##TITLE=1H_LR-0154-C2-EtOAc
 CD3CN
 8 sc, 
 9.2.2023
##JCAMPDX= 6.0         $$ Bruker NMR JCAMP-DX V2.0
##DATA TYPE= NMR FID
##DATA CLASS= NTUPLES
##ORIGIN= UXNMR, Bruker Analytische Messtechnik GmbH
##OWNER= root
$$ XWIN-NMR		Version 3.5
$$ Thu Feb  9 17:45:49 2023 Russian Standard Time (UT+4h)  she@DPX200
##.OBSERVE FREQUENCY= 200.13135
##.OBSERVE NUCLEUS= ^1H
##.DELAY= (6, 6)
##.ACQUISITION MODE= SIMULTANEOUS
##.ACQUISITION SCHEME= undefined
##.AVERAGES= 8
##.DIGITISER RES= 18
##SPECTROMETER/DATA SYSTEM= spect
##.PULSE SEQUENCE= zg30
##.SOLVENT NAME= D2O
##.SHIFT REFERENCE= (INTERNAL, D2O, 0, 15.7039)
##AUDIT TRAIL= $$ (NUMBER, WHEN, WHO, WHERE, WHAT)
$$ ##TITLE= Audit trail, XWIN-NMR		Version 3.5
$$ ##JCAMPDX= 5.01
$$ ##ORIGIN= Bruker BioSpin GmbH
$$ ##OWNER= she
$$ F:/spectra/data/she/nmr/H-F/1/audita.txt
$$ ##AUDIT TRAIL=  $$ (NUMBER, WHEN, WHO, WHERE, WHAT)
(   1,<2023-02-09 17:44:27.01 +0400>,<she>,<DPX200>,
      <created by zg, POWCHK disabled, PULCHK disabled
       configuration hash MD5:
       00 E9 B6 7A A2 85 ED C7 34 08 36 98 17 FE 4E 26
       data hash MD5: 16K
       F5 6E D0 17 77 D8 AD C6 DB 90 DD F3 9D 40 01 F8>)
$$ ##END=
$$ 
$$ hash MD5
$$ 39 95 9F AF 61 F0 C5 31 7D AD BA 11 15 6E E3 3F
##$RELAX= 
##$RELAX= 
##$RELAX= 
##$RELAX= 
##$RELAX= 
##$RELAX= 
$$ Bruker specific parameters
$$ --------------------------
##$DU= <F:/spectra>
##$EXPNO= 1
##$NAME= <H-F>
##$PROCNO= 1
##$TYPE= <nmr>
##$USER= <she>
##$AMP= (0..31)
100 100 100 100 100 100 100 100 100 100 100 100 100 100 100 100 100 100 
100 100 100 100 100 100 100 100 100 100 100 100 100 100 
##$AQSEQ= 0
##$AQ_mod= 1
##$AUNM= <au_zg>
##$AUTOPOS= <>
##$BF1= 200.13
##$BF2= 200.13
##$BF3= 200.13
##$BF4= 200.13
##$BF5= 200.13
##$BF6= 200.13
##$BF7= 200.13
##$BF8= 200.13
##$BYTORDA= 1
##$CFDGTYP= 0
##$CFRGTYP= 5
##$CHEMSTR= <none>
##$CNST= (0..31)
1 1 145 1 1 1 1 1 1 1 1 1 1 1 1 1 1 1 1 1 1 1 1 1 1 1 1 1 1 1 1 1 
##$CPDPRG= <>
##$CPDPRG1= <>
##$CPDPRG2= <>
##$CPDPRG3= <>
##$CPDPRG4= <mlev>
##$CPDPRG5= <mlev>
##$CPDPRG6= <mlev>
##$CPDPRG7= <mlev>
##$CPDPRG8= <mlev>
##$CPDPRGB= <>
##$CPDPRGT= <>
##$D= (0..31)
0 1.2 0 0 0 0 0 0 0 0.06 0 0.03 0 0 0 0 0.0002 0 0 0 0 0 0 0 0 0 0 0 0 
0 0 0 
##$DATE= 1675950266
##$DBL= (0..7)
120 120 120 120 120 120 120 120 
##$DBP= (0..7)
150 150 150 150 150 150 150 150 
##$DBP07= 0
##$DBPNAM0= <>
##$DBPNAM1= <>
##$DBPNAM2= <>
##$DBPNAM3= <>
##$DBPNAM4= <>
##$DBPNAM5= <>
##$DBPNAM6= <>
##$DBPNAM7= <>
##$DBPOAL= (0..7)
0.5 0.5 0.5 0.5 0.5 0.5 0.5 0.5 
##$DBPOFFS= (0..7)
0 0 0 0 0 0 0 0 
##$DE= 6
##$DECBNUC= <off>
##$DECIM= 32
##$DECNUC= <off>
##$DECSTAT= 4
##$DIGMOD= 1
##$DIGTYP= 9
##$DL= (0..7)
0 120 120 120 120 120 120 120 
##$DP= (0..7)
150 150 150 150 150 150 150 150 
##$DP07= 0
##$DPNAME0= <>
##$DPNAME1= <>
##$DPNAME2= <>
##$DPNAME3= <>
##$DPNAME4= <>
##$DPNAME5= <>
##$DPNAME6= <>
##$DPNAME7= <>
##$DPOAL= (0..7)
0.5 0.5 0.5 0.5 0.5 0.5 0.5 0.5 
##$DPOFFS= (0..7)
0 0 0 0 0 0 0 0 
##$DQDMODE= 0
##$DR= 18
##$DS= 0
##$DSLIST= <SSSSSSSSSSSSSSS>
$$ [...]
##$SUBNAM2= <"">
##$SUBNAM3= <"">
##$SUBNAM4= <"">
##$SUBNAM5= <"">
##$SUBNAM6= <"">
##$SUBNAM7= <"">
##$SUBNAM8= <"">
##$SUBNAM9= <"">
##$SW= 18.05172834244
##$SWIBOX= (0..15)
0 0 2 0 0 0 0 0 0 0 0 0 0 0 0 0 
##$SW_h= 3612.71676300578
##$TD= 16384
##$TD0= 1
##$TE= 0
##$TE2= 300
##$TE3= 300
##$TEG= 300
##$TL= (0..7)
0 120 120 120 120 120 120 120 
##$TP= (0..7)
150 150 150 150 150 150 150 150 
##$TP07= 0
##$TPNAME0= <>
##$TPNAME1= <>
##$TPNAME2= <>
##$TPNAME3= <>
##$TPNAME4= <>
##$TPNAME5= <>
##$TPNAME6= <>
##$TPNAME7= <>
##$TPOAL= (0..7)
0.5 0.5 0.5 0.5 0.5 0.5 0.5 0.5 
##$TPOFFS= (0..7)
0 0 0 0 0 0 0 0 
##$TUNHIN= 0
##$TUNHOUT= 0
##$TUNXOUT= 0
##$USERA1= <user>
##$USERA2= <user>
##$USERA3= <user>
##$USERA4= <user>
##$USERA5= <user>
##$V9= 5
##$VALIST= <valist>
##$VCLIST= <CCCCCCCCCCCCCCC>
##$VD= 0
##$VDLIST= <DDDDDDDDDDDDDDD>
##$VPLIST= <PPPPPPPPPPPPPPP>
##$VTLIST= <TTTTTTTTTTTTTTT>
##$WBST= 1024
##$WBSW= 4
##$XGAIN= (0..3)
0 0 0 0 
##$XL= 0
##$YL= 0
##$YMAX_a= 182473
##$YMIN_a= -264722
##$ZGOPTNS= <>
##$ZL1= 120
##$ZL2= 120
##$ZL3= 120
##$ZL4= 120
##$ABSF1= 10
##$ABSF2= 0
##$ABSG= 5
##$ABSL= 3
##$ALPHA= 0
##$AQORDER= 0
##$ASSFAC= 0
##$ASSFACI= 0
##$ASSFACX= 0
##$ASSWID= 0
##$AUNMP= <proc_1d>
##$AZFE= 0.1
##$AZFW= 0.1
##$BCFW= 1
##$BC_mod= 2
##$BYTORDP= 1
##$COROFFS= 0
##$CY= 11.3945322036743
##$DATMOD= 1
##$DC= 2
##$DFILT= <>
##$DTYPP= 0
##$F1P= 2.36226072786647
##$F2P= -0.459571619588291
##$FCOR= 0.5
##$FTSIZE= 0
##$FT_mod= 4
##$GAMMA= 1
##$GB= 0.15
##$INTBC= 1
##$INTSCL= 1
##$ISEN= 128
##$LB= 0.24
##$LEV0= 0
##$LPBIN= 0
##$MAXI= 10000
##$MC2= 0
##$MEAN= 0
##$ME_mod= 0
##$MI= 1.114404
##$NCOEF= 0
##$NC_proc= 0
##$NLEV= 6
##$NOISF1= 3.799351
##$NOISF2= 2.8
##$NSP= 1
##$NTH_PI= 0
##$NZP= 0
##$OFFSET= 15.70392
##$PC= 1
##$PHC0= -19113.93
##$PHC1= 9.00078
##$PH_mod= 1
##$PKNL= yes
##$PPARMOD= 0
##$PSCAL= 0
##$PSIGN= 0
##$REVERSE= no
##$SF= 200.130013532006
##$SI= 16384
##$SIGF1= 3
##$SIGF2= 2
##$SINO= 400
##$SIOLD= 16384
##$SREGLST= <1H.CDCl3>
##$SSB= 0
##$STSI= 0
##$STSR= 0
##$SW_p= 3612.71676300578
##$SYMM= 0
##$S_DEV= 0
##$TDeff= 0
##$TDoff= 0
##$TI= <>
##$TILT= no
##$TM1= 0
##$TM2= 0
##$TOPLEV= 0
##$USERP1= <user>
##$USERP2= <user>
##$USERP3= <user>
##$USERP4= <user>
##$USERP5= <user>
##$WDW= 1
##$XDIM= 8192
##$YMAX_p= 0
##$YMIN_p= 0
$$ End of Bruker specific parameters
$$ ---------------------------------
##NTUPLES= NMR FID
##VAR_NAME=  TIME,          FID/REAL,        FID/IMAG
##SYMBOL=    X,             R,               I
##VAR_TYPE=  INDEPENDENT,   DEPENDENT,       DEPENDENT
##VAR_FORM=  AFFN,          ASDF,            ASDF
##VAR_DIM=   8192,          8192,            8192
##UNITS=     SECONDS,       ARBITRARY UNITS, ARBITRARY UNITS
##FACTOR=    0.0002768,     1,               1
##FIRST=     0,             0,               0
##LAST=      2.2672688,     0,               0
##MIN=       0,             -264722,         0
##MAX=       2.2672688,     182473,          0
$$ Real data points
##PAGE= N=1
##DATA TABLE= (X++(R..R)), XYDATA
$$ plain form
0 0 0 0 0 0 0 0 0 0 0 0 0 0 -8 8 -8 8 -16 16 -16 24 -32 32 -40 48 -56 64 -75 88 -104 118 -136 153 -174 197
34 197 -225 249 -281 314 -353 393 -438 486 -539 598 -661 729 -805 888 -978 1078 -1187 1308
52 1308 -1443 1590 -1759 1946 -2160 2406 -2688 3024 -3425 3915 -4532 5332 -6421 7990 -10469
67 -10469 14984 -25879 112558 15011 -208019 -1496 157904 130769 -13459 -84709 -60023
78 -60023 75582 113937 -10703 -138424 -70427 73793 94617 -66757 -174651 -51209 123572
89 123572 55019 -116303 -113021 17794 69784 38887 -27856 -86386 -33563 110450 108544 -58827
101 -58827 -111908 36699 138880 59410 -63328 -66472 29490 90257 42943 -38885 -55973 -5439
113 -5439 50726 48597 -34465 -89990 -8106 81709 10618 -96414 -52473 46416 39353 -25785
$$ packed form
0@%%%%%%%%%%%%qJ6j6J6k4L2l2M0n6O4p2Q8j04J20j39J63j92K22k54K89l27L71
34A97m22M74n30N95o67P46q31R24j025J137j259J390j534J693j866K056k265K495
52A308k751L033l349L705m106M566n094N712o449P340q447R864j1753J4411j8459
67a0469K5453m0863J38437r7547k23030K06523J59400k7135j44228p1250K4686
78f0023J35605L8355j24640j27721O7997J44220K0824j61374j07894J23442J74781
89A23572o8553j71322L282J30815N1990l0897o6743n8530N2823J44013j906j67371
101e8827n3081J48607J02181p9470j22738l144R5962O0767m7314q1828j7088N0534
113e439N6165k129q3062n5525Q1884Q9815p1091j07032M3941R8889p063o5138
$$ plain form
125 -25785 -50087 -33795 8722 50387 23957 -51727 -58184 27663 82040 22670 -61281 -39796
137 -39796 51233 67141 -2953 -39882 -7118 25444 31341 20802 -16444 -41444 5948 56281
149 56281 9425 -59823 -30777 39407 29278 -33519 -42558 -191 22479 7097 -16667 -28555
161 -28555 -19769 14177 36809 1771 -51748 -27256 48310 49109 -22436 -42145 9405 37692 14663
174 14663 -3895 -7095 -6775 11186 30891 9474 -29170 -18217 28775 27886 -24471 -35907 9870
187 9870 26920 -8447 -28827 -9765 5096 3821 3931 -7856 -27816 -10399 31112 25054 -25326
200 -25326 -34385 13918 39796 6991 -21243 -6202 13358 11869 8172 5023 -8715 -10363 14997
213 14997 20046 -14779 -25936 8740 22962 -9417 -27338 -2323 15595 1652 -11759 -8142
$$ packed form
125b5785k4302J6292M2517M1665k6430p5684o457Q5847N4377n9370q3951K1485
137c9796R1029J5908p0094l6929L2764L2562N897j0539l7246k5000M7392N0333
149E6281m6856o9248K9046P0184j0129o2797r039M2367K2670j5382k3764j1888
161b8555Q786L3946K2632l5038n3519K4492P5566P99p1545j9709N1550K8287k3029
174A4663j8558l200L20J7961J9705k1417l8644J0953M6992q89n2357j1436M5777
187I870J7050l5367k0380J9062J4861j275J10j1787j9960J7417M1511o058n0380
200b5326r059M8303K5878l2805k8234J5041J9560j489l697l149j3738j648K5360
213A4997N049l4825j1157L4676J4222l2379j7921K5015J7918j3943j3411L617
$$ plain form
225 -8142 -3783 744 10148 8307 -13546 -18843 13202 31500 41 -26718 -3246 23094 10542
238 10542 -7910 -3760 -750 -4230 5035 10682 -6225 -16562 1549 13866 -3831 -18432 -1849
251 -1849 15674 1975 -16113 -5521 11728 7109 -2019 638 -932 -5989 7175 18172 -2068
264 -2068 -20431 -1810 19947 7409 -14082 -8926 5000 3297 -2057 -963 -3433 -8259 -2574 8076
278 8076 2901 -10903 -4544 11814 5109 -10323 -2301 13532 6479 -8263 -3315 5923 2679 2011
292 2011 5505 -2149 -10434 -723 12341 4083 -14028 -11405 5271 7111 -4498 -6689 438 312
306 312 -2161 3456 5013 -5016 -5089 7445 7099 -4591 -3318 8430 6024 -5765 -3641 6261 4584
321 4584 -3658 -4380 -1314 -1347 -1295 3318 703 -9132 -7770 6318 8627 -4209 -8868 926 5802 797
$$ packed form
225h142M359M527R404j841k1853n297L2045J8298l1459k6759K3472K6340j2552
238A0542j8452M150L010l480R265N647j6907j0337J8111J2317j7697j4601J6583
251a849J7523j3699j8088J0592J7249m619r128K657j570n057J3164J0997k0240
264b068j8363J8621K1757j2538k1491N156J3926j703n354J094k470m826N685J0650
278H076n175j3804O359J6358o705j5432Q022J5833p053j4742M948R238l244o68
292B011L494p654q285R711J3064q258j8111K623J6676J840j1609k191P127j26
306C12k473N617J557j0029p3J2534l46j1690J273J1748k406j1789K124R902j677
321D584q242p22L066l3N2M613k615r835J362J4088K309j2836m659R794M876n005
$$ plain form
337 797 817 3742 -283 -2817 4128 6599 -643 -4071 2266 4220 -2927 -4597 2538 3467 -4100 -6611
353 -6611 -211 2523 -1839 -2298 -347 -2969 -2716 4574 5831 -3058 -6651 2434 8467 2495 -2902 318
369 318 2562 902 1844 3252 -23 -4176 -1281 2940 -746 -4209 -869 1439 -3232 -5093 393 3264
385 3264 -1280 -4013 -560 1793 981 2281 2867 -197 -2297 3193 7333 1799 -3902 -1177 3157 1679
401 1679 -1015 -859 -1167 -2877 -1833 678 -589 -4218 -3303 -596 -263 -2234 -379 2336 130 -2145
417 -2145 1031 4329 2665 255 658 1780 1357 3096 3893 274 -2903 -576 2572 1203 -2527 -3490
433 -3490 -1932 -1302 -1136 -1015 -1247 -2824 -2762 -229 1374 -1041 -1330 1435 1132 -202 1390 3478 2367
450 2367 -641 254 2059 2255 1537 801 -692 -858 585 1274 426 -2126 -3151 -1251 545 -571 -1681
$$ packed form
337G97K0K925m025k534O945K471p242l428O337J954p147j670P135R29p567k511
353f611O400K734m362m59J951k622K53P290J257q889l593R085O033n972n397L220
369C18K244j660R42J408l275m153K895M221l686l463L340K308m671j861N486K871
385C264m544k733L453K353q12J300N86l064k100N490M140n534n701K725M334j478
401A679k694J56l08j710J044K511j267l629R15K707L33j971J855K715k206k275
417b145L176L298j664k410M03J122m23J739P97l619l177K327L148j369l730r63
433c490J558O30J66J21k32j577O2K533J603k415k89K765l03j334J592K088j111
450B367l008Q95J805J96p18p36j493j66J443O89q48k552j025J900J796j116j110
$$ plain form
467 -1681 -1508 -1090 -429 838 1411 -471 -1090 544 1204 608 528 1124 307 -319 463 1560 800 -306 -1964
486 -1964 -1358 455 485 -200 -20 -1437 -978 1016 1816 326 -814 -230 1077 1735 1140 573 -138 22
504 22 613 833 -29 -659 -1333 -1318 -1177 -1278 -948 -873 -1509 -1459 -915 375 155 -651 -679 278 1427 2060 1866
525 1866 1144 746 1650 2747 2480 1309 320 -371 683 677 -302 -1413 -1721 -2243 -2209 -1686 -1496 -2189 -2685 -1776
545 -1776 -1516 -866 -433 -70 -107 404 1314 2111 2145 1549 1534 2099 2305 2582 1720 713 496 485 579 -61 -1287
566 -1287 -1876 -1961 -1367 -1774 -1826 -1894 -2211 -2154 -1035 -519 -325 -239 19 368 781 1261 1859 1786 1160 1270 1450 2025
588 2025 1678 560 195 382 220 -280 -653 -1443 -1088 -1086 -1114 -1219 -1464 -1239 -1001 -646 142 -175 -496 165 765
609 765 773 769 1388 939 298 444 1134 688 455 412 -591 -325 202 -535 -589 -620 -913 -937 -615 -353 -385 61 330
$$ packed form
467a681J73M18O61J267N73j882o19J634O60n96q0N96q17o26P82J097p60j106j658
486a964O06J813L0o85J80j417M59J994Q00j490j140N84J307O58n95n67p11J60
504B2N91K20q62o30o74J5J41j01L30P5o36N0N44J290k20q06k8R57J149O33j94
525A866p22l98R04J097k67j171r89o91J054or79j111l08n22L4N23J90o93m96R09
545a776K60O50M33L63l7N11R10P97L4n96j5N65K06K77q62j007k17j1R4o40j226
566a287n89q5N94m07n2o8l17N7J119N16J94Q6K58L49M13M80N98p3o26J10J80N75
588B025l47j118l65J87j62n00l73p90L55Kk8j05k45K25K38L55P88l17l21O61O00
609G65QmO19m49o41J46O90m46k33m3j003K66N27p37n4l1k93k4L22K62l2M46K69
$$ plain form
632 330 -21 345 1355 213 506 958 719 161 668 536 193 -260 -100 -399 -784 -995 -1244 -897 -657 -851
652 -851 -883 -381 -547 -865 43 680 404 444 800 1594 763 1254 1615 868 71 1144 676 16 -291 -100 -269
673 -269 -1177 -1361 -1141 -921 -1156 -1629 -1196 -157 -1110 -878 702 730 -415 451 1517 1308 539 1309 1833
692 1833 927 661 1382 1014 113 3 -309 -213 -1034 -1424 -784 -935 -1742 -1182 -685 -984 -1686 -576 667 -85
712 -85 -631 964 1284 571 593 1874 1507 391 407 1173 347 -215 327 586 -534 -1404 -896 -121 -854 -1841
732 -1841 -518 -437 -1074 -1224 177 648 -652 -419 1444 1047 317 756 1300 777 468 756 1285 2 -552
751 -552 229 304 -620 -1143 -391 -556 -1250 -1281 137 -492 -1700 -561 799 141 -282 393 1223 -193 300
770 300 1873 1635 446 146 941 993 -124 -36 632 -207 -1718 -663 292 -799 -1862 -1112 -113 -1022 -1354
$$ packed form
632C30l51L66J010j142K93M52k39n58N07j32l43m53J60k99l85k11k49L47K40j94
652h51l2N02j66l18R08O37k76M0L56P94q31M91L61p47p97J073m68o60l07J91j69
673b69r08j84K20K20k35m73M33J039r53K32J580K8j145Q66J066k09p69P70N24
692A833r06k66P21l68r01j10l12R6q21l90O40j51q07N60M97k99p02J110J243p52
712h5n46J595L20p13K2J281l67j116J6P66q26n62N42K59j120q70N08P75p33r87
732a841J323Q1o37j50J401M71j300K33J863l97p30M39N44n23l09K88N29j283n54
751e52P81P5r24n23P52j65o94l1J418o29j208J139J360o58m23O75Q30j416M93
770C00J573k38j189l00P95N2j117Q8O68q39j511J055R55j091j063P50R99r09l32
$$ plain form
789 -1354 175 -53 -557 -352 1017 926 -143 476 1604 878 517 1129 1318 429 -323 465 1161 -332 -1329
808 -1329 -509 -428 -1317 -1076 78 -612 -2076 -1001 629 122 -1136 -73 698 -39 -132 1308 1438 234
826 234 143 1115 1447 416 150 895 335 -555 -304 453 -709 -1880 -836 64 -449 -1055 -837 13 -773
845 -773 -403 872 1071 -220 -4 1403 1527 457 819 1092 250 -252 666 637 -290 -1087 -600 -209 -654
864 -654 -933 -296 -415 -1460 -1173 232 612 -803 -365 949 500 -178 997 1253 368 58 1046 1499 304
883 304 -326 244 249 -362 -249 -202 -826 -1542 -1227 127 -384 -1253 -819 -80 -400 -267 830 574 -215 -122 1170
904 1170 1400 732 776 778 756 520 713 889 174 -859 -309 -283 -373 -862 -868 -465 -1303 -1076 -280 -293 -853 -767 332
927 332 330 371 298 779 376 637 1190 1380 987 295 381 831 741 -86 -59 -364 -914 -452 -238 -652 -823 -1053 -759
$$ packed form
789a354J529k28n04K05J369r1j069O19J128p26l61O12J89q89p52P88O96j493r97
808a329Q20Q1q89K41J154o90j464J075J630n07j258J063P71p37r3J440J30j204
826B34r1R72L32j031k66P45n60q90K51P57j162j171J044R00n13o06K18Q50p86
845g73L70J275J99j291K16J407J24j070L62K73q42n02R18k9r27p97M87L91m45
864f54k79O37j19j045K87J405L80j415M38J314m49o78J175K56q85l10R88M53j195
883C04o30N70No11J13M7o24p16L15J354n11q69M34P39l20J33J097k56p89R3J292
904A170K30o68M4Kk2k36J93J76p15j033N50K6r0m89oM03q38K27P96j3n60Q6J099
927C32kM1p3M81m03K61N53J90l93o92Q6M50r0q27K7l05n50M62K14m14j71k30K94
$$ plain form
950 -759 -671 -557 -33 -345 -747 88 477 826 698 238 911 923 985 1095 619 0 -377 287 235 5 -838 -609
972 -609 -620 -765 -270 -361 -550 -931 -577 82 114 516 55 -36 140 853 1140 759 316 272 462 582 429 306
994 306 -150 -480 -356 -396 -76 -439 -1051 -851 -263 -567 -14 -114 -350 -217 300 730 554 631 406 367 833
1015 833 1148 778 234 305 -157 316 255 -354 -704 -1033 -512 -445 -329 -539 -999 -919 -243 -178 125 -11 11 37
1037 37 419 1032 1126 700 221 755 884 811 479 119 103 -121 -107 -7 -104 -814 -984 -848 -714 -516 -626 -580
1059 -580 -738 -429 142 449 360 159 268 679 997 951 709 586 166 598 607 479 -367 -460 -543 -638 -210 -222 -749
1082 -749 -963 -697 -401 -62 -341 -636 -121 128 300 483 592 547 549 386 963 975 361 -38 174 343 295 266
1104 266 -48 -798 -754 -422 -231 -480 -766 -1248 -181 -106 -59 -43 77 -196 -121 754 907 461 58 537 568 393
$$ packed form
950g59Q8J14N24l12m02Q35L89L49j28m60O73J2O2J10m76o19l77O64n2k30q43K29
972f09j1j45M95r1j89l81L54O59L2M02m61r1J76P13K87l81m43m4J90J20j53j23
994C06m56l30J24m0L20l63o12K00N88l04N53j00k36J33N17M30j76P7k25l9M66
1015H33L15l70n44P1m62M73o1o09l50l29N21O7J16k10m60Q0O76O5L03j36K2K6
1037C7L82O13R4m26m79N34J29p3l32l60j6k24J4J00r7p10j70J36J34J98j10M6
1059e80j58L09N71L07q9k01J09M11L18m6k42j23m20M32Rj28q46r3q3r5M28j2n27
1082g49k14K66K96L39k79k95N15K49J72J83J09m5Kj63N77J2o14l99K12J69m8k9
1104B66l14p50M4L32J91k49k86m82J067P5M7J6J20k73P5Q75J53m46m03M79L1j75
$$ plain form
1126 393 550 196 -518 -190 -164 200 -316 -826 -977 -731 -723 -300 4 -506 -708 -360 488 601 58 21 496
1147 496 526 616 945 1133 47 -122 377 654 398 -506 -482 -312 -497 -745 113 -286 -1142 -851 173 192 -391
1168 -391 -107 173 -94 -287 995 1119 -61 -218 955 1145 571 330 672 232 -604 -172 427 -163 -1161
1187 -1161 -723 -47 -321 -942 -428 63 -908 -920 403 917 -368 -379 801 936 89 235 1173 382 -574
1206 -574 342 1647 328 -1032 -9 532 -566 -871 97 8 -1748 -1269 432 465 -1347 -498 546 304
1224 304 -642 400 1456 96 -465 1221 1648 -34 -367 755 766 -948 -394 1078 -16 -1723 -927
1241 -927 780 -210 -1777 -679 459 -707 -1246 620 1048 -728 -844 947 1432 -354 -254 1483 830
1258 830 -781 419 1733 121 -1273 -27 1126 -346 -1301 -51 668 -1560 -1505 585 643 -1863 -1362
$$ packed form
1126C93J57l54p14L28K6L64n16n10j51K46QM23L04n10k02L48Q48J13n43l7M75
1147D96L0R0L29J88j086j69M99K77k56r04K4J70j85k48Q58l99q56K91J024J9n83
1168c91K84K80k67j93J282J24j180j57J173J90n74k41L42m40q36M32N99n90r98
1187a161M38O76k74o21N14M91r71j2J323N14j285j1J180J35q47J46R38p91r56
1206e74R16J305j319j360J023N41j098l05R68q9j756M79J701L3j812Q49J044k42
1224C04r46J042J056j360n61J686M27j682l33J122J1j714N54J472j094j707P96
1241i27J707r90j567J098J138j166n39J866M28j776j16J791M85j786J00J737o53
1258H30j611J200J314j612j394J246J153j472r55J250P19k228N5K090N8k506N01
$$ plain form
1275 -1362 1160 500 -1340 48 1701 190 -1039 764 2158 -17 -969 931 1650 -553 -767 1060
1291 1060 811 -1795 -1050 1027 124 -2328 -826 1100 -626 -1965 253 1407 -750 -1514 1224 1998
1307 1998 -728 -824 1631 1219 -641 134 2314 566 -1737 -117 1972 -30 -1988 62 1335 -1214
1323 -1214 -2085 946 1001 -1896 -1949 1315 1023 -1948 -851 2113 234 -1852 726 2462 -118 -1734
1339 -1734 890 2426 -535 -1502 1123 1142 -1523 -1167 1706 421 -2423 -1055 1652 -62 -2170 -150
1355 -150 1705 -538 -2113 1093 2433 -936 -1697 1718 1935 -952 -823 2320 872 -1866 -419 2401
1371 2401 406 -2291 -109 2098 -847 -2571 550 1486 -1870 -2483 1425 1570 -2048 -1347 2100 1018
1387 1018 -2029 133 2953 441 -2262 842 2897 -200 -2002 1030 1817 -1552 -2056 1805 1169 -2717
$$ packed form
1275a362K522o60j840J388J653j511j229J803J394k175r52J900P19k203k14J827
1291A060k49k606P45K077r03k452J502J926j726j339K218J154k157p64K738P74
1307A998k726r6K455m12j860P75K180j748k303J620K089k002j958K050J273k549
1323a214q71L031N5k897n3L264k92k971J097K964j879k086K578J736k580j616
1339a734K624J536k961r67K625J9k665L56K873j285k844J368K707j714k108K020
1355a50J855k243j575L206J340l369p61L415K17k887J29L143j448k738J447K820
1371B401j995k697K182K207k945j724L121R36l356o13L908J45l618P01L447j082
1387A018l047K162K820k512k703L104K055l097j802L032P87l369n04L861o36l886
$$ plain form
1403 -2717 -1710 1783 754 -2584 -804 2386 -215 -2767 428 2466 -852 -2129 1375 2902 -893
1418 -893 -1383 2386 1966 -1626 -844 2609 1074 -2469 -651 2522 52 -2966 -293 1846 -1180 -2950
1434 -2950 998 1835 -1994 -2233 1697 1714 -2009 -662 2622 885 -2163 249 3260 61 -2393 919
1450 919 2642 -858 -2106 1489 1568 -2210 -1901 2088 1120 -2658 -1327 1994 79 -2933 -190 2654
1466 2654 -193 -2628 856 3133 -824 -2026 1612 2465 -1312 -1408 2508 1369 -2394 -1345 2580 395
1482 395 -2855 -675 2107 -1148 -2761 796 2504 -1655 -2605 1831 2146 -1797 -1269 2464 1438 -2320
1498 -2320 -367 3167 457 -2366 349 2850 -134 -2560 798 2222 -1900 -2766 1448 1645 -2539
1513 -2539 -2177 1945 908 -2470 -864 2340 24 -2407 623 3218 -235 -2249 1424 2413 -866
$$ packed form
1403b717J007L493j029l338J780L190k601k552L195K038l318j277L504J527l795
1418h93m90L769m20l592P82L453j535l543J818L173k470l018K673K139l026j770
1434b950L948Q37l829k39L930J7l723J347L284j737l048K412L011l199k454L312
1450I19J723l500j248L595P9l778L09L989r68l778J331L321j915l012K743K844
1466B654k847k435L484K277l957j202L638Q53l777r6L916j139l763J049L925k185
1482C95l250K180K782l255j613L557J708m159r50M436L15l943N28L733j026l758
1498b320J953L534k710k823K715K501k984k426L358J424m122q66M214J97m184
1513b539L62M122j037l378J606L204k316k431L030K595l453k014L673R89l279
$$ plain form
1528 -866 -1587 1824 1892 -1960 -1174 2356 1127 -2541 -852 2256 -374 -2910 163 2031 -1129 -2684
1544 -2684 901 2157 -1575 -1705 1744 1711 -1328 -959 2770 1227 -2053 165 2685 24 -2477 441
1560 441 2289 -790 -2537 1151 1499 -2115 -2127 1501 1283 -2385 -1474 1847 567 -2256 -174 2476
1576 2476 -76 -2280 777 2373 -536 -1912 1429 2000 -1448 -1435 1782 1403 -2165 -1288 1911 184
1592 184 -2459 -404 1648 -687 -2713 450 1953 -1131 -2003 1308 1821 -1113 -1352 2293 1489 -1749
1608 -1749 -424 2342 689 -2103 -3 2131 -331 -2204 485 1749 -1273 -2190 1029 1269 -1704
1623 -1704 -1694 1397 772 -2073 -505 1938 378 -2060 260 2617 -220 -1583 811 2248 -1140 -1317
1639 -1317 1357 1440 -1565 -1327 1724 470 -2060 -902 1628 -35 -2434 -199 1697 -726 -1754 758
$$ packed form
1528h66p21L411O8l852P86L530j229l668J689L108k630k536L073J868l160j555
1544b684L585J256l732j30L449l3l039L69L729j543l280K218K520k661k501K918
1560D41J848l079j747L688L48l614j2L628k18l668R11L321j280k823K082K650
1576B476k552k204L057J596k909j376L341N71l448J3L217l79l568Q77L199j727
1592A84k643K055K052k335k026L163J503l084q72L311N13k934k39L645q04l238
1608a749J325K766j653k792K100K134k462j873K689J264l022r17L219K40k973
1623a704J0L091o25k845J568K443j560k438K320K357k837j363K394J437l388j77
1639a317K674Q3l005K38L051j254k530J158K530j663k399K235J896k423j028K512
$$ plain form
1655 758 1788 -845 -1155 1411 1582 -1314 -412 2128 1019 -1462 -328 1917 271 -1649 -82 1482
1671 1482 -844 -1669 503 972 -1352 -1405 682 841 -1600 -1134 1447 677 -1250 -91 1872 278 -1429
1688 -1429 371 2012 -115 -1051 587 1406 -648 -1095 972 697 -1547 -967 973 -69 -1386 -222
1704 -222 1227 -411 -1447 315 1177 -533 -902 665 1132 -628 -514 1465 775 -682 -396 1466 295
1721 295 -1150 -73 1277 -379 -1603 142 943 -1086 -1246 549 691 -1140 -863 811 620 -750
1737 -750 -328 1357 484 -523 414 1555 2 -636 537 1025 -358 -830 403 672 -992 -785 845
1754 845 254 -1281 -735 765 243 -1198 -34 994 -3 -695 399 837 -297 -302 732 778 -535 -235
1772 -235 944 691 -826 -265 723 -205 -963 39 420 -488 -743 75 308 -828 -626 618 333 -522
$$ packed form
1655G58J030k633l10K566J71k896R02K540j109k481J134K245j646j920J567J564
1671A482k326q25K172M69k324n3K087J59k441M66K581p70j927J159J963j594j707
1688a429J800J641k127r36J638Q19k054m47K067k75k244N80J940j042j317J164
1704b22J449j638j036J762Q62j710l69J567M67j760J14J979o90j457K86J862j171
1721B95j445J077J350j656j224J745Q01k029j60J795J42j831K77J674j91j370
1737g50M22J685q73j007R37J141j553o38J173M88j383m72J233K69j664K07J630
1754H45n91j535N46J500n22j441J164J028r97o92J094M38j134nJ034M6j313L00
1772b35J179k53j517N61R88r28p58J002L81r08k55Q18K33j136K02J244k85q55
$$ plain form
1790 -522 -127 520 449 -252 -177 729 394 -361 571 733 -281 -705 293 573 -270 -706 158 80 -724 -509 325
1811 325 -160 -835 -466 344 97 -350 131 795 -18 -334 257 694 26 -145 595 424 -154 10 426 -93
1831 -93 -441 -139 234 -405 -724 -365 350 -195 -742 53 341 -495 -365 483 333 48 -56 817 170 115 -17
1852 -17 527 200 -81 -52 351 -129 -400 -127 240 -665 -314 346 -118 -375 -227 306 118 -264 172 656 14
1873 14 -109 238 297 164 149 303 274 116 -44 122 77 -290 -243 -119 -11 -220 -483 -179 -130 -229 -299 -127 40
1896 40 -331 73 512 -99 272 479 138 217 357 465 82 -25 111 303 -343 -103 -31 -59 -298 -390 -178 -55
1918 -55 -340 -414 -104 61 -183 -84 -29 346 109 198 95 406 291 452 411 126 196 130 127 123 -43 -89 107 -179
1942 -179 -177 -323 -271 -409 -42 -13 -385 -443 -100 102 49 178 244 90 111 536 154 172 211 118 19 37 21 133 86
$$ packed form
1790e22L95O47p1p01P5R06l35p55R32J62j014m24R98K80q43m36Q64p8q04K15Q34
1811C25m85o75L69Q10k47m47M81O64q13l16N91M37o68j71P40j71n78J64M16n19
1831i3l48L02L73o39l19L59P15n45n47P95K88q36J30Q48j50k85j04Q73o47n5j32
1852a7N44l27k81K9M03m80k71K73L67r05L51O60m64k57J48N33j88l82M36M84o42
1873A4j23L47N9j33j5J54k9j58j60J66m5l67M7J24J08k09k63L04M9r9p0J72J67
1896D0l71M04M39o11L71K07l41P9J40J08l83j07J36J92o46K40P2k8k39r2K12J23
1918e5k85p4L10J65k44R9N5L75k37Q9j03L11j15J61m1k85P0o6lmj66m6J96k86
1942a79Kj46N2j38L67K9l72n8L43K02n3J29O6j54K1M25l82J8L9r3r9J8j6J12m7
$$ plain form
1967 86 34 -165 -196 -424 -37 54 -276 -78 -258 -105 37 79 164 -60 391 46 196 105 216 230 109 123 53
1990 53 100 11 -145 -235 -315 -138 -381 -459 -377 -239 16 -246 -267 -16 -172 13 191 83 170 398 197 244 124
2013 124 243 205 125 32 -135 65 -135 -7 -367 -227 -141 -379 -68 -311 -50 -147 5 -103 -53 64 111 -71
2035 -71 47 242 170 181 197 331 -2 217 -52 47 18 50 -291 34 -110 -155 -594 1 -187 -506 84 -48 -25
2058 -25 -89 -40 108 270 -14 136 117 341 184 401 208 26 -47 -61 -186 162 -3 171 -65 -166 -412 -285
2080 -285 -322 -147 -174 173 95 -218 -48 -67 91 4 335 35 133 360 159 -177 31 -91 -242 117 -180 50
2102 50 -271 108 -353 -274 -262 -105 -157 -242 -139 -399 -89 140 129 245 43 141 157 343 220 129 67 139 6 189
2126 189 -11 71 -69 16 -128 -211 49 -237 -407 67 -158 29 -88 -59 185 66 270 148 219 76 71 403
$$ packed form
1967H6n2j99l1k28L87R1l30J98j80J53J42M2Q5k24M51l45J50r1J11J4j21J4p0
1990E3M7q9j56r0q0J77k43p8Q2J38K55k62k1K51j56J85J78j08Q7K28k01M7j20
2013A24J19l8q0r3j67K00k00J28l60J40Q6k38L11k43K61r7J52j08N0J17M7j82
2035g1J18J95p2J1J6J34l33K19k69R9k9L2l41L25j44m5m39N95j88l19N90j32K3
2058b5o4M9J48J62k84J50j9K24j57K17j93j82p3j4j25L48j65J74k36j01k46J27
2080b85l7J75k7L47p8l13J70j9J58q7L31l00R8K27k01l36K08j22j51L59k97K30
2102E0l21L79m61P9J2J57n2q5J03k60L10K29j1J16k02R8J6J86j23r1o2P2j33J83
2126A89k00Q2j40Q5j44q3K60k86j70M74k25J87j17K9K44j19K04j22P1j43nL32
$$ plain form
2148 403 155 32 -6 184 218 -173 -121 -131 -176 -471 -466 -175 13 -50 -271 -63 -44 37 155 314 110 -64 148
2171 148 214 -24 -18 251 359 240 -185 -38 -56 -147 -188 -183 -10 -162 -22 -307 -91 -323 -47 -247 -381 -11 14
2194 14 158 41 348 199 2 -276 298 215 213 -34 -55 250 -133 122 -59 24 -241 -139 -24 11 -126 -188 7
2217 7 -284 -232 -106 41 24 181 281 454 86 -77 151 261 131 213 -58 -22 -338 -29 334 -2 -317 -351
2239 -351 -190 -155 19 68 210 -352 -309 275 -122 44 -2 33 -12 297 241 375 69 84 244 203 212 29 41 48 80
2264 80 -148 -105 -330 -215 -143 248 -217 -340 -353 112 -215 -210 98 278 239 185 242 236 -46 -73 116 113 -171 -227 59
2289 59 47 -224 -289 -65 78 -559 -7 112 1 30 233 49 5 224 217 99 241 186 495 270 -221 -21 255
2312 255 102 -193 -4 328 71 -2 -9 -115 -135 -265 -50 -38 -197 -23 87 -8 130 162 365 357 50 72 314
$$ packed form
2148D03k48j23l8J90L4l91N2j0m5k95NK91J88o3k21K08J9Q1J18J59k04j74K12
2171A48O6k38OK69J08j19m25J47j8r1m1NJ73j52J40k85K16k32K76k00j34L70K5
2194A4J44j17L07j49j97k78N74q3kk47k1L05l83K55j81Q3k65J02J15L5j37o2J95
2217Gk91N2J26J47j7J57J00J73l68j63K28J10j30Q2k71L6l16L09L63l36l15l4
2239c51J61L5J74M9J42n62M3N84l97J66m6L5m5L09n6J34l06J5J60m1Rj83J2PL2
2264H0k28M3k25J15P2L91m65j23j3M65l27NL08J80l9n4N7ok82k7J89lk84n6K86
2289E9j2k71o5K24J43o37N52J19j11K9K03j84m4K19pj18J42n5L09k25m91K00K76
2312B55j53k95J89L32k57p3pj06k0j30K15J2j59J74J10r5J38L2K03ql07K2K42
$$ plain form
2335 314 170 38 143 262 -162 43 113 -169 -229 -129 -4 -256 -375 -220 194 -23 -274 145 -4 -289 -93
2356 -93 -255 276 -162 -178 349 115 190 97 137 139 -40 -115 -66 -390 -105 58 13 -442 -214 -113 -248 -380 -137
2379 -137 -442 -33 156 -72 256 175 282 172 187 36 -15 4 19 38 -288 3 -42 -377 46 121 -329 -62 61
2402 61 -143 -227 -272 46 -119 -255 11 -126 235 79 15 -131 67 207 163 95 184 -67 -27 43 100 -114 126
2425 126 -271 -189 -142 5 41 -156 53 89 -20 -231 139 254 72 176 32 241 179 20 356 2 57 134
2447 134 15 -219 -138 -151 1 38 -248 -218 -277 -104 -293 -204 40 -106 -32 76 -114 86 219 44 -25 1 254
2470 254 -58 87 -71 145 -166 139 20 85 102 -16 11 -213 -91 -178 -179 -49 -293 -180 120 -149 291 67
2492 67 78 -11 237 75 64 153 162 68 65 -43 -174 193 67 95 37 -133 -77 -64 -27 -119 27 -254 -272 151 107 67
$$ packed form
2335C14j44j32J05J19m24K05P0k82o0J00J25k52j19J55M14k17k51M19j49k85J96
2356i3j62N31m38j6N27k34P5r3M0Kj79p5M9l24K85J63m5m55K28J01j35j32K43
2379a37l05M09J89k28L28q1J07j10J5j51n1J9J5J9l26K91m5l35M23P5m50K67J23
2402F1k04q4m5L18j65j36K66j37L61j56o4j46J98J40m4o8Q9k51M0P0N7k14K40
2425A26l97Q2M7J47L6j97K09L6j09k11L70J15j82J04j44K09o2j59L36l54N5P7
2447A34j19k34Q1j3J52L7k86L0n9J73j89Q9K44j46P4J08j90K00J33j75o9K6K53
2470B54l12J45j58K16l11L05j19O5J7j18K7k24J22q7jJ30k44J13L00k69M40k24
2492F7J1q9K48j62j1Q9Rr4lj08j31L67j26K8n8j70N6J3L7r2J46k81j8M23m4m0
$$ plain form
2518 67 -7 180 -21 -99 131 128 -118 -16 -11 -41 34 -294 -82 -34 -127 122 -82 -171 -218 -220 -217 -57 -219 -5 -83 221
2544 221 61 213 114 61 144 72 -145 546 -38 -83 100 87 -26 28 -70 -61 -120 -178 -374 -39 16 204 -114 276
2568 276 -216 -114 -88 222 246 32 -74 89 112 395 -78 0 181 67 -99 -140 111 -60 -48 -196 35 -314
2590 -314 142 58 -174 -96 -104 -291 76 -41 67 151 243 98 200 163 44 106 63 282 -89 111 116 -85 -18 16
2614 16 127 131 -225 -96 220 137 -48 29 -196 81 -85 -105 313 -79 -299 214 220 98 258 218 -63 108 -27
2637 -27 24 -204 -167 -99 128 -156 23 -300 -189 15 -403 158 66 -36 -240 195 79 -59 -41 99 228 -65
2659 -65 44 180 248 -292 -233 66 -85 25 -26 148 -283 -226 -69 -154 -164 -233 176 -172 130 -11 462 -22 -138
2682 -138 -98 280 -23 -231 26 249 152 24 -77 89 -3 -171 -144 -95 -14 -92 -5 -133 -132 -195 379 -117 -151 325
$$ packed form
2518F7p4J87k01p8K30lk46J02Nl0P5l28K12M8r3K49k04q9m7kLJ60j62K14p8L04
2544B21j60J52r9n3Q3p2k17O91n84m5J83j3j13N4r8Rn9n8j96L35N5J88l18L90
2568B76m92J02K6L10K4k14j06J63K3K83m73P8J81j14j66m1K51j71J2j48K31l49
2590c14M56q4k32P8qj87L67j17J08Q4R2j45J02l7j19O2m3K19l71K00Nk01O7L4
2614A6J11Ml56J29L16q3j85P7k25K77j66k0M18l92k20N13Oj22J60m0k81J71j35
2637b7N1k28L7O8K27k84J79l23J11K04m18N61r2j02k04M35j16j38J8J40J29k93
2659f5J09J36O8n40N9K99j51J10n1J74m31N7J57q5j0o9M09l48L02j41M73m84j16
2682a38M0L78l03k08K57K23r7j28j01J66r2j68K7M9Q1p8Q7j28Jo3N74m96l4M76
$$ plain form
2706 325 405 -256 -224 134 52 -367 -33 413 166 -53 27 206 -102 -292 212 83 -235 -29 -41 123 -182 -206
2728 -206 -75 106 -419 -32 280 -77 -212 -1 546 154 -336 78 252 -56 -175 236 -73 -31 57 -18 -35
2749 -35 -53 -528 160 -192 -153 -29 204 -154 -422 99 72 -158 -256 229 106 26 -1 133 57 -236 1 233 104
2772 104 63 -71 99 147 -343 -40 166 -163 -377 23 -25 -392 -3 295 117 -276 -312 402 88 -277 309
2793 309 194 70 -401 83 314 -132 -278 148 -53 -274 -545 123 102 -520 -208 35 -48 -354 -336 333 25
2814 25 -153 318 372 204 -115 478 415 91 -207 330 128 -417 -19 202 95 -498 47 195 -217 -340 117
2835 117 212 -177 -258 248 336 -306 -201 99 263 -366 -195 414 151 -460 117 570 -112 -289 234 70 -390
2856 -390 -165 -20 135 -395 -464 415 -58 -410 -258 425 131 -394 217 487 134 -485 116 654 60 -163
$$ packed form
2706C25Q0o61L2L58q2m19L34M46k47k19Q0J79l08j90N04j29l18K06j2J64l05k4
2728b06J31J81n25L87L12l57j35K11N47l92m90M14J74l08j19M11l09M2Q8p5j7
2749c5j8m75O88l52L9J24K33l58k68N21k7k30r8M85j23q0k7J34p6k93K37K32j29
2772A04m1j34J70M8m90L03K06l29k14M00m8l67L89K98j78l93l6P14l14l65N86
2793C09j15j24m71M84K31m46j46M26k01k21k71O68k1o22L12K43q3l06J8O69l08
2814B5j78M71N4j68l19N93o3l24k98N37k02n45L98K21j07n93N45J48m12j23M57
2835A17R5l89q1N06Q8o42J05L00J64o29J71O09k63o11N77M53o82j77N23j64m60
2856c90K25J45J55n30o9Q79m73l52J52O83k94n25O11K70l53o19O01N38n94k23
$$ plain form
2876 -163 284 171 -458 -153 588 9 -460 -103 318 44 -527 -106 551 -371 -344 58 189 -206 -45 383
2896 383 157 -275 -59 466 -100 -425 -56 451 78 -243 -243 335 -254 -593 49 119 -410 -255 394 -125 -497
2917 -497 -180 582 33 -571 65 383 -32 -278 409 344 -272 -228 579 328 -399 -403 407 159 -589 -65 498
2938 498 -208 -423 60 327 -200 -503 213 598 -364 -416 400 563 -340 -266 302 110 -330 176 376 -94 -130
2959 -130 176 364 -130 -600 -20 189 -146 -634 170 188 -578 -483 289 -23 -545 1 313 102 -479 211 283
2980 283 -65 -181 533 337 -133 -442 339 291 -586 -293 292 -160 -428 113 711 -108 -327 174 824 -266
3000 -266 -347 99 229 -100 -149 326 355 -38 -256 326 28 -302 54 309 -104 -80 221 324 -301 -385 -53 525
3022 525 -488 -281 330 319 -474 142 434 -39 -252 88 490 13 -323 272 590 -197 -24 361 301 -576
$$ packed form
2876a63M47j13o29L05P41n79m69L57M21k74n71M21O57r22K7M02J31l95J61M28
2896C83k26m32K16N25n66l25L69N07l73l21%N78n89l39O42P0n29J55O49n19l72
2917d97L17P62n49o04O36L18m15k46O87o5o16M4Q07k51p27mQ10k48p48N24N63
2938D98p06k15M83K67n27l03P16L85r62n2Q16J63r03P4N68j92m40N06K00m70l6
2959a30L06J88m94m70N80K09l35m88Q04J8p66R5P72l12n22N46L12k11n81O90P2
2980B83l48j16P14j96m70l09P81m8q77K93N85m52k68N41N98q19k19N01O50j090
3000b66q1M46J30l29m9M75K9l93k18N82k98l30L56K55m13K4L01J03o25q4L32N78
3022E25j013K07O11j1p93O16K92m73k13L40M02m77l36N95L18p87J73L85o0q77
$$ plain form
3042 -576 -193 20 34 -488 -578 320 -114 -620 -149 412 -95 -502 187 152 -125 -154 175 315 -308 -296 380 201
3064 201 -103 78 341 -67 -448 -162 183 -177 -450 35 506 -319 -304 253 175 -270 -263 345 253 -464 96 181
3086 181 160 -250 -176 370 -137 -255 34 231 -83 -319 566 49 -616 -174 290 -83 -377 -120 405 -98 -370
3107 -370 88 238 -33 -268 353 283 -207 -55 86 142 -121 -117 460 -17 -349 -76 318 70 -220 1 78 -297
3129 -297 -466 35 211 -308 -340 393 374 -144 -73 308 129 -176 44 217 -57 -145 251 391 5 -260 275
3150 275 161 -261 -261 36 -20 -183 1 303 14 -477 176 395 -28 -195 197 373 -95 -316 -69 157 -86
3171 -86 -101 320 239 25 26 396 150 -28 -187 -151 -289 -363 61 79 -41 -188 42 328 -103 -169 243 8 -366
3194 -366 -25 -28 203 -203 -19 382 -85 -81 -11 258 188 -225 66 137 -203 -122 198 -223 -340 -35 43 -64 -256
$$ packed form
3042e76L83K13J4n22r0Q98m34n06M71N61n07m07O89l5k77k9L29J40o23J2O76j79
3064B01l04J81K63m08l81K86L45l60k73M85M71q25J5N57p8m45PO08r2p17N60Q5
3086A81k1m10P4N46n07j18K89J97l14k36Q85n17o65M42M64l73k94K57N25n03k72
3107c70M58J50k71k35O21p0m90J52J41N6k63MN77m77l32K73L94k48k90K21P7l75
3129b97j69N01J76n19l2P33j9n18P1L81j79l05K20J73k74q8L96J40l86k65N35
3150B75j14m22%K97n6j63J84L02k89m91O53K19m23j67L92J76m68k21K47K26k43
3171h6j5M21q1k14JL70k46j78j59L6j38p4M24J8j20j47K30K86m31o6M12k35l74
3194c66L41lK31m06J84M01m67MP0K69p0m13K91P1l40Q1L20m21j17L05P8j07j92
$$ plain form
3217 -256 -137 131 110 -160 297 320 -178 -37 -65 111 -229 -115 356 -241 -477 162 167 -108 -200 -90 -7 -130
3239 -130 -173 -62 196 209 124 238 81 -88 94 20 161 -45 296 269 56 9 -71 333 39 3 -16 283 11
3262 11 -143 -34 298 -216 -259 88 230 -346 -315 258 264 -97 165 307 -289 48 116 150 -65 59 54 -59 -25
3285 -25 128 416 -104 -88 -78 55 -120 56 138 51 -139 -15 -64 211 -187 -327 -132 66 125 -226 147 190 101
3308 101 -52 74 89 -52 23 409 -132 17 -60 47 -170 66 0 303 -171 0 45 51 -82 296 119 167 231
3331 231 406 88 -80 -49 -79 -84 -47 -107 -36 -202 91 -4 -77 -100 -87 1 142 117 -268 113 -170 168 -81 177
3355 177 1 12 138 110 116 11 115 410 4 55 -42 -144 137 -145 -95 -263 -143 -99 -37 -14 -42 47 61 -249
3379 -249 1 -151 27 -6 -159 12 65 55 184 238 137 106 -19 -142 -75 -207 -314 -219 53 -179 11 128
$$ packed form
3217b56J19K68k1k70M57K3m98J41k8J76l40J14M71n97k36O39Nk75r2J10Q3j23
3239a30m3J11K58J3q5J14j57j69J82p4J41k06L41k7k13m7q0M04k94l6j9K99k72
3262A1j54J09L32n14m3L47J42n76L1N73Ol61K62J42n96L37O8L4k15J24nj13L4
3285b5J53K88n20J6J0J33j75J76Q2q7j90J24m9K75l98j40J95J98N9l51L73M3q9
3308A01j53J26J5j41P5L86n41J49p7J07k17K36o6L03m74J71M5Oj33L78j77M8O4
3331B31J75l18j68L1l0nL7o0P1j66K93r5p3k3J3Q8J41k5l85L81k83L38k49K58
3355A77j76J1J26k8Oj05J04K95m06N1r7j02K81k82N0j68J20M4O2K3k8Q9J4l10
3379b49K50j52J78l3j53J71N3j0J29N4j01l1j25j23O7j32j07R5K72k32J90J17
$$ plain form
3401 128 -15 200 -201 -15 43 -198 109 -81 77 289 -90 116 223 260 -15 38 17 5 109 -108 -225 216
3423 216 177 31 111 -246 -156 61 214 -77 155 -22 141 106 12 140 94 14 118 116 82 114 112 85 -112 139 -25
3448 -25 6 -237 -166 -7 -91 -144 -201 41 47 -104 142 -30 46 -19 100 -78 50 22 -19 191 -77 220 -100 63
3472 63 350 -193 -73 -17 53 -57 -9 14 -52 227 200 -46 20 -266 -20 195 27 -21 126 -71 -34 117 -12
3495 -12 135 218 169 100 137 -174 65 -161 -47 -41 -282 -117 37 159 -22 41 -47 46 -7 204 -295 213 49 6
3519 6 174 114 101 -57 107 79 -165 200 145 -198 -106 96 161 -364 -232 -52 85 59 37 -16 126 -30 -113 181
3543 181 -23 223 -29 174 239 198 -110 112 -9 -151 117 6 -238 -278 240 -61 -79 78 86 -30 191 -253
3565 -253 -11 -19 95 -164 261 59 120 310 -52 102 -293 16 27 188 -195 -209 17 217 108 -40 86 109
$$ packed form
3401A28j43K15m01J86N8k41L07j90J58K12l79K06J07L7k75N3k1j2J04k17j17M41
3423B16l9j46Q0l57R0K17J53k91K32j77J63l5r4J28m6q0J04kl4L2kk7j97K51j64
3448b5L1k43P1J59q4n3n7K42Oj51K46j72P6o5J19j78J28k8m1K10k68K97l20J63
3472F3K87n43J20N6P0j10M8K3o6K79k7k46O6k86K46K15j68m8J47j97L7J51j29
3495a2J47Q3m9o9L7l11K39k26J14Ok41J65J54J22j81O3q8R3n3K11m99N08j64m3
3519FJ68o0j3j58J64k8k44L65n5l43R2K02O5n25J32J80J37k6k2n3J42j56q3K94
3543A81k04K46k52K03O5m1l08K22j21j42K68j11k44m0N18l01j8J57Qj16K21m44
3565b53K42qJ14k59M25k02O1J90l62J54l95L09J1J61l83j4K26K00j09j48J26K3
$$ plain form
3587 109 -316 7 88 204 67 48 -52 -50 3 -13 -100 39 82 28 114 -97 25 -126 326 132 -208 -168 123 72
3611 72 -132 148 35 -48 -170 111 34 104 75 -185 -171 -147 110 191 181 10 71 104 284 242 160 -88 -63 -293 -49
3636 -49 -56 -245 -51 -24 9 -101 -108 269 17 -195 146 4 28 269 -251 -271 -235 9 -53 -154 -39 269 243 -39
3660 -39 35 -194 186 172 124 -107 -192 -7 -166 -155 -3 -73 -189 94 -56 119 69 42 120 126 -43 183 -78 72
3684 72 -58 -130 124 -7 -102 -17 -93 -83 -30 -59 28 -225 -41 75 -66 59 -58 -30 -276 -57 94 -73 -74 62
3708 62 251 -49 44 200 -23 17 188 88 -111 4 -71 348 -98 -6 -262 -72 48 -306 61 45 -184 213
3730 213 144 192 -32 -12 362 35 71 24 172 -259 -43 -271 121 61 -210 -358 -50 96 -71 164 62 -285
3752 -285 -18 -140 -105 -254 -60 -87 -243 145 61 -9 -169 -22 -104 -226 107 -100 48 86 207 20 11 -153 -8
$$ packed form
3587A09m25L23Q1J16j37j9j00KN3j6q7J39M3n4Q6k11J22j51M52j94l40M0K91n1
3611G2k04K80j13q3j22K81p7P0k9k60J4K4K57Q1j0j71O1L3J80m2q2k48K5k30K44
3636d9pj89J94K7L3j10pL77k52k12L41j42K4K41n20k0L6K44o2j01J15L08k6k82
3660c9P4k29L80j4m8k31q5J85j59J1J52p0j16K83j50J75n0k7P8Oj69K26k61J50
3684G2j30p2K54j31r5Q5p6J0N3k9Q7k53J84J16j41J25j17K8k46K19J51j67jJ36
3708F2J89l00R3J56k23M0J71j00j99J15p5M19m46R2k56J90J20l54L67j6k29L97
3730B13o9M8k24K0L74l27L6m7J48m31K16k28L92o0k71j48L08J46j67K35j02l47
3752b85K67j22L5j49J94k7j56L88q4p0j60J47q2j22L33k07J48L8J21j87rj64J45
$$ plain form
3775 -8 -96 -237 -9 -138 135 -113 72 17 27 -1 -27 156 115 158 199 96 109 5 196 26 -84 252 112 -260
3799 -260 -289 -113 127 -183 -93 -200 -90 215 190 -191 163 -72 12 220 99 193 65 10 -43 -175 -52 -25 -116
3822 -116 -51 79 24 133 -333 -218 -20 -32 -62 56 -89 -112 -218 -204 14 -319 84 -183 143 -11 -29 33 -56
3845 -56 -132 -62 109 71 -3 -51 199 -66 -316 -93 -37 -104 14 -62 -39 73 90 -303 -81 -39 222 28 -140 263
3869 263 -5 -85 46 -116 -35 -123 -93 -215 -53 -177 -119 -148 73 -2 -7 -265 -117 90 -77 -225 -132 86 -14
3892 -14 40 -134 -191 -78 53 -69 103 176 -4 104 5 -224 17 21 -79 -28 -5 153 -238 -28 75 -77 64
3915 64 -142 14 -200 35 -152 245 63 165 -207 128 -43 14 -82 -328 -46 -58 -33 -114 130 -180 39 -167
3937 -167 -260 -136 15 75 -66 -157 -48 -201 -158 13 -117 -16 -219 -68 -238 211 1 27 -51 257 -4 -151
$$ packed form
3775hq8j41K28j29K73k48J85n5J0k8k6J83m1M3M1j03J3j04J91j70j10L36j40l72
3799b60k9J76K40l10R0j07J10L05k5l81L54k35Q4K08j21R4j28n5n3j32J23K7r1
3822a16O5J30n5J09m66J15J98j2l0J18j45k3j06J4K18l33M03k67L26j54j8O2q9
3845e6p6P0J71l8p4m8K50k65k50K23N6o7J18p6K3J12J7l93K22M2K61j94j68M03
3869B63k68q0J31j62Q1q8L0j22J62j24N8k9K21p5nk58J48K07j67j48R3K18j00
3892a4N4j74n7J13J31j22J72P3j80J08r9k29K41Mj00N1K3J58l91K10J03j52J41
3915F4k06J56k14K35j87L97j82J02l72L35j71N7r6k46K82j2K5q1K44l10K19k06
3937a67r3J24J51O0j41r1J09j53M3J71j30J01k03J51j70M49k10K6p8L08k61j47
$$ plain form
3959 -151 -243 -47 -358 207 -46 -194 -73 -62 -135 38 32 -190 -61 -103 114 -137 198 142 -81 193 230 -161 -81
3982 -81 -23 -213 -270 11 -330 -162 44 34 67 -74 -485 -114 -231 -188 -144 156 -53 -90 -11 120 155 -100 111
4005 111 297 71 -43 26 154 13 83 100 145 33 -10 162 112 -139 -127 -21 -168 -57 63 119 -164 13 -13
4028 -13 -15 70 -102 126 -174 40 246 -14 52 84 148 20 -39 -62 -148 90 97 98 -206 -307 -365 47 21 -125 219
4053 219 255 8 -10 84 79 92 204 -6 47 149 355 -67 -98 -292 -351 15 -142 -14 -30 -179 -135 -369 -135 110
4077 110 -297 -142 -86 -75 -35 165 25 -165 47 29 -159 222 -36 321 173 196 162 -126 -32 -240 21 11 200
4100 200 -117 5 257 -14 -193 -167 33 167 -16 -107 256 6 96 26 143 -163 259 142 190 -208 -26 -28
4122 -28 8 101 -39 29 -188 49 -16 -154 45 -7 -59 23 -133 143 -120 146 -85 16 272 127 43 -140 -95
$$ packed form
3959a51r2J96l11N65k53j48J21J1p3J73ok22J29m2K17k51L35n6k23K74L7l91Q0
3982h1N8j90n7K81l41J68K06j0L3j41m11L71j17M3M4L00k09l7P9J31L5k55K11
4005A11J86k26j14O9J28j41P0J7M5j12m3J72n0k51J2J06j47J11J20N6k83J77k6
4028a3kQ5j72K28l00K14K06k60O6L2O4j28n9k3q6K38PJl04j01n8M12k6j46L44
4053B19L6k47j8R4nJ3J12k10N3J02K06m22l1j94n9L66j57J28j6j49M4k34K34K45
4077A10m07J55N6J1M0K00j40j90K12j8j88L81k58L57j48K3l4k88R4k08K61j0J89
4100B00l17J22K52k71j79K6K00J34j83r1L63k50R0p0J17l06M22j17M8l98J82k
4122b8L6R3j40O8k17K37o5j38J99n2n2Q2j56K76k63K66k31J01K56j45q4j83M5
$$ plain form
4145 -95 94 11 -73 152 -10 -196 -55 -5 -278 201 -201 -21 -64 118 19 154 138 135 399 -47 130 -292 145
4168 145 -203 -89 217 -1 -204 -138 43 -84 -191 94 -77 -86 -175 -93 -174 -215 -151 284 -156 195 216 84 -11
4191 -11 129 68 218 -113 -131 79 -188 54 154 -156 -139 40 -320 498 -158 118 -89 90 88 -39 -58 281
4213 281 135 -167 -20 22 178 -136 36 77 -169 24 239 36 150 -152 224 -167 -179 224 73 79 -34 -86
4235 -86 -4 -10 -14 68 102 104 84 -108 -181 -32 -62 163 187 -205 -81 182 210 -3 107 -135 -111 -46 -146 -65 -33 -197
4261 -197 145 -105 -118 -54 246 64 109 204 210 -175 -64 -77 341 -23 -100 308 -14 -94 80 148 -18 -74 12 292
4285 292 -215 -299 -34 166 -99 -207 -206 31 -265 -161 236 33 -119 188 29 113 -64 67 447 129 -97
4306 -97 17 69 -177 -124 75 98 -159 -263 -44 48 -297 -255 85 -65 -296 -104 -46 -58 -94 464 260 99 -396
$$ packed form
4145i5J89q3q4K25j62j86J41N0k73M79m02J80m3J82r9J35j6lK64m46J77m22M37
4168A45l48J14L06k18k03O6J81j27j07K85j71rq9Q2q1m1O4M35m40L51K1j32r5
4191a1J40o1J50l31j8K10k67K42J00l10J7J79l60Q18o56K76k07J79kj27j9L39
4213B81j46l02J47M2J56l14J72M1k46J93K15k03J14l02L76l91j2M03j51Oj13n2
4235h6Q2omQ2L4Kk0j92p3J49l0K25K4l92J24K63K8k13J10k42K4O5j00Q1L2j64
4261a97L42k50j3O4L00j82M5R5Ol85J11j3M18l64p7M08l22q0J74O8j66n6Q6K80
4285B92n07q4K65K00k65j08JK37k96J04L97k03j52L07j59Q4j77J31L80l18k26
4306i7J14N2k46N3J99K3k57j04K19R2l45M2L40j50k31J92N8j2l6N58k04j61m95
$$ plain form
4329 -396 5 166 -167 128 59 0 -64 -50 -151 117 -107 -306 52 -249 -114 70 132 -182 -57 225 274 -56
4351 -56 33 167 -195 281 -42 171 95 -372 -19 207 -120 -307 340 233 77 23 -38 28 -126 84 -231 175
4373 175 -198 -208 115 9 -407 -445 221 -11 -93 208 349 -45 -79 277 170 -147 -184 177 -103 -38 147 -44
4395 -44 -96 -234 -2 -30 -48 -85 21 -54 -195 -156 123 109 -15 -58 220 90 -273 58 145 -141 -27 -283 88
4418 88 -97 -247 -54 39 -110 -99 230 -40 -264 3 324 -111 8 -20 214 -48 22 145 242 -132 -25 177
4440 177 138 40 -179 15 151 -417 -76 233 -335 -159 -156 79 -73 -60 89 95 -161 -148 38 -8 -4 19 -68 76
4464 76 -340 -66 -23 -271 -181 22 389 -25 -441 -9 218 -326 -282 136 -287 -208 -198 314 116 -42 37 238
4486 238 -50 -386 -56 157 33 -125 3 191 -68 -399 -16 143 -86 -18 258 85 -330 -100 507 97
$$ packed form
4329c96M01J61l33K95o9n9o4J4j01K68k24j99L58l01J35J84O2l14J25K82M9l30
4351e6Q9J34l62M76l23K13p6m67L53K26l27j87O47j07j56n4o1O6j54K10l15M06
4373A75l73j0L23j06m16l8O66k32q2L01J41l94l4L56j07l17l7L61k80O5J85j91
4395d4n2j38K32k8j8l7J06p5j41L9K79j4j24m3K78j30l63L31Q7k86J14k56L71
4418H8j85j50J93R3j49J1L29k70k24K67L21m35J19k8K34k62P0J23R7l74J07K02
4440A77l9r8k19J94J36n68L41L09n68J76LK35j52J3J49Ok56J3J86m6MK3q7J44
4464G6m16K74M3k48R0K03L67m14m16M32K27n44M4M18m23P9J0N12j98j58P9K01
4486B38k88l36L30K13j24j58J28J88k59l31L83J59k29O8K76j73m15K30O07m10
$$ plain form
4506 97 -187 -49 67 -283 -24 121 200 -90 55 73 247 -166 -59 156 154 -124 -201 371 209 126 -70 16 -61
4529 -61 -220 33 51 -134 11 144 -68 -141 130 72 -112 -146 -388 148 266 -8 311 225 -184 -235 -21 59 -329
4552 -329 -341 197 36 -38 36 33 -112 -126 42 35 74 -51 -49 193 -69 54 57 435 -6 116 308 361 -144 -235 180
4577 180 -21 -111 111 68 -181 -101 -113 66 -272 -230 118 74 -30 -97 -2 -31 -257 -253 50 -35 -176 -61 -4 11 -216
4602 -216 -57 57 107 -16 283 -108 61 -220 6 105 -383 -10 184 -74 7 -190 109 -289 -118 63 123
4623 123 -79 123 247 -75 264 -312 61 248 3 -150 -29 -140 -372 -304 54 -14 -24 34 66 -184 -219 -164
4645 -164 39 -156 -75 -203 369 141 12 23 129 158 -199 362 -56 -155 116 44 -157 -275 64 77 -12 78 244
4668 244 59 -32 69 170 -84 -12 99 245 72 171 144 129 -169 -20 192 5 13 171 112 157 -185 -166 -116 -217
$$ packed form
4506I7k84J38J16l50K59J45P9k90J45J8J74m13J07K15kk78p7N72j62q3j96Q6p7
4529f1j59K53J8j85J45J33k12p3K71n8j84l4k42N36J18k74L19q6m09n1K14Q0l88
4552c29j2N38j61p4P4lj45j4J68pL9j25KK42k62J23LL78m41J22J92N3n05r1M15
4577A80k01r0K22m3k49Q0j2J79l38M2L48m4j04o7R5k9k26ML03q5j41J15N7J5k27
4602b16J59J14N0j23K99l91J69k81K26R9m88L73J94k58Q1j97K99l98J71J81O0
4623A23k02K02J24l22L39n76L73J87k45j53J21j11k32O8L58o8j0N8L2k50l5N5
4645a64K03j95Q1j28N72k28j29J1J06K9l57N61m18r9K71p2k01j18L39J3q9R0J66
4668B44j85r1J01J01k54P2J11J46j73R9k7j5k98J49K12j87QJ58n9M5l42J9N0j01
$$ plain form
4692 -217 -183 -284 -227 -97 11 -82 -327 158 -91 123 -130 -160 -96 6 -3 152 110 241 62 -245 -231 1 -121
4715 -121 -173 145 67 3 223 -286 153 -118 -182 -177 154 -130 -59 -68 36 -200 -18 -2 -143 -2 103 136 -58 268
4739 268 68 -52 -212 190 286 -239 -96 -1 -94 116 -39 -183 -78 -174 5 14 102 149 125 16 186 71 100
4762 100 359 -32 -29 -5 -81 -444 130 -79 -108 -269 16 -4 -66 -15 -18 127 -23 -195 -44 -63 73 -67 31 -128
4786 -128 152 49 -4 -234 -77 -120 269 -31 -288 248 46 -133 -105 146 89 -3 37 11 115 209 -114 153 91
4809 91 -107 -54 -97 -127 184 -69 -60 85 182 -24 74 15 -31 -68 -296 -68 -238 177 -310 -203 -128 -78 -168 -123 67
4834 67 255 -205 -96 -211 136 -51 -135 -66 -91 57 243 213 -6 97 40 351 12 105 -58 -69 105 127 99
4857 99 -44 -159 119 -182 26 -98 159 -72 -49 -215 -237 -77 0 346 101 38 -192 120 -136 -30 -14 -97
$$ packed form
4692b17L4j01N7J30J08r3k45M85k49K14k53l0O4J02rJ55m2J31j79l07J4K32j22
4715a21n2L18p8o4K20n09M39k71o4NL31k84P1rJ04k36J82J6j41J41J05L3j94L26
4739B68k00j20j60M02R6n25J43R5r3K10j55j44J05r6J79RQ8M7k4j09J70j15K9
4762A00K59l91LK4p6l63N74k09k9j61K85k0o2N1lJ45j50j72J51j9J36j40R8j59
4786a28K80j03n3k30J57m3L89l00k57N36k02j79K8K51n7r2M0k6J04R4l23K67o2
4809I1j98N3m3l0L11k53RJ45R7k06R8n9m6l7k28K28j70M15m87J07P5N0r0M5J90
4834F7J88m60J09j15L47j87q4O9k5J48J86l0k19J03n7L11l39R3j63j1J74K2k8
4857I9j43j15K78l01K08j24K57k31K3j66k2J60P7L46k45o3k30L12k56J06J6q3
$$ plain form
4879 -97 70 -59 -9 -236 124 -36 -188 163 87 -164 115 16 54 -72 -56 112 71 5 44 240 222 155 97 -128
4903 -128 -218 -253 43 -104 132 -110 -91 -100 2 74 74 15 -36 217 94 67 52 22 94 48 -24 105 69 -75 23 -25
4929 -25 -86 -6 -10 23 -99 84 -138 -118 152 64 -62 -352 -14 4 -213 143 -32 124 15 -95 -76 92 71 -104
4953 -104 -63 -24 -11 41 -41 125 -9 -125 62 -11 -285 -26 -87 34 114 -33 2 -139 -40 -42 -44 22 49 -153 -58 263
4979 263 -65 262 136 122 -49 -1 -59 7 -12 -74 170 -149 171 -6 -53 -40 -262 95 -10 20 224 137 -81
5002 -81 286 -6 -220 -24 4 120 149 206 -62 156 90 -277 77 -124 61 -1 111 292 -28 -24 -203 -46 -216
5025 -216 -12 217 227 -107 -57 106 26 219 -186 -169 75 98 -158 -27 -155 107 57 299 279 -13 100 -70
5047 -70 262 18 -273 17 -7 54 160 -22 -154 -93 -70 -132 130 -51 269 34 190 165 -207 -91 -9 68 68 42
$$ packed form
4879i7J67j29N0k27L60j60j52L51p6k51K79r9L8j26J6J68m1o6L9J96j8o7n8k25
4903a28r0l5K96j47K36k42J9rJ02P2%n9n1K53j23k7j5l0P2m6p2J29l6j44R8m8
4929b5o1Q0mL3j22J83k22K0K70q8j26k90L38J8k17L56j75J56j09j10J9J68k1j75
4953a04M1L9J3N2q2J66j34j16J87p3k74K59o1J21Q0j47L5j41R9kkO6K7k02R5L21
4979B63l28L27j26j4j71M8n8O6j9o2K44l19L20j77m7J3k22L57j05L0K04q7k18
5002h1L67k92k14J96K8J16K9N7k68K18o6l67L54k01J85o2J12J81l20Mj79J57j70
5025b16K04K29J0l34N0J63q0J93m05J7K44K3k56J31j28K62n0K42k0k92J13j70
5047g0L32k44k91K90k4O1J06j82j32O1K3o2K62j81L20k35J56k5l72J16Q2P7%k6
$$ plain form
5071 42 -11 56 -35 21 -98 -121 85 -168 -53 188 0 -191 101 -2 267 -13 -10 -36 -104 -4 7 25 52 177
5095 177 -155 -121 -167 -253 89 -29 -315 129 125 43 118 -137 -53 115 64 -115 98 45 60 27 -188 -65 -40 -165
5119 -165 -9 133 231 -70 -26 -122 210 164 -187 96 87 201 69 -157 143 210 152 -75 21 97 41 384 94 -161
5143 -161 60 -104 -3 221 -131 -83 -65 49 -340 212 67 -74 -64 -30 212 -11 -159 -125 275 -61 -34 118
5165 118 -96 5 110 -53 180 -110 -151 -128 -122 52 13 -39 179 125 -75 216 -41 -262 31 140 -117 220
5187 220 -101 46 74 -326 -3 -343 -25 103 75 -38 -47 112 81 54 -215 -90 -169 -311 138 24 -107 100
5209 100 70 -209 60 -120 -34 114 71 -103 -505 -135 257 -18 47 -137 -52 -125 133 167 127 -283 51 -183 -30
5232 -30 -4 -182 32 -108 92 -54 284 -243 7 -277 28 20 168 24 94 51 106 -52 -145 -56 -132 37 -201
$$ packed form
5071D2n3O7r1N6j19k3K06k53J15K41j88j91K92j03K69k80Lk6o8J00J1J8K7J25
5095A77l32L4m6q6L42j18k86M44mq2P5k55Q4J68n1j79K13n3J5l3k15J23K5j25
5119a65J56J42R8l01M4r6L32m6l51K83rJ14j32k26L00O7n8k27R6P6n6L43k90k55
5143a61K21j64J01K24l52M8J8J14l89N52j45j41J0L4K42k23j48L4M00l36K7J52
5165A18k14J01J05j63K33k90m1K3OJ74l9n2K18n4k00K91k57k21K93J09k57L37
5187B20l21J47K8m00L23l40L18J28k8j13rJ59l1k7k69J25p9j42M49j14j31K07
5209A00l0k79K69j80Q6J48m3j74m02L70L92k75O5j84Q5p3K58L4m0m10L34k34J53
5232c0K6j78K14j40K00j46L38n27K50k84L05qJ48j44P0m3N5j58r3Q9p6J69k38
$$ plain form
5255 -201 -86 36 13 16 -41 -45 -272 -119 -129 62 193 125 -56 229 27 200 131 -93 -180 -85 -153 301 -107 -303
5279 -303 35 68 -85 -181 158 -35 209 -185 55 104 271 84 -20 175 -16 -54 -232 -175 224 95 197 164
5301 164 -133 -141 130 -184 -301 -216 -42 289 -161 245 40 -159 -219 5 110 202 106 4 84 -135 -220 -183 226
5324 226 2 42 -72 -97 -118 -101 -84 145 194 -162 -57 -28 22 29 129 -55 22 -89 -70 -3 269 -120 5 160
5348 160 124 227 34 100 -58 91 316 49 -248 63 -156 -109 -123 -3 93 -356 -69 -114 82 145 -159 -83 76
5371 76 151 181 -91 82 -200 -81 -190 95 -17 -112 -38 136 37 132 157 63 -104 -37 24 -201 -163 58 -75 80
5395 80 -19 41 69 -9 -76 68 -101 135 -60 73 44 -106 -38 -60 -171 76 -261 -239 94 284 69 -37 -100 -24
5419 -24 104 -252 204 72 -22 77 -297 -202 -95 -2 -16 216 96 57 152 79 50 -78 321 -112 199 196 65 -199
$$ packed form
5255b01J15J22k3Ln7mk27J53j0J91J31o8j81K85k02J73o9k24q7R5o8M54m08j96
5279c03L38L3j53r6L39j93K44l94K40M9J67j87j04J95j91l8j78N7L99j29J02l3
5301A64k97qK71l14j17Q5J74L31m50M06k05j99o0K24J05R2r6j02Q0k19q5L7M09
5324B26k24M0j14k5k1J7J7K29M9l56J05K9N0PJ00j84P7j11J9O7K72l89J25J55
5348A60l6J03j93O6j58J49K25k67k97L11k19M7j4J20R6m49K87m5J96O3l04P6J59
5371G6P5L0k72J73k82J19j09K85j12r5P4J74r9R5K5r4j67O7O1k25L8K21j33J55
5395H0r9O0K8p8o7J44j69K36j95J33k9j50O8k2j11K47l37K2L33J90k15j06o3P6
5419b4J28l56M56j32r4R9l74R5J07R3j4K32j20l9R5p3k9j28L99m33L11lj31k64
$$ plain form
5443 -199 -148 -65 132 -95 -136 19 239 -249 -95 -10 155 84 -78 -70 178 31 57 -61 -118 -354 227 -21 -23 19
5467 19 -72 76 -15 -51 -134 -42 104 -203 183 94 43 -140 -44 0 175 81 -24 -257 -210 24 35 -34 172 -248 78
5492 78 60 -189 8 38 12 140 153 204 122 -17 -43 51 -98 -60 -34 -158 -59 -94 89 -135 -55 -257 61 11 1
5517 1 274 62 -103 -221 -55 -24 26 -233 -15 35 -64 75 -218 62 28 -24 -11 -202 196 -138 -23 36 -196
5540 -196 -122 -99 -86 112 -170 -151 61 -207 56 22 -27 -103 -169 -144 18 -209 -138 69 14 -139 -65 -13 -58 -175 -11
5565 -11 -258 2 -5 114 209 -32 167 160 161 60 171 -143 255 -76 -9 102 -32 43 -264 136 187 -116 -159 276
5589 276 -55 192 -248 -108 -184 -178 30 323 22 81 -15 -269 -247 -22 40 75 -59 6 240 -99 -6 -178 -158 109
5613 109 -139 163 129 182 215 -72 106 188 64 -51 19 -70 67 242 283 -99 143 -20 18 -93 -324 -109 13
$$ packed form
5443a99N1Q3J97k27m1J55K20m88J54Q5J65p1j62QK48j47K6j18n7k36N81k48kM2
5467A9r1J48r1l6q3R2J46l07L86q9n1j83R6M4J75r4j05k33M7K34J1o9K06m20L26
5492G8j8k49J97L0k6J28J3N1q2j39k6R4j49L8K6j24R9l5J83k24Q0k02L18n0j0
5517AK73k12j65j18J66L1N0k59K18N0r9J39k93K80l4n2J3j91L98l34J15N9k32
5540a96P4K3J3J98k82J9K12k68K63l4m9p6o6K5J62k27P1K07n5j53P4N2m5j17J64
5565a1k47K60pJ19R5k41J99pJj01J11l14L98l31O7J11j34P5l07M00N1l03m3M35
5589B76l31K47m40J40p6OK08K93l01N9r6k54K2K25O2L5j34O5K34l39R3j72K0K67
5613A09k48L02l4N3L3k87J78Q2j24j15P0q9J37J75M1l82K42j63L8j11k31K15J22
$$ plain form
5636 13 -183 -152 -142 -31 286 16 107 -51 -280 -110 59 -12 -132 -136 87 -108 -57 -21 172 -2 -177 -202 221
5659 221 -7 27 115 -134 91 13 130 -143 -220 -40 152 109 93 -82 61 -60 377 104 202 10 -80 -11 -44
5682 -44 -45 125 58 -104 -162 -13 -171 76 -146 -232 41 59 -51 -243 -155 6 91 -47 207 -132 1 19 -94
5705 -94 127 -72 -146 -137 190 183 -100 189 -90 -40 31 -207 -21 -61 -170 -111 -13 52 42 -86 281 52 -110 -64 -235
5730 -235 196 -229 -63 349 148 26 288 -139 70 51 26 -115 -184 13 82 108 -27 118 154 23 -143 16
5752 16 221 153 -275 -95 24 119 181 266 7 -90 133 97 163 -154 -188 115 160 20 50 126 -76 39 -74 -129
5776 -129 207 29 13 -109 -232 5 14 27 -177 183 211 -61 -108 -25 318 -137 -260 -128 -228 -516 -192 -146 174
5799 174 69 0 230 -184 50 -28 36 152 127 -244 -71 -53 -49 60 298 -65 3 201 127 45 50 71 -105 265
$$ packed form
5636A3j96L1J0J11L17k70R1j58k29J70J69p1j20mK23j95N1L6J93j74j75k5M23
5659B21k28L4Q8k49K25p8J17k73p7J80J92m3j6j75J43j21M37k73R8j92r0O9l3
5682d4jJ70o7j62n8J49j58K47k22q6K73J8j10j92Q8J61Q5j38K54l39J33J8j13
5705i4K21j99p4RL27pk83K89k79N0P1k38J86m0j09N9R8O5j0j28L67k29j62M6j71
5730b35M31m25J66M12k01j22K62m27K09j9k5j41o9J97O9K6j35J45L6j31j66J59
5752A6K05o8m28J80J19R5O2Q5k59r7K23l6O6l17l4L03M5j40L0P6k02J15j13n5
5776a29L36j78j6j22j23K37RJ3k04L60K8k72m7Q3L43m55j23J32j00k88L24M6L20
5799A74j05o9K30m14K34p8O4J16k5l71J73J8MJ09K38l63O8J98p4q2NK1j76L70
$$ plain form
5823 265 -134 -72 -82 -14 151 -146 199 84 1 -83 -293 28 38 295 121 -91 146 -198 87 -52 34 25 -61
5846 -61 117 20 -199 -9 111 44 -107 -184 -220 53 -136 -195 131 -42 19 -73 28 -175 -41 227 123 -16 -217
5869 -217 -247 102 17 176 143 36 100 -246 -24 145 -279 -60 -70 194 -210 49 -84 -122 356 251 -41 129
5891 129 39 38 5 -288 -230 -103 234 -390 231 -277 129 -99 -89 152 2 56 -26 3 -53 -47 -17 1 -113 -84 -99
5916 -99 211 26 81 1 13 25 44 40 -171 0 294 -91 -133 11 79 91 10 -238 4 133 -33 -2 24 -45 -85
5941 -85 178 166 30 -8 34 -4 -121 70 516 209 111 24 39 -156 -22 122 204 141 -244 111 178 -35 42 -41
5965 -41 -74 87 -227 135 245 -26 -347 -84 54 -121 -218 42 -15 -247 209 -125 54 -123 -195 -98 -77 -21 112
5988 112 45 -203 -56 -111 198 -209 -8 97 -258 -35 -111 84 105 -93 113 -102 -22 179 130 -207 -384 -35
$$ packed form
5823B65l99O2j0O8J65k97L45j15q3q4k10L21J0K57j74k12K37l44K85j39Q6rq6
5846f1J78r7k19J90J20o7j51p7l6K73j89n9L26j73O1r2J01k03J34K68j04j39k01
5869b17l0L49q5J59l3j07O4l46K22J69m24K19j0K64m04K59j33l8M78j05k92J70
5891A29r0jl3k93N8J27L37o24O21n08M06k28J0K41j50N4q2K9n6OL0J8j14K9j5
5916i9L10j85N5q0J2J2J9mk11J71K94l85m2J44O8J2q1k48K42J29j66L1K6o9m0
5941h5K63j2j36l8M2l8j17J91M46l07r8q7J5j95J34J44Q2o3l85L55O7k13P7q3
5965d1l3J61l14L62J10k71l21K63J38j75r7K60n7k32M56l34J79j77p2R7K1N6J33
5988A12o7k48J47n5L09m07K01J05l55K23p6J95K1j98K06k15Q0K01m9l37j77L49
$$ plain form
6010 -35 250 -216 -62 113 167 -35 105 -113 -30 -144 -56 181 -18 -138 -143 292 17 129 -79 49 -44 -20 1
6033 1 66 108 -93 212 261 -192 36 -3 -152 -264 93 180 135 -121 88 -398 110 120 76 -7 -114 144 109 157
6057 157 162 136 18 -75 -250 -56 -189 -98 -115 210 -225 -9 -186 26 -76 -318 -110 3 50 69 158 -100 243
6080 243 -12 157 214 67 -128 -63 104 238 -6 34 -63 -243 -189 17 46 5 -364 -34 -35 76 -201 197 -43
6103 -43 -109 70 18 112 -274 -84 -83 245 58 159 -156 146 100 177 -259 -47 42 73 58 -77 -153 -162 -213 95 111
6128 111 331 244 98 -157 28 8 -73 -19 129 34 -165 -63 50 31 35 -13 39 356 -196 -37 -206 -198 96 -319
6152 -319 -248 56 -29 91 -136 -196 292 248 -118 -10 -47 -1 -194 275 -14 -100 142 -60 59 -52 -27 284 -190
6175 -190 298 58 -119 -119 -230 18 258 -65 22 127 -197 -81 -36 -243 -261 213 51 55 -45 -21 -76 -135 -97 -274
$$ packed form
6010c5K85m66J54J75N4k02J40k18Q3j14Q8K37j99j20nM35k75J12k08J28r3K4K1
6033AO5M2k01L05M9m53K28l9j49j12L57Q7m5k56K09m86N08J0m4q3j07K58l5M8
6057A57Nk6j18r3j75J94j33R1j7L25m35K16j77K12j02k42K08J13M7J9Q9k58L43
6080B43k55J69N7j47j95O5J67J34k44M0r7j80N4K06K9m1l69L30jJ11k77L98k40
6103d3o6J79n2R4l86J90JL28j87J01l15L02m6P7m36K12Q9L1j5j35p6rn1L08J6
6128A11K20q7j46k55J85k0q1N4J48r5j99J02J13j9Mm8N2L17n52J59j69QK94m15
6152c19P1L04q5J20k27o0M88m4l66J08l7M6j93M69k89q6K42k02J19j11K5L11m74
6175a90M88k40j77%j11K48K40l23Q7J05l24J16M5k07j8M74j62Mj00K4n5n9L8j77
$$ plain form
6199 -274 8 -33 -16 -38 20 83 -49 74 -16 -23 29 -239 116 258 -171 151 40 297 90 -73 177 223 -143
6222 -143 186 -23 55 -327 22 -22 91 136 -6 -79 23 53 34 32 31 100 -53 85 -245 117 -217 108 -255 -235
6246 -235 209 -144 13 -148 -16 -57 -165 63 -67 -54 -119 -22 -305 -24 4 -24 -170 -89 1 29 48 -10 -113 62
6270 62 23 -29 -204 -22 197 -17 2 -103 140 16 -26 94 -74 -8 -6 -48 -231 -16 -15 20 34 134 -93 125
6294 125 93 -29 2 142 32 249 132 1 -77 50 100 73 28 41 -36 160 -232 -187 -101 -65 28 105 95 20 90
6319 90 -38 20 -88 207 55 -59 267 -309 28 10 -74 220 35 10 -13 16 -202 -120 164 46 -25 -83 -93 3
6343 3 76 18 -181 -46 11 -196 -54 197 20 143 20 -73 82 20 -147 -48 170 -68 15 35 97 163 -97 -143
6367 -143 209 -268 -133 -41 164 53 -97 -88 69 -156 -29 344 98 95 -78 -179 9 -181 29 -105 5 -110
$$ packed form
6199b74K82m1J7k2N8O3j32J23r0pN2k68L55J42m29L22j11K57k07j63K50M6l66
6222a43L29k09P8l82L49m4J13M5j42p3J02L0j9kjO9j53J38l30L62l34L25l63K0
6246b35M44l53J57j61J32m1j08K28j30J3o5R7k83K81K8k8j46Q1R0K8J9n8j03J75
6270F2l9n2j75J82K19k14J9j05K43j24m2J20j68O6Km2j83K15JL5J4J00k27K18
6294A25l2j22L1J40j10K17j17j31p8J27N0k7m5J3p7J96l92M5Q6L6R3P7j0p5P0
6319I0j28N8j08K95j52j14L26n76L37j8q4K94j85k5k3K9k18Q2K84j18p1n8j0R6
6343CP3n8j99J35N7k07J42K51j77J23j23r3J55o2j67R9K18k38Q3K0O2O6k60m6
6367a43L52m77J35R2K05j11j50RJ57k25J27L73k46lj73j01J88j90K10j34J10j15
$$ plain form
6389 -110 -242 196 -84 26 91 -248 -53 -175 164 -15 -222 34 -378 54 61 272 -317 -268 38 -259 129
6410 129 -167 -33 -132 109 86 -31 -25 -22 -60 -96 -31 -125 275 -25 311 46 -170 132 -63 128 76 100 -113 -21
6434 -21 -97 -305 -103 -79 59 62 25 123 -241 275 169 -378 0 187 210 171 -139 -251 -119 -110 53 263 22 -171
6458 -171 -58 103 53 -118 -120 189 94 -127 -135 -182 305 -134 -56 -23 -29 43 -95 -169 -249 135 166 114 -27 240 -49
6483 -49 -119 -171 -221 95 -95 -194 -205 90 36 237 -114 -133 -6 -1 101 -32 -147 -146 -179 121 -138 271 -40 -119 29
6508 29 181 319 206 128 20 -3 70 111 -315 95 257 -91 -3 -124 -26 -311 -8 35 341 170 -87 -32 6
6531 6 215 -102 -195 4 56 156 91 283 128 -6 182 -280 -78 -75 -159 -30 -162 -58 -182 176 280 6 119
6554 119 -34 -46 -4 -154 -119 29 -349 -344 -164 -54 89 7 -145 83 -273 73 106 51 88 -53 57 -138 112
$$ packed form
6389a10j32M38k80J10O5l39J95j22L39j79k07K56m12M32PK11n89M9L06k97L88
6410A29k96J34r9K41k3j17OLl8l6O5r4M00l00L36k65k16L02j95J91n2K4k13R2
6434b1p6k08K02K4J38Ll7R8l64N16j06n47L78J87K3l9l10j12J32RJ63K10k41j93
6458a71J13J61n0j71kL09r5k21qm7M87m39P8L3oP2j38p4q0L84L1n2j41K67k89
6483d9p0n2n0L16j90r9j1K95n4K01l51j9J27NJ02j33j15Jl3L00k59M09l11p9J48
6508B9J52J38j13p8j08k3P3M1m26M10J62l48Q8j21R8k85L03M3L06j71k57N5L8
6531FK09l17r3J99N2J00o5J92j55j34J88m62K02Lq4J29j32J04j24L58J04k74J13
6554A19j53j2M2j50L5J48l78NJ80J10J43q2j52K28l56L46L3n5L7j41J10j95K50
$$ plain form
6577 112 -11 -94 163 -21 -72 67 52 59 -21 189 173 205 50 -33 111 -24 -90 -83 -138 -208 -1 -63 3 -147 -4
6602 -4 24 -263 -191 51 199 -17 -225 22 -144 -48 0 -241 65 -63 34 -85 99 103 253 91 94 80 67 54 -86
6627 -86 145 123 147 -34 43 87 96 4 67 87 -233 -76 -202 161 -131 -43 -12 117 48 -196 177 108 13 232 -111
6652 -111 122 -1 28 352 -227 -146 -276 -243 -148 50 54 -216 -34 150 52 70 106 -83 -92 -209 -45 270 12 -6
6676 -6 16 134 17 -19 228 156 -36 176 -209 245 -150 128 4 197 17 58 215 -134 96 -56 103 54
6698 54 36 113 120 179 89 20 273 -193 -173 -150 159 56 121 49 -1 99 20 78 -81 -201 -273 28 -20 -62 93 70
6724 70 -31 22 251 116 -81 22 -108 132 -158 192 98 -66 -40 -135 91 157 -205 -94 87 -39 66 123
6746 123 -253 -201 -113 163 -79 -87 11 94 -24 95 -153 -231 -49 5 -50 -90 -285 10 -24 -154 -215 -189 27 100 -53
$$ packed form
6577A12j23q3K57j84n1J39j5Pq0K10j6L2j55q3J44j35o6Pn5p0K07o2O6j50J43
6602dK8k87P2K42J48k16k08K47j66R6M8k41L06j28R7j19J84MJ50j62Lj4j3j3j40
6627h6K31k2K4j81P7M4Rr2O3K0l20J57j26L63k92Q8L1J29o9k44L73o9r5K19l43
6652a11K33j23K9L24n79Q1j30L3R5J98Mk70J82J84r8J8L6j89rj17J64L15k58j8
6676fK2J18j17l6K47p2j92K12l85M54l95K78j24J93j80M1J57l49K30j52J59m9
6698E4j8P7PN9r0o9K53m66K0K3L09j03O5p2n0J00p9N8j59j20p2L01m8m2J55k3
6724G0j01N3K29j35j97J03j30K40k90L50r4j64K6r5K26O6l62J11J81j26J05N7
6746A23l76N2Q8K76k42qR8Q3j18J19k48p8J82N4n5m0j95K95l4j30o1K6K16P3j53
$$ plain form
6771 -53 -85 -46 -178 127 136 245 -166 -5 -3 -114 -14 88 -37 -107 -3 95 -37 -250 -47 -3 126 294 -151
6794 -151 -353 37 -57 -136 -239 287 -49 319 93 84 -117 45 101 -86 -86 281 187 -98 20 -32 -60 280 252 47
6818 47 168 -176 -83 76 53 -61 -179 -164 13 87 -202 -39 -39 -113 176 -201 249 29 106 -90 34 84 -336
6841 -336 -109 -15 -78 -128 -19 97 -81 -198 210 70 -111 -4 -157 -24 -231 95 -47 -147 -66 256 44
6862 44 17 22 151 -110 -272 -23 29 52 -2 106 14 228 -107 52 225 32 29 161 73 -205 -57 -1 192 58
6886 58 104 -98 -42 -252 -16 103 -22 99 -66 185 -9 -94 -315 60 -60 62 9 234 -101 -32 102 -123
6908 -123 7 286 151 15 147 142 74 -23 69 68 -253 181 117 12 335 37 13 137 -148 105 -44 -4 -46 -5
6932 -5 30 -173 -251 40 -123 54 216 232 -129 -11 52 123 177 -11 -122 -216 16 -151 -236 158 38 -68 47
$$ packed form
6771e3l2L9j32L05RJ09m11J61Kj11J00J02j25p0J04R8j32k13K03M4J29J68m45
6794a51k02L90r4p9j03N26l36L68k26rk01J62N6j87%L67r4k85J18n2k8L40k8k05
6818D7J21l44R3J59k3j14j18J5J77P4k89J63%p4K89l77M50k20P7j96J24N0m20
6841c36K27R4o3n0J09J16j78j17M08j40j81J07j53J33k07L26j42j00Q1L22k12
6862D4k7NJ29k61j62K49N2K3n4J08r2K14l35J59J73j93lJ32q8k78J48N6J93j34
6886E8M6k02N6k10K36J19j25J21j65K51j94q5k21L75j20J22n3K25l35O9J34k25
6908a23J30K79j35j36J32no8r7R2jl21M34o4j05L23k98k4J24k85K53j49M0m2M1
6932eL5k03p8K91j63J77J62J6l61J18O3P1N4j88j11r4K32j67q5L94j20j06J15
$$ plain form
6955 47 -11 -132 137 -7 98 26 304 18 108 8 -205 -119 132 -24 46 117 -95 143 -68 8 -6 -165 -74
6978 -74 -103 -130 -122 6 13 -114 89 213 -100 33 -186 -29 -70 86 -251 -49 -37 28 -43 292 -209 175 -75 281
7002 281 136 11 30 -175 63 -327 66 91 -81 -325 -37 -5 -48 121 3 -301 -92 13 -129 253 -35
7023 -35 -5 -14 -111 27 -22 -6 -105 208 -34 -8 3 -47 195 25 -102 -171 -53 96 21 -107 91 229 -100 192
7047 192 -65 -1 52 -129 -155 -57 -52 125 -249 308 -215 17 -76 -32 97 -89 -121 70 184 53 -59 -92 66
7070 66 21 45 -29 13 -242 -131 -34 -251 11 -55 -16 -65 67 207 -96 136 50 -52 -47 -122 -91 162 -265 -104 33
7095 33 62 272 -6 120 103 -85 303 -192 -222 -92 -230 -101 54 -72 -347 25 100 -9 -19 184 -33 -120
7117 -120 59 -68 -182 -27 117 108 -95 54 2 68 -228 -88 86 -86 -101 -132 -10 -247 -58 -9 102 148 -89
$$ packed form
6955D7n8j21K69j44J05p2K78k86R0j00k13Q6K51j56P0P1k12K38k11P6j4j59R1
6978g4k9k7QJ28Pj27K03J24l13J33k19J57m1J56l37K02J2O5p1L35n01L84k50L56
7002B81j45j25J9k05K38l90L93K5j72k44K88L2m3J69j18l04K09J05j42L82k88
7023c5L0rr7J38m9J6r9L13k42K6J1n0K42j70j27o9J18J49p5j28J98J38l29K92
7047A92k57O4N3j81k6R8NJ77l74N57n23K32r3M4J29j86l2J91J14j31j12l3J58
7070F6m5K4p4M2k55J11R7k17K62o6L9m9J32J40l03K32q6j02Np5L1K53m27J61J37
7095C3K9K10k78J26j7j88L88m95l0J30j38J29J55j26k75L72P5j09j0K03k17q7
7117a20J79j27j14J55J44rk03J49n2O6k96J40J74j72j5l1J22k37J89M9J11M6k37
$$ plain form
7140 -89 -29 -214 -40 -146 61 70 -56 226 146 -147 71 36 12 -160 -7 -77 101 39 -195 -45 9 -157 197
7163 197 -28 40 -118 -175 -39 -4 -9 -76 -60 69 76 -146 12 72 10 119 -108 -20 71 26 -98 -81 186 83 -158
7188 -158 -273 6 -57 40 -207 -14 -22 30 -27 105 -372 -43 -15 235 133 -109 108 201 167 41 -180 186 -41
7211 -41 -260 -111 22 -27 -19 3 -5 -76 153 160 39 -230 -15 83 52 79 -6 -253 -4 -38 -13 147 50 233 134 -166
7237 -166 10 -58 8 -6 254 -184 161 54 -258 -112 -88 23 -146 191 50 72 56 246 -213 25 -167 97
7259 97 -171 84 -75 -54 -26 -239 -107 250 -40 169 -21 241 -92 201 -15 162 -268 -49 86 -236 -36
7280 -36 -115 71 100 -279 312 -123 -65 201 206 283 -277 64 85 224 -60 -305 -190 2 -171 45 30 -47 18 224
7304 224 -63 -383 118 -149 -57 -283 -134 -76 -163 181 69 171 -162 20 -10 -52 185 226 237 128 -90 -69 -117
$$ packed form
7140h9O0j85J74j06K07Rj26K82q0k93K18l5k4j72J53p0J78o2k34J50N4j66L54
7163A97k25O8j58n7J36L5no7J6J29Pk22J58O0o2J09k27Q8R1m5j24J7K67j03k41
7188a58j15K79o3R7k47J93qN2n7J32m77L29K8K50j02k42K17R3l4j26k21L66k27
7211d1k19J49J33m9QK2qp1K29Pj21k69K15R8l1K7q5k47K49l4K5J60r7J83r9l00
7237a66J76o8O6j4K60m38L45j07l12J46K4J11j69L37j41K2j6J90m59K38j92K64
7259I7k68K55j59K1K8k13J32L57k90K09j90K62l33K93k16J77m30K19J35l22K00
7280c6p9J86K9l79N91m35N8K66NP7n60L41K1J39k84k45J15J92j73K16j5p7O5K06
7304B24k87l20N01k67R2k26J49N8q7L44j12J02l33J82l0m2K37M1J1j09k18K1m8
$$ plain form
7327 -117 -30 -292 -142 -213 -121 -95 222 -96 -171 -261 171 312 -93 -160 163 117 151 112 77 313 -69 -110 -82 145
7351 145 -159 -56 143 -27 -154 -372 86 -122 10 202 13 92 -68 -14 83 -175 -171 246 -140 -124 45 244
7373 244 90 51 -45 97 -40 -11 -35 116 -77 -82 162 -105 -75 -77 -45 -17 -5 -193 -58 168 16 88 293 82
7397 82 -6 207 325 133 -113 270 100 -185 -56 -139 -288 170 18 -140 -28 -227 -123 -18 272 -48 -96
7418 -96 51 -298 -137 23 -7 60 72 44 142 -312 5 101 -68 -47 -109 40 -56 139 -111 -2 -16 -164 -46 3
7442 3 -16 -34 89 144 -127 82 -146 66 -283 -98 -118 105 -101 87 107 -239 -287 -126 346 110 46 44 246 -78
7466 -78 61 272 35 -89 -58 92 -129 36 -71 118 -3 -177 81 2 127 -149 43 83 -149 99 268
7487 268 61 -86 79 237 -16 14 29 74 28 170 -14 402 23 -243 -53 -68 212 -3 -74 -43 -32 46 161
$$ packed form
7327a17Q7k62J50p1R2K6L17l18p5r0M32J41m05o7L23m6L4l9l5K36l82m1K8K27
7351A45l04J03J99j70j27k18M58k08J32J92j89P9j60N4R7k58MM17l86J6J69J99
7373B44j54l9r6J42j37K9k4J51j93nK44k67L0kL2K8J2j88J35K26j52P2K05k11
7397H2q8K13J18j92k46L83j70k85J29q3j49M58j52j58J12j99J04J05K90l20m8
7418i6J47l49J61J60l0O7J2k8R8m54L17R6j69K1o2J49r6J95k50J09j4j48J18M9
7442Cj9j8J23N5k71K09k28K12l49J85k0K23k06J88K0l46m8J61M72k36o4kK02l24
7466g8J39K11k37j24L1J50k21J65j07J89j21j74K58p9J25k76J92M0k32K48J69
7487B68k07j47J65J58k53L0J5M5m6J42j84M16l79k66J90j5K80k15p1L1J1P8J15
$$ plain form
7510 161 -17 -152 156 -86 36 -114 -178 -30 -45 82 69 -90 -228 75 28 126 -270 -151 107 -68 -17 -248
7532 -248 -29 -117 231 154 -118 10 177 121 -10 -20 110 72 410 -180 103 -178 21 -294 -10 24 78 127 158
7555 158 261 257 -185 70 -95 -144 -105 220 -251 30 248 31 -157 -65 151 20 232 -53 21 -118 -65 -324
7577 -324 161 -56 -132 118 115 63 193 187 80 -10 108 37 102 80 110 4 -95 107 183 163 -171 -25 131 267 -72
7602 -72 -109 -71 32 142 -220 204 -116 -45 126 391 -127 -227 -130 238 -69 18 -22 -93 -25 -158 115 33 -290
7625 -290 -90 90 99 37 81 21 -270 -25 93 -27 -64 -97 322 -244 180 29 -94 62 205 -15 67 -38 -5
7648 -5 0 -38 45 -58 -3 242 135 -147 -7 -23 68 27 -155 111 -88 -177 47 -149 16 250 -73 178 -74 -13
7672 -13 -16 49 -130 -86 -17 57 91 114 -27 -44 -160 84 169 246 183 -378 -91 -159 -48 44 -139 -330 21 -279 92
$$ packed form
7510A61j78j35L08k42J22j50o4J48j5J27j3j59j38L03m7R8l96J19K58j75N1k31
7532b48K19q8L48p7k72J28J67n6j31j0J30l8L38n90K83k81J99l15K84L4N4M9L1
7555A58J03mm42K55j65m9L9L25m71K81K18k17j88R2K16j31K12k85P4j39N3k59
7577c24M85k17p6K50ln2J30oj07r0J18p1O5k2L0j06r9K02P6k0l34J46J56J36l39
7602g2l7L8J03J10l62M24l20P1J71K65n18j00R7L68l07Q7m0p1O8j33K73q2l23
7625b90K00J80Ro2M4o0k91K45J18j20l7l3M19n66M24j51j23J56J43k20Q2j05L3
7648eNl8Q3j03N5K45j07k82J40j6R1m1j82K66j99q9K24j96J65K34l23K51k52O1
7672a3lO5j79M4O9P4L4K3j41j7j16K44Q5P7o3n61K87o8J11R2j83j91L51l00L71
$$ plain form
7697 92 -255 -120 -5 -7 18 222 61 78 190 146 -205 -183 107 -177 -257 132 26 17 -135 90 -89 7 -136 72
7721 72 181 91 -55 -212 213 86 0 -156 132 -19 -50 -17 120 147 74 -86 -42 -123 -86 41 119 84 345 58
7745 58 -103 160 86 -47 -20 186 219 210 259 25 -1 43 -106 -282 -147 57 240 21 24 37 -232 -141 -156 -4 -11
7770 -11 112 -171 72 141 22 -17 -137 34 31 -62 77 -40 121 160 -192 43 -212 -14 54 -37 129 69 62 -70
7794 -70 66 -180 17 142 -119 -70 32 7 122 220 125 -40 81 177 -77 -74 165 24 55 4 -229 -53 -298
7817 -298 34 217 -220 65 19 -12 -7 -68 30 -55 83 147 -133 8 -154 57 -55 -98 -218 23 3 -121 234
7840 234 -263 -100 74 -87 185 305 89 176 -244 114 102 228 42 -41 108 -43 249 58 -408 -55 153
7861 153 -227 -117 13 -24 69 12 -248 -72 -236 -109 86 -134 -97 96 28 -158 -248 359 -146 -188 71 286
$$ packed form
7697I2l47J35J15kK5K04j61J7J12m4l51K2K90k84q0L89j06rj52K25j79R6j43K08
7721G2J09r0j46j57M25j27q6j56K88j51l1L3J37K7p3j60M4q1L7J27P8l5K61k87
7745E8j61K63p4j33K7K06L3rM9k34k6M4j49j76J35K04J83k19LJ3k69R1j5J52p
7770a1J23k83K43O9j19l9j20J71lr3J39j17J61L9l52K35k55J98O8r1J66o0pj32
7794g0J36k46J97J25k61M9J02k5J15R8r5j65J21R6k54LK39j41L1n1k33J76k45
7817b98L32J83m37K85m6l1No1R8q5J38O4k80J41j62K11j12m3j20K41k0j24L55
7840B34m97J63J74j61K72J20k16Q7m20L58j2J26j86q3J49j51K92j91m66L53K08
7861A53l80J10J30l7R3n7k60J76j64J27J95k20L7J93o8j86r0O07n05m2K59K15
$$ plain form
7883 286 -4 -257 141 62 53 -29 131 -113 -72 -104 -116 59 -7 -137 -120 141 12 -126 -23 14 -81 10 -283 258
7907 258 59 52 142 -179 -400 -39 162 64 96 186 -71 45 101 106 23 180 151 14 -183 -196 3 126 35 272
7931 272 16 -96 -92 -108 254 257 252 118 -68 196 64 -132 123 -147 -5 -111 9 -11 -170 -195 104 -89 40
7954 40 368 -211 -85 -187 74 29 115 -128 73 -126 -55 -348 5 -111 75 162 -292 59 66 113 301 -16 -80
7977 -80 -97 279 -53 73 -142 202 95 164 -61 27 241 340 255 165 -52 140 80 49 103 22 106 15 101 -74 -38
8002 -38 -156 87 32 -49 -33 -180 222 -103 226 112 121 24 322 -126 -86 -67 -20 -46 -79 176 17 -160 -210 -106
8026 -106 -85 80 180 174 27 -139 -70 113 68 -59 226 -69 83 -176 63 5 -46 145 -69 -216 104 -86
8048 -86 257 -125 267 293 -10 -27 -134 -18 19 -90 -3 -34 -81 12 -46 18 161 -59 226 150 -169 219 29 0
$$ packed form
7883B86k90k53L98p9rq2J60k44M1l2j2J75o6j30J7K61j29j38J03L7r5R1k93N41
7907B58j99pR0l21k21L61K01r8L2R0k57J16N6Nq3J57k9j37j97j3J99J23r1K37
7931B72k56j12Mj6L62Lnj34j86K64j32j96K55k70J42j06J20k0j59k5K99j93J29
7954D0L28n79J26j02K61m5Q6k43K01j99P1k93L53j16J86Q7m54L51PM7J88l17o4
7977h0j7L76l32J26k15L44j07O9k25Q8K14R9q5r0k17J92o0l1N4q1Q4r1Q6j75L6
8002c8j18K43n5q1J6j47M02l25L29j14Rr7K98m48M0J9M7k6l3K55j59j77n0J04
8026a06K1J65J00oj47j66O9J83m5j27K85k95J52k59K39n8n1J91k14j47L20j90
8048h6L43l82L92K6l03j7j07J16L7j09Q7l1m7R3n8O4J43k20K85p6l19L88j90k9
$$ plain form
8072 0 -146 -37 -246 -136 -72 -25 -216 -50 66 166 54 -184 -25 265 -48 -75 220 -179 -280 -102 -49 -81
8094 -81 168 -210 -147 -228 -21 222 5 325 -18 0 3 -45 -148 -109 162 73 -283 248 -119 140 144 -139 -64 55
8118 55 -87 173 171 -94 -173 15 123 -10 96 268 -173 -395 -27 116 -35 83 72 134 -203 -260 -77 167
8140 167 34 -38 126 -278 -345 -81 -168 114 61 238 -32 -197 97 54 277 205 27 139 -73 -3 -81 9 -66
8163 -66 310 66 109 -252 128 -212 58 -116 73 -36 25 80 -101 65 91 -136 203 92 -174 -277 160 77
8185 77 -189 146 19 132 183 -28
$$ packed form
8072@j46J09k09J10O4M7j91J66J16J00j12k38J59K90l13k7K95l99j01J78N3l2
8094h1K49l78O3q1K07K43k17L20l43J8Lm8j03L9K71q9l56N31l67K59Mk83P5J19
8118E5j42K60kk65p9J88J08j33J06J72m41k22L68J43j51J18j1O2l37n7J83K44
8140A67j33p2J64m04o7K64q7K82n3J77k70j65K94m3K23p2j78J12k12P0p8R0p5
8163f6L76k44M3l61L80l40K70j74J89j09O1N5j81J66K6k27L39j11k66j03M37q3
8185G7k66L35j27J13N1k11
8191b8
$$ Imaginary data points
##PAGE= N=2
##DATA TABLE= (X++(I..I)), XYDATA
$$ plain form
0 0 0 0 0 0 0 0 0 0 0 0 0 0 0 0 6 -8 8 -8 8 -16 16 -16 24 -24 30 -32 40 -46 51 -58 68 -76 86 -98 110 -124
36 -124 140 -156 173 -194 215 -238 264 -292 323 -355 394 -433 479 -528 580 -638 705 -779 859
55 859 -954 1059 -1184 1330 -1503 1713 -1975 2309 -2758 3386 -4334 5924 -9073 17675 -90112
70 -90112 -264722 -2248 182473 86124 -75121 -89583 -3947 116167 123465 -9898 -99812
81 -99812 3209 138098 111023 -52534 -121700 17830 160769 55000 -130400 -101256 52035
92 52035 73813 -12560 -80048 -94649 -30978 76697 48557 -109890 -132066 37392 122214 8959
104 8959 -103983 -61314 56665 97044 25930 -48707 -32973 38192 77405 48231 -26071 -55904
116 -55904 25682 98140 16515 -88279 -32320 70564 41475 -45759 -57482 -16583 18785 32196
$$ packed form
0@%%%%%%%%%%%%%%Oj4J6j6J6k4L2l2M0m8N4o2P2q6R7j09J26j44J62j84K08k34
36a24K64k96L29l67M09m53N02n56O15o78P49q27R12j007J108j218J343j484J638
55H59j813K013k243K514k833L216l688M284n067O144p720J0258j4997K6748j07787
70i0112j74610K62474J84721r6349j61245j4462Q5636J20114P298j33363q9914
81i9812J03021J34889k7075j63557o9166J39530J42939j05769j85400K9144J53291
92E2035K1778q6373o7488j4601O3671J07675k8140j58447k2176J69458Q4822j13255
104H959j12942M2669J17979M0379p1114p4637J5734P1165L9213k9174p4302k9833
116e5904Q1586P2458q1625j04794N5959J02884k9089q7234j1723M0899L5368J3411
$$ plain form
128 32196 -5828 -67350 -54034 32185 64490 -9756 -79813 -36716 55906 56143 -25990 -53422
140 -53422 370 39349 27066 4104 -19188 -25769 18785 57367 8519 -53116 -14994 56001
152 56001 35724 -33131 -33857 18773 34343 3683 -22199 -22150 -4436 19566 24430 -12995 -52292
165 -52292 -20895 45960 33183 -42810 -53972 10062 37257 508 -22998 -12888 -1361 12164
177 12164 23109 3050 -25843 -7859 36158 30322 -20153 -25683 23584 38049 -4928 -25454
189 -25454 997 18482 6783 -3127 -10466 -20906 -5662 25131 11282 -36025 -36845 14659 33949
202 33949 -7462 -35056 -10006 16534 10481 -386 -1064 -5798 -3548 17141 20473 -9985 -18429
215 -18429 16654 28839 -6270 -23182 4787 22158 1252 -16096 -7952 1020 1662 3832 -673
$$ packed form
128C2196l8024o1522J3316Q6219L2305p4246p0057M3097R2622K37q2133k7432
140e3422N3792L8979j2283k2962k3292o581M4554L8582m8848o1635L8122P0995
152E6001k0277o8855p26N2630J5570l0660k5882M9J7714K4002M864l7425l9297
165e2292L1397O6855j2777p5993j1162O4034K7195l6749k3506J0110J1527J3525
177A2164J0945k0059k8893J7984M4017n836n0475n530M9267J4465m2977k0526
189b5454K6451J7485j1699r910p339j0440J5244L0793j3849m7307q20N1504J9290
202C3949m1411k7594K5050K6540o053j0867o78m734K250K0689L332l0458q444
215a8429L5083J2185l5109j6912K7969J7371k0906j7348Q144Q972O42K170m505
$$ plain form
228 -673 -16107 -16584 11173 23810 -8197 -31331 -2353 26556 9442 -13634 -5568 5762 2672
241 2672 6500 10733 -3752 -12331 4965 15619 -2666 -17122 -367 15526 -297 -18700 -5863
254 -5863 12283 4757 -8546 -5579 -964 -3564 4509 12548 -3951 -18247 2241 23321 7420
267 7420 -15437 -6403 11410 8123 -1997 -1763 -1258 -4356 -242 7280 1551 -11566 -6190 9007
281 9007 2825 -13015 -5484 10420 3196 -11771 -5046 8175 4719 -212 3142 -323 -5998 3404
295 3404 13972 3917 -12380 -6858 10589 10194 -4919 -7875 1149 1875 -3049 -315 1567 -6341
309 -6341 -7144 4325 4596 -6549 -5464 6735 5447 -6015 -2965 8151 6195 -3321 -3036 2798 3092
324 3092 1863 3477 1361 -6296 -5040 6971 6983 -7164 -11481 532 5727 -1468 -3829 26 -1798
$$ packed form
228f73j5434m77K7757J2637l2007k3134K8978K8909j7114k3076Q066J1330l090
241B672L828M233j4485q579J7296J0654j8285j4456J6755J5893j5823j8403J2837
254e863J8146p526j3303K967M615k600Q073Q039j6499j4296K0488K1080j5901
267G420k2857R034J7813l287j0120K34N05l098M114P522n729j3117N376J5197
281I007o182j5840P531J5904p224j4967O725J3221l456m931L354l465n675R402
295C404J0568j0055j6297N522J7447l95j5113k956R024P26m924K734J882p908
309f341q03J1469K71j1145J085J2199j288j1462L050J1116j956r516K85N834K94
324C092j229J614k116p657J256J2011J2j4147m317J2013N195p195k361L855j824
$$ plain form
339 -1798 -3743 2350 5008 -1657 -4036 2991 5849 -644 -2440 4734 5761 -2107 -4213 2855 4957
354 4957 -538 -3337 -312 -1626 -2570 1968 2216 -5886 -8343 1022 6336 -562 -6158 -1342 3105 1337
370 1337 1493 2785 657 -2000 1252 5433 2039 -2171 982 3248 -812 -3381 959 3208 -2349
385 -2349 -5923 -1775 960 -1106 -1256 -703 -2397 -3357 1441 5122 -58 -4671 228 5574 3777 73
401 73 761 2091 774 981 3130 1084 -2513 -2241 643 141 -2615 -2145 -230 -2369 -4815 -1727 1590
418 1590 -775 -3172 -1819 653 779 1653 2871 268 -1564 1921 5052 3449 -422 -631 2058 2718
434 2718 1112 468 -334 -2032 -2159 -322 192 -2358 -3543 -1144 -551 -2486 -1468 889 -644 -2699
450 -2699 -1101 1973 1762 838 665 481 1149 2455 2901 1414 -565 -1049 1121 2751 447 -1569 -942
$$ packed form
339a798j945O093K658o665k379P027K858o493j796P174J027p868k106P068K102
354D957n495k799L025j314r44M538K48q102k457R365N314o898n596M816M447j768
370A337J56J292k128k657L252M181l394m210L153K266m060k569M340K249n557
385b349l574M148K735k066j50N53j694r60M798L681n180m613M899N346j797l704
401G3O88J330j317K07K149k046l597K72K884n02k756M70J915k139k446L088L317
418A590k365k397J353K472J26Q74J218k603j832L485L131j603l871k09K689O60
434B718j606o44q02j698j27J837N14k550j185K399N93j935J018K357j533k055
450b699J598L074k11r24j73j84O68J306M46j487j979m84K170J630k304k016O27
$$ plain form
467 -942 -291 -490 -308 -377 -2106 -2676 -409 650 -650 -229 219 -78 -393 837 1742 962 -256 -908 -438
486 -438 1093 968 -197 -758 -1065 -686 848 1079 -1045 -2173 -954 757 1111 246 -112 -414 464 1815
504 1815 1628 919 526 214 1049 1220 1210 509 -249 -570 -729 -723 -252 -739 -2563 -2109 -1255 -886 -619 -1326 -1722
525 -1722 -1198 -40 1500 1227 579 418 1367 2398 2743 1848 1573 1515 1227 1427 1621 694 24 -791 -967
544 -967 -983 -1123 -1587 -2552 -2781 -2363 -1733 -1278 -1207 -1756 -1434 -195 598 1103 620 714 1465 2333 2835 2235 1621
565 1621 1118 1854 1704 1576 455 -183 -765 -1183 -683 -865 -1792 -2099 -2315 -1927 -1594 -1343 -1083 -1026 -1210 -431
585 -431 161 981 1033 810 721 1417 1633 1376 1320 794 882 941 718 183 -5 -471 -410 -678 -915 -766 -1622 -1326
607 -1326 -385 -661 -701 -610 -235 -529 37 760 582 738 575 269 699 1319 806 255 -97 -176 -458 -29 -391
$$ packed form
467i42O51j99J82o9j729n70K267J059j300M21M48k97l15J230R05p80j218o52M70
486d38J531j25j165n61l07L79J534K31k124j128J219J711L54q65l58l02Q78J351
504A815j87p09l93l12Q35J71j0p01p58l21j59OM71m87j824M54Q54L69K67p07l96
525a722N24J158J540k73o48j61R49J031L45q95k75n8k88K00J94r27o70q15j76
544i67j6j40m64r65k29M18O30M55P1n49L22J239P93N05m83R4P51Q68N02o00o14
565A621n03P36j50j28j121o38n82m18N00j82r27l07k16L88L33K51K60N7j84P79
585d31N92Q20N2k23q9O96K16k57n6n26Q8N9k23n35j88m66O1k68k37J49q56K96
607a326R41k76m0R1L75k94N66P23j78J56j63l06M30O20n13n51l52p9k82M29l62
$$ plain form
628 -391 -616 -688 -781 -683 -715 -106 -558 -390 187 618 99 274 818 760 730 1026 832 564 118 588 41 265
650 265 -263 -814 -720 -806 -1138 -1031 -552 -1110 -1195 -850 28 -569 -255 781 102 -320 1015 1451 858 702 1183
671 1183 1229 892 453 896 662 161 -375 -564 -232 -1012 -1290 -745 -820 -1941 -1253 -445 -740 -1057 -413 503
691 503 -9 8 1085 1328 709 691 1283 1321 915 626 1277 914 108 6 616 -161 -1125 -1212 -153 -974 -1903
712 -1903 -894 -491 -1292 -902 105 194 -747 -242 1014 1036 222 789 1389 741 155 1003 1715 570 -332
731 -332 -111 511 -813 -731 81 -239 -1616 -1561 -119 -492 -1539 -817 100 -191 -299 453 1035 310 -254 1128
751 1128 1579 614 238 907 1163 -42 -80 620 125 -1546 -708 267 -582 -1696 -909 -209 -1135 -1240 261
770 261 410 -1000 -621 835 986 385 538 1544 1211 -41 1078 1830 875 -596 -48 944 -610 -1205
$$ packed form
628c91k25p2r3R8l2O09m52J68N77M31n19J75N44n8l0K96j94k68m46M70n47K24
650B65n28n51R4q6l32J07M79n58q5L45Q78n97L14J036o79m22J335M36n93j56M81
671A183M6l37m39M43k34n01n36j89L32p80k78N45p5j121O88Q08k95l17O44R16
691E03n12J7J077K43o19j8N92L8m06k89O51l63q06j02O10p77r64q7J059q21r29
712a903J009M03q01L90J007Q9r41N05J256K2q14N67O00o48n86Q48P12j145r02
731c32K21O22j324Q2Q12l20j377N5J442l73j047P22R17k91j08P52N82p25n64J382
751A128M51r65l76O69K56j205l8P00m95j671Q38R75q49j114P87P00r26j05J501
770B61J49j410L79J456J51o01J53J006l33j252J119P52r55j471N48R92j554n95
$$ plain form
788 -1205 -112 -287 -1604 -1549 -199 -627 -1757 -930 310 74 -333 334 1209 548 -20 1162 1792 879
806 879 -87 1156 1241 90 27 660 568 -1127 -766 479 -219 -1735 -1273 -338 -807 -1240 -442 503 -887
825 -887 -1138 504 916 270 173 1182 1042 673 450 1439 754 -515 340 953 306 -854 -618 -66 -737
844 -737 -1128 -53 -130 -1536 -1258 139 -102 -497 -190 -56 291 -63 955 1604 512 5 299 1288 665
863 665 -99 430 425 -711 -599 92 98 -1298 -1504 -147 -473 -859 -571 5 -777 -553 415 631 273 -95 860
884 860 1196 958 747 804 769 -269 297 940 550 -789 -836 -409 -413 -957 -578 -767 -1422 -1151 31 120 -697
905 -697 -532 46 187 483 504 1149 567 117 785 1391 1149 446 515 555 -16 -260 490 -134 -1229 -1276 -451
926 -451 -635 -1058 -1084 -681 -754 -476 -92 83 -54 -195 236 882 1045 650 766 835 559 596 1225 811 -142 -381
$$ packed form
788a205J093j75j317N5J350m28j130Q27J240k36m07O67Q75o61n68J182O30r13
806H79r66J243Q5j151o3O33r2j695L61J245o98j516M62R35m69m33P98R45j390
825h87k51J642M12o46r7J009j40l69k23R89o85j269Q55O13o47j160K36N52o71
844g37l91J075p7j406K78J397k41l95L07J34L47l54J018O49j092n07K94R89o23
863F65p64N29nj136J12O91Oj396k06J357l26l86K88N76p82K24R68K16l58l68R55
884H60L36k38k11N7l5j038N66O43l90j339m7M27mn44L79j89o55K71J182Q9q17
905f97J65N78J41K96K1O45n82m50O68O06k42p03O9M0n71k44P50o24j095m7Q25
926d51j84m23k6M03p3K78L84J75j37j41M31O46J63l95J16O9k76L7O29m14r53k39
$$ plain form
948 -381 27 -61 -560 -405 -694 -1079 -814 -493 -271 -672 -914 -491 236 -53 439 126 275 196 694 1154 813
969 813 111 196 449 455 421 72 -234 -525 -649 -252 -25 -788 -614 -705 -370 182 -125 -306 -200 -99 314 903
991 903 601 420 123 260 618 790 773 48 -636 37 42 -146 -158 -396 -1091 -685 -486 -131 -454 -1019 -237 -285
1013 -285 391 420 131 95 349 355 892 1133 614 185 212 744 773 361 -52 -693 -560 -124 -179 -607 -1032 -916
1035 -916 -857 -554 -186 -320 -558 -590 -88 407 769 886 352 557 642 1018 997 555 60 331 419 746 -12 -594
1057 -594 -646 -874 -451 -267 -505 -842 -1013 -779 -359 30 91 -86 103 230 730 814 936 415 350 1030 531
1078 531 557 439 1 -319 -205 67 181 -421 -846 -592 -257 -354 -351 -924 -623 -212 -171 259 279 -216 44 763
1100 763 1007 937 486 438 181 198 610 561 279 -461 -468 -60 -252 -193 -782 -391 -584 -478 -29 -64 -467 -687 60
$$ packed form
948c81M08q8m99J55k89l85K65L21K22m01k42M23P27k89M92l13J49p9M98M60l41
969H13p02Q5K53Ol4l49l06k91j24L97K27p63J74r1L35N52l07j81J06J01M13N89
991I03l02j81k97J37L58J72j7p25o84O73Nj88j2k38o95M06J99L55l23n65P82m8
1013b85O76K9k89l6K54ON37K41n19m29K7N32K9m12m13o41J33M36n5m28m25J16
1035i16N9L03L68j34k38l2N02M95L62J17n34K05Q5L76k1m42m95K71Q8L27p58n82
1057e94n2k28M23J84k38l37j71K34M20L89O1j77J89J27N00Q4J22n21o5O80m99
1078E31K6j18m38l20J14K72J14o02m25K54L35r7Ln73L01M11M1M30K0m95K60P19
1100G63K44p0m51m8k57J7M12m9k82p40pM08j92N9n89L91j93J06M49l5m03k20P47
$$ plain form
1123 60 283 386 540 604 221 198 846 947 486 27 -41 482 275 -104 -284 -16 -1144 -773 36 -29 -977
1144 -977 -752 -414 -457 -225 83 226 98 -336 663 1282 719 212 178 776 352 145 453 342 -996 -530
1164 -530 625 49 -938 -959 -176 -749 -649 -44 227 -719 -761 299 506 -65 -69 548 756 114 667 1520 782
1185 782 -384 116 1105 369 -654 -81 -12 -883 -962 73 77 -1472 -1524 66 155 -811 -405 719 -109 -644
1205 -644 474 1348 116 -488 466 1207 502 -14 749 580 -545 -542 740 134 -1211 -973 273 -289 -1244
1224 -1244 -648 472 -864 -1391 140 1069 -127 -824 483 969 -68 -151 1475 1049 -702 -2 1340
1241 1340 636 -1280 -351 1068 -183 -1248 230 680 -1316 -1564 371 751 -1155 -1264 677 451 -914
1258 -914 98 1525 737 -902 404 1915 479 -853 782 1378 -786 -934 1181 1047 -1499 -1467 691
$$ packed form
1123F0K23J03J54O4l83k3O48J01m61m59o8N23k07l79j80K68j128L71Q09o5r48
1144i77K25L38m3K32L08J43j28m34R99O19n63n07l4N98m24k07L08j11j338M66
1164e30J155n76r87k1P83n73J00O05K71r46m2J060K07n71mO17K08o42N53Q53p38
1185G82j166N00R89p36j023N73O9q71p9J035Mj549n2J590Q9r66M06J124q28n35
1205f44J118Q74j232o04R54P41p05n16P63j69j125LJ282o06j345K38J246n62r55
1224a244N96J120j336n27J531R29j196o97J307M86j037q3J626m26j751P00J342
1241A340p04j916R29J419j251j065J478M50j996k48J935L80j906j09J941k26j365
1258i14J012J427p88j639J306J511j436j332J635N96k164j48K115j34k546L2K158
$$ plain form
1275 691 468 -1782 -944 827 -659 -1792 208 1477 -508 -1349 602 1647 -372 -567 1405 1397 -813
1292 -813 -373 1957 1184 -1509 -159 1500 292 -1843 -68 1312 -1262 -2145 501 1106 -1440 -1704
1308 -1704 1156 728 -1358 -483 1617 716 -1685 95 2438 780 -1437 616 2006 -166 -1223 973
1324 973 1305 -1747 -1536 1447 919 -2254 -1425 1126 -82 -2471 -260 1702 -531 -2103 456 2358
1340 2358 -395 -1751 1526 1738 -950 -534 2101 1391 -1538 -869 1926 726 -2107 -346 1636 -690
1356 -690 -2461 389 1831 -1428 -2443 856 1311 -1486 -1159 1753 875 -1767 -287 2766 666 -2144
1372 -2144 201 2550 163 -1909 1061 2039 -1028 -2029 1449 1593 -2124 -1953 1477 830 -2381 -671
1388 -671 2175 -27 -2704 199 2411 -284 -1955 991 2395 -504 -1133 2068 1810 -1662 -1024 2523
$$ packed form
1275F91k23k250Q38J771j486j133K000J269j985q41J951J045k019j95J972qk210
1292h13M40K330p73k693J350J659j208k135J775J380k574q83K646O05k546k64
1308a704K860m28k086Q75K100r01k401J780K343j658k217K053J390k172j057K196
1324I73L32l052K11K983n28l173Q29K551j208k389K211J962k233j572K559J902
1340B358k753j356L277K12k688M16K635p10k929O69K795j200k833J761J982k326
1356f90j771K850J442l259j015L299M55k797L27K912q78k642J480L053k100k810
1372b144K345K349k387k072K970R78l067j001L478J44l717J71L430o47l211J710
1388f71K846k202k677K903K212k695j671K946J404k899o29L201k58l472O38L547
$$ plain form
1404 2523 1443 -2376 -949 1829 -75 -2972 -35 2099 -1590 -2945 584 2027 -1775 -2156 1674
1419 1674 1693 -1841 -900 2683 1161 -2018 -96 2881 841 -2272 350 2613 -329 -2307 1116 1892
1435 1892 -2041 -2618 1403 1324 -2742 -1647 1888 401 -2485 -288 2623 -45 -2681 514 2948 -531
1451 -531 -2117 1606 2399 -1136 -1545 2401 1816 -2243 -1547 2209 890 -2792 -593 2414 -749 -3160
1467 -3160 338 2351 -1219 -2601 1085 2082 -1244 -1619 2240 1853 -2097 -757 2851 1247 -2106 -224
1483 -224 2705 -31 -2667 474 2307 -1470 -2853 1363 1901 -2134 -2280 1644 1050 -2516 -966 2797
1499 2797 609 -2466 148 3044 178 -2197 1215 2690 -875 -1964 2215 1902 -1650 -1597 2297 1426
1515 1426 -2876 -1360 2218 -137 -2911 -462 2294 -586 -2936 910 2441 -887 -2202 1669 1886
$$ packed form
1404B523j080l819J427K778j904k897K937K134l689j355L529J443l802l81L830
1419A674J9l534R41L583j522l179J922K977k040l113K622K263k942j978L423P76
1435A892l933n77M021p9m066J095L535j487k886K197K911k668k636L195K434l479
1451e31j586L723P93l535m09L946n85m059O96L756j319l682K199L007l163k411
1467c160L498K013l570j382L686R97l326l75L859l87l950J340L608j604l353J882
1483b24K929k736k636L141J833l777j383M216N38m035j46L924n94l566J550L763
1499B797k188l075K614K896k866k375L412J475l565j089M179l13l552N3L894q71
1515A426m302J516L578k355k774K449K756k880k350L846J531l328j315L871K17
$$ plain form
1530 1886 -1567 -1318 2587 1592 -2093 -420 2835 369 -2443 377 2318 -858 -2687 804 1960
1545 1960 -1927 -2275 1233 1657 -2392 -1582 1959 792 -2538 -664 2925 362 -2446 656 2708 -93
1561 -93 -1911 1463 2437 -1298 -1624 1975 1773 -2176 -1401 1875 526 -2548 -759 1789 -451 -2611
1577 -2611 429 2130 -684 -2287 1041 2045 -966 -1354 1976 1640 -1562 -779 2403 1116 -2392 -474
1593 -474 2313 -190 -2390 366 1984 -1103 -2424 997 1353 -2001 -1887 1655 1114 -2035 -552 2187
1609 2187 952 -1888 11 2580 117 -1857 642 2399 -815 -1598 1160 1620 -1479 -1682 1265 902
1625 902 -2008 -1306 1473 232 -2400 -529 1814 -405 -1943 348 2084 -624 -1228 1465 1859 -895
1641 -895 -934 1903 1016 -1294 -469 2063 378 -2124 31 1507 -518 -1929 258 1268 -1119 -1853
$$ packed form
1530A886l453K49L905r95l685J673L255k466k812K820J941l176j829L491J156
1545A960l887l48L508M24m049Q10L541j167l330J874L589k563k808L102K052k801
1561i3j818L374R74l735l26L599k02l949P75L276j349l074J789K548k240k160
1577b611L040J701k814j603L328J004l011l88L330l36l202P83L182j287l508J918
1593d74K787k503k200K756J618l087j321L421L56l354J14L542n41l149J483K739
1609B187j235k840J899K569k463j974K499J757l214p83K758M60l099k03K947l63
1625I02k910P02K779j241k632J871K343k219j538K291J736k708o04K693L94k754
1641h95l9K837q87k310Q25K532j685k502K155J476k025j411K187J010k387p34
$$ plain form
1657 -1853 844 1185 -1211 -1031 1710 895 -1626 -140 2190 662 -1374 194 1851 -98 -1254 1024
1673 1024 1563 -1037 -1337 903 1178 -1506 -1122 1105 383 -1632 -625 1366 316 -1586 75 1624
1689 1624 -122 -1371 894 1565 -404 -558 1662 1167 -901 -619 1393 479 -1367 -323 1139 -165
1705 -165 -1453 78 831 -984 -1378 355 1046 -709 -1006 1014 929 -820 -319 1477 880 -1045 -89
1722 -89 1320 531 -822 451 1375 -374 -832 786 617 -1104 -1162 695 269 -1465 -629 822 280 -1046
1740 -1046 -190 1200 -122 -911 343 1053 -254 -621 800 1103 -333 -333 914 766 -798 -509 820
1757 820 -259 -984 -172 743 -562 -1005 -51 560 -888 -695 421 473 -700 -350 960 385 -658 -163
1775 -163 1083 520 -482 166 996 100 -736 376 626 -427 -850 259 426 -653 -459 165 302 -849
$$ packed form
1657a853K697L41k396J80K741q15k521J486K330j528k036J568J657j949j156K278
1673A024N39k600l00K240K75k684L84K227p22k015J007J991j050j902J661J549
1689A624j746j249K265O71j969j54K220m95k068K82K012r14j846J044J462j304
1705a65j288J531P53j815l94J733O91j755k97K020q5j749N01J796n97j925R56
1722h9J409p89j353J273R24j749m58J618j69j721n8J857m26j734Q36J451n42j326
1740a046Q56J390j322p89J254P10j307l67J421L03j436%J247j48j564K89J329
1757H20j079p25Q12R15j305m43R54O11j448J93J116N2j173L50J310n75j043M95
1775a63J246n63j002O48Q30q96q36J112K50j053m23J109J67j079J94O24J37j151
$$ plain form
1793 -849 -610 989 181 -644 133 1014 332 -218 855 860 340 -351 758 549 -500 -481 678 139 -615
1812 -615 -414 316 -278 -946 -134 352 -142 -553 -62 471 -372 -452 645 311 -133 -36 591 405 -256 -5
1832 -5 383 55 -162 277 281 -303 -528 37 239 -411 -528 300 24 -374 -392 466 199 -595 -149 477 -62 -234
1854 -234 259 555 402 -11 331 202 -24 -192 45 234 -344 -537 70 204 -344 -307 93 -281 -537 4
1874 4 294 -87 -193 356 424 104 216 630 469 92 19 135 242 214 48 251 -123 -331 -49 97 -299 -446
1896 -446 -158 -183 -413 -257 103 -139 -112 -159 202 53 -67 216 342 257 277 300 465 160 24 70 199 -148
1918 -148 -109 2 -128 -364 -161 -125 -279 -256 8 85 -123 15 -49 201 254 22 -40 396 -53 313 276 262 52
1941 52 53 -14 -92 -95 -305 -53 23 -196 -252 -302 98 -199 -154 -181 -93 -294 84 97 177 129 247 395 317 55 141 326
$$ packed form
1793h49K39J599q08q25P77Q81o82n50J073Nn20o91J109k09j049J9J159n39p54
1812f15K01P30n94o68Q12M86m94m11M91N33q43q0J097l34m44R7O27j86o61K51
1832eL88l28k17M39Mn84k25N65K02o50j17Q28k76l98j8Q58k67p94M46O26n39j72
1854b34M93K96j53m13L42j29k26j68K37J89n78j93O07J34n48L7M00l74k56N41
1874DK90l81j06N49O8l20J12M14j61l77p3J16J07k8j66K03l74k08K82J46l96j47
1896d46K88k5k30J56L60k42K7m7L61j49j20K83J26q5K0K3J65l05j36M6J29l47
1918a48L9J11j30k36K03L6j54K3K64P7k08J38o4K50N3k32o2M36m49L66l7j4k10
1941E2Jo7p8lk10K52P6k19n6n0M00k97M5k7Q8k01L78J3Q0m8J18J48p8k62Q6J85
$$ plain form
1967 326 242 -101 68 18 -52 71 72 -137 -468 -221 -190 26 -140 -57 -276 -103 156 -229 347 301 100 359 282
1990 282 159 108 162 -63 388 21 -98 314 46 12 -161 -239 -230 -306 -393 135 -104 -227 -89 -160 -1 19 -67 285
2014 285 -58 321 303 169 318 401 -24 97 12 41 -56 133 -21 -161 -29 -128 -35 -253 -216 -55 -281 -129 -126
2037 -126 -97 37 -11 91 385 136 203 160 286 339 77 48 52 -70 137 148 -210 47 -239 -299 -142 -103 -159 -81
2061 -81 153 -442 -276 94 49 103 87 118 61 293 164 417 14 305 254 -232 6 -52 -99 30 -107 -116 -90 -522
2085 -522 -202 73 -257 -374 -121 -95 248 -185 145 120 110 381 342 88 114 155 -31 111 182 132 160 -239 -292
2108 -292 -14 -80 -62 -163 -207 -117 -60 -133 -168 -8 -52 76 173 366 131 -50 134 339 199 215 346 -39 183
2131 183 -74 242 -35 -188 50 -29 -114 13 -88 -44 -292 118 -92 -123 -56 69 56 15 -234 167 174 45 99
$$ packed form
1967C26q4l43J69n0p0J23Jk09l31K47L1K16j66Q3k19J73K59l85N76m6k01K59p7
1990B82j23n1N4k25M51l67j19M12k68l4j73p8Rp6q7N28k39j23J38p1J59K0q6L52
2014B85l43L79j8j34J49Q3m25J21q5K9r7J89j54j40J32r9R3k18L7J61k26J52L
2037a26K9J34m8J02K94k49O7m3J26N3k62k9Mj22K07J1l58K57k86o0J57L9n6P8
2061h1K34n95J66L70m5N4j6L1n7K32j29K53m03K91n1m86K38n8m7J29j37rK6m32
2085e22L20K75l30j17K53K6L43m33L30k5j0K71l9k54K6M1j86J42P1n0K8l99n3
2108b92K78o6J8j01m4R0N7p3l5J60m4J28R7J93k35j81J84K05j40J6J31l85K22
2131A83k57L16k77j53K38p9q5J27j01M4k48M10k10l1O7J25j3m1k49M01Pj29N4
$$ plain form
2154 99 80 147 37 -58 242 286 -146 35 -151 -245 -397 -187 -152 -287 -347 114 136 -54 105 1 439 -45 292
2177 292 227 97 306 157 53 63 0 94 22 111 -13 -92 -91 -310 -87 -441 135 -165 -27 -110 -185 -120 -160 -13
2201 -13 63 -202 227 265 156 216 222 132 51 190 264 238 -217 -145 -248 -171 -236 -105 -426 -4 -176 64 101 -136 -235
2226 -235 292 65 -38 185 330 253 -260 279 419 107 144 133 233 -6 -101 7 -44 -83 -214 -156 -238 -144 -262
2249 -262 6 -289 -318 -200 7 302 -208 -202 187 185 81 360 457 181 59 113 -32 -139 43 24 -270 -266 -203 -377
2273 -377 -135 -184 -114 -119 -157 -242 -33 31 253 61 64 238 217 143 347 380 53 109 224 106 -111 -49 -83 -109 35
2298 35 -43 62 -37 26 -150 -69 98 -10 18 -25 69 147 182 -70 66 5 240 403 160 -129 133 -186 30 -87
2322 -87 -93 -119 -252 132 46 -220 -248 -239 67 8 -98 70 -92 126 216 22 93 21 62 185 133 165 314 21 -35
$$ packed form
2154I9j9O7j10r5L00M4m32J81j86r4j52K10L5j35o0M61K2j90J59j04M38m84L37
2177B92o5j30K09j49j04J0o3R4p2Q9j24p9Jk19K23l54N76l00J38q3p5O5m0J47
2201a3P6k65M29L8j09O0Or0q1J39P4k6m55P2j03P7o5J31l21M22j72K40L7k37r9
2226b35N27k27j03K23J45p7n13N39J40l12L7j1J00k39r5J08n1l9j31N8q2R4j18
2249b62K68k95k9J18K07K95n10OL89kj04K79R7k76j22N4j45j07J82j9k94MO3j74
2273c77K42m9P0nl8q5K09O4K22j92LJ74k1p4K04L3l27N6J15j18k17O2l4k6J44
2298C5p8J05r9O3j76Q1J67j08K8m3R4P8L5k52J36o1K35J63k43k89K62l19K16j17
2322h7ok6j33L84q6k66k8RL06n9j06J68j62K18R0j94P1p2M1J23n2L2J49k93n6
$$ plain form
2347 -35 113 -253 204 -213 -233 -336 -208 -253 58 103 -115 -416 188 -30 -59 106 232 358 91 28 352 68
2369 68 106 325 2 191 93 -57 -72 -404 -263 -168 36 -141 14 -186 -31 -70 62 201 74 -55 16 186
2391 186 181 -15 4 154 47 -125 100 146 -182 43 -85 63 -154 34 -182 -76 -31 -129 -47 29 -83 -239 187
2414 187 97 -63 87 -18 52 28 175 44 -161 61 296 156 45 80 121 55 -228 29 -175 -189 -175 -147 -374
2437 -374 -24 7 45 -194 -149 -39 67 -130 -87 3 173 -165 -33 -25 -75 274 -6 78 21 -241 -42 -151 -81 -201
2461 -201 -221 120 -146 -179 -107 -113 116 38 8 262 19 65 190 -36 229 30 240 159 88 -47 200 78 -137
2484 -137 -180 -85 -249 71 -356 -217 -115 -101 85 -225 -131 -101 5 125 -37 -91 28 -78 109 94 144 82 73 128
2508 128 83 148 -312 -163 -115 -315 -236 -450 -20 -288 -275 9 98 -355 -115 170 -64 -117 18 141 109 245 51
$$ packed form
2347c5J48l66M57m17k0j03J28m5L11M5k18l01O04k18k9J65J26J26k67o3L24k84
2369F8L8K19l23J89r8j50j5l32J41R5K04j77J55k00J55l9J32J39j27j29P1J70
2391A86nj96J9J50j07j72K25M6l28K25j28J48k17J88k16J06M5r8Q2P6j12j56M26
2414A87r0j60J50j05P0k4J47j31k05K22K35j40j11L5M1o6k83K57k04j4J4K8k27
2437c74L50L1L8k39M5J10J06j97M3R0J70l38J32Qn0L49k80Q4n7k62J99j09P0j20
2461b01k0L41k66l3P2oK29p8l0K54k43M6J25k26K65j99K10q1p1j35K47j22k15
2484a37m3R5j64L20m27J39J02J4J86l10R4L0J06J20j62n4J19j06J87j5N0o2rN5
2508A28m5O5m60J49M8k00P9k14M30k68J3K84Q9m53K40K85k34n3J35J23l2J36j94
$$ plain form
2531 51 357 466 227 -126 140 52 89 26 -202 27 32 138 210 -82 -299 -310 -18 -246 291 78 -104 62 120
2554 120 96 335 63 100 -211 39 -2 243 67 61 -126 -37 107 -182 -2 -7 -114 -16 -87 4 -61 -153 -198 172 -12
2579 -12 -82 387 319 -84 23 -93 -152 209 147 -77 23 193 95 37 17 -38 -56 -193 -425 2 -22 2 -131 -60
2603 -60 -127 -229 7 47 36 49 15 222 184 203 0 51 246 90 18 87 -81 -221 -205 -219 -7 -31 44 22 77 -89
2629 -89 27 2 -87 57 272 -25 16 278 121 -33 -109 60 293 98 -35 200 -223 -197 -4 115 177 -144
2651 -144 -200 -79 -138 -13 24 -5 -285 120 226 385 -244 56 196 -3 -262 94 226 -130 -20 -23 129 -340
2673 -340 -6 3 -31 -383 -315 46 -22 27 54 185 187 -138 -151 162 121 54 101 144 52 162 482 71 -334 129 240
2698 240 -69 -221 46 24 -159 -72 -21 171 35 -78 187 196 -157 -167 161 -104 212 347 438 5 -137 -12
$$ packed form
2531E1L06J09k39l53K66q8L7o3k28K29NJ06P2k92k17j1K92k28N37k13j82J66N8
2554A20k4K39k72L7l11K50m1K45j76oj87Q9J44k89J80nj07R8p1R1o5r2m5L70j84
2579a2p0M69o8m03J07j16n9L61o2k24J00J70r8n8k0n5j8j37k32M27k4K4j33P1
2603f0o7j02K36M0j1J3l4K07l8J9k03N1J95j56p2O9j68j40J6j4K12k4P5k2N5j66
2629h9J16k5q9J44K15k97M1K62j57j54p6J69K33j95j33K35m23K6J93J19O2l21
2651a44n6J21n9J25L7k9k80M05J06J59o29L00J40j99k59L56J32l56J10lJ52m69
2673c40L34Rl4l52O8L61o8M9K7J31Kl25j3L13m1o7M7M3r2J10L20m11m05M63J11
2698B40l09j52K67k2j83Q7N1J92j36j13K65Rl53j0L28k65L16J35R1m33j42J25
$$ plain form
2720 -12 486 196 -244 279 388 71 -147 104 155 -125 -394 137 -139 -427 47 337 -142 -496 -96 536 -88
2741 -88 18 135 490 -23 -188 342 67 -173 -151 165 5 -420 -103 127 111 -361 -75 -50 -254 -272 177 -32
2763 -32 -236 -137 471 264 -113 -61 229 192 -98 93 441 7 -380 74 155 -175 -176 96 236 -84 -307 194
2785 194 187 -286 -111 182 43 -256 -194 284 -50 -418 364 734 -173 -239 304 395 -268 -178 417 170 -485 -76
2807 -76 508 -73 -370 -90 290 -49 -507 78 225 -249 -353 202 507 -213 -170 158 581 -196 -477 621
2827 621 -123 -494 105 601 -319 -199 8 -64 -254 -619 -178 -30 -477 -407 192 478 -467 -223 377 165 -128
2848 -128 114 592 -107 -394 229 304 -304 62 185 386 -294 -215 517 -151 -259 2 74 -158 -385 -47 198
2869 198 -326 -467 124 308 -252 -380 255 204 -202 107 399 65 -204 7 516 54 -437 201 465 -74
$$ packed form
2720a2M98k90m40N23J09l17k18K51N1k80k69N31k76k88M74K90m79l54M00O32o24
2741h8J06J17L55n13j65N30k75k40K2L16j60m25L17K30j6m72K86K5k04j8M49k09
2763c2k04R9O08k07l77N2K90l7k90J91L48m34l87M54Q1l30jK72J40l20k23N01
2785A94pm73J75K93j39k99O2M78l34l68P82L70r07o6N43R1o63R0N95k47o55M09
2807g6N84n81k97K80L80l39m58N85J47m74j04N55L05p20M3L28M23p77k81J098
2827F21p44l71N99M96r20J20K07p2j90l65M41J48m47P0N99K86r45K44O00k12k93
2848a28K42M78o99k87O23P5o08L66J23K01o80P9P32o68j08K61P2k32k27L38K45
2869A98n24j41N91J84n60j28O35n1m06L09K92l34k69K11N09m62m91O38K64n39
$$ plain form
2889 -74 -425 250 259 -346 -236 150 102 -383 -511 250 -84 -489 95 488 78 -359 528 236 7 -296 548
2910 548 374 -263 -426 164 341 -369 -203 482 -334 -513 -97 618 -126 -616 -29 725 -388 -306 340 426
2930 426 -271 -392 285 330 -287 190 363 64 -323 -25 356 -189 -600 73 288 -339 -410 25 283 -551 -276
2951 -276 377 -13 -431 -56 450 357 -413 314 467 -22 -442 321 363 -222 -404 32 118 -343 -321 414 -31
2972 -31 -757 -213 462 -295 -392 210 416 -108 -401 59 577 -319 -297 379 189 -395 -142 433 171 -320 -66
2993 -66 356 243 -323 6 503 -322 -659 133 296 -261 -422 345 223 -309 -348 584 -75 -174 131 568 -47
3014 -47 -440 118 309 133 -225 333 537 -331 -503 512 200 -353 -5 231 141 -500 -67 547 -98 -716
3034 -716 91 458 64 -617 244 405 -218 -195 440 100 -232 -253 327 -176 -443 -42 419 -89 -494 31 335
$$ packed form
2889g4l51O75Ro05J10L86m8m85j28P61l34m05N84L93m10m37Q87k92k29l03Q44
2910E48j74o37j63N90J77p10J66O85q16j79M16P15p44m90N87P54j113Q2O46Q6
2930D26o97j21O77M5o17M77J73k99l87K98L81n45m11O73K15o27p1M35K58q34K75
2951b76O53l90m18L75N06r3p70P27J53m89m20P63M2n85j82M36Q6m61K2P35m45
2972c1p26N44O75p57r7O02K06n24k93M60N18q96K2O76j90n84K53N75k62m91K54
2993f6M22j13n66L29M97q25l37P92J63n57j61P67j22n32l9R32o59r9L05M37o15
3014d7l93N58J91j76l58N58K04q68j72J015l12n53L48K36r0o41M33O14o45o18
3034g16Q07L67l94o81Q61J61o23K3O35l40l32k1N80n03k67M01M61n08m05N25L04
$$ plain form
3055 335 28 -320 60 153 -372 -473 183 293 -412 181 452 205 -302 -37 340 133 -322 301 183 -108
3075 -108 -673 350 643 -265 -286 197 235 -195 -46 64 2 -199 146 376 -30 -99 89 426 -159 -384 633
3096 633 91 -220 -252 324 182 -138 -151 268 -34 -366 -220 437 -88 -395 245 210 -234 -295 100 360 -298
3117 -298 -171 582 -14 -274 55 161 132 -262 99 485 219 -394 230 310 -299 -203 363 -16 -601 -462 29
3138 29 77 -257 -322 65 -195 -399 134 250 23 -315 116 215 -143 -134 80 366 -390 -154 356 206 -388 0
3160 0 409 -58 -146 195 66 104 -327 72 214 -156 -64 159 460 -3 -62 282 126 -224 13 24 182 -283
3182 -283 10 273 -72 111 -62 297 -114 -213 -41 39 -128 -157 -15 84 -340 -384 469 194 -106 -77 211 -233
3204 -233 -131 40 127 -59 81 207 24 -329 -105 294 359 -358 -36 235 -228 -193 14 -71 411 -203 179
$$ packed form
3055C35l07l48L80R3n25j01O56J10p05N93K71k47n07K65L77k07m55O23j18k91
3075a08n65J023K93r08k1M83L8m30J49J10o2k01L45K30m06o9J88L37n85k25J017
3096F33n42l11l2N76j42l20j3M19l02l32J46O57n25l07O40l5m44o1L95K60o58
3117b98J27P53n96k60L29J06k9l94L61L86k66o13O24Q0o09R6N66l79n85J39M91
3138B9M8l34o5L87k60k04N33J16k27l38M31R9l58RK14K86p56K36N10j50n94L88
3160@M09m67q8L41j29L8m31L99J42l70R2K23L01m63n9L44j56l50K37J1J58m65
3182b83K93K63l45J83j73L59m11r9J72Q0j67k9J42R9m24m4Q53k75l00K9K88m44
3204b33J02J71Q7j86J40J26j83l53K24L99O5p17L22K71m63L5K07q5M82o14L82
$$ plain form
3225 179 219 -85 -163 248 186 4 69 234 27 -527 -95 -300 -47 -211 117 287 -244 -149 -74 83 -377 -260
3247 -260 29 81 -209 170 46 228 -143 90 178 215 38 305 325 29 -165 138 -118 180 -213 60 -131
3268 -131 -65 -63 267 -43 -545 -73 174 100 -76 160 305 -74 123 173 148 215 -103 -45 -40 16 1 86 108 -165 -190
3293 -190 74 -103 -238 117 -179 92 6 85 10 -173 -28 141 152 -17 37 125 134 153 27 90 -85 -212 231
3316 231 -26 -151 -177 -71 155 -376 -70 77 43 -142 -304 99 -84 -12 -128 179 -97 168 -111 182 -16
3337 -16 -155 -42 57 84 -6 256 -179 -43 -152 9 -216 -255 44 42 -154 -14 -32 -45 6 80 220 -20 99 -67
3361 -67 175 8 -98 -30 33 38 362 -51 206 250 -91 28 -215 -264 7 29 -139 6 -179 -156 -292 -269 -5
3384 -5 200 95 133 149 8 137 -53 -143 21 -209 12 -32 162 216 94 -220 -56 14 -196 68 -184 -209 35
$$ packed form
3225A79M0l04p8M11o2j82O5J65k07n54M32k05K53j64L28J70n31R5P5J57m60J17
3247b60K89N2k90L79j24J82l71K33Q8L7j77K67K0k96j94L03k56K98l93K73j91
3268a31O6KL30l10n02M72K47p4j76K36J45l79J97N0k5O7l18N8NN6j5Q5K2k73k5
3293a90K64j77j35L55k96K71q6P9p5j83J45J69J1j69N4Q8RJ9j26O3j75j27M43
3316B31k57j25k6J06K26n31L06J47l4j85j62M03j83P2j16L07k76K65k79K93j98
3337a6j39J13R9K7r0K62m35J36j09J61k25l9K99kj96J40j8j3N1P4J40k40J19j66
3361f7K42j67j06O8O3NL24m13K57M4l41J19k43m9K71K2j68J45j85K3j36K3K64
3384eK05j05L8J6j41J29j90r0J64k30K21m4J94N4j22l14J64P0k10K64k52k5K44
$$ plain form
3407 35 -187 -190 46 -97 -189 -9 -53 127 156 -83 260 69 14 -12 21 197 129 219 -114 148 32 -62 -268 -79
3431 -79 -76 -312 -78 -110 -26 -11 -53 -64 -1 161 -41 39 82 -57 -42 -221 -4 37 33 136 -1 4 112 -68 -4 -112
3457 -112 24 -1 15 -108 189 -98 -85 57 -142 -2 139 -147 -50 132 -66 83 -46 194 -6 118 0
3478 0 150 58 71 -33 71 15 264 167 -6 120 230 -77 109 29 -106 77 260 95 -102 -10 -101 -195 233
3501 233 67 47 246 35 57 -174 -93 -42 -47 151 -328 -115 -73 59 -164 -50 115 7 127 31 -165 -130 75
$$ packed form
3407C5k22lK36j43r2J80m4J80K9k39L43j91n5k6L3J76o8R0l33K62j16r4k06J89
3431g9Lk36K34l2Q4J5m2j1O3J62k02Q0M3j39J5j79K17M1mJ03j37NJ08j80O4j08
3457a12J36k5J6j23K97k87J3J42j99J40J41k86R7J82j98J49j29K40k00J24j18
3478@J50r2J3j04J04n6K49r7j73J26J10l07J86q0j35J83J83j65j97R2r1r4M28
3501B33j66k0J99k11K2k31Q1N1nJ98m79K13M2J32k23J14J65j08J20r6j96L5K05
$$ [...]
8191b07
##END NTUPLES=NMR FID
##END=
