##TITLE=1H_LR-0154-C2-B2
 D2O
 8 sc, 
 9.2.2023
##JCAMPDX= 6.0         $$ Bruker NMR JCAMP-DX V2.0
##DATA TYPE= NMR FID
##DATA CLASS= NTUPLES
##ORIGIN= UXNMR, Bruker Analytische Messtechnik GmbH
##OWNER= root
$$ XWIN-NMR		Version 3.5
$$ Thu Feb  9 17:34:47 2023 Russian Standard Time (UT+4h)  she@DPX200
##.OBSERVE FREQUENCY= 200.13135
##.OBSERVE NUCLEUS= ^1H
##.DELAY= (6, 6)
##.ACQUISITION MODE= SIMULTANEOUS
##.ACQUISITION SCHEME= undefined
##.AVERAGES= 8
##.DIGITISER RES= 18
##SPECTROMETER/DATA SYSTEM= spect
##.PULSE SEQUENCE= zg30
##.SOLVENT NAME= D2O
##.SHIFT REFERENCE= (INTERNAL, D2O, 0, 15.7039)
##AUDIT TRAIL= $$ (NUMBER, WHEN, WHO, WHERE, WHAT)
$$ ##TITLE= Audit trail, XWIN-NMR		Version 3.5
$$ ##JCAMPDX= 5.01
$$ ##ORIGIN= Bruker BioSpin GmbH
$$ ##OWNER= she
$$ F:/spectra/data/she/nmr/H-F/1/audita.txt
$$ ##AUDIT TRAIL=  $$ (NUMBER, WHEN, WHO, WHERE, WHAT)
(   1,<2023-02-09 17:33:38.60 +0400>,<she>,<DPX200>,
      <created by zg, POWCHK disabled, PULCHK disabled
       configuration hash MD5:
       00 E9 B6 7A A2 85 ED C7 34 08 36 98 17 FE 4E 26
       data hash MD5: 16K
       E2 91 7D D1 AA 3D 84 F1 32 1A DB F4 E2 94 5C 2A>)
$$ ##END=
$$ 
$$ hash MD5
$$ 6F A6 73 28 93 BD B0 D4 5B 06 76 FD 81 B0 0C D4
##$RELAX= 
##$RELAX= 
##$RELAX= 
##$RELAX= 
##$RELAX= 
##$RELAX= 
$$ Bruker specific parameters
$$ --------------------------
##$DU= <F:/spectra>
##$EXPNO= 1
##$NAME= <H-F>
##$PROCNO= 1
##$TYPE= <nmr>
##$USER= <she>
##$AMP= (0..31)
100 100 100 100 100 100 100 100 100 100 100 100 100 100 100 100 100 100 
100 100 100 100 100 100 100 100 100 100 100 100 100 100 
##$AQSEQ= 0
##$AQ_mod= 1
##$AUNM= <au_zg>
##$AUTOPOS= <>
##$BF1= 200.13
##$BF2= 200.13
##$BF3= 200.13
##$BF4= 200.13
##$BF5= 200.13
##$BF6= 200.13
##$BF7= 200.13
##$BF8= 200.13
##$BYTORDA= 1
##$CFDGTYP= 0
##$CFRGTYP= 5
##$CHEMSTR= <none>
##$CNST= (0..31)
1 1 145 1 1 1 1 1 1 1 1 1 1 1 1 1 1 1 1 1 1 1 1 1 1 1 1 1 1 1 1 1 
##$CPDPRG= <>
##$CPDPRG1= <>
##$CPDPRG2= <>
##$CPDPRG3= <>
##$CPDPRG4= <mlev>
##$CPDPRG5= <mlev>
##$CPDPRG6= <mlev>
##$CPDPRG7= <mlev>
##$CPDPRG8= <mlev>
##$CPDPRGB= <>
##$CPDPRGT= <>
##$D= (0..31)
0 1.2 0 0 0 0 0 0 0 0.06 0 0.03 0 0 0 0 0.0002 0 0 0 0 0 0 0 0 0 0 0 0 
0 0 0 
##$DATE= 1675949617
##$DBL= (0..7)
120 120 120 120 120 120 120 120 
##$DBP= (0..7)
150 150 150 150 150 150 150 150 
##$DBP07= 0
##$DBPNAM0= <>
##$DBPNAM1= <>
##$DBPNAM2= <>
##$DBPNAM3= <>
##$DBPNAM4= <>
##$DBPNAM5= <>
##$DBPNAM6= <>
##$DBPNAM7= <>
##$DBPOAL= (0..7)
0.5 0.5 0.5 0.5 0.5 0.5 0.5 0.5 
##$DBPOFFS= (0..7)
0 0 0 0 0 0 0 0 
##$DE= 6
##$DECBNUC= <off>
##$DECIM= 32
##$DECNUC= <off>
##$DECSTAT= 4
##$DIGMOD= 1
##$DIGTYP= 9
##$DL= (0..7)
0 120 120 120 120 120 120 120 
##$DP= (0..7)
150 150 150 150 150 150 150 150 
##$DP07= 0
##$DPNAME0= <>
##$DPNAME1= <>
##$DPNAME2= <>
##$DPNAME3= <>
##$DPNAME4= <>
##$DPNAME5= <>
##$DPNAME6= <>
##$DPNAME7= <>
##$DPOAL= (0..7)
0.5 0.5 0.5 0.5 0.5 0.5 0.5 0.5 
##$DPOFFS= (0..7)
0 0 0 0 0 0 0 0 
##$DQDMODE= 0
##$DR= 18
##$DS= 0
##$DSLIST= <SSSSSSSSSSSSSSS>
$$ [...]
##$SUBNAM2= <"">
##$SUBNAM3= <"">
##$SUBNAM4= <"">
##$SUBNAM5= <"">
##$SUBNAM6= <"">
##$SUBNAM7= <"">
##$SUBNAM8= <"">
##$SUBNAM9= <"">
##$SW= 18.05172834244
##$SWIBOX= (0..15)
0 0 2 0 0 0 0 0 0 0 0 0 0 0 0 0 
##$SW_h= 3612.71676300578
##$TD= 16384
##$TD0= 1
##$TE= 0
##$TE2= 300
##$TE3= 300
##$TEG= 300
##$TL= (0..7)
0 120 120 120 120 120 120 120 
##$TP= (0..7)
150 150 150 150 150 150 150 150 
##$TP07= 0
##$TPNAME0= <>
##$TPNAME1= <>
##$TPNAME2= <>
##$TPNAME3= <>
##$TPNAME4= <>
##$TPNAME5= <>
##$TPNAME6= <>
##$TPNAME7= <>
##$TPOAL= (0..7)
0.5 0.5 0.5 0.5 0.5 0.5 0.5 0.5 
##$TPOFFS= (0..7)
0 0 0 0 0 0 0 0 
##$TUNHIN= 0
##$TUNHOUT= 0
##$TUNXOUT= 0
##$USERA1= <user>
##$USERA2= <user>
##$USERA3= <user>
##$USERA4= <user>
##$USERA5= <user>
##$V9= 5
##$VALIST= <valist>
##$VCLIST= <CCCCCCCCCCCCCCC>
##$VD= 0
##$VDLIST= <DDDDDDDDDDDDDDD>
##$VPLIST= <PPPPPPPPPPPPPPP>
##$VTLIST= <TTTTTTTTTTTTTTT>
##$WBST= 1024
##$WBSW= 4
##$XGAIN= (0..3)
0 0 0 0 
##$XL= 0
##$YL= 0
##$YMAX_a= 279522
##$YMIN_a= -320667
##$ZGOPTNS= <>
##$ZL1= 120
##$ZL2= 120
##$ZL3= 120
##$ZL4= 120
##$ABSF1= 10
##$ABSF2= 0
##$ABSG= 5
##$ABSL= 3
##$ALPHA= 0
##$AQORDER= 0
##$ASSFAC= 0
##$ASSFACI= 0
##$ASSFACX= 0
##$ASSWID= 0
##$AUNMP= <proc_1d>
##$AZFE= 0.1
##$AZFW= 0.1
##$BCFW= 1
##$BC_mod= 2
##$BYTORDP= 1
##$COROFFS= 0
##$CY= 11.3945322036743
##$DATMOD= 1
##$DC= 2
##$DFILT= <>
##$DTYPP= 0
##$F1P= 2.36226072786647
##$F2P= -0.459571619588291
##$FCOR= 0.5
##$FTSIZE= 0
##$FT_mod= 4
##$GAMMA= 1
##$GB= 0.15
##$INTBC= 1
##$INTSCL= 1
##$ISEN= 128
##$LB= 0.24
##$LEV0= 0
##$LPBIN= 0
##$MAXI= 10000
##$MC2= 0
##$MEAN= 0
##$ME_mod= 0
##$MI= 1.114404
##$NCOEF= 0
##$NC_proc= 0
##$NLEV= 6
##$NOISF1= 3.799351
##$NOISF2= 2.8
##$NSP= 1
##$NTH_PI= 0
##$NZP= 0
##$OFFSET= 15.70392
##$PC= 1
##$PHC0= -19118
##$PHC1= 14.80078
##$PH_mod= 1
##$PKNL= yes
##$PPARMOD= 0
##$PSCAL= 0
##$PSIGN= 0
##$REVERSE= no
##$SF= 200.130013532006
##$SI= 16384
##$SIGF1= 3
##$SIGF2= 2
##$SINO= 400
##$SIOLD= 16384
##$SREGLST= <1H.CDCl3>
##$SSB= 0
##$STSI= 0
##$STSR= 0
##$SW_p= 3612.71676300578
##$SYMM= 0
##$S_DEV= 0
##$TDeff= 0
##$TDoff= 0
##$TI= <>
##$TILT= no
##$TM1= 0
##$TM2= 0
##$TOPLEV= 0
##$USERP1= <user>
##$USERP2= <user>
##$USERP3= <user>
##$USERP4= <user>
##$USERP5= <user>
##$WDW= 1
##$XDIM= 8192
##$YMAX_p= 0
##$YMIN_p= 0
$$ End of Bruker specific parameters
$$ ---------------------------------
##NTUPLES= NMR FID
##VAR_NAME=  TIME,          FID/REAL,        FID/IMAG
##SYMBOL=    X,             R,               I
##VAR_TYPE=  INDEPENDENT,   DEPENDENT,       DEPENDENT
##VAR_FORM=  AFFN,          ASDF,            ASDF
##VAR_DIM=   8192,          8192,            8192
##UNITS=     SECONDS,       ARBITRARY UNITS, ARBITRARY UNITS
##FACTOR=    0.0002768,     1,               1
##FIRST=     0,             0,               0
##LAST=      2.2672688,     0,               0
##MIN=       0,             -320667,         0
##MAX=       2.2672688,     279522,          0
$$ Real data points
##PAGE= N=1
##DATA TABLE= (X++(R..R)), XYDATA
0@%%%%%%%%%%%Qj6J6j6J6k4L2l3M1n6O5p4Q9j05J26j49J73j98K26k60K98l38L82
34B03m34M91n52O19o91P71q60R57j063J178j305J445j596J759j938K136k355K594
52A359k858L152l478L848m268M745n298N945o713P647q810J0305j2307J5143j9513
67a1101K7198m4726J62315J0698k60333p2947n4390Q8448J67522J69487O7183
78B49354J117j38187j97074j41359k1138O8955J70939J67116P6759k9956j25799
89H0727k07150j35039J7959J03538J27642J53005Q7622m0651j27072j55335j35914
100b30668j2327J23829J60311J24829O6446m1166j33139j45179j04167j8097J06212
111a03116J61617J16873M6876l7278j34857j59395r0908L953R7861J54015J12631
$$ y = [0, 0, 0, 0, 0, 0, 0, 0, 0, 0, 0, 0, 8, -8, 8, -8, 8, -16, 16, -17, 24, -32, 33, -41, 48, -57, 69, -80, 93, -105, 121, -139, 159, -179, 203, -231, 260, -292, 327, -364, 407, -453, 504, -559, 619, -686, 759, -837, 922, -1016, 1120, -1235, 1359, -1499, 1653, -1825, 2023, -2245, 2500, -2798, 3147, -3566, 4081, -4729, 5576, -6731, 8412, -11101, 16097, -28629, 133686, 144384, -115949, -188896, -243286, -154838, 12684, 182171, 249354, 250471, 112284, -84790, -226149, -247287, -178332, -7393, 159723, 236482, 206526, 80727, -126423, -261462, -243503, -139965, -12323, 140682, 228304, 187653, 60581, -94754, -230668, -242995, -119166, 41145, 165974, 232420, 191254, 58115, -87064, -191231, -209328, -103116, 58501, 175374, 222250, 184972, 50115, -109280, -200188, -196235, -98374, 55641, 168272]
122A68272J9889m9905j08619j41476r4383O899R5610J45630J25559K7580p3336
133A21720j20603j21461p4518J8874J03458J30295J01472K7312o1894j16251j15973
144a07569p1383J3185J04376J37981R6337J2396p3124j21198j06517m8824K0449
155a43891Q8342J23559R2597J2290o9404j19173j11653m6782L4193R6789J18127
166G4994Q0639R04p3397j09337r6257m0575L2852R1598J12663Q1511K729p8333
178G9991j15913r3198k8781M5021R4284J00759O3999j877p1001j07904q9787k8971
190a53378M3292R5693J03849O0852j2273p8508j06386q0690j5840M9028Q9482
201d879R1798N4695j1563p3685j03184q2315j6402N6227R6612Q9064M3283k1690
$$ y = [168272, 188161, 138256, 29637, -111839, -206222, -199323, -103713, 41917, 167476, 195056, 121720, 1117, -120344, -194862, -175988, -72530, 57765, 159237, 186549, 124655, 8404, -107569, -178952, -165767, -61391, 76590, 172927, 185323, 112199, -8999, -115516, -164340, -143891, -55549, 68010, 160607, 172897, 103493, -15680, -127333, -174115, -139922, -43133, 74994, 155633, 156537, 83140, -26197, -122454, -163029, -130177, -38579, 74084, 155595, 158324, 79991, -35922, -129120, -157901, -112880, -18596, 82163, 146162, 144285, 73284, -34620, -124407, -153378, -110086, -14393, 89456, 150308, 138035, 59527, -46859, -127549, -143389, -94361, -4879, 86919, 141614, 130051, 56366, -46818, -129133, -145535, -89308, 7304, 96368, 139651, 117961]
213A17961p6301r5005o9815j2439N2437R1109Q6126M2921k1941p8405r8390o7513
225a29255l173N9612R1935P9420L0497k7949p2666q8211o3066m858N7566R1607
237B1459Q1697L0561l5183q0202q5931n3890M275O1515Q5381P0177K5970l2185
249I3644p7168q4136n2757L995O2172R0696P0039J6592m1067p8096p8059m2594
261a16739J0521N8682Q1946O7173J7673m0375p8051q0375m1520J7890O5959Q0732
273D3516O0104R856m5425p4632o9297l6889J4905O4029Q0827N8474Q485m6838
285F7115p9892p0627k8063K4438O4416P4777M9578L203m4872p4243o7968k8215
297a10353K3699O5521P6802M9494l865n1770p3539o1702k0751K8891O3223O8886
$$ y = [117961, 41660, -53345, -123160, -135599, -83162, 7947, 94073, 136994, 115053, 36648, -61742, -129255, -132428, -72816, 19119, 98539, 129036, 101087, 28421, -59790, -122856, -127714, -70148, 21459, 103156, 133717, 98534, 18332, -67599, -121489, -117214, -55699, 29682, 99859, 125829, 93644, 16476, -67660, -120417, -116422, -54250, 36446, 106485, 123077, 82010, 3914, -74145, -116739, -106218, -47536, 34410, 101583, 119256, 78881, 830, -79545, -121065, -103175, -37216, 43516, 103620, 113476, 68051, -6581, -75878, -112767, -97862, -33833, 46994, 105468, 113953, 67115, -12777, -83404, -111467, -87029, -22613, 52164, 101742, 104945, 60073, -14170, -82138, -110353, -86654, -21133, 55669, 105163, 101298, 49528, -24011, -85713, -106464, -77573, -14350, 54536]
309E4536M4606j888m9089p3955o1903j9217L3074O7639O9447L7860j0104n2159
321C8847o9013n3986j4454L1708O3174O6375L7889j0060n4117p1466n3704r393
333i8200L8335O5101O0264K9683j3948n2317o6459m8558r325L5904O5570O2084
345F8134K7908j8558n5770o6377m3663q35L9779O1378N5850K4018j9053n1649
357B1162o4015m4810r13M3640O3774N4519J9316k5426n5312n8818l6748K289M1373
370c9969O0106N0402J8290k3827n6332o0460l5027O067M5432O1726M6230J0298
382H2936k7478n2596n5134l0582P020M2351N9708M7750J0520l0590n5699n4679
394e6473k6378J3609M5730N5397M1283P079l0685n2627n0513k6493J2190M5918
$$ y = [54536, 99142, 97254, 48165, -25790, -87693, -106910, -73836, -6197, 63250, 101110, 91006, 38847, -30166, -84152, -98606, -66898, -3724, 62651, 100540, 90480, 36363, -35103, -88807, -98200, -59865, 5236, 65500, 95183, 81235, 28918, -37541, -86099, -95424, -59520, 6050, 68134, 96042, 77484, 21714, -44663, -88326, -89161, -49382, 11996, 67846, 91864, 72811, 21162, -42853, -87663, -88576, -44936, 18838, 73357, 92673, 67247, 11935, -46883, -83631, -81342, -39969, 20137, 70539, 88829, 65002, 8670, -51790, -86817, -80750, -35318, 26408, 72638, 82936, 55458, 2862, -52272, -82854, -75834, -33483, 26225, 73975, 84495, 53905, -1794, -56473, -82851, -69242, -23512, 31885, 73168, 80247, 49562, -3065, -53578, -80071, -67881, -21963]
406b1963N7363M0184L467l5166n4863m7359j9306J5689M4427N2717L5797K907
418G3894l2724n4192m8476j8344J9653M7647N2865L2111k778l5889n1190m2675
430f0098j4130J9955M4906N0488L2289k889l7417n2446m3116j1502K5572M7238
442a150M6442K5516o077l6456m9716l9358j0828K3585M7230M7385K4677r578m0026
455B1646n0367l5682m987K6496M5801M3715K0407j0144l7187m7851l6089m873
467f9115K9051M7915M3480J8222j5206m0062m4622l1059k127K8860M5629M0109
479E1075J7513j4795m1153m6353k9629O07L1375M6311L7803J1782j7740l9058
491G738m3542k6712K272K9412M4853L9491J2069k0999m1278m2562k4375O851L3313
$$ y = [-21963, 35400, 75584, 79051, 43885, -10978, -58337, -77643, -61954, -17527, 35190, 70987, 73894, 41170, -13022, -61498, -79842, -60189, -12542, 40323, 72434, 69656, 33767, -17423, -60098, -74228, -54273, -9367, 41121, 73410, 70521, 33104, -19342, -62458, -73960, -48388, -1150, 45292, 70808, 64731, 28275, -21441, -60799, -71627, -48042, -812, 46573, 71250, 61672, 21646, -28721, -64403, -69390, -42894, 2907, 46622, 67029, 56885, 19698, -28153, -64242, -69115, -40064, 7851, 51331, 69553, 54347, 14285, -30337, -61396, -63523, -34663, 10966, 51075, 68588, 53793, 12640, -33713, -63342, -62735, -31360, 14951, 52754, 64536, 46796, 7738, -35804, -62516, -60244, -30832, 14021, 53512, 65581, 44582, 3304, -39258, -63633, -56782, -23469]
504b3469M2606L3710J0045k0235m0338m0033k3033M970L3943M4899L2960O350
516F2375k2593m2378l9753j7085R200L1573M1867L1053M198k2111m0208m0259
528d4121j8244J2322L4971M1131K9305J272k5747l8591l5205j6471J3060L5237
540a1081L8677K7110L036k6767m1998l3677j2822J4430L6713L8667K1515j716
552E2087k4401l9898l3664j0316J4182L5147M0043K2187n579k7588l8617l2245
564d8662p489J9525L3565L4884K1693n565k8520l6198l0227q785K0178L7486L4547
577C6432J8044p594l0912l6429k4813n297J8366L5788L3617J5468p463k9318l8704
590b2815k6000j464K1325L4878L2745J2676j2154k8585l4434k4442p08K1363L3842
$$ y = [-23469, 19137, 52847, 62892, 42657, 2319, -37714, -60747, -55777, -21834, 23065, 56025, 62375, 39782, -2596, -42349, -59434, -50234, -18661, 23206, 54259, 58457, 36346, -3862, -44121, -62365, -50043, -15072, 26059, 55364, 56636, 30889, -7702, -42907, -59378, -46318, -11081, 27596, 54706, 57742, 30975, -11023, -44700, -57522, -43092, -6379, 32288, 53803, 52087, 27686, -12212, -45876, -56192, -42010, -6863, 33180, 55367, 49788, 22200, -16417, -48662, -56151, -36626, -3061, 31823, 53516, 47951, 19431, -16767, -46994, -55779, -35601, 1885, 36432, 54476, 46882, 15970, -20459, -45272, -50569, -32203, 3585, 37202, 52670, 45207, 15889, -22815, -48815, -50279, -28954, 5924, 38669, 51345, 39191, 10606, -23828, -48270, -48978, -27615, 6227]
603F227L2052J3686j3306l1457l3963k1847J848K4482L3591K7283J0978j2676
615C6898l0398l2897k0254J506K4555L4343K7816P800j5277l1424l1942j6932
627d6206M575K3656L2731K5188O621j5039l0197l2097j7115O298K6005L2869K4210
640D1499L297j7421k9927k8735j4285O940K5126L1585K3598L432j8790l0699k8696
653c3076j2471R771K6948L0029J9881R68j8796k9640k5809j2016R263K6855L0620
666B2527J9897r45k0941l0414k4944p865J1655K5853K8292J7466j454k0136k9244
679a0253k4686q137J2840K7544K8413J5760m363k1676k8673k1876n275J3325K5666
692a391K6597J5056l853k1786k9409k1766l714J5165K7002K5543J2239o415k1731
$$ y = [6227, 38279, 51965, 38659, 7202, -26761, -48608, -46760, -22278, 11313, 38596, 49574, 36898, 6500, -26397, -46651, -45145, -20590, 13753, 41569, 49369, 34092, 2668, -29274, -46206, -41631, -17975, 14756, 39944, 46565, 31526, 1329, -30768, -47883, -41585, -15580, 17289, 41499, 44796, 27375, -2552, -31287, -45572, -38632, -13506, 18079, 41677, 45109, 26319, -4380, -33076, -45547, -35776, -8828, 21201, 41082, 42050, 23254, -6386, -32195, -44211, -34948, -8093, 22527, 42424, 41479, 20538, -9876, -34820, -42685, -31030, -5177, 23115, 40581, 39127, 18991, -10253, -34939, -43076, -30236, -2692, 25721, 41481, 37118, 15442, -13231, -35107, -40382, -27057, -1391, 25206, 40262, 36409, 14623, -14786, -36552, -40266, -25101, 1901, 27444, 39683, 33268, 11537]
705A1537k7282j9831l160J5262K6382K5586J1990p870k3228k7619j8322n52J7093
718b0014K6110K2356R720p999k2445k6150j7378r69J7271K6889K2687Q161j0446
731B7793k3480k5200j4916J733J7223K5068K1474P126j0616k2387k5365j4916
743c6463K989J8793K5543K0479M957j2625k2642k2604j3304L722J8805K4185J9702
756C1537M461j3134k3573k2903j1434N482J9652K3954J6792K575j3126k2745k1626
769b4088j0567N794J9635K3807J7116J374j4852k3266k0528q232P927J9342K2150
782A5612J5496N50j4371k2784k0146p805Q491K0383K2692J3900j613j5820k2043
795g458j7958o344R162J9016K1667J2994j896j5844k2261j8545m598J0653K0493
$$ y = [11537, -15745, -35576, -38736, -23474, 2908, 28494, 40484, 32614, 9386, -18233, -36555, -37107, -20014, 6096, 28452, 38172, 30173, 7728, -18422, -35800, -36769, -19498, 7391, 30078, 38239, 27793, 4313, -20887, -35803, -34070, -16847, 8221, 29695, 36821, 26205, 3818, -21547, -36463, -33474, -14681, 10862, 31341, 36298, 23673, 1031, -21573, -34877, -31155, -12350, 11835, 31537, 35998, 22864, -709, -23612, -35046, -29564, -9912, 14042, 30834, 33409, 20283, -2462, -24088, -34655, -28861, -9226, 14581, 31697, 33071, 18219, -5047, -25575, -33807, -25880, -6538, 15612, 31108, 31658, 17287, -5497, -25643, -33448, -24957, -4574, 18118, 32018, 30405, 14585, -7458, -25416, -31760, -22598, -3582, 18085, 31079, 29183, 13339, -8922, -27467, -32065, -21412, -919]
808i19K0487J0789l422j6264k1082j6386m059J0607K0270K0089J0609m469j7057
821I193k1130j5466k249J2213J9863J8653Q674n242j6382k0275j4819j818J2253
834a6532K0606J8490P243p010j7090k0138j2790K50J2428J9015J7185O819o779
847B1697j7413j9619j2644J094J3715J9755J6358M774q072j7147j8125j1022J633
860b5016J3470J8965J5831M647q679j7767j8617r716L647J4209J8453J4047L166
873B6640r645j6806j7216r119L168J4350J8601J4104J871j0576j7762j6438p444
886b6272N008J4334J7545J2547J241j0151j7127j6349p021N895J4988J7743J1638
899B4019o1j1748j6837j4543n292O036J4673J6845J0920n94j1521j7108j5101
$$ y = [-919, 19568, 30357, 26935, 10671, -10411, -26797, -30856, -20249, 21, 20110, 30719, 26250, 9193, -11937, -27403, -29652, -17439, 2424, 21077, 29751, 24509, 8127, -12148, -26967, -28785, -16532, 4074, 22564, 29807, 22797, 5707, -14431, -27221, -26971, -14543, 4472, 21657, 28476, 21697, 4284, -15335, -27979, -26885, -13170, 6585, 22943, 27717, 19645, 2498, -15627, -26649, -25016, -11546, 7419, 23250, 27897, 19218, 1451, -17166, -26882, -23235, -9026, 9427, 23474, 26640, 16995, 189, -17027, -26146, -22978, -8628, 9973, 24077, 25948, 15372, -2390, -18828, -26272, -21264, -6930, 10615, 23162, 24403, 14252, -2875, -19224, -26245, -20350, -5362, 12381, 24019, 23958, 12210, -4627, -19170, -24462, -18426, -3753, 13092, 24012, 23418, 11897, -5211, -20312]
912b0312m328P147J5895J6027R172k040j2052j6521j3059m216P312J5428J5944
925A4397Q904k312j2829j6866j2191k579Q496J5288J4800P768l188j2482j5800
938h594j2177j954Q973J5453J4894O941m437j3325j5604j0440p93Q957J5016J3405
952A6315O252m317j3449j5164j0732l78J0177J5248J3439M618n565j3331j4634
965a1521r193M43R709J5019J2918M371n967j3495j4855q510J590J1215J4245J1560
979A7529L312o547j3148j3310q051J493J0963J4705J1381K746p345j3977j3639
992a3888o155K811J0838J4226J0032J697p204j3490j3049o177L511J1608J3829
1005H589R820R18q620j3040j2256n242M198J1692J2858R642N79q891j3395j1799
$$ y = [-20312, -24640, -17493, -1598, 14429, 23601, 21561, 9509, -7012, -20071, -24287, -16975, -1547, 14397, 23301, 20989, 8160, -8706, -20897, -23476, -14980, 308, 15108, 22876, 19688, 7206, -8594, -20771, -22725, -13752, 1701, 16595, 23536, 19099, 5774, -9830, -20270, -21063, -12106, 2910, 16315, 22567, 18250, 4801, -10363, -21095, -21473, -11296, 3952, 17391, 22009, 16444, 3113, -11521, -20714, -20271, -10562, 4457, 17375, 21746, 15779, 2284, -12571, -21081, -19491, -8276, 5969, 17529, 20841, 14294, 1146, -12164, -20215, -18722, -7759, 6946, 18327, 21073, 13728, -249, -13888, -20043, -17232, -6394, 7832, 17864, 19561, 12357, -1133, -14182, -20359, -16848, -5240, 8589, 18409, 19327, 10707, -2333, -14589, -19831, -15633, -3941, 8917, 18559, 19138, 10247, -3148, -14947]
1019a4947m764N161J2068J2904P855m43q715j3228j0997l858M811J2069J2699
1032A0615P902j162r630j3090j0665k588N849J1919J2021O936k192q818j3010
1045e913r941k722O414J2253J1807O659k671j0200j2342r362j385O866J1378J1333
1059A2174N937k991j0101j2368q857j023P428J1958J0759M462l505j0083j1791
1072h001p879m94O900J1870J0744M432m114j0530j2024p219N01P818J1550R887
1086A3441L189m239j0260j1163p057P58Q067J1624R530K916n028j0920j0602o216
1100a5960J721Q148J1036Q728K293n155j0417j0608n922J720Q985J0976Q689J338
1114A5572n777j0264j0017m929K102Q503J0583Q563J077o380j0346r917m640L323
$$ y = [-14947, -19711, -14550, -2482, 10422, 18277, 17834, 9119, -4109, -15106, -18964, -14153, -2084, 10615, 18517, 17355, 7725, -5365, -16030, -18618, -12769, -850, 11171, 18107, 15915, 7097, -5913, -15854, -18576, -12162, 91, 11898, 18557, 15886, 5686, -6656, -16018, -17403, -10537, 841, 12174, 18111, 15120, 5019, -7349, -16206, -17229, -9801, 2157, 12916, 17378, 13873, 3790, -8001, -15880, -16374, -9474, 2396, 13140, 17572, 13458, 2928, -9096, -16315, -15814, -7996, 3554, 13441, 16630, 12391, 2131, -9032, -16089, -15331, -7264, 4360, 13890, 16806, 11778, 858, -9744, -15960, -14239, -6091, 4945, 13673, 15966, 10811, 394, -10214, -16136, -14416, -5431, 5545, 14234, 15572, 9795, -469, -10486, -15415, -13313, -4810, 5773, 14336, 15413, 9033, -1313, -11230, -15870, -12547]
1128a2547R166J0618P017M05o424j0260r043m321L404Q989J0476O825L6o912j0589
1143c160q713l044M054R058R769O187p56o687j0054q802k678M425R049J0066O093
1158A4807j418p854r987p703k116M746R131Q964N312j225p569r778p767j877N393
1173h941R674Q941M241k201p764r511o577j462N142R374Q782M302k417p942r845
1188f204o465l53N848R058Q023L519k858p760q861o444k71N864R191Q197K986
1203A3470l389q114q934n262J97O054Q894P507K503l653p810q928n137Q92O389
1218e321R119P088K076m538q090p827m803J373O394Q734O624J562l998q524p963
1233h094m276J739O962Q477N888J018m504p780p935l782K105O821Q157O482J97
$$ y = [-12547, -3381, 7237, 14254, 14659, 8235, -2025, -11068, -15389, -11985, -2996, 7480, 14305, 14341, 7429, -3160, -11873, -14917, -10863, -1805, 7964, 14151, 13395, 6708, -3346, -12148, -14826, -10401, -1352, 8714, 14807, 13389, 5535, -4452, -12155, -14271, -9525, -394, 8570, 13882, 12657, 5088, -4690, -12457, -14334, -8941, 733, 9674, 13915, 11714, 3950, -5561, -12138, -13600, -8458, 916, 9698, 14000, 11583, 3641, -6204, -12669, -13022, -7174, 1884, 9907, 13426, 10568, 2808, -6053, -12497, -12768, -6904, 2287, 10484, 13470, 10081, 1967, -6967, -12229, -12032, -5978, 2916, 10423, 12926, 9273, 1463, -7465, -12602, -11710, -5321, 3798, 10886, 12962, 8424, 334, -7493, -12296, -10923, -4529, 4205, 10829, 12391, 8393, -131, -8094, -12370, -10631, -3669, 4808, 10696, 11714, 7210, -570, -8505, -12287, -10182, -3361, 4796, 11278, 11475]
1248A1475m852q330p197l243K530O982Q271N495j09m690q077o917l417K851P168
1263b060Q294N039l05n206q314o768k160K926P077P671M686m68n297p746p009
1278i640j866L515P000P682M309j283n444p396o451j431L271P186P401M478j458
1293I873n951p675o109r81M093P260P059L228j359o098p403n465r96M219P120
1308H15O753L186j812o521o899n336j94M404P022O210K906k195o343p039m613
1323i656k30M717O852O251K492k912o136o947m053K15M687O754O101K153k945
1338G343o068p200m021J250M732O526N624J582k755o188o553l712P76M912O875
1353C123N495J252l753o204o018l292Q31N592O610M657Q36l193o365n671l383
$$ y = [11475, 6623, -1707, -8904, -12147, -9617, -2635, 5636, 11131, 11022, 6332, -1745, -8662, -12079, -9228, -2060, 6234, 11273, 10968, 5762, -2552, -9320, -11480, -8554, -1477, 6194, 10880, 10412, 5115, -2631, -9640, -11506, -7991, -991, 6691, 11000, 9717, 4273, -3123, -9574, -11005, -7734, -548, 6853, 11331, 9873, 3922, -3753, -9862, -10843, -6750, 510, 7569, 10797, 9438, 3340, -4063, -9528, -10524, -6305, 815, 7568, 10754, 8942, 2421, -4478, -9814, -10008, -5604, 1418, 7628, 10534, 8339, 1996, -5043, -9656, -9886, -5169, 1683, 7934, 10426, 7514, 1378, -5569, -9622, -9407, -4720, 2034, 8135, 10288, 7343, 1275, -5925, -9946, -8696, -3964, 2562, 8186, 9768, 7013, 825, -5728, -9440, -8664, -3752, 3123, 8618, 9870, 6117, -87, -6105, -9397, -8566, -2974, 3636, 8293, 9129, 5936, -429, -6100, -9483]
1368i483J463N420O347M693M34l704n991n796k719J753N234O422M337K77l471
1383E216o072o020k254J961N745N956M149m7m210n824n589k087K329N573N860
1398D686L944l26m248o277n080j430K488N354N844L425q12m139n562n028j725
1413h886K936N374N788L476j042m871n489m373j041K884N281N371K903j081m365
1428B865n897m560l20K769N597N360K336j260m574n797l806l92K998N387N002
1443E708K408j657m538n560l980K46K699N764M928J714j714m479n477l550K0L683
1459c785N257M611J572j927m878n090l290L38L768N209M623J086j992m549n384
1474d431k991P55L605N100M333J030k553m557m961k592R97L616M829M238J077
$$ y = [-9483, -8020, -2600, 3747, 8440, 8874, 5170, -821, -6617, -9336, -7583, -2349, 4073, 8410, 8687, 5216, -856, -6876, -9130, -7169, -1424, 4532, 8681, 8634, 4424, -1400, -6989, -9076, -6747, -1174, 4686, 8630, 8304, 4056, -2221, -7301, -8731, -6243, -889, 4955, 8380, 7568, 3429, -2133, -7161, -8886, -5950, -576, 5212, 8688, 7646, 2775, -2714, -7087, -8128, -5244, 37, 5408, 8311, 7230, 2865, -3032, -7592, -7912, -5143, 454, 5814, 8150, 6890, 2316, -3481, -7287, -7679, -4681, 706, 5708, 8116, 6459, 1921, -3639, -7619, -7373, -4674, 1090, 6018, 7732, 6018, 1539, -3938, -7488, -7468, -3785, 1472, 6083, 7655, 5728, 850, -4240, -7530, -7192, -3424, 1785, 6408, 7494, 5502, 953, -4431, -7422, -6667, -3062, 2038, 6371, 7401, 4848, 291, -4670, -7262, -6265, -2649, 2180, 6418, 7495]
1489G495k830m787m568k580Q31M252M931L574Q10k636n009m401k096P85M231M944
1505B946L485O10l112m697m552j732J539M081M630L349L3k928m569m108j957J617
1521e365L971M999L026l4l114m823m154j352J903L932M538K902j80l298m479l970
1537e498j311J947M258M454K467o42l014m621l778o91J790M402M226K504m32l697
1553B364m610l521o25K314M303M112J945r37l378m128l278p59K282M286M195J800
1569F365r02l989m064k684p43K285M238L551J915j166l066m482k907m55K846L841
1585E83M130J169j166l584l965k860J43K803L690L627J453j604l613l985k258
1600e437Q4K637M213L403J154j740l584l695k440K02K838L880L116J118j725l730
$$ y = [7495, 4665, -122, -4690, -7270, -6439, -2187, 2744, 6318, 7128, 4492, -517, -4918, -7014, -6229, -1998, 2946, 6431, 7041, 3929, -768, -5320, -7052, -5513, -1432, 3198, 6547, 6580, 3652, -917, -5025, -6982, -5365, -1394, 3605, 6631, 6597, 3483, -1340, -5494, -6846, -4943, -1011, 3527, 6429, 6249, 2951, -1528, -5498, -6809, -4862, -604, 3850, 6317, 5675, 2661, -1960, -5738, -6429, -4639, -237, 3989, 6493, 6061, 2364, -2246, -5767, -6392, -4078, 225, 4337, 6282, 5345, 1967, -2161, -5439, -6198, -3916, 370, 4565, 6365, 5463, 1474, -2590, -5274, -6017, -3732, 506, 4057, 5972, 4806, 1740, -2742, -5649, -6104, -3258, 583, 4713, 5882, 4716, 1132, -2833, -5693, -5550, -2747, 943, 4570, 6023, 4419, 806, -3179, -5437, -5353, -2716, 1497, 4900, 6054, 4314, 730, -2965, -5405, -5203, -2365, 1515, 4631, 5749, 4024, 294]
1616B94l842j934M26K957L892K673R54j753l446l910j558M35K790L845L260M11
1632E494k130l538l479j727R30K897L604K603O35j910m081l144j531R51L094L567
1648B235K492L54k216l583k947j583J045K880L765K445J12k666l217l228j078
1663e190J225L045L653K318k61k666l223k794j237J522K979L185K491n39k486
1678B022l412k539r97J349L268L466J688m34k250l504k797p41J465L189L471J635
1694D879q60k453l279k363o27J742K988K965J871o85k547l574k165m66J785L100
1710C11K878J382r36k301l377j917l63J812L020K679J591r17k855l000k398L33
1726d058J860L041K581R68j178k518l158j739N4J901L338K449R97j206k890k925
$$ y = [294, -3548, -5482, -5056, -2099, 1793, 4466, 5420, 3667, 221, -3689, -5247, -4812, -2022, 1823, 5083, 5494, 3364, -174, -3653, -5380, -4450, -1553, 2051, 4654, 5289, 3379, -702, -3846, -5377, -4426, -1332, 2235, 4727, 5081, 2865, -718, -3665, -5248, -4203, -1323, 2442, 4887, 4999, 2333, -884, -4112, -5190, -3965, -920, 2733, 5051, 4790, 2124, -1099, -3893, -5130, -3608, -629, 2556, 5047, 4508, 2022, -1390, -3929, -4926, -3577, -309, 3157, 4845, 4411, 2161, -1343, -4140, -4881, -3416, -227, 3244, 4879, 4019, 1566, -1713, -4076, -4703, -2961, 27, 2992, 4863, 4178, 1631, -1943, -4108, -4574, -2789, 311, 3189, 4571, 3635, 1334, -2043, -3960, -4323, -2511, 509, 3188, 4779, 3862, 1007, -1993, -4391, -4058, -2198, 843, 3424, 4392, 3214, 696, -2462, -4201, -4147, -2246, 1092, 3541, 4538, 3332, 442, -2483]
1742b483j577K26J561K985K748P59q65k873l115j636K96K240L062K518L35j283
1758B898k702k829j366K35K081L222K199O35j494k808k733j509P38K197K676K374
1774C814N7j450k323k986j224M95K590K785J903J66j340k988k520p34N04K373
1790h78K701J958J11j738k753k466j134J147K210L018J672q5k072k244k817o02
1806c972J094K127K719J916o1k052k629k235p69J187K260K521J595Rj901k628
1822h19k128j001J510K312K347J247j81j718k853j896l09J119K253K420J139m78
1838B964j861k548j542o40J204K617K259J198r57j754k331j888J5J023K518K309
1854B586Q99r37j503k391j991m1J902K230J975Q99q09k177k322j645LJ424K420
$$ y = [-2483, -4060, -3834, -2273, 712, 3460, 4219, 3354, 481, -2634, -4270, -3974, -1734, 1328, 3846, 4181, 2898, 196, -2633, -3999, -3764, -1683, 1539, 3738, 4373, 2879, 71, -2662, -4171, -3433, -1236, 1440, 3814, 3871, 2421, 98, -2888, -4112, -3617, -1027, 1758, 3661, 3827, 2487, -501, -3021, -3755, -3251, -878, 1823, 3781, 3892, 2154, -599, -3065, -4199, -3052, -842, 2176, 3848, 3763, 1691, -553, -3370, -3972, -2878, -751, 1968, 3884, 3823, 1771, -858, -3093, -3862, -2675, -415, 2106, 3701, 3710, 1809, -819, -2947, -3948, -2438, -126, 2221, 3468, 3287, 1569, -1284, -3180, -3489, -2370, -117, 2303, 3442, 2964, 1103, -1445, -2987, -3627, -2423, 194, 2453, 3651, 2694, 940, -1391, -3279, -3264, -2241, 277, 2586, 3485, 2548, 1045, -1346, -3337, -3378, -1476, 754, 2729, 3628, 2819, 642, -1680, -3325, -3322, -1898, 522]
1871E22K098P62q68k046k444j487l9J786K237K208N62j045j907k103j375O2J796
1888a281K027K279N32j250k132k117j321M52J471K492J557P85j156k156k136j161
1904c115M87J281K552J450M82r58k089k159r77L42J595K066J480P12j136k218
1920b05k043r08N82J990J899J358J44p40k357j768q40O14J519K204J728K4j543
1937A658j903k071n44O56J701J815J337K72j523j841j757q80R57J478K183J489
1953C027k87j315k015j643o39O62K009J725J009J88j599j785j894n11R37K202
1969G1J567J116j57j683j859j218m17Q96J897J144J649l55j636k059j258l55R02
1986a755J878J825Q50m56j617j832j391m81J551J583J812P82l55j595k410q69
$$ y = [522, 2620, 3382, 2514, 468, -1976, -3463, -3502, -1716, 521, 2729, 3291, 2246, 339, -1764, -3139, -3077, -1281, 746, 3025, 3557, 2307, 175, -1942, -3263, -2811, -1340, 1152, 2709, 3494, 2338, 182, -1954, -3115, -2628, -1347, 1205, 2655, 3137, 2179, 90, -2069, -3046, -2704, -1109, 957, 2437, 3149, 2013, -205, -2248, -3156, -2574, -584, 1315, 2673, 2817, 2077, -280, -2048, -2888, -2274, -755, 1449, 3177, 3201, 1658, -245, -2316, -2860, -2204, -503, 1312, 2649, 2921, 1398, -443, -2200, -3080, -2123, -645, 1538, 3027, 2740, 1425, -590, -2233, -2872, -2210, -201, 1524, 2533, 2721, 1122, -663, -2557, -3068, -2131, 71, 1638, 2754, 2597, 914, -945, -2163, -2580, -1684, 213, 1357, 3006, 2651, 1015, -1044, -2302, -2657, -1755, 123, 1948, 2798, 2342, 725, -1107, -2498, -2979, -1428, 155, 1967, 2749, 2394, 799, -1611, -2480]
2002b480L2J038J663J796Q36n40j976j453j554OJ156K009J572N53n39j732j660
2019a273j193Q4J345J500J605M32l72j963j668j154L16J377J329J694O71r59j789
2036a8j307j050n5J287J789J750L31r91j815j546r92K26J526J889J291J83j011
2053A487j491j759n92N02J343J646J312J05j137j563j448q17J98J568J524J428
2069B306L52j271j752j581l65J57J519J896J024j58o16j712j678o51O05J330J956
2086A361J127k55j069j780j376m57Q33J284J558J050j52j041j569j698j12O14
2102a682J692J198J003N9r76j934j244m64P19J560J454Q78m52r21j614j203n75
2119b502R60J587J537L29L4j337j673r67l06R28J467J414O78l81j096j727r55
$$ y = [-2480, -2448, -1410, 253, 2049, 2885, 2345, 369, -1084, -2638, -2632, -1476, 533, 2105, 2658, 2119, 387, -1273, -2466, -2382, -1037, 463, 2068, 2500, 2128, 165, -1503, -2657, -2341, -964, 365, 2059, 2730, 1771, -18, -1325, -2375, -2430, -1143, 646, 2396, 2727, 1736, -79, -1625, -2617, -2391, -865, 1024, 2315, 2498, 1487, -4, -1763, -2355, -1853, -510, 1136, 2448, 2553, 1416, -147, -1595, -2412, -2214, -646, 878, 2306, 2658, 1387, -365, -1946, -2311, -2154, -635, 1261, 2285, 2127, 1511, -201, -1879, -2530, -1925, -595, 1361, 2488, 2233, 1164, -616, -1992, -2449, -1616, -332, 1226, 2276, 2124, 1083, -486, -2184, -2296, -1682, 10, 1208, 2211, 2270, 1294, -640, -1884, -2348, -1629, -69, 1385, 2263, 1811, 890, -724, -1927, -2502, -1542, 45, 1582, 1911, 1945, 608, -1065, -2032, -2338, -1410, 57, 1471, 2149, 1768, 672, -1055, -2010]
2136b010o6O51J781J193O29l87j081j558r71j73Q40J405J483M87o35r68j773q88
2154b041j55J053J711R82L48j01j192j685q44j19J004J325J366L96l79j707j355
2171a393n02j49J318J264J237O45q72j425j190q01L50P30J476J136L87q94j305
2188A2j439n41K45J082J213J200M99p75j523j238n25K33J206J186J000J19j014
2205I40j003j357o52L78J170J467Q05J96j031j299j017k72P0J338J186R27J54
2222B000r25j380j294n95M27J281J550Q23k35q53j350j040n76N69J413J328P19
2239A862l1j269j154o74o23L82J295J391N78l32o35j440j038j83N54R27J699N01
2257A810k75q40j324r13k63N55J196J142O50k83q62j333r78j13N89J432R53O16
$$ y = [-2010, -2076, -1425, 356, 1549, 2178, 1791, 710, -848, -1819, -1992, -1152, 253, 1736, 2223, 1588, 620, -1153, -2041, -2196, -1143, 568, 1550, 1898, 1797, 605, -1080, -1924, -2043, -1039, 286, 1652, 2048, 1669, -38, -1393, -1895, -2044, -726, 538, 1775, 2420, 1548, 123, -1067, -1868, -1518, -788, 688, 1824, 2211, 1317, 12, -1427, -1968, -1723, -641, 572, 1772, 2271, 1496, -27, -1265, -1790, -1557, -351, 835, 1835, 1954, 940, -63, -1420, -2072, -1694, -524, 943, 1748, 1944, 913, -386, -1403, -1675, -1605, -267, 919, 1846, 2000, 1075, -305, -1599, -2194, -1767, -486, 1064, 1887, 1652, 799, -551, -1591, -2167, -1598, -185, 1143, 1862, 1831, 562, -592, -1266, -1889, -1507, -212, 1179, 1757, 1425, 790, -650, -1688, -1871, -1317, -390, 1309, 1810, 1535, 695, -629, -1542, -1805, -1250, -54, 1088, 1738, 1455, 593, -740, -1718, -1831, -1242, 190, 1143, 1759]
2275A759j55j009j401o14k17O25J105J307K97l27r13j396r59J87P76J229J126
2292A420L44l95j142j098p86q4R10J300Q04P08n71j366j123o80J49R22J324R43
2310A579K85p86r22j280m59j11J179R63J183L9o75j185r26m44J03P71J391O85
2328A390L78q30r37j052n71J38J034J106Q31J05p89q54r90p62M44P17J313Q03
2346A474L21p98j187j180k74K36J185J031M20K07o53r47j090n61L96J190J003
2363G73R47J2q80j238q42l66N40Q61J293L96K02j147r63j005r1K72J127J153L28
2382A372J64j311q19j024K3P53Q34J001M93N5j097j183p95R1O44J064R38M65l69
2401A299j034r37q07pN79Q52J120O31l03o33j492q06L0Q26Q99J097M83m55j093
$$ y = [1759, 1604, 595, -806, -1420, -1637, -1012, 93, 1400, 1697, 1370, 457, -939, -1898, -1711, -935, 294, 1420, 1764, 1369, 227, -871, -1657, -1741, -831, 469, 1273, 1981, 1410, 44, -1079, -1759, -1610, -688, 636, 1579, 1864, 1078, 156, -1124, -1583, -1694, -515, 448, 1631, 1670, 995, -190, -1116, -1560, -1457, -686, 705, 1390, 1768, 938, 1, -1051, -1622, -1484, -450, 656, 1487, 1592, 803, -51, -1041, -1803, -1359, -642, 671, 1474, 1795, 997, -190, -1370, -1644, -1408, -223, 808, 1228, 1435, 782, -165, -1255, -1816, -1420, -230, 773, 1720, 1732, 852, -386, -1228, -1594, -1054, -193, 1100, 1496, 1698, 551, -412, -1417, -1508, -1236, -109, 1044, 1372, 1536, 225, -594, -1618, -1595, -842, -8, 993, 1486, 1541, 444, -739, -1534, -1443, -799, 265, 1203, 1668, 1299, 265, -672, -1479, -1486, -907, -55, 1065, 1696, 1393, 760, -732, -1538, -1508, -682, 217, 1314, 1797, 1342, 249]
2420B49p70q29j90Q13J132J042J52n87q66r23r57K05R96R49O01Q09p04r43j001
2439h22r85O27K92J433Q56K92o44r78o33j057K29N84J252R54K02n12j197j118
2457a225r4l4Q54J100P50J43m68j220r38m21L01Q10J028Q34j82n54j073p47o19
2476a755M00J042R56O20J39l03j384j053P9K12Q00R95P34n1o96j139p68l72N44
2495a000N06J117P10k43j98j435p87j61M63P78J137N61j42p51j032p07l05L84
2513a105J066J014M63k33q42j016o80j16M80J000Q88O10j84p52j089o15l45P66
2531f90O37J134M8Q0q54j087o46m4N85J156M07Q52p08k88j250o77J8N61R31J150
2551A315K94p47p30j105k76n9N55Q95Q43M84l13j155n51j001K58Q34J000M20N70
$$ y = [249, -521, -1350, -1540, -727, 405, 1447, 1599, 1012, 146, -777, -1734, -1529, -533, 416, 1017, 1826, 1122, 179, -822, -1807, -1180, -888, 545, 1401, 1693, 1049, 71, -562, -1619, -1390, -806, 446, 1400, 1602, 1090, -107, -1225, -1319, -1353, -499, 601, 1351, 1494, 1026, -194, -1132, -1553, -1252, -442, 586, 1420, 1238, 684, -389, -1136, -1755, -1355, -313, 643, 1263, 1402, 1099, -285, -1338, -1259, -1047, -247, 748, 1482, 1431, 735, -404, -1172, -1544, -1000, -494, 623, 1333, 1090, 892, -543, -1330, -1491, -1028, -250, 887, 1448, 1306, 555, -477, -1184, -1489, -1105, -39, 975, 1438, 1205, 363, -653, -1333, -1449, -969, 31, 919, 1529, 1345, 593, -496, -1111, -1456, -690, -53, 1081, 1129, 1209, 355, -732, -1378, -1422, -837, 319, 726, 1578, 870, 582, -668, -1345, -1327, -766, 165, 1315, 1609, 862, 132, -973, -1249, -1308, -753, 142, 985, 1469, 1156, 1, -550, -1551, -1293, -459, 541, 961, 1531]
2570A531l52r38j086l93j42R18R71O10M7k55j119o28p25N81K81J037P64K15m93
2589H24q40q12m68K23N57J060M78j14k96p15o10p44M08O39J060N42K69o33j148
2608c20p50k93N87L03R39P78p4q34o18r11Q9R8P86J083L76R4r20p24p78l02N83
2629h08O50R82L42n2n18j049q67K64O0R47Q21M01j94m48q10q29q7O8J222O98M32
2650A225J38j115o47o30j20M62O88J204q0k33o24o51p65j84P62Q07N12M39p2o84
2670D32j071m04r2J53J275P27K42l13q00q35l89j74Q45N55Q68M46m66o82r40p53
2690a376J09P74P28R93m8l20n92j035n56K65L51J256N46L7l06o92r66n70M17N81
2710d04P38P06K10m85q42r50k1j34P91O90N35M70o48p41r68k9OM62Q45P48M16
$$ y = [1531, 1179, 241, -845, -1238, -1380, -462, 509, 1119, 1166, 911, -208, -836, -1561, -980, -699, 338, 1102, 1317, 824, -16, -828, -1296, -1073, -516, 544, 1022, 908, 612, -103, -713, -1457, -1049, -410, 650, 1192, 1461, 828, -320, -1070, -1363, -776, -473, 466, 1244, 1170, 336, -282, -1193, -1104, -1006, -220, 863, 1239, 1333, 413, -311, -1089, -1391, -808, -158, 824, 1166, 1114, 596, -453, -1320, -1056, -996, -49, 772, 1173, 979, 531, -279, -1108, -1195, -1127, 95, 793, 1225, 1363, 248, -399, -1029, -1149, -687, 1, 1205, 1125, 892, 268, -383, -1148, -1332, -570, 237, 749, 1188, 1116, 432, -639, -1043, -1135, -982, 293, 1020, 1262, 949, 149, -686, -1075, -1249, -404, 151, 1019, 1465, 999, 317, -623, -1376, -1267, -493, 235, 1228, 1180, 860, 268, -767, -1323, -1058, -707, 549, 1095, 1132, 826, 134, -832, -1402, -985, -404, 334, 1040, 1250, 765, -77, -1027, -1048, -1182, -391, 299, 834, 1304, 656, -85, -1053, -1082, -1076, -614, 231, 979, 1395]
2731A395p82r37l52o44N17L01P99P35R7m26j148m43l23L54Q85N60M65j0n20o52
2751a29r20q8L70P14M71R06j39n39n96r50k04K53J082M27N32k4n67j093m47q1
2771a022K80O45O36M20J52p56p47o80l5P88M13O58M12j35p74p70m44j34M87M31
2791a75J081K2P3m97q90o56PJ35J126M29M20k23l11q62p67k76Q88Q21P18K59n03
2812H19m63r27l42lM57O92M56O2J08o74q14j77j59N18Q63N85j06l45m72p23l16
2833i61j17O93Q13K85M47l76r28p46p8J8O74M17R28k85O2r06q39k18N16L54O87
2854D40N01l1n31n74p49j56K02Q86M42L71K98n45q64n95j69L78O20P32K37p5k67
2875E51o78o53l16M97N32N13N17n0l56q16n68k2K10O16P26L36l65l4p40o25k23
$$ y = [1395, 613, -324, -676, -1320, -803, -502, 297, 1032, 1129, 703, -445, -888, -1211, -857, 28, 588, 1053, 1043, 523, -129, -1049, -1137, -767, -53, 418, 1324, 1185, 646, 50, -900, -1104, -851, 231, 658, 1190, 1166, 599, -494, -941, -1022, -742, -97, 539, 959, 1111, 355, -392, -1072, -1107, -319, 94, 752, 1164, 1029, 255, -515, -959, -1093, -606, -175, 906, 928, 1001, 504, -386, -1042, -1035, -900, 226, 655, 1075, 852, 541, -321, -1088, -1364, -476, 345, 1063, 1322, 819, 356, -571, -913, -916, -459, 233, 689, 751, 859, 185, -629, -806, -965, -447, 416, 1001, 895, 550, 78, -645, -961, -1078, -385, 428, 713, 1160, 784, -144, -890, -968, -950, -276, 141, 1069, 784, 846, -60, -899, -1117, -601, -247, 440, 941, 910, 379, -195, -944, -1100, -898, -12, 430, 801, 1099, 554, -310, -905, -1074, -696, -76, 656, 893, 818, 551, -127, -780, -1096, -599, -67, 446, 963, 913, 557, -259, -827, -849, -639, -23, 703, 1039, 674, 640, -100, -725, -948]
2896i48L33N08O67L87J14p56q78p8l11J18Q01N12N10l01m94o30m80K32K02P12
2916B20N56k2P2n52o33l97j86N28M82R97p7j90p14n64m17j9N33M96P75l06L57
2937I39q92m48o81J9O73M37O78K4j3n13p60l46j01N89L39O77K78j98q32m93k6
2958f50j01L19O59M72J89m82l58p67l35O4O71Q25K05J75l54m64q23j17j17Q24
2978a65N92%N11o65p80k32K3K10Q4P70L94j22j97m40o60l92L82N39P31L34k1o19
3000B77m93n48k78J85N49R40K46J60j059m55l05k0J8N98O29K69K7m63m90j80n79
3021i72L59Q03J62M67j44n68l63l02j99K00N19O99J91m3o06m33l68k23J87O66
3041C2O63Q7Po66o01k76M7K28O04M85K49l23m77n09l97K7O20J86R17M4j36j004
$$ y = [-948, -615, -107, 560, 947, 1061, 305, -573, -651, -962, -844, -43, 469, 979, 678, 184, -446, -926, -694, -492, 220, 776, 754, 826, 274, -359, -756, -942, -414, 68, 1065, 988, 798, 84, -480, -897, -916, -383, 113, 888, 582, 939, 47, -401, -1082, -1063, -390, 47, 725, 749, 736, 223, -537, -883, -984, -395, -56, 621, 899, 701, -131, -624, -650, -751, -432, 227, 699, 888, 406, 48, -719, -1054, -990, -319, 506, 711, 886, 532, 68, -755, -872, -989, -165, 427, 427, 938, 273, -507, -739, -716, -506, -422, 348, 742, 620, 423, -17, -677, -1069, -687, -148, 583, 917, 896, 277, -216, -764, -1042, -857, -308, 632, 878, 1038, -21, -476, -781, -801, -783, -185, 444, 713, 740, 277, -213, -393, -972, -613, 190, 352, 819, 675, 107, -256, -558, -757, -557, -38, 661, 852, 809, 203, -230, -598, -821, -634, 32, 695, 782, 789, 123, -478, -754, -707, -479, 125, 610, 859, 536, 59, -450, -847, -820, -200, -14, 903, 947, 811, -193]
3063a93j19k70p3N65L85O34k20k34l93m97l68J64J59P26K36K05m1q31m02l5r8
3084g00L90O64K75K39k82p09k43m76K98K93P39J24ok69k79o19J30jK56O08J1L33
3106G76m41k26p18o9K4P86K01L54j19l14l66k00l62J75L80Q05m1M3j40p76l02
3127e30Oj20K98O42N77k55k63n85l20K22k7K56N72O50m20l97o34k42k8L6N00P33
3149F71k9m8k06p86l75P9L74L24L74M15m4n65m02k54j12J73N04J35O14m32j64
3170B46n69n56K85J46N88M92J8j29l40m59o21K17N18K57N33J11k95l89n55j24
3190f26M8L39M00N04J03l77m33l58l48J78N66J2M52J46l81p6n74R3l06M86M58
3211C06M46k69L7l39o02m34L58M75R2M55p0j82k63o45K9K39M71J1N97Lm24n54
$$ y = [-193, -312, -582, -655, -90, 295, 929, 709, 475, 82, -415, -783, -619, -460, 266, 502, 707, 666, -165, -567, -602, -700, -310, 354, 629, 868, 586, -123, -366, -842, -544, -251, 488, 612, 606, 337, 58, -561, -431, -432, -176, 432, 443, 776, 335, 109, -609, -678, -654, 132, 333, 687, 568, 254, -112, -312, -674, -499, -119, 686, 645, 688, 548, -228, -530, -524, -644, -346, 296, 873, 618, 355, -230, -550, -328, -355, -99, 473, 1123, 703, 306, -328, -570, -598, -562, -62, 671, 642, 594, 388, -398, -773, -694, -320, 4, 378, 793, 749, 184, -218, -472, -584, -411, 93, 228, 842, 410, 246, -323, -879, -594, -448, 140, 632, 650, 521, 181, -278, -899, -682, -164, 93, 626, 737, 442, 53, -502, -626, -578, -239, 161, 665, 768, 391, -42, -400, -748, -570, -4, 8, 460, 606, 225, 149, -425, -332, -638, -152, 306, 752, 483, 520, 181, -421, -855, -497, -22, 70, 525, 455, 273, 10, -635, -606, -367, 104, 115, 712, 715, 291, -263]
3233b63j08k31J47K49M50K32R0j42n43l3o10K45L38N71M19j00m07l50l31j57M44
3254i0K97K00L59j47l44l83n37M6L45K16M12K90m01j33k85j74n8p6N16L58J06
3275E17kk40l44m91o5K82N46p1M40j60p0n62k87o5L09M09L12Q4q7m21j86k38j30
3298e20J79M71N41m76J93k94k85N6m71L73L76Q1K56l5m33p8m02o6K14M47N62m93
3320A96L0l69j36k08q3L38N40L06j5j13m83m00k15J90K84M26J39j76K3j87n70
3341d83j81J06P18m9K04L22j89k63o35P7o8K62M39L92j33l65k42j89l50J95K48
3362a84L68K06oq5m57l35p0J31K81N12J4l9k6n62k15j37K25M26K87J84q2j88l19
3385g1l50j95K70M04J62J95O4k52l43l86J81l6K23M88J33j70j78l40j42k65L31
$$ y = [-263, -371, -602, -455, -206, 244, 476, 566, 424, -119, -152, -762, -517, -179, 392, 811, 711, 304, -46, -377, -534, -90, 207, 407, 766, 619, 275, -108, -645, -599, -254, -38, 374, 664, 263, 130, -155, -329, -387, -463, 53, 411, 517, 515, 275, -69, -560, -625, -343, 203, 132, 572, 412, 342, -220, -507, -572, -263, 146, 458, 542, 455, 34, -152, -390, -520, -341, 130, 671, 195, 388, 94, -191, -135, -606, -233, 143, 224, 480, 445, 12, -66, -468, -534, -320, 127, 689, 196, 226, -143, -279, -487, -570, -232, 308, 614, 599, 486, 3, -397, -612, -422, -138, 288, 427, 251, 274, 87, -483, -664, -558, 160, 111, 315, 637, 448, 185, -450, -373, -441, -179, 260, 652, 519, 154, -88, -277, -627, -432, -184, 184, 390, 384, 299, -158, -493, -563, -432, -151, 361, 375, 336, 310, -252, -467, -604, -379, 47, 334, 518, 436, 248, -71, -421, -616, -346, 58, 220, 415, 479, 227, -116, -502, -321, -357, -134, 354, 487, 317, 139, -201, -343, -608, -277]
3406b77K29L62K33N0n02k36m63K30L28J06K12N9m7J48q22p8J21J25M33M1L10j97
3428C65l69m35M6k19L42L74K00j7j69k44l06l22J66O19KM24J27l54j06m49j0m6
3450c81j3M95M03k21j92o6k35j24o4L76R3L18J81k90o30j33J4j50O36J84L59k23
3472C37o2n40o1j81J51J91N48P0O2j24l73m85j19J96J49O30J12j44K47n32l16
3493b44l37J24L42K96K68j19k24l66j37J0R7L98K99n6%j88m26j28L03p8J90K62
3515B86R5O1k01o00nr7L52Q1L86O8mk38n86j5q3L19J86L33r4J30k42l41Ko5K0
3540b52J79O07j64L2n74j29l05J87J98L96P2L05j38m04k42l62M22O9J45L85J23
3561E50k9m25k67j15j21L30K23L89J5m30k2k80m52M72L9J07L57J16l44l12jk98
$$ y = [-277, -48, 314, 547, 597, 95, -141, -604, -374, -46, 60, 272, 331, 284, 432, -390, -468, -347, -222, 211, 252, 562, 365, -4, -439, -393, -612, -270, 104, 304, 287, 118, -126, -432, -754, -588, 31, 33, 457, 584, 230, 124, -325, -335, -381, -394, 101, 504, 283, 91, 25, -210, -334, -398, -22, 71, 389, 570, 280, -350, -483, -469, -619, 17, 201, 560, 337, 275, -265, -326, -507, -356, -165, 383, 453, 515, 391, 18, -467, -586, -390, -241, 389, 501, 357, 604, 72, -244, -581, -457, -115, 181, 449, 330, 106, -260, -397, -387, -290, 108, 407, 351, 351, 163, -263, -391, -88, -166, 24, 286, 381, 442, 241, -359, -364, -461, -109, -28, 358, 426, 422, 184, -402, -417, -500, -181, 5, 338, 244, 374, 132, -209, -207, -272, -252, -73, 534, 370, 402, -172, -301, -606, -419, -221, 175, 247, 552, 414, 10, -232, -594, -172, -103, 42, 427, 550, 521, 96, -171, -286, -407, -77, 146, 535, 550, 120, 98, -182, -634, -162, -123, -16, 341, 457, 113, -199, -200, -498]
3583d98J30kM45K05p0j96j03m76O2J70K93L42K13j11k60k10l86NL06L2N5N41P6
3606E63m13k33k00j59K22J30L04K00k1k13n37J7j27K76K84K84N3j37j00m22j20
3627c49l21L12L74J86M24l43j76j64l83J15L01Q7L29j96L96p44j03o9P4J77l0
3648a03N26J97l46k82j51l58R3K42N01LJ45l66j23k74j49K26J5K98K40L29q8o10
3670c5k04m2J13O8K64J94J53j60m38k11l0K19k0L47J96j84k28K09n26k33L06L11
3692F9j83L67L54o15o1l83rJ77J43J34N67l49k8m36Op5JJ78K74J17J30k55M9m69
3716b97j21M3N77Q5J2Nk72k7m34R6J5L1P37N9k52j04l23j74k07K3O23K35J4O3
3740D07l9m95j54m43J10O23J87J50j29m6m22o3k1l8L28K44K43l45K8l35k6k0P
$$ y = [-498, -368, -370, 75, 280, 210, 14, -89, -565, -503, -333, -40, 302, 515, 404, 144, -66, -452, -447, -141, -109, -54, 487, 563, 150, -83, -283, -442, -220, -90, 214, 414, 393, 180, -357, -340, -467, -191, 93, 377, 430, 293, 193, -229, -349, -670, -358, 16, 202, 626, 283, 107, -57, -440, -325, -24, 63, 392, 196, 592, -152, -255, -324, -250, -73, -103, 423, 620, 274, -8, -159, -517, -424, -182, 319, 322, 467, 101, -22, -296, -445, -219, -204, 94, 334, 663, 575, -35, -239, -281, -168, -100, 164, 358, 511, 351, -87, -298, -328, -109, -129, 218, 414, 230, 2, 211, -315, -548, -242, 69, -114, 253, 607, -8, -69, -452, -461, -284, -141, -7, 560, 211, 183, -253, -247, -322, -321, -143, 131, 248, 378, 123, 172, -297, -418, -375, 202, 287, 299, 304, 32, 5, -429, -333, -318, -287, 450, 509, 257, 153, -170, -344, -551, -528, 95, 330, 344, 407, 368, -127, -281, -724, -614, 9, 196, 346, 217, 171, -251, -314, -335, -373, -45, 199, 442, 97, 125, -210, -236, -256, -249]
3763b49N35K20r1j40j02j05p13J35L7O80K45k07Q8l03k02j11j18K15M35K77j19
3784D07m6k08m24r0J96pK35K08J81k18k99k18j37L23J02O8M17l21M6j42j76M6
3806e7j91N0L21L48k70K3k69l51m1J4L40N24P6m5l52J3m87J18o2K33K14N37k51
3829D35o22k4j40K08k19K86K99J44j39rn35N6k97N73j40N13q4J6l30R4j85n10
3851f10O30L7K80O1M5j94m96Q1k22j6K88L91p8J89k32k60l32K21lJ85L31M4Pk33
3875A14l47r3P7l4P0L41R4mk44k50Rj36PM53N24j12j56l45o6j82J68J71JK55L05
3900F20m28J14n76n0K24j33L30J60L45l72j68k23j26RM53j37L99l68M1J1n63K50
3922a88j08J12J51L19J8k84Q6k53j44r0L05J66R6L55j60k85j66j82l66N20M21
$$ y = [-249, 286, 506, 415, 275, 173, 68, -645, -510, -473, 207, 452, 245, 333, 30, -172, -283, -401, -186, 249, 526, 407, 361, 153, -271, -361, -165, -172, 63, 271, 452, 234, -65, -283, -420, -97, 5, 73, 490, 169, 215, 73, -103, -57, -248, -198, 123, 471, 201, 224, -45, -396, -437, -423, -83, 441, 517, 472, 120, 133, -354, -236, -298, -65, 149, 686, 435, -187, -211, -351, -143, -362, -76, 223, 367, 228, 219, -316, -260, -557, 16, -124, 389, 305, 321, -9, 85, -100, -610, 20, 57, 337, 398, 443, 249, -247, -166, -388, -404, -116, 275, 197, 386, 154, -106, -438, -217, -220, -35, 296, 340, 347, 114, -233, -326, -249, -283, -213, 128, 222, 218, -26, -276, -267, -403, -396, 57, 581, 469, 313, -32, -98, -280, -112, 59, 60, 315, 620, 192, 306, -270, -320, -96, -229, 101, 261, 606, 234, 66, -157, -283, -274, 179, 42, 441, 73, 114, 125, -438, -188, -296, -184, -33, 286, 304, 20, 106, -147, -291, -381, -76, 90, 186, 541, 381, 96, -70, -252, -618, -98, 323]
3943C23J22P2k84l66k70M8l8M34N0J22K86m51l7l14q4L39m2L54N4r0p1j95l07
3966c45M9p9L25L23m8J01j00o69K68j84P7L60Q2J50Q8k79m14J12k20J95M29q6
3988A35M26l69m2k96M9j94L22j06K54J06j14k93n5k25o0K36P4M95p8Nk55j04p6
4011a65J14J25l5L12N1l19p1k1l73K68M31l10J91J01o3k40p7j53n3J86K92P0K17
4034D78m8o23N7j25j32N49J69q4K02m48j4k23l76M27J39J87J04J18l49J7m96J33
4056c38M0L78P6K50j44P8j97n16Q7J49l35N53K73J96n43O1l98N4R3K6N64k03K74
4079D78l05m86Q8j34L47L41n9k9j34k53O5kk54K07L74K3p0O3r1k45j20l6K75M
4103D7J7J47K01k55k98m4l06L15K15L77q0j21o7k19l27j32K98K92K58m0j31L0
$$ y = [323, 445, 517, 233, -133, -403, -355, -393, 41, 91, 213, 499, 48, 11, -303, -387, -48, -90, 264, 318, 228, 157, -38, -345, -296, -375, -50, 273, 225, 326, 226, -443, -175, -359, -282, 78, 160, 310, 398, 119, -295, -183, -403, -208, 221, 135, 561, 192, 150, -146, -97, -291, 31, -75, 179, 285, 171, -122, -177, -402, -462, -226, -152, 343, 265, 270, 15, -89, -165, -51, 74, 39, 351, 402, 83, 12, -9, -382, -114, 317, 7, 198, 299, 236, -4, -81, -234, -287, -101, 191, 261, 478, 430, -193, -136, -261, -393, 156, 325, 241, 443, -5, -19, -242, -618, -191, -52, 135, 239, 357, 8, 25, -471, -338, -298, 80, 156, 406, 262, 340, 143, -373, -286, -137, -472, 81, 354, 550, 7, 68, -330, -276, -183, -157, 407, 204, 478, 173, -313, -225, -359, -12, 329, 270, 241, 107, -146, -81, -83, -337, -130, 244, 267, 197, 260, 169, -76, -196, -232, 43, 47, 64, 211, 412, 157, -141, -185, -491, -176, 39, 416, 336, 215, 148, -71, -398, -530, -232, 60, 318, 278, 147, 177]
4125A77l65q%l5L07Q6L99k91k77j11Rj32J63J29J78J46L9m24j78k59K03k41N21
4148C6K59o7j74j63m2j90L04p5K42J10K23m14n4o4k03J92J18j34O2K03kj5l44
4171a92l91M16K12K98j91J01l54K03r1l26K13m4M33j19N8j97o0l63o2J75J26M79
4193C24K1j24N0l07k17l2L2K76l04P82l05J7o65J88l04L67K45M1J33q8j41J31
4215A20l32p4j3r0N20J77j05l9k30k10m5L09j1K81m6M3j63k56l12J94L4J74Q1
4238GM84j61q1k43m02R8K11M13P2o0J01m02m76K67j79L20p8K85K90m29J6k68J4
4261b01j14L15J43K17j08r1k60j00Nj45K73P8L54J89o67j4K8o8r7K99J01Q0L39
4284E56l39j44p12L26PK69L04l8J3k44j09j67O5M3L21o6r7O8j77L22l02j77J55
$$ y = [177, -188, -196, -196, -231, 76, 162, 561, 270, -7, -118, -109, -241, -78, 51, 229, 375, 414, -10, -188, -447, -244, -485, 36, 295, 228, 54, -109, -151, -341, -37, -112, 130, 240, 463, 49, -5, -69, -272, -80, 38, -96, -34, 169, 167, 152, -192, -583, -167, 45, 343, 152, 253, -101, 102, 11, -315, -102, -146, 287, 168, 226, 29, -31, -394, -456, -281, -155, 324, 345, 221, 271, -36, -253, -285, -253, 23, -281, 501, 196, 213, -452, -264, -568, -201, 44, 85, 218, 130, -11, 120, -212, -286, -299, -389, 131, 308, 203, 164, -66, -276, -321, -12, -23, 258, 212, 255, 92, -164, -476, -282, -248, -74, 7, 491, 330, 249, 6, -396, -298, -87, 326, 398, 338, 439, 37, -439, -172, -351, -31, -109, 176, 466, 37, 53, -215, -201, -315, 0, 143, 360, 252, 161, -99, -199, -194, -339, -66, 12, 366, 555, -112, -126, -98, -166, -263, 36, 137, 217, 556, 217, 73, -639, -313, -306, -37, 267, 229, 242, -2, -111, -278, -213, -170, 151, 85, -12, 56, -121, 201, -101, -278, -123]
4307a23J23K56j08K09k54m44J1J46J2K57M1K0Q7n1o7m95J84L30k2P4l0J17m48
4330a75J87n16L33J10K49j87K73k43j23pj64L43l16N81k66K61J9m45Jl52L15l8
4352a60L11M2R1Ml41m0R5k82l6L55K43k08J89j08k93l3K7R8Q3J18J9J61k86j90
4376a41K7r7J34L21P0n8k23jk90RJ27L02QoO1L3k60n19L54qK50J12k16R0K33l59
4402d7j05j12K2K42K08j78K18k72k11N4j23K11J09J46j48L67k57k63J83k97K58
4423Ek52L47m9M64j03p03L36k24O8N6M66k97K0k80K73j54m7j36K53K94l5M0m23
4446h1O8j27j31K68M9Q5N9J67j03n94rJ9K75J35K26j18k65J11j72l8j52J43K55
4469G0M10k20J75m81j36J32l89Q6M15N21l37j84k71l1k09N1N11J92jOR8k38j12
$$ y = [-123, 0, 256, 148, 357, 103, -341, -330, -184, -172, 85, 126, 146, 233, 182, 115, -380, -196, 134, 112, 186, 156, 273, -175, 12, -504, -171, -61, 188, 1, 274, 31, -92, -99, -263, 80, -236, 345, 79, 340, 359, -86, -85, -437, -122, -160, 151, 193, 284, 288, -53, -93, 2, -280, -316, 39, 282, 74, 263, 155, -138, -171, -144, -46, 37, 155, 174, 335, 49, -141, -114, -211, -77, 244, 314, 256, 33, 32, -258, -249, -122, 180, 188, 182, 243, 276, 16, -503, -149, -157, 93, 205, -11, 79, 312, -47, -152, -264, -242, 0, 208, 30, 248, -24, -235, -181, -304, -93, 16, 162, 14, 381, 124, -139, 44, -253, 5, -247, 100, 51, 515, 412, -291, 45, -179, -111, -55, 411, 114, 134, -146, 127, -27, -74, -210, 43, 337, 302, 342, -81, -13, -140, -271, -3, 46, 131, 190, 357, 254, -340, -349, -330, -55, 80, 306, 188, -77, 34, -138, -176, -328, -185, 70, 480, 260, 435, -46, -182, -50, -439, -353, 62, 583, 246, 62, -209, -240, -449, -398, 113, 305, 304, 310, 408, 170, 58]
4492E8l29L05J86O1J94j70j59r7l62R5Q7P2R5J90p4j89Mk83J06K18q0j39M84j56
4516A17j60r2k2j11O7L84M4J84m7m05j9J33j50J88R4j01Q1j8j59j30q1j82K08
4539a77L6K63J90m29J34L4n27M5L32P8K55jm3l15R9k45j49K75M57k00L41j25j32
4562A96k37l7j79L29M6K22j20M9k07k70K02lk91L71J91j31p3j77k0j48J11N1K15
4585I0L30j82o3l61q6p9K47K45k77L64l9J61k77j72l41L08P2J71j92K80j80k38
4607b19J09K9n0J29k3K20j67Q4k35j04j37j8L70K36k4o7k29K13l91M4L74k07J76
4630A13j33M12l80j32j77L05n9L20j62K93j25Q0l54l21Q6J45J15R0Q7M5k23j19
4652i4p7K6N6J44j41M27o9l62r4k17K56K34o1J87J26m38K62l90J23r1L22r0k5
$$ y = [58, -271, 34, 220, 281, 475, 305, 146, 49, -313, -218, -131, -59, 36, 226, 152, -37, -33, -316, -210, 8, -72, -211, 273, 117, -43, -135, -157, -268, -201, 183, 227, 411, 364, -41, -60, 73, -77, 111, 205, 104, 185, 167, 8, -122, -203, -385, -177, -141, 122, 312, -117, 17, 51, -476, -431, -99, -21, 234, 233, 190, -125, -26, -271, -420, -145, 312, 112, 453, 328, 196, -41, -78, -257, 72, 118, 340, 220, 269, 62, -208, -6, -9, -300, 71, 262, 131, 58, -119, -139, -287, -176, -125, 90, 420, 238, 175, -186, -272, -351, -104, 141, -136, 228, 189, 350, 73, -99, -440, -132, -60, 111, -81, 199, 19, -219, -110, -81, -131, -2, -25, 195, 28, 112, -123, -227, -364, -382, -12, 224, 200, 133, -96, 117, -274, -230, 144, -63, 113, -20, 392, 12, -120, -297, 8, -51, 269, 107, 400, 275, 355, 1, -320, -234, -89, 26, 116, 203, 248, 25, -94, -171, -145, -89, 55, -86, 341, 272, -90, -184, -401, -145, 89, 28, 215, 341, -97, 165, -225, -102, -193, 129, 39, 14]
4675A4P0J21l47j12K8J4J34K5L05k4o5k64j92j6j04L40m8K48kj44j32o2OK56j79
4700a30L15j07q1k6j12q2o1N29r5J7K2j18p0j28J07k08p9P4M56l37L93n1j52k39
4724a63k80J84K75j1j03N04j62l28j09j45J81J42lM29k98p6j14j68K62j45jK22
4746I3K06k20j17P1l59k45L89K93j13M8LR8j56k05J98j51K13PO4%L3j44l80K99
4770g5oL59k93K93j65q6j33j94J75J8J94j32L02L5l04L8k93L46k59J38M77j91
4792B44m19N3Q9n0k17J91L31J69k62p9k57K03k06J23J12K3K39j29K28o01l4J8
4814b31k48N18q4K10q8l8p5k09K36jJ8L20j09J05m00J64q9l16K29k19P36l16q6
4837B7k9J20m14k6K47Q4K10J61l92q5j49P2j24K53J37R0o2Q3l2k89j87O3K72N9
$$ y = [14, 84, 205, -142, -254, -226, -212, -78, -53, 252, 228, 163, -101, -293, -309, -413, -73, -121, 127, 125, -19, -151, -213, -207, 49, -130, 185, 78, -3, -29, -141, -223, -284, 245, 150, 167, 189, 71, 1, -127, -20, -228, -307, -233, 223, -114, 279, 228, 76, -163, -443, -259, 16, 5, -98, 406, 244, -84, -193, -338, -157, -15, -18, 411, 113, 37, -77, -245, 17, -128, -129, 93, 299, 79, -38, 33, -326, -571, -182, 111, -2, 46, 49, 147, -9, -214, -16, -167, 46, 53, 117, 117, 150, 6, -374, -75, -81, 278, -15, 278, 113, 27, -106, -300, -125, -107, 87, -45, 257, 292, -12, 26, -267, 79, -180, -42, 435, 244, -175, -122, -33, -83, -300, -109, 222, 391, 129, 50, -207, -4, -210, -87, 25, 48, 287, 158, 386, -215, -249, -231, -479, 39, -45, 165, 77, 39, -36, -245, -9, -10, 8, 328, 219, 324, -76, 88, -1, -317, -88, -307, 429, 113, 27, -2, 118, -296, -322, -75, 9, 219, 380, -12, -97, -246, -174, -298, -45, 92, 182, 120, 203, 171, -118, -305, -242, 30, 89]
4861H9P7J32j66j02r8l16K38L1K55Q1K45l74m0j05NL8r6M6L42k28j00N2k54j01
4885c49M57j93J96J19R9j44j65O8l09J55j8M1J66K18L9m12oo9j34M27j25K43M1
4908C45k75kp6k83Ql6M54M82o38J61l98j75J01L06K2J98K3p9K0k95o4j65j8L59
4932b5KJ24L4j3k84l4kJ15J2J69Q1j15r2l20J74j87L03J31K62k0m2k95k12J00
4956a34J1j02J62K94j26R9k19k09j26J72j1K11K81p9Kj55Nm39K04P7J64L41j22
4979C01k38M0j68j90P5J57M54l57K43l02QN1l02J46N9N2N7J16j01l62R0n5K13
5002a3j98P22k11k16M4n1n5k74N0J76J1L03o9r7k24k43N1P4K30j5M39k63l59j11
5026b99K54n24L58O8J56J70j34o6Jo6k93M39o5j80L32j60m4r2M9k75N33j40Q9
$$ y = [89, 166, 298, 132, 30, -68, -384, -146, -115, 140, 221, 466, 92, 52, -53, -48, -10, -106, -60, 282, 54, -46, 6, -248, -349, 108, -85, 111, 230, 329, 185, 20, 88, -221, -66, -84, -43, 123, 341, 380, -32, -38, -107, -241, 186, 61, 304, 345, 70, 68, -8, -291, -283, -319, 135, 617, -21, 140, -258, -433, -332, -26, -4, 194, 217, 138, 158, -137, -201, -366, -384, -25, -23, 101, 135, 122, -162, -196, -198, -83, -71, 98, 179, 64, -28, -348, -174, -361, -58, 73, 335, 315, 273, -22, -234, -134, -123, -225, -63, 231, 105, 204, -15, -224, -350, -178, -189, 22, 303, 224, 226, 71, 76, -363, -159, -82, 82, 423, 301, 63, 103, -65, -255, -180, -23, 431, 74, 317, 15, 23, 74, -228, -82, -23, 29, 86, 202, 101, -261, -171, -226, -13, -211, 511, 300, 84, 128, 77, 22, -252, -202, -26, -15, 288, 219, 122, -102, -345, -294, -220, 10, -5, 434, 171, -188, -299, -45, -569, -211, -143, 13, 183, 49, -17, -16, -82, -375, 64, -1, -181, 151, -9, -53, -145, -96, -371, 162, 22, 111]
5049A11O4K17m51j77K78j78j19L28O4K4j14jj2o0Kj86L30n5r6L34l0k88l84J73
5073b26J91L09j38M9nj11l99J62J61l8o1J01K57j60j54j12n8j04K98M4K19M4r7
5096A72m31K29j17N1J29j15J04L33j37m15j15K44q2K03K67j88n0K20l92j96K23
5117f3J3K95l51N38k08l22j11k39K81J32l8J95Q9j23q8N4l96K42j51L29q3J42
5139A37L26m68p0m05N52p7k00N8K13Ro5j38q6M82m96K47J97J15J2k04k93q7r6
5162c37Q2L76L7On5k06K26l31k3L52j11m1J77J44k95J77k74q9J45P6J92R0r8r3
5186A27l40K49j75K52j57M24k24j42j09J04j58J35Kq1L42L7j63j07j8m5k39K25
5208f1R3J45J91l79J68m12K37n14M81k0J86K6j90k66K63j08K16J56m8J16k66p6
$$ y = [111, 175, 392, -59, -236, 42, -136, -255, 73, 137, 161, 47, 46, 34, -26, -24, -210, 120, 65, -31, 303, 273, -15, -399, -226, -35, 274, 136, 185, 180, 69, -330, -168, -7, -45, -106, -5, 252, 92, -62, -174, -232, -336, -38, 6, 225, 269, 172, -259, -30, -147, -96, 33, -82, 22, 355, 218, -197, -312, -68, -150, 53, 320, 132, 82, 302, -90, -286, -63, -50, 245, -106, 432, 224, -98, -209, -448, -167, -35, -73, 122, 211, 88, 0, 54, -342, -100, -251, 78, -5, 137, 463, -5, -75, -480, 72, -5, -205, -147, 66, 75, 10, -128, -214, 268, -228, 19, 216, 331, 343, 139, -154, -241, -337, -255, 121, 158, 164, 109, -97, 129, -202, -225, 127, 16, -25, 152, 296, 1, 178, -96, -185, -40, 36, 228, 318, 220, 127, -213, 36, -139, 113, -44, 380, 156, 14, -95, 9, -149, -14, -12, -93, 249, 286, 123, 16, -2, -47, -286, -61, 32, 177, 368, -11, 157, -255, -18, -532, -51, -71, 115, 141, -49, -315, -52, -160, 56, 212, 164, 280, 14, -62]
5230f2J9K02j86k04q5K07L43l23J93n35K45J01q2R2J18K29k62j13l4l6k3N2J07
5253c7L3qK97K7o80R5M3K12JK24p4k72N67k72j71l94N24j36J7J28k58O6L3j78
5277b13n9J98J9K32M2J79m80j0J21j07j55K46RrO4k55K02j66J74J87m80K68L60
5300C67j56m05K19k76K69j43L21J3J25l80P0j40j12R3j8K55L19j63m01K40l30
5321b33R7K87p0O6j76K70k80O6q1o0k3J2L34M4k17j19o0J12j10k09M46M6P4J55
5345C71j96k2l08R6K24k3o9L7r0j80R4o2r6K01P0o9J87ork07j7q8M9L38QN7l64
5372g4J08j86q7K4J97j12L96j99p7P6k7k12qR8j70L91q2Kj30L2J09l17JK91P4
5397A18R6j42M6l55J55R3k34J54J39J79m31O9K02k00J99l56K96J61N1l10M8o4
$$ y = [-62, -43, 159, -27, -231, -316, -109, 234, -89, 104, -431, -186, -85, -167, -75, 43, 272, 10, -103, -137, -173, -196, -144, -37, -4, -12, 285, 312, -368, -273, -230, -18, -17, 207, 133, -139, 428, 156, -15, -409, 115, -21, -4, 124, -134, -68, -35, -213, -272, -74, -55, 177, 219, 398, -82, -92, 29, -78, -233, 13, 22, 13, 77, -178, 24, -142, 32, 219, -261, 7, 367, 211, -194, 25, -251, 18, -125, 196, 209, 334, -46, 24, -116, -228, -135, -153, 102, 421, 258, -143, 97, -233, -136, 151, 81, 147, -29, 241, -39, 27, -54, -114, -137, -125, 209, 253, 36, -83, -143, -31, -141, -350, 96, 142, 216, 371, 175, 153, -155, -59, 165, 142, 73, 110, 20, -160, -66, -128, -224, -23, 47, -22, 165, 159, 150, -57, -74, -162, -113, 225, 233, 290, -74, 34, -152, -239, -215, -18, -130, 266, 67, -10, 66, 39, -173, -181, -83, -253, 138, 56, 58, -72, -40, 69, -248, -247, 44, 118, 214, 72, 118, -237, -82, 11, -223, -69, 70, 249, -182, -113, 89, -111, 88, -268, 28, 189, 240, -70, -22, -86]
5419h6L02m63K5M76m82M26N3m71j46L09O0j07K58Q9k98J90l49L0m2KL49J20n1
5442A94k60j3kr5l0PL79j8m53K87K39k62o4j35K70j35J15J52n3j18j28J37j47
5465a33K02m0R4R2k30J06j86R8n6n7J75O1J06q5j76j73P3J07p8J03L57o1m6j98
5489E5j52k63K00J15o8K55m3J07j80M9n7k23J20J20o0J65J61k29k09M6p6O8K23
5512A24j43L81l32K34k50r1k5q1L14j40L55k85j87J51N5k00K5m8M08j04j99J42
5534A04l38J88k24L97j66L89q8k94l8r4J06K41n2J00Q7m23m5N4n2q9R9L90j68
5557H4o5J85l18K89j63j90J92l03L24J99R4M5m02k4J02L9N9J01j43n0J15q3p2
5580A5k68K05k10K80k90L07Rr5j40L91q5q1p8K05K96m85J24k47r6M13l07K56j11
$$ y = [-86, 216, -247, -222, 254, -228, 198, 251, -220, -366, -57, 3, -104, 154, 243, -55, 135, -214, -184, -226, -224, 125, 245, 194, -66, -79, -81, -176, -206, -199, 180, 162, -291, -4, 235, -27, -91, -226, 44, -91, 24, 176, 123, 5, -123, 14, -133, 69, 29, 123, 215, -15, 91, -95, 3, -53, -110, 65, 126, 232, 147, -29, -202, -129, -22, -100, 3, 360, 299, 253, 55, -97, -360, -160, -45, -113, 142, 99, 206, 26, 75, 18, -205, -85, 35, -25, 140, 301, 72, -137, -91, -167, -99, 124, -19, 362, 30, 264, 14, -77, -102, -183, 131, -9, 346, 61, -126, 25, 80, -120, -95, -143, 265, 161, -38, 104, -234, -46, -270, 127, -39, 350, 262, -32, -70, -164, -58, 183, 131, 231, 318, -105, -150, -96, -148, -237, -138, 252, 84, 19, 204, -114, 175, 12, -178, 14, -289, 35, 234, 328, 373, -29, -53, 49, 88, 147, 248, 105, 55, 170, 87, 15, -253, -48, -258, 22, -268, 39, 48, -47, -187, 204, 119, 38, -40, 165, 461, -24, 100, -147, -243, 170, -137, 119, 8]
5603HmJ91j1N9k11j03J93J69k56J98l18k18KL28PL47m38o5N7R8k02k1J53J33J27
5628B23k56J17j55J22j44r2m1L59k60K56o3K2Ok76p0k14N15P1o9j02J81j97L10
5651B43m27J00j54K55J14L9j59J2j67o4J38P2r5K37J4n3l78K40R3q9J16k9j7j95
5675a54M33k14l7k44L18j73L04K8q7N2k39l2k17J85J93J70k88J53K2l9j43j04
5697a13N0k03O93j14k29O8l44J76k01K60J10K62k53L0j47l90L16l07M27M6J64
5718C01j86j50j6r4p7J98N9J17nj54K08k52qr6k9J15K35l2j38k14L11k48L6N2
5742f7J59j21Q8M8k17P8k9m5K34o4Q6j01J21k57J60m47K40p0J68j4J2k49L41m6
5766Hj61L90k37q0q9L90j40j27M2l9J23k28RL92n4J05l01J30k77q2P1J04K21K09
$$ y = [8, 4, 195, 184, 243, 32, -71, 122, 291, 35, 233, -85, -303, -301, 27, 34, 381, -57, -122, -65, 33, -169, -190, -37, 96, 223, -33, 84, -71, 51, -93, -185, -226, 133, -127, 129, 66, 88, 94, -182, -252, -466, 49, 120, 51, -51, 130, -67, 243, -184, -84, -238, 17, 131, 170, 11, 23, -144, -208, -70, 2, -93, 144, 158, 105, -273, -33, 60, -29, 87, 58, 41, -154, 279, 65, 28, -216, 102, -71, 233, 261, 174, 226, -13, -45, -262, -77, 116, 286, -2, 151, 173, 134, -9, -113, -63, -266, 427, 313, 84, 152, -192, -16, -217, 43, 153, 415, 162, 192, 45, -345, -29, -336, 91, 137, 301, 115, -35, -51, -145, -222, -24, 35, 152, 147, -7, 201, -51, -59, -155, -184, -69, 166, 134, -4, -218, 93, -155, -119, -67, 92, -29, 59, 107, -110, -32, -61, -106, 128, 64, 150, 49, 170, -87, 73, -374, -134, -204, -36, -50, -38, -287, 54, 8, -153, 237, 0, -80, -169, 221, 81, -46, -4, -43, 80, -148, -139, 253, 199, 304, 3, 133, -144, -226, -155, -51, 170, 379]
5790C79k03j2j95J62k46J37j48R9M3O4R7k90J47j53K92K8M2k89k50O1L38j18j61
5813a76N5K56L07k68l8j08j71J22k77K13J47k1K81l19J12M0l78j50J78M22j27
5834A00O4j33j9K2k29L40j30J18j17J35m1j57n2m0L2P6K9K24j2j45j16j45K21
5857B5j23N5N9m6K33m9m1Q5k29O1K2K16J6l12L69n65K10l1p3N05l64l1j0j8q7
5882a23l8M12j52j09O5O4j66J71k76L46k55p3J38L4K57k39p7j30L4j81M13k62
5904a47qL31j92o1j09K13J37l67J13J12l15Q3K42M7K2j04Q8j30K51m1M4j59j12
5927f2n4J45j04k08K81j23J77r5O9M2k07K97j90J19j90J1L7l19K57J68k56L75
5949A70j54J91m8l19K58m30K59J39J4k22M7m5J39k7k17KM17j15R7N7j96j27N6
$$ y = [379, 176, 164, -31, 131, -115, 22, -126, -27, 16, 80, 177, -113, 34, -119, 173, 201, 243, -46, -296, -235, 103, -15, -176, -121, 135, 442, 174, 136, 28, -143, -21, -298, -85, 62, 41, 322, 3, 115, 155, -223, -373, -195, 227, 100, 164, 31, 12, 34, -195, 145, 15, 133, 16, 151, 110, -47, -99, -139, -107, -31, -2, 222, 210, 65, -51, -196, 25, -98, -43, 16, -30, 203, 154, 113, 198, -31, 30, 52, 268, 284, -28, 341, -224, -14, -45, -118, 387, 23, -8, -18, -36, -123, -161, 251, 99, -10, 55, 119, -47, 124, -152, 194, -61, -134, 4, 38, 295, 56, -21, -151, -117, -298, 115, -147, -155, 176, -16, -77, -186, 27, 164, -203, -90, 22, -293, -210, 32, 79, 101, -3, 85, -45, 206, 165, 209, 50, -62, -116, 29, -75, -283, -2, -125, 52, -43, 26, 68, -139, 158, -32, 87, -103, -92, -55, -374, -117, 51, -205, 170, 16, 207, 159, -160, 98, -332, -73, 66, 80, -142, -95, -140, -1, -28, -245, -243, 174, 59, 156, 213, 17, -110, -54]
5972e4o5L06k86K98N9l75K03j3J8l57L86j17K04P0nj45k01J03l42R8L45j38K33
5995B25m57L02k99K83Km19M61j32J18j33J48k5l93K83l8J55m9j84K02j01j1k17
6017b79K50Nn0L5K34J06k65Q1j87o3O7R8L45o6k13N4k44K3J04j53K29k70J12L07
6041B60m31L4P0kJ33J81p3K31k04o18K80J55j33K27j12M4J14j14l44p4K81J19
6063B4K4o9J73r2j43K07j94j26RJ59K51N1j72r1r5J34q6N9J15j59J64j42P1n6
6087A6n5M5k34P9L14J9r0l22M45m16J69r7K88R1Pp3j6k45j66P3JO6J18l5K37k43
6113b4K18l52J00J16k48L22M3k41J84j71P5r5j0R7J26j70l5J39j85J48P4J0j82
6136f1K61L8j53p1j48m9K2P8K21r2l0r9P2O6N0j09r6R9l8K29k6j16j24J51j72
$$ y = [-54, -119, 187, -99, 199, 258, -117, 86, 73, 91, -266, 120, 3, 207, 277, 272, 127, -74, 29, -313, -215, 130, -8, 225, -232, 70, -229, 54, 56, -363, 98, -34, 84, -49, 99, 74, -319, -36, -74, 81, 32, -152, 50, -51, -62, -279, -29, -24, -74, -39, 195, 301, 36, 117, -70, -133, -66, 32, 377, 311, 98, 152, -92, -69, 35, -118, 111, -159, -47, 260, -171, -137, -67, -69, 64, 245, 172, 403, 199, -419, -139, 16, -117, 110, -2, 42, 156, 42, -302, -376, -95, 24, 48, -21, 152, 60, -83, 124, -70, -196, -187, -28, 223, 274, 102, 11, -84, 50, -36, 23, 138, -21, 143, 1, 72, 16, -39, 6, -228, -149, 165, 184, 94, -228, 217, -199, -30, -127, 161, 252, 259, 186, 170, -75, -241, -168, -167, -101, 17, -18, 219, -24, 194, -158, -58, 58, -190, 132, 175, -66, 118, -53, 22, -73, -83, 14, 140, -30, -65, 74, -111, 37, 111, 121, -61, 200, 238, 85, 14, -134, -183, -161, -83, 138, 46, 16, -83, -11, 55, 105, -4, -100, -1, -39, 190, 164, 48, -76, 75, -97]
6161i7P8m2K98j69M5M2k20K62k82J72M1O9l1k86L03j25k50J28J06o6j32K37k78
6184a97J26j44Q8n8J97L2lJ68k16J01q7k18Pr8M51l7J52k85MJ63k61K19m0J4o
6209G2M3J80k80j23J15o8n3K73j02K74k70o1P4j48n1K90p4K76k89l9J58l46J85
6232C6J28l63K43n6q2K61Nl29J24J75j52J64m3j37Q9K7M7j97J03k19K06M23l54
6255I9j02q8J48k40j35M04m5K08j38j70J75q3r6K13l0M3j0j9p1k47Mk40P75k62
6279I3L4K4j52Q8j21J8J24j19J27N3l58J32M4K3j66j30J61K55J77l40J14%J4j94
6303i9J22j5J29l10K60M3r5j35P6j74o5N99l10K09j84o5k85N0P9J17Oj51J2L08
6327A22k90J11n3K4j03N7J69K6j11J15J5R8Q5l10j5P7J18m03L73l99K75MK8K67
$$ y = [-97, -19, -61, 237, 68, 113, 155, -65, 197, -85, 87, 128, 197, 166, -120, 183, 58, -192, -64, 42, -24, -156, 81, -197, -71, -215, -127, -185, 12, 44, 41, 209, -7, 94, 7, -211, -204, -302, 149, 112, 264, -21, -17, 146, -115, 104, 64, 78, 72, 115, 295, 15, -108, 7, -61, -114, 159, 57, 331, 61, 0, 74, -74, -125, 165, 91, 367, 78, 39, 197, -149, 36, 164, -199, 44, -12, -94, 167, 172, -157, -33, 142, -10, 154, 111, -26, 63, 90, 137, -60, 43, -176, 30, 453, 99, -3, -91, 57, -183, -318, 86, 41, 249, 111, -59, 116, 33, -63, 150, 120, 163, 153, 134, 63, -184, -180, -420, 355, 93, 127, 151, -1, 87, -34, -16, 108, -11, 116, 169, -189, -57, -13, 10, -156, -286, -125, 130, 307, -33, 81, 81, 95, -99, 23, 8, 137, -173, 87, 130, 35, -100, -24, -198, -263, 336, 26, 235, 51, -14, -299, -249, -170, -53, -47, -198, -186, 122, -168, -57, -110, -86, -189, -132, 37, 63, -48, 67, 82, 180, 265, -45, -60, 17, 135, -268, 105, -294, -19, -15, 13, 280]
6351B80k68K65l63R7J04j25k65M03J9j12J05k07j46N2K04l22L12K84j06J3k34
6372a0j38nL4J12r4K15o1j6J49j99n4J69M0j25L22k26k2k62k08M34k62J46J7R1
6396D7K30J13l75K0j42J23O1q3J38M0k34J43k11M5J6J60%Q8q0j42J99j80r3o8
6420a85J0Q3m0J91j01j05K30J00k85J11P8j51R7o9q7K01P4j3j26J4q3R1L9j01
6444b7J91l5O8l45J71nJ4j34lQ2k8J84k54L9j3O1m11N90j18q7m0j49M04r1j52
6469h8L6j48Q6J21r5N4m0j68K91K08m60L02j54l6J68L6j99J89n1j07L23l50J3
6492f9J72j44k7M1J65j55J63OJ64m20O6J42J94m88L15j41m6K38j02J39K5p6k20
6515e8kJ04J6r4j66K45n4k2l23K36M7j23L51j18J74l63J88kk27r7K01J33K41m54
$$ y = [280, 12, 277, -86, 11, 115, -10, -275, 128, 147, 35, 140, -67, -213, -161, 43, -279, 33, 317, 211, 224, -10, -148, -153, -119, -7, -101, 114, 53, 37, 186, -13, -67, 102, 142, 17, 339, 113, 91, -171, -379, 55, -207, -61, -44, 47, 277, 390, 15, 35, -107, 16, 77, -6, 132, 172, -62, 81, -130, -85, -69, 91, 91, 179, 99, -43, 156, -24, -117, -185, -175, -92, -132, 59, -42, -147, 83, 183, -102, 9, 87, -64, 33, -36, -123, 78, 152, 139, 13, 27, -56, 35, 74, -27, 164, 129, 197, -148, 23, 18, 32, -102, -105, -23, -51, 133, -121, -82, -95, -34, -445, 145, 27, -60, -100, -249, 155, 64, -88, -52, -200, -114, 7, -88, -34, -74, -242, 49, 257, -203, 99, -55, -91, 77, 113, -86, 103, 52, -55, 268, -82, -69, 103, -41, -68, -27, 138, -17, 146, 152, 316, -104, -38, 104, 298, -190, 125, -16, -62, 176, 74, 213, 238, 162, -58, -60, 44, 60, -34, -200, 45, -9, -31, -354, -118, -71, -194, 157, 39, 213, -150, 38, 36, -191, -288, -87, 46, 287, -167]
6539a67J3J55J7J0p3j7R2Mj1m7j4q8j69K86N1l2k2M5k4J72k65o2j2N7J93M7k25
6566h6lM6M9O7k61N9J13J67o2mo5p4j51J97k6P2j36M6r1J76P3j24o3J60K8J38
6592B45k78R3P7m5r8k78K53K01k16P5R7m9K06k19k75K86rk93L34l26m5j1O0K30
6616A5O2J5j29L0r8J02J56n9o4j01J44k96J20J96J0k69j17K26J26L9j38J84l19
6639a65K62o7j56K8j22L80p1o6j28j47L8k3K87K23q7k58M3J17r4J39r9K8k5q8
6663e1K17J29l56m3J1j42K42J4o1J16J6k75o9n9J84J16L2K82m57K72o5P2k01N8
6687a8M5Q7P5j91J50n9j88M0l51N65k19O7LJ63k70j21M21m36N1J17J09J0j05J84
6711A29j89J0k26J55L53p5P3m57K62nPJ24l49Q1J28p3M1j94N04l12n9l35L67R4
$$ y = [-167, -154, 1, 18, 28, -45, -62, 30, 34, 23, -24, -38, -126, -295, -9, 42, 10, -12, 33, 9, 181, -84, -146, -158, -101, 92, 139, -86, -89, -43, 6, 73, -188, -129, -16, 151, 89, 85, 20, -54, -205, -8, -34, 38, -98, -52, -143, 33, 106, -18, -81, 79, 107, 245, -33, 60, 137, 92, -6, -284, -31, 170, -46, 29, 126, 77, 283, 64, -211, 75, 66, -227, 107, -219, -264, -275, -215, 15, 77, 92, -37, -7, -105, -3, 153, 94, 30, -71, 73, -223, -103, 93, 103, -166, -283, -57, 69, 108, -30, 154, -165, 97, 30, -126, -98, -220, 160, 89, 23, -105, -252, -214, -237, 50, 273, 186, -72, -29, 88, -6, 133, 34, 62, 37, -51, 166, 295, -61, -104, -93, -235, 7, 21, -40, 76, 92, -183, -252, -311, -127, -11, 21, 303, -154, 118, 53, 125, -76, -18, 27, 114, 189, -2, 148, 89, -99, -59, -410, 155, -64, 3, 6, 169, -101, -222, 199, -237, -186, -69, 40, 50, -55, 129, -60, -50, -276, -121, 232, 157, 230, -227, 35, 30, 37, 161, -188, -107, 21, -52, -11, -205, 299, -13, -72, -407, -40, 54]
6735E4J45j82k71K55j13l2J85k6J15k2J19l36K92j77Q5R6j6l10J73O2J1j60Q9
6758C6Nk31J66L5M80l67k80J22RK7J47k02O7O9n4p6K9N6k9j90L71rk20jn0J99
6784A09J5j59J99k64K92j63p7o5J4M5j78L85j49K03j64J30o0l03J42j72J97n9
6806h2K02j21KJ85l87K3J14P5M2o0n7J93l99K57J71j88J18k18J33J53j59k08J09
6829a02K1L28j79j63J47q4J58k34p0J26KJ23p3J97k95J52k4q1o8J64j38J14J23
6852A44l59J58j41J49k9O5P2o1J08j40n7j55J33k03R8K43RJ6j02o4J99j78oR9
6876bJ47j01k29L48k51o9K28n8l4p8J93j9R2k47K94n24K81J8J58J32k29P8l80
6899b52J6K96j07O4k26K97q2j7pN2j07K9o3J13K63L1k12j44k9J33j11K56n2l63
$$ y = [54, 199, 17, -254, 1, -112, -144, 41, 15, 130, 108, 227, -109, 183, 6, 91, 187, 171, -139, 34, 96, 107, -53, 36, 41, -190, -24, 11, 491, 124, -156, -34, -25, 2, 149, -53, 14, 83, 29, -47, -18, 38, 9, -181, 190, 181, -39, -40, -90, 109, 124, -35, 164, -100, 192, 29, -48, -113, -99, -54, -232, 153, 4, 207, 43, 173, 113, -190, -48, -220, -23, -82, 120, -1, 1, 186, -201, -178, -64, 11, 53, -7, -64, 129, -270, -13, 158, -30, 88, -130, 3, 156, -3, -211, -102, -81, 247, 68, -95, 52, -32, 126, -108, -178, -52, -50, 73, 0, 197, -98, 54, 30, -51, -119, 45, -93, 21, 144, -215, -57, -198, -49, -78, -13, 59, -2, 106, -34, -91, -246, -113, -316, -218, 25, 34, 50, -52, -116, 83, -95, -101, -2, 145, 44, -185, 163, -88, -157, 71, 13, -21, -99, 94, 75, 167, -80, 214, -310, -29, -11, 147, 279, 50, 128, -252, -236, 60, -47, 17, -209, 88, 6, -11, -18, 34, -73, -44, -107, 6, 269, 300, 88, -56, -85, 48, -63, 193, 141, -222]
6923b22K74j00P1j50m6J63R6o4O8Jj46J79j97k50L84q3O0j01J58r8J47k48r0k8
6947b22J95J3J08k05j30L05k43L39j57O9j90K97K23n82J34O1j1j7K92m15J98l1
6969C1r0M5k22K26j94Q4M43j50k42K35L5j72j86K66j36J85j96J51m9m2J68j63
6991B7K11l26K80j34Q6K7j0j70J45k48K75k11j8J45j81K88k23J21r0O9k56K51
7013E8p4m3K65k35j91K66k2n6J48k97J40KJ47n2k27J53K91l94K19j26k26L19q
7036E7L8j55kM8J42j77j27K26J9j76J60j07J64K15o22R4L8J37q0M05p1k02O9l47
7060b54L25oJ36L1k20m8j14J44j51K22J5m03K16J26K5K06o5l37J83L9k30J47N1
7083C8M6K10k76r8K13j23LK1K2J88q2m60O59m23M7L3J6J32j65n3K38l13M1J02
$$ y = [-222, 52, -48, 23, -127, -173, -10, 86, 22, 90, 91, -55, 124, -73, -323, 61, -22, 38, -63, 95, -3, 144, -104, -194, -222, -27, -14, 94, -111, -241, 64, -179, 160, 3, 72, -118, 179, 402, -180, -46, 15, 4, -13, 279, -136, 62, 31, -59, -14, -236, -10, -204, -120, 323, 173, -69, 166, 201, 29, -157, 109, -27, 158, -38, 113, 64, 22, 190, 27, 238, -88, 192, 58, 144, 171, 161, -9, 136, -112, 163, -48, -66, 79, -102, 186, -37, 84, -6, 63, -193, 58, -16, -59, 206, -29, -220, 46, 24, -32, 116, -181, -41, -39, 108, 56, -171, -18, 273, -121, 98, -28, -254, 65, 57, 95, -60, -62, -14, 128, -49, -176, 50, 69, -107, 53, -54, 110, 325, -297, -203, -165, -28, -108, 297, 226, 24, 93, -254, 71, 65, 201, 232, 12, -36, -150, -6, -157, 65, 80, -323, -107, 19, 44, 250, 185, -152, 31, 70, -160, -13, 38, 84, 294, 18, -80, 133, 10, 13, 34, 56, 244, 162, -298, 361, -62, -15, 18, 34, 166, 1, -52, 186, -127, -86, 16]
7107A6K18k06K24l91J05J6q9M4J72n2p8L47k94k34P1j31L09o4J15k3j59N8ko3
7131i1j70p7J72L59j27j72K92l86J27o3p0K17q0K2J79Q8j47J31j89j6j9K55k14
7154B1j28J35j22L6K9J10L8Q6k18m1L4j26k6J62k35L25r1j55J45N7j46M2J13k24
7178a79P9J35j5J12q0P8L2k46j18M9M7l14N49l1j33k4k76J61J35LJ97l27K18j31
7202g9j10L7L06L9j40J16j20L85m48j21K56k63L05j61o4K59j40k0o2j26k51M35
7224C3J4m3J69q3j21J2J26j40r9J75j72K82k95L70K5k62j62L74l08J65j36j79
7246b55J02j43k10M30R0m5K79j57M8k68j29K28J04O9j5j86J74K11m01J50j33K4
7268c3R2R2O4j16j90l6N9k7L05l72R8J92M08n60r7K03J3N4m20L08n7Nkj4K13l99
$$ y = [16, 234, 28, 252, -139, -34, -18, -107, -63, 109, 57, -21, 326, 32, -202, -131, -262, 47, -17, 98, 75, -84, -26, -28, -91, -261, -338, -166, 193, 66, -106, 186, -200, -73, -136, -206, 11, -69, -47, 132, 220, 73, 204, 15, -1, -20, 235, 21, -107, 28, -94, -58, -29, 81, 119, 205, -13, -54, -20, -146, -172, -10, -245, 80, -11, -166, -21, 36, -110, -68, 45, -179, -100, 35, 20, 132, 52, 130, 162, -84, -202, -153, -106, -420, 129, 98, -35, -59, -335, -174, -39, -36, 161, -166, 52, -79, -189, -152, 154, 193, 53, 169, 49, 434, -14, -135, 121, -142, 163, 2, -62, 197, 57, 37, -25, -151, -402, 33, 47, 4, 173, 90, -31, -19, 107, -33, -132, 43, -129, 153, -142, 228, 253, -9, -171, 203, -105, 60, -76, -255, -153, -296, -506, -76, 14, -31, 248, 91, 139, -129, -258, -30, 74, 143, 128, -58, 116, 327, -74, 76, -57, -33, 59, 151, 215, 99, -91, -127, -68, -95, 210, -162, -64, 128, 536, -24, -121, 82, 95, 149, -271, 37, -20, -15, -17, -31, 182, -217]
7294b17K37k39J61K36k01m4n8Qj0O5J46J09k63K32k61L6k6J5N8K28j34J20j18
7317H0J02k62K47l04k06m3O48j67k60J15K28q3k37qJ51P3k87K24M3K90j91j91
7339c8j12J4J61J58r0j19j11j72M78k36j4N4J91%j61O1j95K26j10K54l09Q2j04
7362i2J69Rr5q9J42J89k8qj02k38k15K83J96pl15L12k6j45K2K72m78L87k82J98
7386E9k44M00r9J28j20n84M70o0m3Q3j36L24q0l27L31j72K26l81M10k50k9K8j11
7409a77q6j3L40Q0J4M4k66n5J5j8J79P6l9k29M56m10k0K67L2o4k36L93m08K88
7433A63l57K46p2p8K83j22P2j37K06j66L5k20n3J08J28k12L15j67k10M06l19J37
7455a4K18Np3j56j19N8J05o8j13K54K2k05K92l54J44N4k34O8J0J64K28k85O5o3
$$ y = [-217, 20, -219, -58, 178, -23, -67, -125, -117, -127, -62, 84, 193, -70, 162, -99, -63, -89, -74, -16, 212, 78, 198, 80, 182, -80, 167, -137, -343, -386, 262, 95, -165, -50, 178, 95, -142, -150, 1, 74, -213, 11, 54, 344, 153, -38, -150, -136, 25, 183, 93, -26, -137, -309, 169, -67, -81, -27, 164, 164, 3, 64, -131, 95, -15, 239, -70, 12, -92, 77, 86, -9, -98, 44, 233, 205, 197, 95, -143, -358, -75, 121, 114, -201, 111, 85, -60, -38, 234, -244, 143, -139, 59, -185, 215, 116, 244, 124, -460, 10, -50, -93, -10, -146, 178, 98, -229, 102, -70, 156, -225, 185, -65, -94, -66, -177, -263, -276, 64, 144, 158, 202, -64, -119, -104, -122, 57, 133, 94, -135, 321, -89, -109, 158, 190, 126, -110, 283, -125, 163, -194, 52, -20, -98, 185, 63, 135, -2, 204, 38, 73, -147, -200, -92, 36, -176, 139, -28, -238, 168, -151, -14, 204, 209, 136, -20, -139, -81, 24, -44, -157, 97, 119, -86, 206, -148, -4, 50, -184, -116, -106, 58, 286, 1, 66, 3]
7479CJ47m3j13J5j48K19P2L8l78J72j45M8J57L33m47J85j29k50K26l00J62K44
7501F8J36p9n1j95K52j84k07JJ88k34M39j60R3l01M9r0K37p0M0o0L71l45J85r4
7525a1j49J8J66JM7K7j24O4J8J13l42L71j15M0o3l47J02M44l25k38L87N5m8p1
7549B0j31K21p9m12K55J92m2J59p9l67M85o72L14q9L04j18j51K52L1j66K09J74
7571C10l19J36k36N5m0mJ17J85l46J78k10J11J04J8j4m9J51Kj70R7J72m43K03
7594HK32k85mn8p7K90N9j80kr1r4K94M9r5R9K54m80J0J36r8n3Lj9K70kj8j37L6
7622D7mj24J83k4j45j2%K29J18k19K2l31J02J08J04P6j0o7L1l33J92L4K47l40
7646a16J99K0L6k06Rl4Jj51J97M21l97P5p0J43j79K70k76R1pq1k0j57J3J79j83
$$ y = [3, 150, 107, -6, 9, -139, 80, 152, 190, -188, -16, -161, -113, 44, 377, -70, 115, -14, -264, -38, -338, -176, 68, 204, 125, 74, -121, 131, -53, -260, -259, -71, -305, 134, -26, 67, -234, -185, -275, -38, -108, -68, -128, 243, -102, 83, -11, -160, -142, 24, 25, 72, 99, -25, 39, 57, 170, -172, 199, 84, 124, 61, -286, -184, 260, -65, -303, 84, 139, 91, 20, -111, 110, 31, -381, -126, 66, 24, 183, 104, -263, 222, -450, -136, -225, 79, -39, -190, 62, 93, -73, 136, 310, -9, 127, -109, -54, -94, -98, 19, 204, -142, 36, -174, -63, 41, 59, 45, -4, 147, 149, -21, 76, 248, -195, 8, 240, -45, -49, -107, -184, 106, 165, -15, -17, -108, -202, 92, 141, 46, 145, 399, -81, -71, 65, -33, -86, -83, -102, 168, 166, 148, 11, 47, 43, -81, 102, 78, -67, -79, -79, 150, 268, 49, 71, -260, -158, -50, 54, 130, 120, 53, 84, -249, -57, -23, 224, -116, 83, 103, 139, -67, -58, -92, -91, -242, -45, 376, -21, 54, -16, 127, -52, 218, -58, 33, 26, -55, -75, -232, -219, -40, -223]
7671b23J32N6l9J17j90J49J46l61J43K01k29OJ63q2J87j24l8m2L59j84o38J50
7693c41L09PJ10P9j46R6o5J61Q1m70L79k28MJ03r0O9o7q1Q7J87m12L54j41k22
7717b37M85k10l6n1L3j60m0K09L04j43j07o3J68j23q8J86j60J43j10j86L0J58
7739Bl3j64M36j34R4k45J4j58J50R8K28n5l76J7j18L00k49K77j21M4n7O4j33O3
7763e6J79l63J97j54N29l72L9l8k12J8M26q8j93K48k95L68k00N5j67K47J9l73
7785a86O8O0k2k34J08L56k84J36r0K55k68L66k49K50l44n9k94N29K01l54j96L30
7807G9J26k16J9Q5O8Mk2J0M1j92K5l26M31P9l29K77J6k78K26j45m5K4M6N3l5r6
7833g5J03Qk22L13l48K68j18K7j7J86k84M8m1J16j23P2L79k27J33k23J23k9l4
$$ y = [-223, -91, -35, -74, 43, -147, 2, 148, -213, -70, 131, -98, -92, 71, -11, 176, 52, 14, -28, 331, 147, -491, -341, -32, -25, 85, 164, 18, 114, 49, 210, 291, -179, 200, -28, -24, 79, -11, 58, -9, -90, -3, 184, -228, 126, -15, -237, 248, 38, 2, -49, -16, -176, -216, -7, 297, 154, 47, -16, 152, 29, -59, 127, -33, 110, 0, -186, -156, 2, -31, -195, 241, 107, 201, -44, -30, -188, -38, 60, 288, 233, -143, -126, -244, 56, -193, 84, -37, 7, -50, 14, -119, -56, 123, -240, -43, -197, 332, -40, -1, -39, -251, -233, 193, 105, -88, 160, -135, 233, 33, 88, -79, 168, 187, -186, -118, -58, -80, -314, -206, 150, -134, 2, -88, 167, -101, 265, 16, 266, -78, -137, -431, 98, 299, -55, -251, 79, 205, -11, 8, 93, 161, 165, 143, 153, 194, 2, 27, -299, 132, 211, -118, 159, 175, -103, 123, -22, -67, -43, 3, 56, 21, -75, 28, 36, -186, 127, -221, 47, -71, -44, -61, 125, -159, -111, -152, -36, -159, -87, 292, 65, 198, -25, 98, 69, 35]
7856C5p5l3K36k64L1j73K58j01j12J42N1NM0P4J23l71M86m91K2K9L0L15l47Q5
7880ek06K43j75J10L00k38M2j5Q1r2j19N8m5L83P0l92J30j05q3M5j10K53m9P5
7904A56q2P9l5j44j17J19J22J3k3J56m49J65J03n7n8r6m2j4K64l3N3j91J72R0
7928A51j18j86J27L8k0k7J74j78n6O5K6P2m17M21k4k23j01K08J11J14j79j03K24
7951I9j01r6J34J04k22j43M20j01j34L3K6K9n5j02M4R2J66P1l57j43K24K0J18
7974A26r7j2j93J56J00o1Rl19K26L5J41j84j58K04o5O0J16Oj79LJ28k42M22k03
7998A9M6K5j95K9J83p5r6j36J98qk0j36N6J11j50j1L4NQ8K8j02oo1K60k09J25
8024BL1K0q3J60j77K45K4j19r0P9k55J4L61q5r7k73J92Qp4K22j88k0J42K70l39
$$ y = [35, -40, -73, 163, -101, -70, -243, 15, -86, -198, -56, -5, 0, 40, 114, 237, -134, 352, -139, -117, -88, -58, 257, -90, -5, -211, 32, -143, -33, 267, 29, 71, 56, 137, 45, -74, -16, -61, 322, 392, 0, 130, 25, -58, -13, -123, 130, 81, 156, 74, 153, 118, -26, -143, -24, 98, 111, 88, 244, -205, -40, 63, 6, -52, -148, -190, -204, 60, 27, 80, -111, 61, 151, 33, -153, -26, 12, -8, -35, 139, -39, -95, -30, -4, 68, -349, 72, 48, -175, -276, -68, 43, 157, -22, -125, 99, -2, -98, 36, 140, -82, -225, 195, 94, -40, -7, 19, 48, -7, -109, -65, 27, 193, 264, -93, -236, -12, 8, 126, 29, 17, -176, -20, 80, 19, 28, -291, -65, -30, 111, -73, -231, -27, -92, -32, 84, 90, -89, -86, 42, -200, 222, 19, 65, 90, -105, -76, 107, 32, -64, -200, -2, -10, -30, -166, -110, 1, -149, -160, -126, -121, -33, -5, -107, -113, -174, 86, -123, 2, 33, 53, -30, 130, -47, 198, 222, 103, 13, 92, -163, -149, 212, 127, 30, -243, -51, -43, -117, 105, -83, -103, 39, 309, -30]
8049c0j0K66l14j5J18J10j18r7K5L1l8K5J12M2q6k61K03O0j02j1J99m0j60K64
8073A73M7j32Q5j17J4j64j7J88R8l38J57p5j19l2J68j75K21oPj74P5K61k92J34
8097a3J12J04l22J71j43K82l4j92m0jj9L92N6m54J83L34l58j04j32R2M33k56j36
8120d5M5J76j68K98k89O7r9j84K78n9j19L22m85N20l06J45q9j24K78j87KK5Q7
8143H9j21O2j0J32j04j8l8m9N6jj16K40k76O9L3l9K38k64k4m0J05K25p6l29J14
8168a42K95j59Q0j26L6K99l76J49j30J18j55RM23q7j90p8J17j8J14j16R3J68k93
$$ y = [-30, -40, 226, -88, -103, 15, 125, 7, -90, -65, -34, -72, -47, 65, 107, 21, -240, -37, 23, -79, -90, 109, 69, -91, 173, 220, 88, 173, 56, 70, -94, -111, 77, 175, -163, -6, -81, -200, -232, -64, -239, -18, -24, -17, -191, -116, 145, -147, -13, 99, 203, -119, 52, -91, 191, 157, -35, -75, -76, -95, 297, 353, -101, 82, 416, 58, -46, -178, -86, 347, 91, -45, 0, 176, 8, 306, 17, 84, -15, -199, 79, 20, -99, 223, -262, 258, -48, 97, 8, -116, 162, -25, -23, 2, 89, -32, 30, 20, 152, 48, 30, -8, -57, -1, -2, -118, 122, -154, -85, -52, -91, 147, -117, -141, -181, -76, 149, 73, -256, -142, 153, -6, 74, -52, -16, 283, -93, 56, -74, 44, -111, -102, 321, 234, 44, -34, 83, 65, 179, 63, 156, 324, 31]
8191C1
$$ Imaginary data points
##PAGE= N=2
##DATA TABLE= (X++(I..I)), XYDATA
0@%%%%%%%%%%%%%qJ6j6J6j6J6k4L2l6M4m8N6o8P8r0J04j21J38j57J81k05K32k62
36a38K94l29L64m06M54n05N62o21O87p59Q35r24J020j122J235j361J502j658J830
55I60k027K252k507K802l151L573m088M738n584O735q412J1084j6028K8242j15728
70i7139k23528P4550J21431J64119J62891P5773p5827j28780j67583j37054n563
81b36710J32372J62632J52805O8423o9066j58040j62611j32100m923J51133J77072
92H0987R9254L9678m5950j51803j66900r1731l148J11551J87745J33396J3484
103B06563p0408j32233j51628q0226K4771J05984J61883J35535J8751q1664j24213
114A3115j39933q6448L3899J23958J45974J14280J4022r5164j29721j11384p0504
$$ y = [0, 0, 0, 0, 0, 0, 0, 0, 0, 0, 0, 0, 0, 0, -8, 8, -8, 8, -8, 8, -16, 16, -20, 24, -24, 32, -36, 42, -48, 56, -65, 73, -84, 97, -108, 124, -138, 156, -173, 191, -215, 239, -266, 296, -325, 362, -397, 438, -486, 534, -588, 647, -714, 788, -870, 960, -1067, 1185, -1322, 1480, -1671, 1902, -2186, 2552, -3032, 3703, -4709, 6375, -9653, 18589, -97139, -320667, -246117, -124686, 39433, 202324, 278097, 202270, 73490, -94093, -231147, -236710, -104338, 58294, 211099, 279522, 210456, 52416, -110195, -242295, -247218, -96085, 80987, 180241, 219919, 173969, 22166, -144734, -236465, -239613, -128062, 59683, 193079, 206563, 136155, 3922, -147706, -227932, -203161, -97177, 64706, 200241, 218992, 137328, 13115, -126818, -213266, -179367, -55409, 90565, 204845, 218867, 123703, -6018, -117402, -187906]
125a87906J6722J12494J42213J03531J9030q9090j48994j19454m4325L5624J09363
136e0792J35171Q6408R23p9485j26508j11505m3244L7661J04224J34208R3245
147A80306l782r0975j28118j03699k9354N4002J02215J10836P8130O30q5222j22899
159c7930j01669l3163N3450J11187J11606O4581j3303q8882j18629q7852k0262
170a60866N2373J01217J03486O0840j0747q5027j20313q9552j3573O4063J06011
181G912R7496M5806k2984q1336j04874q0451j4060O0214J02943R6757M6029k7044
193A26408q8485j06483p2593l160O7529J00458Q3805L4806k8370q1790r8940o9601
205a36416m582O5819J04691Q6537K7797l9165q5750r3862n7011M878O4299R4151
$$ y = [-187906, -171184, -58690, 83523, 187054, 206084, 116994, -32000, -151454, -195779, -160155, -50792, 84379, 170787, 171710, 92225, -34283, -145788, -189032, -151371, -47147, 87061, 180306, 176524, 85549, -42569, -146268, -175622, -121620, -19405, 91431, 169561, 170191, 84969, -37930, -139599, -172762, -119312, -8125, 103481, 168062, 154759, 65877, -52752, -140604, -160866, -108493, -7276, 96210, 157050, 146303, 61276, -59037, -148589, -162162, -98099, 7912, 105408, 151214, 128230, 46894, -57980, -138431, -152491, -92277, 10666, 107423, 153452, 126408, 37923, -68560, -141153, -144313, -76784, 23674, 107479, 142285, 113915, 32125, -66815, -136416, -140998, -75179, 29512, 116049, 143846, 104681, 18931, -74931, -131942, -127064, -62765, 31386]
217C1386Q0307K6946l7878q4495r3414n7875Q675P1250R6615P4189J6723m5930
229H6499q3526q2280m7383Q732O5311R2585P3362J8157m6480q8653q5278m0245
241a29199J9537O9941Q8825O3768Q515m6061q0034p9928l9598J9326O8916Q8210
253E2218O5090P045n5124q5161p3596l0839K6849O9183P9417N5618N305n0620
265F5385q2539p3908l0604K8023P4452Q2169M9538m174n4753q1099o6196k0224
277a13930K9522O7022P7984M9741m441n5572q0248o7143j8428L8283P2747P2709
289F8246M0200j0536n5743p3867n9883j7270L5875P0973P2260M0378j2323o1456
301C6854p7468n5245q295M0054O9719O5780L1860j5362n5679p2555n5463q871
$$ y = [31386, 111693, 138639, 100761, 16266, -77148, -135023, -126348, -55098, 41517, 115706, 132429, 86499, 2973, -79307, -126690, -117958, -52647, 39938, 113300, 131457, 84977, -3676, -88954, -129199, -109662, -39721, 49104, 112872, 121387, 75326, -4708, -84636, -124234, -104908, -35992, 52218, 117308, 124353, 69229, -15932, -89528, -120367, -93518, -24335, 55082, 110700, 116005, 65385, -17154, -91062, -121666, -93643, -19191, 62978, 112516, 108342, 53589, -27510, -93706, -113930, -84408, -17386, 60598, 110339, 105898, 50326, -29922, -97065, -115493, -77210, -4463, 68246, 108446, 97910, 42167, -31700, -91583, -108853, -72978, -2005, 70255, 110633, 98310, 36854, -40614, -95859, -104154, -64100, 5619, 71399, 103259, 87897, 32218, -40337, -95800, -104671]
313a04671M1308P2260O6656K8898k2018o0746o9993m6288j786M2275O6784O0834
325G3513K6936j9720n9667p0073m6809P36M7405O9696N8161J8710k7393n8100
337A3395o3975m0792K704M4704O5641N6523J9744k8390o1923o4826l7162Q471
349h5886M9718O4447M9096J3053k9577n7938n9174l4601P213M8070O7186M9640
361H1247R797l3961o0950n7828k6613J4375M7547O0776M5109P291l2647n7556
373c413n7405k7907J6402N0730O1283M2807J399l8567n7691n0007k1888J7340
385f6917M8290N6820M0214L082l8049n9660n0806j8908K1653N2418N5973L3100
397G7210k396l7615n5673m6192j5746K1008M9378N5818L4162m412m0834n7296
$$ y = [-104671, -63363, 8897, 75553, 104451, 82433, 21687, -48306, -94594, -96380, -54105, 12679, 73513, 100449, 80729, 21062, -49011, -95820, -95084, -47679, 22017, 80178, 98888, 71495, 13395, -50580, -91372, -88668, -43964, 21677, 78200, 97944, 69554, 7631, -57195, -94357, -85886, -36168, 28279, 77375, 90428, 60851, 2913, -56261, -90862, -83649, -35579, 31607, 81247, 91044, 57083, -3867, -61695, -88308, -73933, -26386, 34390, 79499, 86790, 54143, -3413, -60818, -88725, -72323, -21593, 39690, 82497, 83896, 45329, -12362, -62369, -84257, -66917, -18627, 38193, 78407, 81489, 43440, -16220, -67026, -85934, -64281, -11863, 44110, 77210, 74814, 37199, -18474, -64666, -80412, -59404, -10026, 45792, 79954, 75542, 34708, -22588]
409b2588m4692j1081K7011M9195N0076K8493o887l8850n3559m3721j1931K7519
421e1015N1714N0069K5880j1353m2758n2674l7996o025K8176M8819M6434K3474
433G2745j0466m1455n2900l7363m187L1266N2086M5674J7607j5758m1256m8370
445c2377l3394j986L0670M8436M4334J8660j7432m3964m9429l1767K240L4406
457c1603M8293L9340J3557j9350m2738m5505k8784J245L3229M9814L9968J1143
469F8609k1903m4958m5001k3663O940L3862M6551L6776R368k1699m2745m4716
481d2579k4260R311L6019M6750L5256N717k6095m3120m0340j9866R347L5230M3909
494B5279L2830O503k5690m5571m1320j7533J2936L7803M4275K8373Q90k5537m1690
$$ y = [-22588, -67280, -78361, -51350, -2155, 47921, 76414, 69527, 30677, -22882, -66603, -78534, -51015, 699, 50768, 76648, 65295, 22537, -30137, -68133, -74158, -45982, 2837, 49271, 72745, 62279, 20824, -32076, -69439, -73626, -42360, 9726, 55400, 73007, 57249, 15993, -32377, -65771, -67757, -37087, 11349, 55683, 74343, 56911, 12947, -36482, -68249, -66009, -31603, 16690, 56030, 69587, 50237, 7499, -38006, -66790, -65545, -32316, 17498, 57466, 68609, 46706, 1748, -43253, -66916, -59976, -26114, 20437, 57213, 66581, 44882, 2137, -42579, -66839, -57528, -21509, 25241, 60497, 66214, 40119, -3001, -43341, -63207, -53860, -18630, 25279, 58109, 64612, 38922, -6649, -47969, -65502, -52566, -14763, 29512, 57885, 58775, 33238, -8452]
507h452l9225j5435J3496L6159M3650K9845k25k8743m2746l7710j2811J8230L7946
520f021L8593K5467p42k9179m1209l4717j3464J6540M0179M0531K2249m288l0830
533B3109m2199l1237p888J7480L7223L9679K0459o054k8651m1181l3825n308K1838
546c6555L7960L7457J9469j0454l1027l7005k8893o503K2121L7430L5239J9177
558E8416r462l5126l8717k5775l534K3640L9304L1981J2561r697l1967l8680k4354
571e1410j169K1904L8493L5317J1380j4772l2249l7173k2824M356K3905L4976
583A0734L1202J1901j5106l2094l4985k3133L171K8097L5843K8664Q901j7180
595C6015l4203l2805j7614L508K5899L5357K6742P686j6130l4547l4181j6878
$$ y = [-8452, -47677, -63112, -49616, -13457, 30193, 60038, 59813, 31070, -11676, -49386, -62197, -43967, -6021, 32572, 58039, 57297, 28118, -13091, -47808, -61272, -44732, -4553, 35978, 58227, 53939, 23109, -19090, -50327, -58215, -40735, -3512, 36167, 56626, 50572, 21921, -19260, -53085, -58393, -36555, 1405, 38862, 58331, 47877, 16850, -20155, -49048, -55551, -33430, 4000, 39239, 58416, 48954, 13828, -24889, -50664, -54198, -30558, 8746, 40727, 53288, 43591, 11624, -27056, -51410, -52579, -30675, 7818, 43135, 54515, 39743, 7494, -29679, -52503, -48147, -24242, 10734, 41936, 53837, 38731, 6637, -28348, -51481, -48310, -20213, 15630, 44294, 53195, 36015, 1812, -30993, -48607, -45099, -19200, 16157, 42899, 50585, 34455, -92, -34273, -51151]
607e1151P173K7686L5146K4970K839j7644l1380l1636j5486Q044K6535L4789K5365
620D5250K999k0368l2976l0515j2989J1154K8052L2127K1538J426k0110l1708
632f120k8999j2414J0439K8976L3110K0255j462k2308l2068k6125q994J1884K7777
645f049L0829J8699j539k1587l2151k6566p698J3886K9447L0410J5969m473k2571
658A6606l0506k3285n992J3915K7952K9270J6112n268k3967l0976k3141l291J6695
671b5876K8305K6572J3489o825k3495k8957k1565l153J6572K8664K6931J2565
683D3227q954k4987k9072j9074l84J8058K7139K4570J0451q712k4023k8230j9187
696c9178r7J9304K8449K3888Q374j1534k4739k6219j6230J509J8610K7133K2944
$$ y = [-51151, -43978, -16292, 18854, 43824, 46663, 29019, -2361, -33997, -49483, -41439, -14904, 19885, 45250, 48249, 27881, -5095, -35610, -48599, -37445, -9393, 22734, 44272, 45698, 25588, -6120, -35119, -47533, -37094, -8118, 24992, 45247, 43785, 21477, -10591, -36716, -45710, -33826, -6049, 24780, 43479, 41940, 20353, -11798, -38364, -46062, -32176, -2729, 27681, 43650, 39177, 16606, -13900, -37185, -43177, -29262, -1310, 27960, 44072, 38804, 14837, -16139, -39280, -42571, -25876, 2429, 29001, 42490, 35665, 12170, -16787, -38352, -41505, -24933, 3731, 30662, 43227, 34273, 9286, -19786, -38860, -39244, -21186, 5953, 30523, 40974, 32262, 8239, -19991, -39178, -39275, -19971, 8478, 32366, 40740, 29206, 4467, -21752, -37982, -36473, -17863, 9270, 32214]
709C2214P441j1234k5249k6881j4971L242K0653K7308K0656M876j2616k4187k4663
722b3411j3748L695J9748K6877K0885M277j4489k5144k4214j2115O425K0808K4968
735A4562J8146L243j4326k4654k3011j1275O179K1723K5704J7553J144j5643k5132
748e787k1462q264P636K0586K4317J6202O73j5466k4697k1626p726R479K1685
761d450K4021J4152j474j6753k3639j9323o554R373K1245K3165J3670k017j7331
774A4085k4193j9082m929J1215K1867K1846J1542l519j6912k2891j7608m671J1277
787b1973K1949K1706J1159m733j8557k2523j6337k106J2636K1288J9638R727m902
800B6972j7951k2450j5896j463J3455K1649K0006P698p522j8632k0713j3915n22
$$ y = [32214, 39655, 28421, 3172, -23709, -38680, -35438, -14785, 12523, 33179, 38055, 25439, 1252, -23411, -37159, -33464, -13716, 13161, 34046, 38323, 23834, -1310, -25524, -37639, -31214, -10406, 14562, 32708, 35951, 21625, -3029, -26040, -37315, -31136, -9413, 16291, 33844, 34988, 19345, -5787, -27249, -35513, -27877, -7291, 17026, 33228, 33901, 18435, -6262, -27888, -35614, -26135, -4450, 19571, 33723, 32249, 15496, -8143, -27466, -34020, -24647, -3402, 19763, 33433, 31416, 14085, -10108, -29190, -34119, -22904, -1037, 20809, 32351, 28832, 11920, -10971, -28579, -33250, -21973, -24, 21682, 32841, 28108, 9551, -12972, -29309, -31415, -18779, 2509, 22147, 31874, 26972, 9021, -13429, -29325, -30788, -17333, 4316, 24322, 32020, 24498, 5866, -14847, -28762, -29284]
813b9284J3323K0991J8716P216p586j8825k1679j2738J266J4804K0881J7066N687
826B9838q652j8752j9304j1773J346J4627K1037J6994M739r884j9530j8950j0381
839b8645L546J5282J9722J4846L780r729j8543j8982r720L855J5660K0013J4756
852B5841J783j1136j8989j7234p957M908J5287J8760J3643J610j1118j8710j7413
865b0725p537O661J6147J8940J2177j97j1993j8001j5700o233O367J6010J8202
878A4118J1804n76j2858j8498j5332m823P648J6667J7076R658j626j2762j7447
891f951j4476m496Q099J6381J7221R511l245j3463j7803j3010k706R077J5785
904g6J5938Q305k875j3336j7279j2719k537R974J6840J5584O726m503j3757j6437
$$ y = [-29284, -15961, 5030, 23746, 30962, 23376, 4551, -17128, -29866, -28600, -13796, 7085, 24151, 29838, 21186, 2434, -16870, -28643, -27297, -12670, 8367, 25361, 30100, 20216, 686, -18264, -28645, -25099, -9817, 9905, 24751, 28531, 18802, 259, -18723, -28443, -24588, -8928, 11085, 25841, 27624, 16488, -2501, -19735, -27692, -22784, -7497, 11263, 24906, 26516, 15398, -3312, -20725, -28262, -21601, -5454, 13486, 25663, 25466, 13473, -4528, -20228, -26461, -20094, -4084, 14118, 25922, 25346, 12488, -6010, -21342, -26165, -18517, -1850, 15226, 24884, 23258, 10496, -6951, -21427, -25923, -17824, -1443, 15778, 25289, 22044, 8581, -9222, -22232, -24938, -15861, -76, 15862, 24167, 21292, 7956, -9323, -22042, -24579, -14605, 2235, 17819, 24545, 20042, 6285, -10152]
918a0152j1661p58R727J5667J4952O699n052j4467j6414j1158O5J0876J6012J3986
932A8322M681n986j3964j5210j0250N86J0632J6010J3545M752o702j4461j5390
945a3435q517J518J1414J5449J2404L649o786j4267j4585q816K532J1384J5581
958G525J2322K373q204j4596j3930o967L153J1524J4642J1149K349q016j4727
971a403j3895o706M046J2281J5148R875O96q592j4004j2864n713M410J2159J4442
985I880R870K98r119j4260j2840m586N549J2502J3525Q706m58r538j3644j1563
999a5678m631N234J3149J3406Q075j285j0235j4166j0377l288O293J2411J2831
1012A1739P049j685r472j4144j0607k626O968J2720J2972O549l249j0124j3361
$$ y = [-10152, -21813, -22571, -12844, 2823, 17775, 24474, 19422, 4955, -11459, -22617, -22552, -11676, 4336, 18322, 23003, 17017, 3053, -12157, -22407, -21821, -11189, 4821, 18366, 23118, 16416, 1955, -13435, -21952, -20434, -9020, 6429, 18833, 22482, 15696, 1429, -13156, -21972, -19440, -8056, 7525, 19847, 22220, 14016, -580, -14510, -21477, -18324, -6800, 7842, 18991, 21340, 13324, -1403, -15298, -22004, -17958, -5677, 9471, 19346, 20042, 11450, -2554, -15418, -21131, -16721, -4562, 9880, 19750, 20048, 10929, -3331, -16171, -20757, -15208, -2706, 10819, 19525, 19067, 9529, -4115, -15678, -20309, -15075, -1926, 11480, 19555, 18270, 8035, -6131, -16508, -19796, -13503, -1092, 11739, 18788, 17103, 7631, -6513, -17120, -19746, -12778, -58, 12914, 19463, 16214, 6090, -7271]
1025g271r821j350P056J2089J2378O587l349j1067j3006r726o91P922J2669J1347
1039A3767M661l520j0895j2601q544m24P937J2483J0999M514m430j0917j2872
1052i842p683P22Q176J2430J0366L733m718j0915j2111p545Q78Q961J2606J0034
1066A5092K975o011j0986j1590o253J509Q873J2008R020K681n661j1378j1287
1079a1008o027K078R540J1716Q756J153o172j0812j0587n205K147R294J1743Q720
1093A5336J224p264j1031j0671m137L590R425J1094P383M92o607j0784r914m425
1107a6289L734R527J1284P513m24p788j0847r122l627M523R679J0387O260k49
1121A4561p400j1078r234k596M489J0103J0501N983j684p838j0540q290j855M783
$$ y = [-7271, -17092, -18442, -11386, 703, 13081, 19668, 16319, 5252, -7754, -17480, -18171, -10249, 2420, 13767, 18428, 14908, 4013, -8588, -17132, -17556, -9619, 2864, 13863, 18377, 13947, 3030, -9842, -17525, -16803, -8627, 3803, 14169, 17902, 13184, 2269, -9842, -17387, -16509, -7548, 5058, 15092, 18067, 12056, 1070, -10520, -16773, -15264, -6391, 5617, 14637, 17318, 11657, 279, -11008, -17035, -14957, -5417, 6299, 15055, 16208, 10036, -776, -11363, -16568, -14421, -5127, 6616, 15336, 16560, 9296, -1735, -12406, -16543, -12953, -3528, 7566, 14949, 15441, 8834, -1950, -11864, -16289, -12555, -3028, 8256, 15769, 15345, 7557, -3290, -12412, -16039, -11516, -1837, 8550, 14810, 14561, 7161, -3917, -13151, -15747, -11258, -1155, 9346, 15329, 13645, 5807, -4733, -13023, -14878, -10095]
1135a0095R501R960N607j563p892j0484q464j510N829R611R651M453k112q254
1149D238r928p551j512N915J0036R251M150k691q429r915p037k57N948R891Q210
1164A0319L931k942q219j0046o256j27O443R380Q614L091m068q412r288n800P40
1179a2640O372R352P815K752l819q234r726n531J337O894R328P618J819m277q245
1194H15q972m765J109O893R445P126J728m695q622r064m349K404P219Q918O370
1209A1560J021m740q421q386m368K399P475R048O512L20n549q566p881l114K724
1224i966P232Q503O047r7n180q419p683l202L021P969Q495N508m52o206q427o810
1240i667k294L322P135Q084N182l91o036q418p063k046L985P733P460M613j076
$$ y = [-10095, -594, 9366, 14973, 13410, 5518, -4966, -13430, -14940, -9111, 500, 10151, 14604, 12492, 4238, -5690, -13241, -14753, -8838, 1198, 10449, 14599, 11908, 3479, -6436, -13473, -13730, -7782, 2109, 10319, 14250, 11308, 3089, -6957, -13213, -13340, -6897, 2483, 11097, 14188, 10120, 1708, -7580, -13380, -12640, -6268, 3084, 10899, 13651, 9832, 1598, -8128, -13659, -12322, -5428, 3900, 11518, 13337, 9060, 815, -8157, -12922, -11813, -4920, 4525, 11651, 13379, 8684, 62, -9002, -13351, -10947, -3728, 5190, 11560, 12581, 7841, -580, -8966, -13334, -10935, -3460, 5588, 12100, 12420, 6871, -1695, -9576, -12690, -9966, -2734, 5769, 11816, 11719, 6539, -1880, -9563, -12765, -9744, -1775, 6720, 12228, 11776, 5570, -2857, -9667, -11961, -8639, -1504, 6580, 11762, 11371, 5335, -3083, -10146, -12192, -8207, -474, 6986, 11599, 10523]
1255A0523o226q110o132j939M218P263P903M195j426o540q076o169n57M230P403
1270E60P294L326j503o293p968n834p97M622P657P047L411k690o043p986m851
1285a0048n65M399P710O761L152k284p059p796m752J9N190P401O541K072k700
1300H041o427p312m504J81N069P075O493K379k995p124p159m131R60N221P089
1315B856N769J624k787o905o943l893J399N112P157N699J321m031o449o994k905
1330i970J178N793O702N219J050l973o464o475l102J410O074O753N037K79m007
1345E504o761n816k401J701N656O909M484J27m135o691o131j782K111N691O523
1360D989M230n30l976o409n643k246K446N988O451L622m31m387o461n430j486
$$ y = [10523, 4297, -3813, -9945, -11884, -7666, -403, 7500, 11695, 10269, 3729, -4347, -10516, -11073, -6843, 560, 7854, 11180, 9677, 3384, -4584, -10418, -11215, -6593, 1064, 8111, 11522, 8832, 2789, -5197, -10048, -10613, -6214, 1496, 8257, 11409, 9125, 2066, -5730, -10482, -10463, -5273, 2128, 8669, 10741, 8041, 1614, -5698, -10202, -10021, -4952, 2123, 8616, 10995, 8000, 876, -6283, -10414, -9454, -4233, 2856, 8625, 10249, 7462, 557, -6386, -10279, -8880, -3768, 3389, 9088, 10409, 6378, -71, -7065, -9970, -8792, -2999, 3703, 8922, 9972, 5999, -465, -6940, -10042, -8632, -2558, 4195, 9232, 9511, 5504, -1257, -7073, -9474, -7773, -2117, 4792, 9276, 9403, 5268, -1423, -7554, -9336, -7225, -1534, 4989, 9219, 8689, 4713, -1696, -7339, -9585, -7139, -1151, 5300, 8922, 8491, 4104, -2357, -7787, -9273]
1375i273K801N692O218L527o37m939o091m964j434K888O225N841K993r75m900
1390B972o159m626o78K906N726N708K975j070m872o359m549m97L361O130N314
1405F282K421j883m505n745m172m33L299N855N174K265j710n225n661m148K47
1420g939L840N654M800J868j481n300n932l478L2L923N842M952J738k670m737
1435A112n694k960J32L753N624M781J441k545m936n624l135J006M095N566M312
1450F928Q10k308n341n156k710R03M020N553M244Q58k827n214m972k613J544M130
1466b151N106L776R05l112m942m798k306J206M104N510L683K87l091n093m891
1481e807j498J544M135N339L081K45l253m908m756j624J887M574N005L082j84
$$ y = [-9273, -6472, -780, 5438, 8965, 8328, 3389, -2702, -7666, -9100, -6212, 13, 5854, 8847, 7872, 2972, -3187, -7813, -8491, -5585, 141, 5849, 8824, 7754, 2882, -3477, -8026, -8523, -5162, 968, 6282, 8703, 6820, 2315, -3430, -7602, -8035, -4736, 1119, 6293, 8558, 6848, 1623, -4038, -8186, -7939, -4099, 1555, 6355, 8223, 6742, 1442, -4490, -7968, -7936, -4013, 1829, 6781, 8519, 5849, 1112, -4582, -7542, -7410, -3657, 1967, 6748, 8189, 5644, 708, -4916, -8051, -7045, -2950, 2616, 6928, 7738, 5430, 89, -5067, -7777, -6874, -2854, 2699, 6943, 7801, 4974, -240, -5212, -7825, -6281, -2151, 2955, 6731, 7636, 4524, -418, -5216, -7522, -6316, -2212, 3298, 6981, 7268, 4177, -916, -5807, -7305, -5761, -1626, 3713, 6794, 7039, 3786, -1122, -5878, -7502, -5615, -1041, 3964, 7046, 6862]
1496F862l589m625m510j202J822M433N041K686l78l573m930l906j335K248M393
1511e63M931K286o10l438m898l451j377K202M594M674K345n75l676m999l617m50
1527f622K531M244M437J920j138l323m410l619n65K661M456M138K135j551l810
1542A484m406l151l63K866M293L845K017j517l788m361k795l68L035M311L906
1557E008J165j229l799m628k548n4K777M462L957J226j507m238m092k518N00L006
1573b512M030L534J194j944l563l822l026O15K669M643L336J042k106m250l605
1588c765k024K93L216M343L186P45k171m012l667k136Q15L398L992L019O48k528
1604C352l715l808j189Q18K924L989L006J88k279m049l482j519J287L507L782
$$ y = [6862, 3273, -1352, -5862, -7064, -5242, -809, 4232, 6918, 6540, 2967, -1963, -5869, -7204, -4956, -563, 4368, 6654, 6044, 2606, -2292, -5743, -7120, -4918, -324, 4350, 6695, 6120, 2444, -2555, -6172, -6622, -4091, 153, 4590, 6510, 5372, 2049, -2361, -5980, -6545, -3884, 572, 4710, 6845, 5294, 1484, -2922, -6073, -6436, -3570, 723, 4568, 6585, 5068, 1280, -3081, -5876, -6244, -3209, 1102, 5008, 6173, 4944, 1145, -3483, -6031, -6085, -3308, 1154, 5111, 6337, 4830, 592, -3500, -6018, -5518, -2512, 1518, 5052, 6246, 4302, 739, -3083, -6109, -5494, -2825, 1818, 5154, 6196, 4090, -160, -3765, -5789, -5496, -2280, 2063, 5249, 5994, 3823, -189, -3856, -5992, -5177, -1779, 2213, 5232, 5880, 3352, -363, -4171, -5360, -4542, -1618, 2371, 5377, 5565, 3286, -763, -4245, -5764, -4477, -970, 2812]
1619B812K416r2k539l535l196j465J059L516L910K352k56k492l712l027j347J575
1635d021L312L495K211J5k611l670l028j079J494L452L477K002k19k644l581k881
1651d276q64J592L190L464K270q20k565l493l038o09J745L508L153J886q28k993
1667A322l134k594l42J713L405L073J609o66l212l446k049k84J992L209L105J300
1683E001j186k684l662k150J40K054L180K945J327j289k896l219j978Q6J924L367
1699I60K767J161j127l110l119j930L6K141L267K897N81j248k646l233k027O16
1715d014J984L190K438J187j471k857l354j828L54K841K897K528K62j442k600
1730A15l161j311M43K256L174K399M49j315l338k727j314M88K739K779K346L27
$$ y = [2812, 5228, 5136, 2597, -938, -4134, -5599, -4540, -1024, 2886, 5238, 4982, 2490, -1222, -4249, -5596, -4021, -709, 2786, 4997, 5012, 2401, -1269, -4297, -5376, -3882, -430, 3047, 5049, 4830, 2186, -1395, -4276, -5140, -3548, -358, 3106, 5376, 4556, 1991, -1502, -4540, -5149, -3404, 104, 3257, 5143, 4315, 1322, -1812, -4406, -4748, -3035, 370, 3443, 5052, 4386, 1174, -2272, -4321, -4605, -2613, 596, 3701, 5001, 3815, 1131, -2531, -4681, -4541, -2487, 693, 3638, 4965, 3676, 780, -2439, -4417, -4331, -2407, 960, 3727, 4888, 3761, 651, -2468, -4398, -4362, -2221, 1046, 3943, 4524, 3276, 630, -2603, -4630, -4014, -2030, 1160, 3598, 4785, 3314, 457, -2897, -4725, -4371, -1530, 1367, 3895, 4157, 2715, 115, -3046, -4357, -3914, -1658, 1516, 3915, 4364, 3049, -289, -3016, -4330, -3842, -1103, 1676, 4022, 4349]
1746D349j770k947k454j683J079K375K863K014L33k032k590k627j014Q95K336
1761h73K835K024L9j728l037k478j050R18K747K825J739j13j807k931k526o28
1777d044R23K481K813K037m19j974l017k214n77J032K701K548J542j98k313k553
1793a232k092p61J388K306K771J619o37k147k570j957o64J501K463K318J405o08
1809C103j870k760j740n56J569K548K506J077p88k028k662j754k98J643K471K261
1825B722J184r20k292k556j672J43J537K331K280R04q21k067k886j132m62J854
1841a853K704K113O08n64k631k352j504L63J456K411K028M44n70k252k399j701
1857c699M86K015K388J751O42j312k432j988r57J93J850K316J875J46r97k407
$$ y = [4349, 2579, -368, -2822, -4505, -3426, -1051, 1812, 3826, 4159, 2127, -463, -3090, -4104, -3209, -873, 1962, 3986, 4025, 2297, -740, -3218, -4268, -3350, -603, 2222, 3961, 3848, 2041, -890, -3416, -4044, -3121, -640, 2173, 4210, 3791, 1817, -1200, -3414, -3991, -2959, -258, 2290, 3832, 3634, 1321, -1232, -3324, -4085, -2697, -391, 2380, 3999, 3362, 1215, -1355, -3312, -3976, -2475, -12, 2306, 3711, 3103, 1233, -1527, -3267, -3823, -2254, 294, 2800, 3877, 3089, 1061, -1601, -3355, -3653, -2010, 461, 2722, 3906, 2986, 694, -1862, -3534, -3391, -1854, 477, 2757, 3661, 2840, 773, -2113, -3245, -3707, -1853, 851, 2964, 3572, 3008, 377, -1975, -3479, -3116, -1660, 751, 2779, 3223, 2653, 401, -1998, -3699, -3213, -1198, 1190, 2941, 3583, 2271, -161, -2149, -3106, -2913, -1063, 1253, 3128, 3274, 2277, -130]
1873a30j914j365P07J554K485J824K75j497k304j964r80N32J725K253K027J29
1889C357j236k299k274r82Q14J747K305J657J09j319k509j941n18N91J792K525
1905A819J403j65j435k122k026p04P89K129J863J563j65j462j919k158m34P23
1921b301J863K407J028m08j376k211j564o52J036J915K190R04k74j153k426j481
1937b503m06Q90J984J974J136m27j842j493j895k66P82J943K175J088l58k037
1953G45j874j632j65J336J798J930O95o53j651j921j281J1J023J784J986O97o36
1970B192j543k127j108j22J152J806J907O53n51j806j986j150j01J535J700J838
1986B289M20q60j335j938j009qJ137J972J552O81q05k003j737r92NJ698J814J152
$$ y = [-130, -2044, -3409, -2702, -1148, 1337, 3161, 3436, 1939, -365, -2329, -3309, -2777, -1052, 1201, 3228, 3357, 2121, -178, -2452, -3434, -2620, -873, 1432, 3089, 3198, 1879, -630, -2571, -3089, -2498, -706, 1819, 3222, 3057, 1622, -500, -2526, -3230, -2441, -312, 1551, 3114, 2949, 1487, -432, -2590, -3024, -2301, -438, 1969, 2997, 2589, 1213, -998, -2562, -3214, -2178, -263, 1927, 2831, 2557, 1404, -1022, -2503, -2909, -2019, -35, 1939, 3075, 2648, 806, -687, -2582, -2848, -2066, -123, 2052, 3140, 2782, 745, -1129, -2761, -2926, -1590, 208, 2138, 2833, 2180, 529, -1392, -2673, -2662, -1639, 145, 2131, 2828, 2192, 649, -1478, -2586, -2708, -1556, 250, 2157, 2810, 2259, 453, -1533, -2683, -2784, -1249, 451, 2289, 2709, 1849, 514, -1424, -2433, -2441, -1304, 668, 2220, 2901, 2096, 93, -1644, -2636, -2631, -933, 881, 2033]
$$ [...]
8191a04
##END NTUPLES=NMR FID
##END=
