##TITLE=1H_LR-0154-BK2
 D2O
 8 sc, 
 22.3.2023
##JCAMPDX= 6.0         $$ Bruker NMR JCAMP-DX V2.0
##DATA TYPE= NMR FID
##DATA CLASS= NTUPLES
##ORIGIN= UXNMR, Bruker Analytische Messtechnik GmbH
##OWNER= root
$$ XWIN-NMR		Version 3.5
$$ Wed Mar 22 14:27:15 2023 Russian Standard Time (UT+4h)  she@DPX200
##.OBSERVE FREQUENCY= 200.13135
##.OBSERVE NUCLEUS= ^1H
##.DELAY= (6, 6)
##.ACQUISITION MODE= SIMULTANEOUS
##.ACQUISITION SCHEME= undefined
##.AVERAGES= 8
##.DIGITISER RES= 18
##SPECTROMETER/DATA SYSTEM= spect
##.PULSE SEQUENCE= zg30
##.SOLVENT NAME= CD3CN
##.SHIFT REFERENCE= (INTERNAL, CD3CN, 0, 15.7039)
##AUDIT TRAIL= $$ (NUMBER, WHEN, WHO, WHERE, WHAT)
$$ ##TITLE= Audit trail, XWIN-NMR		Version 3.5
$$ ##JCAMPDX= 5.01
$$ ##ORIGIN= Bruker BioSpin GmbH
$$ ##OWNER= she
$$ F:/spectra/data/she/nmr/H-F/1/audita.txt
$$ ##AUDIT TRAIL=  $$ (NUMBER, WHEN, WHO, WHERE, WHAT)
(   1,<2023-03-22 14:26:12.18 +0400>,<she>,<DPX200>,
      <created by zg, POWCHK disabled, PULCHK disabled
       configuration hash MD5:
       00 E9 B6 7A A2 85 ED C7 34 08 36 98 17 FE 4E 26
       data hash MD5: 16K
       8A 96 86 15 0A 57 6A CC 66 FF FE A6 16 17 49 ED>)
$$ ##END=
$$ 
$$ hash MD5
$$ 49 C9 F9 67 D6 70 98 D8 D2 98 EA C2 8B 34 B2 54
##$RELAX= 
##$RELAX= 
##$RELAX= 
##$RELAX= 
##$RELAX= 
##$RELAX= 
$$ Bruker specific parameters
$$ --------------------------
##$DU= <F:/spectra>
##$EXPNO= 1
##$NAME= <H-F>
##$PROCNO= 1
##$TYPE= <nmr>
##$USER= <she>
##$AMP= (0..31)
100 100 100 100 100 100 100 100 100 100 100 100 100 100 100 100 100 100 
100 100 100 100 100 100 100 100 100 100 100 100 100 100 
##$AQSEQ= 0
##$AQ_mod= 1
##$AUNM= <au_zg>
##$AUTOPOS= <>
##$BF1= 200.13
##$BF2= 200.13
##$BF3= 200.13
##$BF4= 200.13
##$BF5= 200.13
##$BF6= 200.13
##$BF7= 200.13
##$BF8= 200.13
##$BYTORDA= 1
##$CFDGTYP= 0
##$CFRGTYP= 5
##$CHEMSTR= <none>
##$CNST= (0..31)
1 1 145 1 1 1 1 1 1 1 1 1 1 1 1 1 1 1 1 1 1 1 1 1 1 1 1 1 1 1 1 1 
##$CPDPRG= <>
##$CPDPRG1= <>
##$CPDPRG2= <>
##$CPDPRG3= <>
##$CPDPRG4= <mlev>
##$CPDPRG5= <mlev>
##$CPDPRG6= <mlev>
##$CPDPRG7= <mlev>
##$CPDPRG8= <mlev>
##$CPDPRGB= <>
##$CPDPRGT= <>
##$D= (0..31)
0 1.2 0 0 0 0 0 0 0 0.06 0 0.03 0 0 0 0 0.0002 0 0 0 0 0 0 0 0 0 0 0 0 
0 0 0 
##$DATE= 1679480771
##$DBL= (0..7)
120 120 120 120 120 120 120 120 
##$DBP= (0..7)
150 150 150 150 150 150 150 150 
##$DBP07= 0
##$DBPNAM0= <>
##$DBPNAM1= <>
##$DBPNAM2= <>
##$DBPNAM3= <>
##$DBPNAM4= <>
##$DBPNAM5= <>
##$DBPNAM6= <>
##$DBPNAM7= <>
##$DBPOAL= (0..7)
0.5 0.5 0.5 0.5 0.5 0.5 0.5 0.5 
##$DBPOFFS= (0..7)
0 0 0 0 0 0 0 0 
##$DE= 6
##$DECBNUC= <off>
##$DECIM= 32
##$DECNUC= <off>
##$DECSTAT= 4
##$DIGMOD= 1
##$DIGTYP= 9
##$DL= (0..7)
0 120 120 120 120 120 120 120 
##$DP= (0..7)
150 150 150 150 150 150 150 150 
##$DP07= 0
##$DPNAME0= <>
##$DPNAME1= <>
##$DPNAME2= <>
##$DPNAME3= <>
##$DPNAME4= <>
##$DPNAME5= <>
##$DPNAME6= <>
##$DPNAME7= <>
##$DPOAL= (0..7)
0.5 0.5 0.5 0.5 0.5 0.5 0.5 0.5 
##$DPOFFS= (0..7)
0 0 0 0 0 0 0 0 
##$DQDMODE= 0
##$DR= 18
##$DS= 0
##$DSLIST= <SSSSSSSSSSSSSSS>
$$ [...]
##$SUBNAM2= <"">
##$SUBNAM3= <"">
##$SUBNAM4= <"">
##$SUBNAM5= <"">
##$SUBNAM6= <"">
##$SUBNAM7= <"">
##$SUBNAM8= <"">
##$SUBNAM9= <"">
##$SW= 18.05172834244
##$SWIBOX= (0..15)
0 0 2 0 0 0 0 0 0 0 0 0 0 0 0 0 
##$SW_h= 3612.71676300578
##$TD= 16384
##$TD0= 1
##$TE= 0
##$TE2= 300
##$TE3= 300
##$TEG= 300
##$TL= (0..7)
0 120 120 120 120 120 120 120 
##$TP= (0..7)
150 150 150 150 150 150 150 150 
##$TP07= 0
##$TPNAME0= <>
##$TPNAME1= <>
##$TPNAME2= <>
##$TPNAME3= <>
##$TPNAME4= <>
##$TPNAME5= <>
##$TPNAME6= <>
##$TPNAME7= <>
##$TPOAL= (0..7)
0.5 0.5 0.5 0.5 0.5 0.5 0.5 0.5 
##$TPOFFS= (0..7)
0 0 0 0 0 0 0 0 
##$TUNHIN= 0
##$TUNHOUT= 0
##$TUNXOUT= 0
##$USERA1= <user>
##$USERA2= <user>
##$USERA3= <user>
##$USERA4= <user>
##$USERA5= <user>
##$V9= 5
##$VALIST= <valist>
##$VCLIST= <CCCCCCCCCCCCCCC>
##$VD= 0
##$VDLIST= <DDDDDDDDDDDDDDD>
##$VPLIST= <PPPPPPPPPPPPPPP>
##$VTLIST= <TTTTTTTTTTTTTTT>
##$WBST= 1024
##$WBSW= 4
##$XGAIN= (0..3)
0 0 0 0 
##$XL= 0
##$YL= 0
##$YMAX_a= 556220
##$YMIN_a= -560461
##$ZGOPTNS= <>
##$ZL1= 120
##$ZL2= 120
##$ZL3= 120
##$ZL4= 120
##$ABSF1= 10
##$ABSF2= 0
##$ABSG= 5
##$ABSL= 3
##$ALPHA= 0
##$AQORDER= 0
##$ASSFAC= 0
##$ASSFACI= 0
##$ASSFACX= 0
##$ASSWID= 0
##$AUNMP= <proc_1d>
##$AZFE= 0.1
##$AZFW= 0.1
##$BCFW= 1
##$BC_mod= 2
##$BYTORDP= 1
##$COROFFS= 0
##$CY= 11.3945322036743
##$DATMOD= 1
##$DC= 2
##$DFILT= <>
##$DTYPP= 0
##$F1P= 2.36226072786647
##$F2P= -0.459571619588291
##$FCOR= 0.5
##$FTSIZE= 0
##$FT_mod= 4
##$GAMMA= 1
##$GB= 0.15
##$INTBC= 1
##$INTSCL= 1
##$ISEN= 128
##$LB= 0.24
##$LEV0= 0
##$LPBIN= 0
##$MAXI= 10000
##$MC2= 0
##$MEAN= 0
##$ME_mod= 0
##$MI= 1.114404
##$NCOEF= 0
##$NC_proc= 0
##$NLEV= 6
##$NOISF1= 3.799351
##$NOISF2= 2.8
##$NSP= 1
##$NTH_PI= 0
##$NZP= 0
##$OFFSET= 15.70392
##$PC= 1
##$PHC0= -19110.98
##$PHC1= 15.80075
##$PH_mod= 1
##$PKNL= yes
##$PPARMOD= 0
##$PSCAL= 0
##$PSIGN= 0
##$REVERSE= no
##$SF= 200.130013532006
##$SI= 16384
##$SIGF1= 3
##$SIGF2= 2
##$SINO= 400
##$SIOLD= 16384
##$SREGLST= <1H.CDCl3>
##$SSB= 0
##$STSI= 0
##$STSR= 0
##$SW_p= 3612.71676300578
##$SYMM= 0
##$S_DEV= 0
##$TDeff= 0
##$TDoff= 0
##$TI= <>
##$TILT= no
##$TM1= 0
##$TM2= 0
##$TOPLEV= 0
##$USERP1= <user>
##$USERP2= <user>
##$USERP3= <user>
##$USERP4= <user>
##$USERP5= <user>
##$WDW= 1
##$XDIM= 8192
##$YMAX_p= 0
##$YMIN_p= 0
$$ End of Bruker specific parameters
$$ ---------------------------------
##NTUPLES= NMR FID
##VAR_NAME=  TIME,          FID/REAL,        FID/IMAG
##SYMBOL=    X,             R,               I
##VAR_TYPE=  INDEPENDENT,   DEPENDENT,       DEPENDENT
##VAR_FORM=  AFFN,          ASDF,            ASDF
##VAR_DIM=   8192,          8192,            8192
##UNITS=     SECONDS,       ARBITRARY UNITS, ARBITRARY UNITS
##FACTOR=    0.0002768,     1,               1
##FIRST=     0,             0,               0
##LAST=      2.2672688,     0,               0
##MIN=       0,             -560461,         0
##MAX=       2.2672688,     556220,          0
$$ Real data points
##PAGE= N=1
##DATA TABLE= (X++(R..R)), XYDATA
0@%%%%%%%%%Qj6J6j6J6k4L3m1N6o5Q1j02J18j41J66j94K27k62L05l52M04m66N31
32B82o04O85p74Q75r82J101j234J376j534J706j893K101k324K568k836L128l449
49a808L800m188M613n083N608o193O851p597Q449r435J0591j1968J3641j5727
63h446J8417k2025K7158l5111M9216q1835L01488J18661m92127k68626j67231
74e60461J50353L13751L86876K15067K2123k50605l69989l30258j08917J20719
84d11341L32222L54137K20833k0293k41714l78314k88388p0157J48623K88145
94f6247L34570K00465l1880k36999l31573k84376o9947J69807L02779K98232J73192
105D58023m8159k39759l09613k42681o0536J64404K92210K75929J50077n0833
$$ y = [0, 0, 0, 0, 0, 0, 0, 0, 0, 0, 8, -8, 8, -8, 8, -16, 17, -24, 32, -33, 48, -54, 64, -77, 89, -105, 122, -140, 165, -187, 217, -249, 282, -322, 363, -411, 464, -518, 583, -651, 725, -809, 897, -996, 1105, -1219, 1349, -1487, 1641, -1808, 1992, -2196, 2417, -2666, 2942, -3251, 3600, -3997, 4452, -4983, 5608, -6360, 7281, -8446, 9971, -12054, 15104, -20007, 29209, -52626, 248862, 367523, -124604, -393230, -560461, -410108, -96357, 290519, 505586, 527709, 277104, -92885, -423143, -532060, -411341, -79119, 275018, 495851, 475558, 233844, -144470, -432858, -503015, -354392, -66247, 268323, 468788, 436908, 199909, -131664, -416040, -485987, -316180, -13401, 284831, 458023, 409864, 170105, -139508, -382189, -442725, -278321, 13889, 289818, 439895, 389062]
115C89062k44418l06664k16512l5671J65152K85273K52690J13390o1673k23730
125A16899k89646k03004k1663J62782K77359K51922R5584q9387k22585k63931
135a85670j79236p24J69236K53788K26265Q9976q9061k19799k51636j68002Q075
146c46788J80535K53195K05959O5962j04977k18176k25610j39089J1589J68949
156a48451K43154J93592N5586j06741k19809k24665j21325L4599J73994K30211
166A10145J72267L4994j11493k05803k06082j09627L8280J70345K24839J66770
176B84635K3546j24860k06294j91003q9160N2960J68571K06400J47895J7793j21673
187A68810k01016j83591q0597O0615J73073K01984J33169L88j29382j92973j65686
$$ y = [389062, 144644, -162020, -378532, -414203, -249051, 36222, 288912, 402302, 340629, 116899, -172747, -375751, -397414, -234632, 42727, 294649, 390233, 300846, 78261, -185670, -364906, -365630, -196394, 57394, 283659, 373635, 284574, 64775, -186861, -354863, -346788, -166253, 86942, 292901, 358863, 253886, 35710, -189900, -328989, -317400, -148451, 94703, 288295, 343881, 237140, 17331, -207334, -328659, -294060, -120066, 110145, 282412, 317406, 205913, 110, -205972, -315599, -277319, -106974, 117865, 284635, 308181, 183321, -22973, -213976, -303136, -250176, -81605, 124795, 272690, 290483, 168810, -32206, -215797, -296394, -235779, -62706, 139278, 272447, 272835, 143453, -49520, -215206]
198b15206o4455O5098J65381J90427J25072l619j32052j93133j59459n0764P9145
209a93565J68263J77476J05634j5418j30571j82289j46537m3541P9398J66726
219a4424J73982R7074k6035j37003j80839j34249k6019Q7965J59939J59861Q4070
230B44322l0736j32390j73608j30413k0545R6000J62915J53806P1485m4244j36462
241F0130j63159j14332j0590R7424J56544J43872O5747m7203j39234j61783j06190
252b18774j22J05851J57927J32022M8406n4690j34910j52333r6169M899J04790
263a03103J55209J29605M0827o4656j38845j47621q4209J8024J08772J47530J17547
274A79080L1940o7043j34153j41241q0371K2799J13896J47884J10889K1600p6467
$$ y = [-215206, -279661, -214563, -49182, 141245, 266317, 262698, 130646, -62487, -221946, -272710, -193565, -25302, 152174, 257808, 242390, 111819, -70470, -217007, -260548, -181150, -14424, 159558, 256632, 230597, 93594, -87245, -221494, -247513, -159548, 391, 160252, 244322, 213586, 81196, -92412, -222825, -243370, -147370, 15545, 169351, 240836, 196592, 60130, -103029, -217361, -227951, -130527, 26017, 169889, 235636, 188433, 49199, -112584, -218774, -218896, -113045, 44882, 176904, 225310, 170620, 35710, -116623, -212792, -207893, -103103, 52106, 181711, 222538, 157882, 19037, -128584, -212793, -194769, -85997, 61533, 179080, 211020, 143977, 9824, -131417, -211788, -188989, -75093, 72791, 183680, 205280, 128813]
285A28813j35409j29899o6451K8348J11747J41554J03775J7118p7969j36123j28095
296a42591n9111L7902J16793J37954R2206N069q2183j30749j18543n1160M0582
307a53831J14449J34815Q8859j300q9054j32496j12081l9605M9708J15099J25841
318A00404P7785o652q8070j27971j07031l5135N3566J17518J24422P1007j6621
329A63222r3612j24619r7065k4598N8022J13135J16708O5181j9145r4723j24081
340f1575r3492j8045O5317J15459J10323N4400k7507r5874j17317q4377j3221
351a65909O5708J13868J06926M8990l2084r9333j17063p7245k341P1478J11087
362B4082R8173M0333l5969r6121j11943p3026J486P3827J11656R5992L3179m4502
$$ y = [128813, -6596, -136495, -202946, -174598, -62851, 78703, 182478, 199596, 121627, -14496, -142591, -201702, -163800, -47007, 90947, 183153, 188222, 106039, -24710, -143253, -194413, -153831, -39382, 95433, 184292, 182992, 93938, -38558, -150639, -190244, -140536, -25437, 100404, 178189, 171537, 83467, -44504, -151535, -186670, -133104, -15586, 108836, 179843, 163222, 69610, -55009, -152074, -176672, -118650, -5515, 111193, 176374, 157229, 62506, -61575, -155067, -173112, -107795, 7664, 117987, 172387, 144880, 49006, -68311, -152688, -165909, -100201, 13667, 120593, 169583, 137499, 38166, -78897, -156142, -158483, -87005, 24082, 122255, 162588, 126619, 30498, -81445, -154471, -152985, -79158, 32498, 128490, 161669, 117167]
374A17167r8291j05803o4302Q450P6093J06394Q7996K8823m5710r8845j04145
385i2173n9768J4286Q0933J06316Q0968J8894n1369r7475r6831n1399J7302P9346
397e0970J04504P7749J3960n5177r8690r4704m4122K6358Q2381R9502O9696P464
409A37951n6996r5072q9441m0159K9131Q3783R8680O6061J000o3316r5145q2225
421a05748l2218L3604Q3034R2832N9562j785o3350r4784q0474k7825L8238Q5479
433a3435R0843N2569r464o6090r1062p3460k2065L9401Q3460Q8038M9980j2321
445A16394o8591r1559o9892j5164M5689Q4066Q2344M2594j6668o7969q7437o5577
457a11770j2237M6916Q4552Q1230L8446k2656p1779q5934n9177n060M9758Q1448
$$ y = [117167, 18876, -86927, -151229, -142779, -66686, 39708, 127704, 156527, 110817, 11972, -92173, -151941, -137655, -56722, 49594, 130562, 149456, 98087, 612, -96219, -147618, -130316, -50970, 53534, 131283, 145243, 90066, -8624, -103328, -147450, -121092, -38711, 60791, 130487, 137951, 80955, -14117, -103558, -143717, -114586, -30803, 67877, 133938, 134938, 71622, -23523, -105748, -137966, -104362, -21328, 71504, 131066, 129281, 65931, -28853, -109327, -137152, -98914, -13435, 77408, 129977, 120513, 54423, -36639, -110099, -132164, -92763, -9303, 78735, 128715, 116394, 47803, -43756, -113648, -128812, -83123, 943, 83287, 125881, 109213, 41244, -46193, -111770, -124007, -77091, 7461, 88691, 127137, 104481, 32702, -53232, -112409, -117469, -67711, 13737]
469A3737P5535L3571k4751p1194q4250n7187j505N4298Q2426P1772K7425l0477
481H9400p2443p9402n0220K187N4618Q0785O8446K4372l2305p4334p8803m5363
493a13062Q208N7746Q0049O2992J7312l4613p2030p5701m2028J1053N8279P9202
505C7407O1804J2767m0258p2814p2376l6823J6709N9649P4714N6523J0492m1494
517F6300p2461o9704l4657J9415O3488P4756N1569N073m5163p2464o3883k7974
529a05705K0716O2422P3154M8147J932m5826p3398o3666k2836K6536O3381P0807
541E5664M2931m329m7002o9740o0479j9717K9045O2889O9053M1645q202n1819
553C9939o9057n5659j5444L3387O3857O3898L6321r603n2207o8384n2243j2749
$$ y = [13737, 89272, 122843, 98092, 26898, -57352, -114539, -116044, -61746, 20680, 92452, 119877, 89400, 16957, -62445, -112665, -110478, -55860, 24925, 93371, 117743, 85438, 11104, -67699, -113062, -104854, -47108, 32941, 95933, 113245, 78632, 6602, -69099, -111127, -100074, -41795, 37407, 99211, 111978, 71720, -1094, -73470, -110293, -93584, -33935, 40779, 97302, 107794, 66300, -6161, -75865, -110522, -91107, -27619, 47137, 98706, 103779, 58616, -13848, -77731, -105705, -84989, -22567, 50587, 98734, 100666, 54840, -18558, -82224, -105060, -78524, -15143, 55664, 98595, 94266, 47264, -22476, -82955, -102672, -73627, -10738, 58315, 99960, 91758, 39939, -29118, -84777, -100221, -66834, -2977, 60921, 97242, 87639, 35432, -32952, -85195, -97944]
565i7944L5286O6199O2657L0609j4158n3891o7095m7308o843L5423O3981O0961
577F7877K7469j7375n4077o6639m5895k128M0048O3156N7331K3215k1732n4040
589A7210o2178m2514o15M2021O2820N5111K1220k4841n7195o0864l6976L991M3855
602c8955O1571N0108J6636k5163n6464n9524l4457O328M5097O2796M8087J1184
614H7244k9258n6583n6903k9671J0443M4743N9539M5897R282l1173n6493n6031
626e8964k7302J4366M7968N8202M1811N133l3560n5514n1508k4363J5712M8274
638a9745N7572L9366K797l6052n6800m9514j9437J9443M8936N4926L4894m11l6218
651C9757n5352m7876j7262K1317M9739N4387L2560m844l8819n4293m4284j3229
$$ y = [-97944, -62658, 3541, 66198, 96807, 82649, 28758, -38337, -85645, -92488, -57065, 6916, 67877, 95346, 77971, 23894, -42745, -88640, -90768, -50720, 12436, 69767, 92982, 71250, 17210, -44968, -87482, -88097, -46076, 16744, 71855, 93075, 68234, 11039, -49825, -86801, -82810, -38955, 22616, 72724, 89360, 64197, 7733, -51791, -86248, -79920, -34823, 27973, 76060, 87244, 57986, 1403, -55500, -85171, -74728, -29985, 29554, 75451, 84733, 53560, -2933, -58964, -86266, -71900, -23932, 34270, 76081, 81214, 47654, -7860, -59368, -83731, -68019, -19745, 37827, 77193, 79990, 43938, -12862, -62376, -81813, -62370, -13434, 41492, 76386, 75975, 39757, -15595, -63471, -80733, -59416, -9677, 44710, 77270, 72426, 33607, -20686, -64970, -78199]
663g8199K3447M8963N1415L0237o061l9711n4301m2607j0467K6702N0358M9585
675D9361K5844r831m0655n1786l9073p910K7275M9834M8480K3788j2303m2300
687B0724n1976l6463l763L0132M9237M5046K0012j4341m1863n0037l4734j828
699f9854L1486M9842M3937J7234j7916m3489m8253l0334J440L2399M8114M1282
711E5888J4883j8813m3579m7725k8569L918L4839M8094L8782J0875k1399m3264
723C930m4920k5666N898L4665M7195L7355R135k3357m4257m4034k2699R091L6394
736b1270M5762L3838O295k4357m3255m2000k0578J0406L7129M5793L2188L422
748F3373k7202m3602l9678j7020J3389L7122M3437K9670J408k7547m3510l8661
$$ y = [-78199, -54752, -5789, 45626, 75863, 69802, 30091, -24210, -66817, -77284, -50582, -224, 49361, 75205, 65374, 24719, -27067, -66140, -74050, -46775, 3059, 51539, 75327, 63024, 20724, -31252, -67715, -71478, -41346, 7891, 52937, 72949, 58608, 16745, -33292, -68026, -69854, -38368, 11474, 55411, 72645, 54729, 11240, -37013, -67347, -65907, -33508, 14606, 55888, 70771, 51958, 8379, -39346, -67915, -63997, -29158, 18936, 57718, 68593, 47194, 3930, -40990, -66656, -60758, -26093, 21102, 58457, 67592, 44235, -22, -44056, -66755, -57664, -21270, 24492, 58330, 64625, 40268, -2987, -44987, -65565, -55159, -18030, 27763, 59951, 63373, 36171, -7431, -47109, -64129, -50740, -13618, 29819, 59489, 60897, 33350, -10160, -48821]
760d8821j5016J5598L8463M2813K6788k067k9202m2357l5621j2336J6626L8085
772g047M1571K5065l500l0493m2823l4128r259J9590L8655L9271K1788o023l0785
785B1882m1162l2028p701K0598L8906L8811J9741q556l2678m0645k9415m285K2159
798c4373L8381L6162J7514r961l2620l9988k8080k723K4245L8839L4883J4599
810E6878j2782l3123l8142k5353n57K4431L8034L3586J3175j3806l4336l7696
822b9691k3500K298K6322L7547L1304J0136j5479l3536l6235k1670L379K7015
834b2110L7540L0187Q312j7648l4726l4973j8912O266K7611L6129K7878O220j8246
847C3528l4311l4142j7509P570K9258L6254K6111L351k0270l4228l1827j4801
$$ y = [-48821, -63837, -48239, -9776, 33037, 59825, 57758, 28556, -13801, -49422, -61758, -45132, -7047, 34524, 59589, 56089, 25596, -17227, -51355, -60614, -41024, -2369, 36902, 58690, 52667, 21882, -19280, -51308, -59009, -38411, 495, 39306, 59047, 50491, 17813, -22832, -52247, -56532, -34373, 4008, 40170, 57684, 47723, 15103, -24885, -52965, -55688, -31443, 7396, 42279, 56878, 44096, 10973, -27169, -52522, -53079, -28648, 9386, 42972, 56147, 42341, 8005, -29691, -53191, -50893, -24571, 12976, 44280, 54416, 38937, 5401, -30834, -52504, -49125, -22110, 15430, 45617, 53929, 36281, 1555, -33418, -52330, -46064, -18453, 17676, 45554, 51774, 33528, -783, -34925, -52434, -44864, -15606, 20648, 46759, 50110, 29840, -4388, -36215, -51016]
859e1016R218K9016L4920K4742K261k1347l4603l1171j2801J1581L0115L4170
871B5085K1869l00k2239l3427k9306j1358J2588L0269L3614K0767k230k3927l3881
884a2476k7555q394J4502L0141L1912J8592l666k4216l2987k6549p267J5938L0893
897a132L1555J6385o063k5159l2466k3955n004J6560L0668K9764J5313o990k5911
910A3565l2286k2991k846J8279L0905K8290J2693q900k5878l0961k1382j603J8706
923b4409L0509K7760J1388j0298k7134l0532j9603O63K0367K9824K5710R513j1286
936C2472k6669k9690j8375J852K1096L0303K4790P437j3218k7284k8115j6025
948d1426L683K1355K9097K3382O231j3961k7339k7926j4762N356K2651K8966K1500
$$ y = [-51016, -41798, -12782, 22138, 46880, 49141, 27794, -6809, -37980, -50781, -39200, -9085, 25085, 46954, 46654, 24415, -9012, -38318, -49676, -37088, -6819, 26795, 47562, 45332, 21405, -12476, -40031, -48425, -33923, -3782, 28130, 46722, 43056, 18840, -14147, -40696, -47963, -32025, -1132, 30423, 46808, 40745, 15586, -16880, -40835, -45839, -29279, 1389, 31153, 46466, 39476, 13565, -18721, -41712, -44558, -26279, 4626, 32916, 45609, 36709, 10831, -20130, -41512, -43115, -24409, 6100, 33860, 45248, 34950, 7816, -22716, -42319, -41656, -21289, 8535, 34245, 43758, 32472, 5803, -23887, -42262, -40410, -19314, 10989, 35779, 43216, 29998, 2714, -25401, -41426, -37743, -16388, 12709, 36091, 42322, 28361, 1022, -26904, -41666, -36310, -13659, 15307, 36807]
961C6807L758j5069k7013k6178j3182O302K2670K8544K0532K554j6420k7572k5386
974b9653j0989Q243K3261K7471J8506J111j6880k6890k4263j0229R325K4160K7246
987B0419J7269q90j8228k6909k2476p915J0338K3871K5905J6015j806j8749k6611
1000i767k2125o385J1611K4540K5345J3957l644j9337k5949k0353n190J2360K4332
1013f05K4506J3239m945j9979k6147j9193l288J4017K4226K3126J1462n893k0536
1026I990k4921j8113k471J4672K4632K2719R937p412k1259k4692j6207p43J5300
1039a8568K4260K1257Q600q115k1198k4519j5656Q97J6399K4332K0399O779r657
1052B5210k1344k3265j4114J991J6697K3736J9767N876j0677k1787k3017j2778
$$ y = [36807, 40565, 25496, -1517, -27695, -40877, -34575, -11905, 16639, 37171, 39725, 23305, -4267, -29653, -40642, -32399, -9138, 18333, 36839, 37950, 21070, -5820, -30083, -40312, -30987, -6827, 20419, 37688, 36798, 18570, -8339, -30815, -38730, -28392, -4521, 21384, 37399, 35593, 16844, -9767, -31892, -38277, -26666, -2126, 23219, 37176, 33532, 14195, -11754, -32107, -37297, -24937, -605, 23901, 37140, 32195, 12216, -13931, -33124, -36412, -22395, 1831, 24957, 36419, 30526, 9990, -14931, -33044, -35515, -20843, 3789, 26508, 36445, 29033, 7774, -16918, -33125, -33868, -18568, 5692, 26949, 35549, 27434, 6236, -18283, -33939, -33042, -16643, 7689, 28088, 34867, 25210, 3866, -19399, -33513, -31522, -14825, 8911, 28678, 34554, 23877, 2090, -20927, -33705]
1064c3705L437J7947K3289J7978M477j1505k1715k1756j1737M153J8410K3414
1076A2687J6965L143j2562k2334k0963r734N580J8469K2521J5878J869j3035k1966
1089c482k0406q893O761J9165K2279J4801J74j4134k1469j9102p593P408J9200
1102e291K1586J4149n55j4933k1788j8263o482Q875J9658K0742J2276j643j5250
1115A3081k1127j7438n432R247J9809K0523J1483k818j5920k1234j6352l883J0377
1128a9684J9446J9543J0614l883j6057k0954j5733k898J1368J9939J8861R167
1140B9729n151j6722k0001j4390j919J1802J9438J8262Q379n808j7097k0127j3574
1153b7179m45J2640J9491J7262O909o809j6848j9358j2666K95J2942J9706J6652
$$ y = [-33705, -30268, -12321, 10968, 28946, 33423, 21918, 203, -21553, -33290, -29137, -10727, 12687, 29652, 32795, 20233, -2101, -23064, -32798, -27218, -8749, 13772, 29650, 31519, 18484, -3482, -23888, -32781, -26020, -6855, 15424, 30225, 30399, 16265, -5204, -24306, -31899, -24491, -5291, 16295, 30444, 29889, 14956, -6832, -25095, -31577, -22702, -3044, 17698, 29974, 28331, 13081, -8046, -25484, -30916, -21669, -1860, 18663, 30146, 27328, 11408, -9826, -26178, -30061, -19684, -238, 19305, 29919, 26036, 9979, -10975, -26708, -29606, -18238, 1701, 20562, 29729, 24578, 7856, -12145, -26535, -28454, -16652, 2786, 21048, 29427, 23619, 6522, -13605, -27179, -27624, -14984, 4507, 21769, 28678, 21869, 5021, -14337, -27003, -26708, -13766, 5940, 22592]
1166B2592N859p755j7621j8653j1407J624J3541J8928J5673M833q246j7447j8264
1179a6343j0694K377J4266J8932J4777L595r264j7500j7400r419L295J4260J8540
1192I422J4129K747r615j7791j7171q334M447J5001J8047J2790J686j0390j7341
1205b373j6137p492M940J4870J7910J2331P86j1114j7499j5437o257N759J5126
1218d587J7211J1197q3j1338j7296j4959n367O483J5611J6831J0319j287j2116
1231A0619j6733j4037m347P260J5179J6252R605j809j2247j7013j3362l588Q423
1244a5798J5304J5625Q429k879j2596j6269j2408k802Q492J5534J5355P692l701
1257A9978j3319j6109j1544j680R315J5253J4379O637m198j3048j5831j1083p71
$$ y = [22592, 28451, 20696, 3075, -15578, -26985, -25361, -11820, 7108, 22781, 27614, 19368, 1921, -16343, -27037, -24660, -10394, 8538, 23315, 26910, 17646, 146, -17254, -26673, -23378, -9118, 9422, 23551, 26298, 16683, -1108, -18279, -26613, -22166, -7165, 10882, 23672, 25358, 14968, -2373, -18510, -26002, -21062, -6192, 11718, 24049, 24835, 13721, -3778, -19215, -25472, -19713, -4587, 12624, 23821, 23738, 12400, -4896, -19855, -25222, -18739, -3128, 13703, 24022, 22735, 10619, -6114, -20151, -24498, -17238, -2059, 14193, 23798, 21989, 9742, -7271, -20633, -24221, -15798, -494, 15131, 23560, 20681, 8085, -8184, -20592, -23394, -14902, 632, 15987, 23679, 19978, 6659, -9450, -20994, -22674, -13359, 1894, 16273, 22910, 18712, 5664, -10167, -21250, -22021]
1270b2021R698J5437J3965N717n430j3382j5194r888J26J0088J5041J3212M921
1283B2290n658j3723j5038r161J001J0810J4818J2512M024o498j3518j4362q469
1296b0972J535J0800J4954J1820L252p016j3845j3976p480K471J1096J4511J0988
1309A8138K421p313j3679j3359o866K841J1547J4477J0296J595q073j3761j2680
1322a4416n905L863J1410J3936R702P42q378j3599j2365n199M544J1859J3727
1335I921Q862j78q903j3234j1560m522N037J1822J3225Q268o62r367j3379j0897
1349a5567l592N559J1900J2790P205j259r541j2925j0606k836O104J2116J2473
1362A1821O648k202r956j2858r535k074O665J1715J2016N973k701j0156j2471
$$ y = [-22021, -12323, 3114, 17079, 22796, 17366, 3984, -11210, -21098, -20972, -10884, 4157, 17369, 22290, 16632, 2909, -12129, -21290, -20289, -9479, 5339, 17851, 21875, 15377, 1859, -12503, -20972, -19437, -8637, 6317, 18137, 21389, 14373, 528, -13448, -20928, -18457, -7361, 7150, 18138, 20559, 13246, -433, -13792, -20658, -17817, -6270, 8207, 18503, 20098, 12025, -1736, -14416, -20321, -16458, -5048, 8888, 18590, 19332, 10954, -2645, -15010, -20209, -15665, -3806, 9921, 18783, 18605, 9702, -3532, -15092, -19614, -14577, -2755, 10470, 18738, 18076, 8709, -4670, -15567, -19159, -13600, -1700, 11090, 18295, 17036, 7495, -5430, -16036, -18872, -12768, -652, 11821, 18469, 16267, 6311, -6547, -16082, -18156, -11491, 224, 12240, 18213, 15512, 5356, -7115]
1375g115r183j343P279J1972J1235N156l424j0426j1919q347q53P424J1779J1027
1389A3262M573m004j0599j2074p665J27P747J1882J0093L780m299j0543j1526
1402i246p265O98Q076J1700R799L063m938j0546j1078o484J228Q391J1398Q987
1416A3783K765n342j0662j0740n809J819Q620J1304Q427J835n914j0469j0179
1429a0562n305K322Q764J1082P846J237o231j0468r986m460K965Q918J0715P301
1443A4138N29o449j0220r541l956L388R159J0464O765M1o850j0350q864l182L790
1458a1138R064R957O348o32o877j0174q583k671M281R248R686N731j261p316r794
1473d131q054k181M770R124R367N168j495p814r818p357j522N154R298Q796M384
$$ y = [-7115, -16298, -17641, -10362, 1610, 12845, 18001, 14577, 4151, -7768, -16115, -16968, -9544, 2235, 13262, 17835, 13831, 3232, -8842, -16507, -16380, -8633, 3249, 13342, 17122, 12823, 2280, -9246, -16511, -15813, -7737, 3963, 13762, 16825, 11887, 1341, -9737, -16221, -14993, -6602, 4796, 13783, 16548, 11206, 544, -10196, -16005, -14186, -5566, 5738, 14165, 16000, 10086, -383, -10562, -15867, -13545, -4781, 6301, 14147, 15384, 9153, -1315, -11301, -15761, -12796, -3878, 6837, 14138, 14667, 8218, -2002, -11543, -15499, -12111, -2952, 7512, 14277, 14318, 7468, -2882, -11746, -14928, -11138, -2074, 7883, 14231, 13599, 6722, -3452, -12035, -14706, -10425, -1177, 8509, 14240, 12979, 5663, -4131, -12185, -14366, -9596, -472, 8895, 14063, 12568, 4754, -5064, -12421, -13943, -8789, 509, 9305, 13689]
1488A3689j879p726r416o824j361N287R216Q752M016k593p694r517o278m45N400
1503g373R020Q197L520k985p753r009o116k5O036Q930P888K813l383q017q583
1518f840n404K10O195Q777P351K611l688q096q685m778Q16O338Q851O883J822
1533A2363l929p894q403m476J453O272Q660O737J242m346p896p846m083J928O422
1548c796Q137O309R95m493p932p443l902K365O827Q043N720M71m839p955p050
1563h543k986K251O988P827N166K87n008q056o817k497K750O841P850M544l68
1578A0229n025p726o505k133L179O850P363M415p43n540p415o343j432L407O898
1593e21P105L884j033n396p412n695j521L695P212O633L580j400n812p207n060
$$ y = [13689, 11810, 4084, -5332, -12156, -13517, -8230, 986, 9738, 13754, 11161, 3467, -6050, -12328, -12773, -7373, 1647, 9844, 13364, 10379, 2626, -6383, -12499, -12524, -6488, 2442, 10330, 13143, 9760, 1743, -6840, -12244, -12034, -5839, 2938, 10289, 12900, 9212, 1116, -7569, -12347, -11531, -5193, 3658, 10541, 12363, 8434, 540, -7863, -12339, -10886, -4614, 4046, 10783, 12025, 7679, -217, -8063, -12146, -10218, -3796, 4341, 10650, 11645, 7152, -780, -8223, -12125, -9760, -2933, 5110, 10830, 11301, 6462, -1493, -8543, -11529, -9278, -2290, 5537, 10703, 10990, 5982, -2074, -8891, -11388, -8638, -1797, 6053, 10597, 10229, 5204, -2522, -9027, -11160, -7981, -1131, 6232, 10647, 9904, 4364, -3051, -9394, -10826, -7419, -521, 6584, 10468, 9435, 4039, -3373, -9068, -10589, -6894, 318, 6951, 10531, 9131, 3319, -3888, -8948]
1608h948j186L851O887O527L141j697n756p184n059m30M144O849O268K584k149
1623G842n822o714m559j98M269O734N929K512k643n748o683m182K31M614O562
1638B144N529J972k659n747o559l822M00M869O611N211J463k831o130o073l435
1653i057Q17M815O266N066J146l153n841o114l003J270M973O088M651O92l230
1668E386n994n456k784J499N002N887M566L93l559n945n351k316J857M955N816
1683C956L918K21l680n825n076k134K043N138N883L567k11l919n645m789j737
1698h290K176N154N574L267m51m029n617m595j435K491N313N443K834p37m070
1713C028n607m177j046K563N178N099K747r55m317n516l923o09K897N132M744
$$ y = [-8948, -10134, -6283, 604, 7131, 10272, 8575, 2819, -4365, -9424, -9854, -5710, 1139, 7407, 9991, 7842, 2020, -4694, -9253, -9451, -5182, 1552, 7481, 9993, 7350, 1602, -5081, -9263, -9032, -4418, 2144, 7673, 9645, 6986, 1239, -5320, -9142, -8742, -3873, 2738, 7949, 9412, 6581, 451, -5622, -9057, -8240, -3425, 2841, 7907, 9053, 5900, 59, -6055, -9058, -7788, -2815, 3273, 7924, 8616, 5386, -608, -6064, -8848, -7349, -2347, 3540, 8106, 8499, 4940, -1005, -6356, -8672, -6815, -1860, 3956, 7874, 8095, 4415, -1410, -6486, -8620, -6577, -1439, 4444, 8011, 7800, 3881, -1764, -6553, -8290, -6114, -960, 4614, 7881, 7430, 3401, -2216, -6811, -8246, -5755, -442, 5001, 7835, 7098, 3028, -2579, -6756, -7802, -5239, -61, 5038, 7785, 6830, 2513, -3003, -6926, -7535, -4638, 494, 5238]
1728E238K429j410m037n454l674m84L192M949M741K027j584m208n328l419L4L002
1744c986N224M463J683j797m318n158l071J15L373N044M182J281j834m347m902
1759d048k699K34L419M905M186J191k302m602m536k592P29L557M882L531Q56k261
1775D450m316m550k325Q85L654M759L488N81k574m437m217j989J002L859M531
1790B801L115L89k624m554l903j738J204L905M487K938K4k722m326l916j441J480
1806d881L731M422K790r3k994m482l578j165J790L683M282K517l16l081m323l376
1822e074j031J808L989M081K240p02l189m069l202p53K046L769L820K106q35l105
1838A899m102k939o88K237M000L708J757j120l302l889k750k02K135L900L522
$$ y = [5238, 7667, 6257, 2220, -3234, -6908, -7392, -4200, 749, 5490, 7517, 5933, 1725, -3603, -7022, -6988, -3986, 1238, 5701, 7384, 5587, 1269, -3889, -6960, -6845, -3472, 1572, 5754, 7035, 5201, 854, -4048, -6747, -6513, -3094, 1811, 5997, 7188, 4886, 284, -4252, -6844, -6115, -2558, 2324, 5855, 6711, 4450, 134, -4416, -6741, -5856, -2202, 2557, 6045, 6626, 4052, -385, -4602, -6591, -5589, -1730, 2801, 5916, 6305, 3681, -873, -4776, -6514, -5310, -1405, 3082, 6020, 6044, 3322, -1004, -4920, -6361, -4881, -1150, 3272, 6062, 5969, 2975, -1507, -5085, -6250, -4460, -777, 3505, 6022, 5706, 2625, -1698, -5074, -6105, -4297, -308, 3773, 6013, 5311, 2122, -1947, -5149, -5902, -3856, -87, 3733, 5839, 5004, 1899, -2203, -5142, -5830, -3593, 407, 4115, 5872, 4752, 1450, -2439, -5189, -5391, -3256, 644, 4166]
1853D166J480j125l325l963k544p4K593L809L172J320j332l301l821k415K52K574
1869b534L768L067J088j596l433l407k120L70K564L641L057Q16j653l399l499
1884c270k030O85K796L668K648N69j721l434l332j571N03K859L646K583M15k084
1900B930l346l113j516R77K886L442K352J02k101l278k964j322J166K838L428
1915B481K188pk105l432k936q08R71L013L133K176k19k309l186k784p01J109K970
1932d46L197J813n50k231l262k428p84J632K952K887J660n02k339l360k147n39
1948d447J736K803K911J349o50k411k939k291l23J798K875K740J382r96k501k990
1964a954k021n0J737K841K754R32r38k603k945j834L9K008K822K701P70j254k614
$$ y = [4166, 5646, 4521, 1196, -2767, -5311, -5385, -2792, 1017, 4189, 5509, 4177, 876, -2945, -5360, -5108, -2534, 1234, 4301, 5389, 3793, 360, -3047, -5167, -4797, -2233, 1408, 4465, 5281, 3628, 229, -3270, -5300, -4615, -1819, 1849, 4497, 5066, 3345, -89, -3421, -4992, -4489, -1630, 2016, 4599, 5014, 2930, -416, -3529, -5045, -4068, -1182, 2260, 4612, 4714, 2613, -665, -3629, -4951, -3785, -947, 2481, 4669, 4662, 2557, -875, -3811, -4619, -3648, -635, 2498, 4674, 4455, 2146, -1040, -3824, -4525, -3416, -446, 2751, 4564, 4014, 1783, -1479, -3907, -4691, -3059, -107, 2780, 4440, 3938, 1599, -1761, -3908, -4447, -2711, 92, 3003, 4352, 3702, 1291, -1648, -3939, -4262, -2464, 411, 3151, 4533, 3537, 1036, -1954, -3975, -4025, -2288, 553, 3307, 4239, 3301, 698, -2247, -4081, -4042, -2034, 788, 3489, 4259, 3005, 391]
1981C91k747j638K79J864K864K422N32j102k603k723j495L04K188K762K148M37
1997C883j340k472k700j393O65K024K868J932L66j424k572k591j113N39K248K649
2013A569J944K66j523k624k482j044Q36K299K530J779m3j651k465k366r00R93
2029b882K319K454J670j08j836k552k010o81R77K409K212J562j94j870k445j981
2045b956o38J245K245K226J337m13j791k549j820k75J191K281K217J184m35j923
2061A126k353j889k28J211K379K163R51o38j866k285j711l8J274K305K060P88
2077C249o38j770k411j436p9J560K001J975P46q25j904k174j285Q6J417K154J872
2094B538O20q20k101k106j133J79J544K153J662N44r64j966k077j062K48J489
$$ y = [391, -2356, -3994, -3715, -1851, 1013, 3435, 3967, 2865, 262, -2461, -3956, -3652, -1464, 1298, 3446, 3883, 2543, 71, -2629, -4022, -3357, -1333, 1535, 3467, 3833, 2409, -163, -2754, -3867, -3328, -1080, 1569, 3513, 3779, 2256, -368, -2850, -3894, -3058, -759, 1771, 3550, 3507, 1856, -609, -2975, -3875, -2882, -563, 1891, 3561, 3453, 1617, -935, -2945, -3626, -2649, -240, 1972, 3534, 3340, 1470, -975, -2956, -3594, -2349, -104, 2122, 3459, 3046, 1255, -1294, -3114, -3389, -2198, 83, 2300, 3484, 3049, 1126, -1227, -3116, -3344, -2133, 246, 2409, 3360, 2722, 856, -1429, -3140, -3178, -1904, 401, 2461, 3249, 2611, 841, -1570, -3006, -3085, -1525, 476, 2451, 3197, 2372, 468, -1706, -2991, -2905, -1488, 666, 2538, 3158, 2338, 237, -1869, -3002, -2823, -1279, 874, 2536, 3080, 2116, 150, -1927, -2989, -2741, -1252]
2110a252K138J680M26j010j924j989j048M11J601J992J609L89j262j942j813j034
2126c028N43J615K190J383J68j143k021j738q75O22J588K108J277J58j386j925
2142d64j719o54O58J738J938J045M1j252j940j640n39P07J772J797J134r3j478
2159A051j816j351n53Q57J660J759R41j70j394j846j524m2O69J795J749O95k56
2176B224j415j746j393j72R01J744J652O77l53j524j671j389l6Q67K067J346P17
2193B496n30j460j585j179j21J132J591J493O20n64j585j654r64n3J303J491J457
2210A888N11o42j559j492r52P9J060J631J373M48o59j417j605r29K52J082J592
2227F61J209N01q94j453j385r88L09J192J590J165K09n73j483j648p12L56J235
$$ y = [-1252, 886, 2566, 2992, 1982, 58, -1931, -2979, -2568, -967, 1025, 2634, 3023, 1761, -181, -1994, -3028, -2485, -870, 1320, 2703, 2871, 1728, -293, -2031, -2906, -2284, -696, 1412, 2689, 2847, 1461, -464, -2183, -2837, -2179, -441, 1497, 2542, 2583, 1331, -609, -2249, -2788, -2081, -309, 1488, 2622, 2529, 1051, -765, -2116, -2669, -1812, -152, 1607, 2548, 2378, 984, -862, -2386, -2428, -1759, 36, 1785, 2480, 2224, 809, -937, -2330, -2502, -1601, 143, 1795, 2472, 2119, 595, -1076, -2465, -2501, -1634, 433, 1779, 2496, 1966, 506, -1079, -2258, -2379, -1247, 344, 1837, 2457, 1893, 308, -1346, -2310, -2363, -1060, 431, 1888, 2399, 1757, 198, -1294, -2246, -2167, -1107, 524, 1897, 2345, 1686, 269, -1336, -2265, -2013, -931, 661, 1870, 2371, 1477, 24, -1361, -2349, -2040, -848, 742, 1907, 2116, 1543, 60, -1588, -2300, -1944, -709]
2244g09J652J169J39r46j429j432n90L78J263J382J290j27q64j324j505m00L65
2261a688J273J535Q91n1q48j506j178m07L70J245J351R46j1r71j435j181k44L61
2279a548J381J303Q04m8j078j192j286k13N29J220J343P63j33q85j740q44m01
2296b025O85J351J288N69k21q92j452j203N4O21J231J390N89k60j139j319r80
2313a713m9N41J214J312N91l33j153j292p95j51P37J309J065N20l93r73j206r11
2331a680J3P79J146J080N68n75j107j103p87L3P64J118J147L88m31j054j272p52
2349a725J67Q46J084J102J37l90j098r85p01J24Q18J172Q44K49n54j064j000o05
2367a579J94P39J105R46K73o14j017j168m20J64Q85J109Q30M6n53j063r50m45
$$ y = [-709, 943, 2112, 2251, 1305, -124, -1556, -2146, -1768, -505, 877, 2167, 2040, 1176, -148, -1653, -2053, -1688, -415, 1120, 2011, 1960, 1112, -394, -1572, -1979, -1609, -364, 987, 1933, 1922, 951, -484, -1665, -1909, -1548, -167, 1136, 1940, 1892, 814, -378, -1664, -1877, -1348, -128, 1215, 1978, 1845, 960, -780, -1624, -2025, -1340, 11, 1299, 1868, 1647, 755, -697, -1900, -1846, -1225, 6, 1396, 1985, 1725, 586, -733, -1713, -1762, -1221, -7, 1305, 1896, 1563, 410, -882, -1677, -1828, -1091, 218, 1283, 1803, 1410, 437, -769, -1680, -1667, -888, 258, 1338, 1906, 1331, 224, -879, -1666, -1633, -869, 249, 1396, 1784, 1353, 299, -973, -1725, -1558, -712, 372, 1474, 1611, 1221, 123, -862, -1563, -1439, -621, 551, 1395, 1644, 1090, 26, -974, -1579, -1385, -646, 459, 1405, 1678, 1064, 47, -1121, -1541, -1377, -492, 617, 1447, 1493, 940, -123, -1073, -1518]
2385a518J91P62J219O21K48o87q87j081m14L59R28Q74Q75n7n75j038q16l85L04
2404a077Q33R89N93J21p62j003p90l55M64O70J027P37j35p16r02q17k17L34R15
2423i1P15P72j68o21j055o50k91N85O64R65N44j96q33o32q72n8N04P54Q83M29
2443A348j53p71r37o16k06M12J002Q05L89j89p42q27o14j96O33P64P37L73k31
2462I81p04r15n24N4L78P83R03J87j92p17q73n79J9O22O78P77L76l58p42p63m81
2483a090M3N04Q95N51L39m19o96q51l89J11N76P46P59Q3l87p27p93m03J55N63
2503d30P71M95K52l15q23o58l19J21M95Q34L93J82k96o70o96l93J15O00P66M82
2523I06J91m69p21o34k28P2N50P05O12K7l95q43n48j62R4O39O46M43Qn36n28n77
$$ y = [-1518, -1327, -565, 654, 1275, 1523, 836, -51, -1132, -1546, -1187, -259, 615, 1490, 1433, 858, -180, -996, -1381, -1077, -244, 745, 1338, 1459, 697, -306, -1096, -1451, -987, -317, 710, 1447, 1312, 596, -306, -1123, -1340, -1006, -91, 624, 1396, 1228, 607, -448, -1098, -1389, -804, -140, 825, 1369, 1173, 340, -292, -1164, -1222, -718, 36, 919, 1348, 1195, 424, -513, -1129, -1335, -923, 79, 884, 1273, 1084, 342, -485, -1099, -1295, -662, 102, 839, 1212, 981, 277, -638, -1162, -1108, -730, 53, 956, 1143, 951, 234, -639, -1218, -1199, -577, 101, 878, 1254, 896, 154, -609, -1090, -1047, -543, 352, 903, 1242, 823, 127, -724, -1113, -1002, -426, 320, 1079, 1162, 775, 48, -745, -1148, -993, -430, 341, 836, 1088, 773, -50, -708, -1027, -906, -411, 423, 816, 998, 702, 32, -664, -1057, -942, -342, 424, 906, 1097, 628, -93, -727, -955, -883, -333, 372, 984, 1011, 616, -227, -775, -937, -843, -204, 442, 885, 893, 357, -171, -748]
2545g48k18K68N27Q14L73j09l82q26m19k21K84M96P02K68l1m02o33n49j87M00
2565e93N13O47L19j6m09p91n13r3L09N21O48K47m8l71o51m18j52K85O17O41J68
2586H60r4n07o05l25m8K68M95O58J39j38k66q51m09J11L02L29O98K94k23m82n23
2607c17m65lL69N70L82J65j16m42n49l35k0M38L98N01K53k90l81n61l40M4K85
2628d14M88M78J67j80l69n55l40M0L04N29M68J60l48l27n02l67K17J53N09O11
2648G22q1k36m21l01l44q7O00M02K70K07k57m93m55j83J12K82N11K85L2j60l61
2669D4m63k03M8L50N14L01j5j56m65l68k04Q8L44N82K37K1l42k84m33l12J69L83
2691a64L04M34m6j37n24l88j99K88K95M02J21K16k14l85m46l4lM13M18K47j59
$$ y = [-748, -966, -698, -171, 643, 1016, 907, 525, -301, -720, -941, -657, -161, 541, 809, 778, 376, -257, -806, -993, -593, -80, 567, 886, 870, 461, -330, -843, -936, -627, -106, 542, 789, 741, 370, -281, -699, -851, -566, 51, 692, 860, 766, 259, -346, -671, -719, -451, 44, 702, 841, 703, 437, -414, -823, -712, -410, -81, 617, 911, 688, 206, -317, -782, -785, -416, 154, 536, 701, 585, 143, -406, -741, -761, -323, 75, 576, 829, 539, 158, -403, -743, -699, -414, 74, 552, 719, 539, 170, -385, -725, -685, -381, 148, 616, 776, 428, 101, -401, -768, -551, -398, 111, 722, 641, 405, -16, -317, -661, -748, -148, 254, 524, 731, 474, -19, -474, -657, -545, -263, 248, 533, 565, 405, 44, -419, -622, -574, -224, 290, 591, 576, 420, -45, -413, -617, -529, -185, 397, 634, 655, 313, 29, -404, -716, -547, -164, 140, 574, 528, 391, -133, -521, -720, -432, -137, 265, 386, 602, 388, 3, -443, -477, -480, -67, 351, 598, 439]
2712D39m9n61l65J52j8L54L98J10Qj69n02k48mK7K60M60K97l6n12k32k79j04J8
2735e56O61J86J91Ok70l68k94n5J04M42K21J49p5k17k73l48K0J49K65M08J36m0
2757D42l90n8l62j99K26L40K69J88r4k02l74k28P7J09L18K89P5q1k43k88L6k94
2779d44J92K70L17J71k71q0m57q8m5J51L19K57J62j59l27j50k58J06J61J76K05
2800B08K13j41j53n02q8N1J40L50K62J15k65pm21j7o0J37L70J20o8M6k26k84j52
2823c72JK28K88O8K11j87k29j34j82k06M35J68K42l0K4k41j99j43n3J06K62J81
2845B38K96k03k46l10o9m8J04L29K32Q9r2l15k24j88R4J19J82L36j03N3k49l51
2867c26N9j67K52L16J53R7l34p7j22m25K56L59M6J69J40r1k67l35n5J36K00J21
$$ y = [439, 390, -171, -536, -384, -402, -48, 350, 460, 468, 299, -203, -451, -455, -428, -168, 292, 589, 553, 41, -191, -470, -574, -556, 105, 291, 482, 488, 218, -150, -444, -499, -395, 47, 268, 417, 342, 125, -148, -496, -476, -327, -62, 346, 482, 442, 52, -6, -368, -567, -341, -1, 268, 456, 362, 160, -214, -442, -365, -256, 62, 351, 426, 345, 102, -186, -150, -444, -252, 18, 335, 506, 235, 155, -302, -390, -435, -284, 35, 292, 454, 295, -32, -182, -440, -334, -173, 3, 208, 421, 280, 127, -375, -463, -412, -272, 78, 340, 455, 190, 183, -238, -255, -315, -178, 192, 312, 244, 290, 64, -220, -372, -371, -143, 145, 213, 424, 237, 8, -126, -308, -514, -79, 89, 331, 301, 325, 84, -115, -258, -311, -205, 57, 238, 534, 331, 85, -225, -294, -342, -238, 91, 323, 412, 320, 5, -219, -407, -313, -194, -12, 324, 221, 274, 25, -326, -267, -434, -182, 134, 287, 384, 50, -27, -149, -574, -318, 41, 87, 256, 396, 305, 38, -297, -352, -216, -16, 105]
2889A05J94J18k08j90k30q6P7Q7J73K88k4j62j50n1k64L1L03R0J57N0j57j40k78
2912b67q8J24P0K95J12J2j1k44l60j08P8L40J39K57k0k69n2j88r8j2J81Q6L80
2935C57j42n0j82j76j9m6J58K87J7K01l54j36j41k2J36J3K74J84j9k27j47k96
2957c30P4j2K66N3J36J21k21j33q8k51J44L72K8K63k02q0j94j50r2J33R5J19J72
2980B23l2jl37q8n8M2J19J23K51M2j06k53j59J4L8J27L98p9m1j77k18m8%J49J45
3005G4O5K02k11j39J3k56j8L8L38N8N2o7p4k55p4j2K8K31J45J40p9j24j35k12
3029b72j39K70J93L3K28j57r4j95k0l0J09J69J50p3J1m2k47k40M4Q9K31J50J18
3052B86q7j34j43j64k7j2L02J00K6K4k03j60J01k8J52K6J3J03m4j26p3j28RO5
$$ y = [105, 299, 417, 209, 19, -211, -297, -220, -133, 40, 328, 304, 142, -8, -59, -323, -292, 11, 101, 258, 308, 151, 11, -267, -355, -231, -161, 134, 246, 258, 247, 3, -357, -465, -387, -47, 92, 349, 329, 60, 8, -180, -278, -290, -109, -23, 357, 215, 165, -17, -193, -212, -258, -100, 187, 204, 405, 51, -85, -226, -248, -112, -99, 175, 359, 340, 113, -34, -330, -256, -268, -2, 51, 187, 308, 87, -46, -134, -385, -241, 131, 159, 422, 220, 140, -54, -204, -296, -163, -68, 51, 223, 191, 190, -147, -235, -293, -251, -132, -9, 242, 284, 178, -75, -234, -220, -182, -55, 343, 264, 223, 46, -172, -220, -220, -71, 74, 139, 341, 130, -9, 4, -252, -270, -232, 106, 164, 216, 149, 75, -180, -254, -266, -238, -7, 138, 278, 199, 75, -60, -272, -411, -141, 52, 85, 313, 156, 62, -133, -153, -183, -74, 95, 245, 172, 183, 141, -106, -346, -302, -213, 18, 168, 286, 199, 65, -78, -242, -269, -281, 21, 121, 147, 171, -32, -192, -91, -119, 33, 59, 72, 175, 131, 5, -68, -196, -187, -122]
3076a22K20j15K17p4ok52p1R9M0L2K20M8n7j82j53n1J6J21J76R1j11o1q1o1j31
3101b48O4J07J34N9L1K1j85q4r4M3K21j5J08j0o4n4k64j24K20J08J99J16j02m1
3125A46j63m2p2k5N6K05K9M5j32o0j63o6O9N6J63L03j64k43N1k46K0Q7J0L02l5
3150A31k8N1k21j74k1R9J45P8N0K9j25j25l9j33J37J64J80j69J83j98l4J1k14
3173b23R9J33K23j64J04r8k05m6o9K35o2J84mK9r7j94Jm5O0K5K62L1o3K0k49L9
3199g4p5Q6NK23o3j5K7k71r0R6J04J38Q2j6j08J51j58k06p2J77L1O5J78p1k40
3224i6o9p7J73Q9r0J96O8l5j56n8k71K10L6M9J15J42r3q6j30o1O5L7N1N4R3pk4
3251A25l19K4K28k07K08jN7L4k63J5m9R1QJ51o6J31j08L5j70l0P9p5Q6Q7j35J65
$$ y = [-122, 98, -17, 200, 126, 120, -132, -203, -104, -64, -32, 188, 236, 179, -3, -156, -207, -191, -70, 106, 197, 86, 25, -56, -117, -248, -184, -77, 57, 116, 147, 168, -17, -101, -195, -152, 69, 54, 162, 152, 88, 34, -230, -354, -134, -26, 173, 289, 187, 146, -17, -59, -131, -156, -100, 105, 134, 179, 47, -13, -176, -242, -173, -117, 46, 349, 185, -58, -7, -253, -233, -146, -136, 166, 131, 103, 154, -67, -241, -262, -163, -18, 60, 110, 139, 14, -111, -150, -283, -146, 18, 198, 29, 212, 14, -20, -9, -223, -124, 9, 232, 68, 172, 74, -131, -177, -246, -11, -73, 111, 107, 136, 39, -155, -154, -199, -139, -114, 148, 179, 116, 136, -113, -74, -149, -63, -58, 165, 102, 87, 114, -157, -247, -151, -47, 91, 173, 157, 49, 200, 42, -164, -236, -59, -28, 37, 215, 144, -96, -165, -242, -69, 20, -70, 126, 194, 159, 3, -55, -326, -116, -80, -31, 84, 226, 133, 47, -83, -144, -79, -42, 9, 63, 156, 149, 125, -194, -170, 58, -149, 59, 58, 115, 149, -114, -99, -148, -57, -49, 102, 36, 167, 59, 94, -76, -106, -27, -102, -16, 71, -64, 101]
3277A01j20j6j19N8P2N6k7J46j30p4K7o3j32L06k12J78Q1j03q4k2n8Rk1J79J02
3302A34j68M6R3q2j49K55j18N6J70j64j22J9r4%MO7Q6J37r9j09J37j51l3PNJ87
3328A14K9L4j04p3j99P1J09j0Q3M0r8J11m6r8j3r1M7J39J4Q9q4qj49K9P8o3R8
3355D9R9o0l6q0j22O2m4J05R2M1p7mj15k8M0o3J26J53r2j1k4r0J26k15Pk5J32
3382e4J20p9M4J60j94j77J11R1L4l1o1M9r4j9j35J51L9j9J41j8lm2o8m4k8J49
3408B3K6J32j85p6J00j71JnJ48L4O8K8j86Mk0j18R6J14J32p8o1M8j70r3O7R4R
3435c9R3R8r9r2j4j3j62J53O8Q6O3j12J10j29o8j27J12J07PK2p9l6j09n3K62n2
3461cq4J83p2P5j12m4j04P0L0J20r3Q3K9j9j64jl6N9J69nq8j4J71k58n4P7N1N0
$$ y = [101, -19, -35, -154, -96, -24, 32, 5, 151, 21, -53, -26, -89, -221, 85, -127, 51, 132, 29, -55, -77, -135, -126, -147, 32, 134, -34, 12, 105, 23, -126, 129, 11, 67, 237, 73, -49, -30, -124, -124, -120, -53, 33, 170, 71, -38, 99, -52, -85, -78, -73, 114, 143, 177, 73, 0, -199, -128, -19, -29, 54, 94, -4, 107, 61, -37, -50, -141, -94, 45, 59, 148, 64, 56, -93, -64, 14, -49, 49, 148, 88, 52, -28, -150, -88, -132, -27, 65, 106, 29, 25, -90, -118, -78, -141, -15, 138, 46, 35, 11, -79, 47, -168, -161, -186, -54, 66, -13, 31, 191, -3, -180, -69, 22, 56, 25, -36, 13, -81, -100, -235, -84, -45, -64, 77, 59, 56, 14, -54, -98, -126, 23, 49, 181, -4, -80, 20, -151, -150, -155, -7, 27, 95, 123, -63, -59, -79, -197, -101, 13, 145, 67, 6, 54, -116, -209, -142, -48, -39, 54, 152, 53, -39, -53, -66, -228, -75, -7, 79, 142, 30, 140, 11, -57, -184, -72, 35, 42, 64, -15, -51, -160, -213, 49, -3, -87, 96, 24, 99, -13, -57, -161, -91, -61, 59, -34, 49, 78, 59, -105, -106, -142, -83, 86, 81, -7, -21, 150, -108, -162, -85, -34, 16]
3489A6J04L3j16l7l5m0Nk2J26J7J29j49p1OM7q2p5L43J7p5K4j99o9q4mJ26k2J30
3517D3P3N2j94l3m4P5P5L0P1n7j26p3j9P0K6L0k0K0J92o6j74q9k7J21p0J03R1
3544H0p0J04j49q0J00p5N6RN3J00j07M5j86k6K7Q4J29j2o3n8Pq0N4M9o0O4L9K21
3572B55j96l3j29P1j75K80q1J17k6l5J5o9j02Q8M9r5J57p7nj10j5R5n9R0R6m5
3598F1q8P1M0j46m4L0j04K45o1p3R7l8r8J9qQ8J83j19N5M4k63K1k6J24K3j1K28
3625B50j35j40J22j29kr7K02O6j93R6k9k6j76K85j49L3j2M2P0J23l34J4j4ON4
3650g3K99j01j54L7j6j17J8P2K30j54N0lj24k3l3K3L6N9O2O0l5j02r2k7P0n4j4
3677a06J89m8m1m1n4K4P9K3n7R3N4l9p1j6o2Qm5K92p5m4p2l1j59P9J41k9Q9jJ18
$$ y = [16, 120, 153, 37, 0, -35, -75, -70, -92, 34, 51, 180, 31, -40, -34, 13, -69, -144, 199, 216, 141, 165, -34, -103, -187, -191, -65, -87, 43, 116, 168, -26, -59, -103, -28, 47, 77, 148, 91, -35, -108, -127, -57, -31, -1, -21, -1, 191, 125, -49, -138, -165, -44, -114, -11, 80, 10, 114, -35, -115, -15, -90, -34, -25, 28, 128, 21, 66, -120, -146, -119, -35, 94, 82, 19, -39, -32, -112, -58, -9, -69, -5, 34, 255, 59, 26, -103, -32, -207, 73, -8, 109, 83, 48, 63, -6, -108, -20, 29, -66, 91, 14, 9, -101, -116, -21, -80, 10, 106, 61, -27, 44, 84, -62, -106, -76, -180, 65, 4, -69, 28, -10, -108, -89, -97, -9, 174, 55, 110, 154, -109, -88, -114, 10, 33, 22, 250, 115, -25, 97, -32, -34, -131, 71, 137, -56, 40, 11, -15, -191, 94, -55, -22, -34, 8, 78, 201, -133, -119, -133, -127, -73, 226, 125, -29, 8, -8, -125, -107, -35, 195, 41, 91, 88, -36, -59, -92, -69, -33, 26, 88, 148, 113, 11, -81, -108, -38, -92, -106, 83, 35, -6, -47, -101, -77, 2, 25, -32, 61, 115, 76, 5, -11, -73, -65, -110, 182, 107, 63, -9, -40, -199, -120, 21, -8, 81, 80, 198]
3706A98j45N0j44j14P5Q8OO2N1j01r1o3N1j4Q6j1J05J1j04j87J09N9m5J3L1J36
3732A12j97J62n5L9q2m4M1J33r2RoL5k29K22j42L2J88o4l5Mo6K5K1rrL5J42j83
3760a3k0o7Jl2J30q0K14j63O8N1k09J06r8J54o6j4J11r2L8m4M0j26J39J41k2j03
3786D4J43o9j64j18Q9J9K9J18L6j55qo0O1K1ln0P3Q4j40O2j08J7P6j31J52O8M3
3813A29l1r2q2r8J89L5pOo0R0j92O6k06L26J7j78L07m7k31J26p9J4j4J63j14J3
3839E0n9J04r7j55P0MJ11P2K1N0r6j82Q9j60J21J39o5m6P7k4k6j02J6KJ52J89
3865B55k31Kr4O4j18P7J46k9l0lQ1q0r2J2q9R4J48J3l7jj4j96j5J16Q2L8m5P0
3893A24l1k32J74q6l4P3j8R6J68j15p1k15P1P8N1k5J02r5j89K85j52r6K1J4K10
$$ y = [198, 53, 103, -41, -155, -80, 8, 14, 76, 127, 26, -65, -128, -77, -91, -5, -16, 89, 100, -4, -191, -82, -23, -68, -55, -24, 112, -85, 77, 22, 61, -21, -65, -24, 109, 17, 26, 20, 55, -174, 48, -94, -62, 126, 62, 27, 31, -35, -10, 11, 2, -7, 28, 170, -13, -33, -100, -99, -131, -1, -81, 133, -30, 38, 89, -120, -14, -112, 42, -24, -38, 73, -19, 19, -25, 15, -111, 28, 169, 147, 44, 187, 118, -46, -164, -75, -56, -27, 91, 127, -28, -36, -96, -35, -14, -17, -67, 6, 90, -50, 12, -96, -79, -3, -134, 18, 86, 129, 98, 6, -76, -174, 15, 50, 43, 49, -11, 79, -113, -47, -253, 73, 90, -88, 219, 172, -59, 67, -12, 2, -12, 151, 37, 50, -9, 95, -2, -157, -87, -83, 28, 100, 121, 171, 75, -107, -18, -178, -57, 82, 17, -29, 48, 24, -2, -104, -88, -86, 66, 255, 24, 26, -68, -4, -122, -45, 101, 72, 42, 39, 120, 40, -52, -40, -129, -35, 113, 126, 89, 88, 74, -122, -137, -21, 61, 99, 54, 124, 93, -139, 35, -51, -85, -12, -30, 66, 234, 119, 48, -167, -96, -18, 33, 8, 110, 15, -174, 111, -41, -137, -116, -102, 108]
3918A08o4N5J6q7j27m2J40mP7r1K73j95j21m1Po5J67R0j0M9j07j12M8P2j73R6
3944d1N6P3M5p7j34no9J52o6J25J14j97M7j19J31j34O3j6J12k0R2o5j02m4o4J52
3970In5N3P0K9p3q0m6J9R6NO8j49J19j17p0M9k5M1P6n4K46k37l5L5j23L6%J34
3998B1N0m2K3l9L4j57j0Q2P0k4J51j51q5J3J0mN4K10q3MKj81q4L2P2j9O9J47j23
4027D2k2j36K5M3j9M8Q1J37j21j34L7j09L0R1N4L7NL5j70m1J14j18mQ1O1J9m5
4054B1j1j7J5j59R5J01M7N2p6pj84m2Q4MJ53j11J41p7n0r9J70j65J26m9J92j7
4080A37q7n3k8r4J15l0j8K41j7J28m37N2J4q5J50m8J62n4p0n9rk5M8j5J41J34
4106A93o9o2j72j2r3K5J50J39O6l0l8j54RQ5p7M3M1P2M5q1j99l0N4mJ74j6O9n5
$$ y = [108, 44, 99, 115, 28, -99, -141, -1, -5, 72, -19, 254, 59, -62, -103, -96, -161, 6, 96, 86, 135, 28, -84, -36, 36, -137, -41, 15, 88, 133, 56, -78, -83, -152, 0, -66, 59, 173, -24, 23, -96, 35, -99, -36, -52, 60, 40, 132, 67, -35, -79, -143, 9, -46, 7, 77, 106, 33, -47, -93, -74, 22, 27, 95, -54, 65, -52, -122, -73, -98, -57, 19, -35, 211, -26, -61, -26, -149, -113, -113, 21, 71, 29, 52, 13, 47, -110, -120, -38, 32, 8, 159, 8, -77, -64, -54, -58, -4, 206, 123, 127, 129, -52, -136, -104, -32, -51, 18, 165, 42, 20, -116, -91, -48, -67, -19, 62, 199, 78, -56, -19, -128, -98, -7, 47, 84, 89, 124, -46, -87, 27, -91, -95, -14, 47, 66, 21, 10, -7, 8, -151, -56, 45, 92, 144, 68, 61, -123, -165, -81, -77, 76, -35, 106, 29, -21, -120, 50, -115, 11, -38, 154, 137, 50, -3, -31, -125, -10, -40, -58, 183, 166, 294, -143, -91, -77, -162, -12, -60, 102, 48, -22, -81, -90, -115, -67, -82, 59, 193, 124, 62, -110, -122, -215, -190, -40, 99, 165, 135, 97, -57, -48, 37, -40, 3, 44, 116, 161, 80, -119, -149, -95, -99, 75, 59, 128, 73]
4134G3k01K1j1rQ0J86j2M9K7j05m9k73R4J20m1J68j13O4r3l2r2N9j4R3N1M5Q0
4161A65k02p4o5K29j65J26J26l8j9J48l59Q4j38J20N0N6J22n7j01j03R1j70J33
4184d1J03J16j75N4j59Qo4N4J19M0J16N7j60m9p3l7j93K92j1J87j88L1n9n3J8
4209f7M7q3K07J70q9q2j71L3l7rJ06j5J58M2q9j24r1M9n2Q5Q9P5M1j66j30rj9
4236a31J09J49m3L0J2j0j92j3j08P7J71q1P7Q7l3k68JL1OJ02J00J48j25j67M2
4261b9K7j54J90r2K45p5K4j6j73K2j44J58J7P6M2j73oK4j48O1N9Q3J33m3j9k3
4287F6j45J2n6Q0O9J33q8Mr5j50M5R2r1J14M4J05o0j45N6n5p2R9L6J21l5n2r4
4314f2o7N4j25K74m6N7k7j8j0q7p9M1P2R0l7M7l3o1J16k46N8M2M1J72q4k6rj21
$$ y = [73, -128, -107, -118, -127, -47, 139, 127, 176, 203, 98, 49, -224, -130, -10, -51, 117, 4, 68, -25, -57, -149, -90, -104, -11, 40, 85, 165, -37, -111, -176, 53, -112, 14, 140, 102, 83, 231, -128, -44, -182, -62, -12, 44, 166, 109, 8, -95, -4, -174, -41, 62, 178, 3, 57, -102, -94, -158, -104, 15, 55, 171, 228, 68, 19, -54, -91, -284, 8, -3, 184, -4, 27, -32, -85, -67, -20, -103, 104, 274, 185, 103, -68, -35, -72, -81, 25, 10, 168, 210, 121, -3, -94, -45, -97, -12, 77, 152, 193, 27, -103, -112, -131, -22, 127, 84, 114, 126, 116, -76, -89, -197, -120, 51, -30, 47, 134, 101, -167, -166, -135, -129, -27, 73, 221, 96, -71, -29, -2, -156, 34, -58, 187, 112, 136, 120, -53, -31, -175, -17, 0, 76, 118, -55, -61, -37, -185, -124, -65, 18, 151, 108, 89, 66, -79, -67, -123, -43, 26, 159, 71, 75, -20, -170, -125, -33, -124, -10, 34, 139, 79, -66, -10, -65, -137, -38, -2, 119, 84, 32, -62, -129, -75, -200, 74, 28, 85, 58, 40, 30, -57, -136, -95, -23, 67, 30, 77, 44, -17, 99, -147, -89, -47, -6, 166, 82, 56, 47, -74]
4342g4n3JO8K06j29Q9q4J6j00K4j7J26JJ7R1j67p6q4R3MK0P4J2L2n3j28o8qK25
4371E8r0J11K0k6m2n1r9mrL03p3j0pQj69N9j05J48J7N7J46k51L0O2k39M7J8Q0
4399a1R7k9L3j58o1l4m5O5J07J93o5nl8q2p2K1k5K06%q2oL5r1l3L1r6J85n7J31
4428A14K1o2k56P7L8O0RJ5M8j3j34o1p4R1O4P7J46k4o6o2j26p3K50q3MN0J0Jj01
4457f0J31j62k7J49J16j2l8p4j25J54k44J30M7J36m2Mok49P6jL0K7J6K00mj40
4483C2j5n3N2n6Rp9K86p0J1j37j46o2J73P8J19P9j82p9j0n0M7kM5l9O4N4k3n8
4511a2j5j35J09nJ9l1K00j98K3p9R9j11J85n3J92j36j29j0o1J07j18J22J86j7
4535A32n3j77M5Mm7O4K5L8k5j2R9o8q8J62j20JJK1P0j21J02j59rQ1J42m9K5j69
$$ y = [-74, -127, -126, -58, 148, 19, 108, 24, 40, -60, -36, -53, 73, 74, 91, 182, 15, -61, -145, -52, -48, -28, 46, 58, 90, 37, -91, -159, -167, 58, -32, 79, 99, 73, 31, -20, -119, -123, -132, 171, 98, 88, 81, 89, -80, -21, -126, 22, 39, 96, 242, -9, 21, 83, -156, -109, -91, -11, 86, 57, 90, -68, -129, -163, -208, -143, -36, 157, 92, 87, 49, -33, -105, -84, -109, 97, 97, 15, 9, 44, -47, -80, -49, -145, 40, -17, 114, 135, 73, -183, -106, -68, -8, 1, 16, 64, 51, -83, -144, -218, -127, -63, 14, 160, 136, 70, 8, -118, -191, 59, -24, -20, 30, 40, 41, -60, 71, -91, -118, 31, 147, 135, 97, 23, -102, 52, -192, -62, -15, 121, 79, 83, 77, -172, -96, -97, -67, -40, -24, 176, 172, 32, 17, -36, 16, -40, -31, -110, 176, 106, 117, -20, -166, -228, -55, 23, 142, 221, 39, -40, -50, -100, -53, -55, -10, -49, 15, 69, 46, -12, -27, -162, -53, -58, -39, -70, 130, -68, -45, -124, -25, -136, 49, -4, 188, 52, -77, -87, -148, -41, -159, -37, 149, 132, 79, -98, -53, -49, -96, -32, -7, 31, 6, -6, 93, 25, -63, 99, -21, -20, -19, 2, 72, -49, 53, -106, -115, -34, 108, 59, 84, -85]
4563h5J2L4r1R8K0Q9N6L9k08k0J6Q1j16j7J10R6o3p6J50k11K8j0J03k9R1M7j74
4590c0j24n8P7O7J06L8J78j24k56M7j1m6J02p2J16L3n7Q7j94l3J16PJ56n4M1n6
4616E6j09m2m9M0N0J00o7m9J30j72Q9o7l1L0L5J34q4N5n8l8l3m1L5K07j58J49
4642A12j33J4m6pP3QM1K7j65K8J33q5k4j33J71p4J79r4n1R3j60R5j16J73j37J89
4668A11j83J20k13J42p9Q1p4k1J76jn3l4q6o3O2J13j4q4K47j36ro5k0r2J23K02
4694A50j64J02j04K2%n7J31m4L9R1k5j56j23J6l0J31rJ76q8L7j35L4j09J49q9
4719e5J9J28o5KM2J6k05Q2J8N0l5O6m9q1L0N6j46J30l6J69M7j86j7j27Q2m0J9
4746h6O5N8K6K0j17n6N9PJ00N0N7j63l3O4j23PM2J3N1M3l3N1j22p3KJ10O9n7M
$$ y = [-85, -73, -39, -130, -32, -12, 77, 133, 172, -36, -56, -40, 41, -75, -92, 18, 114, 51, -25, 125, -86, -58, -68, 35, 6, 97, 144, -30, -154, -212, -135, -68, 38, 76, 254, 130, -126, -79, -90, -136, -34, -106, 10, 43, -14, 73, -121, -154, -38, -31, 125, 71, 112, 56, -53, -95, -144, -104, -54, 46, -21, -70, 60, -112, -23, -90, -121, -91, -56, 78, -6, 49, -9, -47, -80, -121, -86, 121, -37, 112, -21, -7, -53, -60, 13, 21, 62, 89, -76, -48, 85, 0, -24, -157, 14, -60, 119, 25, -26, 67, -93, 2, -114, 59, -78, 111, -72, 48, -165, -23, -102, -21, -95, -116, 60, 59, 6, -28, -114, -177, -115, -2, -16, -100, 147, 11, 2, -63, -83, -175, -52, 150, -14, 88, -16, 6, 6, -51, 80, 36, 75, 166, 141, -15, -138, -122, -152, -21, -30, 146, 58, 95, -40, -6, -115, 34, -55, -36, 92, 27, 29, 71, 87, -118, -36, -18, 32, -3, 63, 14, -67, -37, 19, -127, 3, -33, 136, 183, -3, -20, -147, -65, -105, -86, -21, 37, 63, 83, -34, -90, -31, -24, 76, 126, 183, 20, -13, 51, -72, -65, -23, -10, 41, 84, 51, 102, -20, -93, -91, 19, 88, 31, 35]
4775C5M7lj01R5j80O4J81r3lJ6m4q3L9l4j27J34J17qK3j66J28n1m6m8K00j60J00
4802C2K3m8l9J29m6j11M9J25o9J11k02kRP4K0k23J60K9M1l0j51J64l7j39O4J38
4828G1n8R5j82k5L3l4J71q3k4O7N7j41J3o9j8J45J4J26J1j18j21J27j08Q2M5j59
4854h3J42j4P1p2p0k1o9K01L6q3O9n2q4o3J87j21k4J86j57K3j1j41J95n2l0J21
4880H4o7O8q9M4k02J99o4l5R6p4K2lk4O9O2q0M2n4N2L9r2K0l7j2j5l0R6N3N2p6
4910D4j41N1p0J40q2j9J52P4j77l7K3N5O3p1J03k4r4p5R7p5M1P8j2j06K24Lk32
4937f7L3n2O4M4Q6j18L3J6o9J9O1O7j34J0N5Qj04j6NQ1j67P7J05Pn0q1J70j88
4965a05LL1J76k27J71K7p1P2kq2r0k3J01J38j05J55l02J55l0q3O7J28j53P4k7
$$ y = [35, 82, 79, -22, 73, -107, -43, 138, 45, 42, 58, 14, -69, -30, -64, -191, -57, 60, 52, 75, -91, 37, -14, -60, -108, 92, -68, 32, 55, 7, -32, 97, 51, -60, -11, 114, 45, 156, -46, -48, -39, 35, 55, -168, -8, 21, 62, 32, -119, 45, 8, -131, -67, 71, 13, 108, -74, -99, -66, -100, 71, -12, -36, 31, 88, -53, -40, -109, -127, 18, 32, 158, 169, 51, -70, 57, -51, 31, 76, -83, 59, 45, 116, 44, -26, -47, -116, 85, 121, 38, 107, 55, -29, -92, 95, -26, -50, 136, -21, 2, -9, -150, 45, -7, -37, 84, 17, 85, -4, 40, -162, 37, -27, -62, 34, -40, -18, -21, -45, 24, 86, 6, 48, -6, 46, 85, -7, 13, -24, -36, -51, -81, 15, 68, 120, 44, -97, -46, -116, 24, -58, -77, 75, 149, -28, -65, -42, 13, 76, 5, 108, 84, -10, -85, 12, -63, -22, 56, 44, -62, 162, 165, -67, -34, -86, -22, 22, 108, -10, 23, 39, -30, -11, 50, 117, -17, -7, 48, 56, -48, -64, -59, 22, -145, -68, 37, 44, -6, -87, 83, -105, -102, -71, 105, -122, 49, 76, 5, 77, 75, -7, -97, -120, -19, 119, 14, 169, -133, 22, -8, -91, -24, 104, -49, 25, -2]
4990bj1n8P5J01j07k0J19pLk45J43j63J43R7k8n7J46j30j53K23j66J79p9P1N9
5015A33l2j94J14r5Q6o1M3M9J9j0K1r4L2j35K16q8rJ35j20m6Q9M6j79K8M3P4N8
5042A23j79RJ01j51P0J14j40R0J13k29O6j15N2K93j57m2p4P8k5M4m6K1j22R7J27
5067A18k02J18p3K0no4J4O7m4K22k38R7j04m2K4K0K1J26k4J7q2j22J46p5K18k01
5093d8J27m0j2Nl5jn0K14k64Q5L5p2N3M4J3n7J32j48L6P9m8n3Kq6k1K13j41OK2
5122a0K1%n1KM8nJ69j68L4J15j44p7Q1M4L7q8J26j00mM4j87J4J25q1j8Q6P4K6
5150A13r8p5L1J24j32k0K7K9KM6j43P2O1r0M1o6J83k12K1NJ2n0K8J0JJ35r7O5
5178B3j44k1J10l5m5P3J35J7j58l2P5P4j49M9Q3m5LPo1J01j20K5J64k9j28J44
$$ y = [-2, -13, -71, 4, 105, -2, -22, 97, 90, 93, -152, -9, -172, -29, 68, 40, -17, 129, -1, -154, 69, -97, 82, 3, 74, 133, 101, -93, 21, -74, 12, -49, -6, 43, 62, 52, 73, -21, 11, -124, 92, 4, -5, 130, 10, -36, 53, 99, -80, -52, -9, 65, 123, -56, -47, 54, -97, -27, 87, -53, 37, 150, -79, -13, -128, -76, 217, 60, 18, -56, 22, -3, 41, -5, 16, -106, -9, 118, -84, 34, -39, -19, -24, -88, -74, -7, -51, 171, -67, 30, -74, -116, -92, -72, -51, 75, 51, 68, -14, -136, 10, -65, 153, -48, 79, 39, 27, 32, -3, -4, -54, 160, -104, -19, 16, -56, -3, 41, 54, -3, 129, -19, 17, 96, 48, -5, -3, -89, -110, 103, -38, -32, -10, 11, 11, -40, -38, 10, 5, 174, 6, 40, 155, 11, -66, 15, 59, 96, 8, 134, 34, 30, 74, -113, -99, 26, -55, -73, 13, 87, 113, 15, -60, -29, 95, -37, -57, -30, -1, 1, 47, -96, -24, 37, -53, -12, -78, 105, -107, -86, -81, -69, -119, -91, -81, -80, 55, -42, 23, -121, -142, -32, -67, -112, -39, 96, 113, -45, -77, -2, 72, -77, -28, 55, 10, 13, 20, -41, 60, -60, -35, 129, 100, -28, 116]
5204A16j85N0P3k5Nn6j1N3Jm1n4M0L0LJ40j32j06K3K0o5J46L8J7mk7l4k9o7M1
5233d0j4R2L3o9L4l2p3NK6O7J8r0P0Np5jk3N8K1l0R7n5N2j8q5k5q7J12J7RM0j6
5265B3j42J49J6p3K1P9m2rq7k2J01O5r6j01J61O7q7m3j37J25ON5m0J57J9j40%
5292B5Jn5L4J38k04R3Q0k13J69J02k13J68k11J26j1j7K3lJ0p1O9j13O2R2j21j6
5318e6P0j2l8o1K4P8oqK0P2k50J32m3J4N0L9N8q0l4o5k1O5J1j37K31J4q6R7j8
5347F0j97J00L9J1J16k37L5L4L3j69J78r9K20L1j18O1m0j25q1J05L9J09q4j2J16
5372A25p2j53R3k0l0J35j18P7k0j57P2L0k2j00J23K9M1q2k4k0J61j37n6P8J8J36
5398A07j07qn6j02K48q5L0q1J83j77O7j82Q5P4J47j0L9j15j63J76j33J94j63P5
$$ y = [116, -69, -19, 54, 29, 34, -22, -33, 20, 21, -20, -74, -34, -4, -1, 139, 7, -99, -76, -56, -121, 25, 63, 80, 76, 49, 15, -14, -81, -40, -54, 38, 71, 2, 36, 4, -69, -64, -38, 29, 47, -43, 27, 32, -43, -44, -67, -9, 12, -18, 79, 24, 76, 58, -27, -52, -139, -27, -10, -1, 39, 23, -119, 30, 46, -27, -6, 73, 31, 22, -65, -87, 14, 79, -17, -118, 43, 110, 23, -20, -157, -32, -26, 29, -11, 146, 165, 25, 25, 26, -29, 5, 143, -61, 32, 112, -101, 68, 170, -43, 125, -86, 40, 29, 12, 35, 32, 42, -29, 40, -73, -11, 81, -40, -56, 14, 2, -36, -97, -73, 5, -1, -9, 11, 83, -167, -35, -78, -64, -14, 25, 83, 3, -31, -96, -117, -52, -41, -178, 53, 67, -19, 78, 60, -137, -37, 2, 13, 129, -108, -73, -39, -6, -175, 3, -96, 124, 155, 37, 98, 58, -67, -148, -43, -4, 105, 21, 9, 125, 53, -100, -7, -27, -57, 78, -40, 37, 17, -140, -68, -38, -60, -160, -37, -8, 33, -49, -73, -93, 68, -69, -125, -47, -29, 107, 0, -8, -64, -166, 82, -3, 27, -54, 129, -48, 19, -163, -78, -4, 143, 133, 172, 57, -106, 70, -63, 131, -32, 43]
5422D3%j07L5M7j13k1J48o7O2M6q9R1j48MJ9j06J28K4J31p7o4K8l6m6m8J47nn9
5450c3P3P5j80J6kL9N8N7j09Q7j45MQ8mj24M1J13l5n8J11j53M7kkm7J11o1R4P2
5479A31k64L1N8M3j08K47j0j10k0k9k7pk0N3J05K6j46n1J68k0o2n2K2M8l4O9j17
5506g6J48j97J37n1qQ9O0l0k2j53j9M3L8J41m0L0j10n6N7r9R5O5K2o6J86nj36
5533D3o9n2l8Q9J6R4pj5P0k37M3R3r9J05K1k1j42R8n7M4j40J08J34nk1j14P0m8
5561c7L3j33J27J15j64J40p7j16Q9p6J7O3P5m8J38Q3j81j3n5j6O9lmj0PL5j32
5588g4QK8O4Q2Nj36N6o0q3J22p9J33K0K3P0k32p6N0J9K3lK2j5N3k2%q0M3L7N7
5618E5o5P0O2j71j14R6N7m9J3J61np4j3p4p7R8J2Q9Jj11N2j09J53j69j15J44J22
$$ y = [43, 43, -64, -29, 18, -95, -116, 32, -35, 27, 73, -16, 75, -73, -69, -50, -156, -28, -4, 127, 50, -14, 14, -22, -68, -116, 31, 26, -33, 40, 115, -65, -49, -51, -12, 46, 103, -6, 81, -64, -60, 28, 24, -100, -59, 54, 19, -39, 72, -81, -34, -36, -38, -85, 26, -35, 59, 131, -133, -102, -44, -1, -109, 138, 128, 18, -2, -31, -58, -65, -85, -32, 73, 99, -47, -98, 70, 50, -12, -64, -42, 6, -28, 41, -76, 72, -125, 12, -39, -47, 42, 102, 72, 50, -103, -122, -79, -41, 100, 60, 90, -20, -76, -19, -118, -23, 42, 64, -2, 184, 179, 43, -26, -78, -116, -27, -11, 83, 76, 61, 131, -106, -63, 30, -69, 36, 57, 36, -106, -8, -65, -21, -161, -53, 81, 76, 55, -59, 11, -37, -4, -137, -10, 105, -59, 81, 4, -112, -23, -99, -82, -19, 56, 8, 146, 229, 48, 35, -20, -36, 33, 30, 26, 16, 23, 58, -74, -66, -38, 26, 108, 113, -23, 33, -27, -110, 12, -67, 66, 86, 109, 179, -53, -129, -79, -60, -37, -40, -18, -33, 20, -2, -2, -82, -39, -2, 55, -10, 60, 122, -49, -163, -67, -10, -59, -46, 115, 110, 36, 23, -51, -128, -30, -18, 71, 72, -39, 13, -96, 57, -112, -227, -83, 39]
5645C9j05J43l2M7j23r1l3J95J6J0P4J6o9j03j36QR1J34L9j21m4Q8j29Q6o5Q3
5671A8J09j27N0nj26J09j35LK10q6k3J57r2j77J14k9j14J85p8L3MO7j13l7O4r9
5697a18J15N2r6J10k3p8Qm9k6K7J26m7O8M9j70L9r3J0Q3k2J7J01o5j8q2n9J67
5724B6%J70k59K01o6Kj89M8oJ19M2KPn8p5m0K7J6J30r0J25j33J22j37k9R5r8J4
5752c4P6K5l7n4L5qj49J87K0k9Q1k1j28k8M0o7J22lR2r2M3j28QO3j57J9K78p6
5780G8j8p1L0j31J21l9OQ8m9J45j98RP2q3L3Lm9J71j18k8L5m8k9o9J63L8L8l8
5808F2j63J43r2N0q0O0J1L9N9j38J42o2j50J8J6O5L9mNj43P2J15k5r8R5M2Ppj00
5837b2L6j07P3k9O2J11J7l11K48j75K6j8J04lq6K29j33k7r9o3J26J2K0mM9k1j9
$$ y = [39, -66, 77, 45, 92, -31, -122, -155, 40, 56, 66, 140, 156, 87, -16, -152, -144, -53, 81, 120, -1, -45, 43, -86, 0, -65, 18, 127, 0, 50, 45, -81, 28, -107, -104, 106, 20, -3, 154, 62, -115, -1, -30, -144, 41, -37, -4, 0, 67, -46, -83, -19, -118, -3, 49, -47, 63, 40, -38, -30, -79, -105, -78, 48, 1, 69, 118, -52, -13, -106, -96, -13, -35, -18, 83, 18, 0, -82, -141, 26, 26, 196, -63, 138, 72, 74, -115, -67, -73, 46, 88, 90, 97, 39, -36, -76, -49, -33, 97, 7, 132, -1, 121, -16, -45, 50, -48, -34, 42, 67, 30, -24, 11, 3, -146, 41, 61, 32, 113, 92, -36, -64, -24, -91, 31, 28, 120, 28, 71, -57, -49, 14, -143, -124, 154, 78, 60, -11, 19, -112, 9, -30, -24, 64, 15, 160, -38, -29, 43, -40, -7, -4, -53, 118, 0, -28, 7, -41, -70, -139, 24, 62, 100, 62, -101, 42, -50, 0, -80, -20, -9, 30, 89, -49, 93, 31, -119, -101, -85, -20, 19, 15, 20, -123, -51, 64, 39, -59, 36, 78, 85, 78, -22, 14, -93, -20, -49, 13, 124, 141, -170, 78, -97, -71, -89, 15, 12, -74, 155, 22, -5, -104, -167, -41, -29, -9, -13, 36, 15, -4]
5864dm0K0m0J47L3j28M2j8j23N1j02O0K47j34J49q3p2p4j04J04J4R5K7j4m0Q2
5890I5j76K6q4J01J21k0Q1j09p5k14K01R1k0l2R1oJ24k63J38q2Lk9J76j38J13
5915A13k6o1Klo1K8PJ33j9j04n3k2Lj3K6p0J65R4j79j0nn1R5o7J02J0J04k51J22
5944Il2m0O4m8J50j6j10o1L5P0k8n7K0Q4L0o6j4mJ76k15K7L3O7lj00k9O1K2j16
5973i1O5J24l5j6O1j61m7j60R7K67j13J09Pp7j9nk6K4L2r4J31Jr7J30j74n6J12
6000a1o1J22j9J17j56J28r0r1R1k38L45q4l8M4o6k8r5J05J22k8J03j80N0q3o6
6025a07J1l9K51j37M3P2j35J36j97J8M1P2J0j51K73j90K3j89J93N5lm4p9o9K00
6050E8o8K9l4kJ41qq4m4J10l1j48J28j55J0j5K13N8M9k58J27j02QJ05j09J02o5
$$ y = [-4, -44, -24, -64, 83, 116, -12, 30, 12, -111, -60, -162, -102, 145, 11, 160, 77, 5, -69, -173, -69, -55, 40, 67, 53, 13, 95, -81, -55, -139, -38, 83, 63, 144, 35, -40, -254, -53, 38, 18, -14, 77, 71, 195, -68, 70, -12, -9, -38, 138, 0, 113, 87, 26, 28, 25, -36, -8, -1, 132, 113, 9, -44, -66, -63, -76, -50, -120, 45, 139, -40, -50, -55, -106, -11, -78, 24, 34, 138, -113, 9, -23, -63, 1, -47, 103, 87, -23, -84, -49, 21, -7, -64, -44, 40, 70, 4, -10, -14, 162, -53, -26, 7, 74, 71, -29, -58, 3, 25, -91, -26, 98, 63, 47, 108, -53, -100, -260, -163, 104, -9, 100, 107, 30, 11, 6, -20, 4, 36, -58, 73, 74, -23, 107, -67, -123, -11, -72, 50, 31, 148, -8, 120, 30, -61, 30, -208, 137, 53, 15, 59, -7, -35, -130, -25, 97, 69, 172, -8, 42, -41, -107, -96, -135, 116, -21, 22, 94, -41, 95, -102, -84, -43, 29, 39, -112, 161, -29, -6, -195, -2, 53, 50, 6, -73, -142, 58, -10, 19, -15, -17, 124, 116, 32, -12, 98, 67, -81, 47, -108, -98, -113, 100, 158, 207, -51, 76, -26, -18, 87, -22, 80, 15]
6076A5P7J0q2p5M1j27J24L7M0j29Q9m1q9j67L58j26J31N1r4p4N7j86J06L2O6p7
6102c3k8M7j34O1L2k4J4M8J28j03k8r0J23j31R0J30n4J1J53k30J4O5q1o9K9J77
6128A17p7j5j19j9J61j96L5P4J05l6q6J02j1J01k25o9P9R4O7m0o9pRO8l8k2K42
6155B25l32J16j20O8M2j0o3J7J12j76J09k1M0m5j0l7j1O7L4N1Kj24O0nk3J69p2
6182F3R9r4o5j38K3J81n6m1M2l5K0K7o7j77J98l1n4O1R0rn0J3m0P2kOj33J78p6
6211EJ64k71J4L3J67O2j88lj1n5n6J41n5J73r5m6Q9j01j1p9P5o0N2J27J6L5j46
6238b4on1Q0o4L9Q3L5j60J16j09m1K6j05K01R8j8j51M3J04j23q4P2k2O0P1r0O7
6265D7j30q8J92l4P6p3M2l9j18K03j05P7j63J76m6oJ00j09q6N6qJ13j03J55j19
$$ y = [15, 92, 102, 20, -55, -14, -141, -17, 20, 60, -69, 20, -21, -110, -277, 81, -45, 86, 137, 43, -31, 26, -160, -54, -22, 44, -33, -61, -14, -148, -87, -55, -79, -65, -17, 111, 8, -20, -110, 13, -118, -28, 102, 48, 59, 212, -18, -4, 61, -20, -89, -60, 117, 40, 25, -94, -113, 48, -148, -113, -39, 66, 30, -56, 46, 35, 136, -89, -158, -79, 15, 82, 42, -27, -34, -25, 43, 5, -17, 225, -107, 9, -111, -43, -1, -11, -74, -57, 55, -121, -12, -33, 7, -38, -48, -85, -96, -29, 5, 56, 58, -66, -6, -11, -34, 135, 63, 162, 68, 3, -135, -112, 69, 13, -28, 14, -21, -1, 26, -41, -218, -20, -51, -105, -44, 46, 37, -13, 0, -40, 32, 30, 36, -97, 81, 5, 169, -102, -88, -55, 112, 174, -14, -17, -28, -83, -139, 2, -53, 120, 25, -21, 68, -33, -44, -123, -48, -108, -56, 71, 87, 122, -24, -30, -81, -1, -65, -26, 57, 92, -68, 48, -61, -102, -76, -181, 20, 118, 100, -51, -8, 96, -27, -111, -39, -61, -1, 70, -20, 47, -83, -171, 21, -13, 63, -10, 32, -7, -125, 78, -27, 50, -113, 63, 17, 11, 111, 2, -84, -28, -36, 77, -26, 129, 10]
6290A0N0j45r4L5J11K0k2J80j35Q8o4Mm9K8K3K5r4R1j17K58j81o4p6R5P0n9O7
6317E5Ko7p4J19j48K81k17R2l1L8l1O2k19J65j4r1j09Q6J65k7r9n2J26j8L3Nn1
6344a9L1Qn7p1K7PN9N0O7j83J49j40O3M2p6J11j42M0l1P4o2R7j19l3J16J2k7J7
6372A0J0q5q7R5J19k2p5J15k00J02l8R5m5P3m2l8J0J01j4j52J79m3j54O3k8k1
6398g2R6o7j2k8J08o3Q0n9O7j20K0o0R5M7m7Q4m5L8Kp9J5L4k06J71J21k49J16
6425a3o5q1O8M7M9k4J45o9L9j94J07j10N6L0M7j8j1r4O3Q4j21QN6J36q3P4j03
6452B3m2Om9p8J00Q1j1q4N1J04j94J69r0l5K2o0J10K7j03o0K26j89O2L5jj5l4
6479b9OK3j75J30PkO9j31J56j56Q2q0K7On6J89m7p4J22j2j43N8J09N6j42J14j49
$$ y = [10, 60, -85, -179, -144, -33, -13, -35, 145, 10, 98, 34, 38, -11, 17, 40, 65, -29, 62, -55, 203, 22, -42, -118, -23, 47, -12, 55, 57, -10, -84, 35, -113, 168, -49, 43, 12, 50, 19, 81, -138, 27, 13, -78, -187, -101, 64, 37, -62, -114, 12, -6, 27, 32, -19, 12, 20, -37, -108, -81, -74, -15, 35, 102, -81, 68, -72, -9, 33, -43, 68, -74, -34, -65, 9, -53, 44, -75, -108, 8, 20, -7, 10, 20, -65, -152, -57, 62, 40, -35, 80, -120, -18, -56, 39, -6, 67, 25, -13, -3, 98, 84, -68, 111, 68, -86, -23, -51, -72, 24, -43, -55, -83, 25, -38, 42, -17, 50, -70, -50, -110, -15, 32, -15, 69, 24, 62, 64, -15, 0, 34, -172, -1, 120, -129, -13, -78, -159, -91, -44, 5, -19, 126, 57, 96, -98, 9, -101, -45, -15, 32, 14, 3, -91, -28, 56, -65, -57, -1, 135, 52, 126, 23, -19, -13, -62, -140, -40, 41, 30, -54, -3, 101, -93, 76, -14, -49, -27, -87, 23, 50, -53, -113, 113, -76, -14, 21, 20, 5, -29, -23, 0, -175, -45, -38, -40, 29, -102, 54, -102, -20, -100, -73, -67, -123, 66, 19, -55, 67, 55, -88, -30, 79, 135, -7, 107, -42]
6506d2K4j68K10R2p9n8M0j0r5O6M2n1L2n4M0o6QJ31p1j19J20Q3n0m6O9l7o4N6
6534Cp6l3P1j01J07J21j37O8r7O5J1JK9L4o4L3J1j1j67R4q7K7K37M7r2m3q8m4
6562h1O1L9O7r0j07J56j31p9R3L7J28p4N7m4Km4j8j9L8J04r0j6KQ8Jj75q6J63
6590a8j02K03j44N6j2j9J67j83J4j6L9kQ0Pj82OO2k6N3O5n7N3j14Q9n8r1J37J8
6618B5K7j17M0p6Q7M5o0J5p5O8k1j1O2o4J8l4L4L8q0R1p6K17j14n0k0R1j00M8
6646HJ01j32J49j16K1r9N5N6j18L4L7K7j3PK8j02K47k08m7R4J2r6L5L6N4m2O9
6673I7Mq2K0j08J16J1p4M3j4R9o1J05r6m0O1n7n6J77R3k03n6L2J1m0o5J24j22
6700h1OJ50N8j69RM3rK9J6k9j2J28q0j69J85j19Om8J39n9Q5j22n1J3K7k4O7K4
$$ y = [-42, -18, -186, 24, 116, 37, -21, 19, 9, -86, -20, 22, -29, 3, -51, -11, -77, -69, 62, -9, -128, -8, 75, 25, -21, 48, 11, -53, 3, -73, -106, -35, -136, -29, 92, -45, 23, -74, -9, 2, 3, 32, 66, 2, 35, 46, 35, -132, -38, -125, -98, 139, 186, 94, 51, -37, -81, -20, 19, 86, -4, -111, 45, -86, -165, -72, -35, 93, 19, 76, 32, 34, -10, -28, -47, -9, 95, 5, -11, -9, 79, 80, -95, -181, -18, -120, 83, -61, -5, -17, -36, 131, -52, -38, -54, -15, -17, 63, 70, -112, -106, -44, -70, -17, 48, -9, 44, -70, 19, -39, -130, 7, 25, 52, -65, -25, -101, -14, 31, -29, -14, -89, -21, -42, -53, 9, -55, -37, -71, -37, 1, -79, 12, -64, 153, 39, -11, -31, 60, -40, 8, 109, -23, 126, 10, 31, -68, -13, 43, -75, -41, -4, 23, 10, 17, 45, -57, 190, -18, -65, 29, 41, -55, -20, 16, 70, 28, 97, 101, 19, 39, -69, 47, 58, -16, 27, 13, 112, 51, 156, 60, 20, 81, 24, -32, 145, 238, 35, -21, 11, 22, -18, -83, 41, -81, -75, 75, 133, -36, -27, 16, 7, 36, 52, 23, 11, 139, 59, -110, 75, -44, -38, -86, 53, -6, 79, -43, -94, -81, -54, -78, -11, 13]
6728A3P4m1j01J35j46O8nl0P2L1L2j16m0P0q6Q0K0L5k5n8K9o6P1m4N7p3lJ23n5
6757B1o1jQ6POn2N1Oj42N9l8K9O2k0m9P2j7j09M5n6L7J17N8j35p3J50M7q2L7j54
6787i9J72k7K7m5o5M7J9r9P4M1L4j74M3M3r8J20l0N6k0m1m6O1Q6j42J32j01M3
6814A1Q6q7J29k00MO7m5Q6M7k25M2J41j73M5M5J03k12J98j45K53k42J27j8o7J13
6839H3k45R6O6k3P0J5o9j8n1M4q3o3J41J45K0j58j7k4N3r5J62mk3q7L8J83j86
6866c0l3O6m6r1J97k7q3J61r7p5K0m6J93k26K13p2N3j80J21j14N5P5k9j1n2P6
6892A8j14J21k4P2j26J51j49m0j5J8R1j4N6r8Nk5K55j10L7k40J73n7j8pl0K4J65
6919A19r8j02L8N2M5r6M5lo3P5m8jN2O8J03k01K2r2j5J33j59J34J9N6j30l7J25
$$ y = [13, 87, 46, -55, 80, -66, 2, -3, -33, 39, 70, 102, -14, -54, 16, -70, 10, 30, 65, 40, -18, 11, -55, 16, -28, 29, -44, -47, 76, 21, -40, -41, 45, 52, 58, 6, 57, 63, -79, -20, -58, -29, 33, 13, -36, 36, 19, -90, -45, -101, -64, 53, 111, -24, -97, 53, 100, 18, 55, -99, 73, 46, 73, 28, -37, 10, 29, -70, 4, 45, 79, -95, -52, -9, -107, 13, -17, 39, 19, -22, -68, -7, 79, -63, 69, -32, 11, 97, 10, 139, -61, -57, 10, -35, 51, 98, -127, -85, 56, -117, -72, -27, 76, -136, 62, -83, 170, -72, 55, 37, -30, 83, -162, -66, 0, -23, 47, 62, -7, -25, -76, -32, -115, -178, -37, 108, 128, -30, -47, -71, -18, -113, 49, 45, 22, -65, -27, 156, -30, -63, 3, -43, -134, 63, 36, -47, 114, 17, -58, -38, -84, 109, -117, 96, 24, 77, -103, 18, -96, -41, 34, 5, -6, -58, 18, -96, 25, 1, 73, -53, 98, -51, -91, -106, -88, 3, -11, 45, -53, -48, -73, 182, 72, 109, -131, 42, -15, -33, -40, -70, -46, 119, 21, -81, -43, 9, 54, -42, 3, 0, -63, 12, -36, -37, 15, 83, 186, -15, 7, -85, -100, 33, -126, 8, 27, 83, -47, -84, 41]
6946D1n5Ok2OJ6N2l8J4j11N8P2L8o3J27j47L0N8j14J1K6J04n8n3J23j49M8j05
6973h5R8j18J16L0l3n4N4r5J53q4J29j04j5R8m3m4J04j31r5P2R5M6L3j02j54R9
6999c0p1J06K2o9O5k5Q9m6r5q1K8O1p2J80r0P6j28J53j41J33m1%jj42J87OJ2L1
7027A17j43o8R0O8K8q0J8N8j80LM1J18j27J20k86K66R3k55J60q7O0J9L1q4OK3
7053IJ8p4mL3o8J29L8j28O1K0M3n4Q8q8Qn1J04k64P2J48j47Q3l1J27j76J70n3
7080A3O6j56j5K38j01l4r3K3J03n0p0J46oj03J19p2r6Q1k5P0r6R7r6J21m9r2J27
7107E0j73J85o1K3R7j47J20o9o2r8N0J54m5jrjj21N2R4j23K2N6j8L1j9j37O7O2
7135b1l5N8J26j19j63P4q7M0K12j16Q8p3Q0K4r3n7Ql8J10q4N6L0j7k8N3M8j63
$$ y = [41, -14, -8, -30, -24, -8, 44, 6, 20, -91, -33, 39, 77, 14, 141, -6, 24, 82, -32, -21, 5, 109, 51, -2, 121, -28, 20, -85, 13, -105, 11, 41, 8, -46, 8, -87, 66, -18, 111, 7, -8, 90, 47, 3, 107, -24, -119, -47, 48, 94, 127, 25, -129, -30, -101, 5, 27, -42, 23, -2, 87, 41, -54, -135, -107, -46, -118, 62, -28, 48, -80, 73, -68, 65, 24, 24, 23, -119, 68, 74, 86, 117, -26, -94, -4, 64, 92, 12, 30, 88, -92, -89, -48, 70, -57, 63, -223, 43, 136, -119, 41, -46, 14, 33, 64, -20, -14, 9, 27, -47, -51, -18, -86, 43, 81, -47, 14, 34, 77, 23, 111, 23, 31, -20, 84, -180, -108, 40, -107, -24, -55, 72, -104, 66, 13, 79, -77, -92, 146, 45, 11, -82, -59, 44, -6, -76, 70, 64, -39, 80, 8, -88, -7, -32, 38, -58, 39, -57, 64, 15, -77, 50, -123, 62, 1, 24, 121, -26, 94, 25, -37, -135, -85, 69, 24, 23, 14, 13, -108, -56, 38, -85, -63, -7, -25, 6, -13, -150, -83, -21, -56, 2, 128, 9, -154, -80, -167, -127, 85, -31, 57, -16, 64, 88, -5, -62, -54, -92, 18, -66, -10, 20, 3, -25, 28, 76, -87]
7162h7J80j49L3P3j25J78j05j2KJ0J19j35kJ21O3j94m7K1QJ09o7j13J85p8Kmk4
7189c8N5K3l4n2J46j18J39j16mR3l6m1L5r8M7n4o6O9J55j83o1J30P2j31L0m7P4
7216a1n9Q2L4n7L7N4j81J14P3jp0m3O5m6r1J52o2o6P8L9k0o9k0P9j18J4P1j0P0
7245C8K4J1j60J01j77J24R7q9J13j8M8j30J79k33N4nO1j25J90k06rN0k3r0O8Q2
7271b5Q7j22K13k07M3j09L5R3K3ol3j41J51q1J7l2K71j20n1J1m9J6n9R5K3J3j70
7298a14K10l3j34J19j05k5L4k6K18o7l7j40K4J14r0O7k02J77J52j40m1O5j59O8
7322f5L0J03m3M7N5j01k5lj29Q6m5j02R1P8J56j05j48J99j54N8j6J28q6k6P9j13
7348e1K1JP8j8Op5P0j13j6J02p5J5J19j3P9j22JQ8j73N8J17j18RP3r7q5N2J39
$$ y = [-87, 93, -56, -23, 50, -75, 103, -2, -14, -12, -2, 117, -18, -20, 101, 164, -30, -77, -56, -48, 61, -6, -119, 66, -12, -10, -14, -38, 17, 40, 6, -46, 100, -18, 121, 5, 1, 94, 58, 17, 52, -46, 1, -53, -119, -50, 105, -78, -139, -9, 63, -68, -38, -85, -11, -70, 12, 46, -11, 26, 80, -101, 13, 86, 85, 15, -28, 37, -9, -100, 52, -10, -76, 2, 41, 21, -48, -68, 11, -107, -93, -22, -32, 38, 62, 73, -87, 14, -163, -39, 58, -31, 82, 64, 112, -18, 161, -72, -18, -23, 38, -87, 103, -103, -112, -62, -85, -175, -107, -25, 62, -60, 153, -54, -11, -120, -85, 8, 31, 25, -8, -149, 2, -79, -62, -94, 177, 57, 6, 17, -32, -16, -75, 20, 43, 56, -114, 96, 63, -71, 48, -57, -82, -48, -74, 144, 77, 40, -100, -76, 38, -52, 15, -187, -10, 142, 2, -39, 26, -133, -65, -35, 68, 25, 72, 127, 26, 1, -2, -131, -45, -90, -192, -101, -23, 133, 28, -120, 79, -75, -17, -33, 95, 9, -17, 62, -51, -30, -29, 49, 31, 37, -38, 32, -81, -97, 5, -70, -55, 64, 51, 130, 8, 9, 97, -76, -18, 99, -19, -10, 63, -34, -119, -67, 72]
7376G2j05O5l8L7p4J02m0k01L7K30o8k3P1r4K5o7R6j36N6J22J8r1K2K6j03J54
7402I3k1M2n2m1L1k5j24Q2KMK0l1J98j34m5K2m0J12j61jN4j6n9J87q1N7j57J85
7430A01p5n0J1p2J35pm9N8o6N5j9lL7j55K26k91J53RO9lk2P4Ok09J23r4m2J48
7458D8l2K6k6N3j41Q9o7P8K7p4OJ5J0o3l3J83N4j61l6P1M0j87O8J57j10n9K49
7485A85o1j73o1J91j73R1K3j06J69j84J23m4O3p9L9L8q4n3O7N7K7j77J29r7J6
7510g4R5O7q6J38k6j17M3j64oL4J69o4Q5l1K3q7j01J33Pq7K1J14j07p0J40j38
7536h9O8N4Pj2O7r8j89J39QJ04q0O2qj2LJ3q9M1R3j9K0Q4k00q0J76j61N9K1J13
7565I5j43J0nJ7p0R9J5Mj81J50J28m4j9j9l7J8Nq5Q7n0O2j15N9M0j1l5J2n9N9
$$ y = [72, -33, 32, -6, 31, -43, 59, 19, -182, -145, 85, 17, -6, 65, -29, -4, -71, 25, -111, -55, 67, 85, -6, 16, 42, -61, 93, 72, 114, 62, 21, 52, 27, -97, -15, -13, -9, 11, -20, 178, 44, -1, 21, -19, 93, -68, -69, -15, -31, -90, 97, 16, 73, -84, 101, 26, -24, -13, -85, 50, 43, -6, 52, -14, 41, 22, 19, 56, -99, 127, -164, -11, -2, 67, 64, 42, 116, 122, -87, 36, -58, -100, 48, 16, 42, 16, 69, -72, 17, -50, 28, 55, -19, -13, 2, 12, -51, -84, 99, 153, -8, -44, 27, 67, -120, -52, 105, -5, -64, 185, 124, -49, -110, 81, -92, -1, 22, -84, 85, -99, 24, -20, 43, -36, 3, 41, -43, -96, -29, 28, 55, -122, 7, -90, -74, 21, 88, 2, 140, 114, -3, 40, -124, -130, -96, 73, 9, 94, 63, 86, -1, -102, 31, 38, -49, -28, 86, -21, -91, 49, -89, -21, 33, 40, 28, 95, -3, -192, -53, -45, 59, -21, 41, 33, 21, 24, 37, -52, -11, 82, 63, 83, 167, -33, -113, 63, -98, -39, -18, 95, -48, -38, -43, -26, -96, 3, 18, 22, -159, -9, 119, 75, 56, 37, 0, 18, 23, -62, 25, -25, 37, -78, -19, 21, 10, -25, -13, -72, -13]
7594a3Q2n3M8j13J42q9j02R7K2j8k6J16j08o6J61n0p5L0L6k4J03j66J05k4%j09
7620i4P4N1l8m6jk2R1J10j11J01p3l2j35J44J0n6O4Q9n5o4o5M3J0K0L4m9J15j31
7648a6O4o9k5k8Q8j04N7J39q5N5r7p7K90j99j6r3NJ74j00J3O1p2Q9J2K3j5j18
7675d4Qj03J54O7j15o7J06M9n1p4J2O8L5q7P6O5q5k3l7o4N0K6K5Q5j08L0j8j06
7703a26J82r4J41J4j13m8J08M7j51O1k9K2j24J75k4J16j05j36pJ08q4N6l4J93
7727A48q1r6o8N4n3ML3R8lQN2j53J00j52O1J05K7j10Q2qj07qR7j9Q4n5l5k9q3
7756a07K05r6J1j00M7J1j00R3%Pj11M1J0J08J8m2P0M7j23o4k5P2k3NM5j75P2P3
7784c1J3o5JJ63M2l9Kj63J49p3LJm9J97j08M1j96R3o9K3kN7PL4o7l9L6L0m9O7
$$ y = [-13, 69, 16, 64, -49, 93, 4, -98, -1, 21, 3, -23, 93, -15, -81, 80, 30, -45, -15, 21, -3, 100, -66, 39, 15, 15, -94, -20, 31, -7, -53, -54, -76, 15, 125, 14, 115, 42, 10, -125, 19, 29, -27, 37, 126, 71, 7, -58, -15, -5, 15, 49, 0, 115, -16, 48, -21, -46, -74, 14, -90, -33, 106, 21, 76, -21, -98, 192, -7, -23, -116, -111, 63, -37, -24, 37, -35, 54, 66, 89, 74, -44, -36, -139, 15, 82, -33, -100, 6, 55, 4, -70, -58, 10, 45, -42, 34, 99, 14, -9, -46, -110, -60, -34, -9, 76, -32, -2, -20, -126, 56, -38, 103, 117, 4, -44, 64, 111, -40, 21, -8, 14, -110, 65, 41, 157, 52, -84, -91, 17, -67, -11, -45, 148, 67, -29, -97, -43, -96, -92, -59, 39, 36, 44, 96, -57, 43, -109, -48, 57, 84, -26, 56, 48, -59, -67, 30, 11, 95, 40, 5, -24, -107, 98, 2, 13, -87, -40, -29, -129, -36, -36, -29, -140, -99, -89, 19, 37, -5, 65, 112, -11, -75, -100, -28, -51, -46, -1, -176, -104, -31, -18, -83, -82, 81, 123, 84, 86, -77, 72, -1, 2, 3, -46, 151, 43, 84, -112, -19, -88, -65, -67, -10, -3, 31, -36, -75, -39, -9, -58, 9]
7814Ij8Q6m7M2k19J38Nj3p0J45o6k7m5j6K7N6jp0J29k6L3o3O9q2L9j16R0m5O6
7843A0J2L5l0j03J87j12m3J37p0q3L1M4j57J01j7R7Q0k5j82R5j23R5Qp8Q6J70
7869A65r6r5P9j46R0o6J02Nn9P2o6O4Jr7M6j93J73j8J01q9o3J21j35R3jJ0K8j52
7897a26K20j19P5o3NN3n0m2j7J15k11M5M4J38N0j59J16j21l6J92l2Mm7L8J2O0
7923A44k39K06j51J12j26J7R7pPk3rk0Q4j34R4r3JJ14j28J41o4j5o8J38r9M9K
7950C0Lo1o9J97j84Q3M5j42K54r1n1J6k09Q4J09J10r2j39J96j28j36J55O1k0j46
7975a25J71l5K7j2j14L0j05O6P1L3K9j23Q4l4o5P3p0R5Q7j09j2O6j07m4N8J06
8001D1p6R9Mm7j0n7M0K6M2j14p2L7J55j31Q4j13K5N6J16kq4n7N8q0Q2p3k8J11
$$ y = [9, -9, 77, 30, 72, -147, -9, -4, -17, -87, 58, -8, -35, -80, -96, -69, -13, -14, -84, 45, 19, 52, -11, 58, -24, 15, -101, -11, -56, 10, 22, 57, 27, -76, 111, -1, -44, 93, 23, -60, -29, 15, -142, -41, -58, 39, 119, 94, -88, 7, -116, -21, -13, -91, -5, 165, 69, -26, 53, -93, -3, -69, 33, 38, -21, 51, -15, 49, 50, -47, -1, -194, -21, -39, 62, -27, -90, 31, -104, -11, -12, -2, 26, -126, 94, -25, 50, -13, -8, 45, -5, -47, -64, 51, -160, -115, -71, 67, 117, -42, 74, -47, -83, 109, 77, 81, 34, 72, 84, 144, -95, 111, -40, 72, -54, -37, 60, 53, 60, 37, 28, 8, 92, -42, 52, -41, -40, 74, -54, 87, 23, 8, -60, 78, -21, 28, 30, 33, -28, -97, 100, -84, -1, 44, -98, 156, 65, 14, 30, -179, -95, 14, 124, 32, -107, 89, -39, -175, -20, 41, 21, -125, 46, 11, 38, 26, -88, -58, -163, -97, -26, 7, 36, -87, -3, -37, -102, -29, -99, -4, 83, -26, -38, 28, -79, -123, -65, 41, -35, 64, 68, 21, 11, -46, -6, 20, 62, -52, -124, -87, 68, -63, 21, -92, -67, -11, 105, 103, 19, -38, 20, -60, 22, -51, -79, 32]
8029C2J5M1o6M1j08m2J80j10q1J00L5k1J32k61M1Qk7R8J9j07o3J43n7nj1J91j67
8056e0J07M8j29k8K08n1j15rk1J3J71r5L2r3mL3l1N8l5l4O2o9j4R3P6j02k6P2
8084F7r4k1l9P9j95J63J1J41j17P2j74Q7M7o2J12k17J53J18j92O5p6j2P0J84k29
8109e9k3J61K8j38K5J9j15J70J4p7l8KK0J4J4J05j79J96j00j77R7Qk7N9j51K29
8135G7JK2J3j83NJ22j67N7M0p3L7P6n9J0K6L3q2M5L9QK9L2K6j39r4PJ85o7j3j2
8165AK3k4Q2q5n8%k3R9j9J5j26N6R7k13K51o0l4J21j35K6N3p0L3m1J14j36
$$ y = [32, 47, 88, 22, 63, -45, -87, 93, -17, -98, 2, 37, 16, 148, -113, -72, -64, -91, 7, 26, -81, -144, -1, -58, -63, -74, 117, -50, 57, 105, -24, -52, 156, 105, -10, -19, -40, -27, 144, 49, 81, -12, -16, 17, -14, 44, 9, -25, 37, -32, -46, 47, 123, 21, -5, 67, -27, -48, -87, -8, -203, -40, -29, 112, -5, 67, -107, -20, 27, -35, 77, -140, 13, 131, -61, 4, -72, -84, -14, 170, -59, -82, 79, 107, -31, -6, 13, -102, 68, 82, 5, -33, -31, -11, 3, 17, 122, -57, 139, 39, -138, -41, -33, -60, -1, -152, 77, 78, 100, 113, -70, -65, 57, -110, -53, -13, -86, -49, 27, -32, -22, 4, 37, -45, 0, 39, 47, 76, 108, 134, -5, -99, -92, 93, 26, 13, 1, 24, 0, 82, -3, -61, -61, -84, 15, -4, 11, -115, -59, 38, -175, 76, 16, -18, 103, -32, -6, 47, -23, 10, -31, 83, -53]
8191e3
$$ Imaginary data points
##PAGE= N=2
##DATA TABLE= (X++(I..I)), XYDATA
0@%%%%%%%%%%%qQqJ6j6J6j6K4l2L2m0M8n6P2q1R2j09J24j43J62j86K13k39K70
35A43l02L40l86M29m77N33n90O57p27Q02q87R78j079J188j310J444j589J752j933
54a014K136k366K627k928L277l689M187m796N566o577P962r995J3273j9444L5126
69B3345j52066m03255k4089J92401L61974L57539K00371p9178k75301l70813k92621
80d61693o6989K01705L44963L45065J76555q0855k92834l57630k75615l8492K20387
91b85433L36994K87031J45749p6116k82587l39588k33674l5338J99994L40935
101E7967K90395J08160r7939k69333l17402k04011k767J94436L13295K72933R4563
112D40297j07085k55327l01353j93608J8297K06633K94611K48354P3734j26712
$$ y = [0, 0, 0, 0, 0, 0, 0, 0, 0, 0, 0, 0, -8, 0, -8, 8, -8, 8, -8, 16, -16, 16, -24, 24, -32, 40, -41, 51, -58, 66, -77, 85, -101, 112, -127, 143, -159, 181, -205, 224, -253, 280, -310, 347, -380, 422, -465, 513, -566, 622, -688, 756, -833, 919, -1014, 1122, -1244, 1383, -1545, 1732, -1957, 2230, -2566, 3000, -3577, 4385, -5610, 7663, -11781, 23345, -128721, -531976, -556065, -363664, -1690, 355849, 556220, 477042, 201741, -169072, -461693, -528682, -326977, 17986, 363051, 539606, 458751, 165917, -191713, -467328, -505820, -285433, 51561, 338592, 484341, 408225, 125638, -213950, -447624, -482962, -282968, 57967, 348362, 456522, 358583, 89250, -228152, -432163, -434930, -240494, 72801, 345734, 440297, 333212, 77885, -223468, -417076, -398779, -192146, 102465, 350819, 424553, 297841]
122B97841k47718k66283j74001J7710K03382K80976K28891O7811j35517k60838
132A2254k51339j39126L3500K01492K66996J98835M6358j26975k43818k40871
142b42694j26363M2257K00355K64499J89261K4851j40836k38752k21184r7797
152c46403O0740J87765K38874J76580J9827j42374k30903k12429r1828P3854J98814
163f7483K28108J51790P97j48316k19930j89090p4882P4633J89973K16361J42035
174C03996l743j52464k22030j79008n5033Q8516J89189K00958J19802j6131j45858
185A28194k07611j68950m8919R2293J88627J95423J09280k9620j53725k01825
195i6833j51086l1214R8472J79700J79224R6660l2471j49812j96713j45344k2911
$$ y = [297841, 50123, -216160, -390161, -372451, -169069, 111907, 340798, 408609, 273092, 12254, -239085, -378211, -344711, -143219, 123777, 322612, 368970, 241995, -1823, -242694, -369057, -326800, -126445, 138054, 327315, 352166, 211330, -27422, -248606, -346403, -285663, -97898, 140976, 317556, 337383, 195009, -35894, -248323, -340151, -266297, -67483, 160625, 312415, 313212, 164896, -55034, -244124, -319006, -244373, -54400, 161961, 303996, 300253, 147789, -74241, -253249, -308282, -219766, -30577, 170381, 290183, 274052, 128194, -79417, -248367, -297286, -204993, -16366, 179057, 288337, 258717, 104992, -96833, -247919, -279133, -180661, -961, 178263, 274923, 242452, 92640, -104073, -249417, -272328]
206b72328J07707J83102J70412P8377m7355j49527j82659j29011j3161J06976
216a47467J75233J62641P2622n3082j53614j79650j19274K15J16918J71804J46263
227A92609N6803n8859j48564j67921j09448K573J16698J72642J41902M5903o9682
238A74656j52409j61169r3116J6070J17447J63611J30062L6779p1221j48113j57050
249a44453q7708K4851J23580J62674J22497K2680q2838j45237j42846p5271L0390
260a91681J21912J54923J15624J9254q7223j48996j38853o4638M1108J26906J49221
271I7557J01262P643q9256j43414j29524n7229M2849J25963J48392R6422j330
282A99335r6162j44387j22266m3173N2722J23401J38007Q7267o250r5823j40283
$$ y = [-272328, -164621, 18481, 188893, 267270, 219915, 70388, -112271, -241282, -254443, -147467, 27766, 190407, 263029, 209947, 56333, -123317, -242591, -242376, -125458, 46346, 192609, 249412, 190553, 41989, -125932, -235380, -232807, -116109, 56533, 198435, 244338, 174656, 22247, -138922, -232038, -215968, -98521, 65090, 195152, 231931, 160710, 12597, -144453, -232161, -207310, -83730, 78944, 201441, 224121, 141283, -3954, -146800, -222071, -191681, -69769, 85154, 200778, 220032, 132809, -16187, -155040, -219678, -178570, -51664, 97557, 198819, 206462, 117206, -26208, -155732, -212961, -170112, -44149, 104243, 200665, 199335, 103173, -41214, -163480, -206653, -153931, -30530, 107477, 194744, 188494, 92671, -47612]
293d7612j18022l8508N9029J27739J35293P7637j7297j01226j35278j06214k8544
304a93003O2026J23842J27987P2035k0228j03990j36134j01718j8902P0344J24904
315G163J20343N9325k8637j02566j28815r3924j4679P1610J23970J17457N4200
326A85447l5349j07865j26635q4459l904P6958J20165J07509M5591l7504j05056
337C4898j22754q0540O28Q1248J22110J03515L5943m6552j06421j16047o9988
348a63960Q191Q0840J16399R8063L1468n0155j07058j13840o5642J5691Q7436
359f2567J14963Q8219K1614n4670j04594j05870n8527J8026Q7178J13110Q5171
370A42053J7183o0051j07616j01763m8167K5797Q8250J08659P6578R784o0246
$$ y = [-47612, -165634, -204142, -145113, -17374, 117919, 195556, 178259, 77033, -58245, -164459, -193003, -130977, -7135, 120852, 192887, 172659, 68669, -67465, -169183, -188085, -117741, 7163, 127506, 186831, 158194, 55628, -73187, -167111, -181790, -110180, 13790, 131247, 185447, 150098, 42233, -84402, -168861, -172765, -95807, 24358, 131867, 177458, 139954, 34898, -87856, -168396, -167768, -86520, 35590, 139105, 175048, 128496, 22075, -93972, -163960, -155769, -74929, 41470, 139533, 171001, 120846, 13788, -100052, -165694, -150003, -62567, 52396, 140615, 162229, 107559, 2965, -102905, -161432, -143406, -56228, 56882, 142053, 159236, 99185, -8431, -110194, -158361, -132564, -44314, 64345, 140923, 150707, 90461]
381I0461j03560r8093m4656L0154R0876J07915P1399J223o6560j02435r0511l5827
393a49614L5553Q8375J01161O6931j729o9364j02408q7259l0543M1309R2518R7775
405H2705N7240r368p1103r8248p9935k4970M2686R1398R5381N3728j3335p4610
417E1569r9207p4526j5693M8374Q9923Q9436M6548j7896p3494r4815p1314j3049
429a34144N1510R1234Q7310M0848k4540p6863r2070o3826o380N3373Q7405Q1748
441I5605L7073k6303p7528r1385o0880j614N8069Q8776P7097K8911l1749p6635
453A9437q5708n5139K116N8254Q6906P4632K6580l5143p9471q4513m9153Q948
465a12254O2092Q4746O7629K0138l7250p7447q0916m5633J0965O3423Q5473O4870
$$ y = [90461, -13099, -111192, -155848, -125694, -34818, 73097, 144496, 145719, 79159, -23276, -113787, -149614, -114061, -25686, 75475, 142406, 140677, 71313, -31095, -118354, -148897, -107588, -15070, 82705, 139945, 130577, 59474, -38774, -118709, -143679, -100993, -9595, 85786, 139514, 126179, 51569, -47638, -122164, -137857, -89483, 440, 89876, 136424, 118528, 45034, -49781, -121095, -134144, -82634, 8600, 95910, 136758, 112218, 35355, -56715, -120541, -126921, -73548, 13857, 95605, 132678, 106375, 28847, -62538, -123418, -125032, -66963, 21813, 98910, 127821, 96072, 19437, -66271, -121410, -119294, -61040, 25866, 100498, 127078, 91935, 12464, -72049, -121202, -112254, -50162, 34584, 102213, 122351, 85101, 7654, -73262, -118895, -107930, -44507, 40966, 105836]
477A05836J4034m2318p8807p7350l8547J6566O3210Q1243O0565J0642m3980p7793
489f699p5801l5969K1577O6883P9702N5819M672m7894p5933o9383l1515K3310
501i1231O6994P7608N2712K459n0721p8088o6476k4978K7512O8308P4915M5528
513A04542k307n0082p5774o3929k1881K9409O8491P4881M3008q490n3756p4668
525c0556o0074j5357L4163O6153O9817M0194j0734n5041p2615n7727j3509L8190
537f7096O9405O6961L4397j5341n7610o9957n1237r916L8548O8758O4265L0817
549A01994j6886n9238p1656m7529l423M1480O8435O1218K4447k1285n7445o8222
561d8110m5259k25M3344O7461O0280K1614k6662n9293o5357m0847M741M6327O4558
$$ y = [105836, 119870, 77552, -1255, -78605, -117152, -100586, -37376, 43867, 104432, 115074, 71094, -6699, -82500, -118469, -96892, -30009, 49693, 105512, 110184, 62290, -13643, -83026, -114541, -91231, -24237, 53371, 106083, 108542, 57821, -20267, -86743, -111721, -84209, -15901, 59014, 104542, 102235, 52153, -23621, -87550, -109431, -80022, -11531, 63350, 106358, 97868, 44112, -30556, -90630, -105987, -71824, -5671, 64146, 104340, 93606, 38565, -34050, -91777, -105286, -67096, 2309, 69270, 103667, 88326, 30716, -39241, -90478, -100394, -61846, 6912, 71177, 101994, 85108, 25870, -45786, -93315, -96738, -55258, 13177, 74395, 98842, 77557, 20112, -48110, -93369, -93594, -50250, 17211, 77491, 99105, 72443, 13150, -52207, -93054, -88313, -41986, 22572]
574B2572N4854J9255k7908o0168o3278l7909O525M9181O5997N0714J3471l0613
586F2693o0817o0080l2193R303M7890O4683M8757J0263l2363o1282o0047k8254
598i1447J4892N0074O2589M4918N182l4518n8587n6534k6263J7068N1093O1474
610C9941M3082K591l8805n9730n2707k1545K0501N1865N7921L8297N44l8949n9429
623a6423n1012j8916K2403N3543N7969L4153m396m0952n8315m7235j4181K4269
635e9093N2197N5771L2305o859m2243n8018m5740j0690K8491N3246N2928K7839
647H0134j0245m2892n5211m2384q799K9600N3111N1595K5638j2995m5530n5110
659c3088l8426m663L1690N2387M8199K1868j4667m4783n3798l7153k305L3691
$$ y = [22572, 77426, 96681, 68773, 8605, -54673, -92582, -86057, -36876, 29121, 79835, 93306, 62693, 1876, -58204, -90397, -81094, -33204, 31479, 80236, 90499, 58136, -3146, -63193, -91447, -76555, -26481, 36108, 81026, 86208, 51690, -6897, -63431, -89694, -72626, -21533, 39941, 83023, 85614, 46809, -12921, -65628, -87173, -66672, -14807, 43114, 81411, 81955, 43006, -16423, -67435, -86351, -63948, -10405, 47564, 81717, 77321, 36369, -21946, -69181, -83362, -59093, -6896, 48875, 81180, 74321, 32078, -25940, -71680, -82370, -53879, -633, 52295, 80134, 69889, 26997, -28214, -70598, -79397, -49797, 3314, 54909, 80547, 67552, 22022, -33088, -71514, -76177, -44487, 7900, 56099, 77967, 63300, 18517, -35281, -72434, -74739, -41048]
671d1048N3006M6938J8091j8549m6018n1276l2873Q77L4332N1368M4544J6247
683G5639j9929m6669n0928l0624M215L7047N1170M1222J1953k2439m6000m8021
695d3364k7786O025L7019N0800L9863R652k4982m7344m7011k3847R846L8401M8574
708B5846L6438O878k5903m6303m4988k2388J1424L9670M8940L4339L349k8551
720C8751m6538m2044j8394J3588L9498M6599L1959J926k9471m6570m1207j6241
732f8144J6444M0861M5602K8582j633l0615m4946l8629j3718J7594M0602M4553
744C6553K7183l714l2568m5491l6449j0228K0701M0953M1892K3628n835l2693
756B3932m3895l4571q657K1782M1809M1380K0928q891l4310m3037l1517n254K3156
$$ y = [-41048, 11958, 58896, 76987, 58438, 12420, -38856, -71729, -70852, -36520, 14848, 59392, 75639, 55710, 9041, -41887, -72511, -68296, -31249, 19921, 61143, 73096, 50657, 4657, -43364, -71150, -65125, -28106, 22694, 62557, 72209, 47227, -117, -47128, -70975, -61129, -22728, 25846, 62284, 69162, 43259, -3044, -48032, -70420, -58996, -19326, 29614, 63953, 67302, 38751, -7787, -49831, -68225, -54637, -15139, 31460, 63419, 65345, 35874, -10696, -51903, -68144, -51700, -10839, 34763, 63345, 61712, 31097, -13849, -52478, -66196, -48602, -8000, 36553, 63736, 60022, 27454, -18037, -54486, -64714, -44013, -3060, 38832, 62460, 56625, 23932, -19963, -54534, -63191, -41409, 400, 41780, 62708, 53817, 19507, -23530, -55047, -60301, -37145]
769c7145M0500L9016J9201j0209l4689m2885l0145l068K5482M1463L7160J5567
781F0248j3093l5020m0554k7382r80K6203M0470L5799J4114j4705l6405m0211
793c1516k4915K288K7912L9957L3019J1072j6080l5777l8636k3167L596K8593
805b3654M0203L2074Q575j8750l6632l6940k0219O174K9198L8478K9769O963j9225
818C6014l6684l6425j8680Q351L0717L8459K7720L729k1218l6131l3942j6108
830e4198R432L0704L7427K6443K407k2536l6665l3064j3776J2135L1788L6055
842B6152K3554J18k3177l5758l1387j2262J3035L2271L5749K2008k207k5147l5665
855a2716k9299r365J4887L2036L3951J9830l456k5380l5327k8165p695J6659L2758
$$ y = [-37145, 3355, 42371, 61572, 51363, 16674, -26211, -56356, -59424, -33942, 7521, 44681, 60248, 47155, 12135, -28419, -55801, -56781, -30578, 9892, 45691, 59805, 45100, 8695, -31516, -56431, -54143, -26231, 13726, 46745, 57817, 41737, 5960, -32676, -55843, -52247, -23654, 16549, 48623, 57198, 38448, 1816, -35124, -55343, -49169, -19971, 18507, 48276, 55239, 36014, -670, -37095, -55775, -47424, -16707, 21752, 49472, 53201, 31983, -4148, -38090, -54198, -44766, -14062, 23365, 49808, 52215, 29679, -6986, -40050, -53826, -41691, -9903, 26152, 49706, 49824, 26647, -9111, -40498, -52760, -39725, -7454, 28295, 50303, 48096, 22949, -12716, -42015, -51380, -36493, -4457, 29494, 49324, 45868, 20488, -14839, -43004, -50699, -34040, -1282]
868a282L3096J7545n983k6481l4173k5946n398J7410L2094L2130J6304p272k7660
881A4384l4127k4507l132J9563L2469K9913J3648r113k7346l3062k2828j854K0148
894b5844L2512K9369J2020j1125k8689l2367k0255M23K1178L1637K7524J0261
906D6644j1962k8446l1653j9593K114K2694L1747K6258P958j3828k8718l0010
918b6795j7149L480K2846L1003K4813O873j4772k9236k9520j5642N580K3923L0625
931A6029K2761M280j5827k8576k8039j4271O459K4410L0238K1981K675j7321k9307
944d508k6765j1770Q538K4545K9173J9751J578j7824k8484k6204j0705R832K5532
957g311K8757J8376q81j9098k8260k3943q891J0920K5257K7634J7224j798k0096
$$ y = [-1282, 31814, 49359, 43376, 16895, -17278, -43224, -48622, -31212, 882, 33012, 49316, 42044, 14384, -19743, -44250, -47382, -27819, 4650, 34563, 48211, 39098, 11752, -21310, -44138, -45992, -25844, 6668, 36037, 48057, 36932, 8243, -24124, -44379, -43956, -22778, 8859, 36383, 46644, 34682, 6236, -25417, -45010, -42896, -20202, 11545, 37803, 45761, 31933, 3215, -26795, -43944, -40464, -17618, 13385, 38198, 45071, 30299, 1063, -28457, -44099, -38519, -14596, 16029, 38790, 43070, 27243, -1333, -29372, -43643, -37184, -12774, 17464, 39445, 42120, 24799, -4508, -31273, -43043, -34505, -9960, 19213, 38964, 40542, 22718, -5766, -31970, -42675, -32843, -7311, 21446, 39822, 38941, 19843, -8417, -32360, -41251, -30331, -5074, 22560, 39784, 37986, 17890]
970A7890k8190k3418o950J2421K5988K6459J5082l673k0330k7530k1604n823J3087
983b6591K5778K6224J4019n099k1661k7385k0193l436J4532K5496K4712J2211
995C8607o178k1409k6647j9334k554J5580K6005K3932J0480p939k2195k5974j7296
1008c4922q34J6018K5428K2729R381q548k2582k5799j6561O48J7465K5481K1448
1021B9352P358r911k2508k4778j4836J871J7478K5271K0769O218j1032k3108k4227
1034b2083j3325L666J8475K4437J9320M749j1916k2802k3282j2426M496J9221
1046a1470K4488J8402L097j3259k3339k1766j0552N591J9497K3652J6818K394
1058C3553j3756k3451k1518r417P037K0127K3688J5483K84j4662k2782k0329p912
$$ y = [17890, -10300, -33718, -40668, -28247, -2259, 24200, 39282, 35609, 15279, -12251, -33855, -39678, -26591, -813, 25411, 39430, 34331, 12670, -14715, -34908, -38344, -23812, 1684, 26396, 38607, 32429, 11020, -15627, -34961, -37515, -21935, 4070, 28002, 38482, 30543, 8348, -17626, -34922, -35756, -19738, 5690, 28419, 37800, 29252, 6670, -19129, -35690, -35042, -17577, 7904, 29352, 36710, 26799, 4291, -20487, -35323, -33452, -15974, 9297, 30066, 36284, 25252, 2144, -22083, -35408, -31742, -13267, 11170, 30490, 35239, 23323, 521, -22761, -35187, -30691, -11470, 13018, 31420, 34517, 21258, -2081, -23847, -34399, -28808, -9311, 14341, 31159, 33553, 19797, -3654, -25172, -34589, -27552, -7425, 16263, 31746, 32030, 17368, -5414, -25743, -33655]
1071c3655P868K0008K3086J4864p98j5690k2955j9466o555R481K0401K1947J3294
1084C1830j924j6013k2547j8413n778J0233K0895K1636J2088l335j6964k2219
1096a0511j7079m028J0792K0781K0635J0867l995j6995k2160j6616k759J1797
1108a9271K1070K0044R329n335j7353k1401j5318j683J2302K0728J9300Q623o214
1121B4821j8081k1189j4233n41J3663K0500J8066P404p220j8022k0458j3218J98
1134b8310J3821K0928J7386O216q291j8540j9941j1737J590J4228K0356J6363
1146B4069N202q903j8505j9661j1013K862J5015K0156J5528L611r757j8415j8544
1159a8355r900L637J5197J9563J4805K898j0356j8817j8077q733M682J5831J9360
$$ y = [-33655, -25787, -5779, 17307, 32171, 31373, 15683, -7272, -26738, -33293, -23812, -3411, 18536, 31830, 29906, 13893, -8654, -27067, -32845, -22612, -1717, 19919, 32007, 28672, 11708, -10511, -27590, -31618, -20826, -45, 20590, 31457, 27462, 10467, -11693, -28309, -31068, -19271, 1799, 21843, 31172, 25837, 8484, -12917, -28235, -29918, -17616, 3112, 22412, 31035, 24821, 6740, -14449, -28682, -29223, -15560, 4940, 23006, 30410, 23190, 5168, -15290, -28508, -28310, -14489, 6439, 23825, 30041, 21750, 3210, -16731, -28468, -26878, -12650, 7706, 24069, 29271, 20368, 1863, -17798, -28811, -25949, -10934, 9222, 24750, 28361, 18604, 189, -18355, -28255, -24618, -9421, 10142, 24947, 27845, 17489, -1328, -19405, -28138, -23456, -7625, 11735]
1172A1735J3524J581j0960j8616j7014p893N359J6129J8861J2929M97j1839j8555
1185d262j6293o589O369J6098J8169J1769o9j2123j8331j5867n688P096J6542
1198c179J7880J0774j512j2718j8075j4475m784P647J6367J7275J0206k171j3185
1211A0050j8021j3933l586Q737J6323J6685Q712k912j3374j7266j3368k985R073
1224a5865J6722J5958Q218l890j4144j7132j2177j591R749J6344J5165P208m626
1237A9939j3953j6756j1720r58J0377J6577J4589N914n433j4179j6299j0578K52
1250b2228J0516J5970J4203N445o270j4438j6049r844J235J1295J6107J2966M281
1263B3189o784j4534j5255q987J608J1759J5784J2677L152p477j4818j4744p844
$$ y = [11735, 25259, 26840, 15880, -2736, -19750, -27643, -22284, -6155, 12706, 25635, 26132, 14293, -4262, -20555, -27144, -20775, -4677, 13492, 25261, 25192, 13069, -5262, -21129, -26817, -19721, -3179, 14701, 25475, 23963, 11245, -6830, -21305, -26089, -18442, -2075, 15200, 25406, 23235, 10050, -7971, -21904, -25490, -16753, -430, 16255, 24967, 22055, 8681, -8585, -21953, -24938, -15865, 857, 16815, 25033, 21143, 6999, -10133, -22310, -23901, -14152, 2192, 17357, 24565, 19939, 5986, -10770, -22490, -23448, -13071, 3506, 18095, 24009, 18576, 4397, -11902, -22480, -22228, -11712, 4258, 18461, 23906, 17636, 3198, -12851, -22695, -21460, -10165, 5942, 18908, 23189, 16405, 1871, -13384, -22371, -20763, -9004, 6780, 19457, 22609, 15132, 314, -14430, -22274]
1276b2274K648J2027J5349J1646K548p867j4746j4264p229L450J2350J5213J0958
1289A9809J463q805j4296j3668o116L970J2293J4967J0180R99r087j4654j3016
1302a5961n600M918J2796J4323R325L0r463j4107j2454m701N228J2714J4059Q754
1316A9861p12j0026j4195j1760l640O153J2578J3541P729j468j0033j3967j1017
1329a6956l099O381J2961J3290P020k489j0225j3759j0226k185O824J2750J2654
1342A2941O606k930j0810j3383r964j164P548J2763J1977N587l636j0773j2983
1355h221r110q45P832J2852J1616M793m099j1428j2642q286M5Q433J2513J0721
1369A4174M045m552j1075j2497p696O42Q760J2553J0293L386n401j1277j1737
$$ y = [-22274, -19626, -7599, 7750, 19396, 21944, 14077, -669, -14933, -22162, -18712, -6362, 8851, 19809, 21272, 12467, -1829, -15497, -21613, -17643, -5350, 9617, 19797, 20796, 11709, -2945, -15961, -21561, -16643, -3847, 10476, 19801, 19831, 10368, -3739, -16193, -20894, -15666, -2952, 11107, 19861, 19149, 9123, -5072, -16832, -20472, -14319, -1741, 11800, 19529, 18061, 8028, -5939, -16956, -20055, -13674, -713, 12577, 19597, 17108, 6883, -6876, -17102, -19287, -12463, 287, 12941, 19547, 16617, 5807, -7576, -17540, -18704, -11156, 1607, 13584, 19171, 15535, 4762, -8221, -17331, -18176, -10344, 2508, 14124, 18917, 14818, 3390, -9252, -17538, -17493, -9060, 3453, 14174, 18219, 13667, 2592, -9905, -17601, -16959, -8199, 4354, 14647, 18033, 12632, 1355, -10382]
1382a0382o798J247Q913J2249R687K699n629j1329j1719o288K332R149J2123R042
1396A5296J851o333j1217j1046n699K486R524J1844Q650J120o577j1445j0555
1409a2101m777L146R685J1336P705Q14o833j1203j0088m289L719R704J1282P281
1423A5381j29p344j0921r556l435M160R653J0753O904p75p372j1001r145l044
1437a5871M747J0013J0381O021j324p918j0468q511k375M913R849J0085N488j728
1451A3302q098j0594p937j438N363R815R412M881k175q191j0154p424j254N874
1465h618R817R287M224k808q344j0093o676m69N933R668Q751L659l007q437r932
1480g045o304P2O303R765Q210L058l676q548r261n800M28O479R499P958K624m053
$$ y = [-10382, -17180, -15933, -7020, 5229, 14916, 17615, 11986, 657, -11062, -17350, -15018, -5869, 6254, 15296, 17147, 10814, -403, -11449, -17148, -14662, -5138, 6706, 15356, 16476, 9899, -1546, -12101, -16878, -13732, -4047, 7289, 14994, 15808, 8975, -2228, -12316, -16605, -12886, -3182, 8100, 15381, 15252, 7908, -3013, -12569, -16004, -11844, -2191, 8562, 15466, 14691, 7319, -3682, -12827, -15871, -11124, -1111, 9270, 15291, 13967, 6049, -4419, -12930, -15305, -10392, -543, 9542, 15030, 13302, 5204, -5390, -13327, -14765, -9402, 413, 9825, 14706, 12531, 4340, -5814, -13238, -14492, -8618, 1199, 10486, 14710, 11902, 3558, -6535, -13211, -13680, -7747, 1921, 10672, 14331, 11324, 2887, -7045, -13349, -13277, -6974, 2791, 11001, 14059, 10383, 1835, -7426, -13226, -12798, -6319, 3180, 11138, 13762, 9709]
1496I709q519r201n285J019O895R349P109K165m159q680q585m769J158O997R310
1511D513O911J484m597q675q245m196J890O970Q861O617R87m738q513q237l785
1526a2753K345P267Q577O157M84n237q353p565l299K541P338Q377N757Q3n582
1541F137q360p296k673K983P420Q207M929k19n539q406o840k295L227P437Q105
1556F817M596q36n770q150o546j552L681P204P570M326j245n826q063o120j551
1571a1465M171P544P287L709j608o190p662n582j062M200P294O956L402j628o673
1586B693p623n254l73M436P437O643K703k114o376p312m997j65M825P232O546
1601H301K354k826o241o970m575L93M809O874O255K064k924o298o887m275O14
$$ y = [9709, 1190, -8011, -13296, -12277, -5382, 3967, 11076, 13241, 9082, 402, -8183, -12952, -11794, -4797, 4513, 11424, 12908, 8311, -364, -8609, -12805, -10915, -3945, 4916, 11533, 12520, 7782, -731, -8968, -12753, -10408, -3141, 5436, 11593, 12077, 6840, -1513, -9078, -12377, -9836, -2498, 5879, 11636, 11719, 6137, -2223, -9519, -12192, -9209, -1789, 6418, 11347, 11128, 5589, -2817, -9657, -11952, -8725, -1288, 6817, 11413, 10577, 4807, -3343, -9889, -11441, -7760, -556, 7014, 11340, 10095, 4269, -3794, -9914, -11465, -7294, 250, 7537, 11246, 9638, 3448, -4214, -9796, -10858, -6658, 636, 7592, 10994, 9366, 2693, -4930, -10184, -10557, -6121, 1316, 7959, 10662, 8548, 2172, -5140, -10137, -10302, -5477, 1755, 8301, 10655, 7829, 1588, -5382, -9957, -9564, -4755, 2119, 8374, 10438, 7514, 1216, -5671, -9946, -9332]
1616i332N226P062N409J712l073o553o518l793J040N029O997N215J342l266o668
1631a71o400l068J199N376O631N063O68l492o290o075k893J593N244O549M851
1646H785M01l941o203n780k608K063N210O379M273K57l992o220n597k117K105
1661f985N454O139L934j27m226o103n169j857K352N589O035L435n75m203o053
1676b360m803j618K715N555N808L065p82m390n808m699j145K884N700N386K935
1691H443j193m545n781m299o97L210N332N117K595j287m698n614l973m69L092
1706d767N649M994K269j767m738n282l899m1L348N542M725J958j962m834n222
1721d027l482J68L637N311M584J572k181m662n147l087L43L815N115M369J249
$$ y = [-9332, -4106, 2956, 8365, 10077, 7004, 451, -6067, -9860, -8820, -3791, 3206, 8421, 9763, 6497, -171, -6571, -9639, -8440, -3064, 3567, 8630, 9298, 5806, -484, -6559, -9452, -7859, -2615, 3934, 8785, 9186, 5245, -958, -6738, -9346, -7283, -2073, 4306, 8579, 8836, 4844, -1376, -6973, -9090, -6985, -1531, 4608, 8542, 8415, 4189, -1914, -7083, -8940, -6588, -999, 5036, 8471, 7896, 3693, -2360, -7163, -8781, -6066, -511, 5297, 8362, 7580, 3190, -2618, -7317, -8462, -5578, 122, 5508, 8443, 7250, 2705, -3076, -7375, -8072, -4862, 470, 5587, 8182, 6895, 2197, -3417, -7390, -7859, -4767, 882, 5876, 8145, 6378, 1640, -3642, -7541, -7582, -4234, 1308, 6033, 7991, 6029, 1195, -4027, -7509, -7341, -3704, 1607, 6191, 7763, 5582, 920, -4227, -7314, -6971, -3156, 1959, 6328, 7577]
1736G577k396m753m945k749P42L896N002M041P98k394m873m772k519J070L934
1751b341N089L794M69k588m807m515k242J227L838M899L607M60k887m786m280
1766e063j892J388M121M828L069J94l035m777m142j427J419M143M733L000j73
1781F386l169m616l898j498J800M251M497K698l71l188m698l556j266K116M226
1796b86M300K249n13l440m367l548p73K095M231M143K185q01l352m473l346n02
1812f198K321M268L957J919j009l633m197l017l84K490M161L735J729j240l536
1827A366m203k710j01K531M175L528J248j310l514m123k521J1K842M143L443J080
1843E885j778l528m076k068L88K794L913L105J031j634l744l883j942L85L172
$$ y = [7577, 5181, 428, -4517, -7266, -6524, -2628, 2374, 6415, 7213, 4819, -54, -4826, -7345, -6275, -2341, 2748, 6542, 7011, 4423, -384, -4899, -7141, -5914, -2076, 2823, 6430, 6890, 4003, -783, -5063, -6955, -5567, -1446, 3382, 6451, 6645, 3610, -1167, -5309, -6736, -5317, -1174, 3559, 6559, 6386, 3217, -1399, -5297, -6795, -4995, -744, 3753, 6451, 6080, 2892, -1806, -5362, -6628, -4512, -286, 4014, 6263, 5750, 2310, -2057, -5605, -6378, -4283, -52, 4091, 6276, 5475, 2123, -2350, -5696, -6198, -3877, 391, 4348, 6267, 5258, 1625, -2572, -5589, -5973, -3483, 678, 4413, 6142, 4902, 1366, -2837, -5547, -5648, -3117, 1058, 4586, 5834, 4524, 1010, -3113, -5634, -5623, -2781, 1362, 4805, 5885, 4107, 579, -3497, -5565, -5177, -2383, 1530, 4635, 5666, 4032, 288, -3595, -5537, -5152, -1980]
1858a980L826L053O11j964l483l739j859Q76K860L878K866L77k044l530l644j540
1874e436J043L096L462K624L62k253l472l336j347J182K985L660K449n9k300l634
1890i74k964j249J301L258L337K136m7k531l406k988j006J550L163L467J900n16
1906D431k418l506k681p18J443L166L351J685m38k710l320k532n55J811L046L133
1922C188J513o03k726l208k431k66J705L326K862J379r84k625l230k168j38J877
1938b529L060K877J088j095k699k871k106J21J836L265K598Q86j161k773k801
1953b304j960L29J996L108K419O76j131k910k729j772L50K286L176K204M52j426
1969B764k688k771j654Q15K297K861K051M86j579k876k555j251O45K280K894K078
$$ y = [-1980, 1846, 4899, 5510, 3546, 63, -3676, -5535, -4659, -1799, 2079, 4945, 5322, 3278, -252, -3896, -5436, -4393, -1297, 2165, 4789, 5151, 2898, -574, -3910, -5257, -4075, -1090, 2570, 5019, 4960, 2660, -974, -3938, -5187, -3886, -628, 2709, 4845, 4798, 2267, -1139, -4127, -5133, -3583, -420, 3047, 4947, 4431, 2013, -1493, -4174, -4892, -3449, -283, 3068, 4753, 4315, 1605, -1715, -4247, -4802, -2991, 55, 3188, 4701, 4098, 1372, -1836, -4267, -4533, -2828, 498, 3360, 4739, 3755, 1130, -2100, -4268, -4406, -2529, 531, 3408, 4496, 3401, 702, -2169, -4275, -4154, -2318, 947, 3545, 4431, 3270, 497, -2304, -4264, -3935, -1939, 1169, 3588, 4264, 3133, 223, -2506, -4278, -3928, -1642, 1534, 3738, 4190, 2764, 76, -2695, -4349, -3534, -1237, 1624, 3675, 4161, 2582, -294, -2849, -4100, -3455, -1175, 1719, 3797]
1985C797J39j614k722k588j137Q20K380K917J600K21j941k682k234r48J011K368
2001f13K733J644j63j788k744k161p23J069K302K636J514k59j618k802k136o70
2017c779J162K402K655J138j65j995k638j992m66J233K493K418J321n92k009k634
2033a448j774m66J388K599K100J232p38j993k410j717k59J565K381K115R15o07
2049B883j919k639j712J25J490K389K002Q73q59k180k257j526J70J613K195K111
2065B759N69q70k127k394j238L44J645K277J840M21j043k000k266j166L42J655
2081a252K558J600L17j237k100k006j150M52J784K142J703K43j187k150j914r52
2097c149N76J701K046J706J32j255k059k055p06N71J660K240J471K6j251k191
$$ y = [3797, 3936, 2322, -400, -2988, -4125, -3305, -925, 1992, 3592, 3813, 1872, -810, -3044, -3992, -2981, -613, 2120, 3764, 3601, 1813, -931, -3092, -3815, -2746, -444, 2192, 3706, 3447, 1829, -973, -3109, -3779, -2617, -215, 2440, 3578, 3413, 1418, -1220, -3212, -3678, -2445, 48, 2466, 3787, 3195, 1186, -1448, -3222, -3688, -2300, 299, 2399, 3631, 2893, 900, -1510, -3227, -3486, -1921, 460, 2575, 3490, 2883, 964, -1675, -3387, -3262, -1772, 617, 2619, 3492, 2633, 453, -1804, -3330, -3160, -1547, 648, 2759, 3328, 2458, 331, -2063, -3301, -2957, -1312, 965, 2805, 3226, 2183, 183, -2083, -3249, -2907, -1252, 1306, 2906, 3223, 1986, -114, -2120, -3270, -2818, -1034, 1108, 2811, 3054, 1867, -283, -2197, -3149, -2573, -872, 1174, 2880, 3012, 1757, -302, -2357, -3063, -2492, -832, 1408, 2879, 2905, 1654, -537]
2113e37j863n65N50J937K038J338j12j365k022j784n83Q62J777J935J276k37j436
2130A209j997j629m87Q56J943J819J038q7j594k009j560l66R43J848J904J073
2146B904n21j556j823j371l25J060J699J868P95l26j680j851j451j9J235J543
2162A81J705P56m39j641j796j197n3J010J885J605O53p21j550j795j174J11J303
2179a157J793J426O33p80j664j754r70J54J204J774J479L11o86j616j638r47L24
2196b114J207J693J380K81q18j656j519r02K72J327J640J255M31q78j659j651
2212a711p07L57J385J586J239N3r08j471j496p28M40J392J648R38K68j002j623
$$ y = [-537, -2400, -2965, -2415, -478, 1560, 2898, 2786, 1421, -601, -2385, -2968, -2106, -329, 1606, 2882, 2645, 1209, -788, -2417, -2904, -2048, -105, 1714, 2752, 2665, 1071, -938, -2498, -2864, -1921, -73, 1831, 2904, 2383, 827, -996, -2367, -2692, -1632, 67, 1935, 2730, 2404, 724, -1127, -2578, -2597, -1362, 181, 1886, 2642, 2203, 562, -1234, -2431, -2484, -1474, 411, 2016, 2669, 1948, 398, -1397, -2571, -2460, -1157, 636, 2062, 2695, 1915, 251, -1503, -2473, -2319, -1115, 659, 2138, 2449, 1763, 147, -1491, -2438, -2114, -907, 786, 2166, 2447, 1629, -27, -1546, -2448, -2176, -849, 791, 2046, 2477, 1599, -60, -1711, -2418, -2061, -676, 910, 2149, 2202, 1294, -177, -1673, -2401, -1961, -569, 1079, 2017, 2285, 1283, -340]
$$ [...]
8191C9
##END NTUPLES=NMR FID
##END=
