##TITLE=1H_LR-0149-C1-EtOAc-B-M
 CD3CN
 8 sc, 
 15.3.2023
##JCAMPDX= 6.0         $$ Bruker NMR JCAMP-DX V2.0
##DATA TYPE= NMR FID
##DATA CLASS= NTUPLES
##ORIGIN= UXNMR, Bruker Analytische Messtechnik GmbH
##OWNER= root
$$ XWIN-NMR		Version 3.5
$$ Wed Mar 15 14:08:36 2023 Russian Standard Time (UT+4h)  she@DPX200
##.OBSERVE FREQUENCY= 200.13135
##.OBSERVE NUCLEUS= ^1H
##.DELAY= (6, 6)
##.ACQUISITION MODE= SIMULTANEOUS
##.ACQUISITION SCHEME= undefined
##.AVERAGES= 8
##.DIGITISER RES= 18
##SPECTROMETER/DATA SYSTEM= spect
##.PULSE SEQUENCE= zg30
##.SOLVENT NAME= DMSO
##.SHIFT REFERENCE= (INTERNAL, DMSO, 0, 15.7039)
##AUDIT TRAIL= $$ (NUMBER, WHEN, WHO, WHERE, WHAT)
$$ ##TITLE= Audit trail, XWIN-NMR		Version 3.5
$$ ##JCAMPDX= 5.01
$$ ##ORIGIN= Bruker BioSpin GmbH
$$ ##OWNER= she
$$ F:/spectra/data/she/nmr/H-F/1/audita.txt
$$ ##AUDIT TRAIL=  $$ (NUMBER, WHEN, WHO, WHERE, WHAT)
(   1,<2023-03-15 14:06:55.68 +0400>,<she>,<DPX200>,
      <created by zg, POWCHK disabled, PULCHK disabled
       configuration hash MD5:
       00 E9 B6 7A A2 85 ED C7 34 08 36 98 17 FE 4E 26
       data hash MD5: 16K
       C1 15 90 2D 4D 3F DF FA AA 70 34 74 CC 11 DB EB>)
$$ ##END=
$$ 
$$ hash MD5
$$ 87 8D FE B5 72 C8 27 1F E1 C8 0D 2F 92 8D A1 DE
##$RELAX= 
##$RELAX= 
##$RELAX= 
##$RELAX= 
##$RELAX= 
##$RELAX= 
$$ Bruker specific parameters
$$ --------------------------
##$DU= <F:/spectra>
##$EXPNO= 1
##$NAME= <H-F>
##$PROCNO= 1
##$TYPE= <nmr>
##$USER= <she>
##$AMP= (0..31)
100 100 100 100 100 100 100 100 100 100 100 100 100 100 100 100 100 100 
100 100 100 100 100 100 100 100 100 100 100 100 100 100 
##$AQSEQ= 0
##$AQ_mod= 1
##$AUNM= <au_zg>
##$AUTOPOS= <>
##$BF1= 200.13
##$BF2= 200.13
##$BF3= 200.13
##$BF4= 200.13
##$BF5= 200.13
##$BF6= 200.13
##$BF7= 200.13
##$BF8= 200.13
##$BYTORDA= 1
##$CFDGTYP= 0
##$CFRGTYP= 5
##$CHEMSTR= <none>
##$CNST= (0..31)
1 1 145 1 1 1 1 1 1 1 1 1 1 1 1 1 1 1 1 1 1 1 1 1 1 1 1 1 1 1 1 1 
##$CPDPRG= <>
##$CPDPRG1= <>
##$CPDPRG2= <>
##$CPDPRG3= <>
##$CPDPRG4= <mlev>
##$CPDPRG5= <mlev>
##$CPDPRG6= <mlev>
##$CPDPRG7= <mlev>
##$CPDPRG8= <mlev>
##$CPDPRGB= <>
##$CPDPRGT= <>
##$D= (0..31)
0 1.2 0 0 0 0 0 0 0 0.06 0 0.03 0 0 0 0 0.0002 0 0 0 0 0 0 0 0 0 0 0 0 
0 0 0 
##$DATE= 1678874815
##$DBL= (0..7)
120 120 120 120 120 120 120 120 
##$DBP= (0..7)
150 150 150 150 150 150 150 150 
##$DBP07= 0
##$DBPNAM0= <>
##$DBPNAM1= <>
##$DBPNAM2= <>
##$DBPNAM3= <>
##$DBPNAM4= <>
##$DBPNAM5= <>
##$DBPNAM6= <>
##$DBPNAM7= <>
##$DBPOAL= (0..7)
0.5 0.5 0.5 0.5 0.5 0.5 0.5 0.5 
##$DBPOFFS= (0..7)
0 0 0 0 0 0 0 0 
##$DE= 6
##$DECBNUC= <off>
##$DECIM= 32
##$DECNUC= <off>
##$DECSTAT= 4
##$DIGMOD= 1
##$DIGTYP= 9
##$DL= (0..7)
0 120 120 120 120 120 120 120 
##$DP= (0..7)
150 150 150 150 150 150 150 150 
##$DP07= 0
##$DPNAME0= <>
##$DPNAME1= <>
##$DPNAME2= <>
##$DPNAME3= <>
##$DPNAME4= <>
##$DPNAME5= <>
##$DPNAME6= <>
##$DPNAME7= <>
##$DPOAL= (0..7)
0.5 0.5 0.5 0.5 0.5 0.5 0.5 0.5 
##$DPOFFS= (0..7)
0 0 0 0 0 0 0 0 
##$DQDMODE= 0
##$DR= 18
##$DS= 0
$$ [...]
##$SUBNAM2= <"">
##$SUBNAM3= <"">
##$SUBNAM4= <"">
##$SUBNAM5= <"">
##$SUBNAM6= <"">
##$SUBNAM7= <"">
##$SUBNAM8= <"">
##$SUBNAM9= <"">
##$SW= 18.05172834244
##$SWIBOX= (0..15)
0 0 2 0 0 0 0 0 0 0 0 0 0 0 0 0 
##$SW_h= 3612.71676300578
##$TD= 16384
##$TD0= 1
##$TE= 0
##$TE2= 300
##$TE3= 300
##$TEG= 300
##$TL= (0..7)
0 120 120 120 120 120 120 120 
##$TP= (0..7)
150 150 150 150 150 150 150 150 
##$TP07= 0
##$TPNAME0= <>
##$TPNAME1= <>
##$TPNAME2= <>
##$TPNAME3= <>
##$TPNAME4= <>
##$TPNAME5= <>
##$TPNAME6= <>
##$TPNAME7= <>
##$TPOAL= (0..7)
0.5 0.5 0.5 0.5 0.5 0.5 0.5 0.5 
##$TPOFFS= (0..7)
0 0 0 0 0 0 0 0 
##$TUNHIN= 0
##$TUNHOUT= 0
##$TUNXOUT= 0
##$USERA1= <user>
##$USERA2= <user>
##$USERA3= <user>
##$USERA4= <user>
##$USERA5= <user>
##$V9= 5
##$VALIST= <valist>
##$VCLIST= <CCCCCCCCCCCCCCC>
##$VD= 0
##$VDLIST= <DDDDDDDDDDDDDDD>
##$VPLIST= <PPPPPPPPPPPPPPP>
##$VTLIST= <TTTTTTTTTTTTTTT>
##$WBST= 1024
##$WBSW= 4
##$XGAIN= (0..3)
0 0 0 0 
##$XL= 0
##$YL= 0
##$YMAX_a= 191656
##$YMIN_a= -267686
##$ZGOPTNS= <>
##$ZL1= 120
##$ZL2= 120
##$ZL3= 120
##$ZL4= 120
##$ABSF1= 10
##$ABSF2= 0
##$ABSG= 5
##$ABSL= 3
##$ALPHA= 0
##$AQORDER= 0
##$ASSFAC= 0
##$ASSFACI= 0
##$ASSFACX= 0
##$ASSWID= 0
##$AUNMP= <proc_1d>
##$AZFE= 0.1
##$AZFW= 0.1
##$BCFW= 1
##$BC_mod= 2
##$BYTORDP= 1
##$COROFFS= 0
##$CY= 11.3945322036743
##$DATMOD= 1
##$DC= 2
##$DFILT= <>
##$DTYPP= 0
##$F1P= 2.36226072786647
##$F2P= -0.459571619588291
##$FCOR= 0.5
##$FTSIZE= 0
##$FT_mod= 4
##$GAMMA= 1
##$GB= 0.15
##$INTBC= 1
##$INTSCL= 1
##$ISEN= 128
##$LB= 0.24
##$LEV0= 0
##$LPBIN= 0
##$MAXI= 10000
##$MC2= 0
##$MEAN= 0
##$ME_mod= 0
##$MI= 1.114404
##$NCOEF= 0
##$NC_proc= 0
##$NLEV= 6
##$NOISF1= 3.799351
##$NOISF2= 2.8
##$NSP= 1
##$NTH_PI= 0
##$NZP= 0
##$OFFSET= 15.70392
##$PC= 1
##$PHC0= -19111.1
##$PHC1= 16.40074
##$PH_mod= 1
##$PKNL= yes
##$PPARMOD= 0
##$PSCAL= 0
##$PSIGN= 0
##$REVERSE= no
##$SF= 200.130013532006
##$SI= 16384
##$SIGF1= 3
##$SIGF2= 2
##$SINO= 400
##$SIOLD= 16384
##$SREGLST= <1H.CDCl3>
##$SSB= 0
##$STSI= 0
##$STSR= 0
##$SW_p= 3612.71676300578
##$SYMM= 0
##$S_DEV= 0
##$TDeff= 0
##$TDoff= 0
##$TI= <>
##$TILT= no
##$TM1= 0
##$TM2= 0
##$TOPLEV= 0
##$USERP1= <user>
##$USERP2= <user>
##$USERP3= <user>
##$USERP4= <user>
##$USERP5= <user>
##$WDW= 1
##$XDIM= 8192
##$YMAX_p= 0
##$YMIN_p= 0
$$ End of Bruker specific parameters
$$ ---------------------------------
##NTUPLES= NMR FID
##VAR_NAME=  TIME,          FID/REAL,        FID/IMAG
##SYMBOL=    X,             R,               I
##VAR_TYPE=  INDEPENDENT,   DEPENDENT,       DEPENDENT
##VAR_FORM=  AFFN,          ASDF,            ASDF
##VAR_DIM=   8192,          8192,            8192
##UNITS=     SECONDS,       ARBITRARY UNITS, ARBITRARY UNITS
##FACTOR=    0.0002768,     1,               1
##FIRST=     0,             0,               0
##LAST=      2.2672688,     0,               0
##MIN=       0,             -267686,         0
##MAX=       2.2672688,     191656,          0
$$ Real data points
##PAGE= N=1
##DATA TABLE= (X++(R..R)), XYDATA
$$ [...]
1773D21O4r21J63Q14m85o63M92P11o39n11O69N02r03k20O72K95r73j0Q54j02p39
$$ 421 485 -436 -273 541 56 -607 -115 596 -43 -554 115 617 -286 -506 166 461 -512 -522 332 230 -509
1794e09O8R45k98p75M12O97n42n96Q40K23m22p22J144p3q48k6N21J59p00K47P86
$$ -509 -441 504 206 -569 -157 540 -2 -598 242 465 43 -679 465 392 -456 -482 39 198 -502 -255 531
1815E31k31o97M02M04n43j86M61L72o78k74N76O3m75j29R31l24n95K64N03j46
$$ 531 300 -397 5 409 -134 -320 141 513 -165 -439 137 200 -275 -404 527 203 -392 -128 375 229
1835B29p12M83L63n06k7M54r4m04j68M65K94m34k35O22l04m80M49L19k37n39N78
$$ 229 -483 0 363 -143 -170 284 190 -214 -382 83 377 -57 -292 330 26 -454 -5 314 77 -462 116
1856A16N21o33k82M13J8j42k45L10J89o63M29L40k28m18K04K64l00L1q0L26q1
$$ 116 637 4 -278 135 153 11 -234 76 265 -398 31 371 143 -275 -71 193 -107 -76 -156 170 89
1877H9l25N97k12m0J15k40O8m0j39K21J64l6R6J01m52j23K19J9M1l81K49p5K11
$$ 89 -236 361 149 109 224 -16 52 12 -127 94 258 222 318 419 -33 -156 63 82 123 -258 -9 -84 127
1900A27j59K0j48J82j31J61k0j70J56Q5k37J73L47l61P2k63K41R4Qk12J74M6o7
$$ 127 -32 -12 -160 22 -109 52 32 -138 18 103 -134 39 386 25 97 -166 75 169 177 -35 139 185 118
1923A18r0j4k09J93L8J23j09j9J57l52L19J00j12J77l79q7J04J25l7j25N7L40
$$ 118 28 14 -195 -2 36 159 50 31 188 -164 155 255 143 320 -59 -146 -42 83 46 -79 -22 318
1945C18l15J22O0l41r1L12j18n5j35M5N2N1J82j05N0j60L4R7Oq2K11o0Q5k11l5
$$ 318 3 125 185 -156 -247 65 -53 -108 -243 -198 -146 -95 87 -18 32 -128 -94 3 9 -73 138 78 163 -48 -83
1970h3J78j84K28j54l3Q3j57L63k73P1k4m6j5j32J69J87j62JJ53l55J71q9J32
$$ -83 95 -89 139 -15 -48 35 -122 241 -32 39 15 -31 -46 -178 -9 178 16 17 170 -185 -14 -103 29
1993B9j57Q7o6J96l8j48K68n0j32R1J79k97j46p1K50l19L79J28j83J0M6J61q2
$$ 29 -128 -41 -107 89 51 -97 171 121 -11 80 259 -38 -184 -255 -5 -324 55 183 0 10 56 217 135
2016A35J88m14J80k31J35Q9K4k19j4Q4J14m1m15L43M51o48J69J88j80L35l28K1
$$ 135 323 -91 89 -142 -7 82 106 -113 -127 -43 71 30 -385 -42 409 -239 -70 118 -62 273 -55 -34
2038c4m2J2L0OJ33j22j95L78K2k99R1K55l80J84R8j49r3J12l62L10K16j86p0p8
$$ -34 -76 -64 -34 -28 105 -17 -212 166 188 -111 -20 235 -145 39 137 -12 -105 7 -355 -45 171 -15 -85 -163
2062a63M54j27l31K40j54L27o0K3m42R9M14l14J02K52k07j54m7l6N40l19k08J7
$$ -163 291 164 -167 73 -81 246 186 209 -233 -134 280 -34 68 320 113 -41 -88 -124 416 97 -111 -94
2084i4k23J29K48K03k97k65K06K27j22k34K70J12p4l66L17J1m04N34j14k33l2
$$ -94 -317 -188 60 263 -34 -299 -93 134 12 -222 48 160 86 -280 37 48 -356 178 64 -169 -201
2105b01P3L01j32j74R4j90L8K43k13L01M7k40m8J03M1j60M31l52r6M93l06o9J52
$$ -201 -128 173 41 -133 -39 -229 -191 52 -161 140 187 -53 -101 2 43 -117 314 -38 -134 359 53 -16 136
2128A36j78j17K00J27m03K65J31l39Q5L53j95m57L70L31n93j20K30L34R9N7q4
$$ 136 -42 -159 41 168 -235 30 161 -178 -93 260 65 -392 -22 309 -284 -404 -174 160 259 316 232
2149B32l87Q8K07j83m6R0n7j1J18k86L34K31j72n19K63k9l9m1K71J0l6j77J54
$$ 232 -155 -67 140 -43 -89 1 -56 -67 51 -235 99 330 158 -361 -98 -127 -166 -207 64 74 38 -139 15
2172A5j01Q5M9j00j9k09M28m0Ok04M3K07l96LL79j73K44k09j69J60J28M4J80m90
$$ 15 -86 -1 48 -52 -71 -280 148 108 114 -90 -47 160 -236 -233 146 -27 217 8 -161 -1 127 171 351 -139
2196a39K23O6k2M6k49M23k95o5K0j4j32n0J83r6L18l56M12n7k04J24p1j6j26K16
$$ -139 84 150 128 174 -75 348 53 -12 8 -6 -138 -188 -5 -101 217 -139 273 216 12 136 65 49 -77 139
2220A39j54j03m3K73k41K40J20j55K55j12m50L16OK8k16K1K26l07l99N36K45j97
$$ 139 -15 -118 -161 112 -129 111 231 76 331 219 -231 85 91 119 -97 -76 150 -157 -556 -20 225 28
2242B8j29J33Jl89K11J15L8kO0R8o7l66K53R9J2j47Q9N0q4J12K01l29j87K75O0
$$ 28 -101 32 33 -356 -145 -30 8 6 66 164 97 -269 -16 83 95 -52 37 87 3 115 316 -13 -200 75 135
2267A35j89J13M2k99K7J21PQj2j07K66l53J60N3M3Q7j78k35L80J06k55J24K39
$$ 135 -54 59 101 -198 -171 -50 -43 -35 -47 -154 112 -241 -81 -28 15 102 -76 -311 69 175 -80 44 283
2290B83l49j31L48O5k51k4J43q4O5K60j41j91M8j92K95QqJ93j83k73J47j34J72
$$ 283 -66 -197 151 216 -35 -59 84 0 65 325 184 -7 41 -151 144 152 144 337 154 -119 28 -106 66
2313F6k16K29Lj50M50n08M4q6L0O9K86k65j24M30K0n15J00J41j89J53k0J55j17
$$ 66 -150 79 82 -68 382 -126 -82 -168 -138 -69 217 -48 -172 258 278 -237 -137 4 -185 -32 -52 103 -14
2336a4j1L05m85N4K4K09k06L6Q9jM6l41O20n3k54j40K5J07k4q3J27P8L1k84L56
$$ -14 -25 280 -205 -151 -127 82 -124 -88 1 0 46 -295 325 272 18 -122 -97 10 -14 -97 30 108 139 -145 211
2361B11j92nj8K54k74J10j95L09m22K59J6j19k6K3J6R0p6r6N9J50K10k98o8M6
$$ 211 19 14 -4 250 -24 86 -109 200 -222 37 53 -66 -92 -69 -53 37 -39 -135 -76 74 284 -14 -82 -36
2385c6j02R9L56J2n49J13J48k63L8M9q3J77J28j01j17Q4K01k02J93j92l8j35K04
$$ -36 -138 -39 317 329 -220 -107 41 -222 -184 -135 -218 -41 87 -14 -131 -47 154 -48 145 -47 -85 -220 -16
2408a6K6j2Q5j2j7j81L82m07K3J21j92P5K77m14L80J33n45L17j89K76k09R1J06
$$ -16 10 -2 83 71 54 -127 255 -152 -129 -8 -200 -125 152 -262 118 251 -294 23 -166 110 -99 -8 98
2431I8j27%O2J10j18J0n3K8qJ08K1k8j54R5j37N6k33N67k43n97N54m4J53L9P0
$$ 98 -29 -29 33 143 25 35 -18 10 2 110 131 103 -51 44 -93 -37 -270 297 54 -543 11 -33 120 159 229
2456B29j85J5L8j14j9J1q5J0J21j63K14j61k61K46K05J39k7j00j67M2n3O5K4R2
$$ 229 44 59 97 -17 -36 -25 -110 -100 21 -142 72 -89 -350 -104 101 240 213 113 -54 -12 -65 0 24 116
2480A16l80L45J03j80k21K18j28J37L18l62N5J1J12k54r5qK50M4k62j2R9k00N17
$$ 116 -264 81 184 4 -217 1 -127 10 328 -34 21 32 144 -110 -205 -213 37 81 -181 -193 -94 -294 223
2503B23l77K56l6Q9l14O5Ko6Q8j45N51m23K10k35J67K6j99L52k92j44L53K6k5
$$ 223 -154 102 66 155 -159 -94 -92 -158 -70 -215 336 -87 123 -112 55 81 -118 234 -58 -202 151 177 152
2526A52k37J44o6P0k7j88j60L25j20N9J00j74nJ10J3j17k01M90j67k22K72J70
$$ 152 -85 59 -7 63 36 -152 -312 13 -107 -48 52 -122 -127 -17 -4 -121 -322 168 1 -221 51 221
2548B21L7j84p3m6k05L16l1J92j37j3k33K32j65J15j75L19l21J57o2K43k96j8
$$ 221 258 74 1 -45 -250 66 35 227 90 77 -156 76 -89 26 -149 170 -151 6 -56 187 -109 -127
2570a27j3J33l1K0k6lq3k0L95m6l19L00m55L55J52k08J13P1l81o8n8K16j7J75
$$ -127 -140 -7 -38 -18 -44 -47 -130 -150 245 199 -120 180 -275 80 232 24 137 208 -173 -241 -299 -83 -100 75
2594G5p7j74K58j95j14K67m2k76K33Q6m0O0O6j14N7k50J66k04L42JK38q4o6j65
$$ 75 -2 -176 82 -113 -227 40 -2 -278 -45 41 1 61 127 13 70 -180 -14 -218 124 125 363 279 213 48
2618D8N4J60l18J08j12j18j08N70k31L9p5q5j53O8R3L5O5L41n30n5O8J52j12L99
$$ 48 102 262 -56 52 -60 -178 -286 284 53 92 17 -68 -221 -153 -60 -25 40 381 -149 -204 -136 16 -96 303
2642C03l79j78L15j21J26m2p4N5jO8o6K82r9o3l24M5PN7K16n4q0o8L99j51l80
$$ 303 -76 -254 61 -60 66 24 -50 5 4 72 6 288 189 126 -198 -153 -146 -89 127 73 -7 -75 324 173 -207
2667b07J72L51j73m33K80j7l31J42J94P4k17o0K51j34j47k3K37J34j66j01J21
$$ -207 -35 316 143 -290 -10 -27 -358 -216 -22 52 -165 -225 26 -108 -255 -278 -41 93 -73 -174 -53
2688e3J61k75M35n10j5J35M86j48l72M7K78l3r6O8j38K03j78J03k29j5m3L58m46
$$ -53 108 -167 268 -242 -257 -122 364 216 -156 -109 169 136 40 108 -30 173 -5 98 -131 -146 -189 169 -277
2711b77K73l82N41j48k23L41l6j38k7r3K56j25j41K7J2PK6K73j34k21K46m2J11
$$ -277 -4 -386 155 7 -216 125 89 -49 -76 -169 87 -38 -179 -152 -140 -133 -107 166 32 -189 57 15 126
2734A26m75K23L17k06j41R7N15o08J25j22L50m2m97P22l02M4j66K48p6k40MJ41
$$ 126 -349 -126 191 -15 -156 -59 456 -152 -27 -149 201 159 -338 384 82 126 -40 208 132 -108 -104 37
2756C7J55l47J1K29k31N3o8L14j90Q2j9K5k99J21O31m82k6n0L51l03q5L08J79
$$ 37 192 -155 -144 85 -146 -93 -161 153 -37 45 26 51 -248 -127 504 22 -4 -54 297 -6 -91 217 396
2779C96n25k0J89K69m58j98M72j54o9J0L25l32k15K12L9K03j78K7L92l06l20K64
$$ 396 -129 -149 40 309 -149 -347 125 -29 -98 -88 237 -95 -310 -98 -59 144 -34 -7 385 79 -241 23
2801B3J46k68n0L66j46k52j19L05O2l82L52J88k63k31L49K4q6n6L82r6n56k6P98
$$ 23 169 -99 -149 217 71 -181 -300 5 67 -315 37 225 -38 -269 80 104 18 -38 344 248 -308 -334 464
2824D64m70j39K10K29k02j84J78K84m69j83J24K59l1l52L79Jj43k76M25N3l39
$$ 464 -6 -145 65 294 92 -92 86 370 -99 -282 -158 101 70 -282 97 98 -45 -321 104 157 -182
2845a82J79L19j46k88J23L07l26l54M43K04m24q8K47J85n68L14K21J1m78L52j2
$$ -182 -3 316 170 -118 5 312 -14 -368 75 279 -145 -233 14 199 -369 -55 166 177 -301 51 39
2866C9K46l55J28J77l86j99M38J45j73j90K49r6j28J23K5J53n56J37L53j72j33
$$ 39 285 -70 58 235 -151 -350 88 233 60 -130 119 23 -105 18 43 196 -360 -223 130 -42 -175
2887a75J69J10j58l34N56K25p04j51N64j0j91Q1L13l14j70q8K86p2l05M62J96
$$ -175 -6 104 -54 -388 168 393 -311 -462 102 92 -99 -18 295 -19 -189 -277 9 -63 -368 94 290
2908B90j80m4J34j66K6L1k56M37o72K87M12m18m09M33L07j69l05J82L37m40k79
$$ 290 110 66 200 34 60 91 -165 272 -400 -113 299 -119 -528 -95 212 43 -262 -80 257 -183 -462
2929d62N57P7l65J08K17K38m00N6K32j15m73M38mq5k58K38M60m65l77L54L91o47
$$ -462 95 172 -193 -85 132 370 -30 26 258 143 -330 108 104 19 -239 -1 459 -6 -383 -29 362 -285
2951b85Q6M95j94r6RJ7Rl08J25P44l05o14O11p8l43J17K04L0m98J11L52q0m59
$$ -285 -199 296 102 6 15 32 41 -267 -142 602 297 -317 294 216 -127 -10 194 224 -274 -163 189 109 -350
2974c50K29N17l41k94M32J51k43l38J46L62j83m54M56K24k46n93P81r6k96o4M31
$$ -350 -121 396 55 -239 193 344 101 -237 -91 271 88 -366 90 314 68 -525 256 160 -136 -200 231
2995B31j97n12M39J80k98j11K69K53l20r4K00j78K55k93J45J8m02J28N51l49P1
$$ 231 34 -478 -39 141 -157 -268 1 254 -66 -160 40 -138 117 -176 -31 -13 -415 -287 264 -85 -14
3016a4m6M72n44k00K28L53l87K8K69O8l70l8K45L50o87J79N06k92n03M70K64m11
$$ -14 -60 412 -132 -332 -104 249 -138 -110 159 227 -143 -181 64 414 -273 -94 412 120 -383 87 351 -60
3038f0r8L97k73k25J33M78j98n57N93M2j57j57O5J66l49J27L42K6m69m1L37K43
$$ -60 -158 239 -34 -259 -126 352 154 -403 190 232 75 -82 -17 149 -200 -73 269 295 -174 -215 122 365
3060C65p72K75K04K84m64O2K76r5m73K83K13k07j74N9L47l17j48M63j1k44N4J92
$$ 365 -407 -132 72 356 -108 -46 230 135 -338 -55 158 -49 -223 -164 183 -134 -282 181 170 -74 -20 172
3082A72J8j81q3L39r8o15L77J32k49K3K74j48j79K37K40k69N5qR0j28r9J49M2
$$ 172 190 9 -74 265 167 -448 -71 61 -188 -165 109 -39 -218 19 259 -10 45 37 127 -1 -100 49 91
3105I1K37n10J84J10n9k44L33j62J03l75M39J16m11K50J89j47m38K18K29k01l5
$$ 91 328 -182 2 112 53 -191 142 -20 83 -292 147 263 -148 102 291 144 -294 -76 153 -48 -83
3126h3m9L58l08KR6L05l91o2J93J35k48j63N36l94k90M67p6j71M1l0L18j48p5
$$ -83 -132 226 -82 -80 16 321 -70 -132 61 196 -52 -215 321 -73 -363 104 28 -143 -102 -132 186 38 -37
3149c7K58k3j61J10o9Q0l98j68M28K21l68J04J47J3j18J74K8l36m5L01k66J34
$$ -37 221 198 37 147 78 158 -240 -408 20 241 -127 -23 124 137 19 193 221 -115 -160 141 -125 9
3171IN4J26r6k54Q2N16n54k32N01M8j39l37M93j02j48n5K80l29R1n9K25J99k88
$$ 9 63 189 93 -161 -79 437 -117 -349 152 200 61 -276 217 115 -33 -88 192 -137 -46 -105 120 319 31
3194C1J86j83K00l26r0L62M6l25K06J67k84k06K90j14j08J85J20J41l06J5J08
$$ 31 217 34 234 -92 -182 180 226 -99 107 274 -10 -216 74 -40 -148 37 157 298 -8 7 115
3215A15m9j69J24J37l85K64j49j50J37l1K71N7j21k28J04r7J33k0J41r9j76L36
$$ 115 66 -103 21 158 -227 37 -112 -262 -125 -156 115 172 51 -177 -73 -170 -37 -57 84 -15 -191 145
3237A45n3j15L1nM8r0k62K26K13r9j76J15m7J77l01L81k64o5l4Q7j08K77j14j27
$$ 145 92 -23 8 3 51 -39 -301 -75 138 39 -137 -22 -69 108 -193 188 -76 -141 -175 -88 -196 81 -33 -160
3261a60J62r6J26l25K22jJ31n8K27j62n6j19O5r6M0J55p9K29O9j47j44r0Q1k2
$$ -160 2 -94 32 -293 -71 -72 59 1 228 66 10 -109 -44 -140 -100 55 -24 205 274 127 -17 -107 -26 -48
3285d8K36r6j80K47j41J69k29j00J67J41q9p3Q6Omj83J21l9Qk51L60j05pM51l50
$$ -48 188 92 -88 159 18 187 -42 -142 25 166 77 4 90 96 92 -91 30 -9 -1 -252 108 3 -4 447 97
3310I7m8Q9m6q4K7mn7j10K99p5j82J93j52k18L24q2o8K28k16j66K19K14q6j37
$$ 97 49 138 92 8 35 31 -26 -136 163 88 -94 99 -53 -271 53 -29 -97 131 -85 -251 -32 182 96 -41
3334d1R5O7J54k64J58j00r0p9J19K7O6j03K45k28k36L17j68J54m6p5K1j95n7L70
$$ -41 54 121 275 11 169 69 -21 -100 19 46 112 9 254 26 -210 107 -61 93 47 -28 -7 -202 -259 111
3358A11nR0j61j31J24j43j53K35m3l8M2o7L06j87P0j39R8M2k9J10j82K04K74m99
$$ 111 106 196 35 -96 28 -115 -268 -33 -76 -114 -72 -139 167 -20 50 -89 9 51 22 132 -50 154 428 -71
3382g1J08L8L04l39j75L50k53J28j59j60J88J47l1j73J06k15K51o0N1J09l4P2
$$ -71 37 75 379 40 -135 215 -38 90 -69 -229 -41 106 75 -98 8 -207 44 -16 35 144 110 182
3404A82r4k5MJm2j41K65Q0m18L84p0l15J22J82m15K99m9J32r7O0j24PN7M8r9K6
$$ 182 88 63 67 68 26 -115 150 230 -188 196 126 -189 -67 115 -300 -1 -50 82 -15 45 -79 -72 -15 33 -66 -40
3430d0P4J41j62L0r6k6P2m6J58j82J96r5K10j95k55K43N1oj3l1k41N0P1m1m7K45
$$ -40 34 175 13 43 -53 -79 -7 -53 105 -77 119 24 234 39 -216 27 78 72 59 28 -213 -163 -92 -133 -180 65
3456F5j43K12j57R4l6P1k38N20o85M34l61L40r0j07J58j60Q7k44k7L85Jl99M43
$$ 65 -78 134 -23 71 35 106 -132 388 -297 137 -224 116 26 -81 77 -83 4 -240 -267 118 119 -280 163
3479A63j71k2J18j10n3Q5R7j58Q1K58k58n0n6mJ0J28r0M8N1k12R0K00k04M4j59
$$ 163 -8 -30 88 -22 -75 10 107 -51 30 288 30 -20 -76 -80 -70 58 -32 16 67 -145 -55 145 -59 -15 -174
3504a74L53KK4k20R0J7j84N3J95r5j37R4j28J31j86l4J41o9J38R3n6K6j64J93
$$ -174 179 181 205 -15 75 92 -92 -39 156 61 -76 18 -110 21 -165 -199 -58 -127 11 104 48 74 -90 103
3528A03l37K98j56j69L49j21K63j93LjO1m6J34j23k54J69j11r3L25J3L8j25q9
$$ 103 -234 64 -92 -261 88 -33 230 37 40 39 100 54 188 65 -189 -20 -131 -224 101 114 152 27 -62
3551f2R6j48P4P3M6K34j77j31J88k30J63m17M32qk35K63j88J10n3J1l5q2O1j61
$$ -62 34 -114 -40 33 79 313 136 5 193 -37 126 -291 141 133 -102 161 -27 83 30 41 6 -76 -15 -176
3575a76J42J74J04J04n58L6K54l4k33K89j38J01k48P7K4K79j67l2j43M76l53j75
$$ -176 -34 140 244 348 -210 -174 80 46 -187 102 -36 65 -183 -106 -82 197 30 -2 -145 331 -22 -197
3597a97K44Jj74K6J66j79P6J33K45n11J09kJ14J24j07k87L28j24L34k34l22M56
$$ -197 47 48 -126 -100 66 -113 -37 96 341 -170 -61 -63 51 175 68 -219 109 -15 319 85 -237 219
3619B19m05O76n55pO0p1J34k2l5k50J92q7J65N7K7j86J06L8j85L30l29L7Jk61
$$ 219 -186 490 -65 -72 -12 -83 51 29 -6 -256 -64 -151 14 71 98 -88 18 56 -129 201 -128 -91 -90 -351
3643c51M26j74K2L3o4J01J81k02L8P8k49M5J21P6K6n0k63J34K40k88j02K45N8
$$ -351 75 -99 -77 -44 -108 -7 174 -28 10 88 -161 -116 5 81 107 57 -206 -72 168 -120 -222 23 81
3666H1P1k4j27Pj03Q5R5o3m3n5K41k78o9M2K2P4o3k7J53p6o6J86l33K01J84j16
$$ 81 152 128 1 8 -95 -10 85 22 -21 -76 165 -113 -182 -140 -118 -44 -107 -134 19 -57 -123 63 -270 -69 115 -1
3692aq3r6J60k8m3K1j71J61L2L48l99j21q0L5M60j47q9j21R9K7O5j04l8J78k85
$$ -1 -84 -180 -20 -48 -91 -70 -241 -80 -48 300 -99 -220 -300 -265 195 48 -41 -162 -63 -36 29 -75 -113 65 -220
3717b20M2M4o3J04l1J46R9j40O1l2q1Rm7J28J50l5k04J78l4n3J44q9j32M1j33
$$ -220 -178 -134 -197 -93 -124 22 121 -19 42 10 -71 -62 -109 19 169 134 -70 108 74 21 165 76 -56 -15 -148
3742a48r6J53J6j36J92Qn6K37j01L5N2L2j70K0j45K78om23J47J67Q1k19J45k2
$$ -148 -244 -91 -75 -211 -19 -11 -67 170 69 104 156 188 18 38 -107 171 165 -258 -111 56 137 -82 63 41
3766D1Q8j47rn6R6m8K54j71rJ29l01P9k3J59jj68j25O4L53k78L06j78qJ73m08
$$ 41 129 -18 -27 -83 13 -35 219 48 39 168 -133 -54 -77 82 81 -87 -212 -148 205 -73 233 55 47 220 -188
3791a88L16k25J23mJ50R5k98K18k16k27M4K89j02R2l3R1k72K96l41qJ89k17K85
$$ -188 128 -97 26 22 172 267 -31 187 -29 -256 -212 77 -25 67 34 125 -147 149 -192 -200 -11 -228 57
3814E7r2l37M83j5l39K59j30J20P8j40K0O0qj47J34m4n1pK19ok28J35n9l8o0K83
$$ 57 -35 -372 111 96 -243 16 -114 6 84 -56 -36 24 16 -131 3 -41 -92 -99 120 114 -114 21 -38 -76 -136 147
3840A47j67R6j64J6l4j37L53k52o5K97l49N05k7j49M3p4j68K89j19k92K43L2j9
$$ 147 -20 76 -88 -72 -106 -243 110 -142 -207 90 -259 246 219 70 113 39 -129 160 41 -251 -8 24 5
3863Ep8K69l92M36j96J56k06K17j63P5q1n3q4P1r8j64M43k08Q2j1j70J75r8k00
$$ 5 -73 196 -196 240 44 200 -6 211 48 123 42 -11 -95 -24 -122 -286 157 -51 31 20 -150 25 -73 -273
3887b73J48K52q1P6J0l22j6K92j88j22R6J63J04k46J86k73K6K01m3L9k53K50j14
$$ -273 -125 127 46 122 132 -190 -206 86 -102 -224 -128 35 139 -107 79 -194 -168 33 -10 29 -224 26 -88
3910h8J13O9k01q6J46O0M8o7j26M5J39pj00J78j02Q1j78o2L61j96L0NM2pj76O8
$$ -88 25 94 -107 -193 -47 13 61 -6 -132 -87 52 45 -55 123 21 102 -76 -138 223 27 57 62 104 97 -79 -11
3936a1Jo5J98j72J0j25M1L94o7l6k72J2J24o6m2r0K26N9p8noJ95j60k5n6J12N7
$$ -11 -10 -75 123 -49 -39 -164 -123 271 204 168 -104 -92 32 -34 -76 -166 60 119 41 36 30 225 65 40 -16 96 153
3963A53l56N5L27j18J9k06k1O7l8J48J54l03R9j54K02p9j02O07l36m47L11j97
$$ 153 -203 -148 179 61 80 -126 -147 -80 -118 30 184 -119 -20 -174 28 -51 -153 454 118 -329 -18 -215
3985b15j6P9J55k8j08L14k12N6n9j41J29L02m32J23L02k05M3R3j24Qr3J20N8j56
$$ -215 -231 -152 3 -25 -133 181 -31 25 -34 -175 -46 256 -176 -53 249 44 87 180 56 64 -29 91 149 -7
4009gM8O9J5j90J02j07m0J29l85L38k1M1p5n4J50p0K7p9r3L69j45j3O5k83K00
$$ -7 41 110 125 -65 37 -70 -110 19 -366 -28 -49 -8 -83 -137 13 -57 -30 -109 -202 167 22 9 74 -209 -9
4034iK14j72nK3q0L21k91O3mr0K7Ok07Q9P4J37k57J79L8J04k4j23J11j75M2J78
$$ -9 205 33 28 51 -29 292 1 64 60 -30 -3 3 -204 -115 -41 96 -161 18 56 160 136 13 124 -51 -9 169
4060A69j27j50N3j1m3j1K37r0K1j91K06qJ26k67J48n8m2l8RK27l23L73n2l88J15
$$ 169 42 -108 -55 -66 -109 -120 117 27 48 -143 63 55 181 -86 62 4 -38 -76 -67 160 -163 210 158 -230 -115
4085a15J96n5k6o4Mk2K14j93k2R6L6p8o5j57J54M2pJ67j70J53j29J23j24qo4j24
$$ -115 81 26 0 -64 -60 -82 132 -61 -83 13 49 -29 -94 -251 -97 -55 -62 105 -65 88 -41 82 -42 -50 -114 -238
4111b38K09J18j59Q9K3K17m0l95j40M24j11N2j90R8K11l59K36M8j56k45M87l80
$$ -238 -29 89 -70 19 42 259 219 -176 -316 108 -3 49 -141 -43 168 -191 45 93 -63 -308 179 -201
4133b01L77p7l19q4J17L45m95J21Q3L81j36M8j79J58J4n1n3O6r4j26K0K7L13j79
$$ -201 176 99 -220 -304 -187 158 -337 -216 -133 248 112 160 -19 139 153 102 49 115 21 -105 -85 -58 255 76
4157G6M4j5j76J29j74j1K53l56J16L34m68J50J82j17p4j96J83l4J59M6k00J05
$$ 76 120 105 -71 58 -116 -127 126 -230 -114 220 -248 -98 84 -33 -107 -303 -120 -154 5 51 -149 -44
4179d4kJ20o5%j08M1K45j97k11J03K67k7r8O7K54l79q2J36P2q8L1j12J02j64J71
$$ -44 -46 74 9 9 -99 -58 187 -10 -221 -118 149 122 24 91 345 -34 -116 20 92 4 35 -77 25 -139 32
4204C2l8L0k26L80l4k97J62M8k0q8n6J38O9j15Q5L3K6l25J62J03p5j07n9K13j4
$$ 32 -6 24 -202 178 144 -153 9 57 37 -51 -107 31 100 -15 70 103 129 -196 -34 69 -6 -113 -172 41 27
4229B7J19pj53J34j61p0L08m33J15j04K87j38jL10m01L21j21K34k37j64P7J85
$$ 27 146 139 -14 120 -41 -111 197 -236 -121 -225 62 -76 -77 233 -168 153 32 266 29 -135 -58 127
4251A27Pk66K6M8k09M34j16k4J99k62J56J1j26M2J11k38J10L5m3J61l79M88j39
$$ 127 134 -132 -106 -58 -267 167 51 27 226 -36 120 131 5 47 158 -80 30 65 22 183 -196 292 153
4274A53k86J29P4j33j78J97K7J11k5j49J69L7l90J45K87k74J61nN0p1j44K74J72
$$ 153 -133 -4 70 -63 -241 -44 -17 94 69 -80 89 126 -264 -119 168 -106 55 50 100 29 -115 159 331
4297C31l90Q9r2M66m55n3K22k86j00J99M51l67p4P8q4J32j49J22Q1m55N23j28
$$ 331 -59 30 -62 404 -51 -104 118 -168 -268 -69 382 15 -59 19 -65 67 -82 40 121 -334 189 61
4319F1J86k61l7L41l15J20k16J16k29K90m3op0n8l6J73m29M21RL0l07K69J95l59
$$ 61 247 -14 -51 290 -25 95 -121 -5 -234 56 13 7 -63 -121 -157 16 -413 8 17 47 -260 9 204 -155
4343a55P1K13l47K98j11q5J25o3k4N3R8l32L93oJ04m15K39rj09J85q7K89j52k62
$$ -155 -84 129 -218 80 -31 -116 9 -54 -78 -25 73 -259 134 128 232 -183 56 47 -62 123 36 325 173 -89
4367h9K82k19j74K10J31j32j16%l4J64l90M41N9m48K71j0JL1N6J96n6l94K61K6
$$ -89 193 -26 -200 10 141 9 -107 -107 -141 23 -367 74 133 -315 -44 -54 -53 -22 34 230 174 -220 41 67
4391F7n2L8rK16o30L18oJ7L7k10L12N0n07O14o1l9l64L73j43k51L40l8K17k60
$$ 67 15 53 44 260 -370 -52 -58 -41 -4 -214 98 148 -359 255 194 155 -209 164 21 -230 110 72 289 29
4415B9n3L45l76j41J7P6Q3k67J92j9J96j1k00N6K6k14K04K23n05L71p6J36j85
$$ 29 -24 321 -55 -196 -179 -103 -20 -287 -95 -114 82 71 -129 -73 -47 -261 -57 166 -339 32 -44 92 -93
4438i3J45J49l15O2p1L55j47l16K58K4j88m5J66Q6J07j83K63j79k53k2K12N0p0
$$ -93 52 201 -114 -52 -123 232 85 -231 27 51 -137 -182 -16 70 177 -6 257 78 -175 -197 15 65 -5
4461ej51L37Q4l23j34K78r3p3k9K64k80N4p9K75l63J88r5K99N8l04N3J14n1o4
$$ -5 -156 181 265 -58 -192 86 -7 -80 -109 155 -125 -71 -150 125 -238 -50 -145 154 212 -92 -39 75 24 -40
4485d0J16k86N8J80J55j14p5R0O0K07o06K62K54l05j48j8L74j71j18K40r5P2P7
$$ -40 76 -210 -152 28 183 69 -6 84 144 351 -255 7 261 -44 -192 -210 164 -7 -125 115 20 92 169
4508A69l1k06R3K71k54j63N2R7kj87L11j11k9M8L2J58j45k00L07ol36N7Q9J16
$$ 169 138 -68 25 296 42 -121 -69 28 26 -161 150 39 10 58 90 248 103 -97 210 204 -132 -75 14 130
4532A30J55m06O5r2M0J16M6j65J29j1J91j21o2o3K29n44J91K00n7J26k73K39o
$$ 130 285 -121 -56 -148 -108 8 54 -111 18 7 198 77 15 -48 181 -363 -172 28 -29 97 -176 63 57
4555E7o2l2K16j12Q0P2j17j02r5K11j9j45O1O4jk68R1K43K7o00O76k58nJ93r9
$$ 57 -5 -37 179 67 147 219 102 0 -95 116 97 -48 13 77 76 -192 -101 142 169 -431 245 -13 -18 175 76
4580G6J80j60l01K91j24j24J34L0j5l03L50K97k42N4l06M35k93j52J90k83L04
$$ 76 256 96 -205 86 -38 -162 -28 2 -13 -316 34 331 89 143 -163 272 -21 -173 17 -266 38
4601C8l34L68J31k24q9J28J57rn64L85J41O9j61k3o6n0J10J33j86j77N36j87j84
$$ 38 -296 72 203 -21 -110 18 175 166 -398 -13 128 197 36 13 -53 -103 7 140 -46 -223 313 126 -58
4624e8J34L0p4pJ46k39j47K21M8j24j82L79j20r0n5K33k31j68M38M6r7l85K66
$$ -58 76 106 32 25 171 -68 -215 6 54 -70 -252 127 7 -83 -138 95 -136 -304 134 180 83 -302 -36
4647c6j1K26j4k70M0K75k7j19j63J15J3j32k1K63k89K27P0J62n75L08Q8k04K36
$$ -36 -47 179 165 -105 -65 210 183 64 -99 16 29 -103 -124 139 -150 77 147 309 -266 42 130 -74 162
4670A62j62R8P6k53R8j67J1J11J5k58K43K64k21P3j52K9K02o5k57K43j80k3J75
$$ 162 0 98 174 -79 19 -148 -137 -26 -11 -269 -26 238 17 90 -62 -33 169 104 -153 90 -90 -113 62
4693F2M3K5L2r7o0J7k20J64J89j58r4J29R3j39J9J79Ll15K89j88Q4m3j6J09j39
$$ 62 105 130 162 65 5 22 -198 -34 155 -3 -97 32 125 -14 5 184 187 -128 161 -27 57 14 -2 107 -32
4718c2N2j23K35l39J80n6l6K4J09K12Q8l88R1k9J60j04n6J10K4j21J76k66J26
$$ -32 20 -103 132 -207 -27 -83 -119 -95 14 226 314 -74 17 -12 148 44 -12 98 122 1 177 -89 37
4741C7Oj85J2JM2L16m38O3J22j57J09j37K01J20m52L81K9j40j29J23J87o4k2n
$$ 37 43 -142 -130 -129 -87 229 -209 -146 -24 -181 -72 -209 -8 112 -340 41 70 -70 -199 -76 111 47 25 20
4765B0j11J3j84L14j59m1P6K37j00j69J38J5j53K39j71Q2Q0j82J3J09L0J0k57
$$ 20 -91 -78 -262 52 -107 -148 -72 165 65 -104 34 49 -104 135 -36 46 126 -56 -43 66 96 106 -151
4788a51K64k74J43L0J1R8j96K25m22L37k63K37k5k3Ll7J70m9p1J90o5k62M12j70
$$ -151 113 -161 -18 12 23 121 -75 150 -272 65 -198 39 14 -9 -6 -43 127 78 7 197 132 -130 282 112
4812A12j17r8m8J29k4R6j20j25p4K59J04k06Nk5L37k6n0l1j8m4J65k02n7L9J06
$$ 112 -5 -103 -151 -22 -46 50 -70 -195 -269 -10 94 -112 -107 -132 205 179 129 98 80 36 201 -1 -58 -19 87
4837H7M0k25J60m13K49lK53o9M7J07qk50n3K00R2l26L48o7l51j30M00O0l72J10
$$ 87 127 -98 62 -351 -102 -105 148 79 126 233 225 -25 -78 122 214 -112 236 169 -182 -312 88 148 -224 -114
4861a14o2K27j24J51K53k40j97L2J30K56j31m1m02N97l14L08l90J91k29R5K6j98
$$ -114 -176 51 -73 78 331 91 -106 -74 56 312 181 140 -262 335 21 329 -61 130 -99 -4 22 -176
4883a76K06p6J50j56j54J12P2J29J26j52j76K82k87J33jN1n9j2p0jk58N9M07l61
$$ -176 30 -46 104 -52 -206 -94 -22 107 233 81 -95 187 -100 33 32 83 24 12 -58 -59 -317 -258 149 -212
4907b12J80O3j11j44J77J87o9N1oj07j1p1P6k1R1J15j89N6j76M07j31j91j76K82
$$ -212 -32 31 -80 -224 -47 140 71 122 116 9 -2 -73 3 -18 73 188 -1 55 -121 286 155 -36 -212 70
4931G0k6j18K22q5p6J3j41K39l27K46qK67j82L1J5j37L8m1K05k26N4n8P6p6O8
$$ 70 44 -74 148 63 -13 0 -141 98 -229 17 9 276 94 125 140 3 41 0 205 -21 33 -25 51 -25 43
4956D3J27j09k77L08k40K09k36K74L03k80rj92N3J26J8j50o8qK0o9J1R0J52J5
$$ 43 170 61 -216 92 -148 61 -175 99 402 122 113 -79 -26 100 118 -32 -100 -108 -88 -157 -146 -56 96 111
4980A11k41K17l1l31M06l60N11k24k07J27P3M5jj94K76l22j3J65K56j77j73n3
$$ 111 -130 87 56 -275 131 -229 282 58 -149 -22 51 96 95 -99 177 -145 -158 7 263 86 -87 -140
5002a40r1K07J24r2k28L15r9k76K36mO8J08j88MK14j49J1m0k11J24J53n6p6J61
$$ -140 -231 -24 100 8 -220 95 -4 -280 -44 -48 20 128 -60 -56 158 9 20 -20 -231 -107 46 -10 -86 75
5026G5k13K12j46r1R0K58j94j96K91P7pk30M6K14k40j64L00j4r2m2j00K58l2k82
$$ 75 -138 74 -72 -163 -73 185 -9 -205 86 163 156 -74 -28 186 -54 -218 82 68 -24 -66 -166 92 60 -222
5050b22L68o8k94L31op6j58K05j61K01j34k31K89O0K4j31O3j41N5l1J68j80j04
$$ -222 146 78 -216 115 109 33 -125 80 -81 120 -14 -245 44 104 128 -3 60 -81 -26 -57 111 -69 -173
5073a73J98j73L12r6p5j38L19l67L40j53o9J25k03P1K37m27J24LN1L27k52J74
$$ -173 25 -148 164 68 -7 -145 174 -193 147 -6 -75 50 -153 -82 155 -272 -148 -145 -94 233 -19 155
5095A55K5P5m23K46J74j16j52P0j88J81j8N4k44P4K40k20J55O4j1l21L64p4k48
$$ 155 180 255 -168 78 252 136 -16 54 -134 47 29 83 -161 -87 153 -67 88 152 141 -180 184 110 -138
5118a38Q6Q5K6j56L28m6j17l26J36K42p5j33r0K70r1j38K59jN2k08j14M2J6J59
$$ -138 -52 33 59 -97 231 185 68 -258 -122 120 45 -88 -178 92 1 -137 122 121 173 -35 -149 -107 -91 68
5142F8j3l3j27L90m90K28J4p9Jk6K4K48j09n7k10L5J85k5lj53J69Mk16J00p8L0
$$ 68 55 22 -105 285 -205 23 37 -42 -41 -67 -43 205 96 39 -171 -136 49 24 21 -132 37 41 -175 -75 -153 -123
5168a23J19j75J10J48j92J44Q6j07j11j02L77l21K88m0k36J52j77L53q1P7j8j54
$$ -123 -4 -179 -69 79 -113 31 117 10 -101 -203 174 -147 141 101 -135 17 -160 193 112 189 171 17
5190A7J3J4J0N3N8j35K13k9k0m14R6M4J80J90j88j01K37l06n8K23j13l8N4l41
$$ 17 30 44 54 107 165 30 243 214 194 -220 -124 -80 100 290 102 1 238 -68 -126 97 -16 -54 0 -341
5214c41L09n6K34j27j97O6kK40k10K74Q2m66J5O3J37pL0o1oJ6j45n2K50MJ4q8
$$ -341 -32 -88 146 19 -178 -112 -114 126 -84 190 272 -194 -179 -116 21 14 44 -17 -23 -7 -152 -204 46 50 64 -24
5240b4R3O1k15K35j55p7J48j29j10L22k0r0P2k91J12J68k44L35j95o3J4J8L6K0
$$ -24 69 130 -85 150 -5 -82 66 -63 -173 149 129 39 111 -180 -68 100 -144 191 -4 -67 -53 -35 1 21
5264B1j24MJ90l30M18m4P9l49M31l37L37m15J48J00k96L03j40J20k48J87o7PL7
$$ 21 -103 -99 91 -239 179 135 214 -135 296 -41 296 -119 29 129 -167 136 -4 116 -132 55 -12 -5 32
5287C2J08j51O6K12k08M2L4k07M7l8J36j31k07J82K94j50ROj6J77k49qL36m3l97
$$ 32 140 -11 55 267 59 101 135 -72 -25 -63 73 -58 -265 -83 211 61 70 76 60 237 -12 -20 316 273 -124
5312a24L0l45M68j0K08k41j86M06j20k17K02r3k10K43o5j36k80M88nK71j83k49
$$ -124 -94 -439 29 19 227 -14 -200 206 86 -131 71 -22 -232 11 -54 -190 -470 18 13 284 101 -148
5334a48J18J26n1L9k27J45j15L5Q4Ro0j28jJ91KP1P8j39j91L76q6q8K51l57K47
$$ -148 -30 96 45 84 -143 2 -113 -78 6 15 -45 -173 -174 17 19 90 168 29 -162 214 128 40 291 -66 181
5359A81l07J86L4j19n4J43L24l97l43L76k5p6J53n4r6P1k28M14k13K4r0K66n2
$$ 181 -126 60 94 -25 -79 64 388 -9 -352 24 -1 -77 76 22 -74 -3 -231 183 -30 -6 -96 170 118
5382A18q4j27K21N9k51l2L23k12k2L9L1j31j51Q0J46l2o6Q8j84K10j75K08l7K08
$$ 118 34 -93 128 187 -64 -96 227 15 -7 32 63 -68 -219 -139 7 -25 -91 -3 -187 23 -152 56 19 227
5406B27k96j17J41J67n5k36K22o2j3o1m1O7M6k4J13j44J94j47L31k17J52K8l40
$$ 227 -69 -186 -45 122 67 -169 53 -9 -22 -83 -124 -57 -11 -35 78 -66 128 -19 312 95 247 275 -65
5429f5K7j51R8J11q4m3K8J83l6j2j35J00J75l0j4k53N8r8K16K9m49N08j47k4J
$$ -65 -38 -189 -91 20 -64 -107 -79 104 68 56 -79 21 196 166 152 -101 -43 -141 75 104 -345 163 16 -8 -7
5454g%J00K24m69K08j27N8l6K50j44p2Q4O6K47n00nO2N4k28K80p4o6K87j78j1
$$ -7 -7 93 317 -152 56 -71 -13 -49 201 57 -15 69 135 382 -118 -123 -61 -7 -235 45 -29 -95 192 14 3
5479CL5j34R8L6j08J16K02m18kQ3O5K48j04p6m9J4P1j21JjM7J65j38j35P7J3j24
$$ 3 38 -96 2 38 -70 46 248 -170 -172 -89 -24 224 120 44 -5 9 80 -41 -40 -41 6 171 33 -102 -25 -12 -136
5506a36J16N2j00J64j33J14j83m4KJ34R6j06j75K91M5k21J50L0Jk50J90N6nJ95
$$ -136 -20 32 -68 96 -37 77 -106 -150 -148 -14 82 -24 -199 92 137 -84 66 96 97 -153 37 93 88 283
5530B83j23k33k5R1O7K83l20JJ52m61L63q4R4K8L6o9O9r0l52N05k87lJ35j41K8
$$ 283 160 -73 -98 -7 60 343 23 24 176 -285 78 -6 88 116 152 83 152 62 -290 215 -72 -75 60 -81 -53
5555e3J69k03K44r3J16k80R8pj84J35J84Nj03n0J56M8k72P9q7Nj15L31l97J95
$$ -53 116 -87 157 64 180 -100 -2 -9 -193 -58 126 131 28 -22 134 182 -90 -11 -98 -93 -208 123 -274 -79
5579g9q3J66J1k38M63k02K3r8k01L22o2J10l2N9k23L25l14L6Lm52N02j97J06K81
$$ -79 -162 4 15 -223 240 38 61 -37 -238 84 22 132 100 159 -64 261 -53 -17 -14 -466 36 -161 -55 226
5603B26l60L05m0j9k11L2J57mk2L2L3j81J52r3j64K28k7p7j95L07j85L3J61Jk08
$$ 226 -134 171 131 112 -99 -67 90 86 64 96 129 -52 100 7 -157 71 44 -33 -228 79 -106 -73 88 89 -119
5628a19K4q0J37J55k39J24N8r4j68K18k60K74r1m5J92j60N5m1MJ18j51L4K13m25
$$ -119 -95 -175 -38 117 -122 2 60 -34 -202 16 -244 30 -61 -106 86 -74 -19 -60 -56 62 -89 -55 158 -267
5652b67K41K5K3l03K2N87l75n5m2L66m5k71J53k4j02J54K40l35j11L29k5l17K57
$$ -267 -26 -1 22 -281 -259 328 -47 -102 -144 222 177 -94 59 35 -67 87 327 -8 -119 210 185 -132 125
5675A25k46Q9j36J22R1j51M09l36J34N6l37L4K34o6J5J51l3j03J3j02N3n0j13
$$ 125 -121 -32 -168 -46 45 -106 303 -33 101 157 -180 -146 88 22 37 188 155 52 65 -37 16 -34 -147
5698a47J93R5o2p3L57k65m70K22K4L7m9K73J5l9l04o4L04l2k47L31Qj54K9J98
$$ -147 46 141 79 6 363 98 -372 -150 -126 -89 -138 135 150 111 -193 -257 47 15 -232 99 107 -47 -18 180
5722A80j00j28J5Q5m2j36L74k25k92K39P6j80M39j45k1j78K3o5qJ73k70L42p2
$$ 180 80 -48 -33 52 10 -126 248 23 -269 -30 46 -134 305 160 139 -39 -16 -81 -89 84 -186 156 84
5745H4j11j99J05K94q3j63N1J5K0j90J75K70o94K99l5M58n44J83j17J84%j33L49
$$ 84 -27 -226 -121 173 90 -73 -22 -7 13 -177 -2 268 -426 -127 -162 296 -248 -65 -182 2 2 -131 218
5768B18l94m7K21L39n59K55j82R5K28l45L29R1l45M1J68N5m49K00l8r5J25L0L16
$$ 218 -176 -223 -2 337 -222 33 -149 -54 174 -171 158 249 -96 -55 113 168 -281 -81 -119 -214 -89 -59 257
5791B57l30O7L05m38N1j37M43j16k06j39N08jl64J81K1J0j69J68l0n7j21M60l16
$$ 257 -73 -6 299 -139 -88 -225 218 102 -104 -243 265 264 -100 81 102 112 -57 111 81 24 -97 363 47
5814D7j57m4M51m74J96O3J59l22r9J25k07J46K30j92K17m05j4M32k43J73j05K03
$$ 47 -110 -154 297 -177 19 82 241 -81 -180 -55 -262 -116 114 -78 139 -266 -280 152 -91 82 -23 180
5836A80k69j92K47K60k73k1m9L09l25r8K37nkl25M43K3l74O8K66k0j80k12L89
$$ 180 -89 -281 -34 226 -47 -68 -117 192 -133 -231 6 1 -1 -326 117 140 -234 -166 100 80 -100 -312 77
5859G7J76m98L14P8j62j3N1K36j38k69M0J19q8L20l61L19l31J81J36r8j54K05
$$ 77 253 -245 69 147 -15 -28 23 259 121 -148 -108 11 -77 243 -118 201 -130 51 187 89 -65 140
5881A40l8j8l63M72J08l45RL20j53j01K02j10j66J35o2J5K41o49M27q9R9j22m
$$ 140 102 84 -279 193 301 -44 -35 285 132 31 233 123 -43 92 30 45 286 -363 64 -25 74 -48 -52
5904e2J19j10N3L0J58k66j65J91j20N5m6J77J18n1j03J06j93l22O20j29j84%L89
$$ -52 67 -43 10 40 198 -68 -233 -42 -162 -107 -153 24 142 91 -12 94 -99 -421 199 70 -114 -114 275
5927B75k14Q4j84K05l38J23q0K00J30k10K2j20J01k29P09n19j30j08N86j05n14
$$ 275 61 145 -39 166 -172 -49 -129 71 201 -9 13 -107 -6 -235 474 -45 -175 -283 303 198 -316
5948c16K14Q1J11j40L0J01j80j19K57K00j90j05Q3J58n71L69L2m1L3J02R7l45
$$ -316 -102 -21 90 -50 -20 81 -99 -218 39 239 49 -56 27 185 -386 -17 15 -26 7 109 206 -139
5970a39J53j60M98m73J90m3Q6k14J19j52j5J95K2j81k1q4K98J06j15k59L45%j13
$$ -139 14 -146 352 -121 69 26 112 -102 17 -135 -150 45 67 -114 -135 -219 79 185 70 -189 156 156 43
5993D3o1L0J48j51j33R5J00K30k91L07k30k75J37L78m59j18L13K41l29k11L19
$$ 43 -18 12 160 9 -124 -29 71 301 10 317 87 -188 -51 327 -132 -250 63 304 -25 -236 83
6014H3P3j36j82J38L6j67O9J6p3M4P3q0J28Q0K3l0J47k16n5L06l36R0J70Q6n01
$$ 83 156 20 -162 -24 12 -155 -86 -70 -143 -99 -26 -106 22 102 125 95 242 26 -29 277 -59 31 201 287 -214
6039b14J09j72K31k45M47k90J47N8R4M1l99J00O65m46q4m9J18m9j7L01l38l6l7
$$ -214 -105 -277 -46 -291 156 -134 13 71 165 206 -193 -93 572 126 42 -7 111 62 45 346 8 -28 -65
6062f5K83J13l06%M0K00m42o1J33m9K6m6J62K1q7l9J13m91L25J20J71k38o5P2
$$ -65 218 331 25 25 65 265 -177 -238 -105 -154 -128 -174 -12 9 -78 -117 -4 -495 -170 -50 121 -117 -182 -110
6086a10J57k19j09M19r5j87k0N8K00k20jl9J60j28K71j22J06k10k8K16J20k93
$$ -110 47 -172 -281 138 43 -144 -164 -106 94 -126 -127 -166 -6 -134 137 15 121 -89 -117 99 219 -74
6108g4J17j9k43K37m0K15l32J08MJ71k27L84j98K1n9k91M43n43J45M24m3l02j42
$$ -74 43 24 -219 18 -22 193 -139 -31 -27 144 -83 301 103 124 65 -226 217 -326 -181 243 200 -102 -244
6131b44M37j20j37J00Q6j62q6J21M87m82k9oO5J30l04K51q3o6J26O4k45JL70l6
$$ -244 193 73 -64 36 122 -40 -126 -5 482 0 -29 -35 30 160 -144 107 24 -42 84 148 -97 -96 274 238
6155B38p0p3l22N82n24Q5J34j68L80M4k43J59n1k96K48j71J13O7j45j70J35L7
$$ 238 168 95 -227 355 -169 -84 50 -118 262 306 63 222 171 -125 123 -48 65 132 -13 -183 -48 -11
6177a1M8j88L24j51m9J99l76J13K44r6on2j06j4K62k13J27o2J25J66m23M2o6K43
$$ -11 37 -151 173 22 -27 172 -204 -91 153 57 51 -1 -107 -121 141 -72 55 -7 118 284 -139 -97 -163 80
6201H0p1n0P2JJ1j49Q9o6m5n8j07K13K40o3n3j3Mj3K77j28j60RL5j82p2K21q8
$$ 80 9 -41 31 32 43 -106 -17 -83 -128 -186 -293 -80 160 97 44 31 35 22 299 171 11 20 55 -127 -199 22 -66
6228f6J16J94j30o5J44l78J62K04k08J28j52Q8L4j01J61m69N10j80M5j38Q2J52
$$ -66 50 244 114 49 193 -185 -23 181 -27 101 -51 37 71 -30 131 -338 172 -8 37 -101 -19 133
6250A33k12J1J42l9L9k65N6K01o7J18j21Q6j8o1j0RJ51p2r8j35K4K85j99k01J66
$$ 133 -79 -68 74 35 74 -191 -135 66 -1 117 -4 82 64 3 -7 2 153 81 -17 -152 -128 157 -42 -243 -77
6275g7o6L69k42p9P2q1o7R8M2J74J14l65J10k2k5J9J12k10J03Q7N0j26Q5r6M72
$$ -77 -143 226 -16 -95 -23 -104 -171 -73 -31 143 257 -108 2 -20 -45 -26 86 -124 -21 66 116 -10 75 -21 451
6300D51n78KJ47K01m47J14L22k64Q4LK5j12M9R0J09o7J28l25L0q6L0j11n3L84
$$ 451 -127 -125 22 223 -224 -110 212 -52 32 35 60 -52 -3 87 196 129 257 -68 -38 -124 -94 -205 -258 126
6324A26m66N69n83K14M25m55O40m67l6J5NR0m4J43k45J1k25K53o1K32Lk03M8J33
$$ 126 -340 229 -354 -140 285 -170 470 3 -33 -18 -13 77 33 176 -69 -58 -283 -30 -91 141 144 -59 -11 122
6348A22n7J27j20j93L15k46R1k56L81J93k91J53k12j42J75Q3k83M15k60L4j83
$$ 122 65 192 72 -121 194 -52 39 -217 164 357 66 219 7 -135 40 123 -160 255 -5 29 -154
6369a54p9Q7M3J57k04q1j16M23p2o4ml0J01J35m4J2k41L76k30J93j72n6J15p7
$$ -154 -233 -146 -103 54 -150 -231 -347 76 4 -60 -64 -94 7 142 98 110 -131 245 15 208 36 -20 95 18
6393A8jl5r8j3K58m3Kj83K50m56K71M8r8j5O1K8J75k74J47N9J39k96K13j19k26
$$ 18 17 -18 -116 -129 129 86 88 -95 155 -301 -30 18 -80 -95 -34 -6 169 -105 42 101 240 -56 157 38 -188
6418a88J75J15m9j59N4R6j15K57k46o0K94j70mK4j43J55J0qm9J28l69J96j51K66
$$ -188 -13 102 53 -106 -52 44 -71 186 -60 -120 174 4 0 24 -119 36 46 38 -11 117 -252 -56 -207 59
6442E9Q8j69P2J40m83J45M7K60j18j15l3J37k23K52k07R2p7L40l73K52J91l92
$$ 59 147 -22 50 190 -293 -148 -101 159 41 -74 -107 30 -193 59 -148 -56 -133 207 -166 86 277 -115
6464a15M51m23K28J08j16q6k28K10J22J30k39J24j47o9J82j52p4M6J87k92P0N6
$$ -115 336 -87 141 249 133 47 -181 29 151 281 42 166 19 -50 132 -20 -94 -48 139 -153 -83 -27
6486b7J79q7J05j97K82j32r3Q7l52K88p6J2p2L2j65J58Q7j20L58l81N3N1J7J34
$$ -27 152 65 170 -27 255 123 30 117 -235 53 -23 -11 -83 -51 -216 -58 29 -91 267 -114 -61 -10 7 141
6510A41k80J91J03j16n2J36j71L2J70j93k32L80j31k57L97m4r5n1K35k47J03N2
$$ 141 -139 52 155 39 -13 123 -48 -16 154 -39 -271 109 -22 -279 118 74 -21 -72 163 -84 19 71
6532G1J6l1N9L8k77J96m3J36k72J14m8q8L15l83J49J70j49L1k1Qk18L69k29K9
$$ 71 87 56 115 153 -124 72 29 165 -107 7 -41 -129 186 -197 -48 122 -27 4 -17 -9 -227 142 -87 -58
6556e8J22j01n7L0K92j46j42j65L96j81P7LO4k6l5k19K87k08J84J38k38J14k98
$$ -58 64 -37 -94 -64 228 82 -60 -225 171 -10 67 70 134 108 73 -146 141 -67 117 255 17 131 -167
6579a67L09j14j58J5K89q8J31m18J96j1O6M0n2ML4l0o9L24k90j62K93p6p9J8j61
$$ -167 142 28 -130 -115 174 86 217 -201 -5 -16 50 90 38 42 76 46 -23 301 11 -151 142 66 -13 5 -156
6604a56J53L72j21k99j6O7N1M9j84K88m8q2K07l07L6j01J10j84P7J34P4J2lo0
$$ -156 -3 369 248 -51 -67 0 51 100 -84 204 156 74 281 -26 10 -91 19 -165 -88 46 120 132 129 69
6628F9j18k2p3K0MJ06Q4k73L17j12J14o4j52M2N0L1q1j50M55l60K61m84M90j62
$$ 69 -49 -71 -144 -124 -120 -14 70 -203 114 2 116 52 -100 -58 -8 23 -58 -208 247 -113 148 -336 154 -8
6652hk68K21j42K18m5n9J71l9l52L29Q8k27K86m03J47L19j44J8j6k92M6M01k98
$$ -8 -276 -55 -197 21 -24 -83 88 49 -303 26 114 -113 173 -230 -83 236 92 110 94 -198 -152 249 -49
6675d9J40n1L49n74J05L18m12R7L07l43J21J35o6N7r7l52K05L03l14L75l05K45
$$ -49 91 40 389 -185 -80 238 -174 -77 230 -113 8 143 77 134 37 -315 -110 193 -121 254 -51 194
6697A94m92K81n2J04O4j12J22J32k19Q9N3k32J56j07K4m01L10jk6J05j52L75j19
$$ 194 -298 -17 -69 35 99 -13 109 241 22 111 164 -68 88 -19 5 -396 -86 -87 -113 -8 -160 215 96
6720I6j96Q1j06p1L01j8l9j37j65J40M8m1J66j05L00k16J29n00L79N8j12m5n6
$$ 96 -100 -19 -125 -196 105 87 48 -89 -254 -114 -66 -107 59 -46 254 38 167 -333 46 104 -8 -53 -109
6743a09j6L01j08k05J30q3L56k18J23p8j53L6J9k85K65l14L79Ln1j8qk3j38L41
$$ -109 -125 176 68 -137 -7 -90 266 48 171 93 -60 -24 -5 -290 -25 -339 40 43 -8 -26 -34 -57 -195 146
6767A46j66j29P0N9N3k0k30J89J42l36M25j53n4m1j20R0N7K3j27j99M13j45j4
$$ 146 -20 -149 -79 -20 33 13 -217 -28 114 -222 203 50 -4 -45 -165 -75 -18 5 -122 -321 92 -53 -67
6790f7l0j4M6Q0j22K67j1l61J6J81J90r1kj33l7Q9j70M7J86J20p1l25K53r0J00
$$ -67 -97 -111 -65 15 -107 160 149 -212 -196 -15 175 84 82 -51 -88 1 -169 -122 64 184 113 -212 41 -49 51
6815E1MK16k17k06N15l34L7o2k49J90rJ45n4p0p5N7l2M0L1K1J79j04j50K5J69
$$ 51 55 271 54 -152 363 29 66 4 -245 -55 -64 81 27 -43 -118 -61 -93 -53 -22 -1 178 74 -76 -51 118
6840A18j62K89k93K55o1m2k41Q9N9n9P1r2n3R8J32j98J15Q3q9Q1m2R3j78n1K51
$$ 118 -44 245 -48 207 146 104 -137 -48 11 -48 23 -69 -122 -24 108 -90 25 108 19 100 58 151 -27 -78 173
6865A73j28M3j66l5J54P2J2o3m8K25k82J08k8l78K17OK83pp2q0k14Q2L42j04l65
$$ 173 45 88 -78 -113 41 113 125 62 14 239 -43 65 37 -341 -124 -118 165 158 86 6 -208 -126 216 112 -253
6890b53J66J92K64m14k59K30K37q9l9q8r2K42j91k04M27Q1k55R9j15k0K50jj57
$$ -253 -87 105 369 -45 -304 -74 163 74 35 -53 -145 97 -94 -298 129 210 -45 54 -61 -81 169 168 11
6913A1q7J75j80q1M1K01J50k97n4J83j66J16j7j80K98j93R0m30L18J39j81R1K6
$$ 11 -76 99 -81 -162 -121 80 230 -67 -121 62 -104 12 -5 -185 113 -80 10 -420 -102 37 -144 -53 -27
6936b7l8p6K53k95K82L7j65P5j45o1K26J02q8l2N0k20k59L81L9j27O3J98j59L1
$$ -27 -65 -141 112 -183 99 136 -29 46 -99 -160 66 168 80 48 98 -122 -381 0 39 -88 -25 173 14 45
6960D5p7j05J00K09k13J36M2j85J97n8M9j82L09l67J14j25l5L14p1J04l03K69
$$ 45 -32 -137 -37 172 -41 95 137 -48 149 91 140 -42 267 -100 14 -111 -146 168 97 201 -102 167
6982A67j65R0p8J12J1n0r4j32q1J90RJ25O2K70m82J36j10Q2k09L52p0j60K87l33
$$ 167 2 92 14 126 137 87 -7 -139 -220 -30 -21 104 166 436 -46 90 -20 62 -147 205 135 -25 262 -71
7006g1r8K85k13J36n4J77p5l09K83j80K87R0k35k83K40p5K64k04J36j30K27k19
$$ -71 -169 116 -97 39 -15 162 87 -222 61 -119 168 258 23 -260 -20 -95 169 -35 101 -29 198 -21
7028b1J33l47J88J65l6K7J9l8lj64qJ60j20Q0j6j51j75N06j38j78K39r1O4j50
$$ -21 112 -235 -47 118 82 109 128 90 87 -77 -85 75 -45 35 19 -132 -307 199 61 -117 122 31 95 -55
7052e5P4j53J7J20m8l9J88r2K96l44M0J8J00j77R7l17O75n17k06M18oJ53l53K50
$$ -55 19 -134 -117 3 -45 -84 104 12 308 -36 4 22 122 -55 42 -275 400 -117 -323 95 89 242 -111 139
7076A39j18J30j03L0J12m29L90k66J05K2j01JL72k52N8J07l86K91k63jK56r5K86
$$ 139 21 151 48 78 190 -239 151 -115 -10 12 -89 -88 284 32 90 197 -189 102 -161 -162 94 -1 285
7099B85k79j4K2q0K04j01j72J54r1m1N2J9j44j14K61J02j19p0J55J09j14k27M00
$$ 285 6 -8 14 -66 138 37 -135 19 -72 -113 -61 -42 -186 -300 -39 63 -56 -126 29 138 24 -203 197
7122A97J7j71K6j58L37j61KJ4Qp6j59M17l74k9K30j41KP3%Pm45J68M05k03J96
$$ 197 214 43 69 -89 248 87 89 103 111 35 -124 293 -81 -110 120 -21 -19 54 54 61 -384 -216 189 -14 182
7147A82n8kk52K53L2m0n5l04L45nk69J71l9Q7L0j26k3K1J29j2K3q2q2J51l30L16
$$ 182 124 122 -130 123 155 115 60 -244 101 96 -173 -2 -41 46 76 -50 -73 -52 77 65 88 6 -76 75 -255 61
7173F1oo4oJ16Q6j58j33J18j69J89K8j21L02k75j17K21k49K25j50j10K85j69K29
$$ 61 55 -9 -15 101 187 29 -104 14 -155 34 62 -59 243 -32 -149 72 -177 48 -102 -212 73 -96 133
7196A33j18J02K61l83r7L92k32o3J31j32k26J03r1M4J4j6K64J8Q8l37Q8k32M03
$$ 133 15 117 378 -5 -102 290 58 -5 126 -6 -232 -129 -220 -176 -162 -178 86 104 192 -145 -57 -289 114
7219A14k10L10j67m0K3j83K24j70m5L14j45k42J28j07j03K16Q7j66o5k6L61P1
$$ 114 -96 214 47 7 30 -153 71 -99 -144 170 25 -217 -89 -196 -299 -83 4 -162 -227 -253 108 179
7241A79j20j19k7l0O7j22L87k13k36K47Oo3J70m55J47J35K98j02j75K36j59K31
$$ 179 59 -60 -87 -117 -50 -172 215 2 -234 13 19 -44 126 -329 -182 -47 251 149 -26 210 51 282
7263B82l60R4m5j18J74J0K44k64K15l29J43j88K41p2m2K04k15oJ08lk06L37p3
$$ 282 -78 16 -29 -147 27 37 281 17 232 -97 46 -142 99 27 -15 189 -26 -32 76 73 -133 204 131
7286A31k59K5L69l51J12K0O1j53jK64j21j7k22K54j74O9k15J42J35J64m35J50
$$ 131 -128 -103 266 -85 27 47 108 -45 -46 218 97 80 -142 112 -62 7 -208 -66 69 233 -202 -52
7308e2Q1j89L46k79J54l54M30l6k39J94k5j13K53l14k72N31j18L6J29k50J12J61
$$ -52 29 -160 186 -93 61 -293 137 101 -138 56 31 -82 171 -143 -415 116 -2 34 163 -87 25 186
7330A86j18m3j17K68p6Q9k27J82k22k7J4K41j37j45J1J73Lk14L48J9k87J03j71
$$ 186 68 25 -92 176 100 189 -38 144 -78 -105 -91 150 13 -132 -121 52 55 -159 189 208 -79 24 -147
7353a47L10r2K19k72j11m0LN6K57k01l8J81J6l16J63M27l09j51J35J09j93J32
$$ -147 163 71 290 18 -93 -133 -130 -74 183 -18 -56 125 141 -175 -12 415 106 -45 90 199 6 138
7375A38k23L09k18K3j27K21j37J85q6K29k42p0L9L1R8m01J98q6j0Q4K01j68k2
$$ 138 -85 224 6 29 -98 123 -14 171 85 314 72 2 41 72 170 -231 -33 -119 -129 -45 156 -12 -34
7398c4n4K47o4J0M7q8j18J83l9j59RO1K39q9j00j77L5J00k00R2L07k64n5J01K7
$$ -34 -88 159 95 105 152 64 -54 129 90 -69 -60 1 240 151 51 -126 -91 9 -191 -99 208 -56 -111 -10 17
7423A7J2n1l3p6n0l6K62k74L12k05J83Qj42K35k27J43Mj30k1j13K18M7J31m31
$$ 17 29 -22 -55 -131 -181 -217 45 -229 83 -122 61 69 -73 162 -65 78 82 -48 -69 -182 36 83 214 -217
7447b17M80l95K95j55R3n0j33q0J10K87j18o2j91K57l97R3K45k34M66k93PJ3o8
$$ -217 263 -132 163 8 101 51 -82 -162 -52 235 117 55 -136 121 -276 -183 62 -172 294 1 8 21 -47
7470d7K09k52J1k07J6L52r9O8J21k68K9L07o8k85k03L98J55k24j34K49l8k39J54
$$ -47 162 -90 -79 -286 -270 82 -17 51 172 -96 -67 240 172 -113 -316 82 237 13 -121 128 90 -149 5
7493EJ01k30J73j36J87j9k38K69j08k70R8J67J1MR2j52k59M85m61J25K19k36K73
$$ 5 106 -124 49 -87 100 81 -157 112 4 -266 -168 -1 10 14 106 -46 -305 180 -281 -156 63 -173 100
7516A00j6m7K3r0L2r0JJ42j33K34m53K79j54K31P3Q6j12k39J28K43k3n8k45k4
$$ 100 84 37 60 -30 2 -88 -87 55 -78 156 -297 -18 -172 59 132 218 106 -133 -5 238 215 157 -88 -112
7540a12K73m24L23K71n42J0L52p5pk0K25l45J09K03j42j5j37M49l73j51q4J84
$$ -112 161 -263 60 331 -211 -201 151 76 69 49 274 -71 38 241 99 84 -53 396 23 -128 -212 -28
7562b8m8J08j36J77n1p4q2J6M00k66J44j85J33n8R2j32j9r1P6j09K59j34n9N0
$$ -28 -76 32 -104 73 22 -52 -134 -118 282 16 160 -25 108 50 142 10 -9 -100 -24 -133 126 -8 -67 -17
7586a7N0J46L2k55J85k28j10K58j19OJ80n7j42m0K04J33k02k5J9J37Q5j29j54
$$ -17 33 179 211 -44 141 -87 -197 61 -58 -52 128 71 -71 -111 93 226 24 -1 18 155 240 111 -43
7609d3K7k04J35J0J46j39J93k87J46L0j20M7M7j46P1J10r8Q5k33J10K10J43k40
$$ -43 -16 -220 -85 -75 71 -68 125 -162 -16 14 -106 -59 -12 -158 -87 23 -75 10 -223 -113 97 240 0
7632@K28k82J00j90K3J86j18N5J2O2q5J1K06o8jk37J16q5qJ41m1m9N6q8p4J40
$$ 0 228 -54 46 -144 -121 65 -53 2 14 76 -9 2 208 140 139 -98 18 -67 -75 66 25 -24 32 -56 -130 10
7658A0m8L5K68m18J68R4M2O4j76l1J8J66j65N6k9L63k63k38J47j71K17n4l1k30
$$ 10 -38 -3 265 -153 15 109 151 215 39 8 26 192 27 83 54 417 154 -84 63 -108 109 55 24 -206
7682b06K13j35j79J97J14J2l9P9qo0j58n1J48K46m27J27J19O3M5M0m6p6n9j3J59
$$ -206 7 -128 -307 -110 4 16 -23 56 48 -12 -170 -221 -73 173 -254 -127 -8 55 100 140 94 18 -41 -54 105
7707A05Q0l70J54K10k07L66l57K33k95K43l29K43Q9j93M9r6J2J51k04q3L83j37
$$ 105 185 -185 -31 179 -28 338 -19 214 -81 162 -167 76 165 -28 21 -75 -63 88 -116 -199 184 47
7729D7k3l13K86K28q5l06K74J77k34j30o1K83j52j24L1J30l42L66j53J04j20J11
$$ 47 24 -289 -3 225 140 -166 108 285 51 -79 -140 143 -9 -133 -102 28 -314 52 -101 3 -117 -6
7751fl7P8n0M7r4p9J77k2j17M9m1J99K6j63J06L9q4k10OM30k98o1K21R5j22K3
$$ -6 -43 35 -15 32 -62 -141 36 14 -103 -54 -95 104 130 -33 73 112 28 -182 -176 254 -44 -105 116 211 89 112
7777A12k46r3N5J72J25k75pj48J3J97J93l1J43k38N3K5J74m62j35K73K20m42L18
$$ 112 -134 -227 -172 0 125 -150 -157 -305 -292 -95 98 67 210 -28 25 50 224 -238 -373 -100 120 -322 -4
7800dj28J23n1K00L8j83J78l23K16k62K93j62M6n8K44m6m13L01O0m8K18j26l49
$$ -4 -132 -9 -60 140 178 -5 173 -150 66 -196 97 -65 -19 -77 167 121 -292 9 69 21 239 113 -236
7823b36M16j03l37M24j59J75k15J00Mj05o4L87l68p6l7O6N3M9j8O6n3j64K30L1
$$ -236 180 77 -260 164 5 180 -35 65 69 -36 -100 287 -81 -157 -194 -128 -75 -26 -44 22 -31 -195 35 66
7847F6q8P3o0P9M4k06p8N2k9qK65j68N7L9n4O5j63J33l8J11k65J03L07m11Q1m1
$$ 66 -22 51 -9 70 114 -92 -170 -118 -147 -155 110 -58 -1 38 -16 49 -114 19 -19 92 -173 -70 237 -174 -93 -134
7873a34J44j5M6J9J6k32K76l5j19J71j35J86j99P9k3m3N6J86Ol32Q7m3J71rj75
$$ -134 10 -5 41 60 76 -156 120 85 -34 137 2 188 -11 68 45 2 58 244 250 -82 5 -38 133 124 -51
7898e1l41N35j40j82K21J21k10j9k7Q7j49J1K44J32k59n0J49K39k54P2k21K88
$$ -51 -392 143 3 -179 42 163 -47 -66 -93 -6 -155 -144 100 232 -27 -77 72 311 57 129 -92 196
7920A96m62K92k69K24k64K73rJ26j65O7j6O3j14K5pJ57k48J24k3P6k91L35p9J61
$$ 196 -266 26 -243 -19 -283 -10 -19 107 -58 9 -7 56 -58 -33 -40 117 -131 -7 -30 46 -245 90 11 172
7944A72j42Q6r3o6K29m85K37K1J89j31q2NJ55p5J9j25k65J20K34j42k8J19J02
$$ 172 30 116 23 -43 186 -299 -62 -41 148 17 -65 -60 95 20 39 -86 -351 -231 3 -139 -167 -48 54
7967E4k58K63K14l52j67J20L88j15k99%J61l58J90K22r7K36m19O5o1J52j33L78
$$ 54 -204 59 273 -79 -246 -126 262 147 -152 -152 9 -349 -159 63 -34 202 -217 -152 -213 -61 -194 184
7989A84l22jJ83J16j29J28j23J74q0k32k5J59J17j29j16J16q7J89k79J00J0k31
$$ 184 -138 -139 44 160 31 159 36 210 130 -102 -127 32 149 20 -96 20 -67 122 -157 -57 -47 -278
8011b78L43L1k08K79r5l25M03k81K33p6l6J98k20J0j16o1l8R1J7K71j95N2n0K06
$$ -278 65 96 -112 167 72 -253 150 -131 102 26 -10 188 -32 -22 -138 -199 -237 -146 -129 142 -53 -1 -51 155
8035A55j12k11Q6J19N7j10l2Q0k47L68l72L46l38N6L60n23K63n7n7L39J35m42
$$ 155 43 -168 -82 37 94 -16 -48 32 -215 153 -219 127 -211 -155 205 -318 -55 -112 -169 170 305 -137
8057a37J4L4L02p7k3n5J8j44P3j69L45p4j47J29l49L85m42N06j9l31J88L18k43
$$ -137 -123 -89 213 136 113 58 76 -68 5 -164 181 107 -40 89 -260 125 -317 189 170 -161 27 345 102
8080A02Q0j52j75KQ2jJ05k7n3J6K58m63M79k29J38k48J03k25L71r0m9m5J11k68
$$ 102 182 30 -145 -143 -61 -62 43 16 -37 -21 237 -226 253 24 162 -86 17 -208 163 73 24 -21 90 -178
8104a78l4K77j52J62k09M43m40J41k21L25j12L01k24K0M0q2j07K41o9k74L5K65
$$ -178 -212 65 -87 75 -134 309 -131 10 -211 114 2 303 79 99 139 57 -50 191 122 -152 -117 148
8126A48k00N5k89M70k67p4J32r2J31j84P0P5l20K36J50J47o7l0J63l53J96J77
$$ 148 -52 3 -286 184 -83 -157 -25 -117 14 -170 -100 -25 -345 -109 41 188 121 91 254 -99 97 274
8148B74j17k79JOO6r8P4j61Q7J48O9j41J57r8q8O2K27k01j91R7J46K25m95K35
$$ 274 157 -122 -121 -115 -49 -147 -73 -234 -147 1 70 -71 86 -12 -100 -38 189 -12 -203 -106 40 265 -230 5
8172EO6j18J77k02J30l69N59m98J89L2j04K2K82k24J26k3j6N8k90
$$ 5 71 -47 130 -72 58 -311 248 -250 -61 -29 -133 -111 171 -53 73 50 34 92 -198
8191a98
$$ Imaginary data points
##PAGE= N=2
##DATA TABLE= (X++(I..I)), XYDATA
0@%%%%%%%%%%%%%%%mJ2j6J6j6J6k4L2l2M0m8N2o0P2q2R0j04J20j36J53j71J90
$$ 0 0 0 0 0 0 0 0 0 0 0 0 0 0 0 0 -4 8 -8 8 -8 8 -16 16 -16 24 -24 28 -32 40 -42 48 -56 64 -72 81 -90 100
37A00k12K37k66K98l29L62m01M44m89N39n94O54p20P94q76R64j065J179j306J452
$$ 100 -112 125 -141 157 -172 190 -211 233 -256 283 -311 343 -377 417 -459 505 -560 619 -687 765
57G65j620J820k056K342k701L159l768M616n883P975j1990K2272r3280j89337
$$ 765 -855 965 -1091 1251 -1450 1709 -2059 2557 -3326 4649 -7341 14931 -78349 -267686
71b67686K97373J61969k15729j22778J50545J07143p1714j37114Q650J72289N2285
$$ -267686 29687 191656 -24073 -146851 3694 110837 39123 -97991 -89341 82948 135233
82A35233j88033q2632J60055Q4747j17267p5163O9269R0902j5638j23508m7275
$$ 135233 -52800 -135432 24623 109370 -7897 -83060 -13791 77111 61473 -62035 -109310
93a09310J52322R6426j64792j23215J62629J24666j51134j20755J32426J26971
$$ -109310 43012 139438 -25354 -148569 14060 138726 -12408 -133163 -737 126234
103A26234r3921j40185M2355J45694K522j43849k5195J39620L2642j31907l6848
$$ 126234 32313 -107872 -65517 80177 82699 -61150 -86345 53275 85917 -45990 -82838
114h2838J09633M6720o6482n9292J1555O8595L6340p9400o4602R2578P9631j01608
$$ -82838 26795 73515 7033 -52259 -40704 27891 64231 -15169 -79771 12807 92438 -9170
126i170q9985R4370J00578o8295j08183L3483J13956m723j21287j2311J28185
$$ -9170 -99155 -4785 95793 27498 -80685 -47202 66754 62031 -59256 -71567 56618
137E6618K3021j30414l1033J17317L8102q9958m2532N6568M5985k7154n2141K452
$$ 56618 79639 -50775 -81808 35509 73611 -16347 -58879 -2311 43674 16520 -35621 -33169
149c3169O0056J9984o2440l9658N7387N5605m3144o7620K5381P6985r472q8127
$$ -33169 26887 46871 -15569 -55227 2160 57765 14621 -52999 -27618 49367 39895 -48232
161d8232n576R9323K0182j04410l1632J01527L7301r1391l9303P5593M0952n8160
$$ -48232 -53808 45515 65697 -38713 -70345 31182 68483 -22908 -62211 13382 54334 -3826
173c826m6096L9078N3169j9153n4794J370N1313J0460m1650j9945K9569L0491
$$ -3826 -49922 -10844 42325 23172 -31622 -30252 21061 31521 -10129 -30074 -505 29986
185B9986j5303m3982l82N7822J4689o7151k6228P1229L2653o9720l7017O4081
$$ 29986 14683 -29299 -29681 28141 42830 -24321 -50549 20680 53333 -16387 -53404 10677
197A0677M1825n5344m8200M4382N3698l3313n5979K2716N5003j4106m8698N266
$$ 10677 52502 -2842 -51042 -6660 47038 13725 -42254 -19538 35465 21359 -27339 -22073
209b2073M0483M174k9420j4621J6718K4207l659l2203p563L8038J6792m1288k5714
$$ -22073 18410 22584 -6836 -21457 -4739 19468 15809 -16394 -23957 14081 30873 -10415 -36129
222c6129M1252L3604l7770m1564L2244M7835k5604n1935J9876N4397j5344n4280
$$ -36129 5123 38727 957 -40607 -8363 39472 13868 -38067 -18191 36206 20862 -33418
234c3418J0484N0751m323m3736j665L3326Q561k2232j4326J2206J9059l858k3214
$$ -33418 -22934 27817 23494 -20242 -21907 11419 19980 -2252 -16578 -4372 14687 10829 -12385
247a2385m480K3949J3346k2328k1721J8644L0558j4442l7118R939M2660p005m6325
$$ -12385 -16865 7084 20430 -1898 -23619 -4975 25583 11141 -25977 -16038 26622 19617 -26708
260b6708L514M7500k33m4542l730L9997Q279l3727j2270K7134J4912k0262j7681
$$ -26708 -23194 24306 24073 -20469 -24199 15798 24077 -9650 -21920 5214 20126 -136 -17817
273a7817J3157J8332n762j6556j695J3808Q960j0416j6522O780K3484l013k9531
$$ -17817 -4660 13672 7910 -8646 -10341 3467 12427 2011 -14511 -7731 15753 12740 -16791
286a6791q60L2916M946l4088p167L3222J0195l1458j3507K8209J6585k4303j9145
$$ -16791 -17651 15265 20211 -13877 -21044 12178 22373 -9085 -22592 5617 22202 -2101 -21246
299b1246J9440K0639j4328j9518R706J7233n149j4633o70J0636O496o370j1607
$$ -21246 -1806 18833 4505 -15013 -5307 11926 6777 -7856 -8526 2110 8606 2236 -9371
312i371K272J6246K248j9542n455K0905Q394k1298j2259K0662J5846j8691j7933
$$ -9371 -7099 9147 11395 -8147 -13602 7303 15697 -5601 -17860 2802 18648 -43 -17976
325a7976J5988K0339j3625k1402J0683K0897q299j9274M361J7363j094j3269k516
$$ -17976 -1988 18351 4726 -16676 -5993 14904 6605 -12669 -8308 9055 7961 -5308 -7824
338g824R627N654n929q376J987J0606J962j2347n231J1956R633j1775j2087J0352
$$ -7824 1803 7457 1528 -6848 -4861 5745 7707 -4640 -9871 2085 11718 -57 -12144 -1792
352a792J4401q554j7162P289J8732n475j9002L175J8107j108j6838o63J4153K957
$$ -1792 12609 4055 -13107 -5818 12914 7439 -11563 -8388 9719 8611 -8227 -8890 5263 8220
366H220j1528m705Q669O749n279p816J892P744J473p796m029P395P029o144j0309
$$ 8220 -3308 -8013 656 7405 2126 -5690 -3798 3946 5419 -2377 -6406 989 8018 1874 -8435
381h435M704J2387l449j3527J657J3784L01j4018j679J3493L557j2490m910J0534
$$ -8435 -3731 8656 5207 -8320 -6663 7121 7422 -6596 -8275 5218 8775 -3715 -8625 1909
395A909O449q851o901O724P200m180o915J042O657J389o004l772M785O155l865
$$ 1909 8358 -493 -7394 -670 6530 2350 -4565 -3523 3134 4523 -1481 -5253 -468 5687 1822
410A822p787K777Q750p83r526j358R411L001q974m501Q909N701q432o301P143
$$ 1822 -5965 -3188 5562 4779 -4747 -6105 3306 6307 -2667 -7168 1741 7442 -990 -7291 -148
425a48P098n595p117L582O712j676n761m03N426K421n316m052M335M920k808n619
$$ -148 6950 1355 -5762 -2180 4532 2856 -2905 -3308 2118 4539 -777 -4829 -494 4426 1618 -4001
441d001Q24O474M67n465l149N890M317n949n613N441O728m818o198L862O091k700
$$ -4001 -3177 3297 3764 -1701 -4850 1040 5357 -592 -6205 -764 5964 1146 -5052 -1190 4901 2201
457B201n737L89N456J537n453k821N037L798m171l821L220L997k252m439J82M278
$$ 2201 -3536 -3147 2309 3846 -1607 -4428 609 4407 236 -3585 -365 3632 1380 -3059 -2877 1401
473A401K174m390l307M275M446m062m646L987M364l331m693J496M932O37m751
$$ 1401 3575 -815 -4122 153 4599 537 -4109 -122 4242 911 -3782 -2286 2646 3283 -1468
488a468k198M683K902m445l445M401K963l580l352K514L373l73l311j548L609
$$ -1468 -3666 1017 3919 -526 -3971 430 3393 -187 -3539 -1025 2348 1975 -1336 -2884 725
503G25K831l859l522L769L400l445l303K945L288j150l199k65K866K106l803l103
$$ 725 3556 -303 -3825 -56 3344 -101 -3404 -459 2829 1679 -1520 -1785 1081 3187 -616 -3719
519c719L774L694l808l225K907K606j644k675Q38K620P11l091j803L273L022l815
$$ -3719 55 3749 -59 -3284 -377 2229 585 -2090 -1252 1368 2079 -1012 -2815 458 3480 -335
535c35k727K934K489j674k315J150J945n4k483j332L011K113l439k572L152K782
$$ -335 -3062 -128 2361 687 -1628 -478 1467 1413 -1070 -2402 609 2722 -717 -3289 -137 2645
551B645k449k155J550J423j04j674r35K311J728k971k113L160K366k425k090J610
$$ 2645 196 -1959 -409 1014 910 -764 -1699 612 2340 -631 -2744 416 2782 357 -1733 -123
567a23J266m30j582k57J949P85k312j688K636J950j989k077J765J218r24j443
$$ -123 1143 713 -869 -1126 823 1608 -704 -2392 244 2194 205 -1872 -107 1111 187 -1256
583a256L26K024L39j750j341J862J413j671j377J471J734j031k371O17J840P84
$$ -1256 -930 1094 1433 -317 -1658 204 1617 -54 -1431 40 1774 743 -1628 -1011 829 1613
599A613j400j455J313J170j763j024J850J488j374k453N46K278O72j907m95J420
$$ 1613 213 -1242 71 1241 -522 -1546 304 1792 418 -2035 -1489 789 1461 -446 -941 479
615D79K88j228n53J557J332j726k169J038K070k54j167MM00M33r71o72J338J416
$$ 479 767 -461 -1014 543 1875 149 -2020 -982 1088 834 -333 -329 71 504 -467 -1139 199 1615
633A615j359j725P51J895m44j299m5J622q4j739l98J466J263j255j657J386J046
$$ 1615 256 -1469 -718 1177 733 -566 -611 1011 927 -812 -1210 256 1519 264 -1393 -7 1039
650A039j333j031J277J255m98j548K36P92M39J72r48l01O05j50r59M11J672J64
$$ 1039 -294 -1325 -48 1207 709 -839 -603 189 628 800 -148 -449 156 6 -953 -542 1130 1294
668A294j833p59J477P87j049n87N44J187j393r04J245J685j598j286P93R54m55
$$ 1294 -539 -1298 179 966 -83 -670 -126 1061 -332 -1236 9 1694 96 -1190 -397 557 102
685A02n52N20N13l32o39k57N42P01m32l79k11N72M19l46j344Q06J380n60j761
$$ 102 -450 70 583 251 -388 -645 -103 598 166 -213 -424 148 567 221 -1123 -317 1063 503 -1258
704a258M16J984o39j606P53J443p68j588R43J425n39j157J78Q19m33k42L82O1
$$ -1258 -842 1142 503 -1103 -350 1093 325 -1263 -320 1105 566 -591 -413 406 -27 -269 113 174
722A74l58k15K68m37O98K24J4p67j96J287j8q85n69J506K15j978L82J431K42j722
$$ 174 -184 -399 -131 -568 130 354 368 -399 -595 692 674 -211 -780 726 941 -1037 -655 776 1018 -704
742g04k36J754n5j516j42J398k89m41Q9O19k74l81K7M07p6k29P35n90r48Q07P66
$$ -704 -940 814 759 -757 -899 499 210 -231 -142 477 203 -178 -151 256 180 -49 686 96 -852 -45 721
763G21n77r31Q25P30j062q09J293O80j375p51J556O69j090q15J096M28r91j67
$$ 721 144 -787 38 768 -294 -1103 190 870 -505 -1256 300 969 -121 -936 160 588 -403 -570
781e70R65P9q59q3R54m95j25J44N80j237L3J213n78r53N78J201n16j464Q14J315
$$ -570 395 474 -385 -468 486 -9 -134 10 590 -647 -614 599 21 -932 -354 847 331 -1133 -319 996
801I96r77m60N87R63q31r73L73J234p30r52O97N10p26k03R66p9p24R7L16j45m49
$$ 996 19 -441 146 1109 278 -695 -322 912 182 -770 -73 437 -289 -492 474 395 -329 -232 84 -61 -510
822e10P32L06q69J59M16M23r25k13J200j14j225r3J712l73j192J95J290o10j035
$$ -510 222 528 -341 -182 234 657 -268 -481 719 605 -620 -713 999 626 -566 -371 919 309 -726
841g26N11R61m59j049R05L83q09r0P04J71p92K05L41k49m25L57N75k75p53N36
$$ -726 -215 746 287 -762 143 526 -283 -373 331 502 -290 -85 256 7 -418 -61 514 239 -514 22
861B2P06q42m91O23R45j230n47J073M47j009r8J153k26j173M96M89l44j99m6M59
$$ 22 728 -114 -605 18 963 -267 -814 259 706 -303 -401 752 526 -647 -151 338 -6 -205 -251 208
881B08l06r5J06M23n65O6K44K09p55K79R67o69p12M40O89o06q11P52N47p67qP45
$$ 208 -98 -193 -87 336 -229 -163 81 290 -465 -186 781 112 -600 -160 529 -77 -888 -136 411 -356 -364 381
903C81k08m13P9J10J15J51l96K41J88l88K6M16L5m74L85L60j062J12Q60n24o62
$$ 381 173 -240 -161 -51 64 215 -181 60 248 -140 -114 302 337 -137 248 608 -454 -342 518 -6 -668
924f68L57N46k59j70L36J08Q4n68L5L90Q2n94J87P88o31n80O34M74n53j20O38
$$ -668 -311 235 -24 -194 142 250 334 -234 -199 191 273 -321 -134 654 23 -557 77 551 -2 -122 516
945E16m53m22P67k66k38J47K01m32p9L29j02K04j14m46L44K78o39M1J009k90q30
$$ 516 63 -359 408 142 -96 51 252 -180 -259 70 -32 172 58 -388 -44 234 -405 -364 645 355 -475
966d75J72N52l06o2M21j81l24J91r2P5K10J82o61o6K64j90J04M41n34n0P02m87
$$ -475 -303 249 -57 -119 302 121 -203 -12 -104 -29 181 363 -298 -364 -100 -290 -186 255 -279 -329 373 -114
988a14l7N01J01o24O3J78m05J76L17M2o44N73m08l64J003J52n79n0K23m58J55
$$ -114 -151 350 451 -173 -110 68 -337 -161 156 198 -446 127 -281 -645 358 510 -69 -119 104 -354 -199
1009a99L69j76k97M79j49o53P35M65n79K5K80o67j38P60j64m52O88l09n29N17
$$ -199 170 -6 -303 176 27 -626 109 574 -5 20 300 -367 -505 255 91 -361 327 18 -511 6
1029FN26m76PN34q97k65N45N4k2J00J1o29K70Q47n88o7L40l60k44P12j13k54K31
$$ 6 532 56 63 597 -300 -565 -20 34 12 112 123 -506 -236 611 23 -44 296 -64 -308 404 291 37 268
1052B68K40j045M23N09n66j25O90j1q00M31mm04M67J21m71J50K94m44j24J013
$$ 268 508 -537 -114 395 -171 -296 394 383 -417 14 10 -394 73 194 -277 -127 167 -277 -401 612
1072F12k84q49M32K9l6M46J0l13m76O10m69j13R12j88r13L70R18j400M55Q26o25
$$ 612 328 -521 -89 -60 -96 350 360 47 -429 181 -288 -401 511 323 -590 -220 698 -702 -247 579 -46
1093d6k47N82l58m22R25l8o35M59M09q10n0N96m76l82O71K5o75L82O83r57P7O64
$$ -46 -293 289 -69 -491 434 396 -239 220 629 -181 -231 365 -111 -493 178 203 -472 -90 593 -364 -287 377
1115C77n43k84O58l0m17K91J43m09K51J74n82J42P17n86m60Q55J3r04O88O79j303
$$ 377 -166 -450 208 178 -239 52 195 -214 37 211 -371 -229 488 -98 -558 297 310 -594 94 773 -530
1136e30K93N96m00m23Q23m91j97M82j74k20L56j10o96R77L68j116m1J263p28n57
$$ -530 -237 359 -41 -464 359 -132 -329 153 -21 -241 115 5 -691 286 654 -462 -503 760 32 -525
1156e25Q42M61j164j08R83m79j53P5K00l75J10j30K36M19n99j37N84n2o90N81
$$ -525 317 778 -386 -494 489 10 -143 -68 132 -243 -133 -263 -27 392 -207 -344 240 188 -502 79
1176G9P38q88m97J031J10j139M75O98m84n67O08J80q3n17oL65J93q23K97N01l70
$$ 79 817 -71 -568 463 573 -566 -91 607 123 -444 164 344 261 -256 -262 103 296 -527 -230 271 -99
1197i9m36O75P78j376l62J765l69j200O31P53q65p26J292l6o88l31P48j1l63k13
$$ -99 -535 140 918 -458 -820 945 576 -624 7 760 -105 -831 461 425 -263 -594 154 143 -220 -433
1217d33N71N80j385k44J528O3j472N12J022p34j056J064Q83j093p46J336J15r98
$$ -433 138 718 -667 -911 617 680 -792 -280 742 8 -1048 16 899 -194 -940 396 511 -487
1235d87J26P59M19j430k0J219n7j417N01J203p05j390J142J160j389p64J732M70
$$ -487 -361 398 817 -613 -633 586 529 -888 -387 816 111 -1279 -137 1023 -366 -1130 602 1072
1253A072j946K09J449j22j484M86J356m76j466O60J156p30j089J066R33j322j093
$$ 1072 -874 -665 784 662 -822 -336 1020 544 -922 -262 894 164 -925 141 1074 -248 -1341
1270a341J875O37j920k47J694M4j881O64J767r08j726J221J605j357j484J436
$$ -1341 534 1171 -749 -996 698 742 -1139 -475 1292 384 -1342 -121 1484 127 -1357 79
1286G9J023j355q78J902N13j800p31K256r4k055J84K389j051k231J675J667j566
$$ 79 1102 -253 -1131 771 1284 -516 -1247 1009 915 -1140 -956 1433 382 -1849 -174 1493 -73
1303g3j512J842R35j833q28K276M52k166M3J992O0k171K18K249j054j782J324
$$ -73 -1585 257 1192 -641 -1469 807 1259 -907 -864 1128 1188 -983 -765 1484 430 -1352 -28
1320b8J529j498j737K127J084k119r88K199N93k415J9K579l46k499O73K593j300
$$ -28 1501 3 -1734 393 1477 -642 -1630 569 1162 -1253 -1234 1345 999 -1500 -827 1766 466
1337D66k379J798J961k198j487K583R75k674q73K693O66k711k03K894o26k688
$$ 466 -1913 -115 1846 -352 -1839 744 1719 -955 -1828 865 1531 -1180 -1383 1511 885 -1803
1353a803R84K653j499k076J724J686k173j277K183J051k254p75K709O09l046J07
$$ -1803 -819 1834 335 -1741 -17 1669 -504 -1781 402 1453 -801 -1576 1133 1742 -1304 -1197
1369a197K763q31k537J349K367j491k550K144K073k634j100K482O66k518p23K838
$$ -1197 1566 735 -1802 -453 1914 423 -2127 17 2090 -544 -1644 838 1504 -1014 -1737 1101
1385A101K57k837J87K781n39k937J279K921k138k358K350K051k647j382K782R48
$$ 1101 1358 -1479 -1292 1489 950 -1987 -708 2213 75 -2283 67 2118 -529 -1911 871 1819
1401A819k852m05K961m3k852L20K873q38k941J657K506k208k634K923J818k724
$$ 1819 -1033 -1438 1523 1480 -1372 -1052 1821 983 -1958 -301 2205 -3 -2637 286 2104 -620
1417f20j381K907R05k996m54L154l23k949O57K967j073k970J754K753k088k587
$$ -620 -2001 906 1811 -1185 -1639 1515 1192 -1757 -1100 1867 794 -2176 -422 2331 243 -2344
1433b344K569K033k903j712L457R93l375m76L336m34l030J032K930j656k557J966
$$ -2344 225 2258 -645 -2357 1100 2093 -1282 -1758 1578 1144 -1886 -854 2076 420 -2137 -171
1449a71K511k358j913K641J369k720j460L293N98l432J04L141j68l499J044L144
$$ -171 2340 -18 -1931 710 2079 -641 -2101 1192 1790 -1642 -1538 1603 1435 -2064 -1020 2124
1465B124j383l022K273K094k190j990K453J644k853q39K987P50l367k07L213n12
$$ 2124 741 -2281 -8 2086 -104 -2094 359 2003 -850 -1689 1298 2048 -1319 -1526 1687 1175
1481A175k922R71K845j573k857K148K548k399k081L031J075l101o23L351r1l391
$$ 1175 -1747 -776 2069 496 -2361 -213 2335 -64 -2145 886 1961 -1140 -1763 1588 1497 -1894
1497a894N93L444j165k882J013K925j638k622K061K580k623k107L069J691l615
$$ -1894 -1301 2143 978 -1904 -891 2034 396 -2226 -165 2415 -208 -2315 754 2445 -1170
1512a170p71L614K85m048R16L210j549k586J633K426j874k286K129J950k361j732
$$ -1170 -1941 1673 1958 -2090 -1174 2036 487 -2099 -466 1960 86 -2200 -71 1879 -482 -2214
1528b214K945J379l148j217L726L2l168O71L122j242l097J872K426j980k173K407
$$ -2214 731 2110 -1038 -2255 1471 1503 -1665 -994 2128 886 -2211 -339 2087 107 -2066 341
1544C41J524k600j234K718Q88k815n20K973K13l243O36L354j459k840J820K429
$$ 341 1865 -735 -1969 749 1637 -1178 -1698 1275 1488 -1755 -1119 2235 776 -2064 -244 2185
1560B185k243k056K718J371k712r26K757O48k943j47L127n73k830Q61K421r96
$$ 2185 -58 -2114 604 1975 -737 -1663 1094 1742 -1201 -1348 1779 1206 -1624 -763 1658 662
1576F62k624J857J959j597k316K556J788l001j174K831K23k358n4L061o38l047
$$ 662 -1962 -105 1854 257 -2059 497 2285 -716 -1890 941 1164 -1194 -1248 1813 1175 -1872
1592a872J199K403j296k277J706K141k363j623K392J440k401j264L138L04k860
$$ -1872 -673 1730 434 -1843 -137 2004 -359 -1982 410 1850 -551 -1815 1323 1627 -1233
1607a233Q9K714n55k479Q03K307j204k379J847J876k136j255K169J094k559p39
$$ -1233 -1144 1570 1015 -1464 -661 1646 442 -1937 -90 1786 -350 -1605 564 1658 -901 -1640
1623a640K849J68k845K88K696n57k554R65K044j106k290K206J494k169q98J918
$$ -1640 1209 1377 -1468 -1180 1516 959 -1595 -630 1414 308 -1982 224 1718 -451 -1349 569
1639E69O75k125m99K347K23k270J5K362o55k307R57K584j603j948J660J398j652
$$ 569 1244 -881 -1380 967 1190 -1080 -1065 1297 642 -1665 -708 1876 273 -1675 -15 1383 -269
1656b69j299K150O85k095j59K142m47j861K34K114n61k041J183J514j246j466
$$ -269 -1568 582 1267 -828 -987 1155 708 -1153 -919 1195 634 -1407 -224 1290 44 -1422
1672a422J472J434j752r12K037J70j790k51J779l2j710L09J926p40j933R00J826
$$ -1422 50 1484 -268 -1180 857 1027 -763 -1014 765 733 -977 -668 1258 518 -1415 -515 1311
1689A311j185j520J770Q30j562r99J935L31j670j99J683K4j812M14J812n08j518
$$ 1311 126 -1394 376 1206 -356 -1355 580 911 -759 -958 725 749 -1063 -649 1163 655 -863
1706h63Q73J017j246o96Q86J249j720l44J326K59j650K38J202K09j923Q25J307
$$ -863 10 1027 -219 -915 -29 1220 -500 -844 482 741 -909 -671 531 740 -1183 -358 949
1723I49q99q17O61J445j448q34R72P13j239l06J472m7j073K9J027nj403O22J197
$$ 949 50 -767 -106 1339 -109 -943 29 742 -497 -803 669 622 -451 -422 605 600 -803 -181 1016
1742A016r12j247Q05J184r86m78O20Q01j153m70J339N7j211N97O35P2j676P73
$$ 1016 104 -1143 -338 846 -140 -618 2 803 -350 -820 519 576 -635 -38 597 669 -1007 -234
1760b34J075o68r93P35R18r52n23N96N64r89j9J005K40j085K17O12m19p84L64
$$ -234 841 173 -820 -85 833 -119 -642 -46 518 -471 -490 515 755 -330 -113 499 80 -704 -340
1779c40Q31l84o08M88N98n38n76N90N56j002l40J198j63q49J67O00k70n64L93
$$ -340 491 107 -501 -13 585 47 -529 61 617 -385 -725 473 310 -539 -372 228 -42 -606 -213
1798b13O44m37o24Q29K15n59o34J057J9n31m0O16m7n81J80O36k63o63K06N93m48
$$ -213 431 -6 -630 199 414 -145 -779 278 297 -234 -274 342 295 -286 -106 530 267 -396 -190 403 -45
1819d5n10P48K47o55j38Q05J19n57k89P16m90l48M11M37j96l58j34O01m64j34
$$ -45 -555 193 440 -215 -353 452 571 14 -275 441 -49 -397 14 451 255 -103 -237 364 -100 -234
1839b34N45l4n29j40N74K63o34L23K77j76n98L54L68k37k79K91o3k02L7J64K52
$$ -234 311 277 -252 -392 182 445 -189 134 411 235 -363 -9 359 122 -157 134 71 -131 -94 70 322
1860C22l33m54O12j13j62N0J28N8j94LL65k31k37J22K75J8n24L13J90l13n9K35
$$ 322 -11 -465 147 34 -128 -78 50 108 -86 -83 282 51 -186 -64 211 229 -295 18 208 -105 -164 71
1882G1q9p6j10N21l65j05R8J78l9l17L36O7On6k26L59l49MM51k41l56J5k2M35
$$ 71 -18 -94 -204 317 -48 -153 -55 123 84 -233 103 170 176 120 -106 253 -96 -92 359 118 -238 -223 -245 190
1906A90j78j05L81k0m27O2K30k03o4j57N13k87j65L22k39q1L15J23R5k12j52j1
$$ 190 12 -93 288 268 -159 -97 133 -70 -134 -291 222 -65 -230 92 -147 -228 87 210 305 93 -59 -70
1928g0J29l48Q2L46m22K45M7Rj16K71j36P6j28J2P0Q9l44J46K20J25m75K86j15
$$ -70 59 -289 -207 139 -283 -38 9 18 -98 173 37 113 -15 -3 67 156 -188 -42 178 303 -172 114 -1
1951ak56k19N04p4Lj32M00k64j09J57k33K64K51m25J3L81m0j11j93L50l28Q3M28
$$ -1 -257 -476 28 -46 -43 -175 225 -39 -148 9 -224 40 291 -134 -121 260 220 109 -84 266 -62 21 449
1974D49l81q9J8K0O0k31O3N1r1K07k64O8K13j30K65j86j44L7q9J05L0J39l82K65
$$ 449 68 -21 -3 17 77 -154 -91 -40 -131 76 -188 -120 93 -37 228 42 -102 -65 -154 -49 -19 120 -262 3
1998Ck25L29n2m15M80R0k57j94L55l62L24J00kk62K16j21l8q6J42J37j48J55l33
$$ 3 -222 107 55 -360 120 210 -47 -241 114 -248 76 176 174 -88 128 7 -31 -117 25 162 14 169 -164
2021a64K73K98j90k94J68l03P6J67N6j92r7M38j29k45J05J0q3L54k56N0O3j76
$$ -164 109 407 217 -77 91 -212 -136 31 87 -105 -202 236 107 -138 -33 -23 -106 248 -8 42 105 -71
2043g1K34k58L09K1l20M2J77m02L59r6k4o6J96p3J4K59k84l16N63l34P6j31J20
$$ -71 163 -95 214 235 -85 -43 134 -268 91 -5 -29 -95 101 28 42 301 17 -299 264 -70 6 -125 -5
2066eJ52J10m37R3K20L0l3l09K94j65j43L14J83l78P3J9k40K06J48j90q7K98P0
$$ -5 147 257 -180 -87 133 163 130 -179 115 -50 -193 121 304 -74 -1 18 -222 -16 132 -58 -145 153 223
2089B23l11k5R7J64l49K54j09J12O4O1K45m32K3p5J2J10M7r3K6j08j11J53K21
$$ 223 -88 -113 -16 148 -201 53 -56 56 120 181 426 -6 17 -58 -46 64 111 18 44 -64 -175 -22 199
2112A99k73O4K35k69j7M33k27j25J57q8l10J94O3k57L27k0O7k16N1J88j4k11j10
$$ 199 -74 -10 225 -44 -61 372 145 20 177 89 -221 -27 36 -221 106 86 153 -63 -12 176 162 -49 -159
2135a59K32Rr0j1K62J77p61o0O37K7k78P8K06p12L25M20j68ql49K00J15j43p3
$$ -159 73 82 -8 -19 243 420 -341 -401 236 263 -15 63 269 -443 -118 302 134 126 -223 -23 92 -51 -124
2158a24k0L30K8m99K67J25j04M1R2j81j0o5J49l03L89q5K04l75O2K1M23m08n2
$$ -124 -144 186 214 -285 -18 107 3 44 136 -45 -55 -120 29 -274 115 30 234 -141 -79 -58 365 -43 -95
2181i5J92k88N5K59lj49J9r1L8M59o09K99Q0m04J6N60l82j58J61nQ5j43J82L6
$$ -95 97 -191 -136 123 120 -29 -10 -101 -63 396 -213 86 166 -238 -222 338 -44 -202 -41 -46 39 -104 78 114
2205A14j5K8j29M2j29k01O20j00m12L34Rnk95m3L20l99J87q6N49m65q3Q8K27k96
$$ 114 99 127 -2 40 -89 -290 330 230 -182 152 161 156 -139 -182 138 -261 -74 -160 389 -76 -159 -71 156 -140
2229a40L88l22J19j68K18l5q0l19K81K81k23k56L68j29l0j23K00R9O0p8l18L50
$$ -140 248 -74 45 -123 95 60 -20 -339 -58 223 0 -256 112 -17 -47 -170 30 129 189 111 -207 143
2251A43r5%O1N0l98J42l2rK61m40L82M9QJ63M5m17k1M33k71q7L11k44K05k59j16
$$ 143 48 48 109 159 -239 -97 -129 -138 123 -317 65 114 122 285 330 -87 -108 325 54 -33 278 34 239 -20 -136
2276a36K75n15N27l08K47k2j53o2K63k8k59R7P8j43J6J45l8l0K20m9k17j44R7
$$ -136 139 -376 151 -157 90 68 -85 -147 116 88 -171 -74 4 -139 -123 22 -16 -46 174 125 -92 -236 -139
2299a39K48m0o6K08k10k06p3M06O5m36J32L9K43l7k34K88k37q7Q0K69o5k32K09
$$ -139 109 69 3 211 1 -205 -278 128 193 -243 -111 -72 171 134 -100 188 -49 -136 -56 213 148 -84 125
2322A25j52J51l37K13J67m38L11l40L25j69J99L2P2k99L50m3j27Lj7J78l90k15
$$ 125 -27 124 -213 0 167 -271 40 -300 25 -144 55 87 159 -140 210 167 40 43 26 204 -186 -401
2344d01L46j50J64J31j65pK13j64L5q6j30K89Q0l07j68K27M6k39J40L94k75n4
$$ -401 -55 -205 -41 90 -75 -82 131 -33 2 -84 -214 75 155 -152 -320 -93 -47 -286 -146 248 -27 -81
2366h1m5K64q9q6j50L07j94P1K70N6m54k4L57j18k04M1J23o9j53K13j89J06o4
$$ -81 -126 138 49 -37 -187 120 -74 -3 267 323 -131 -155 202 84 -120 -79 44 -25 -178 35 -154 -48 -112
2389a12J79p7j43L3K5K76k08j69L63p1N5k22q7L99m2p5M4q5k42M37m20k9Q7K19
$$ -112 67 -10 -153 -120 -95 181 -27 -196 167 96 151 -71 -158 241 199 124 168 83 -159 278 -142 -171 -84 135
2413A35k40J58j47L14j95j44K40j29K26l65N9K55j04j80J75J78k23j57M0Q3m3
$$ 135 -105 53 -94 220 25 -119 121 -8 218 -147 -88 167 63 -117 58 236 13 -144 -104 -21 -64
2434f4M30q6n69M00j38M4q9K22n5l9L4k96K09j55K5J27j46Q1o1l3J65q2J53k10
$$ -64 366 280 -289 111 -27 17 -72 150 95 56 90 -206 3 -152 -127 0 -146 -65 -126 -159 6 -76 77 -133
2458a33J3K36j26k05L10j6p0k13L79M2j34K7j5k42K58j10o7J17k40J98j19J71
$$ -133 -120 116 -10 -215 95 79 9 -204 175 217 83 110 95 -147 111 1 -66 51 -189 9 -110 61
2480F1q3K70j28j39J30O5j72j32K15k06K32L4k37J98J21k22K07K32n68N9L19j12
$$ 61 -22 248 120 -19 111 176 4 -128 87 -119 113 147 -90 108 229 7 214 446 -122 -63 256 144
2502A44Pq7J54m56K39k81Q6r3N42l02K1P2J82k69K46j10k17m2J45k54K33J19k38
$$ 144 151 64 218 -238 1 -280 -194 -287 255 -47 -26 46 228 -41 205 95 -122 -164 -19 -273 -40 79 -159
2525a59L76k97L8j36J37J26q9j38P9K53m46J62J86j9o4R7j16j22R9m2O8J41k06
$$ -159 217 -80 -42 -178 -41 85 -4 -142 -63 190 -256 -94 92 73 9 106 -10 -132 -33 -75 -7 134 -72
2548g2K20p0Q0l42O6K32m13K57K49q3j19n4J40k34K64j73J13k8K08j48J71j53
$$ -72 148 78 158 -184 -118 114 -299 -42 207 124 5 -49 91 -143 121 -52 61 33 241 93 264 111
2570A11j57K7M3o1j95Q6K81j64K81j74Q7k78J06k3k11J85r1K09n4m8m10K13J94
$$ 111 -46 -19 24 -37 -232 -146 135 -29 252 78 165 -113 -7 -30 -241 -56 -147 62 8 -40 -450 -237 -43
2593d3L09m6j65k20K09j8J93k79r7JM0J35k84M26j40q4J02j75K79j80N5p5p8l36
$$ -43 266 220 55 -165 44 26 219 -60 -157 -156 -116 19 -265 161 21 -63 39 -136 143 -37 18 -57 -135 -471
2617d71O35j64K48j89P3k2k93M69m98K8J41J9J63k06J97j6k60M66k62L4J30k31
$$ -471 164 0 248 59 132 110 -183 286 -212 -184 -43 -24 139 -67 130 114 -146 320 58 92 222 -9
2639ik38K84J96k78J01J08l76J22L2j23J85n9J11m1M9j72J1O8m0K63l83K29K2
$$ -9 -247 37 233 -45 56 164 -212 -90 -58 -181 4 -55 56 15 64 -108 -97 -29 -69 194 -189 40 62
2662F2L7Q4r4k69L31r3Kr5j12L19j67J77l60L95k54M8K06m66j85L02J51j7j8n5
$$ 62 99 183 89 -180 151 58 60 -35 -147 172 5 182 -178 217 -37 11 217 -249 -434 -132 19 2 -16 -71
2686g1P9m6K21K6k94o3k2J70J19n20K68L76j85j46j19L77j91p8J78J22j02n85
$$ -71 8 -38 183 209 -85 -148 -170 0 119 -401 -133 243 58 -88 -207 170 -21 -99 79 201 99 -486
2708d86K81M91m57n4L49Kj79l45L91l1j05R1j4o4J61J76j1j95k49M33L03m45j18
$$ -486 -205 286 -171 -225 124 126 -53 -398 -7 -38 -143 -52 -66 -130 31 207 196 1 -248 185 488 43 -75
2731g5R8K20l14Q8k8m2j20J59K91m54J6M03o1r8k13K27J66n32J64M40k00k49K21
$$ -75 23 243 -71 17 -11 -53 -173 -14 277 -177 -161 242 181 83 -130 97 263 -269 -105 335 135 -114 107
2754A07K27j89j55n6K10k94p4M80o1m04L16J8j74Rj27L60J11n31J79L04j17k78
$$ 107 334 145 -10 -66 144 -150 -224 256 195 -209 107 125 -49 -40 -167 193 304 -227 -48 256 139 -139
2776a39n8K42r2k65L98P6m83K02J98N8L0j25K61k47J7Jj13k8Q8k28N83m51k03
$$ -139 -197 45 -47 -312 86 162 -321 -119 79 137 167 42 303 56 73 74 -39 -67 21 -207 376 -75 -278
2799b78L88o4o1O9K19J00n27K82j54J61l44J15L86l20l15L4O10k08j92N0L51n74
$$ -278 110 46 -15 54 273 373 -154 128 -26 135 -209 -94 292 -28 -343 -309 301 93 -99 -49 302 -272
2821b72o3M49J24m52P4J38L5k07rL54l17o4K39L04m45RL31j80q3rK08J64p30M13
$$ -272 -335 114 238 -214 -140 -2 33 -174 -183 171 -146 -210 29 333 -112 -103 228 48 -35 -44 164 328 -402 11
2845A1%J55j80j22L29j67m77N10Q1j41m02O02k37l53O31Q0k27m28K50M77l15l89
$$ 11 11 166 -14 -136 193 26 -451 59 140 -1 -403 199 -38 -391 240 320 93 -335 -85 392 77 -312
2867c12P9L25l60J15J73J24l69KL43L10n56j7K99j66k27J21M51k84l76J13N56
$$ -312 -233 92 -268 -153 20 144 -225 -223 120 430 -126 -143 156 -10 -237 -116 335 51 -325 -212 344
2888C44m64l28J60O13p83M10K87j70k05k05P20n32p5o0N29m5m41L53K95k62m49
$$ 344 -120 -448 -288 325 -458 -48 239 69 -136 -341 379 -153 -228 -288 241 196 -245 108 403 141 -308
2909c08M84M6k25p8Q2J33m79N8O23m07j14N4K58j97L6q1M17l06j11K68K69o92
$$ -308 176 222 -3 -81 1 134 -345 -287 336 -71 -185 -131 127 -70 -34 -115 302 -4 -115 153 422 -270
2931b70K05K70j01k65K0M19K04p82K23M79k86n56K78M56m31K1L17o7l83J66K92
$$ -270 -65 205 104 -161 -141 278 482 -300 -77 402 116 -440 -162 294 -137 -116 201 134 -249 -83 209
2952B09k33m44N99J13m38l3q8N48K2q34N96P8o6k94O77k52k63j79M30r4l28K90
$$ 209 -24 -468 131 244 -194 -227 -315 233 255 -579 17 95 29 -265 412 160 -103 -282 148 54 -274 16
2974A6L46n16k71M50K22j83j29K57j92n7l27N93N5l04l67N08q2j26p5N13k78l19
$$ 16 362 -154 -425 25 247 64 -65 192 0 -57 -384 209 264 -40 -407 101 19 -107 -182 331 53 -266
2996b66L56R0k95j58N13J1m92O6K00J57k54j20M00P8m90j5L61J03n11J90M18l47
$$ -266 90 180 -115 -273 240 251 -241 -175 25 182 -72 -192 208 286 -204 -219 142 245 -266 -76 342 -5
3018ek40M60n4k35j86L01O4q7j4J97k16r1M3M51k81m18K68N68o30l17N61L54o11
$$ -5 -245 215 161 -74 -260 41 105 18 4 201 -15 -106 -63 388 107 -311 -43 525 -105 -422 139 493 -118
3041a18oO9R8l92L03L47k71l00J36M45m16j72L89j3k34J10K68k4l32j61J73K99
$$ -118 -124 -55 43 -349 -46 301 30 -270 -134 311 -105 -277 112 99 -135 -25 243 219 -113 -274 -101 198
3063A98l84p1M08q0l62J51j26K83k01K2L14j11k07J30P5Nq7J05j34o3J09K91l69
$$ 198 -186 -257 151 71 -291 -140 -266 17 -184 -162 152 41 -166 -36 39 44 -43 62 -72 -135 -26 265 -104
3086a04L0j9J17kP2m6j6l53J62K79k0r0k84M62Q9m12N7K69k12L9J08J37j31l50
$$ -104 -74 -93 24 22 94 48 32 -321 -159 120 100 10 -274 188 277 -135 -78 191 -21 18 126 263 132 -218
3110b18K10L96l39n02L53K1k6n5N25k73n14O86j28L2m18J16K04K30m08J90O2j07
$$ -218 -8 388 49 -453 -100 -79 -105 -160 365 92 -422 264 136 168 -250 -134 70 300 -108 82 144 37
3132C7k26J33L48l16p3K72n6k56M8J23j87k2K00P8j60j22K05L13l07k9K8k74j8
$$ 37 -189 -56 292 -24 -97 175 119 -137 -89 34 -153 -175 25 103 -57 -179 26 339 32 3 31 -243 -261
3155b61P5O04k08q3l47L03j55j74N22r0k14J21o3J81k85j8M21j52k64j41J53J46
$$ -261 -186 418 210 127 -220 83 -72 -246 276 186 -28 93 30 211 -74 -92 329 177 -87 -228 -75 71
3177G1l83K98J22q2j65L24O6m42K12k2K4J00l02K86J3k38L77J15l69l01M00J26
$$ 71 -312 -14 108 26 -139 185 251 -191 21 -1 23 123 -179 107 120 -118 259 374 5 -296 104 230
3199B30l87RM46l84M7l8J17N9q1J35j1k56J48j50K04j2m21O55j70L1l10Q1K27
$$ 230 -157 -148 298 -86 -39 -77 40 99 18 153 142 -114 34 -116 88 76 -345 310 140 171 -139 -58 169
3222A69j35k02L00M3k99J11J58j23n21N16L6l82K59J05j36J73m5N7QN2k97Q0M08
$$ 169 34 -168 132 175 -124 -13 145 22 -499 17 53 -329 -70 35 -101 72 27 84 92 144 -153 -73 335
3245C35m32K8K24j3l68N3J03J13J02k80J31j01j70K79J88k62l4K54k58j38K23
$$ 335 -97 -69 155 142 -226 -173 -70 43 145 -135 -4 -105 -275 4 192 -70 -104 150 -108 -246 -23
3266b3K37K9j60j10J37pj51N7P8p7k1P1K1l23J41J57J27p0qj66K12k70k6M61k53
$$ -23 214 243 83 -27 110 103 -48 9 87 10 -11 60 81 -242 -101 56 183 113 105 -61 151 -119 -145 316 63
3291F3k35j6K21j66K19j25R9K4l41L02n3Q1j47J70l44j5M50J7k41K05K2j64J5
$$ 63 -172 -188 33 -133 86 -39 60 84 -257 45 -8 73 -74 96 -248 -263 187 204 -37 168 190 26 41
3314D1j9Q7k01J53r1k43J33J26oJ48r8K43k77j6J19j84K80n8J09k01j05K23j58
$$ 41 22 109 -92 61 -30 -273 -140 -14 -20 128 30 273 -4 -20 99 -85 195 137 246 45 -60 163 5
3337Ek33K61O8j97j30N29l15P9k38M5k3M5K06j66Ll3k8J79r4J9j81R2J18k61K60
$$ 5 -228 33 101 -96 -226 303 -12 67 -171 -126 -149 -104 102 -64 -61 -94 -122 57 -37 -18 -199 -107 11 -250 10
3362A0j36K88k44J79j33p5J37j3q6J20J67k03Q7j27J28j33m8K11m1J22l25K57
$$ 10 -126 162 -82 97 -36 -111 26 13 -73 47 214 11 98 -29 99 -34 -82 129 88 210 -115 142
3384A42k07P2j44j99K99P4m6k82L06l3l7L72k11j19l4J49j68j16L81j20n1J7j0
$$ 142 -65 7 -137 -336 -37 37 -9 -291 15 -18 -55 317 106 -13 -47 102 -66 -182 199 79 28 45 35
3407C5j97K0L15p0j45J27R1l12J44M9j5K22o04K3K09M8R1P8j32r2o9M2m2J44M59
$$ 35 -162 -142 173 103 -42 85 176 -136 8 57 42 264 -340 -317 -108 -60 31 109 -23 -115 -184 -142 -184 -40 419
3432D19n17Q6k42L48j92l4k18K06j07J29J1J95L7L3j98j49L83l11l5Q5J57n4o3
$$ 419 -98 -12 -254 94 -98 -132 -350 -144 -251 -122 -111 84 121 154 -44 -193 190 -121 -156 -71 86 32 -31
3455c1o6J15l21K89k29L28j61L5k86L78l6j99K37j52K57l04J45o2J08o6M2p3P
$$ -31 -97 18 -303 -14 -243 85 -76 -41 -327 51 15 -184 53 -99 158 -146 -1 -63 45 -21 21 -52 -45
3478d5K46j91J29m3O6K5m05j4L82j43k8q5R7m6J8p8K01k0J28j73j20J4J23j01
$$ -45 201 10 139 96 162 187 -218 -232 150 7 -21 -106 -9 -55 -37 -115 86 66 194 21 -99 -85 38 -63
3502f3J67Nj45M8j11L9N3k0M4j9P4J33j26K01r2r6l12K72Q0k01o3RJ60J73k14
$$ -63 104 109 -36 12 -99 -60 -7 -27 17 -2 72 205 79 280 188 92 -220 52 132 -69 -132 -123 37 210 -4
3527dK81k49j26j0p4p2L82k15R1J64j15j51j41J24O3J40k03K09j17J3r3Q4J67
$$ -4 277 28 -98 -108 -182 -254 128 -87 4 168 53 -98 -239 -115 -52 88 -115 94 -23 -10 -103 -19 148
3550A48M0J71k59j0k23L72l03J8J13J38k00J53p0j9J4q2L76j82j74K3P9l62J87
$$ 148 188 359 100 90 -133 239 -64 -46 67 205 5 158 88 69 83 1 377 195 21 44 123 -239 -52
3573e2J8K1J30k90J47n9J55p2l33M21j59r1K39j14J39j90J31p2J12J7k49n0L54
$$ -52 -34 -13 117 -173 -26 -85 70 -2 -335 86 -73 -164 75 -39 100 -90 41 -31 81 98 -151 -201 153
3596A53o6RM2k08J11r1J42j90J48q2K63j34R6k78j21K54Qk74l2K76m0J25j69j10
$$ 153 87 96 138 -70 41 -50 92 -98 50 -32 231 97 193 -85 -206 48 56 -218 -250 26 -14 111 -58 -168
3620a68J59J16m5Q8J29k73M7j30K18p2j95L12k04R6L1o9j41R9j58L15k00j23K13
$$ -168 -9 107 62 150 279 6 53 -77 141 69 -126 186 -18 78 109 40 -101 -2 -160 155 -45 -168 45
3643D5j22j95J01J71M9N0j52m5o6J42J3r3k3j4M49j88o9K26k66l47L04n5J04k11
$$ 45 -77 -272 -171 0 49 99 -53 -98 -164 -22 -9 -102 -125 -139 310 122 53 279 13 -334 -30 -85 19 -192
3667a92M8J80k41K19p5L29k69J92K2k54J33k14J60k9K29n6j07j4J4j87r5J67K17
$$ -192 -144 36 -205 14 -61 268 -1 191 213 -41 92 -122 38 9 238 182 75 61 75 -112 -207 -40 177
3690A77j09J06k79K92j98j74J37r0J66k5j01N7M3K31l74J19RJ31k94K91p4j12
$$ 177 68 174 -105 187 -11 -185 -48 -138 28 3 -98 -41 2 233 -141 -22 -13 118 -176 115 41 -71
3712g1j5J03%J31m97M47O8l20J63L9Q0l37J65j5n3K44j85K92r9n01L67N2j72K03
$$ -71 -86 17 17 148 -349 98 166 -154 9 48 128 -209 -44 -59 -112 132 -53 239 140 -361 6 58 -114 89
3736H9j06O5J86k67K11K33m61K3l1J90k88J83m9J51R4j58n7Rk49K94j4K07n6j97
$$ 89 -17 48 234 -33 178 411 -50 -27 -58 132 -156 27 -22 129 223 65 8 17 -232 62 48 255 199 2
3760BK44n09J64K00k01O5j28k55O59m45j3K21k3L8r1l2m9J39l61M23J7m2k02K14
$$ 2 246 -263 -99 101 -100 -35 -163 -418 241 -204 -217 4 -19 19 -72 -104 -153 -14 -375 48 65 23 -179 35
3784C5N0j50K1J6K53k29j0r6J27Q5k74N10n32J87J50j83J13L7j61q9K09j76K19
$$ 35 85 -65 -44 -28 225 -4 -14 -110 17 102 -172 338 -194 -7 143 -40 73 110 -51 -140 69 -107 112
3807A12n0J2M6k71J95j99K15J17j12j48%J76L3k97L48j46k89N31m04J92j21j04
$$ 112 62 74 120 -151 44 -155 60 177 65 -83 -83 93 126 -171 177 31 -258 273 -131 61 -60 -164
3829a64P3K61j16l36M97j96j61K79m40J84L44k05J7P2j65J14o0k10Q0L0K50J3
$$ -164 -91 170 54 -282 215 19 -142 137 -303 -119 225 20 37 109 -56 58 -2 -212 -132 -102 148 161
3851A61l7K6p7j08n3P6l8j43K52M2l13J88N7R1J7l01q4K54q2Q3Q2k25K22nj45
$$ 161 124 150 73 -35 -88 -12 -50 -193 59 101 -212 -24 33 124 141 -160 -244 10 -72 11 93 -132 90 85 -60
3876f0l3J36j87l6j39l9M31k0j04jk26J21K63j45k43M34j01n0J29qp4M2k13K62
$$ -60 -93 43 -144 -180 -319 -358 73 53 -51 -52 -278 -157 106 -39 -282 152 51 1 130 122 48 90 -123 139
3900A39R5k33j13j89M30k4j97K04k96J00K63j10l26M68k00r7J96m2j09n6RK0p
$$ 139 234 1 -112 -301 129 105 -92 112 -184 -84 179 69 -257 211 11 -86 110 68 -41 -97 -88 -68 -75
3923g5O3J70l23J81k2J38j63j58k7K73j09J74k42R8J57q9j74K80l04K05r4K4l8
$$ -75 -12 158 -165 16 -6 132 -31 -189 -216 57 -52 122 -120 -22 135 46 -128 152 -152 53 -41 -17 -55
3946e5o5L9P0J02mk11O1k5P8o9L08k8k20j08N1OpJ82l83M47k78K51k36K8K70k14
$$ -55 -120 -81 -11 91 87 -124 -63 -88 -10 -79 229 201 -19 -127 -76 -70 -77 105 -278 169 -109 142 -94 -66 204 -10
3972a0k18L79j1k37K59j89kk36K67q5J22j13j37J07J42j1o5J45q3k13K83r2M9
$$ -10 -228 151 140 -97 162 -27 -29 -265 2 -83 39 -74 -211 -104 38 27 -38 107 24 -189 94 2 51
3995E1j8j30J73J4N3j85j75M05j98k0M7l3J96j85k2P0m6M9K7j06N9Lj15j2K84
$$ 51 33 -97 76 90 143 -42 -217 188 -10 -30 17 -16 180 -5 -27 43 -3 46 73 -33 26 29 -86 -98 186
4020A86rj9o9l15K61M5j40n6k3N7J34j66L92k11Q7l3j90J46q5Q1K2q6k19J68j33
$$ 186 177 158 89 -226 35 80 -60 -116 -139 -82 52 -114 278 67 154 121 -69 77 -8 73 95 9 -210 -42 -175
4045a75K71J4k4OJ21k43L47m46J43l6k87K22K12p4k47M8KK25n5j60J8L10j82l9
$$ -175 96 110 86 92 213 -30 317 -129 14 -22 -309 -87 125 51 -196 -148 -146 79 24 -136 -118 192 10 -29
4069b9j00K9k53L04n6oK41l77K64l2k61k4K96q8q5n2L29pq3k44K22j70j79K98
$$ -29 -129 -100 -353 -49 -105 -111 130 -247 17 -15 -276 -300 -4 -92 -177 -229 100 93 10 -234 -12 -182 -361 -63
4093f3j36K40Lk08K67j09m0j03J95j19K9N5j10r9K35k12J57j11Q6K57m11M65j09
$$ -63 -199 41 44 -164 103 -6 -46 -149 46 -73 -44 11 -99 -198 37 -175 -18 -129 -43 214 -197 268 159
4116A59k21MN7p4J47j33M7K08k8k36R5N6k8j74J40k01R2K34l40M84m60N5J10q2
$$ 159 -62 -58 -1 -75 72 -61 -14 194 166 -70 25 81 53 -121 19 -182 -90 144 -196 288 -172 -117 -7 -89
4140h9K22l83J75K17k27r5J53k3k4K79j43J95o66J00M92J24m45K78%q6N9o9O1
$$ -89 133 -250 -75 142 -85 -180 -27 -50 -74 205 62 257 -409 -309 183 307 -138 140 140 54 113 44 105
4163A05r5M6J65J05m64P2qo2K08Q0Pj75M7K8K0k20P9kO6l2J21J3o7N7K0k59j32
$$ 105 10 56 221 326 -138 -66 -74 -136 72 152 159 -16 31 59 79 -141 -62 -64 2 -30 91 104 37 94 114 -145 -277
4190b77L3j7L37k07j35K91K2q3pK36l68J67Q7M6J17o5K18k89jj0j16l8mj7J29
$$ -277 -244 -261 76 -131 -266 25 47 -36 -43 193 -175 -8 79 125 242 177 395 106 105 95 -21 -59 -63 -80 49
4215D9k4k71K14j62L65j94J17k03j73L48j16K23m3P7j31R1l12P5M9R1k49R3k48
$$ 49 25 -246 -32 -194 171 -23 94 -109 -282 66 -50 173 130 207 76 167 -145 -70 -21 70 -179 -86 -334
4238c34M96k16P0j34j03m0K18N48m24k01R0J36k18J24k65L71l37J66L36m19J87
$$ -334 162 -54 16 -118 -221 -261 -43 505 81 -120 -30 106 -112 12 -253 118 -219 -53 283 -136 51
4259E1n1J22j25J43k75R9r8rQ1p4K03j69K52n3m6n7J4J82j38l06K53O6k18L20
$$ 51 0 122 -3 140 -135 -36 -134 -143 -62 -136 67 -102 150 97 51 -6 8 190 52 -254 -1 65 -153 167
4283A67L3k30l1J23o5o6R8L4j44N6R8n6n1j10R9K52O3n03K26J13M5l65L39qj00
$$ 167 200 -30 -61 62 -3 -69 29 63 -81 -25 73 17 -34 -144 -45 207 270 -233 -7 106 151 -214 125 117 17
4308A7j90M79K1m30p4K97k72K41o3n0k8k20N90n77K35J45k27j2M9j85M28k76K76
$$ 17 -173 306 327 -103 -177 120 -152 89 26 -24 -52 -272 318 -259 -24 121 -106 -118 -69 -254 174 -102 174
4331A74r5j12M6n0Q2M46k97m96M33j56o4m1J42J37j40k46L19k69J32R7l6J71j63
$$ 174 79 -33 13 -37 45 491 194 -302 131 -25 -89 -130 12 149 9 -237 82 -187 -55 42 6 177 14
4354A4O4Q1j61q7J52M2k44mN6J84k20QL58k30j0q7K76j95j10l5L13K30m73L22
$$ 14 78 159 -2 -89 63 105 -139 -143 -87 97 -123 -115 243 13 3 -84 192 -3 -113 -148 165 395 -78 244
4378B44j70j99J81n2M9k53J35M16m69l3p4L92k03j31K99l57M44n9j70Q1k89J13
$$ 244 74 -125 56 4 53 -200 -65 351 -118 -151 -225 167 -36 -167 132 -225 219 160 -10 71 -218 -105
4400a05J38K18k49J65j66K94m11p8L83l63N3J05J7j33O4L93m77L16m85M02j6j43
$$ -105 33 251 2 167 1 295 -116 -194 189 -174 -121 -16 1 -132 -68 325 -152 164 -321 81 65 -78
4422g8J48kk32K80k42J56OLJ42O2o50K34K64l2j34J24J77J00m96nM43j65q3Q3
$$ -78 70 68 -164 116 -126 30 36 39 181 243 -407 -173 91 59 -75 49 226 326 -170 -175 268 103 20 103
4446A03j08M8J71j64L30m85n9L78k45J25q1j18N20n16L0K03j09J5j87L09J5m07
$$ 103 -5 43 214 50 380 -105 -164 214 -31 94 13 -105 415 -101 -71 132 23 38 -149 160 175 -232
4468b32K71K4k90L61j29J50r1l96K73K73j52j45J09P2j95OK83L7l91J36J92j63
$$ -232 39 63 -227 134 5 155 64 -332 -59 214 62 -83 26 98 -97 -91 192 229 -162 -26 166 3
4490Cj13J74P9l48R3M55k01n8j69M1K06j17K59j71R7j59k02N2J09n3J73o2k29
$$ 3 -110 64 143 -205 -112 343 142 84 -85 -44 162 45 304 133 230 71 -131 -79 30 -23 150 88 -141
4513a41M9R1K03j14r4K37l46m6R4P7L2j77L33J49m76J08Q6o5r2K37o4l31J19q2
$$ -141 -92 -1 202 88 -6 231 -115 -161 -67 10 42 -135 198 347 -129 -21 65 0 -92 145 81 -250 -131 -213
4537b13K28KM6J4j39K38k79P1K6r0O9k58L95j45j13N05l05Pj42K06o9j28O0L67
$$ -213 15 17 63 77 -62 176 -103 -32 -6 -96 -27 -285 110 -35 -148 357 52 59 -83 123 54 -74 -14 353
4561C53l06j79K69J39k37n2k3J71j50J22j39j0k51K54L31l06J00j18J04l6n7q1
$$ 353 47 -132 137 276 39 -13 -36 135 -15 107 -32 -42 -293 -39 292 -14 86 -32 72 36 -21 -102
4583a02J00k45P5K73N2k20J48k2J13k42K65m0r5j75K66M6j39l56M69K8l50J44
$$ -102 -2 -247 -172 101 153 -67 81 59 172 -70 195 155 60 -115 151 197 58 -298 171 199 -151 -7
4605gM0J88l16O7J04r8l02K74j7P3O7J02Rl14j75L59K0j74J5j5J66m98K27M25
$$ -7 33 221 -95 -28 76 -22 -324 -50 -67 6 73 175 184 -130 -305 54 74 -100 -85 -100 66 -432 -205 220
4629B20k26j17K64j04J02M1j65K1J2j52L07k46J72j79K91m68J32J73j69J97l67
$$ 220 -6 -123 141 37 139 180 15 36 48 -104 203 -43 129 -50 241 -227 -95 78 -91 106 -261
4650b61R2K1K64k11P8j32J15L4J63l58J90J87j36J25k17KK1J17j59L36o1j79j41
$$ -261 -169 -148 116 -95 -17 -149 -34 0 163 -195 -5 182 46 171 -46 -44 -23 94 -65 271 210 31 -110
4673a10J00j39P9oj9o2K2N8R7k49J00J25j76J42lmk3M9k63L82j09N0j60M00j92
$$ -110 -10 -149 -70 -76 -95 -157 -135 -77 20 -229 -129 -4 -180 -38 -41 -45 -68 -19 -282 100 -9 41 -119 281 89
4698H9p3o3J53L6l18L71m67K20r0R6Om1J29oM0k68Q0J48l3J70j3j14m2J40r4j24
$$ 89 16 -47 106 142 -176 195 -272 -52 -142 -46 -40 -81 48 42 82 -186 -106 42 9 179 166 52 10 150 56 -68
4724f8j40K39J57k43o0N5j47N5J53j03J0J57k42M32k49k3J54j51j12K13k66K84
$$ -68 -208 31 188 -55 -115 -60 -207 -152 1 -102 -92 65 -177 255 6 -17 137 -14 -126 87 -179 105
4746A05l7L6j0J5j08j44K02J74k53O4k49J30j2j16L49o9o8j54J43MM8m0k1J34
$$ 105 68 104 94 109 1 -143 59 233 -20 44 -205 -75 -87 -203 146 77 9 -145 -2 2 50 10 -11 123
4770A23j50l6L86m09K68J18j81j05O9j78L76m17K38n8l01K27J8J1R2m3L06k68
$$ 123 -27 -63 323 -86 182 300 119 14 83 -95 281 -136 102 44 -257 -30 -12 -1 91 48 354 86
4792H6k45P9J54j4j74J71k11L41j23j55K82k08OK69n64M38k59oj40J23O5M78l07
$$ 86 -159 -80 74 60 -114 57 -154 187 64 -91 191 -17 -11 258 -306 132 -127 -133 -273 -150 -85 393 86
4815H6k76K8j40M47q7j3M0N7m23L10j58o5j0R7J18l9M0n2Mn7J08Q5J4k83K08K7
$$ 86 -190 -162 -302 145 58 45 85 142 -281 29 -129 -194 -204 -107 11 -28 12 -40 -36 -93 15 100 114 -169 39 66
4841F6m5m1m2n9j19n0K39N6R6k83K80K7j07k72K52rJ10j73K02k98J55j83K14m6
$$ 66 21 -20 -62 -121 -240 -290 -51 5 101 -182 98 125 18 -254 -2 -11 99 -74 128 -170 -15 -198 16 -30
4865c0J03P2j49K3k84K90mko1K85m45R9J46P6j81n2J63K0p5N4O0j76m1K98m1k44
$$ -30 73 145 -4 19 -265 25 21 19 -42 243 -202 -103 43 119 -62 -114 49 69 -6 48 108 -68 -109 189 148 -96
4891i6J72j66J47p4J08l4l0J6J3J35N7k29k01K53j46J23r8j0J40K29j99l30L19
$$ -96 76 -90 57 -17 91 57 27 43 56 191 248 19 -182 71 -75 48 -50 -60 80 309 110 -220 99
4914I9J22j11j15qJ66q5J09l04J54Jl09M22k72J94k13PK10r4r6j49L16J9J5j03
$$ 99 221 110 -5 -13 153 68 177 -127 27 28 -281 141 -131 63 -150 -143 67 -27 -123 -272 44 63 78 -25
4938b5n7J67j59K64l33K73k10o8rK91k07jK2N2L32l25j73P6O7J47j64O4j7k34
$$ -25 -82 85 -74 190 -143 130 -80 -148 -157 134 -73 -74 -52 0 332 7 -166 -90 -23 124 -40 24 7 -227
4962b27K61k31K3K30J55j98p4j4J06l02j6K46j8M04j40k74Q0j01K07j39p1R9K49
$$ -227 34 -197 -174 56 211 13 -61 -75 31 -271 -287 -41 -59 345 205 -69 11 -90 117 -22 -93 6 255
4985B55j39j72J00r7Qp8J20J%Q4j20l6K04j91m1L66j17j72L0k7n8R5L9L4j43J75
$$ 255 116 -56 44 -53 -45 -123 -3 -2 -2 82 -38 -74 130 -61 -102 264 147 -25 5 -22 -80 15 54 88 -55 120
5011A20l26J92k5j11J64J52q6J07j84K22l43Q4k4JK64k61K12j43j47R0k22L42
$$ 120 -206 -14 -39 -150 14 166 80 187 3 225 -118 -34 -58 -57 207 -54 158 15 -132 -42 -264 78
5033G8N1k41j2J41K3R4k2k17J63ok29J33K70n1k76J92j57J18j29J10j46K66k35
$$ 78 129 -112 -124 17 40 134 112 -105 58 52 -177 -44 226 175 -101 91 -66 52 -77 33 -113 153 -82
5056h2J29j40K3q8pN1j2LJ89j01J9j07J6J82K22m75J13J58k07j84M15k97J47J70
$$ -82 47 -93 -70 -158 -165 -114 -126 -123 66 -35 -16 -123 -107 75 297 -178 -65 93 -114 -298 117 -180 -33 137
5080A37l3r9m9Pj75J89j40O6M3N6k17K40j34K45j34L0k48M49k80JqJ33%K1J16
$$ 137 104 5 -44 -37 -212 -23 -163 -97 -54 2 -215 25 -109 136 2 32 -216 233 -47 -46 -54 79 79 100 216
5105B16k96K97j43J40j91O1m3j03L1j07L27j91p5N1J3k21L25j04p6J65k4K14j61
$$ 216 -80 217 74 214 23 84 41 -62 -31 -138 189 -2 -77 -26 -13 -234 91 -13 -89 76 52 266 105
5128A05j23J18j73J45J4j43L5j19L05mk90L67k84o5K48j44j16J36j24J77Q3p6
$$ 105 -18 100 -73 72 86 -57 -22 -141 164 160 -130 237 -47 -112 136 -8 -124 12 -112 65 148 72
5150G2l05M53r1L3J32k06j26P4m14N33p7p8m2J48K14l47m99O96l78K50p9n6J07
$$ 72 -233 220 129 162 294 88 -38 36 -378 155 78 0 -42 106 320 -27 -526 170 -208 42 -37 -93 14
5173A4m6J59k11Q9k38J79k5p4J86P8n6k81K78Q7k99K17j78p8K64j10m2n8K57q0
$$ 14 -32 127 -84 5 -233 -54 -79 -153 33 111 55 -226 52 139 -160 57 -121 -199 65 -45 -87 -145 112 32
5197C2K14l47L2J07p9N3K22k79K34j69M7o2K1l6m1q0K90k54J30r3L70j05j58M4
$$ 32 246 -101 -69 38 -41 12 234 -45 189 20 67 5 26 -10 -51 -131 159 -95 35 -58 312 207 49 93
5221I3n35M39P2J10k17j25l1L69m11Q8o0L52k29J01l22O9L3Q0K8K10mj10j30r3
$$ 93 -442 -3 69 179 -38 -163 -194 175 -236 -148 -208 144 -85 16 -306 -237 -204 -124 -96 114 110 0 -130 -223
5245b23J38r4L70j65Q2q6J03p4r9N6qL0j13L27j89O1k10L3K28J47k11k9k65J29
$$ -223 -85 -179 191 26 108 22 125 51 -48 8 0 30 -83 244 55 116 -94 -61 167 314 103 74 -191 -62
5269f2J2m6K06j01q6J95j0k62J64j34L5K13M1k46L25j39k28L6K57k15K44k51j78
$$ -62 -50 -96 110 9 -77 118 108 -154 10 -124 -89 124 165 -81 244 105 -123 -87 170 -45 199 -52 -230
5292b30M04m41L25K6j28k3L04j81J27k9j64p0J04j6k1J20l7J60k54j86J18J62
$$ -230 174 -267 58 84 -44 -67 237 56 183 154 -10 -80 24 8 -13 107 70 230 -24 -210 -92 70
5314G0l86J82J99k01J12J39R1j85P7k04J06j06K28j07O8L8L8l97J63K9j14J96
$$ 70 -316 -134 65 -136 -24 115 206 21 98 -106 0 -106 122 15 83 121 159 -238 -75 -46 -160 36
5336C6Mn5j63j7L58l0k87L68o8j13P7J25l20L7j58M2K50J0k83P6J02J22k57m9
$$ 36 40 -15 -178 -195 163 133 -154 214 146 33 110 235 -85 -48 -206 -164 86 96 -187 -111 -9 113 -144 -193
5360a93O2K15k90K84l20K00pJ49J09l01L44j58P2o6j02q0J15K4O4n8n5l88K18
$$ -193 -131 84 -206 78 -242 -42 -49 100 209 -92 252 94 166 100 -2 -82 33 57 121 63 8 -380 -162
5383a62J24k66L17j81j20M50n8j30O6J3K17k95J51K3k08K07j78J68k8j27L44m73
$$ -162 -38 -304 13 -168 -288 162 104 -26 40 53 270 -25 126 149 -59 148 -30 138 110 -17 327 -146
5405a46K60j28J07m4o7J49j75q1p7R5k08L48pj35L9O8k65K58KP9K23l10n5K6J71
$$ -146 114 -14 93 49 -18 131 -44 -125 -202 -107 -315 33 26 -109 -70 -2 -267 -9 -7 72 295 -15 -70 -44 127
5430A27m33N04m69L24m3j10P5j21J17m9K12J12k46R3R6R6n40L01O2k09R8Q0j61
$$ 127 -306 198 -271 53 10 -100 -25 -146 -29 -78 134 246 0 93 189 285 -255 46 108 -101 -3 77 -84
5453h4N5k11K47q5K65k10j86n3K6L82j71j79q0K87j69M59k83k6P9J15k4j20lo4
$$ -84 -29 -240 7 -78 187 -23 -209 -262 -236 146 -25 -204 -284 3 -166 293 10 -16 63 178 154 34 31 -33
5477c3P8J39k69l2M4J71j07K69n13J93LJ43m46O87n56L10lKJ70k48P3kr2n2R7
$$ -33 45 184 -85 -117 -73 98 -9 260 -253 -60 -57 86 -360 327 -229 81 78 80 250 2 75 73 -19 -71 26
5502B6J41k58k20N8J05M36k25j39j67K2K16n1J28k55oQ1K0M2l10M14J16l17N0
$$ 26 167 -91 -311 -253 -148 288 63 -76 -243 -221 -5 -56 72 -183 -189 -108 -88 -46 -356 58 174 -143 -93
5525i3j00K77Kp1j26P3K02l83J5J60O0J20l4J42k18j36R1k16N92l82K93m22J84
$$ -93 -193 84 86 15 -111 -38 164 -219 -204 -44 16 136 102 244 26 -110 -19 -235 357 -25 268 -154 30
5548C0j61J73J91k52o8P7l2J33k73N00l48K42r5k0Q4M8j81J51j55P6R9k96K60
$$ 30 -131 42 233 -19 -87 -10 -42 91 -182 318 -30 212 117 97 181 229 48 199 44 120 219 -77 183
5571A83p6k04J41j99J32Q9L6o2p0J25k48K59k1R5k2j87j17L4K23o9P6j10J2M3
$$ 183 107 -97 44 -155 -23 66 102 40 -30 95 -153 106 85 180 158 -29 -146 -112 111 42 118 8 20 63
5595F3k23K55k62K14q9O5J2j71J82J49k00j51K30L0j18K37q5n7l36J81OO9jJ49
$$ 63 -160 95 -167 47 -42 23 35 -136 46 195 -5 -156 74 104 -14 223 138 81 -255 -74 -68 1 0 149
5619A49l35R9q8K28p8k0q4K20j53K55l13M0J36p9%R5Q8l68J20K17j3k73R6K%m0
$$ 149 -186 -87 -175 53 -25 -45 -129 91 -62 193 -120 -80 56 -23 -23 72 160 -208 -88 129 116 -157 -61 -59 -59 -99
5645i9L88o6k95J84k9n0j80j14K84m3l0P6L9k60N8L01j66J09JJ7l41J91K53j75
$$ -99 289 223 -72 112 83 33 -147 -261 23 -20 -50 26 65 -195 -137 164 -2 107 108 125 -216 -25 228 53
5669E3k02K37P9j13m1m1M4J39m76K93K37m4k43K70l40L0P7J63p8J20k85L24rj66
$$ 53 -149 88 167 54 13 -28 16 155 -321 -28 209 165 -78 192 -148 -118 -41 122 44 164 -121 203 194 28
5693B8k7j04O4K36k92K94o8k23J56L3p3j58M09l92J81k56L22l83J18n7M65k7m93
$$ 28 1 -103 -39 197 -95 199 131 -92 64 97 24 -134 275 -117 64 -192 130 -253 -135 -192 273 246 -247
5716b47K03P3M4j32J38k81j32J95J33o8p4J32K29l54K4J16J43k48J22J29k3O8
$$ -247 -44 29 73 -59 79 -202 -334 -139 -6 -74 -148 -16 213 -141 -117 -1 142 -106 16 145 122 190
5738A90l9m0K3l36K32K44q1l34K43j61n4Pj45L02K9k65J25J07j96J34j5L59l59
$$ 190 151 111 134 -202 30 274 193 -141 102 -59 -113 -106 -251 51 80 -185 -60 47 -149 -15 -30 329 -30
5761c0J56J49l60J70q9k58K43j48J00K00k52L6R5J7K8o4n1nQ3J4k53L55m02R8
$$ -30 126 275 -85 85 -4 -262 -19 -167 -67 133 -119 -83 12 29 57 -7 -58 -63 20 34 -219 136 -266 -168
5785a68M45k46m8RJ14K2l93L29j91k6J02j88K43k67Q5L12K05l41J66Ro5j91J00
$$ -168 277 31 -17 -8 106 128 -265 64 -127 -153 -51 -239 4 -263 -178 134 339 -2 164 173 108 -83 17
5808A7m2k2l7J00j49P4j64N28m61J51k03M01r9j04J67P1j87m4K23M6m13NnK26
$$ 17 -25 -47 -84 16 -133 -59 -223 305 -156 -5 -208 193 94 -10 157 228 41 -3 220 266 -147 -142 -147 79
5832G9k03M3K18M6k28j91L07Q0q8q2K32j44j16K14q1k72K92K9P5L1l84J93Q4j86
$$ 79 -124 -81 137 183 -45 -236 71 151 63 -19 213 69 -47 167 86 -186 106 135 210 241 -143 50 134 -52
5856e2o0J66L7k01K61L8N7m27L34P4m67Q8J23J10nm6K31l02J78o0l5j10J61j47
$$ -52 -112 54 91 -110 151 189 246 -181 153 227 -240 -152 -29 81 76 30 261 -41 137 77 42 -68 93 -54
5880e4l3L27m56L42r0N7k2K13l95J6k2M28k06j83P8K01m45j47N08L2k36J3L17
$$ -54 -87 240 -216 126 36 93 71 284 -111 -95 -117 311 105 -78 0 201 -244 -391 117 149 -87 -74 243
5903B43j45k17N0L07k38M0n5J32q3l97M33N6n4m03O12l6m06o0L91j14k61K01K37
$$ 243 98 -119 -69 238 0 40 -15 117 34 -363 70 126 72 -331 281 245 -161 -221 170 56 -205 -4 233
5926B33k07j43j06L60j50N2j12K31J08j79K58k40l79j3K03J30l3O0O8k15j40l9
$$ 233 26 -117 -223 137 -13 39 -73 158 266 87 345 105 -274 -287 -84 46 13 73 141 -74 -214 -253
$$ [...]
8191c0
##END NTUPLES=NMR FID
##END=
