##TITLE=1H_LR-0145-C1-EtOAc
 CD3CN
 8 sc, 
 14.3.2023
##JCAMPDX= 6.0         $$ Bruker NMR JCAMP-DX V2.0
##DATA TYPE= NMR FID
##DATA CLASS= NTUPLES
##ORIGIN= UXNMR, Bruker Analytische Messtechnik GmbH
##OWNER= root
$$ XWIN-NMR		Version 3.5
$$ Tue Mar 14 14:40:05 2023 Russian Standard Time (UT+4h)  she@DPX200
##.OBSERVE FREQUENCY= 200.13135
##.OBSERVE NUCLEUS= ^1H
##.DELAY= (6, 6)
##.ACQUISITION MODE= SIMULTANEOUS
##.ACQUISITION SCHEME= undefined
##.AVERAGES= 8
##.DIGITISER RES= 18
##SPECTROMETER/DATA SYSTEM= spect
##.PULSE SEQUENCE= zg30
##.SOLVENT NAME= CDCl3
##.SHIFT REFERENCE= (INTERNAL, CDCl3, 0, 15.7039)
##AUDIT TRAIL= $$ (NUMBER, WHEN, WHO, WHERE, WHAT)
$$ ##TITLE= Audit trail, XWIN-NMR		Version 3.5
$$ ##JCAMPDX= 5.01
$$ ##ORIGIN= Bruker BioSpin GmbH
$$ ##OWNER= she
$$ F:/spectra/data/she/nmr/H-F/1/audita.txt
$$ ##AUDIT TRAIL=  $$ (NUMBER, WHEN, WHO, WHERE, WHAT)
(   1,<2023-03-14 14:39:11.53 +0400>,<she>,<DPX200>,
      <created by zg, POWCHK disabled, PULCHK disabled
       configuration hash MD5:
       00 E9 B6 7A A2 85 ED C7 34 08 36 98 17 FE 4E 26
       data hash MD5: 16K
       E8 42 A4 1F 01 04 ED 99 06 02 3E 99 E8 94 60 74>)
$$ ##END=
$$ 
$$ hash MD5
$$ 8F E9 C0 02 D5 19 7A CC F6 61 6D 52 F1 D0 D6 E0
##$RELAX= 
##$RELAX= 
##$RELAX= 
##$RELAX= 
##$RELAX= 
##$RELAX= 
$$ Bruker specific parameters
$$ --------------------------
##$DU= <F:/spectra>
##$EXPNO= 1
##$NAME= <H-F>
##$PROCNO= 1
##$TYPE= <nmr>
##$USER= <she>
##$AMP= (0..31)
100 100 100 100 100 100 100 100 100 100 100 100 100 100 100 100 100 100 
100 100 100 100 100 100 100 100 100 100 100 100 100 100 
##$AQSEQ= 0
##$AQ_mod= 1
##$AUNM= <au_zg>
##$AUTOPOS= <>
##$BF1= 200.13
##$BF2= 200.13
##$BF3= 200.13
##$BF4= 200.13
##$BF5= 200.13
##$BF6= 200.13
##$BF7= 200.13
##$BF8= 200.13
##$BYTORDA= 1
##$CFDGTYP= 0
##$CFRGTYP= 5
##$CHEMSTR= <none>
##$CNST= (0..31)
1 1 145 1 1 1 1 1 1 1 1 1 1 1 1 1 1 1 1 1 1 1 1 1 1 1 1 1 1 1 1 1 
##$CPDPRG= <>
##$CPDPRG1= <>
##$CPDPRG2= <>
##$CPDPRG3= <>
##$CPDPRG4= <mlev>
##$CPDPRG5= <mlev>
##$CPDPRG6= <mlev>
##$CPDPRG7= <mlev>
##$CPDPRG8= <mlev>
##$CPDPRGB= <>
##$CPDPRGT= <>
##$D= (0..31)
0 1.2 0 0 0 0 0 0 0 0.06 0 0.03 0 0 0 0 0.0002 0 0 0 0 0 0 0 0 0 0 0 0 
0 0 0 
##$DATE= 1678790351
##$DBL= (0..7)
120 120 120 120 120 120 120 120 
##$DBP= (0..7)
150 150 150 150 150 150 150 150 
##$DBP07= 0
##$DBPNAM0= <>
##$DBPNAM1= <>
##$DBPNAM2= <>
##$DBPNAM3= <>
##$DBPNAM4= <>
##$DBPNAM5= <>
##$DBPNAM6= <>
##$DBPNAM7= <>
##$DBPOAL= (0..7)
0.5 0.5 0.5 0.5 0.5 0.5 0.5 0.5 
##$DBPOFFS= (0..7)
0 0 0 0 0 0 0 0 
##$DE= 6
##$DECBNUC= <off>
##$DECIM= 32
##$DECNUC= <off>
##$DECSTAT= 4
##$DIGMOD= 1
##$DIGTYP= 9
##$DL= (0..7)
0 120 120 120 120 120 120 120 
##$DP= (0..7)
150 150 150 150 150 150 150 150 
##$DP07= 0
##$DPNAME0= <>
##$DPNAME1= <>
##$DPNAME2= <>
##$DPNAME3= <>
##$DPNAME4= <>
##$DPNAME5= <>
##$DPNAME6= <>
##$DPNAME7= <>
##$DPOAL= (0..7)
0.5 0.5 0.5 0.5 0.5 0.5 0.5 0.5 
##$DPOFFS= (0..7)
0 0 0 0 0 0 0 0 
##$DQDMODE= 0
##$DR= 18
##$DS= 0
##$DSLIST= <SSSSSSSSSSSSSSS>
$$ [...]
##$SUBNAM2= <"">
##$SUBNAM3= <"">
##$SUBNAM4= <"">
##$SUBNAM5= <"">
##$SUBNAM6= <"">
##$SUBNAM7= <"">
##$SUBNAM8= <"">
##$SUBNAM9= <"">
##$SW= 18.05172834244
##$SWIBOX= (0..15)
0 0 2 0 0 0 0 0 0 0 0 0 0 0 0 0 
##$SW_h= 3612.71676300578
##$TD= 16384
##$TD0= 1
##$TE= 0
##$TE2= 300
##$TE3= 300
##$TEG= 300
##$TL= (0..7)
0 120 120 120 120 120 120 120 
##$TP= (0..7)
150 150 150 150 150 150 150 150 
##$TP07= 0
##$TPNAME0= <>
##$TPNAME1= <>
##$TPNAME2= <>
##$TPNAME3= <>
##$TPNAME4= <>
##$TPNAME5= <>
##$TPNAME6= <>
##$TPNAME7= <>
##$TPOAL= (0..7)
0.5 0.5 0.5 0.5 0.5 0.5 0.5 0.5 
##$TPOFFS= (0..7)
0 0 0 0 0 0 0 0 
##$TUNHIN= 0
##$TUNHOUT= 0
##$TUNXOUT= 0
##$USERA1= <user>
##$USERA2= <user>
##$USERA3= <user>
##$USERA4= <user>
##$USERA5= <user>
##$V9= 5
##$VALIST= <valist>
##$VCLIST= <CCCCCCCCCCCCCCC>
##$VD= 0
##$VDLIST= <DDDDDDDDDDDDDDD>
##$VPLIST= <PPPPPPPPPPPPPPP>
##$VTLIST= <TTTTTTTTTTTTTTT>
##$WBST= 1024
##$WBSW= 4
##$XGAIN= (0..3)
0 0 0 0 
##$XL= 0
##$YL= 0
##$YMAX_a= 167185
##$YMIN_a= -310155
##$ZGOPTNS= <>
##$ZL1= 120
##$ZL2= 120
##$ZL3= 120
##$ZL4= 120
##$ABSF1= 10
##$ABSF2= 0
##$ABSG= 5
##$ABSL= 3
##$ALPHA= 0
##$AQORDER= 0
##$ASSFAC= 0
##$ASSFACI= 0
##$ASSFACX= 0
##$ASSWID= 0
##$AUNMP= <proc_1d>
##$AZFE= 0.1
##$AZFW= 0.1
##$BCFW= 1
##$BC_mod= 2
##$BYTORDP= 1
##$COROFFS= 0
##$CY= 11.3945322036743
##$DATMOD= 1
##$DC= 2
##$DFILT= <>
##$DTYPP= 0
##$F1P= 2.36226072786647
##$F2P= -0.459571619588291
##$FCOR= 0.5
##$FTSIZE= 0
##$FT_mod= 4
##$GAMMA= 1
##$GB= 0.15
##$INTBC= 1
##$INTSCL= 1
##$ISEN= 128
##$LB= 0.24
##$LEV0= 0
##$LPBIN= 0
##$MAXI= 10000
##$MC2= 0
##$MEAN= 0
##$ME_mod= 0
##$MI= 1.114404
##$NCOEF= 0
##$NC_proc= 0
##$NLEV= 6
##$NOISF1= 3.799351
##$NOISF2= 2.8
##$NSP= 1
##$NTH_PI= 0
##$NZP= 0
##$OFFSET= 15.70392
##$PC= 1
##$PHC0= -19113.28
##$PHC1= 17.00074
##$PH_mod= 1
##$PKNL= yes
##$PPARMOD= 0
##$PSCAL= 0
##$PSIGN= 0
##$REVERSE= no
##$SF= 200.130013532006
##$SI= 16384
##$SIGF1= 3
##$SIGF2= 2
##$SINO= 400
##$SIOLD= 16384
##$SREGLST= <1H.CDCl3>
##$SSB= 0
##$STSI= 0
##$STSR= 0
##$SW_p= 3612.71676300578
##$SYMM= 0
##$S_DEV= 0
##$TDeff= 0
##$TDoff= 0
##$TI= <>
##$TILT= no
##$TM1= 0
##$TM2= 0
##$TOPLEV= 0
##$USERP1= <user>
##$USERP2= <user>
##$USERP3= <user>
##$USERP4= <user>
##$USERP5= <user>
##$WDW= 1
##$XDIM= 8192
##$YMAX_p= 0
##$YMIN_p= 0
$$ End of Bruker specific parameters
$$ ---------------------------------
##NTUPLES= NMR FID
##VAR_NAME=  TIME,          FID/REAL,        FID/IMAG
##SYMBOL=    X,             R,               I
##VAR_TYPE=  INDEPENDENT,   DEPENDENT,       DEPENDENT
##VAR_FORM=  AFFN,          ASDF,            ASDF
##VAR_DIM=   8192,          8192,            8192
##UNITS=     SECONDS,       ARBITRARY UNITS, ARBITRARY UNITS
##FACTOR=    0.0002768,     1,               1
##FIRST=     0,             0,               0
##LAST=      2.2672688,     0,               0
##MIN=       0,             -310155,         0
##MAX=       2.2672688,     167185,          0
$$ Real data points
##PAGE= N=1
##DATA TABLE= (X++(R..R)), XYDATA
$$ [...]
1801b38j95M41O87r69k94Q41j75q30P7P59K5m03K19Q16n99m98M41M68p40k55P02
$$ -238 -433 8 695 -274 -568 273 98 -732 -655 104 129 -274 -55 761 162 -336 105 573 -167 -422 280
1822B80Q5p66j01O15J43m77Q2P38k87m31l3L65k85o33N97M32m20k13M99L8k54
$$ 280 365 -401 -502 113 256 -221 -139 599 312 -119 -152 213 -72 -705 -108 324 -96 -309 190 228 -26
1843b6k10M41P9m95j60P06j74n32K77M50k69n48N28M51o14j32K65J31l01k09K7
$$ -26 -236 205 284 -211 -371 335 161 -371 -94 356 87 -461 67 518 -96 -228 37 168 -133 -342 -315
1864c15J64l46l6O36j62l41L69L54j2k73R5L70n75k39L52O0k63n4K15K79r0k84
$$ -315 -151 -497 -533 103 -59 -400 -31 323 311 38 133 503 -72 -311 41 101 -162 -216 -1 278 188 -96
1886i6K02K9j41K57%k14j79j9K54q5l72N32Lj12q6K37J68k74N8K14j72j64j75
$$ -96 106 135 -6 251 251 37 -142 -161 93 8 -364 168 171 59 -27 210 378 104 162 376 204 40 -135
1909a35r8j5OK15L98l41J27P1j34j26m4J17o9j46j58K03o9P3j16L46J30p2k1K0
$$ -135 -233 -248 -242 -27 371 30 157 228 94 -32 -76 41 -28 -174 -332 -129 -198 -125 -241 105 235 163 142 162
1933A62J08j1l29R2j91q5J23J55J95j6o7o9o1J49j68n4j33oK03j2k30K63M8j56
$$ 162 270 259 -70 22 -169 -254 -131 24 219 203 136 67 6 155 -13 -67 -200 -206 -3 -15 -245 18 66 -90
1957i0K68J0M1k97J76j79j16K91j41J0J22j95J98n4K0L9K0q5J14j21n3j23L65
$$ -90 178 188 229 -68 108 -71 -187 104 -37 -27 95 -100 98 44 64 103 123 38 152 31 -22 -145 220
1980B20m56K05K8J97J00k35j33j48L28K1L1K4Mq2l08N3O3j84J05K02j58J49K19
$$ 220 -236 -31 -3 194 294 59 -74 -222 106 127 158 182 186 104 -204 -151 -88 -272 -167 35 -123 26 245
2003B45j88o8k6j41J43j67j0J58Q0j09m6J77L0j05J15J06j20n2L9K79m37P7j72
$$ 245 57 -11 -37 -178 -35 -202 -212 -54 26 -83 -129 48 78 -27 88 194 74 22 61 340 -97 -20 -192
2026a92N4J24K02j08J24l6l5k8k9l61m1K94k08R4J15j02rJ39J55j27K08q1j29
$$ -192 -138 -14 188 80 204 168 133 105 76 -285 -326 -32 -240 -146 -31 -133 -142 -3 152 25 233 152 23
2049B3NJ2K8j40m1J01k42R6P4J08p1m9L08k78K03k35k6P3l80M48l7j11K75j98
$$ 23 28 40 68 -72 -113 -12 -254 -158 -84 24 -47 -96 212 -66 137 -98 -124 -51 -431 17 -20 -131 144 -54
2073e4Q9m3M97k37k64n2J25k08R8M7q9j8j35J49Q9J25k66K50K6p2j55j10J54k65
$$ -54 35 -8 489 252 -12 -64 61 -147 -49 -2 -91 -109 -244 -95 -6 119 -147 103 129 57 -98 -208 -54 -319
2097c19Rj9N23n22M37N8r2J59j97K09l36K62j03j90L00j31p3K95k94Q2J96kN3
$$ -319 -310 -329 194 -328 109 167 75 234 37 246 -90 172 69 -121 179 48 -25 270 -24 58 254 252 305
2120C05l89L5J42j83j25J73k6k3r7K69K10l60J14O7p9J36k07J48k65J23lL6O7
$$ 305 -84 -49 93 -90 -215 -42 -68 -91 -188 81 291 -69 45 112 33 169 -38 110 -155 -32 -35 1 68
2143F8P1j04L53m50K41J0o2k41J35L9l99L44j29j33L60l96L52j40J4J2J48R2m11
$$ 68 139 35 388 -62 179 189 127 -114 21 60 -339 5 -124 -257 103 -293 59 -81 -67 -55 93 185 -226
2166b26J30M3j72k4M11p6l31Q4K84K55k13kO7k08r9J30k11J13l25K49K84l1j45
$$ -226 -96 -53 -225 -249 162 86 -245 -161 123 378 165 163 230 22 -77 53 -158 -45 -370 -121 163 132 -13
2189a3J10P9%k65K10l76L44j16q9k22J73J97J49j92j9j09M40j41l46K70N0k56
$$ -13 97 176 176 -89 121 -255 89 -27 -116 -338 -165 32 181 -11 -30 -139 301 160 -186 84 134 -122
2211a22n5J99j77O8K8M18l52K99j67K02l53n0K7J23q0k64L01k3k12J44L37k67
$$ -122 -177 22 -155 -87 -59 359 7 306 139 341 -12 -62 -35 88 8 -256 45 22 -190 -46 291 24
2233B4k75K43m6K74j39j68J40m70J93J68Q6q6P8k2q3L46p7q8J72k05k42k5K88
$$ 24 -251 -8 -54 220 81 -87 53 -417 -224 -56 30 -56 22 0 -83 263 186 98 270 65 -177 -202 86
2256H6l92J41J36J76N9N9k27j32O0K93l02j21M9J46l01P5J14J18K30l29J95N8
$$ 86 -306 -165 -29 147 206 265 38 -94 -34 259 -43 -164 -115 31 -270 -195 -81 37 267 -62 133 191
2278A91p0K08m44P2R6j38Ok58L18r3L69k63o3J34J98j62j86J37K1j11r9RJ62q4
$$ 191 121 329 -115 -43 53 -85 -79 -337 -19 -112 257 -6 -69 65 263 101 -85 52 73 -38 -137 -128 34 -50
2302e0j49N67k35j32j10K31M0k32J58jj10J4j7K5J08l05K91J64k48j40K52l41
$$ -50 -199 368 133 1 -109 122 162 -70 88 87 -23 -9 -26 -1 107 -198 93 257 9 -131 121 -220
2324b20K98m8k04P6k03K06N2o0P6J12J34l63K92j2l45J43k7K57l42L93j96K95
$$ -220 78 30 -174 -98 -301 -95 -43 -103 -27 85 219 -144 148 136 -209 -66 -93 164 -178 215 19 314
2346C14l94O7R0k19K63l86J13Q3J22j58r6J35K8j76L70k07J25j10M4M7n2L1m9
$$ 314 -80 -13 77 -142 121 -265 -152 -69 53 -105 -201 -66 -38 -214 156 -51 74 -36 8 55 3 34 -15
2369a5l1R8q4q8L21j26k83M24j69j25L27j87k9j75J93J35m80L93j50J06j13L31
$$ -15 -46 52 -32 -120 201 75 -208 216 47 -78 249 62 33 -142 51 186 -294 99 -51 55 -58 273
2391B73k64L11k74j83M06m79L00j74J23k4j03j02J62M4J63k29J85j74P8n3N1m8
$$ 273 9 320 46 -137 269 -210 90 -84 39 15 -88 -190 -28 16 179 -50 135 -39 39 -14 37 -11
2413a1J69k88K0PJ90n7q2K30m7k03q6K74j89o1j28N19k00k35L35k58J30M2j0O8
$$ -11 158 -130 -110 -103 87 30 -52 178 131 -72 -158 116 -73 -134 -262 257 57 -178 157 -101 29 71 61 129
2437A29l4j8J2K8q3k79J45MK83j01J49J31n12K13K15k83m4K5J33m7j15K38k55
$$ 129 95 77 89 117 34 -245 -100 -96 187 86 235 366 -146 67 282 -1 -45 -20 113 66 -49 189 -66
2460f6K13m2L5J02k17M7r6J51n6j62K01l05Q1oJ10j57J06PL93m14q5K80n0j22
$$ -66 147 105 140 242 25 72 -24 127 71 -91 110 -195 -114 -120 -10 -167 -61 -54 339 -75 -160 120 70 -52
2484e2J34l06r6K32J74j76q8J57ln2K84j32j9N4k2k25R1K28l47J01J94q3J20j29
$$ -52 82 -224 -320 -88 86 -90 -178 -21 -24 -76 208 76 57 111 89 -136 -45 183 -164 -63 131 48 168 39
2508C9P6k67P6K21k25n8O7J00r3k16L05J81jj13j27o5N4K88k78P6R1L0k12R6j02
$$ 39 115 -152 -76 145 -80 -138 -71 29 -64 -280 25 206 205 92 -35 -100 -46 242 -36 40 131 161 -51 45 -57
2533e7j34O4k5J80j38J48K40m55kK78j35k8j00K31j85P3K47k12L76o1k39L9p3
$$ -57 -191 -127 -152 28 -110 38 278 -177 -179 99 -36 -64 -164 67 -118 -45 202 -10 366 305 66 105 32
2556C2kj4k39L54j06q5J04L9j01J05j0P0k14J64m6R2m50K94M4r9J11k06M5J62
$$ 32 30 16 -223 131 25 -60 44 83 -18 87 77 147 -67 97 51 143 -307 -13 31 -68 43 -163 -118 44
2580D4q7K38k39J6L9O1Q2k60K05lo6q5J62r7l5J42k53m8J32j86j8K16r4k6J9o2
$$ 44 -43 195 -44 -28 11 72 154 -106 99 96 30 -55 107 10 -25 117 -136 -184 -52 -238 -256 -40 -134 -160 -141 -203
2606b03K22m3J53j33K13o2k32mJ80q5M0j61L1j37J42J77J1j7k52K06j00K02l76
$$ -203 19 -24 129 -4 209 147 -85 -89 91 6 46 -115 -84 -221 -79 98 109 92 -160 46 -54 148 -228
2629b28L06J13k22M5J37P4J0m83K00K09k72J69K4n2j03ML11l73J16Q5j05J07l12
$$ -228 78 191 -31 14 151 225 235 -248 -48 161 -111 58 82 30 -73 -69 242 -131 -15 70 -35 72 -240
2652b40M30p5l1k10J87r7k12L21J42j18l06J55K55r7k05oJ27j40K81j48P0Km65
$$ -240 190 115 84 -126 61 -36 -248 73 215 97 -209 -54 201 104 -101 -107 20 -120 161 13 83 85 -380
2675c80N10N0q6j06J25J6l49J92K42l27k43N31m3l96Q7L75l2l44K34q5l6J38L6
$$ -380 130 180 94 -12 113 129 -220 -28 214 -113 -356 175 132 -264 -177 198 166 -178 56 -29 -65 73 109
2698A09j94J99m19N8K63Q6l09K93K08l32m26N95j36j49J42J77r1l43M23k06N0
$$ 109 -85 114 -305 -247 16 102 -207 86 294 -38 -464 131 -5 -154 -12 165 74 -269 154 -52 -2
2719bJ1k26L43q6K6J11j81M7k03K66k91j08nL42j9j52j52N83l60k30M10l3j30
$$ -2 9 -217 126 40 66 177 -4 43 -160 106 -185 -293 -298 44 25 -127 -279 304 -56 -286 124 91 -39
2742c9k33N14k49l06o0N48k32J25l34L14J01l89K98n9j0l01M33Lm09j8M07P4k10
$$ -39 -272 242 -7 -313 -373 175 -57 68 -266 48 149 -240 58 -1 -11 -312 121 124 -285 -303 104 178 -32
2765c2k89M55p1n9J02j29j8l19L23K53k44k62K71J87l06KL92l4l27j10M07j50
$$ -32 -321 134 63 4 106 -23 -41 -360 -37 216 -28 -290 -19 168 -138 -136 256 222 -105 -215 192 42
2787D2k04J89J99k67o1M07J6j60m89N76J48n83K4N40j52m77K17O7M2m46L77K76
$$ 42 -162 27 226 -41 -102 305 321 161 -328 248 396 -187 -163 377 225 -252 -35 32 74 -372 5 281
2809B81k57m09L77M51n00l75N48J14m14l33N36J45n24K17N27m46j42O1L88j93
$$ 281 24 -385 -8 443 -57 -432 116 230 -184 -517 19 164 -360 -143 384 -62 -204 -143 245 52
2829E2R0l33M37m04j6L84J10o38Q5O23k06l62R1L49k45m82M62K56k11k81J70L06
$$ 52 142 -191 246 -158 -174 210 320 -318 -233 390 184 -178 -87 262 17 -465 -3 253 42 -239 -69 237
2851B37n52k39R04r0l54k32O81j82l96M0N68k45k66k2M00r6o76M93M30n18j47
$$ 237 -315 -554 350 260 -94 -326 355 173 -223 -183 385 140 -126 -148 252 156 -520 -27 403 -115 -262
2872b62M68K70o51l37Q40k34l25Q5O49m94l48M56K71m98J21Q4J50l80k39L46j1
$$ -262 206 476 -175 -512 328 94 -231 -146 503 9 -339 117 388 -110 11 95 245 -135 -374 -28 -39
2893c9j56j09O13on07Q4N31n49m39Q78J94p83K4M27J64m00k65L76L05n29l2M93
$$ -39 -195 -304 309 303 -204 -120 411 -138 -577 301 495 -288 -264 163 327 -73 -338 38 343 -186 -218 275
2915B75N0q59M07K70n45k6M02K35k64l36N20J73o28lO10k7n13J26L27j85k67j1
$$ 275 325 -534 -127 143 -402 -428 -26 209 -55 -391 129 302 -326 -329 281 254 -259 -133 194 9 -258 -269
2937b69K92j28j61N38J43l38l99N68K6m01l56R30m00l65K49O60j79p12L29K43
$$ -269 23 -105 -266 272 415 77 -322 246 272 -129 -485 445 45 -320 -71 589 410 -302 27 270
2957B70k45n09N57L03n97j39N95K82n33k88Q47j49n97j14N51k48l08M59M0k16
$$ 270 25 -484 73 376 -221 -360 235 517 -16 -304 543 394 -203 -317 234 -14 -322 137 177 -39
2977c9k97L76K58l13l10K14M16n81P5M31j17j95OL83l54m11M23M93l07m79M87
$$ -39 -336 40 298 -15 -325 -111 305 -276 -201 230 113 -82 -76 307 -47 -458 -35 458 151 -328 159
2998A59J78l41j79M50ol09l6K88pk95R3K19L62p65J93L56l52m05M57K41o05J8
$$ 159 337 -4 -183 267 261 -48 -84 204 197 -98 -5 214 576 -189 4 360 8 -397 60 301 -304 -286
3020b86N26Q0o63K78K02p6l12J49N21l30m03L39M27n11l19L09P29r31q2N71J09
$$ -286 240 320 -343 -65 137 61 -251 -102 419 89 -314 25 452 -59 -378 -69 660 -271 -353 218 327
3041C27m51p6P34n16r5J58L4l10r4L72K01k98k70M82J26k67n12Q93k37m37j39
$$ 327 -124 -200 534 18 -77 81 115 -195 -289 83 284 -14 -284 198 324 57 -455 438 201 -236 -375
3062c75N86j43n81N14M92l26l67L05K77l97l6P3J17j33k52L66L3k27j98N56k70
$$ -375 211 68 -513 1 493 167 -200 105 382 -15 -51 22 139 6 -246 120 153 -74 -272 284 14
3083A4l44L11M92n37k26L60L94o43k10N04j65k45k8L93n8l06J96K85p9l15J82
$$ 14 -330 -19 473 -64 -290 70 464 -179 -389 115 -50 -295 -323 70 12 -294 -98 187 108 -207 -25
3104b5K9k5q6L26J27n68J27n1N15m56j17M34o2m37l0N04j88k37R5K11k54LN83
$$ -25 4 -21 -107 219 346 -222 -95 -146 369 -87 -204 230 168 -269 -299 205 17 -220 -125 86 -168 -165 418
3127D18m2n64n4O20k07l71K32J12j03m62K29N74l59k28M20m1j16m8J43L9l38L3
$$ 418 376 -188 -242 378 171 -200 32 144 41 -421 -192 382 23 -205 215 174 58 10 153 192 -146 -113
3149a13K81j61k81J09L73R4n76R2K65j7l03K47K76k21k87L79L2j24P8l1J62l31
$$ -113 168 7 -274 -165 208 302 -274 -182 83 66 -237 10 286 65 -222 157 189 65 143 112 274 -57
3171e7p5jJ22j43K84J88l85o3J00K27k82k3K27J5l17k9L55K6n31J50L03K21k99
$$ -57 -132 -133 -11 -154 130 318 -67 -130 -30 197 -85 -108 119 134 -183 -212 143 169 -362 -212 91 312 13
3194A3j38L31r2j23K61n4j82l18N39j29j05J21n1J1k44p3L96k29n7o1J29L6K2
$$ 13 -125 206 114 -9 252 198 16 -302 237 108 3 124 73 84 -160 -233 163 -66 -123 -184 -55 -19 3
3217CP1K58n39J23J53r9k8j63P0L32j85o9q1J96n4r1P5n2j93K77r1J65j48m0R1
$$ 3 74 332 -207 -84 69 -30 -58 -221 -151 181 -4 -73 -154 42 -12 -103 -28 -80 -273 4 -87 78 -70 -110 -19
3242a9j31J42L7j34L8j5M9L67k58j56L47j40k24j92M01Pj01K29j40j4k05R8J70
$$ -19 -150 -8 29 -105 -67 -82 -33 334 76 -80 267 127 -97 -289 112 119 18 247 107 93 -112 -14 156
3265A56j43J54Q3j69l7m3J11j66q8j06M53k76l5Q8J03k56Q4K6lJ49j70K19k44
$$ 156 13 167 250 81 44 1 112 -54 -142 -248 205 -71 -106 -18 85 -171 -87 -61 -64 85 -85 134 -110
3288a10N9K96j83J05k10j90K79o9j37J44m9j85K23J51o9j00j07M37k09k10J9J47
$$ -110 -51 245 62 167 -43 -233 46 -23 -160 -16 -65 -250 -27 124 55 -45 -152 285 76 -134 -115 32
3310C2o9j94J01K26j97J3R2J02r7l1O8j08j46j50K99l5K7j9R5p9N5R4M4j46P3
$$ 32 -37 -231 -130 96 -101 -88 4 106 9 -22 46 -62 -208 -358 -59 -94 -67 -86 9 -70 -15 79 123 -23 50
3335E0j28J28m9j1Q3M2l72J13O3P9k72J37K31o5j18jm7J38J69l28M59n74L84o3
$$ 50 -78 50 1 -10 73 115 -257 -144 -81 -2 -274 -137 94 29 -89 -90 -137 1 170 -158 301 -273 111 48
3359D8j32K7K06j57L8p4J29k39jJ70r4J63j15k37M51j90MP8k12R9O0j56K33k33
$$ 48 -84 -57 149 -8 30 -44 85 -154 -155 15 -79 84 -31 -268 183 -7 -3 75 -137 -38 22 -134 99 -134
3383a34J34j13j4J93n3K8o2K91k91J07k60M44l63M70k83k13K54j52K2j66J52J56
$$ -134 0 -113 -127 66 13 41 -21 270 -21 86 -174 270 -93 377 94 -119 135 -17 5 -161 -9 147
3405A47j07L2k20J42J84n29M23o1n5K10p4l6j96J57p9K63j69j00Q5j72K93k1j29
$$ 147 40 72 -148 -6 178 -351 72 11 -44 166 92 56 -140 17 -62 201 32 -68 17 -155 138 117 -12
3428a2k8K49l24J74r7O9nK34j39k58J66k18J69K89k51M8Oq9q1J56j5K17k37k70
$$ -12 -40 209 -115 59 -38 31 26 260 121 -137 29 -189 -20 269 18 66 72 -17 -98 58 43 260 23 -247
3452b47M45k01pj09K57l06K80r3L3k7Q5k6J06l65L36k52j29K87j60L16p8o2J09
$$ -247 198 -3 -10 -119 138 -168 112 19 52 25 110 84 190 -175 161 -91 -220 67 -93 223 145 83 192
3475A92j49n2k9k80L09j63j22M30qk8j81j88K21k3K08O6r0K56m72J53j23j94M62
$$ 192 43 -9 -38 -318 -9 -172 -294 136 128 100 -81 -269 -48 -71 137 203 113 369 -103 50 -73 -267 195
3498A95k04J45O5l3j82J28l64K58k54K39J28l30K87J7j01p8j49M71j77k51K78
$$ 195 -9 136 201 168 -14 114 -250 8 -246 -7 121 -209 78 95 -6 -84 -233 238 61 -190 88
3519H8j09M9J27j25kQ8k12K42j03l07K70J74j5N5m55M05K3j82L03n26M02l65P5
$$ 88 -21 28 155 30 28 116 -96 146 43 -264 6 180 165 220 -235 170 193 11 314 -212 190 -175 -100
3542a00K23j15J5J2or1n7J85K5N1o2k20K08l64J30J81NP0L8j64p5M5J25r8l7K46
$$ -100 123 8 23 35 29 -62 -119 66 91 142 80 -140 68 -296 -166 15 20 90 128 -36 -111 -66 59 -39 -76 170
3568A70k54N4M3K09k68M6O7j50J63p9m7J01J23Ok85nj39K14k3K6k68L68k29O9
$$ 170 -84 -30 13 222 -46 0 67 -83 80 1 -46 55 178 184 -101 -106 -245 -31 -54 -28 -296 72 -157 -88
3592h8J73N0k33j37N0K73j42N3j45R6J25j14J63m2l80J00L55k66k59L74q7J46
$$ -88 85 135 -98 -235 -185 88 -54 -1 -146 -50 75 -39 124 82 -298 -198 157 -109 -368 6 -81 65
3614F5j7k33Q1J15k39K25Q0j01M13m10k5J20k7L6J01k89j06J71L58m08P5J48j04
$$ 65 48 -185 -104 11 -228 -3 77 -24 389 -21 -46 74 47 83 184 -105 -211 -40 318 -90 -15 133 29
3637B9R4r4M3k4j51q4J43r4K65j21P9m3oJ45j63j38j00L77o2k26K4j57J12L07
$$ 29 123 29 72 48 -103 -187 -44 -138 127 6 85 42 36 181 18 -120 -220 157 95 -131 -107 -264 -152 155
3661A55j27R6l17N8M11j74k52J29p2J59j05O5n5J18k13J48L14m6l37O3q9K2J80
$$ 155 28 124 -193 -135 276 102 -150 -21 -93 66 -39 26 -29 89 -124 24 338 292 -45 18 -71 -49 131
3684A31j78k27J66K03k53k5J85m1q1R6j97L01ln0K0k12K74k2q6N2k0q8J82p6j77
$$ 131 -47 -274 -108 95 -158 -183 2 -39 -120 -24 -221 80 77 27 47 -165 109 87 1 53 33 -55 127 51 -126
3709a26J94l59J60J62j13P9rj59J59R3J59m80oK87rJ45l82J73p2K74n5l17J09
$$ -126 68 -291 -131 31 -82 -3 -12 -171 -12 81 240 -240 -246 41 32 177 -205 -32 -104 170 115 -202 -93
3732i3k1J75j74K50k61o0M28m15J09k7J14J1j53K87l91L05l3m1l9n3J48j36j88
$$ -93 -114 61 -113 137 -124 -184 244 -171 -62 -89 25 36 -117 170 -221 84 51 10 -29 -82 66 -70 -258
3755b58L74l15J28N7NJ76k90J05r6N6K99k81j58J6J86m5J53k76K94J1j37M7l2
$$ -258 116 -199 -71 -14 -9 167 -123 -18 -114 -58 241 -40 -198 -182 4 -41 112 -164 130 141 4 51 19
3778A9J97n9k02j42L07m41M87r4j60L30n67J26K7L44q5k42M55m61M7J97O0j35
$$ 19 216 157 -45 -187 120 -321 166 72 -88 242 -325 -199 -172 172 87 -155 300 -161 -114 83 143 8
3800HK1J27k12J08j83K99kj60J96l72J70m8Q1M0K2j60L9K53j69l9R9Qr2k0J63
$$ 8 29 156 -56 52 -131 168 166 6 202 -170 0 -48 33 73 95 -65 -26 227 58 19 118 126 34 14 177
3825A77j43J5j0j34J15m9q7j37L84k99Q0R1Q1o5j43J12q9K2k8L9k19L58J27j58
$$ 177 34 49 39 -95 20 -29 -116 -253 131 -168 -88 3 84 19 -124 -12 -101 -79 -107 -68 -287 71 198 40
3849D0L3j02j38L60l25Q7J18k58Q4J83J61k64K26j75J33m24L77j19j46K25j04
$$ 40 73 -29 -167 193 -132 -45 73 -185 -101 82 243 -21 205 30 163 -261 116 -3 -149 76 -28
3870b8J3p7K03p5J82n47M79l75J63J89NO6k57J86l33J26k56M70j01j9N5j24m2
$$ -28 -15 -92 111 36 218 -329 150 -225 -62 127 132 198 -59 127 -206 -80 -336 134 33 14 69 -55 -97
3893i7J12K1p5Q5r8r1J35r8j10K27N0k66J34P7M8K5k32M68l82J9K58j63l6r2J50
$$ -97 15 36 -39 46 -52 -143 -8 -106 -216 11 61 -205 -71 6 54 79 -153 315 -67 -48 210 47 11 -81 69
3918F9l3J67j61n5J27j11L5j8j70K28j87J58J24j56J25k15k0O5j73K86n1j20K21
$$ 69 36 203 42 -13 114 3 38 20 -150 78 -109 49 173 17 142 -73 -93 -28 -201 85 34 -86 135
3941A35k52R8M8L7oL9k81K67l7N2l66Q3K58j69K81l38J98j08K21j13j06K7K22
$$ 135 -117 -19 29 66 60 99 -182 85 48 100 -266 -183 75 -94 187 -151 47 -61 160 47 -59 -32 190
3964A90n8k91J10Q0l3j54J21N3pJ56k03J15j2r3r2Q1K15j91j2r3J11O4K3L0j62
$$ 190 132 -159 -49 31 -2 -156 -35 18 11 167 -36 79 67 -26 -118 -37 178 -13 -25 -118 -7 57 80 110 -52
3989e2r4K33l18K82o7k8J13p7L34m15L08j84p6M8j10K23k12L40l92L19k9m1k70
$$ -52 -146 87 -231 51 -16 -44 69 -8 326 -89 219 35 -41 7 -103 120 -92 248 -144 175 146 105 -165
4012a65K27J6q8j7N9J86m69N30k47j50j85K70p4k4J29k13K28J68J6r7k62j7J19
$$ -165 62 78 -10 -27 32 218 -251 279 32 -118 -303 -33 -107 -131 -2 -215 13 181 197 100 -162 -179 -60
4035f0j98K56P1j96J06O4j19K07k33J65l48J08M02j91k45L88j25Q7j60j43K20
$$ -60 -258 -2 69 -127 -21 43 -76 131 -102 63 -285 -177 225 34 -211 177 52 139 -21 -164 56
4056E6m3k0Q1lj97j35K03n6J77j09K8Ko4J92l08L7l3O5L3J91j30K48m48L55L0
$$ 56 13 -7 74 71 -126 -261 -58 -114 63 -46 -18 -16 -80 112 -196 -159 -192 -127 -94 97 -33 215 -233 122 152
4081A52p8j72O1oJ61q3j50J97l49L77l2j06O7j84M01k54j28J46j01j91L84m0m13
$$ 152 74 -98 -37 -43 118 35 -115 82 -267 110 78 -28 39 -145 256 2 -126 20 -81 -272 112 72 -341
4104c41K49K10j60L9Jj17L32k01J69j00J86l22j31J42J70l21J96oj31J6K04j86
$$ -341 -92 118 -42 -3 -2 -119 213 12 181 81 267 -55 -186 -44 126 -195 1 -5 -136 -120 84 -102
4126a02p4K73m56M24J79k31r3L0K21l51J14j9qJ16k18J82K26n08K93J22k48J86
$$ -102 -176 97 -359 65 244 13 -80 -50 171 -180 -66 -85 -93 23 -195 -13 213 -295 -2 120 -128 58
4148E8k03J97j72J77p5J68j07o3J10j61j13K1J40m3J21J48n87L33l5J33q3Q0L36
$$ 58 -145 52 -120 57 -18 150 43 -20 90 -71 -184 -163 -23 -66 55 203 -384 -51 -86 47 -36 44 380
4171C80n81K85j00R0k9k4J02j12j36j08K35P5J70r9k14Q5k49L83j92J62l46M53
$$ 380 -201 84 -16 74 45 21 123 11 -125 -233 2 77 247 148 -66 19 -230 153 -39 123 -223 230
4193B30O8l85L0J90P2l57J97k51K09N3j98K23n6k53L84m0J3M4r7K0k62J34j15
$$ 230 298 -87 -57 133 205 -152 45 -206 3 56 -142 81 25 -228 156 116 129 173 76 96 -166 -32 -147
4216a47J0L46m48J87J08k02K78Q2l07J77K0Q2j64j71L33l8n9q1j84K17jk27K46
$$ -147 -137 209 -239 -52 56 -146 132 214 -93 84 104 186 22 -149 184 146 87 6 -178 39 38 -189 57
4239E7j21k04K09K06qr7l39J74n5L24j61l9l4%l6K15m8j47L27k62j34K00R5k64
$$ 57 -64 -268 -59 147 139 42 -297 -123 -178 146 -15 -54 -88 -88 -124 91 43 -104 223 -39 -173 27 122 -142
4263a42J59j36J67k19J85j08K51J7n70M28L1J61l91J22J45k72J1M92l60j04K09
$$ -142 17 -119 48 -171 14 -94 157 174 -396 32 63 224 -167 -45 100 -172 -161 331 -29 -133 76
4284G6j15l2K02n9P6Pk82L16j10k3J24M6j48k04J25K12k85k37L97N0r4O9j9j38
$$ 76 -39 -71 131 72 148 155 -127 189 79 56 180 226 78 -126 -1 211 -74 -311 86 136 42 111 92 -46
4308d6J57k79K33J90k31J03k11r9K41j8K47l88P8nK22j5k03N3J37l02J6J01L1
$$ -46 111 -168 65 255 24 127 -84 -183 58 40 287 -101 -23 -28 194 179 -24 29 166 -136 -120 -19 12
4331A2l31K35J46j68J42j6p2J96m57L91j15n7k4L22j23k68J79j14J63k11M4K01
$$ 12 -319 -84 62 -106 36 20 -52 144 -313 78 -37 -94 -118 204 81 -187 -8 -122 41 -170 -126 75
4353G5n1mr7K21l47PK02J13J94l43J39Nq9J5m0j5j92R6L38j32l11p0N71k75j82
$$ 75 24 20 -77 144 -203 -196 6 119 313 -30 109 114 25 40 0 -15 -207 -111 227 95 -216 -286 285 10 -172
4378a72J60L86j37m30M33J52k08k35J19k99K65k8MK16l60L22L1m69O1K37j34J72
$$ -172 -12 374 237 -193 240 392 184 -51 68 -231 34 6 10 226 -134 188 219 -250 -189 48 -86 86
4400H6l21O0J87l38J84L21j03k7k06R8j28J46J33J55kn01L33j92Q9k9K6M83m37
$$ 86 -235 -175 12 -326 -142 179 76 49 -157 -59 -187 -41 92 247 245 -256 77 -115 -26 -55 -29 454 17
4423A7q1J75k83J45l42M22m1j87J33K85k79m9M41n7k78j59M32l36m7K52l1N3n45
$$ 17 -64 111 -172 -27 -369 53 12 -175 -42 243 -36 -85 356 299 21 -138 294 -42 -89 163 132 185 -360
4446c60L98Q1j00k39K71o8j19J39K58o0l75K38K04k0k77k01K83j03K12N7j05l25
$$ -360 38 119 19 -220 51 -17 -136 3 261 201 -174 64 268 248 -29 -230 53 -50 162 219 114 -211
4468b11q7K34K93k12K6J65k04k88J38L07k28J00J92q3j13j81K39N6p3j00J39o0
$$ -211 -298 -64 229 17 43 208 4 -284 -146 161 -67 33 225 142 29 -152 87 143 70 -30 109 49
4490D9nm42N53k87J44K7J92J98o70L73l7k2m75L05O8m5j88M57p6j25k56L56j10
$$ 49 44 -398 155 -132 12 39 231 429 -241 132 95 73 -402 -97 -29 -74 -262 195 119 -6 -262 94 -16
4513a6j56K06J65m06r2J71K52K73m54KM24n54j58N24l0m17oK38J6m0jk25L20j81
$$ -16 -172 34 199 -207 -299 -128 124 397 -57 -55 369 -185 -343 181 151 -266 -272 -34 -18 -58 -59 -284 36 -145
4537a45J27J80j08j8K34N0m32q9K81J05r7k62J91K30l54m8L22jm27K28L3J68k73
$$ -145 -18 162 54 36 270 320 -112 -201 80 185 88 -174 17 247 -107 -155 167 166 -261 -33 0 168 -105
4560a05J89k11K77l52J45J11k60K63j69L3J07J15R7j42j51J20J36k44j11J61j7
$$ -105 84 -127 150 -202 -57 54 -206 57 -112 -79 28 143 240 98 -53 67 203 -41 -152 9 -8
4581hJ41l03L38k06n0L3M1j20J69o9j08J08j73K67m5m3j91J89K18j86j30J23J23
$$ -8 133 -170 168 -38 -88 -55 -14 -134 35 -34 -142 -34 -207 60 15 -28 -219 -30 188 2 -128 -5 118
4604A18j51J66j77j12Q8j74M73k49N8J2M24m01n5M6J38l35J50k6l05K94K09j26
$$ 118 -33 133 -44 -156 -68 -242 231 -18 40 52 476 75 20 66 204 -131 19 -7 -312 -18 191 65
4626F5kj27J43K34m12q7J82P3N2q8j35J69M4N6m04M05J75l90j50L60m18L63J42
$$ 65 63 -64 79 313 -99 -186 -4 69 121 33 -102 67 111 167 -237 168 343 -47 -197 163 -255 108 250
4649B50k50k72K71K21l73k80N61J7n3Q0l13K54j11o2k36L56l08P3R2l5J83j7K19
$$ 250 0 -272 -1 220 -153 -433 128 145 92 172 -141 113 2 -60 -296 60 -248 -175 -83 -118 65 48 267
4672B67j72p3k01K44r0K8J23O3m82J93J61k4J35k83J12J29j93J83j75l12J29K72
$$ 267 95 22 -179 65 -25 3 126 189 -293 -100 61 37 172 -111 1 130 -63 120 -55 -367 -238 34
4694C4M7j75j05K6O0R3j38M8J69LK02o9m9O5j00j68K2j45L49k47k52L64p4L15
$$ 34 81 -94 -199 -173 -113 -20 -158 -110 59 62 264 195 146 211 111 -57 -35 -180 169 -78 -330 34 -40 275
4718B75m19K5Q6j26L5L87k77q0j22J33j03K4L94j02q4m62O51m06K70q2q3M5j1
$$ 275 -144 -119 -33 -159 -124 263 -14 -94 -216 -83 -186 -162 232 130 46 -416 235 -171 99 17 -66 -21 -32
4741c2j3P1k03L51j72j3m4r5L91l27J65j67nL2K25j97J60o1n6r9j80K42Q7k8m6
$$ -32 -45 26 -177 174 2 -11 -55 -150 241 -86 79 -88 -93 -61 164 -33 127 66 10 -89 -269 -27 60 32 -14
4766a4L7Q0J86n9k17K38l1nj47L17l15j7n5Mj04l6J03M0j4k71J22L21j40j48J00
$$ -14 23 103 289 230 13 251 220 215 68 385 70 53 -2 2 -102 -138 -35 5 -9 -280 -158 163 23 -125 -25
4791b5K04j7m31L8OJ36K52j94P1nrJ62k22r7J12N7j80J10j37N6N6J04k44J19J86
$$ -25 179 162 -269 -231 -225 -89 163 -31 40 35 26 188 -34 -131 -19 38 -142 -32 -169 -113 -57 47 -197 -78 108
4816A08nQQ7n3r0K9k30j10j26L09L13l07K26j8j40q2K95j80m4k9J98j33p0J25
$$ 108 103 111 198 145 55 84 -146 -256 -382 -73 240 -67 159 141 1 -81 214 34 -10 -39 159 26 -44 81
4840H1l78M21j55J0K15p5q1k6l14N29K0j40l15p9K13J41J07k97J75j01J32o9m2
$$ 81 -297 124 -31 -21 194 119 38 12 -302 227 247 107 -208 -287 -74 67 174 -123 52 -49 83 14 -28
4863b8K2k6J7m2j04K47l84M42o6Oq7k01J22J89l19J32K7K11m54K71j46K3P0K75
$$ -28 -6 -32 -15 -57 -161 86 -298 144 78 84 -3 -204 -82 107 -212 -80 -53 158 -296 -25 -171 -148 -78 197
4887A97k5m94N08K4k28m0J20k11k41L49J27k81L36r7j50K74k09p9J15j92P5J47
$$ 197 172 -322 186 210 -18 -58 62 -149 -390 -41 86 -195 141 44 -106 168 -41 -120 -5 -197 -122 25
4909B5K3k50P6N4J03M1j42r7J73J35j18n7O4j33P3J16p4j52M2J78j36J43K1k2
$$ 25 48 -202 -126 -72 31 72 -70 -167 6 141 23 -34 30 -103 -30 86 12 -140 -98 80 -56 87 108 86
4933H6K7j85nP5j16k3K62k83L92l68J74M0m97N32k65K71k33K29j15j14J85r3p1
$$ 86 113 -72 -77 -2 -118 -141 121 -162 230 -138 36 76 -421 111 -154 117 -116 113 -2 -116 69 -24 -95
4956i5K57m7J36q6j42l20N51l69J55O4p6L44o39J80J01J21k89K05K91l61K72k65
$$ -95 162 115 251 165 23 -297 254 -115 40 104 28 372 -267 -87 14 135 -154 51 342 -19 253 -12
4978a2P6j61J18Q3K4L6q1o4Q6O1j93K06j39R4k94K30j05k25K93j4R5j06j25L1
$$ -12 64 -97 21 104 128 164 83 19 105 166 -27 179 40 134 -160 70 -35 -260 33 19 114 8 -117 -86
5002h6K85l57K76j78Q3j63J81J26k98K32O2m17K23K46o4J21m5l32Q3qN7M8j27
$$ -86 199 -158 118 -60 23 -140 41 167 -131 101 163 -254 -31 215 151 272 227 -105 -22 -30 27 75 -52
5025e2n4J22J48r8ll27N2J74Lj7jl1R3k70J58K29j8j81j37L60j80r5J39P4j61
$$ -52 -106 16 164 66 63 -264 -212 -38 -35 -52 -53 -84 9 -261 -103 126 108 -73 -210 150 -30 -125 14 88 -73
5050g3M8R2m5k58K07j10N6J24K5J89k70k26K81M9J5P2l20oK0L1O4nq2L44l20K70
$$ -73 -25 67 22 -236 -29 -139 -83 41 66 255 -15 -241 40 89 104 176 -144 -150 -130 -99 -35 -40 -122 222 -98 172
5076A72m14L79j38j61P4K48j47n9L6j19P8k20L12q1k42K45Q0K16k13J43j7k50
$$ 172 -242 137 -1 -162 -88 160 13 -46 -10 -129 -51 -271 41 -40 -282 -37 43 259 46 189 172 -78
5098g8j87K80o9k07J57j8J21l4JR8r7j13M9M7K03J15j53rn9j55P4n5M32m02J15
$$ -78 -265 15 -54 -261 -104 -122 -1 -35 -34 64 -33 -146 -97 -50 153 268 115 106 47 -108 -34 -89 343 -59 56
5123E6r7K23j04j63j86J98N3k3j06J9K6j36K16J75k02p1L9r6L2R9J07k07j18L01
$$ 56 -41 182 78 -85 -271 -73 -20 -43 -149 -130 -104 -240 -24 151 -51 -122 -83 -179 -147 -48 59 -148 -266 35
5147C5p1k06J97j70J57LL2k65L13N5p6r1m5J30l5j79M00j23q1P7R4o3P6j91K72
$$ 35 -36 -242 -45 -215 -58 -55 -23 -288 25 80 4 -87 -132 -2 -37 -216 184 61 -20 57 151 88 164 -27 245
5172B45k10Q3k12J32M1Q7j82J39k26L13o4j54j60J86k04J29R7k5J26r4J74l03
$$ 245 35 118 -94 38 79 166 -16 123 -103 210 146 -8 -168 18 -186 -57 40 15 141 47 221 -82
5194h2J92j26k7qP2Q8L9k95j3K46j42RO9L11m52L4J00m9N1K84n03L23j73R8l1
$$ -82 110 -16 -43 -51 21 109 148 -147 -160 86 -56 -47 22 333 -119 -85 15 -34 17 301 -202 121 -52 46 15
5219A5j42Q3L11n7j68j05J74l81L10k0kr7M7l3J4j91K38l7j82L30k34Q4J15l43
$$ 15 -127 -44 267 210 42 -63 111 -270 40 20 18 -79 -32 -65 -51 -242 -4 -41 -223 107 -127 -43 72 -271
5243b71M82k87j17K38k20K56Q9J21k25l6Rk62K72P6l04J21J24j09J64mL4j0J43
$$ -271 211 -76 -193 45 -175 81 170 291 66 30 39 -223 49 125 -179 -58 66 -43 121 117 151 141 284
5266B84n2l21M8r7J3K43k50Q5J6K7J97Nl76J25M4Oj00o9J16q2R5k9K37l1j33n3
$$ 284 232 -89 -41 -138 -125 118 -132 -47 -31 -4 193 198 -178 -53 -9 -3 -103 -172 -56 -138 -43 -72 165 134 1 -52
5292e2P5J06lm20L60k31J67j20Q0J4q8J93J32jl47J90k00K09k43M19l69J51J3
$$ -52 23 129 126 -294 66 -165 2 -118 -38 -24 -112 81 213 212 -135 55 -145 64 -179 240 -129 22 35
5315C5k4M5k43j2J82L1p3l4L63l35J30j25J07N6k0k1q8Qj1q7K15l4p0o0J58j82
$$ 35 11 56 -187 -199 -17 14 -59 -93 270 -65 65 -60 47 103 83 62 -26 -18 -29 -116 99 65 -5 -65 93 -89
5341h9qJ68k31J94j1J36j13l9k01L26k41m6M8O1l4K50l15l6K5J04j65J40j30K71
$$ -89 -97 71 -160 34 23 159 46 7 -194 132 -109 -155 -107 -46 -80 170 -145 -181 -156 -52 -217 -77 -207 64
5365F4J86j84m0n6N1j49K00J43l28J36k19K31m2j13K16j16J36K30n29R2J50R2
$$ 64 250 66 26 -30 21 -128 72 215 -113 23 -196 35 -7 -120 96 -20 116 346 -183 -91 59 151
5387A51k98M0M9O6M8p4o8Jp4L25q1k53J47j66K73k09J90j33P8q8m5n0J53j01O0
$$ 151 -147 -107 -58 8 56 -18 -86 -85 -159 166 85 -168 -21 -187 86 -123 67 -66 12 -76 -121 -171 -18 -119 -59
5412e9r3J3K12k4l0J16O1l3k86O9J28l02N17m54K72j5k19K14J7K9k17o3K21J92
$$ -59 -152 -139 73 49 19 135 196 163 -123 -54 74 -228 289 -165 107 92 -127 87 104 133 -84 -147 74 266
5436B66K3l87oJ1K09ll94K77J0LK81j11m31M16l27Q3K9k50K73J0R1j69Q7M07n31
$$ 266 289 -98 -104 -93 116 113 -281 -4 6 9 290 179 -252 164 -163 -80 -51 -301 -28 -18 73 -96 -9 398 -133
5461a33nL04k57J00j85j5J99m6J4r1j31J39k16L21j29Q9L9r4j5Q6K81k37J63k17
$$ -133 -138 166 -91 9 -176 -191 8 -38 -24 -115 -246 -107 -323 -2 -131 -42 -3 -97 -112 -26 255 18 181 -36
5485c6k95K06J08L37k26m35K45j01K00j20nO2o3K22K5Q9l09j52Q5qQ3K11K6j51
$$ -36 -331 -125 -17 320 94 -341 -96 -197 3 -117 -122 -60 -123 99 124 213 -96 -248 -163 -171 -88 123 149 -2
5509bl57K07J15J24J9O4j32m5J7K5n1j22J45j74KL40j76J98k93J49L11k63l38
$$ -2 -359 -152 -37 87 106 170 38 -7 10 35 -16 -138 7 -167 -165 175 -1 197 -96 53 364 101 -237
5532b37K49J23k8k48P2J72j19L24k91J95n5j50ql2N4J1K0k51J11J11K94j11j24
$$ -237 12 135 107 -141 -69 103 -16 308 17 212 157 7 -1 -33 21 32 52 -199 -88 23 317 206 82
5555H2J03j73J7q9j5J01l2m3o3r2K4K35Q9O6j19j93J55m83N04m5Q4l14L42oo6
$$ 82 185 12 29 -60 -75 26 -6 -49 -112 -204 -180 55 144 210 91 -102 53 -430 74 29 113 -201 141 135 69
5580F9p7J85k80o1N6J99J1j95J10j37k7J26M6jO4k9N4k17K37L3l81N30m50j9j6
$$ 69 -8 177 -103 -164 -108 91 102 -93 17 -120 -147 -21 25 24 88 59 113 -104 133 166 -215 315 -135 -154 -170
5605a70J87Q1l22L23j19m8K37k64M3p1m3J64j38Q5k8K6N8p2J51j47L9O2K88k54
$$ -170 17 98 -224 99 -20 -68 169 -95 -52 -123 -166 -2 -140 -55 -83 -57 1 -71 80 -67 -28 34 322 68
5629F8m8l73L54ok6j19K31n7j84J3n9J37j63J07j4m5M5K29k99K52m8o5l7J22P1
$$ 68 20 -353 1 -5 -31 -150 81 24 -160 -147 -206 -69 -232 -125 -139 -184 -139 90 -209 43 -5 -70 -107 15 86
5654H6j81J96mm2p9K39o6l33K5J53k45M86k76M7J78j59J16l28J9L35l79J23J51
$$ 86 -95 101 97 55 -24 215 149 -184 -159 -6 -251 235 -41 6 184 25 141 -187 -168 167 -212 -89 62
5677F2J6j73J99p2p9L31l03O1N6k13K24M1j81K21j80n7O7o4J03Lk00pJ15K67l13
$$ 62 78 -95 104 32 -47 284 -19 42 98 -115 109 150 -31 190 10 -47 20 -44 59 62 -138 -145 -30 237 -76
5702g6M51l37l55Q3K43j0j67J50J68j89J04n0j24M03l41p6mQn7K91j11J15l12
$$ -76 375 38 -317 -234 9 -1 -168 -18 150 -39 65 15 -109 294 -47 -123 -127 -119 -176 115 4 119 -193
5725a93K97k83O1J38k1%j27l2L42k91K78k07J11%k18K1L27p5r9J37p6N6k55K23
$$ -193 104 -179 -118 20 -1 -1 -128 -160 182 -109 169 -38 73 73 -145 -124 203 128 29 166 90 146 -109 114
5749A14k96l2L53j55Kl5K0l1N9J49l13J64P8j36K9nj03J79J72k10n0q4J83k01
$$ 114 -182 -214 139 -16 -14 -49 -29 -60 -1 148 -165 -1 77 -59 -30 -35 -138 41 213 3 -47 -131 52 -149
5773a49L00n6J4J34l52K59q0n6j32J74J70k42o4J77l11O4P6J34P0l34q7K95M9
$$ -149 151 95 109 243 -109 150 70 14 -118 56 226 -16 -80 97 -214 -150 -74 60 130 -204 -291 4 53
5796E3k6%k74K0K02j29K97l68J20K04J31j41j92J01j61K10k14L41j50k24K57K7
$$ 53 27 27 -247 -227 -25 -154 143 -225 -105 99 230 89 -103 -2 -163 47 -167 174 24 -200 57 84
5818H4l0n7L08k76k6j90K09J39o9J1k17J98k04K59k72LL2J29k10K38j45K00J01
$$ 84 54 -3 305 29 3 -187 22 161 92 103 -114 84 -120 139 -133 -130 -98 31 -179 59 -86 114 215
5841B15k33O0K43l11r8J4J67Q8r7r7K71k95L0L01l55K73k78J19j50K33k47J80
$$ 215 -18 42 285 -26 -124 -110 57 145 48 -49 222 -73 -43 258 -97 176 -102 17 -133 100 -147 33
5863C3k15K0M12k77j17N6J82j29r2j01L10j05J50j97N8j83J67M5J62k15j52J08
$$ 33 -182 -162 250 -27 -144 -88 94 -35 -127 -228 82 -23 127 -70 -12 -195 -28 17 179 -36 -188 -80
5885h0J97p8j17pK14k36J1L63r3m89K88L5q9oK8K64k69k78K01J85Nj59J66N9R2
$$ -80 117 39 -78 -85 129 -107 -96 267 174 -315 -27 8 -81 -87 -59 205 -64 -342 -141 44 49 -110 56 115 207
5910B07k02Q2K27m31L2k5J19J34j74K8nJ62l99K72L1k83J25K70k54P9M22o00L66
$$ 207 5 87 314 -117 -85 -110 9 143 -31 -3 -8 154 -245 27 58 -225 -100 170 -84 -5 417 -183 183
5933A83l97K29J06l51J27K99j14j47K24N7k44j56K75j4M2j73l2K88m34o8N53l
$$ 183 -214 15 121 -230 -103 196 82 -65 159 216 -28 -184 91 77 119 -54 -86 202 -232 -300 253 250
5955B50m64j4L66p2k33J55J43j60k8KL1O9R9j81J81m40K66j14K88l77L54J42l49
$$ 250 -214 -228 138 66 -167 -12 131 -29 -57 -55 -24 45 144 -37 144 -296 -30 -144 144 -233 121 263 -86
5978h6K6qJ76j3r7K6J13k08J99l2j22J0k3J46J01j12m3J45K7m07L40j03J88k92
$$ -86 -60 -68 108 95 -2 24 137 -71 128 96 -26 -16 -39 107 208 96 53 198 225 -182 158 55 243 -49
6002d9J44O7j14q0J85J00n87M71m17K48J3J57J7m3j56j11M11k01K30j83J88l05
$$ -49 95 162 48 -32 153 253 -334 137 -280 -32 -19 138 155 112 -44 -155 256 55 285 102 290 -15
6024a5J60oJ03k38j85N00m69k43L88O6J71l94K09K03k37l8j74J86J94k19J05r2
$$ -15 145 139 242 4 -181 319 -150 -393 -5 61 232 -162 47 250 13 -25 -199 -13 181 -38 67 -25
6046b5J07Kj66Rj1O7K16k88L8j19K05j46J79j13J50l65J07l8K17n5o8Q9K19m11
$$ -25 82 84 -82 -73 -84 -17 199 -89 -51 -170 35 -111 68 -45 105 -260 -153 -191 26 -29 -97 -8 211 -200
6070b00l0L27j35k42K76m7r1J82j1p5m6n0L02l3k94J22K21k51l9J4J48k29J65
$$ -200 -230 97 -38 -280 -4 -51 -142 40 29 -46 -92 -142 160 127 -167 -45 176 -75 -114 -100 48 -181 -16
6093a6l0K92L0l97L91k85j44J85o7l0R9k09K55k2j70l7J20j33J12J2J58M1m23
$$ -16 -46 246 276 -121 270 -15 -159 26 -41 -71 28 -181 74 52 -118 -155 -35 -168 -56 -44 114 155 -268
6116b68M1K52J57k06j72M54l20j15J05J96m2J5k51J61j05k7K13J9j14n3j9P5l4
$$ -268 -227 25 182 -24 -196 258 -62 -177 -72 124 82 97 -154 7 -98 -125 88 107 -7 -60 -79 -4 -38
6139c8oJ70J37n14K63j42q5J7j28J75m0L41k63l4O0J21k5R6m8l4J17m8J79j87
$$ -38 -44 126 263 -251 12 -130 -215 -198 -326 -151 -191 150 -113 -147 -87 34 9 105 57 23 140 92 271 84
6163H4k19r4J66k09K64J9n6M3j08K20p6J91k75M9J60j24k0k34J83MJ58n3l7j5
$$ 84 -135 -229 -63 -272 -8 11 -45 -2 -110 110 34 225 -50 -1 159 35 15 -219 -36 -32 126 73 36 21
6187B1J57j44J18j94R6o6J99k19Q0rj63j49N7M30k16J60K5J45n26J45O8P3k34
$$ 21 178 34 152 -42 54 -12 187 -32 48 39 -124 -273 -216 214 -2 158 183 328 -198 -53 15 88 -146
6210a46J78J76q3j35J29mNk63K29k8k24k1J18JK84k06k5Q6mj17J93j89j14M8L06
$$ -146 32 208 125 -10 119 115 120 -143 86 58 -166 -187 -69 -68 216 10 -15 71 67 -50 143 -46 -160 -112 194
6235A94k65qN5K4K50l37l1K97j24r4O9J14k21J35j56O3K32m6l81K68l1J55k76
$$ 194 -71 -79 -24 0 250 -87 -118 179 55 -39 30 144 -77 58 -98 -35 197 151 -230 38 7 162 -114
6258a14J1n0j5J39J20J83l13N2o7L11j31mk00kPo0N16m55J25J24R0k74J34j00
$$ -114 -103 -153 -168 -29 91 274 -39 13 -54 257 126 122 -78 -80 -73 -133 383 -72 53 177 267 -7 127 27
6282B7o6J52j39M00k05j19O8l70K57J36J2l83L72p2k0j68r9K44nN6k17N2Q7L55
$$ 27 -39 113 -26 374 169 50 118 -252 5 141 153 -230 142 70 50 -118 -217 27 22 78 -139 -87 0 355
6306C55m45M8r8K80l6k18K80k52K08j90J63kj96J31j27K14J7M5k40k92K96N6J85
$$ 355 -90 -42 -140 140 104 -114 166 -86 122 -68 95 93 -103 28 -99 115 132 177 -63 -355 -59 -3 182
6329A82m80L61j2O8Q1p2J5m5j25K61m35K05k98K52m9N9q8K86Q2j41k02K5K5J40
$$ 182 -298 63 51 119 200 128 143 98 -27 234 -201 4 -294 -42 -91 -32 -120 166 248 107 -95 -70 -45 95
6353I5N1j20j82L7J00Pj6J25J61j23l5L7l44L80r5j33L4l0r4n9L67r9J60l96K50
$$ 95 146 26 -156 -119 -19 -12 -28 97 258 135 100 137 -207 173 78 -55 -21 -51 -145 -204 163 64 224 -172 78
6378G8j22j8o0J36pq0K38Ml09M8J43k23J76J25k60j6J55p0L1J28j62n3Q7J04j17
$$ 78 -44 -62 -122 14 7 -73 165 169 -140 -92 51 -172 4 129 -131 -147 8 -62 -31 97 -65 -118 -31 73 -44
6403d4K3J20k00J46k08K10R7o2j36L5j79J23R4L0M3j55j37L25n4o0Np1J14j43
$$ -44 -21 99 -101 45 -163 47 144 82 -54 -19 -198 -75 19 49 92 -63 -200 125 71 11 16 -55 59 -84
6427h4K12r5N4l18L96j17R5K1k91J49j4j44M2m1K58l06M47j15j65k76J67Pj78
$$ -84 128 33 87 -231 165 48 143 164 -127 22 8 -136 -94 -135 123 -183 264 149 -16 -292 -125 -118 -296
6450b96J30J51k47J54l2J06K3p3j19Q4J57N1R2k4k10L23k47M0q2K25J20l55O4
$$ -296 -166 -15 -262 -108 -140 -34 -11 -84 -203 -119 38 89 181 157 -53 270 23 63 -19 206 326 -29 35
6473C5n3j61K22l25L08J34m10L43k86M5J3p8N2L33k64l1J80m0k9J68j78L63m42
$$ 35 -18 -179 43 -282 26 160 -250 93 -193 -148 -135 -213 -161 172 -92 -123 57 17 -12 156 -22 341 -101
6496a01M5J74q5J13j56l1J8j73Q5J1l5%J03oM5j71J69j61M33k82l47N82l42j04
$$ -101 -56 118 33 146 -10 -41 -23 -196 -111 -100 -135 -135 -32 -38 7 -164 5 -156 277 -5 -352 230 -112 -216
6520b16J85J60m9P7Pk14J67j12Q1n3m19P27k48j62N8J28L6K79m73j55K3l1K45
$$ -216 -31 129 80 157 164 -50 117 5 86 33 -386 341 93 -69 -11 117 153 432 -41 -196 -173 -204 41
6543D1R4j26K21j06n0k7m6K84l58J78J9j10j10L68l23Q6j29J99J06R6j62m65L18
$$ 41 135 9 230 124 74 47 1 285 -73 105 124 14 -96 272 -51 35 -94 105 211 307 145 -320 -2
6566bj90K05K66k06j72K57k39m8k4O9j19L28j48J02l53K65O9k39J00K46k18J87
$$ -2 -192 13 279 73 -99 158 -81 -129 -153 -84 -203 125 -23 79 -274 -9 60 -179 -79 167 -51 136
6588A36M7j89L13j59j03p3J10J10j95j63J01Q9j74j38J14P2qlK69l79J91K49k21
$$ 136 183 -6 307 148 45 -28 82 192 -3 -166 -65 24 -150 -288 -174 -102 -110 -113 156 -223 -32 217 -4
6611dJ1K51l40l8O4p9K84k29j83N3J27J35j75P4J16r7p5KJk5M3J22J05j29K64
$$ -4 7 258 -82 -120 -56 -135 149 -80 -263 -210 -83 52 -123 -49 67 -30 -105 -103 -102 -127 -84 38 143 14 278
6636B78k00M0k23P8J09l17M42j33J5j25R8m1j22L18r4L3k28O7K9j48K0P3J70j80
$$ 278 78 118 -105 -27 82 -235 207 74 89 -36 62 21 -101 217 123 156 -72 -5 24 -124 -104 -31 139 -41
6660d1k3l7J85m6lj96R9J37L2j53J68j06j64KJ37J28oM7k12L32l01j08L47l92
$$ -41 -64 -101 84 38 35 -161 -62 75 107 -46 122 16 -148 -146 -9 119 113 160 -52 280 -21 -129 218 -174
6684a74J47J05J05j28j25n8K23N8j65O7Lj62L7J7j20K37o9n8J04k61J59J43l2
$$ -174 -27 78 183 55 -70 -128 95 153 -12 55 58 -104 -67 -50 -170 67 -2 -60 44 -217 -58 85 53
6707E3j53RJ66Lj4o3J75m54L14j64J4L8J4j16L67k13j94J48L31m83K07L65o91
$$ 53 -100 -91 75 78 64 1 176 -278 36 -128 -114 -76 -62 -178 189 -24 -218 -70 261 -222 -15 350 -341
6730c41L43J02j50p4J72q5K53m76M35K9j02j12J87qk85J41j85J76M6j47j22K63
$$ -341 2 104 -46 -120 52 -33 220 -256 179 208 106 -6 181 173 -112 29 -156 20 66 -81 -203 60
6752F0P2j85j15Q8j07L03J87l15O2j12O2J30k44N8p4J16k0q6r2K06K1k23q9M04
$$ 60 132 -53 -168 -80 -187 116 303 -12 50 -62 0 130 -114 -56 -130 -14 -34 -120 -212 -6 15 -208 -297 107
6776A07M6q1o0l32M61j45J04l34J48j35J14L04m6Q0l10L3j18K10k36P5o3L55q9
$$ 107 153 72 12 -320 141 -4 100 -234 -86 -221 -107 197 151 231 -79 -46 -164 46 -190 -115 -178 177 88
6799H8P6j06k75J91j58L1L00k54R7J20o3O7k76J31l16L48K75j39l12K54L5J85
$$ 88 164 58 -217 -26 -184 -153 147 -107 -10 110 47 114 -162 -31 -347 1 276 137 -175 79 114 299
6821B99l72K9QJ00j4q7L23k52R8l06J27n4M2Q9R1m6j6N2j64l9PJ37q8K7K01j51
$$ 299 -73 -44 -36 64 50 -37 286 34 132 -174 -47 -101 -59 30 121 75 59 111 -53 -92 -85 52 -36 -9 192 41
6847D1j85M8J8K53j32J13l02J74k5k00J59J2o2O2K51j89k46L09n8j08j90J36j64
$$ 41 -144 -96 -78 175 43 156 -146 28 3 -197 -38 -26 -88 -26 225 36 -210 99 41 -67 -257 -121 -285
6870b85J16K19j61J95j35j98K25r9j53P8N4L28j14r0J31j57J97n3J85j67k75J67
$$ -285 -169 50 -111 84 -51 -249 -24 -123 -276 -198 -144 184 70 -20 111 -46 151 98 283 116 -159 8
6892Hm6Mj09k3R1J24j44p9L33j36J27J5k03J79j16j01P4J23m0j62N9j47L85k27
$$ 8 -38 -34 -143 -166 -75 49 -95 -174 159 23 150 165 -38 141 25 -76 -2 121 81 -81 -22 -169 216 -11
6916a1K71m29Q3J20J24j86n6R8j7M4J33p6k54N3j6l2o8J69k0k15N08j89m5MJ44
$$ -11 260 -169 -86 34 158 -28 -84 14 -3 41 174 98 -156 -103 -119 -151 -219 -50 -70 -285 223 34 -11 -7 137
6941A37l01M43j99M9J92m26M2j05J65J60k36J93k16M8%j7J88R8l57L7O3K67j49
$$ 137 -164 279 80 129 321 -105 -63 -168 -3 157 -79 114 -102 -54 -54 -71 117 215 -142 -105 -42 225 76
6964G6k41m7J67Q8k4K25l18K18l08J84n1M0p3J28j28P6J03J87l16kk4j18M81n65
$$ 76 -165 -212 -45 43 19 244 -74 144 -164 20 -31 9 -64 64 -64 12 115 302 -14 -16 -40 -158 323 -242
6988b42K29q8j39J97J10j23P1r4O5j25J87K7l3l0Q8k02OK22Q3k22k32K42l5J85
$$ -242 -13 -101 -240 -43 67 -56 15 -79 -14 -139 48 75 42 12 100 -102 -96 126 209 -13 -245 -3 -38 147
7012A47o1j66P2j22P0k0m0N3j51L40N2j72j0J83K7l84R3K25k13Pl5P4K09l16m
$$ 147 86 -80 -8 -130 -60 -80 -120 -67 -218 122 174 2 -8 175 202 -182 -89 136 -77 -70 -105 -31 178 -138 -142
7037a42J67q0K38j41p2J42j71J40k58J71N7O1K11n14J50J57k87J0Q7J11j83J44
$$ -142 25 -55 183 42 -30 112 -59 81 -177 -6 51 112 323 -191 -41 116 -171 -161 -74 37 -146 -2
7059bj0m6n1J69o5n6K91j65o0j3r7N9J07j49J46j07J9m0R0k96L29rJ3k17q7L08
$$ -2 -12 -58 -109 60 -5 -61 230 65 5 -8 -105 -46 61 -88 58 -49 -30 -70 20 -276 53 44 57 -160 -247 61
7085F1K20k59o1n3Q5m0L5J34K8k98K34j73K2j21J4K03L83n31N3K2OJ12jj54j8
$$ 61 281 22 -39 -92 -7 -47 -12 122 150 -148 86 -87 -65 -186 -172 31 414 -117 -64 -42 -36 76 75 -79 -97
7110i7K23j87RMO8j21L8q5J94k3J46j85J27j31j37P5p3O3p9J35K1m1q2j6rJ01
$$ -97 126 -61 -52 -48 20 -101 -63 -148 46 23 169 -16 111 -20 -157 -82 -155 -92 -171 -36 -15 -56 -138 -154 -163 -62
7136f2j42L60l03K38J77j14%k49K10j00l2l2M9j6r6k5K84l8Q1r3k6j91L70k23
$$ -62 -204 156 -147 91 268 154 154 -95 115 15 -17 -49 0 -16 -112 -137 147 109 190 97 71 -120 250 27
7160B7r9J07j17N2M3M2j44K00k31J23k65L88j30j65r2K47j00J27O2K4k22N7J5
$$ 27 -72 35 -82 -30 13 55 -89 111 -120 3 -262 126 -4 -169 -261 -14 -114 13 75 99 -123 -66 -51
7183e1q0n5L66j94n3J0MK16L9l16K37j35p9J7j8J29j81J03J26j23m8q9L1K99k76
$$ -51 -131 -186 180 -14 -67 -57 -53 163 202 -114 123 -12 -91 -74 -92 37 -144 -41 85 -38 -86 -175 -144 155 -121
7208a21M4L60l10k03K13J46q6J62j30J54j83j3J82j54k32q0L17j67J33q7J94k94
$$ -121 -77 283 -27 -230 -17 129 43 205 75 229 46 33 215 61 -171 -251 66 -101 32 -55 139 -155
7230a55M7K84j52L38l94P7r6O0K30l55K60n4j54N4Nn6n3J39O1k51r0K72j05n1
$$ -155 -108 176 24 362 -32 45 -51 9 239 -116 144 90 -64 -10 -5 -61 -114 25 86 -165 -255 17 -88 -139
7254a39K34j76R9K25l98J21J64j9q2p4j02Q8J03o6J14j75J30j73P5J0J07N9j6
$$ -139 95 -81 18 243 -155 -34 130 111 29 -45 -147 -59 44 -22 92 -83 47 -126 -51 -41 66 125 109
7277A09m31K42J43j05q4J22q1K09M9l01K48j91J12j09m4J29j43K79l12Q9J27j07
$$ 109 -322 -80 63 -42 -126 -4 -85 124 173 -128 120 -71 41 -68 -112 17 -126 153 -159 -70 57 -50
7299e0q6Q5p2N8r4J99J89r8r4J38k44m3J30j3O2l71L18k22J43j63L60J04m94J77
$$ -50 -136 -51 -123 -65 -159 40 229 131 37 175 -69 -112 18 5 67 -304 14 -208 -65 -228 132 236 -258 -81
7323h1J75Lk16K55j99M9n3K52j79j99K65o4mj49r5N44l30jP8j45q8P2K26p0k39
$$ -81 94 97 -119 136 -63 -14 -67 185 6 -193 72 8 4 -145 -240 304 -26 -27 51 -94 -182 -110 116 46 -193
7348a93J25l9K09%j41RQ9K9k39j66L73P1k87K51q3J12J14q0j27O1l73P6Q3j31
$$ -193 -68 -107 102 102 -39 -30 59 88 -151 -317 56 127 -160 91 8 120 234 154 27 88 -285 -209 -126 -257
7372b57J38J14J93j35k97K88j67K49k07l2J43J10K9m9l45K42O4l07J58j04J96
$$ -257 -119 -5 188 53 -244 44 -123 126 -81 -113 30 140 169 120 -225 17 81 -226 -68 -172 24
7393B4k85J87L33k06M2r3N2J6m76N09J20k50k9K02n9k41J7R4M4r1l4K34k08J33
$$ 24 -261 -74 259 53 95 2 54 70 -406 103 223 -27 -56 146 87 -154 -137 -43 1 -90 -124 110 -98 35
7417C5L6j94K14k50K52j79K3K6J23J2j01M5J54Lk23J83k09J95l26K42jJr7K28
$$ 35 71 -123 91 -159 93 -86 -63 -37 86 98 -3 42 196 199 -24 159 -50 145 -181 61 60 61 -36 192
7441A92j64q2o6rQ1N5J00J39j35j86m3K19j9M2q6k02J57p1K89j43k59J29Q8L65
$$ 192 28 -54 -120 -129 -48 7 107 246 111 -75 -118 101 82 124 38 -164 -7 -78 211 68 -191 -62 26 391
7465C91m14j1J25q9j15P9Pkk25K55o4l2l1K4K26k5j45R0k09J10K42k27M6jn1j80
$$ 391 -23 -34 91 2 -113 -34 -27 -29 -254 1 -63 -95 -126 -102 124 99 -46 44 -165 -55 187 -40 6 5 -46 -226
7491b26P8p2J03J92k24L09k49K82j8j03j20J02l7P0p5j0J03k21J50L2OJ5K6j52
$$ -226 -148 -220 -117 75 -149 160 -89 193 175 72 -48 54 17 87 12 2 105 -116 34 66 72 87 113 -39
7515c9J77r6M0j68M4J28M0k22J8n2Oj39K41K05j49j31L06j06k0k24M9Q7N8k52
$$ -39 138 42 82 -86 -42 86 126 -96 -78 -130 -124 -263 -22 183 34 -97 209 103 83 -141 -92 -5 53 -199
7539a99K8n8L67J03j37j87Q6J05l49K39j07K93M3m50K81k09J47k5p2K92j70r8
$$ -199 -171 -229 138 241 104 -83 3 108 -241 -2 -109 184 227 -223 58 -151 -4 -29 -101 191 21 -77
7561g7Q9J9K19k83m1mLr9P9L57k42nQ7k35j2L88j36j49R5J62j06j40K56k60m5
$$ -77 12 31 250 -33 -74 -78 -75 -174 -95 262 20 15 102 -133 -145 243 107 -42 53 215 109 -31 225 -35 -80
7586h0q2P7N48n46M04l33k4K5J18Nk46L37q2j02r1Q2J34m1o6N4j74N1J61o0k24
$$ -80 -162 -85 463 -83 321 -12 -36 -11 107 112 -134 203 121 19 -72 10 144 103 37 91 -83 -32 129 69 -155
7611a55K0k06K80JK08K5j53M1j26J8j9j69L83q7j56L30j77j82pK38J02j50M7m9
$$ -155 -135 -341 -61 -60 148 173 20 61 -65 -47 -66 -235 148 61 -95 235 58 -124 -131 107 209 59 106 57
7635E7m0j77j3J31J91j77K68l0n59K46J51j90J75p9J21K5k23p7K00Pj52L09j10
$$ 57 17 -160 -173 -42 149 -28 240 210 -349 -103 48 -142 33 -46 75 100 -123 -200 0 7 -145 164 54
7658E4N7k83M85j51j42j10Lj2k4K81k82J47j41K82j20k79L10k73O7J39PQ7J29
$$ 54 111 -172 313 162 20 -90 -87 -99 -123 158 -124 23 -118 164 44 -235 75 -198 -131 8 15 102 231
7681B31k83j53L50k54K12m9k89L88k49K13J12k29J32j85J48q5o3q4L3OJ98n4j63
$$ 231 -52 -205 145 -109 103 54 -235 153 -96 117 229 0 132 -53 95 10 -53 -137 -104 -98 100 46 -117
7704a17J12k24J69Q5J58j95J78J9M5J5k56J0n6J44k31K42k73l6J66L8R4j62l9
$$ -117 -5 -229 -60 25 183 -12 166 185 230 245 -11 -1 -57 87 -144 98 -175 -211 -45 -7 87 -75 -114
7727a14o5J95j44r0P8J78K26j98j57L07k85o8K06N8O0m13K51J40k17J61Kj6M6
$$ -114 -179 16 -128 -218 -140 38 264 66 -91 216 -69 -137 69 127 187 -226 25 165 -52 109 111 95 141
7750A41j32j38k77M46j45J85o2j9J39j12J9J63jk28J65j39r4n5M4J29k43K41j16
$$ 141 9 -129 -406 40 -105 80 18 -1 138 26 45 208 207 -21 144 5 -89 -144 -100 29 -214 27 -89
7773h9J01Q3k5J76m7k30K58l08J31k66m9M82j49n9K28Nj96q7J52l38K10J77j70
$$ -89 12 95 70 246 199 -31 227 -81 50 -216 -265 217 68 9 237 242 46 -41 111 -227 -17 160 -10
7796a0J7J49o2k00K87J10k12N9j93J01m5N3p3P7J79j56l68M97k98R8M7k50J07
$$ -10 7 156 94 -106 181 291 79 138 -55 46 1 54 -19 58 237 81 -287 210 -88 10 57 -193 -86
7819h6J21J34k97K55n0j8j24R4k41L25j26k4k20L63k15Q4N1j08J74j21P6j54M13
$$ -86 35 169 -128 127 77 59 -65 29 -212 113 -13 -37 -257 106 -109 -25 26 -82 92 -29 47 -107 306
7842C06j47oj50p8J4K80q1j40q2J57j99L8J78p4L8j94j5m3K5K32j35j42L10k05
$$ 306 159 153 3 -75 -61 219 138 -2 -84 73 -126 -88 90 16 54 -140 -155 -198 -173 59 -76 -218 92 -113
7866a13M5m8J22r6L21k97J71j06k41K69j71L3K44J37l87J59jj42O2P1j05L12k43
$$ -113 -68 -116 6 -90 231 -66 105 -1 -242 27 -144 -111 133 270 -117 42 41 -101 -39 32 -73 239 -4
7889dJ5k63R5K57L3j32P8j72Q4l7K56j08q4N1q8J70n3j02M8M6j6k2k56KJ69j60
$$ -4 11 -252 -157 100 133 1 79 -93 -9 -46 210 102 18 69 -19 151 98 -4 44 90 74 52 -204 -202 -33 -193
7915a93oK44k5J58k27L6n1K2K4l09L08J37r3j93O4J54k52J35J77m19J61J48K55
$$ -193 -199 45 20 178 -49 -13 -64 -42 -18 -327 -19 118 25 -168 -104 50 -202 -67 110 -309 -148 0 255
7938B55l23k3Q1q7J41J75L2l54Q9q7K28J26k47J69j06J07j03j94P5p2R4j31J10
$$ 255 -68 -91 -10 -97 44 219 251 -103 -14 -101 127 253 6 175 69 176 73 -121 -46 -118 -24 -155 -45
7961d5k4J27O5k16K57k28n2P3n8K13r4Qj70K65k17M4n6rL76j19l11K25J41j06
$$ -45 -69 58 123 -93 164 -64 -116 -43 -101 112 18 26 -144 121 -96 -52 -108 -117 259 140 -171 54 195 89
7985H9k18J6R8J41j77nJ52q4k5J46k57J22J42j50P7R8k11J29k18K51k72J77K22
$$ 89 -129 -113 -15 126 -51 -56 96 12 -13 133 -124 -2 140 -10 67 165 -46 83 -135 116 -156 21 243
8008B43l61K5K83m85L78j04p9o0J32k29K91P4j68j22M7L56m49K06NJ84k77m5P9
$$ 243 -118 -93 190 -295 83 -21 -100 -160 -28 -257 34 108 -60 -182 -135 221 -228 -22 -17 167 -110 -155 -76
8031g6J55L0J03k19k90J84J56o0j94Q4M4P3j23K36k56K00L3L0k16R8K8K1k50K50
$$ -76 79 109 212 -7 -297 -113 43 -17 -211 -127 -83 -10 -133 103 -153 47 80 110 -106 -8 20 41 -209 41
8055D1Q8o7j30k21K88l0j94M38l21R5q9k4J71p4q1K70j24J36J10k66J51l20J83
$$ 41 129 62 -68 -289 -1 -31 -225 213 -108 -13 -102 -126 45 -29 -110 160 36 172 282 16 167 -153 30
8078C0p7n6Ql8K0N6L5Q0n3n4J04o3m0j29K2K01K2J92k70M5J25k03L1N2o1n2j22
$$ 30 -47 -103 -95 -133 -113 -57 -22 58 5 -49 55 -8 -48 -177 -155 46 68 260 -10 35 160 -43 -12 40 -21 -73 -195
8105a95J32j24L37R2k78J67k78J48L13k84M9K05l95K73k6k37J31N1J36l64J95
$$ -195 -63 -187 150 242 -36 131 -147 1 314 30 79 284 -111 162 136 -101 30 81 217 -147 48
8126D8P3j28K0kQ0O9k59J60O9k88pK60l6j01j02J22j45K68k84K77j73L8K78l39
$$ 48 121 -7 13 11 91 160 -99 61 130 -158 -165 95 59 -42 -144 -22 -167 101 -183 94 -79 -41 237 -102
8150a02L9p7R8k38K95L04l32p7j79M03j11M45o42J60j69K16o6K76j81P7j57j44
$$ -102 -63 -140 -42 -280 15 319 -13 -90 -269 134 23 468 -174 -14 -183 33 -33 243 62 139 -18 -162
8172a62J04O7j59J14o9PK39l15M90j18l65J8L22j76JPk6o3m4
$$ -162 -58 9 -150 -36 -105 -98 141 -174 316 198 -167 -149 173 -3 -2 5 -21 -84 -128
8191a28
$$ Imaginary data points
##PAGE= N=2
##DATA TABLE= (X++(I..I)), XYDATA
0@%%%%%%%%%%%%%%%qJ6j6J6k0K8l2L5m3M8n6O8p6Q8j04J20j36J53j72J92k16K44
$$ 0 0 0 0 0 0 0 0 0 0 0 0 0 0 0 0 -8 8 -8 8 -12 16 -16 19 -24 24 -32 36 -40 48 -56 64 -72 81 -91 101 -115 129
37A29k73L06l42L77m17M63n13N68o27O91p61Q39r25J018j123J239j368J514j676
$$ 129 -144 162 -180 197 -220 243 -270 298 -329 362 -399 440 -485 533 -590 649 -719 795 -881
56h81J861k074K325k622K981l424L984m723N746p258R712j4353K6087j09211k18305
$$ -881 980 -1094 1231 -1391 1590 -1834 2150 -2573 3173 -4085 5627 -8726 17361 -91850 -310155
71c10155K47687K29653m1333j19763k7707J7213Q8710Q0000n5807j48934l6621
$$ -310155 -62468 167185 125852 6089 -21618 -4405 84305 164305 108498 -40436 -77057
82g7057J22499J07992q9681j70667p354J35068M4929p3011o7567k2395K0325P5364
$$ -77057 45442 153434 63753 -106914 -114268 20800 65729 -7282 -74849 -97244 -76919 -1555
94a555L0000r5427p9986R0119J33038q011r1038k1859M3575M6230K8953j7237
$$ -1555 28445 -66982 -146968 -56849 76189 68178 -22860 -44719 -1144 45086 74039 56802
106E6802o3129j2592Q2584O5184n3975j05628j5762Q0919L4599o8684n7361J3916
$$ 56802 -6327 -18919 63665 128849 74874 -30754 -46516 34403 69002 318 -57043 -43127
118d3127J4014L379K4313j5410o1895J1754Q4762J2639p4608l0378N4651N1597
$$ -43127 -29113 -25734 -1421 -16831 -78726 -66972 17790 30429 -44179 -74557 -19906 31691
130C1691n192k2808M151J4146P816J9392N143m6222l1518M6706M5051l7867n5171
$$ 31691 26499 3691 7842 21988 29804 49196 54339 8117 -23401 23305 68356 30489 -24682
143b4682N032K6851l660j6222o512j1457j0794K0157K5376k3109l5846K5252N0217
$$ -24682 -19650 7201 3541 -12681 -19193 -30650 -41444 -21287 4089 -19020 -54866 -29614 20603
156B0603o537l4880M552K3870K561J117J3732l751j7940J2492L4585q488m6375
$$ 20603 14066 -20814 -16262 7608 10169 11286 25018 21267 3327 15819 50404 41916 -4459
169d459p259L3830Q95l3156o884J3595p223r342J5051L147k7154p372L4064J4250
$$ -4459 -11718 22112 23007 -10149 -17033 -3438 -10661 -20003 -4952 -1805 -28959 -36331 -2267 11983
183A1983l1505j5943L0065J7950j5520K34J8405m732j1521J6185J4543j9440j5723
$$ 11983 -19522 -35465 -5400 12550 -2970 -2736 15669 10937 -584 15601 30144 10704 -5019
196e019K0043J6887k0611k1964J0499J1875j5490r945J1088l853j8316R642K1961
$$ -5019 15024 31911 11300 -10664 -165 11710 -3780 -13725 -2637 -6490 -24806 -15164 6797
209F797j2309k1426J3925K2811r643j5888J0917J1999q721k443J6979K986j5774
$$ 6797 -5512 -26938 -13013 9798 155 -15733 -4816 7183 -1538 -3981 12998 15984 210
222B10L145K0617l926k3301L1J8361l903j8948K607J0501j0603j1209J4304Q036
$$ 210 3355 23972 20046 -3255 -3224 15137 11234 -7714 -5107 5394 -5209 -16418 -2114 5922
236E922j8475n892J9415M084j8645j781J8074J579j1779M235J1984m446q670R024
$$ 5922 -12553 -18445 970 5054 -13591 -15372 2702 4281 -7498 -3263 8721 4275 -4395 4629
250D629J0792r987r782J2792J1113j4369j1578J0933K733j4712j297J2748m594
$$ 4629 15421 5434 -4348 8444 19557 5188 -6390 4543 7276 -7436 -8733 4015 -579
263e79j3279O805J2174p918r820R486R972p739q642P084N916p682k328J2489M051
$$ -579 -13858 -7053 5121 -2797 -12617 -3131 6841 -898 -9540 -2456 3460 -4222 -6550 5939 9990
278I990j1401M37J4077j942j5103K370J1286o963j0575P489O814j0058n287R634
$$ 9990 -1411 -974 13103 11161 -3942 -1572 9714 2751 -7824 -335 6479 -3579 -8866 768
292G68K226r659q13J0048J115r706j119Q571R80p469K623Q935l494q802O225Q131
$$ 768 2994 -6665 -7478 2570 3685 -6021 -7140 1431 2411 -5058 -2435 6500 3006 -5796 429 8560
308H560q222n418J1201M468j0488k631P581j839q888J180O379l389n461M291O743
$$ 8560 338 -5080 6121 10589 101 -2530 5051 3212 -5676 -4496 1883 -1506 -6967 -2676 4067
323D067l311n586M150N352m762n002N565L667p428k447Q691J401p280K424Q361
$$ 4067 756 -4830 -680 4672 -90 -5092 473 4140 -3288 -5735 2956 4357 -2923 -499 7862
338G862l291p703L165M959m991m417M497K620n085j643M194J162m669q17N961
$$ 7862 4571 -3132 33 4992 1 -4416 81 2701 -2384 -4027 167 1329 -3340 -4157 1804
353A804J412m674k54N435j035o040J601N010l417l914M834L430m815j852N387
$$ 1804 3216 -1458 -1712 3723 2688 -3352 -1751 3259 -158 -4072 762 4192 -623 -2475 2912
368B912J608m881k09L450k160m791P17L242j115k509K825L629j720k610K710K301
$$ 2912 4520 -361 -570 2880 720 -4071 -3354 -112 -1227 -3736 -911 2718 998 -1612 1098 3399
384C399l283k374L239J741l950m76L757k85m295J236M411j913l055K344K373l457
$$ 3399 116 -2258 981 2722 -1228 -1704 2053 1768 -2527 -1291 3120 1207 -1848 496 2869 -588
400e88j707K273%j873p88K178J82j897L77K184J660j979M42K619q34l307N36K277
$$ -588 -2295 -22 -22 -1895 -2683 -505 -323 -2220 -1843 341 2001 22 464 3083 2249 -1058 -522 1755
418A755k430j782L141J394k439J24K870j130k197M75J098j308j397J01J90J38
$$ 1755 -675 -2457 684 2078 -361 -237 2633 1503 -694 -219 879 -429 -1826 -1725 -1535 -1397
434a397j239O69K028K79p85J048J944j388j291J603J59k317N07J863j148j588
$$ -1397 -2636 -1967 61 340 -445 603 2547 1159 -132 1471 1630 -687 -180 1683 535 -1053
450a053Q72J226n40m90Q86J42m67j107O0n73q99q08Q49R30k16M31J505J12p58
$$ -1053 -181 1045 505 15 901 1043 576 -531 -471 -1044 -1943 -2751 -1902 -972 -1188 -757 748 860 102
469A02Q46J161p58j193P76O7j322n2N16j87m5O03J160n79l76p06k26M51j006q03
$$ 102 948 2109 1351 158 934 1001 -321 -373 143 -44 -89 514 1674 1095 719 13 -213 238 -768 -1571
489a571Q5j1p28M86J030K36k36M67R49L11j31K75m06p45M7M68J7q3M59l14q2L91
$$ -1571 -1486 -1497 -2225 -1739 -709 -473 -709 -242 707 1018 887 1162 756 11 58 526 543 460 919 605 523 914
511I14j6p22j2M70l58q49l29j092o49R15K36r6J021O01l67Q75R47p26j95K88o29
$$ 914 898 176 164 634 276 -573 -902 -1994 -2643 -1728 -1492 -1588 -567 34 -333 542 1489 763 568 856 227
532B27j16O58j76p04O05Q0j17Q31L49n60k58k06r96o08n44n19p5P45M61l60O53
$$ 227 111 769 593 -111 494 574 457 1288 1637 1077 819 613 -383 -991 -1535 -2054 -2129 -1384 -923 -1283 -630
553f30Q0j81Q83N04J99J95n29J87l76J37j64l24O97N36j33M3k37m24o25O95k25
$$ -630 -550 -731 152 656 855 1050 521 708 332 469 305 -19 678 1214 1081 1124 887 463 -162 533 308
574C08p34m11o69q10J26P43j86O86J120M91k07M94j33j111pO38l60P25L13p03
$$ 308 -426 -837 -1506 -2316 -2190 -1447 -1633 -947 173 664 457 951 818 -293 -300 338 -22 703 1016 313
594C13M2J152o70k62N78po57J70o70j024n39j07n0P66P4o22K12R60o86P21J108
$$ 313 355 1507 837 575 1153 1146 489 659 -11 -1035 -1574 -1681 -1731 -965 -891 -1513 -1301 -341 -1027 -306 802
615H02K57l86O90o59p33M47j96k48J132L65m68N30o9q55LQ7j672k16L51n80p89
$$ 802 1059 673 1363 704 -29 418 222 -26 1106 1471 1003 1533 1464 609 612 699 -973 -1189 -838 -1418 -2207
636b207O67N44j247O91J620L43l89N80K7m24j42J92L23L69k24k37N01L35p84r8
$$ -2207 -1540 -996 -2243 -1552 68 411 22 602 629 205 63 255 578 947 723 486 987 1322 538 440
656D40J113k16j170M12j23j824n90J026p76o42R69N27l25N24Q35j64K91q6lM30
$$ 440 1553 1337 167 579 456 -1368 -1958 -932 -1708 -2350 -1381 -854 -1179 -655 180 16 307 221 218 648
676F48M73j041k56J064o50lJ323L02j008p9Q59q75j162j19k03o92j48L51J80j89
$$ 648 1121 80 -176 888 238 235 1558 1860 852 773 1632 757 -405 -524 -727 -1419 -1567 -1216 -1036 -1225
696a225l22M97Q26J32j66J097L76j307P6Q08m20q66J043R78j46p63N01O14j047
$$ -1225 -1547 -1050 -224 -92 -258 839 1215 -92 -16 792 372 -494 549 1527 1381 618 1119 1733 686
715F86l66P34j54j869m04P36l71j124K26P72j01j18Q01J240j10n09K76O79p28
$$ 686 320 1054 900 -969 -1373 -637 -1008 -2132 -1906 -1134 -1235 -1353 -552 688 578 69 345 1024 296
734B96n61P70J020j323l73J231j40p89P34J143p69j742J97K2j115p23Q84K80o50
$$ 296 -265 505 1525 202 -171 1060 920 131 865 2008 1239 -503 -306 -284 -1399 -2122 -1238 -958 -1608
753a608K10Q40P76l66q5O97O07j038K3J165m44j457J011O62n82o87J584L32j077
$$ -1608 -1398 -558 218 -148 -233 464 1071 33 56 1221 777 -680 331 993 411 -276 1308 1640 563
772E63k10P97m98j480J78L08n44o56k55Q75k61n93J095J572j99r49J039O34j609
$$ 563 353 1150 652 -828 -650 -342 -886 -1542 -1797 -922 -1183 -1776 -681 891 692 -257 782 1416 -193
791a93m18J312M7j227L49J555o79o18Q32M01k62j075L17q5j120p16L76N28p32
$$ -193 -611 701 748 -479 -130 1425 746 128 960 1361 1099 24 341 256 -864 -1580 -1204 -676 -1408
810a408KJ110N52q41K8J331k5r76O89R43j056n33K84R78j495j10R82M00q6k39
$$ -1408 -1406 -296 256 -585 -557 774 749 -227 462 1405 349 -184 100 1078 -417 -527 455 855 769 530
830E30O54j36j459n00M49j66r06K80Q65l00n54P71R84j92k94Q77J34j084p6M46
$$ 530 1184 1048 -411 -911 -462 -628 -1534 -1254 -389 -689 -1243 -472 512 320 26 903 1037 -47 -123 323
850C23K07r65M23R36m34o80K51R26o04q22O42K10p07p66M64R5o60n58J220M09
$$ 323 530 -435 -12 924 490 -190 61 987 383 -439 203 413 -294 -1060 -596 -501 -1161 -1719 -499 -90
870i0n82O35J091l78r39O94L76p70p3J30L28o51l99O21L73l48R5Q78j0r10o84
$$ -90 -672 -37 1054 676 -263 431 807 37 -36 94 422 -229 -628 -7 366 18 113 991 981 71 -613
891f13Q04n65j097M03Q48n30l77Q58K60J08j76Q64N0n71N6K51n52m75J37M68N0
$$ -613 191 -374 -1471 -1068 -220 -750 -1127 -269 -9 99 -77 787 837 266 322 573 21 -454 -317 151 201
912B01l02K98N17k47m30J98K27o22n19L83j73o84M9N16p5j34R84N13M3J13j76
$$ 201 -101 197 714 467 37 235 462 -160 -679 -296 -469 -1153 -1104 -588 -663 -797 187 700 743 856 680
933F80N2n30q2m7J79n36j98P39J36l27j0P26k67n33J08R5n46m88J18n2k41K12
$$ 680 732 202 120 73 252 -284 -482 257 393 66 56 782 515 -18 90 185 -361 -849 -731 -783 -1024 -812
955h12M47L29N4L66k1K99k91N4nk09k86j43P9j91J95K00K97J83j34k86K76j36
$$ -812 -365 -36 18 384 363 662 371 425 420 211 -75 -218 -139 -330 -135 65 362 545 411 125 401 265
977B65p66K85j20m61P4L81k12Q8K50J56L52K38M0J05j68n5p64J18k01P9L03l8
$$ 265 -501 -216 -336 -797 -723 -342 -554 -466 -216 -60 292 530 570 675 507 452 -312 -194 -395 -316 -13 -51
999e1K26PK34k48j94K23Q4n9r35J9J41j83K33L14j54J56N37J00k0P2k16r9J69
$$ -51 175 182 416 168 -26 197 281 222 -713 -694 -553 -736 -503 -189 -343 -187 350 450 430 502 286 187 356
1022C56k23j01k27K94j83k00N85m08P0O41m7n01L53n56n83K23K1k21J2M70kL53
$$ 356 133 32 -195 99 -84 -284 301 -107 -37 604 557 56 409 -147 -730 -507 -486 -707 -695 -225 -227 126
1044A26N06j59p9L52k36m63Q1P8p73L13l10L38Q6M66m6n1J7n9k24K28k79M0j34
$$ 126 632 473 394 746 510 47 128 206 -567 -254 -564 -226 -140 326 280 229 246 187 -37 191 -88 -48 -182
1067a82j16l54K98o4q4N88L77J0k1K12n23JJ18j72m99J66Q2n6JR8j3L88K13K63
$$ -182 -298 -652 -354 -418 -502 86 463 473 452 664 141 142 260 88 -411 -245 -163 -219 -218 -120 -133 255 468 731
1091G31l39j73m14m19R1J25J5r3O14Q0j42M6O0Q8L7l7k23K29j69k96l18L58n4
$$ 731 392 219 -195 -614 -523 -398 -383 -476 138 218 76 122 182 270 307 270 47 276 107 -189 -507 -149 -203
1114b03J19L78j53l19N79J16p29J46K25m01j59N0k59J32J57K48J00L30J12k42
$$ -203 -84 294 141 -178 401 517 -212 -66 159 -242 -401 -351 -610 -478 -321 -73 27 357 469 227
1134B27N09m52p19N38j74l31k22N71J52m42L81M08l34j16R3M09l49n34K42J96
$$ 227 736 284 -435 103 -71 -402 -624 -53 99 -343 38 446 112 -4 89 498 149 -385 -143 53
1154E3m64o06O57P12l37l41R55p5q19J00O80k37n32J56Q5k67m75M30O38m58j05
$$ 53 -411 -1017 -360 352 15 -326 629 554 -265 -165 515 278 -254 -98 -13 -280 -755 -325 313 -145 -250
1175b50R73P7o24n16M64K47q59o6P16l35m53M28O28k69o70Q02P17q19k76L82J77
$$ -250 723 800 176 -340 124 371 -488 -554 162 -173 -626 -198 430 161 -509 293 1010 191 -85 297 474
1196D74j229j01J208J35j045L54R93m3j130N05P21n94r32R81L00j050p83J004
$$ 474 -755 -856 352 487 -558 -204 789 746 -384 121 842 248 -684 297 597 -453 -1236 -232
1214b32N31r73M7J385J08j234M15P14m41j280Q28R65j058p14J153M94j084k0J133
$$ -232 299 -674 -627 758 866 -368 47 761 320 -960 -132 833 -225 -939 214 708 -376 -396 737
1233G37K95j075j57P90k07j285K07J200l89j488J231J307j005j769K228O53j562
$$ 737 1032 -43 -200 590 383 -902 -695 505 116 -1372 -141 1166 161 -1608 620 1273 -289
1250b89m04J473J76j642j28J493n72j294P13J636o65j132P68J159j236j215J185
$$ -289 -693 780 956 -686 -814 679 107 -1187 -474 1162 497 -635 133 1292 56 -1159 26
1267B6N83j597n56K007L1j718L05K329p94j268N16J755j193j628J072J267j605
$$ 26 609 -988 -1544 463 494 -1224 -919 1410 616 -652 -136 1619 426 -1202 -130 1137 -468
1284d68p91J382P56j732j70J982K90k101P9K257o64k100N08K071j505j732J597
$$ -468 -1259 123 879 -853 -1023 959 1249 -852 -773 1484 820 -1280 -772 1299 -206 -1938 -341
1301c41J588j506j103K289M75k053l14K337j75k429L46K208n25k501J133J911
$$ -341 1247 -259 -1362 927 1402 -651 -965 1372 1197 -1232 -886 1322 797 -1704 -571 1340
1317A340j058j789K019J492k209j463K353L95k172n87K508K46k880L71K926r02
$$ 1340 282 -1507 512 2004 -205 -1668 685 1080 -1092 -1679 829 1075 -1805 -1434 1492 590
1333E90k254J581K379j908j629J612J585k674j070K116R66k374m17K755L46k950
$$ 590 -1664 -83 2296 388 -1241 371 1956 -718 -1788 328 1294 -1080 -1497 1258 1604 -1346
1349a346O39K332q56k552J301K379k177j862J989J549k279q24K864N57k663r2
$$ -1346 -707 1625 769 -1783 -482 1897 -280 -2142 -153 1396 -883 -1707 1157 1714 -949 -1041
1365a041K902m51l092Q88K692j595k441J807K311j839k094K249K100k823j289
$$ -1041 1861 1410 -1682 -794 1898 303 -2138 -331 1980 141 -1953 296 2396 -427 -1716
1380a716K768P94l440o6L226q47l021J223K859j207k512K120K313k560j644K613
$$ -1716 1052 1846 -1594 -1660 1566 719 -2302 -1079 1780 573 -1939 181 2494 -66 -1710 903
1396I03J035k614j154K907M53l637O75L373n46l208J294K600j442k712K077K297
$$ 903 1938 -676 -1830 1077 1530 -2107 -1432 1941 1395 -1813 -519 2081 639 -2073 4 2301
1412B301k784k034K895J096l123q40M203K76l329K32L444r84l211J295K940k361
$$ 2301 -483 -2517 378 1474 -1649 -2489 1714 1990 -1339 -1107 2337 1353 -1858 -563 2377 16
1428A6k411K194K395k565j937L101J506l274n41K943J25l468L12L171q48l218
$$ 16 -2395 -201 2194 -371 -2308 793 2299 -975 -1516 1427 1552 -1916 -1604 1567 719 -2499
1444b499J430L061j750k530K493K269l181j158L163P62k964j003L400Rl362N55
$$ -2499 -1069 1992 242 -2288 205 2474 -707 -1865 1298 2060 -904 -1907 1493 1502 -1860 -1305
1460a305L319j152l264J972L234k204k887K638J602k948j633L316J205l558m07
$$ -1305 2014 862 -2402 -430 2804 600 -2287 351 1953 -995 -2628 688 1893 -1665 -2072
1475b072L344K39l111N44L418j076l381J737K582k294k532K873K007k944j527
$$ -2072 1272 1511 -1600 -1056 2362 1286 -2095 -358 2224 -70 -2602 271 2278 -666 -2193
1490b193L472P18l253k67L520m83l427R41L083j522l099J754K950k372k396L301
$$ -2193 1279 1997 -1256 -1523 1997 1514 -1913 -972 2111 589 -2510 -756 2194 -178 -2574 727
1506G27J914l270j334L512O07l612n5L236n17l611J460L052j637k756K367K410
$$ 727 2641 -629 -1963 1549 2156 -1456 -1511 1725 1208 -2403 -943 2109 472 -2284 83 2493
1522B493k201k705K815J837l020j510L254M67l227j66L661o23l086J306L099j617
$$ 2493 292 -2413 402 2239 -781 -2291 963 1430 -1797 -1963 1698 1075 -2011 -705 2394 777
1538G77k737K054K160k451j981K720J307k936j215L381Q68l503J83L262q08l008
$$ 777 -1960 94 2254 -197 -2178 542 1849 -1087 -2302 1079 1947 -1556 -1373 1889 1081 -1927
1554a927J288K878k116k678K383K044k801j303K864J409l074o33L383k67k896
$$ -1927 -639 2239 123 -2555 -172 1872 -929 -2232 632 2041 -1033 -1666 1717 1450 -1446
1569a446K06L189j021l019J313K778j884k346K322J848k283j436K701Q26k800
$$ -1446 -1240 1949 928 -2091 -778 2000 116 -2230 92 1940 -343 -1779 922 1748 -1052
1584a052p45K931J73k871L17K973p75l088J758K444j601k283K434J630k900j229
$$ -1052 -1797 1134 1307 -1564 -1247 1726 951 -2137 -379 2065 464 -1819 615 2245 -655 -1884
1600a884K717R05l081m85K981r0k478O15K629p66k914J411K442j999k263K320
$$ -1884 833 1738 -1343 -1828 1153 1063 -1415 -800 1829 1063 -1851 -440 2002 3 -2260 60
1616F0J569k316j180K682P50k533l65L029o21k326N10K568j274k517J559J877
$$ 60 1629 -687 -1867 815 1565 -968 -1333 1696 1075 -1251 -741 1827 553 -1964 -405 1472
1632A472j499k036K221J702k459r13K521N81k431m15K712o63k599Q27K321r08
$$ 1472 -27 -2063 158 1860 -599 -1512 1009 1590 -841 -1256 1456 793 -1806 -979 1342 434
1648D34k339J825J703j489j437J979P82k013r37K343K62k452J73K394n73k059
$$ 434 -1905 -80 1623 134 -1303 676 1458 -555 -1492 851 1113 -1339 -1166 1228 655 -1404
1664a404Q33K142j106j740J407J158j556j300K016N19j477q03J969K76j787M8
$$ -1404 -571 1571 465 -1275 132 1290 -266 -1566 450 969 -508 -1311 658 934 -853 -805
1680h05K203m15k134R38J547j292j310J035J612j846r51J617R34j611m67J697
$$ -805 1398 983 -1151 -213 1334 42 -1268 -233 1379 -467 -1418 199 1133 -478 -945 752
1696G52j42j614N46J319l38j598O25J321j074j399J581J233j420q65J538N70j344
$$ 752 610 -1004 -458 861 523 -1075 -450 871 -203 -1602 -21 1212 -208 -1073 465 1035 -309
1713c09l05J541k84j696L44J506m67j390Q05J504j155j031J262Q94j183j094J560
$$ -309 -614 927 643 -1053 -709 797 330 -1060 -255 1249 94 -937 325 1219 36 -1058 502
1730E02L68j888P2J700j77j379M61J325m28j222P31J243j133j098R46P19j204
$$ 502 870 -1018 -946 754 577 -802 -341 984 556 -666 65 1308 175 -923 23 742 -462
1747d62o46J508O02j651P5J449rj451N32Q66n26j093N07R20q15p08Q55O48p90
$$ -462 -1108 400 1002 -649 -574 875 866 -585 -53 813 287 -806 -299 621 -194 -902 -47 601 -189
1766a89k96J338L08j707l9J207k65r64O7J097m79r15N82J194r96p16J138J84n16
$$ -189 -485 853 1161 -546 -585 622 357 -607 -540 557 78 -837 -255 939 -57 -773 365 549 33
1785C3o58R66j59p36l19J257k27r00K03J077m98m02M43O43p19k44N29J47q01j89
$$ 33 -625 341 182 -554 -873 384 157 -743 -540 537 39 -363 80 723 4 -240 289 436 -365 -554
1805e54P42K5r57O07O22Q7q58J37P52r39j37M03L38l03r71R82N13q61L1P03L56
$$ -554 188 213 -744 -137 485 572 -286 -149 603 -336 -473 -70 268 -35 -1006 -24 489 -372 -341 362 718
1826G18p56J31L49m07k06j29L51j6m62L31N26p90J10M22P2m70L44O2J81n85LK86
$$ 718 -38 93 442 35 -171 -300 51 35 -427 -96 430 -360 -250 172 244 -226 118 180 361 -224 -221 65
1848F5J42p66L92P52m31l88N13j56n8l24L45K08o07J77j37L37n52K24M85Q3l93
$$ 65 207 -559 -167 585 154 -234 279 123 65 -259 86 294 -313 -136 -273 64 -488 -264 221 304 -89
1869h9L8N06m77k72K70J18l75P3O9L09l61k2N65m5m06P8J23J37n00K51J34k26
$$ -89 -51 455 -22 -294 -24 94 -281 -208 -139 170 -191 -213 352 307 -99 -21 102 239 -261 -10 124 -102
1891a02p8kN01m94K95J87j62l57Q0N45n2o90Q7K85Ql41j4K77J05k23K82L28k43
$$ -102 -180 -182 319 -175 120 307 145 -212 -132 413 361 -329 -242 43 51 -290 -304 -27 78 -145 137 465 222
1914B22l30K25J36k58k11K6M09n16N96j73k53m2K47J12m0r5O7K8k70J31k58J93
$$ 222 -108 117 253 -5 -216 -190 219 -297 299 126 -127 -169 78 190 150 55 122 150 -120 11 -247 -54
1936e4lp1J0M68l31K84j62J31k14J02j75j71k36N20r7j89K04J24j91J87J53m34
$$ -54 -57 -128 -118 350 19 303 141 272 58 160 -15 -186 -422 98 1 -188 16 140 -51 136 289 -145
1958a45J38mj20O6l4J84l62K35m8n3L05R6l07K33Q7M8m77K39k5m64M02L02k65
$$ -145 -7 -11 -131 -65 -99 85 -277 -42 -90 -143 162 258 -49 184 271 319 -158 81 56 -408 -6 296 31
1981C1N4J04n61M59nk5l5J44j67k88j1J73L0j45J64j52N62n06Q15m98Nj43OR3
$$ 31 85 189 -372 87 82 57 22 166 -1 -289 -300 -127 -97 -242 -78 -230 332 -174 641 143 148 5 11 104
2005A04j55l09L1M78l36L14O5j36L6J20j55k20Q7N8j92R8j15j41J95L38Qp3O7
$$ 104 -51 -360 -329 149 -187 127 192 56 92 212 57 -163 -76 -18 -210 -112 -227 -368 -173 165 173 100 167
2028A67o5P7J16l48K99k3m15K00j03o9J12J34k90J67J76K2k78J77l3J00k92K26
$$ 167 102 179 295 -53 246 223 -192 8 -95 -164 -52 82 -208 -41 135 157 -121 56 23 123 -169 57
2050E7k28L21j75J09n9P6J74j24j22J87Oj69R2j53j16kl50K42J61N9J8J13n3K5
$$ 57 -171 150 -25 84 25 101 275 151 29 216 222 53 145 -8 -124 -126 -476 -234 -73 -14 4 117 64 89
2074H9j21J18n1k55K51j31J06m9l4j1j40K98M7Q6r1K7r6j05j65J47K12k71pL0
$$ 89 -32 86 35 -220 31 -100 6 -43 -77 -88 -228 70 117 203 112 139 43 -62 -227 -80 132 -139 -146 -116
2098a16J9N6k09L93j87L32k70p7O4k58J90K5N9k21K05M37l32k4p3K33k48k32K70
$$ -116 -97 -41 -250 143 -44 288 18 -59 5 -253 -63 -38 21 -200 5 442 110 86 13 246 -2 -234 36
2121C6l5k66k26L64K9K5j29M79k99L6l1r0J68k27J98j35Q7k69l0O11k53m3L70
$$ 36 1 -265 -491 -127 -98 -73 -202 277 -22 14 -17 -107 61 -166 32 -103 -16 -285 -315 296 43 0 370
2144C70k25j58K12R8m38j7k4K75m23M9K35O0Q1j80K92J00l24K8L0j1m01M37j64
$$ 370 145 -13 199 297 -141 -158 -182 93 -330 -281 -46 14 95 -85 207 307 -17 11 41 30 -371 66 -98
2167i8K93k18J48p0j05L6J63J47l20K8j36N2k39J89O2j13p6L69L7k04j41M40k04
$$ -98 195 -23 125 55 -50 -14 149 296 -24 4 -132 -80 -319 -130 -68 -181 -257 112 149 -55 -196 244 40
2190D0j34k27L00r4K25m47L26Nk40L52K44k24r3Q0K1j21j64Q2O2l49L47K9Nj76
$$ 40 -94 -321 -21 -115 110 -337 -11 -6 -246 106 350 126 33 113 134 13 -151 -69 -7 -356 -9 20 25 -151
2214a51K91M1J42l82R6j40J79k11j30K56O7k53K76P7j81l2K12q8L9oj94J36l47
$$ -151 140 181 323 -59 37 -103 76 -135 -265 -9 58 -195 81 158 -23 -55 157 69 108 102 -92 44 -303
2237c03J61K23j53O0J69O8l10p7K07n3Q4k7o4qk44J16L83l52j85L28J35k00L0
$$ -303 -142 81 -72 -12 157 225 -85 -162 45 -8 76 49 -15 -23 -267 -151 232 -120 -305 23 158 -42 -12
2260a2j19M16n18J43P9o6l2k24N03l01Q1N0J1K6j27K00l5n7k81J3J18J76k17P7
$$ -12 -131 285 -233 -90 -11 -77 -109 -333 170 -131 -50 0 11 37 -90 110 75 18 -263 -250 -132 44 -173 -96
2284i6K23j97M5N49l42k84K25l2k2k08K5J98j03l96O59k44o7N3K60L34k78k93
$$ -96 127 -70 -25 524 182 -102 123 91 69 -139 -114 84 -19 -415 244 0 -67 -14 246 580 302 9
2306Ij10J53m05L60N2L9l95M45J06o7k05K31%k74o9J43L4k74M5J36N3j11K9K43
$$ 9 -101 52 -353 7 59 98 -297 148 254 187 -18 213 213 -61 -130 13 47 -227 -182 -46 7 -104 -75 168
2330A68j50r7L54l77N4J06j88J98k7j63J92o3n4j01K58j03LR6M0j67j33Q6J36
$$ 168 18 -79 275 -102 -48 58 -130 68 41 -122 70 7 -47 -148 110 7 10 106 146 -21 -154 -68 68
2353F8k56Q8K3R0l9j99N97l22j33J33j49R1m6M9P0r2k6J12j31KK9q4K62k89J46
$$ 68 -188 -100 -77 13 -26 -225 372 50 -83 50 -99 -8 -54 -5 65 -27 -53 59 -72 -70 -41 -125 137 -152 -6
2378fo3J41j91NJ82J60k64j44K14j7L38j90j23m1j53j19j0K26J13K9j63J91j58
$$ -6 -69 72 -119 -114 68 228 -36 -180 34 17 355 165 42 1 -152 -271 -281 -55 58 87 -76 115 -43
2401d3K19j37j60N6K2j0J89j7k45p2J47J21jj54P9L51m21K12j35k97K28J58q1
$$ -43 176 39 -121 -65 -43 -53 136 119 -126 -198 -51 70 69 -85 -6 345 -76 136 1 -296 -68 90 9
2424Ij10O6p9m1P9J40N5J3j27q5J80j2Jj38r9K51l22L80k55J42k37K32j2n6L9
$$ 9 -101 -35 -114 -155 -76 64 119 132 5 -80 100 88 89 -49 -148 103 -219 161 -94 48 -189 43 31 -25 14
2449A4j53K19j28k5r0R8M5M0j3q4J73L8j86J43l1j95J50j5m52K09K81J19r1k47
$$ 14 -139 80 -48 -73 -163 -65 -20 20 7 -77 96 134 -52 91 60 -135 15 0 -452 -243 38 157 66 -181
2473a81M07k37K23k53L77k44o5j22J21L6OP3k50L39R4l01L4j54K84K43l62j93
$$ -181 226 -11 212 -41 336 92 27 -95 26 62 68 141 -109 230 324 23 57 -97 187 430 68 -125
2495a25o1L05j45K5j58j16J14J33N3J28k7o2k02L55m7j77j28R7M4J74n0l06J20
$$ -125 -186 119 -26 -1 -159 -275 -161 -28 25 153 126 64 -138 217 170 -7 -135 -38 6 180 130 -176 -56
2518e6J88q6j36J04l0K18l5k55Q4j23K23l6k17L78j58M2L6j17J06j27k20M4kR5
$$ -56 132 46 -90 14 -16 202 167 -88 -4 -127 96 60 -157 221 63 105 141 24 130 3 -217 -173 -175 -80
2542h0p5K92j68M3K02k79J31m6Pk56K31k10K21N14p42M24k16o1J65j29J8K5K79
$$ -80 -155 137 -31 12 214 -65 66 20 27 -229 2 -208 13 527 -215 209 -7 -68 97 -32 -14 11 290
2565B90j81k12J47k55k16L57l19N14J42k93J34k67K29j27K28j63k25LL55n5k36
$$ 290 109 -103 44 -211 -427 -70 -389 125 267 -26 108 -159 70 -57 171 8 -217 -214 141 86 -150
2586a50J51k27K18J81mj26op3J36l98L03j58J84J29q1M5j21j19L1K79o8n6k7k37
$$ -150 1 -226 -8 173 169 43 37 -36 100 -298 5 -153 31 160 79 124 3 -116 -85 194 126 70 43 -194
2610a94K1j7K39n4m4J36J4r9N0P5r3K56l66J2j2j59R6L2J37m6J12j94J35Q0j35
$$ -194 -173 -190 49 -5 -49 87 101 2 52 127 34 290 -76 -64 -76 -235 -139 -107 30 -16 96 -98 37 117 -18
2635a8j14pL83l22K01k40Q5j71P9J44j42J02K71k5j51k4J19j62j04n5j67M8J15
$$ -18 -132 -139 244 -78 123 -117 -32 -203 -124 20 -122 -20 251 226 75 51 170 8 -96 -151 -318 -270 -155
2658a55P2N6J06j62J24J50J34m04R8J11l89K0Q2l0R1N3J34j16M6p3K29j03m18
$$ -155 -83 -27 79 -83 41 191 325 -79 19 130 -259 -239 -157 -187 -96 -43 91 -25 21 -52 177 74 -344
2681c44M11n9m9n3J06Q6j99j53M42j82J32p1N9n6j66K8k2J42k47J33J86j91j54
$$ -344 67 8 -41 -94 12 98 -101 -254 188 6 138 67 126 70 -96 -68 -90 52 -195 -62 124 -67 -221
2704b21N85j26k13j48J98l2p6O5r9J27j53Q7J3j00p4M22M9k48m93O68k79j84J49
$$ -221 364 238 25 -123 75 43 -33 32 -67 60 -93 -6 7 -93 -167 255 304 56 -437 231 -48 -232 -83
2727h3L37k27k39L6L16J63m14J83P5j09j35%L97m93K2K54O2j65j33K71R4Q0j62
$$ -83 254 27 -212 -176 140 303 -111 72 147 38 -97 -97 300 -193 -171 83 145 -20 -153 118 212 292 130
2750A30J92k27n63N38K87m00N3k45L09l88N3L42r2j67J72K50k81j04O4K34j50
$$ 130 322 95 -468 70 357 -43 10 -235 74 -314 -261 81 -11 -178 -6 244 -37 -141 -77 157 7
2771Gl55N8L86l89R7P8N28l26l32M93k7j11k72K74j90j47J78L77l17M9J37K26
$$ 7 -348 -290 96 -293 -196 -118 410 84 -248 245 218 107 -165 109 -81 -228 -50 327 10 59 196 422
2793D22k44l38L96J74n86j20N01Jl69J98L20l62j49q5P11m32n27L54L87m72m5
$$ 422 178 -160 236 410 -176 -296 205 206 -163 35 355 -7 -156 -241 470 38 -489 -135 252 -220 -265
2814b65K95k6j55j8L19Q8o89L97N18l11o64O17p6j46j33K14M31m52j60L44Q4k49
$$ -265 30 4 -151 -169 150 238 -451 -54 464 153 -511 106 30 -116 -249 -35 396 -56 -216 128 212 -37
2836c7j37L58j06o18M07J95J97o87M09K64j86n53O23L36m08n06N67J79m18%M73
$$ -37 -174 184 78 -540 -133 62 259 -428 -19 245 59 -494 129 465 57 -449 118 297 -121 -121 352
2857C52j67l88N7L55p5l21J92K98l12k45K19K59l18J9L09O0n63j43O22k1k63N8
$$ 352 185 -203 -146 209 134 -187 5 303 -9 -254 -35 224 -94 -75 234 294 -269 -412 210 189 -74 -16
2879a6K89k66l49K11N63n24l29L94J38k38n6L66M7j51l90M87O3n91Q0M70j78m20
$$ -16 273 7 -342 -131 432 -92 -421 -27 111 -127 -183 183 230 79 -311 176 239 -352 -272 198 20 -400
2901d00J90L44j96m30L91K89k21l99N47J32k54k49M74o2k78k8M10R0r82O75L72
$$ -400 -210 134 -62 -492 -101 188 -33 -432 115 247 -7 -256 218 156 -122 -150 260 350 -632 43 415
2922D15n05j97L70L33n71n2K28L2k64j81O30n1o34L77N62k78n89L33J49Lm22O11
$$ 415 -90 -287 83 416 -155 -207 21 53 -211 -392 238 187 -447 -70 492 214 -375 -42 107 110 -312 299
2944B99j31n24R6N87k66j02p1N84l62k20O0K35%p05N28J52k27l12L64M83o20O5
$$ 299 168 -356 -260 327 61 -41 -112 472 110 -110 -50 185 185 -520 8 160 -67 -379 -15 468 -152 -87
2966h7M18o6m57J24M95j63p00K26N36l44k49L94J89k74k60L07K00m23j93N23k2
$$ -87 331 265 -192 -68 427 264 -436 -210 326 -18 -267 127 316 42 -218 89 289 -134 -327 196 174
2987A74m17J55M54l84m43L07M80m40K8J41K16l92R0K86j20k68m4M88k44l01J70
$$ 174 -243 -88 366 -18 -461 -154 326 -114 -86 55 271 -121 -31 255 135 -133 -177 311 67 -234 -64
3008f4N05m68j42J35J64q3n79M40K82l58l09N91L16n65J0O23m00j44K1M12n89
$$ -64 441 -27 -169 -34 130 47 -532 -92 190 -168 -477 114 430 -135 -125 498 98 -46 -25 387 -202
3029b02p8K99J23l2o22N84K41j98k84M04J91n54p3O82m11l22J0M41rn26L75L07
$$ -202 -280 19 142 110 -512 72 313 115 -169 235 426 -128 -201 481 70 -252 -242 199 190 -336 39 346
3051C46l06k89O57j97k06l12N62J63r26J31N18k9l25M6L89o3l69M53P0m22l82
$$ 346 40 -249 408 211 5 -307 255 418 -508 -377 141 112 -213 -167 222 159 -210 243 313 -109 -491
3072d91N22J01j27q6K29J13m13j01M18n9l76M09J54k80l00N67j34k58j58O37k28
$$ -491 31 132 5 -81 148 261 -152 -253 165 106 -270 139 293 13 -287 280 146 -112 -270 367 139
3093A39l71L21J53q0l12j47P28m51k49J71L03k94m25L71P17n48k31L52K73o88
$$ 139 -232 89 242 162 -150 -297 431 -20 -269 -98 205 -89 -514 -143 574 26 -205 147 420 -268
3113b68m7M80J28m97K9M68k87m59L84J45k7k18N50L6o85j18J65L67k41l18M90
$$ -268 -315 165 293 -204 -175 293 6 -453 -69 76 49 -169 381 417 -268 -386 -221 146 -95 -413 77
3134G7Lm67L08L52q9n20M18L98n48k20L24K09m00j32M21J75l54k77N99J47q46
$$ 77 80 -387 -79 273 184 -336 82 480 -68 -288 36 245 -155 -287 134 309 -45 -322 277 424 -422
3155d22K87L21r8j18K79r7k02k53L13J99j88l84P28J0m89j23O82j64m68n7M90
$$ -422 -135 186 88 -30 249 152 -50 -303 10 209 21 -363 365 375 -114 -237 445 281 -187 -244 246
3176B46k83j32K99R2r3m65M28On8l69M47l45p0K35J85L3l63J16K30j02j73K54
$$ 246 -37 -169 130 222 129 -336 92 98 40 -329 118 -227 -297 -62 123 156 -207 -91 139 37 -136 118
3198A18L73l10k99K39k90J28l57L42K51k66O1J15K25j79J09j52k05j51J85N29
$$ 118 491 181 -118 121 -169 -41 -398 -56 195 -71 -10 105 330 151 260 108 -97 -248 -63 466
3218D66n20oL8K4j10M0K71j18j53rK78o5n68L00J86J4j77rO0p5M3K05j70P5j7
$$ 466 -54 -60 -22 2 -108 -68 203 85 -68 -77 201 136 -432 -132 54 68 -109 -118 -58 -133 -90 115 -55 20 3
3243CK45k69N3k46K55l4M0j41kJ47J27k4K07l85Q6q7O4J91m36M71k34k7k56J46
$$ 3 248 -21 32 -214 41 7 47 -94 -96 51 178 154 361 -24 62 -25 39 230 -206 265 31 4 -252 -106
3267a06J12M6R9r0mj79O7j4K2k1K1K39j88j44J96j19m1l1n1J90j19L81j86m6R9
$$ -106 6 52 151 61 57 -122 -55 -69 -47 -68 -47 192 4 -140 56 -63 -104 -135 -186 4 -115 266 80 34 133
3292A33k40K48q0j5n9K03j06j56K18k56jK81k76j17J13l5p5L29j44j44J58r1l8
$$ 133 -107 141 61 46 -13 190 84 -72 146 -110 -111 170 -106 -223 -110 -145 -220 109 -35 -179 -21 -112 -150
3315a50K14j62j66J38J01R9nj34J26p3M3j63Q6J78k27J39r3n7o7L16k89R0k1K30
$$ -150 64 -98 -264 -126 -25 74 69 -65 61 -12 31 -132 -46 132 -95 44 -49 -106 -173 143 -146 -56 -77 153
3339A53P5j73J20m3k02J63j55R9j98P0J47j0k9n3K00k31RJ73pk14J78j78K49k44
$$ 153 228 55 175 132 -70 93 -62 37 -161 -91 56 46 17 -36 164 -67 -58 115 108 -106 72 -106 143 -101
3363a01jQ3m3K71l27P8J51J77l04J66m51J69J27j85K38j1m1nJ13rl1j74L14k15
$$ -101 -102 -19 -62 209 -118 -40 111 288 -16 150 -301 -132 -5 -190 48 37 -4 -9 104 95 64 -110 204 -11
3387a1l16J41K47q2J66j86j51J09M1lj22N1P0r3j2J48K4R3k45OK30j08J09m06
$$ -11 -327 -186 61 -21 145 -41 -192 -83 -42 -45 -167 -116 -46 -139 -151 -3 21 114 -131 -125 105 -3 106 -300
3411c00K57L76j72j6j00k17J72M7j0j57K13j09J03p1J04j43OR4p9k85L14j40M6
$$ -300 -43 333 161 145 45 -172 0 47 37 -120 93 -16 87 16 120 -23 -17 77 -2 -287 27 -113 -67
3434f7O0K1j82J69n9J06o7N1l5j82L37P2j15J4l89J67L06k89J9J04j00L40j87
$$ -67 -7 14 -168 1 -58 48 -19 32 -3 -185 152 224 109 123 -266 -99 207 -82 -63 41 -59 281 94
3457I4J22j97K36l01J89j06j68L36l20N5J01j5j97J83J66k42J90n4o9J44n1j1
$$ 94 216 19 255 -46 143 37 -131 205 -115 -60 41 26 -171 12 178 -64 126 72 3 147 96 85
3479H5n07L74J97j86RK68k65j23q9J64K01q7r6o0J82p0k05N6L85k3k13J82k19
$$ 85 -422 -48 149 -37 -28 240 -25 -148 -237 -73 128 41 -55 -115 67 -3 -208 -152 233 210 -3 179 -40
3502d0j48L95j75j22j10K97K8j58j0O2K95k23j06M6k02J60K69k25J47l16j20K07
$$ -40 -188 207 32 -90 -200 97 125 -33 -43 19 314 91 -15 31 -171 -11 258 33 180 -136 -256 -49
3524d9p0n5K24R3J3j13J44m06L30j69J05j44j83K62jp4J39j36Q6M2l7j1L69n28
$$ -49 -119 -174 50 143 156 43 187 -219 111 -58 47 -97 -280 -18 -19 -93 46 -90 -4 38 1 -10 359 -169
3548a69J16J22o2K50m63J90Q0P3o3l2r9K19j7p6r0J15j43O0p9R9K3j34J40J3k4
$$ -169 -53 69 7 257 -206 -16 64 137 74 42 -57 162 145 69 -21 94 -49 11 -68 31 54 -80 60 73 49
3573D9k38L82k63%J29n2J41j21j20L0O1rJ54q9p5J25k45J7N3J96k23q7J70j43
$$ 49 -189 193 -70 -70 59 7 148 27 -93 -63 -2 -11 143 54 -21 104 -141 -124 -71 125 -98 -185 -15 -158
3597a58j0K5L43k75n8K36k6p3p5L0K18J43m95K40p6J04j38N9K53k65J20k14k52
$$ -158 -168 -143 200 -75 -133 103 77 4 -71 -41 177 320 -175 65 -11 93 -45 14 267 2 122 -92 -344
3620c44M57j56L07k95J33k11J82J22j42J0Pk5o7j73m9K82o2k34K73m5J20j14r2
$$ -344 113 -43 264 -31 102 -109 73 195 53 63 70 45 -22 -195 -244 38 -24 -258 15 -30 90 -24 -116
3643a16l6m6L71j28R5Jl60J38J6J50k34J34k1Q7P5l69K21oN9k02p5J26J36p1K32
$$ -116 -152 -198 173 45 140 141 -219 -81 -65 85 -149 -15 -36 51 126 -243 -22 -28 31 -171 -246 -120 16 -55 177
3668A77k06j40K26O1O2j33L9K39l70J84j87J53q1j34K06R1k26K45j85q3N5l0m7
$$ 177 -29 -169 57 118 180 47 86 325 -45 139 -48 105 24 -110 96 187 -39 206 21 -62 -7 -37 -84
3691h4J20Q7k91N2j85K44K14k33M8k06M40j88J37n4J14k17K06q5j60R9l5n9n0
$$ -84 36 123 -168 -116 -301 -57 157 -76 -28 -234 206 18 155 101 215 -2 204 119 -41 58 23 -36 -86
3714h6n1J50n0k56M45j34k08J29K04j35o1J42j61N3M4K7J44m74K70N5R6j62n9
$$ -86 -137 13 -37 -293 152 18 -190 -61 143 8 -53 89 -72 -19 25 52 196 -278 -8 47 143 -19 -78
3737g8K60k90j98J38kJ41K07k64j5J52J8L72m03N7l57M21j85j51N4K03j50l9K4
$$ -78 182 -108 -306 -168 -170 -29 178 -86 -101 51 69 441 38 95 -262 159 -26 -177 -123 80 -70 -109 -85
3760h5P1J21j78J10n0j77L3K19k4J12r7k20L61l39K40l05K83m2J39j38j96O6K00
$$ -85 -14 107 -71 39 -11 -188 -155 64 40 152 55 -165 196 -143 97 -208 75 33 172 34 -162 -96 104
3783A04k0k38K14K7J78o3kj62q7J49k14q6K19l02J0J60M62k08k71N8P6j89M4j08
$$ 104 84 -154 60 87 265 202 200 38 -49 100 -114 -200 19 -283 -273 -113 349 141 -130 -72 4 -185 -141 -249
3807b49K38j46K60J26j78rr3R4M7M4j97J39j55P3N7J39l11J35o6J40M2j0j32R4
$$ -249 -11 -157 103 229 51 42 -51 43 90 134 -63 76 -79 -6 51 190 -121 14 -52 88 130 120 -12 82
3831H2j61j03J55m5J50j66P3K07l50J23J29o0J3j4l6qp8J66K2j12J6P5k9j04k88
$$ 82 -79 -182 -27 -72 78 -88 -15 192 -158 -35 94 34 47 33 -3 -11 -89 77 99 -13 3 78 49 -55 -343
3856c43L13J15j56ln6Q8J87q0P9oq1o4o9L5n2M77k55L9r4q4J43j75l6L6P0j3N
$$ -343 -30 85 -71 -74 -130 -42 145 65 144 138 57 -7 -76 -41 -93 384 129 168 74 -10 133 -42 -78 -42 28 15 20
3883B0Q5L2q1q4m4L5N3L86k12k49O2J96k46n5J85j79n8K38P8n3r8O4JK7j12L1
$$ 20 105 137 56 -28 -72 -37 16 402 190 -59 3 199 -47 -102 83 -96 -154 84 162 109 11 75 76 103 -9 22
3909B2p2O9J62k53k02M94l21J07k6j18J58k54L67L1k08m6O6p2J46K71n27K00O9
$$ 22 -50 19 181 -72 -274 220 -101 6 -20 -138 20 -234 133 164 -44 -90 -24 -96 50 321 -206 -6 63
3932F3j1j6k40J25L6N2k90J82k12K44j08J04J84j1jm2J4j69K32k09K04j1k71p1
$$ 63 52 36 -204 -79 -43 9 -281 -99 -311 -67 -175 -71 113 102 101 59 73 -96 136 -73 131 120 -151 -222
3956b22K42j93rK42l4n8n3J15j82J60O2l02J30Q3R0k97K35r0N3J94K7j02r3j53
$$ -222 20 -173 -182 60 26 -32 -85 30 -152 8 70 -232 -102 -19 71 -226 9 -81 -28 166 193 91 -2 -155
3980a55j36O04l99J41j18n3N75n95K48J43k50M4P2j08j26J81r0k1k28N7J17J10
$$ -155 -291 313 -86 55 -63 -116 459 -136 112 255 5 49 121 13 -113 68 -22 -43 -271 -214 -97 13
4002A3R9J33j71j07j10K52q8K17k94J37j22pJ35o2k04J99J27k8p9JN1J28j93j53
$$ 13 112 245 74 -33 -143 109 21 238 -56 81 -41 -48 87 25 -179 20 147 119 40 41 92 220 27 -126
4026a26K95l33L95n98L62j1l5N9J47j13o6Q9j46k41N15l37L9J36r7K78k07J65
$$ -126 169 -164 231 -367 -5 -16 -51 8 155 42 -24 65 -81 -322 193 -144 -105 31 -66 212 5 170
4048A70r7j66L44l60L5j9K46j53k64J10K10P1L6l84L16j25k22L4J26p3Q6o0J43
$$ 170 73 -93 251 -109 -74 -93 153 0 -264 -154 56 127 163 -221 95 -30 -252 -218 -92 -165 -79 -139 4
4071Dn0q9K91J1k15J70J30j08l34R3N9J30q1K8j56O9M5r3J31J25k01j48J79N9
$$ 4 -46 -135 156 167 -48 122 252 144 -190 -97 -38 92 11 39 -117 -48 -3 -96 35 160 -41 -189 -10 49
4095D9O9k16m8M85n28K09M6l06K24L6M1k28L46p6j31P7pr2K6J88r3k11k21K68
$$ 49 118 -98 -146 339 -189 20 66 -240 -16 20 61 -167 179 103 -28 49 42 -50 -24 164 71 -140 -361 -93
4119i3N9j74J00J93J7l9j54J55J76m35K46l35L13L5k7j87J69l39J40L04j58k1
$$ -93 -34 -208 -108 85 102 63 -91 64 240 -195 51 -284 29 64 37 -150 19 -320 -180 124 -34 -55
4141e5P0l40M67l9M7L5j11m9K84j35j9n8j55j61L35j52j7r0J80n1J03j48n5J4
$$ -55 15 -325 142 103 150 185 74 25 309 174 155 97 -58 -219 116 -36 -53 -143 37 -14 89 -59 -114 -100
4165a00K90J33l56J34l6K2o0M6N6q2j40j27L15m00J74J09q6R1j94L68j93j13j97
$$ -100 190 323 -33 101 65 87 27 73 129 47 -93 -220 95 -305 -131 -22 -108 -17 -211 157 -36 -149 -346
4188c46J12L57j98Q8P3j70m3J26k06o2K15K15k4k18m4J66j57R1M9N3K00o01M55
$$ -346 -234 123 -75 13 86 -84 -127 -1 -207 -269 -54 161 137 -81 -125 41 -116 -25 24 77 277 -324 131
4211A31J01l08J90l26L49k67j8K62k0k92L13j04N8l48J99L11l39L3L4Q1k29kJ59
$$ 131 232 -76 114 -212 137 -130 -148 114 94 -198 115 11 69 -279 -80 231 -108 -75 -41 40 -189 -191 -32
4234c2Q8k06J37J22K42m18M3K52k77j16K49l96K34kN5J00m0J39j24J84j87j44
$$ -32 56 -150 -13 109 351 -67 -24 228 -49 -165 84 -312 -78 -80 -25 75 35 174 50 234 47 -97
4256i7J25k1oN9j81j23J17K46p8p9K3J03o7j00j62K33o5J95k84K08K41k51j50
$$ -97 28 7 1 60 -121 -244 -127 119 41 -38 -15 88 21 -79 -241 -8 -73 122 -162 46 287 36 -114
4279a14J35K2m18K99K41Ml10L1L47m74K18j15L13l53J77nQ5k84J62J89l01j12
$$ -114 21 43 -375 -76 165 169 -141 -110 237 -237 -19 -134 179 -174 3 -2 83 -201 -39 150 -151 -263
4301b63K34o9K9l7K03j66P5R4l50L78l85K10J83n1l06K88Q0r8k96K34Nk71M8L91
$$ -263 -29 -98 -69 -106 97 -69 6 100 -250 128 -257 -47 136 85 -221 67 147 49 -247 -13 -8 -279 -231 160
4325A60j20j24J52M7j77q9K15J6J80m49J53M7j19J75l3J75j68j39J43J72K1k85
$$ 160 40 -84 68 115 -62 -151 64 80 260 -189 -36 11 -108 67 34 209 41 -98 45 217 238 -47
4347d7K88k10j36j5K38k52J20NK64k39l74K51L82m37k53O34j65Q9m21M76j67O2
$$ -47 241 31 -105 -120 118 -134 -14 -9 255 16 -358 -107 275 -162 -415 219 54 143 -278 198 31 93
4369I3j45K89k3m65L34J11n3m34O60k23j25l67N45J5k78J91l4j91q0J27N12m59
$$ 93 -52 237 214 -251 83 194 141 -293 367 144 19 -348 197 212 -66 125 91 -100 -180 -53 459 0
4391@k91K12K03k66L2K08J22l98K7R5k9R8j66K36m8M7J42k42L7l9J6L62l81q4
$$ 0 -291 -79 124 -142 -110 98 220 -178 -151 -56 -85 13 -153 83 35 82 224 -18 19 -20 -4 358 -23 -107
4415a07J50m2k15J06P2J75k18R1K94k37nq8j73K78k47K2L20r4k3O7k0p5j3LQ6
$$ -107 43 1 -214 -108 -36 139 -79 12 306 69 64 -24 -197 81 -166 -144 176 82 59 126 106 31 18 21 107
4440A07j18k27K07K02k30J5O4q7k77L11J72p3j35M2K1n3K32k22K07J01m64L20
$$ 107 -11 -238 -31 171 -59 -44 20 -67 -344 -33 139 66 -69 -27 -6 -59 173 -49 158 259 -205 115
4462A15n6j55L8L40k27j10J46K07m6k51j18M4j98M3K96N9k28K87k39j9j76L73
$$ 115 59 -96 -58 282 55 -55 91 298 252 1 -117 -73 -271 -228 68 127 -101 186 -53 -72 -248 125
4484A25J56l15o4K08r6oj23L41q4m96M78J13k13j74j53L79k9k96N9M21k95J13
$$ 125 281 -34 -98 110 14 8 -115 226 142 -354 124 237 24 -150 -303 76 47 -249 -190 231 -64 49
4506D9l0R1m05n5P46l79Q2l42L25Q9l00J34n7j76J47J96j81L9O4O1J62m96O6K10
$$ 49 19 110 -295 -350 396 17 99 -243 82 171 -129 5 -52 -228 -81 115 -66 -27 37 98 260 -236 -170 40
4530D0l3k0k43K89J61l62L12j6j26j57K53J60p9n66N7K44q8J22K29j07J4j34k3
$$ 40 7 -13 -256 33 194 -168 144 128 2 -155 98 258 179 -387 -330 -86 -174 -52 177 70 84 -50 -73
4553g3J39j13K69k58J21l97K92L11l81j12Q1K45j36q0K29l21Q6m9J27j5o4r0K35
$$ -73 66 -47 222 -36 85 -312 -20 291 -90 -202 -121 124 -12 -92 137 -184 -98 -147 -20 -35 -99 -189 46
4576D6l4Q4j57P7j7k11K79R0k9k37L8m6j07R9K47k75K55k63N90l92r7K37L2r7
$$ 46 12 96 -61 16 -1 -212 67 157 128 -109 -71 -117 -224 -125 122 -153 102 -161 429 37 -60 177 209 112
4600A12r5L4j27j31J72M6k3j52J75L7p2j82K60P6j55j8m1J59p1j79K95k02P7q2
$$ 112 17 51 -76 -207 -35 11 -12 -164 11 48 -24 -206 54 130 -25 -43 -84 75 4 -175 120 -82 -5 -87
4624h7o2J24j37J70n5J94k76J77j61k09J09O73l39n1j83K89j08j45Q2O1K14l53
$$ -87 -149 -25 -162 8 -47 147 -129 48 -113 -322 -213 460 121 70 -113 176 68 -77 5 66 280 -73
4646g3k06M41j15l30L67O7o8k52J03L89l19q0L12l10l7k6M4J96l87J32K35j40
$$ -73 -279 162 47 -283 84 151 83 -169 -66 323 4 -76 236 -74 -111 -137 -93 103 -284 -152 83 -57
4668e7R3j50K13n8p6J82Nn6j47J23Q1j27K00o1j57K13m35J15L54l69K99l11L7
$$ -57 36 -114 99 41 -35 147 152 96 -51 72 153 26 226 165 8 221 -214 -99 255 -114 185 -126 -89
4691h9K77j84J4R5n06L82n0J37q6j8P1P4J8j89R4k81K58J59k70R3L0j01J03m3
$$ -89 188 4 18 113 -393 -11 -61 76 -10 -28 43 117 135 -54 40 -241 17 176 -94 -1 29 -72 31 -12
4715a2K6J56r7j00J5r7J98j05J77L2l5KQ4l35Q7j7j4P0l7J91o6q6R0k14l1K01
$$ -12 14 170 73 -27 -12 -109 89 -16 161 193 158 160 244 -91 -4 -21 -35 35 -2 189 123 37 127 -87 -118 83
4741H3j61J43j34J55K08k42j36j51K50K5k5O5RK2m45M18j23j53P5J61K0k26L31
$$ 83 -78 65 -69 86 294 52 -84 -235 15 40 15 80 89 111 -334 84 -39 -192 -117 44 64 -162 169
4764A69k83L17L9m22J27J68k11K4J44l9j11P3k80K49k30N42l52L46n2k13k36L26
$$ 169 -114 203 242 -180 -53 115 -96 -72 72 33 -78 -5 -285 -36 -266 276 -76 270 218 5 -231 95
4786I5k60L42o2k05K9O5m8R1M8j0r3J6J09j09M3j14N3J23k4r8J61r3l9L0K59k53
$$ 95 -165 177 115 -90 -61 4 -44 47 95 85 -8 8 117 8 51 -63 -10 113 89 -9 152 59 20 50 309 56
4812E6j8m0jJ66k2n5M8o3J9r1K7P8o3k12J94J21l95JM35l35m8J79jp7r5L8N7J9
$$ 56 38 -2 -3 163 141 86 134 71 90 -1 26 104 41 -171 23 144 -251 -250 185 -150 -198 -19 -20 -97 -192 -154 -97 -78
4840g8L87k83L5k20L41m07L30J51j14j84k69K77K0k3o1n1O7o7J46J04L4j98O3
$$ -78 309 26 61 -159 182 -225 105 256 142 -42 -311 -34 -14 -37 -98 -149 -82 -149 -3 101 135 -63 0
4863@jJ5J04j83n2J16J89l92J02J34K11k64l7k1l4m1L6K24m5O7M6j93J11p4K96
$$ 0 -1 14 118 -65 -117 -1 188 -204 -102 32 243 -21 -58 -79 -113 -154 -118 106 61 128 174 -19 92 18 314
4888C14l59K8J09m1Kk58J76j03K42r2j18J52j53Q5P8J60k13J2j88L50r1l0K6j00
$$ 314 -45 -17 92 51 53 -205 -29 -132 110 18 -100 52 -101 -16 62 222 9 21 -167 183 92 62 88 -12
4912a2L2J45j46j25K2J45n3J59p2p9K47k28J27j66M4j79K75j40J94q3NrM6k12
$$ -12 20 165 19 -106 -84 61 8 167 95 16 263 35 162 -4 40 -139 136 -4 190 107 112 103 149 -63
4936f3J19J80l55L33l10p7K78j78m6k9j40K28k12K32j4N2J10p9k67J58k47L32
$$ -63 56 236 -119 214 -96 -173 105 -73 -119 -148 -288 -60 -272 -40 -54 -2 108 29 -238 -80 -327 5
4958El46M45k91M39l73Q4P8k94K86q4J19r0O3j29K20l73J08M43l57J24L6r0M3
$$ 5 -341 104 -187 252 -121 -37 41 -253 33 -51 68 -22 41 -88 132 -241 -133 310 -47 77 113 23 66
4981F6k6m0K19r5k17J94K1P2l43J54l8n7M6j19q2N8J80J50o8j68Ln2j80M17j08
$$ 66 40 0 219 124 -93 101 122 194 -149 5 -33 -90 -44 -163 -245 -187 -7 143 75 -93 -90 -142 -322 95 -13
5006a3K34l37J69m1j87J86j64J11J1K91l80P3J29q5j57K42%P3k17J19k55J09K03
$$ -13 221 -116 53 12 -175 11 -153 -42 -31 260 -120 -47 82 -3 -160 82 82 155 -62 57 -198 -89 114
5029A14j40J53r2j60K70J41k90Qj5k8m7J71J62j06m1m1k96M30n0k62J85Jj62K6
$$ 114 -26 127 35 -125 145 286 -4 4 -11 -39 -86 85 247 141 100 59 -237 193 143 -119 66 67 -95 -69
5053f9m2j41N07n9o9j06j3K4k21J73J86o2m33L27j68J15j78N74k81j74N1L17k29
$$ -69 -111 -252 255 196 127 21 8 32 -189 -16 170 108 -325 2 -166 -51 -229 345 64 -110 -59 258 29
5076B9K7j85l6J23n0kK32q9n7K66o1j25NJ9j76o0K29k44n7M48p5l75K00J83r7
$$ 29 56 -129 -165 -42 -92 -94 138 49 -8 258 197 72 77 96 -80 -140 89 -155 -212 236 161 -214 -14 169 72
5101G2J3j56k5K3M7L3J28q7K2k36P3l8J23l5M8K64j76K7j11rk07K44l02L16k54
$$ 72 85 -71 -96 -73 -26 7 135 48 70 -166 -93 -131 -8 -43 5 269 93 120 9 0 -207 37 -265 51 -203
5126b03Q8o5L36j61L01k31Q4j43R5m24L18N3L8j33j07K54j14K31l0j32j02P5J61
$$ -203 -115 -180 156 -5 296 65 149 6 101 -323 -5 48 86 -47 -154 100 -14 217 187 55 -47 28 189
5149A89k38J18oP6j60n9J61k33L20k00kN9K86m50J57L8L5o6l6j12M28j31l21J08
$$ 189 -49 69 63 139 -21 -80 81 -152 168 -32 -34 25 311 -139 18 56 91 25 -11 -123 305 174 -147 -39
5173c9J53r9J95j84j21J85p7nO7m5l68K67J36K4K81k94l05J65Q0k20J61L37l22
$$ -39 114 15 210 26 -95 90 13 8 75 30 -338 -71 65 89 370 76 -229 -64 16 -204 -43 294 -28
5196b8J66k42%M6L32p9o2k06L0J33m8j89J73j75P0k28L51O6j23N3j97M6K43l62
$$ -28 138 -104 -104 -58 274 195 133 -73 -43 90 42 -147 26 -149 -79 -307 44 110 -13 40 -157 -111 132 -230
5220b30M4P6j39K74J68l24L9J03mM3j17j08J18K47j28k28K24l4R3m8Lj67L57j91
$$ -230 -186 -110 -249 25 193 -131 -92 11 7 50 -67 -175 -57 190 62 -166 58 24 117 69 72 -95 262 71
5244G1K50l50j72L46j00k46J51K18k02j99L63j61l5L2Q4l8j0K82N3m37M0l0K55
$$ 71 321 -29 -201 145 45 -201 -50 168 -34 -233 130 -31 -66 -34 50 12 2 284 337 -100 -60 -90 165
5267A65k38J9l7K03q2k1l7J2K3J24Q7p3j91j93J4K58K52m36M32j62k5j87p6J33
$$ 165 -73 -54 -91 112 30 9 -28 -16 7 131 218 145 -46 -239 -225 33 285 -151 281 119 94 -93 -169 -36
5291c6J18p1J52j98jJ11o5n0J51L1m6n5o5o6J57Q4j28n9J04J29j93n3j91L09k09
$$ -36 82 11 163 -35 -36 75 10 -40 111 142 96 41 -24 -90 67 151 23 -36 68 197 4 -49 -240 69 -140
5316a40J17J69l91L92M4k70J07l1j48K32j85M2J29r1L3l3k1J81j05J00j46M6j74
$$ -140 -23 146 -245 147 191 -79 28 -3 -151 81 -104 -62 67 -24 9 -24 -45 136 31 131 -15 31 -143
5339a43K82j89k43J35M5m5J08nK49k42K13k35K26j39k29K51jJ27Q5l38J62k2K3
$$ -143 139 -50 -293 -158 -113 -158 -50 -55 194 -48 165 -70 156 17 -212 39 38 165 250 -88 74 52 75
5362G5j1N4Oj79n5K9K12j20m9l5J26J64j62j02N4j85M9J48l63L47J96k26J00k66
$$ 75 64 118 124 -55 -110 -81 131 11 -38 -73 53 217 55 -47 7 -178 -129 19 -344 3 199 -27 73 -193
5386a93K68k13K24k04R0o0r8K61Np5P5Q7k41L66j32m9k06R7q1K39m3k09J28k19
$$ -193 75 -138 86 -118 -28 -88 -186 75 80 5 80 167 -74 292 160 111 -95 2 -79 160 117 -92 36 -183
5410a83J68k33L66j37J71j5L5m0k49O3p4m2J50J93j01J60m92K73J29j60qk49L56
$$ -183 -15 -248 118 -19 152 137 172 132 -117 -54 -128 -170 -20 173 72 232 -260 13 142 -18 -26 -275 81
5433H1j2q6J06q7lo5K45j20j75L11m72N08j12j98j0K04l22J92k22K24q1J07q1
$$ 81 69 -17 89 2 -1 -66 179 59 -116 195 -277 231 119 -79 -89 115 -207 -15 -237 -13 -94 13 -68
5456f8q0L36j31mN8k30L78lm73L97l18K98k34J08o8N3n4k6K46j35j55L18k00J8
$$ -68 -148 188 57 53 111 -119 259 256 -217 180 -138 160 -74 34 -34 19 -35 -61 185 50 -105 213 13 31
5480C1J66k20K63k28k58K68o7n5Q1J81l00J64J75j95J42k5k51J9K05m0p5j24J02
$$ 31 197 -23 240 12 -246 22 -45 -100 -19 162 -138 26 201 6 148 123 -128 -109 96 56 -19 -143 -41
5503d1j2m0p3Q4L7%j22j2Q9K08k82J52M2J88n05K36J5R1k10L42k59K2K35q7k18
$$ -41 -53 -93 -166 -82 -45 -45 -167 -179 -90 118 -164 -12 30 218 -287 -51 -36 55 -155 187 -72 -50 185 98 -120
5528a20rK78k74J32K39m12PL87j34j5k28N8n3P8rK8J15k1p0K32m25L84l23M64
$$ -120 -129 149 -125 7 246 -166 -159 228 94 79 -149 -91 -144 -66 -75 -47 68 47 -23 209 -216 168 -155 309
5552C09o11K90j45J44Qj78M3J16J39Q3l37K76K3k78J97j45O4MO7j23K06k08q5
$$ 309 -302 -12 -157 -13 -5 -183 -140 -24 115 198 -139 137 160 -118 79 -66 -2 2 69 -54 152 -56 -141
5575a41m0K19j09o1L36k81L5J91M6k83K45k92m5L9J09J19K8J42j16k4Rj69rJ65
$$ -141 -181 38 -71 -132 204 -77 -42 149 195 -88 157 -135 -180 -141 -32 87 115 257 141 117 126 -43 -52 113
5599A13j40K8l5J45j21RJ02j25J60j49j21K50m6K05k74j22o1P4N7J47Q8j03l26
$$ 113 -27 1 -34 111 -10 -1 101 -24 136 -13 -134 116 70 275 1 -121 -182 -108 -51 96 184 81 -245
5622b45K86j6R7j39L19j77l98N65k39k23j53J72J56j8L17j82l23K86pj83K33j6
$$ -245 41 25 122 -17 302 125 -273 292 53 -170 -323 -151 5 -13 304 122 -201 85 78 -105 128 112
5644A12k70J81K63l79J38K7p7J75j86K15j49O2k34K19m2j49K50q9m9M0P2Q7l34
$$ 112 -158 23 286 -93 45 72 -5 170 -16 199 50 112 -122 97 55 -94 156 67 18 58 130 217 -117
5667a17J56p0j72J67J43O1k19M00l34O2l23J38K56j85J86n3L3j54q6L9N7j13R
$$ -117 39 -31 -203 -36 107 168 -51 349 15 77 -246 -108 148 -37 149 96 129 -25 -111 -72 -15 -128 -119
5690a19J42n6j89R2K92j75O0j80K37O1j59j31R6k64M03J4J07k33q4PJ20R2l75
$$ -119 23 -33 -222 -130 162 -13 47 -133 104 165 6 -125 -29 -293 110 124 231 -2 -86 -79 41 133 -242
5713b42K15j82K23P1j88R2M6n3J33l19K74k62K12l19K26j32N8K04j33J95j51j39
$$ -242 -27 -209 14 85 -103 -11 35 -18 115 -204 70 -192 20 -299 -73 -205 -147 57 -76 119 -32 -171
5735a71Q5K39j97Q1l6R2j64M4m3P0k79M48k43K6j31R1J02r0P2k5L63l39n9K63
$$ -171 -86 153 -44 37 1 93 -71 -27 -70 0 -279 169 -74 -48 -179 -88 14 -76 -4 -29 334 -5 -64 199
5759A99L1j74j36k6J30Mk47K80K11k77k00P7K78k24j85J09k5j02M05r2J01k90
$$ 199 230 56 -80 -106 24 28 -219 61 272 -5 -205 -128 150 -74 -259 -150 -175 -277 128 36 137 -153
5781a53J25P0k01N8L22m42L26l62L31k38K9J50l1k9L6N4j63J0J12J7L3l02J25
$$ -153 -28 42 -159 -101 221 -221 105 -257 74 -164 -135 15 -16 -45 -9 45 -118 -108 4 21 54 -248 -123
5804a23K48j72L3p6k71L62r1n4K36k04K12M1k9j65L16m00J78k1O1k55K57p7o8
$$ -123 125 -47 -14 -90 -361 1 -90 -144 92 -112 100 141 112 -53 263 -137 41 20 81 -174 83 6 -62
5827f2J65j18l2nrJ48Lk36K57Q6k96K22m16L45j18%L2p3J08k37m6K42M0Pj20R2
$$ -62 103 -15 -47 -52 -61 87 90 -146 111 197 -99 123 -293 52 -66 -66 -34 -107 1 -236 -282 -40 0 7 -113 -21
5853b1K28q5j0j33M23k66k05j67m5K40j60L57k09L6r7L40j4j04j49K66k54j23
$$ -21 207 122 112 -21 402 136 -69 -236 -281 -41 -201 156 -53 -17 -114 226 212 108 -41 225 -29 -152
5875a52m5J66K78k36J23N5j33nP7P8j04j93K27MN0k18M1J31m50M46j09No0J92
$$ -152 -197 -31 247 11 134 189 56 51 128 206 102 -91 136 140 190 -28 13 144 -306 140 31 36 -24 168
5899A68O8j74m72M00O2J9j05n9j3j25Q2k4K29j1k5j54J68j95J73J56j77m3l2J63
$$ 168 236 62 -410 -10 52 71 -34 -93 -106 -231 -149 -173 56 45 20 -134 34 -161 12 168 -9 -52 -84 79
5923G9j07p8K95r4k23M4Q3J61l00K46k0j00l86M63l9n8j69M8K79k1j95J57m4j89
$$ 79 -28 -106 189 95 -128 -84 -1 160 -140 106 86 -14 -400 63 24 -34 -203 -155 124 103 -92 65 21 -168
5947a68L2J36j2Mr7L22J54k83J42j18J51k80j04L05l37J91m5m0k18K99o1M4k38
$$ -168 -136 0 -12 -8 -105 217 371 88 230 112 263 -17 -121 184 -153 38 -7 -47 -265 34 -27 17 -221
5970b21J93R8r1j52JJ3j7L6K1K66k53L02l98M20m17L04j0j18l1j58L06j27J41
$$ -221 -28 70 -21 -173 -172 -159 -176 -140 -119 147 -106 196 -202 218 -199 105 95 -23 -54 -212 94 -33 108
5993A08j14J75n2j31J76q5j58J26j37O4J17k03M13k17k41M76j55L9q8j09K00k7
$$ 108 -6 169 117 -14 162 77 -81 45 -92 -28 89 -114 299 82 -159 317 162 201 113 4 204 177
6015A77j22K1j22q4q7K01J07j50R1K94k46K9j27j72K09n8M1R4r8k66K49O9k9k49
$$ 177 55 76 -46 -130 -217 -16 91 -59 32 326 80 109 -18 -190 19 -39 2 96 -2 -268 -19 50 21 -228
$$ [...]
8191H5
##END NTUPLES=NMR FID
##END=
