##TITLE=1H_LR-0139-C1-EtOAc-B-M
 CD3CN
 8 sc, 
 15.3.2023
##JCAMPDX= 6.0         $$ Bruker NMR JCAMP-DX V2.0
##DATA TYPE= NMR FID
##DATA CLASS= NTUPLES
##ORIGIN= UXNMR, Bruker Analytische Messtechnik GmbH
##OWNER= root
$$ XWIN-NMR		Version 3.5
$$ Wed Mar 15 14:21:31 2023 Russian Standard Time (UT+4h)  she@DPX200
##.OBSERVE FREQUENCY= 200.13135
##.OBSERVE NUCLEUS= ^1H
##.DELAY= (6, 6)
##.ACQUISITION MODE= SIMULTANEOUS
##.ACQUISITION SCHEME= undefined
##.AVERAGES= 8
##.DIGITISER RES= 18
##SPECTROMETER/DATA SYSTEM= spect
##.PULSE SEQUENCE= zg30
##.SOLVENT NAME= DMSO
##.SHIFT REFERENCE= (INTERNAL, DMSO, 0, 15.7039)
##AUDIT TRAIL= $$ (NUMBER, WHEN, WHO, WHERE, WHAT)
$$ ##TITLE= Audit trail, XWIN-NMR		Version 3.5
$$ ##JCAMPDX= 5.01
$$ ##ORIGIN= Bruker BioSpin GmbH
$$ ##OWNER= she
$$ F:/spectra/data/she/nmr/H-F/1/audita.txt
$$ ##AUDIT TRAIL=  $$ (NUMBER, WHEN, WHO, WHERE, WHAT)
(   1,<2023-03-15 14:20:31.43 +0400>,<she>,<DPX200>,
      <created by zg, POWCHK disabled, PULCHK disabled
       configuration hash MD5:
       00 E9 B6 7A A2 85 ED C7 34 08 36 98 17 FE 4E 26
       data hash MD5: 16K
       5D 1E 46 75 06 5D AA 71 B3 09 0A 72 C8 F3 68 22>)
$$ ##END=
$$ 
$$ hash MD5
$$ 34 CF 84 0F 0E 1F D8 E8 29 E5 40 0A 5F 68 3B A8
##$RELAX= 
##$RELAX= 
##$RELAX= 
##$RELAX= 
##$RELAX= 
##$RELAX= 
$$ Bruker specific parameters
$$ --------------------------
##$DU= <F:/spectra>
##$EXPNO= 1
##$NAME= <H-F>
##$PROCNO= 1
##$TYPE= <nmr>
##$USER= <she>
##$AMP= (0..31)
100 100 100 100 100 100 100 100 100 100 100 100 100 100 100 100 100 100 
100 100 100 100 100 100 100 100 100 100 100 100 100 100 
##$AQSEQ= 0
##$AQ_mod= 1
##$AUNM= <au_zg>
##$AUTOPOS= <>
##$BF1= 200.13
##$BF2= 200.13
##$BF3= 200.13
##$BF4= 200.13
##$BF5= 200.13
##$BF6= 200.13
##$BF7= 200.13
##$BF8= 200.13
##$BYTORDA= 1
##$CFDGTYP= 0
##$CFRGTYP= 5
##$CHEMSTR= <none>
##$CNST= (0..31)
1 1 145 1 1 1 1 1 1 1 1 1 1 1 1 1 1 1 1 1 1 1 1 1 1 1 1 1 1 1 1 1 
##$CPDPRG= <>
##$CPDPRG1= <>
##$CPDPRG2= <>
##$CPDPRG3= <>
##$CPDPRG4= <mlev>
##$CPDPRG5= <mlev>
##$CPDPRG6= <mlev>
##$CPDPRG7= <mlev>
##$CPDPRG8= <mlev>
##$CPDPRGB= <>
##$CPDPRGT= <>
##$D= (0..31)
0 1.2 0 0 0 0 0 0 0 0.06 0 0.03 0 0 0 0 0.0002 0 0 0 0 0 0 0 0 0 0 0 0 
0 0 0 
##$DATE= 1678875630
##$DBL= (0..7)
120 120 120 120 120 120 120 120 
##$DBP= (0..7)
150 150 150 150 150 150 150 150 
##$DBP07= 0
##$DBPNAM0= <>
##$DBPNAM1= <>
##$DBPNAM2= <>
##$DBPNAM3= <>
##$DBPNAM4= <>
##$DBPNAM5= <>
##$DBPNAM6= <>
##$DBPNAM7= <>
##$DBPOAL= (0..7)
0.5 0.5 0.5 0.5 0.5 0.5 0.5 0.5 
##$DBPOFFS= (0..7)
0 0 0 0 0 0 0 0 
##$DE= 6
##$DECBNUC= <off>
##$DECIM= 32
##$DECNUC= <off>
##$DECSTAT= 4
##$DIGMOD= 1
##$DIGTYP= 9
##$DL= (0..7)
0 120 120 120 120 120 120 120 
##$DP= (0..7)
150 150 150 150 150 150 150 150 
##$DP07= 0
##$DPNAME0= <>
##$DPNAME1= <>
##$DPNAME2= <>
##$DPNAME3= <>
##$DPNAME4= <>
##$DPNAME5= <>
##$DPNAME6= <>
##$DPNAME7= <>
##$DPOAL= (0..7)
0.5 0.5 0.5 0.5 0.5 0.5 0.5 0.5 
##$DPOFFS= (0..7)
0 0 0 0 0 0 0 0 
##$DQDMODE= 0
##$DR= 18
##$DS= 0
$$ [...]
##$SUBNAM2= <"">
##$SUBNAM3= <"">
##$SUBNAM4= <"">
##$SUBNAM5= <"">
##$SUBNAM6= <"">
##$SUBNAM7= <"">
##$SUBNAM8= <"">
##$SUBNAM9= <"">
##$SW= 18.05172834244
##$SWIBOX= (0..15)
0 0 2 0 0 0 0 0 0 0 0 0 0 0 0 0 
##$SW_h= 3612.71676300578
##$TD= 16384
##$TD0= 1
##$TE= 0
##$TE2= 300
##$TE3= 300
##$TEG= 300
##$TL= (0..7)
0 120 120 120 120 120 120 120 
##$TP= (0..7)
150 150 150 150 150 150 150 150 
##$TP07= 0
##$TPNAME0= <>
##$TPNAME1= <>
##$TPNAME2= <>
##$TPNAME3= <>
##$TPNAME4= <>
##$TPNAME5= <>
##$TPNAME6= <>
##$TPNAME7= <>
##$TPOAL= (0..7)
0.5 0.5 0.5 0.5 0.5 0.5 0.5 0.5 
##$TPOFFS= (0..7)
0 0 0 0 0 0 0 0 
##$TUNHIN= 0
##$TUNHOUT= 0
##$TUNXOUT= 0
##$USERA1= <user>
##$USERA2= <user>
##$USERA3= <user>
##$USERA4= <user>
##$USERA5= <user>
##$V9= 5
##$VALIST= <valist>
##$VCLIST= <CCCCCCCCCCCCCCC>
##$VD= 0
##$VDLIST= <DDDDDDDDDDDDDDD>
##$VPLIST= <PPPPPPPPPPPPPPP>
##$VTLIST= <TTTTTTTTTTTTTTT>
##$WBST= 1024
##$WBSW= 4
##$XGAIN= (0..3)
0 0 0 0 
##$XL= 0
##$YL= 0
##$YMAX_a= 291868
##$YMIN_a= -404150
##$ZGOPTNS= <>
##$ZL1= 120
##$ZL2= 120
##$ZL3= 120
##$ZL4= 120
##$ABSF1= 10
##$ABSF2= 0
##$ABSG= 5
##$ABSL= 3
##$ALPHA= 0
##$AQORDER= 0
##$ASSFAC= 0
##$ASSFACI= 0
##$ASSFACX= 0
##$ASSWID= 0
##$AUNMP= <proc_1d>
##$AZFE= 0.1
##$AZFW= 0.1
##$BCFW= 1
##$BC_mod= 2
##$BYTORDP= 1
##$COROFFS= 0
##$CY= 11.3945322036743
##$DATMOD= 1
##$DC= 2
##$DFILT= <>
##$DTYPP= 0
##$F1P= 2.36226072786647
##$F2P= -0.459571619588291
##$FCOR= 0.5
##$FTSIZE= 0
##$FT_mod= 4
##$GAMMA= 1
##$GB= 0.15
##$INTBC= 1
##$INTSCL= 1
##$ISEN= 128
##$LB= 0.24
##$LEV0= 0
##$LPBIN= 0
##$MAXI= 10000
##$MC2= 0
##$MEAN= 0
##$ME_mod= 0
##$MI= 1.114404
##$NCOEF= 0
##$NC_proc= 0
##$NLEV= 6
##$NOISF1= 3.799351
##$NOISF2= 2.8
##$NSP= 1
##$NTH_PI= 0
##$NZP= 0
##$OFFSET= 15.70392
##$PC= 1
##$PHC0= -19106.72
##$PHC1= 9.60074
##$PH_mod= 1
##$PKNL= yes
##$PPARMOD= 0
##$PSCAL= 0
##$PSIGN= 0
##$REVERSE= no
##$SF= 200.130013532006
##$SI= 16384
##$SIGF1= 3
##$SIGF2= 2
##$SINO= 400
##$SIOLD= 16384
##$SREGLST= <1H.CDCl3>
##$SSB= 0
##$STSI= 0
##$STSR= 0
##$SW_p= 3612.71676300578
##$SYMM= 0
##$S_DEV= 0
##$TDeff= 0
##$TDoff= 0
##$TI= <>
##$TILT= no
##$TM1= 0
##$TM2= 0
##$TOPLEV= 0
##$USERP1= <user>
##$USERP2= <user>
##$USERP3= <user>
##$USERP4= <user>
##$USERP5= <user>
##$WDW= 1
##$XDIM= 8192
##$YMAX_p= 0
##$YMIN_p= 0
$$ End of Bruker specific parameters
$$ ---------------------------------
##NTUPLES= NMR FID
##VAR_NAME=  TIME,          FID/REAL,        FID/IMAG
##SYMBOL=    X,             R,               I
##VAR_TYPE=  INDEPENDENT,   DEPENDENT,       DEPENDENT
##VAR_FORM=  AFFN,          ASDF,            ASDF
##VAR_DIM=   8192,          8192,            8192
##UNITS=     SECONDS,       ARBITRARY UNITS, ARBITRARY UNITS
##FACTOR=    0.0002768,     1,               1
##FIRST=     0,             0,               0
##LAST=      2.2672688,     0,               0
##MIN=       0,             -404150,         0
##MAX=       2.2672688,     291868,          0
$$ Real data points
##PAGE= N=1
##DATA TABLE= (X++(R..R)), XYDATA
$$ [...]
1930d62L17o0M20J64O07K62j50j16J61n64n59k99j33J97j59K18K19j05l07lk82
$$ -462 -145 -205 215 379 986 1248 1098 982 1143 579 20 -279 -412 -215 -374 -156 63 -42 -349 -352 -634
1951f34l09j86k6M18O23K93N62R6q1k05K54q28L00l65L54K61N9N0J0j50m36l93
$$ -634 -943 -1129 -1155 -737 -114 179 741 837 756 551 805 -23 277 -88 266 527 586 636 646 496 60 -333
1973c33l06m13j39N53o7M28J79l3R9k02k69n0K40K97K53J97O25J93k44j50l87
$$ -333 -639 -1052 -1191 -638 -705 -277 -98 -131 -32 -234 -503 -553 -313 -16 237 434 1059 1252 1008 858 471
1994D71j65m65O3j6k3J24K84j49k65k22m33j2l69l2L06N6J016n7K38K22j8l93
$$ 471 306 -159 -96 -112 -135 -11 273 124 -141 -363 -796 -808 -1177 -1209 -903 -847 169 112 350 572 554 161
2016A61o1J87j32K28K73L31m2o7l50k90l81m13k59K21j84J36L44J93k33P3k50
$$ 161 100 287 155 383 656 987 945 878 528 238 -143 -556 -815 -594 -778 -642 -298 -105 -338 -265 -515
2037e15l34J27J62J99M58K79N53K7J9J03l41m56l48J82R5J1J6J51l41N4l45l39
$$ -515 -849 -722 -560 -361 97 376 929 956 975 1078 737 281 -67 115 210 221 237 388 47 101 -244 -583
2059e83n10p6L98k6M08J12Q2M95K01p4n82K70q5J39K73L73Q9j0l2j79k08m60m97
$$ -583 -1093 -1169 -771 -797 -389 -277 -195 300 501 427 -155 115 30 169 442 815 904 894 862 683 475 15 -482
2082d82l6j78K02K66j9J34k92K9j49l26K14j07L59J28L45N37M47m24M8p9l28j84
$$ -482 -518 -696 -494 -228 -247 -113 -405 -376 -525 -851 -637 -744 -385 -257 88 625 1072 648 696 617 289 105
2104A05K10K4l28M57k30J18p0n35Q3m14m04q3K59J74K95M18Nj21m2J56l99J30
$$ 105 315 339 11 468 238 356 286 -249 -166 -580 -984 -1067 -808 -634 -339 79 84 -37 -79 77 -322 -192
2126a92K78J02J88L40J94j73M13o57k63l62k09k1o8K58J68k10j83o8L4l18q3L00
$$ -192 86 188 376 716 910 737 1150 493 230 -132 -341 -362 -430 -172 -4 -214 -397 -465 -431 -749 -832 -532
2148e32K49J00j36Q14R7J39k66J33l07j26l00O42K6j53K53k35j05k26k51m86l9
$$ -532 -283 -183 -319 495 592 731 465 598 291 165 -135 507 533 380 633 398 293 67 -184 -670 -709
2169g09Q3p0J40K65O8j04K19k5l24J93K13J17L6L47L88K6j53l5j60k84n2l85l69
$$ -709 -626 -696 -556 -291 -223 -327 -108 -133 -457 -264 -51 66 102 449 837 863 710 675 515 231 179 -206 -575
2192e75N14o9K85j92l2k15j27m8j40Ml4J2O86Rl1K40K71l62p6J04L1Q7m2L27j9
$$ -575 -61 -130 155 -37 -69 -284 -411 -459 -599 -595 -629 -617 69 78 47 287 558 196 120 224 255 342 300 627 608
2217F08j37l03j62j71k37l16K28L4l8L09R9k21K32P6k88J36J16Q9J02L85j33L99
$$ 608 471 168 6 -165 -402 -718 -490 -456 -494 -185 -86 -307 -75 1 -287 -151 -35 54 156 541 408 807
2239H07j2j35m42J7q4k85J03k55M38j86J01k83L98n99j57q1J3r9J83M94J87jp9
$$ 807 795 660 218 235 151 -134 -31 -286 152 -34 67 -216 182 -417 -574 -655 -642 -741 -558 -64 123 122 43
2262D3N02l06m8L1P9N1j07K31J91j11k56J74l84m47j09K03Nm44P79j5k46q4q8
$$ 43 545 239 191 222 301 352 245 476 667 556 300 474 90 -357 -466 -263 -258 -702 77 62 -184 -268 -356
2285c56K30l40P9K61K65N8R7K91n8j5j3m07pl5Q4j17RR5k37j28l5l8J0k68l7R1
$$ -356 -126 -466 -387 -126 139 197 294 585 527 512 499 92 85 50 134 17 26 121 -116 -244 -279 -317 -307 -575 -612 -521
2311e21j46O27J51k13J31J69k27O5j47J54N0K33J79k36M44k26K3m11k44p3rl5
$$ -521 -667 -40 111 -102 29 198 -29 36 -111 43 93 326 505 269 713 487 510 99 -145 -218 -227 -262
2333b62m3P8j44Q6K15j67k82J94J23j37L80J93J12L64k73K54l60j34k07K10j90
$$ -262 -305 -227 -371 -285 -70 -237 -519 -325 -202 -339 41 234 346 710 437 691 331 197 -10 200 10
2354A0l7j5K03l9j15J25o5n10Q6l9j62M4M41K7P9J60j17pj43O3J45K24J16R3j97
$$ 10 -27 -42 161 122 7 132 67 -443 -357 -396 -558 -514 -73 -46 33 193 76 69 -74 -11 134 358 474 567 370
2379C70N4N2j77l10o7m6J0J23j74r6J22K54m60J53K3lk31J13K9K62K66k0J24J23
$$ 370 424 476 299 -11 -78 -124 -114 9 -165 -261 -139 115 -345 -192 -169 -172 -403 -290 -261 1 267 247 371 494
2403D94l16m5j01J83l17LN55R4n97K84l8k41j15j99l83J38K28K24L29m7J6p1r6
$$ 494 178 133 32 215 -102 -99 456 550 -47 237 199 -42 -157 -356 -739 -601 -373 -149 180 133 149 78 -18
2426a8np1K13n2J84q6L57k59J10j00k44j79j71K33m1N5n3K71j91m52K01J23k30
$$ -18 -23 -94 119 67 251 165 522 263 373 273 29 -150 -321 -88 -129 -74 -127 144 -47 -499 -298 -175 -405
2449d05L51m02L10Q0L56l26J72Q5j92J57j13j79L58r3N4n5K62k55m42K74k98J07
$$ -405 -54 -456 -146 -66 290 -36 136 221 29 186 73 -106 252 159 213 158 420 165 -277 -3 -301 -194
2471a94p3M3J1o4K45L39m73M88m27Q4l16L29N5p7K74N10m31qPk25k50j72K25j8
$$ -194 -267 -224 -213 -277 -32 307 -166 322 -105 -21 -337 -8 47 -30 244 754 323 315 322 97 -153 -325 -100 -118
2495a18K20j48K22l16K5k67p1L01k74L21k46L77j37N34j97P8o5l16LL26r1J69
$$ -118 102 -46 176 -140 -115 -382 -453 -152 -426 -105 -351 26 -111 423 226 304 239 -77 -74 252 161 330
2517C30l2J95n61K31J06m92J6O3k23N9L95j55Q6j09K48L1k91k04j30L32j09L51
$$ 330 298 493 -68 163 269 -223 -207 -144 -367 -308 87 -68 18 -91 157 188 -103 -307 -437 -105 -214 137
2539A37K6J58K24m86J44j9mj54j52mM7K8L78o4k12jj59j62N8N8j47M22r0J3o7
$$ 137 163 321 545 59 203 184 180 26 -126 -130 -83 -55 323 259 47 46 -113 -275 -217 -159 -306 116 26 39 -28
2564b8L69r4j43j27j58K58N3J8j17L83j94k26L14m01l17k24M92j86N9r9J84J38
$$ -28 341 247 104 -23 -181 77 130 148 31 414 220 -6 308 -93 -410 -634 -142 -328 -269 -368 -184 -46
2586d6O5Kj21j13k3K46q2K83Q8m7j59Q5K9j08m9j31J21L9o2K6J71j10j77k12J54
$$ -46 19 21 -100 -213 -236 10 -72 211 299 252 93 178 207 99 50 -81 40 79 17 43 214 104 -73 -285 -131
2611a31j83j13K91JK72M7M9k21K66l13K48l73K90n3PR9J54l8m3l06lJ60l67R3
$$ -131 -314 -427 -136 -135 137 184 233 12 278 -35 213 -160 130 77 84 183 337 299 256 -50 -53 107 -260 -167
2635a67r7K07Q1K85j63l48K6pK16j99K35O2P7L8N4J17l47k5K45l65q3K04j66K22
$$ -167 -264 -57 24 309 146 -202 -176 -183 33 -166 69 131 208 246 300 417 70 45 290 -75 -158 46 -120 102
2659A02J62j00j60k31L3o8L9K07k86K94j31M1J30K94k54J23k11J08M7j44L45l1
$$ 102 264 164 4 -227 -194 -262 -223 -16 -302 -8 -139 -98 32 326 72 195 -16 92 139 -5 340 309
2681C09k01J93p7j71k64J5J62l03r4O03k87P9J9J88j34j74j04L00j5k22M22K97
$$ 309 108 301 224 53 -211 -196 -34 -337 -431 172 -115 -36 -17 171 37 -137 -241 59 44 -178 244 541
2703E41l10j23J54J6k01k81L20J26k51K10k96L82m06o6J55l28j81M47J66k31M1
$$ 541 231 108 262 278 77 -204 116 242 -9 201 -95 287 -119 -185 -30 -358 -539 -92 74 -157 -116
2724a16J84j40j76N4P20m35q5Q4N23k81k04o1K04J2j62j06m4k77r3K84LJ8j47
$$ -116 68 -72 -248 -194 526 91 6 90 613 332 128 67 271 283 121 15 -29 -306 -399 -115 -112 -94 -241
2747b41L62j60j82o4R6J85k04K76M53k57k4j45L30l43o9o6J69L9j01J25Q5m37
$$ -241 121 -39 -221 -285 -189 -4 -208 68 521 264 240 95 425 82 13 -53 116 155 54 179 264 -173
2769a73J55K02k50k73O1K58k16r3K62K33k48lK89nm54L4M05k5k73L29P7j84K17
$$ -173 -18 184 -66 -339 -278 -20 -236 -329 -67 166 -82 -85 204 199 -255 -221 184 159 -114 215 292 108 325
2792C25m13J99p6k76K26j58J04l39N42q2m61K44M31l83l09L64K90L3l31K70M70
$$ 325 -88 111 35 -241 -15 -173 -69 -408 134 52 -409 -165 266 -117 -426 -62 228 261 -70 200 670
2813F70n15j00j32L61l99j20P16j42m87K12L15k38l38j49K88l1k06J76K92k75
$$ 670 155 55 -77 284 -115 -235 481 339 -148 64 379 141 -197 -346 -58 -89 -295 -119 173 -102
2833a02J60O3l1j22o9L25n8k61J51L09o8l41j37N55m42j89R2L14n34LN07om40
$$ -102 58 121 90 -32 -101 224 166 -95 56 365 297 -44 -181 374 -68 -257 -165 149 -385 -382 125 119 -321
2856c21j8L43j22k09K43K23r3j51K62J24m1j14M4J98n28k10M88J30o10L62J69
$$ -321 -339 4 -118 -327 -84 139 46 -105 157 281 240 126 170 368 -160 -370 118 248 -362 0 169
2877A69Q2o44L00qj78k07K80J98j80j4K66L01m11j37J71M29o79J26O81l15j67
$$ 169 251 -393 -93 -101 -279 -486 -206 -8 -188 -202 64 365 -46 -183 -12 417 -262 -136 545 230 63
2898F3R2L32n97J6J09J30l41j03L77L8qm45L94k8l54j11L43J40m40L68M17p5m11
$$ 63 155 487 -110 -94 15 145 -196 -299 78 116 108 -337 57 29 -325 -436 -93 47 -393 -25 392 317 -94
2921i4J68J33j77J13k7oq3l82P97l22m06K88J22r9m91J03N42l09j04M54j0j19
$$ -94 74 207 30 143 116 110 27 -355 442 120 -286 2 124 25 -466 -363 179 -130 -234 220 210 91
2943I1n23O25J75n73j58M77J65k92K9M34j26m98J34K55m94m21N60M93n68l5M72
$$ 91 -432 193 368 -205 -363 114 279 -13 16 450 324 -174 -40 215 -279 -700 -140 353 -215 -250 222
2964B22j93j20j14R6K30l61J40J78j52j5l3M54j91l69K72K39l65j22M70m6k97
$$ 222 29 -91 -205 -109 121 -240 -100 78 -74 -89 -122 332 141 -228 44 283 -82 -204 266 220 -77
2985g7J01L45m38l05N4M07j24n83O88M13m57l96K84J66m54p6P60P3l41j47K69
$$ -77 24 369 -69 -374 -320 87 -37 -620 68 481 24 -372 -88 78 -376 -452 308 381 40 -107 162
3006A62K96l48r7J95j08k97K74K57k18k83M20M8j21o58K81J32p9O2K26k10j24
$$ 162 458 110 13 208 100 -197 77 334 116 -167 253 301 180 -478 -197 -65 -144 -82 144 -66 -190
3027a90J13M93k02m80L50J34m6k37J94K23n9m00K72Nl25J33Q3l35l22K29N31l22
$$ -190 -77 416 214 -266 84 218 172 -65 129 352 293 -107 165 170 -155 -22 61 -274 -596 -367 164 -158
3049a58j76J53P6k84J21K22J60k63K09K70P9k34l53O25l95j89o9M45l27k76N41
$$ -158 -334 -181 -105 -389 -268 -46 114 -149 60 330 409 175 -178 447 52 -137 -206 239 -88 -364 177
3070A77J25o7l52k7J62m07J32L59J08k29k12M62J01n33K47J71k29k49K15M25k46
$$ 177 302 235 -117 -144 18 -389 -257 102 210 -19 -231 231 332 -201 46 217 -12 -261 -46 379 133
3091A33k95N87k52l18l5K37J63j98k69K12K30n54J50L73k46M7p3o7P1j23N49J72
$$ 133 -162 425 173 -145 -180 57 220 22 -247 -35 195 -359 -209 164 -82 -35 -108 -175 -104 -227 322 494
3113D94p61L84K30j4m18J26K03k57k65K84J83j47j82J65j8j46k27L13P6k92p0
$$ 494 -267 117 347 333 -85 41 244 -13 -278 6 189 42 -140 25 7 -139 -366 -53 23 -269 -339
3134c39M48J16k77J32P6k11k89L13J39M9k79L82J98n81P8M14l19o7q5M55k69l67
$$ -339 109 225 -52 80 156 -55 -344 -31 108 157 -122 260 458 -123 -45 369 50 -17 -102 353 84 -283
3156b83J93L47j91k13M0N5Q4l94L09L94l16k56O02j35q5n15N66k41l25O26K8k07
$$ -283 -90 257 66 -147 -107 -52 32 -362 -53 341 25 -231 371 236 151 -364 202 -39 -364 262 290 83
3178H3l48N16o9k61l1l9Q9m2J76R6L0k81K54k54J49k09J53J27p8j50K16K07k29
$$ 83 -265 251 182 -79 -110 -149 -60 -102 74 170 200 -81 173 -81 68 -141 12 139 61 -89 127 334 105
3201A05Pl6J88m81J9K60N4k22K79j79r1k55N5L80j41k2J14j84K2R4RL72m14J20
$$ 105 112 76 264 -217 -198 62 116 -106 173 -6 -97 -352 -297 83 -58 -80 34 -150 -128 -34 -25 347 -67 53
3225E3J06k25j11K43K54k33j43N3J26j25k39J5O2k5o6N8K77k45K38j49K14n0j49
$$ 53 159 -66 -177 66 320 87 -56 -3 123 -2 -241 -226 -164 -189 -255 -197 80 -165 73 -76 138 88 -61
3248f1K55q5n0J17J00J7l31M13o9l14m8J89p3j28l4J74n4j28P9K16m30K64j00
$$ -61 194 109 59 176 276 293 -38 375 306 -8 -56 133 60 -68 -102 72 18 -110 -31 185 -245 19 -81
3271h1j79K69q2J12M48l30j65P7K31l51j6K45M6k74J60Rl8k82K60K8k40J31k9
$$ -81 -260 9 -73 39 487 157 -8 69 300 -51 -67 178 224 -50 110 119 81 -201 59 87 -153 -22 -51
3294e1Q6k73R9O0M4k39J60K72l0m02M25j47N3J82j0j37l9O4l05K60j6n8pm5m19
$$ -51 35 -238 -139 -79 -35 -274 -114 158 128 -274 151 4 57 239 229 92 53 117 -188 72 56 -2 -9 -54 -473
3319d73M65M0j8j60j74O3K38j32K31l9q8J06R2K71k44o1j85J91K96m26M35l12
$$ -473 -8 32 14 -146 -320 -257 -19 -151 80 41 -47 59 151 422 178 117 -68 123 419 -7 428 116
3341A16k11M06n15M6J1q4L52o9l06J69m1J31q2J80p3j76k99L41j7R5L62j84n6
$$ 116 -95 311 -204 -158 -147 -231 121 52 -254 -85 -126 5 -77 103 30 -146 -445 -104 -121 -26 336 152 96
3364I6k45M60k11M4k07R5q8k1J4K69l14O1k63J98L05l94k15L70J20j12M5p7K50
$$ 96 -149 311 100 144 -63 32 -56 -77 -63 206 -108 -47 -310 -112 193 -201 -416 -46 74 -38 7 -70 180
3387A80k09l68M05O7J4j90L30m7J8l09Q0K9j06P3r2k78L36Q4k14J40K24k81P7
$$ 180 -29 -397 8 75 89 -101 229 182 200 -109 -29 0 -106 -33 -125 -403 -67 17 -197 -57 167 -114 -37
3410c7J01l6j56K56j86r6L61n2Oj41M5J43L1l39N7j29L30m1m2j68K62n26M25k18
$$ -37 64 28 -128 128 -58 -154 207 155 161 20 65 208 239 -100 -43 -172 158 117 75 -93 169 -357 68 -150
3434a50OM27k98O1J2jJ93J09l66m8J74J93l5K0l34K01j08p8j20L39l31J75j82
$$ -150 -144 283 -15 46 58 57 250 359 -7 -55 119 312 277 297 -37 164 56 -22 -142 197 -134 41 -141
3457a41L64j96q0j18J60j4j73K57k12L47Rk85K65j51K84k41J25m5N7l04j05L03
$$ -141 223 27 -53 -171 -11 -25 -198 59 -153 194 203 -82 183 32 316 75 200 155 212 -92 -197 106
3479A06l60K34J07n59K66K25J54l35k8K92Ml1J06m58K73j31L6J86r8J67j05o3
$$ 106 -254 -20 87 -472 -206 19 173 -162 -190 102 106 75 181 -277 -4 -135 -99 87 -11 156 51 -12
3501a2LK95j58k02J79j2j41K4k8j61J65k97L24j63j11K38O0k89J86K84n8J1L2
$$ -12 -9 286 128 -74 105 93 -48 -24 -52 -213 -48 -345 -21 -184 -295 -57 3 -286 -100 184 126 137 169
3524A69j93L05j27l74K84o8J32k07L32l85K18Q9j28q8j56J43Q3K4l07K22k08K15
$$ 169 -24 281 154 -220 64 -4 128 -79 253 -132 86 175 47 -41 -197 -54 29 53 -254 -32 -240 -25
3546b5J79L5l28K91j10J43k48N5J11j30mL08l19K35l76L63j07r7m9J52l70L88
$$ -25 154 189 -139 152 42 185 -63 -8 103 -27 -31 277 -42 193 -183 180 73 -24 -73 79 -291 97
3568I7j55K5K92k71J47m12M19k07L15k48K37j57J33r7j82J19j41K98j98J04k26
$$ 97 -58 -33 259 -12 135 -277 142 -65 250 2 239 82 215 118 -64 55 -86 212 14 118 -108
3589a08K2q5k03L45n0p7K55j40k2R9j22j7J23j36J26L5rJ8j78J28K8J69j35k3
$$ -108 -86 -171 -374 -29 -79 -156 99 -41 -63 36 -86 -103 20 -116 10 45 36 54 -124 4 32 201 66 43
3613D3M9q0r0K42j89j01nJ24K43k54J55l77K91k22j86J27J00k2K91j36J33q1k9
$$ 43 92 12 -78 164 -25 -126 -131 -7 236 -18 137 -240 51 -171 -357 -230 -130 -152 139 3 136 55 26
3636B6%P1j14Q5j89qK37M4m05J45k9rj00K2L03j62k4j28J0L54j70L6R0o0r4J34
$$ 26 26 97 -17 68 -121 -129 108 152 -253 -108 -137 -146 -246 -224 79 -83 -107 -235 -225 129 -41 -5 85 25 -69 65
3662F5J27j34k1J08k50N0J90j32M5N2j53m5j9L21j51m57K37N0J29k39K26O4P4
$$ 65 192 58 37 145 -105 -55 135 3 48 100 -53 -98 -117 204 53 -404 -167 -117 12 -227 -1 63 137
3685A37k65N05j61r4K1J07l78K23j61j81P5J46M9j4N5j12J3j20K96l79J99O0R9
$$ 137 -128 377 216 122 143 250 -128 95 -66 -247 -172 -26 23 9 64 -48 -35 -155 141 -238 -39 21 120
3708A20j53K93l50J7n3L29k28j70J21J61P2M3p8j36R7j74j54J92j5J40j49j7J92
$$ 120 -33 260 -90 -73 -126 203 -25 -195 -74 87 159 202 124 -12 85 -89 -243 -51 -66 74 -75 -92 100
3731A00N3l28K65l1j58j69L30J36j96N9J32j09k48L52j39rJ2j51L06n8l54K12
$$ 100 153 -175 90 59 -99 -268 62 198 2 61 193 84 -164 188 49 40 52 -99 207 149 -205 7
3753Gp9J0J36n8J93n04J77q7L89j48q5L1Q3r6L5j46J62J11k99L88M8j60j06MJ58
$$ 7 -72 -62 74 16 209 -295 -118 -205 184 36 -49 -18 65 -31 4 -142 20 131 -168 220 268 108 2 6 164
3778A64J64l07Mq4j54K40j60K09p4J51J4m03K0J14K18k2r2K03q7n3l2O8j10oJ62
$$ 164 328 21 25 -59 -213 27 -133 76 2 153 167 -236 -216 -102 116 94 2 205 118 65 33 101 -9 -15 147
3803A47j68J21m9J24j47j14k58L42k24J70k25M73J29l43J85r0q2J83j50k50K70
$$ 147 -21 100 51 175 28 -86 -344 -2 -226 -56 -281 192 321 -22 163 73 -9 174 24 -226 44
3824D4P7j65Q1O0o8R0N1k87O8K12j44N8p6J35j52l8k13K96J43k99L06l38J25j3
$$ 44 121 -44 37 97 29 119 170 -117 -49 163 19 77 1 136 -16 -54 -267 29 172 -127 179 -159 -34 -47
3848d7J59j57J40J8J96l08J00j23k22L36N2r8k54K70k05k08K75j03L7j08K49j14
$$ -47 112 -45 95 113 309 1 101 -22 -244 92 144 46 -208 62 -143 -351 -76 -179 -142 -250 -1 -115
3870a15K53j28k9m3k5L8L9Qk05M16j25N8j50K3K01l22J16j25J75Q6m3J01k25l4
$$ -115 138 10 -19 -62 -87 -49 -10 -2 -207 209 84 142 -8 15 216 -106 10 -115 60 146 103 204 -21 -55
3894e5K08l92J36J09J18R1k68J57j85K09l09J53L02l22R8Q4k42J08J00j97M4K74
$$ -55 153 -239 -103 6 124 215 -53 104 -81 128 -181 -28 274 -48 50 134 -108 0 100 -97 -53 221
3916B21j10k85L2N4OO2p1L62j35j48k36J74Q2p2P4J38k30K49j60l7K80M3k97Q7
$$ 221 111 -174 -142 -88 -82 -20 -91 271 136 -12 -248 -74 8 -64 10 148 -82 167 7 -30 250 293 -4 83
3940H3k63K67j17p6M50m79L15k11J51pj70J90j60j25K53k15j05M05k20Q2N7r1
$$ 83 -180 87 -30 -106 344 -135 180 -31 120 113 -57 133 -27 -152 101 -114 -219 186 -34 48 105 14
3962A4K1R3j32kKK11j48k47J82L8Nj98k65O45j03J5q4m7J33j8l50M52j07nL3k35
$$ 14 35 128 -4 -6 -4 207 59 -188 -6 32 37 -161 -426 219 116 131 47 0 133 115 -235 217 110 105 138 -97
3988i7J06L60l20r6K16j71p1k24L07J57l39J66j34J75Qm5m9J70r6k45R4J61K7
$$ -97 9 369 49 -47 169 -2 -73 -297 10 167 -172 -6 -140 35 43 -2 -51 119 23 -222 -128 33 60
4011F0N6j39J02j54j34M98q2j43q1j0K26j69J28k82j31J17O4M7o8J25k40K00J39
$$ 60 116 -23 79 -75 -209 289 207 64 -17 -27 199 30 158 -124 -255 -138 -74 -27 -95 30 -210 -10 129
4034A29r7j07N1J2J41j47r4J45j06l1J74J8j50r5L52l42O0L1K11Rj19l9k82J74
$$ 129 32 -75 -24 -12 129 -18 -112 33 -73 -104 70 88 -62 -157 195 -147 -87 -56 155 164 45 6 -276 -102
4058a02o4%J02rJ99l8p9J87l45K31P9r3j58M3J27O4k40L84l41K32j5l14J98K4
$$ -102 -166 -166 -64 -73 126 88 9 196 -149 82 161 68 -90 -47 80 144 -96 288 -53 179 164 -150 48 72
4082G2J44k02pj74M16j42l37K62J37l87K01l21M81j13K41r1k22R1M1O0l00J37
$$ 72 216 14 7 -167 249 107 -230 32 169 -218 -17 -338 143 30 271 180 -42 49 90 150 -150 -13
4104a3l2R9J84k97L2K77k42K1j23p9m9N2K41k2N5j54j16R4R1j44K08q4MO7j34
$$ -13 -45 54 238 -59 -27 250 8 29 -94 -173 -222 -170 71 49 104 -50 -166 -72 19 -125 83 -1 3 70 -64
4129f4L9J49k35J68q7K32l37P8O4K46k80k05K15m1M2o3j26j09J12L03j94J18j6
$$ -64 -25 124 -111 57 -30 202 -135 -57 7 253 -27 -232 -17 -58 -16 -79 -205 -314 -202 101 -93 25 9
4152IJ3m6P7j24L60k97l3L6m9J30k38K24j2k46J68J14j84J20j64K28r8N8J02q4
$$ 9 22 -24 53 -71 289 -8 -41 -5 -54 76 -162 62 50 -196 -28 86 -98 22 -142 86 -12 46 148 64
4176F4j82K60j8k41j2M03q3l1j63K46Q7k94j57L09j2n5j59k9O8k91K33MJ25l85
$$ 64 -118 142 124 -117 -129 274 191 160 -3 243 330 36 -121 188 176 121 -38 -67 1 -290 -57 -53 72 -313
4200c13O4M68m87J20K36J18L8o32M45j10L7n8o8K97k54J12O3j51L5j74N64l75
$$ -313 -249 219 -268 -148 88 206 244 -388 57 -53 -16 -74 -142 155 -99 13 76 -75 -40 -214 350 -25
4222b5j19K3J63r2j47K39k56Q4P2k9L57n22L06M9m2m2j59K19o8R2j89J43K5P1
$$ -25 -144 -121 42 -50 -197 42 -214 -130 -58 -87 270 -252 54 103 61 19 -140 79 11 103 -86 57 82 153
4246A53l65M18j42k10K13k17kJ20K19l42J31O8K19k30j09p8L33l11L00k81J59
$$ 153 -212 206 64 -146 67 -150 -152 -32 187 -155 -24 44 263 33 -76 -154 179 -132 168 -113 46
4267D6k03K66J72j71l09M25l58J41k77L63r2N4k26L07P8k96J38J83k08k43J19
$$ 46 -157 109 281 110 -199 226 -132 9 -268 95 3 57 -169 138 216 -80 58 241 33 -210 -91
4288i1K65M5l33J2M72l42J47k59K79j95j74K99k75O4j27L60k7n08M52p9J5j46
$$ -91 174 219 -114 -102 370 28 175 -84 195 0 -174 125 -150 -86 -213 147 120 -388 64 -15 0 -146
4310a46O6J51Q5M3j43K35n91L28j0J26m3k27K83j96J86j88J07k56j86K19jK47
$$ -146 -80 71 156 199 56 291 -300 28 18 144 101 -126 157 -39 147 -41 66 -190 -376 -157 -158 89
4332H9l09K96J19k03N5J44j98j21R9L04Q1l25k4J60j03k22J37K44j69k52L8L04
$$ 89 -220 76 195 -8 47 191 -7 -128 -29 275 356 31 7 167 64 -158 -21 223 54 -198 -160 144
4354A44l67P9K19o5k33L14K1m38K26j30L85k67K5j6N74l42j48J75k88j6MM49k70
$$ 144 -223 -144 75 10 -223 91 112 -326 -100 -230 155 -112 -87 -103 471 129 -19 156 -132 -148 -144 305 35
4377C5j15Q2M54l19k74K63p5j44Kl2J47l9q6J66p1j44J6K49j17o5M6K72l60o5
$$ 35 -80 2 456 137 -137 126 51 -93 -91 -123 24 -15 -101 65 -6 -150 -134 115 -2 -67 -21 251 -109 -174
4401a74J49J40K4j50k6m6j80kL03n0j57K65Q6j56k40K00J27n1k89K58K91j41l39
$$ -174 -25 115 139 -11 -37 -83 -263 -265 38 -12 -169 96 182 26 -214 -14 113 62 -227 31 322 181 -158
4424a58K65j14r7J58J16k20k82M42O8q0k27J81K10j49l96K47k9M7j77J82J75k90
$$ -158 107 -7 -104 54 170 -50 -332 110 178 98 -129 52 262 113 -283 -36 -65 -18 -195 -13 162 -128
4446a28R3k3K32k31j07K00N9k54J52J95j75q3Q2L39p99M16Q2L90m98p0L41k40
$$ -128 -35 -58 174 -57 -164 36 95 -159 -7 188 13 -70 12 351 -448 -32 50 440 -58 -128 213 -27
4468b7J07l07M06j83j19J26J93j75k22L27O7k98N7J2Q3J07p4J33j49j3j38K1R
$$ -27 80 -227 179 -4 -123 3 196 21 -201 126 193 -105 -48 -36 47 154 80 213 64 51 -87 -66 -57
4491e7l38M71J55k62J4Q8rl6j35J50J9k88p2M84j7k05j52M90k59P2R5N0m45L47
$$ -57 -395 76 231 -31 -17 71 62 26 -109 41 60 -228 -300 184 167 -38 -190 300 41 113 208 258 -187 160
4515A60JOk55MJ96q8q7j7K39l54K27k79M84O0m29O3J80l13K76k1k19Q4J2lJ52
$$ 160 161 167 -88 -84 112 24 -63 -80 159 -195 32 -247 237 297 -132 -69 111 -202 74 53 -166 -82 -70 -73 79
4540G9K04k92J05K06o26L07J16j37J3j05K11kj39J05J06m33L64Q5N9l67j3J36
$$ 79 283 -9 96 302 -324 -17 99 -38 -25 -130 81 79 -60 45 151 -282 82 167 226 -141 -154 -18
4562a8N7J1k48K78j04r4j88N10l18R4K23%k69K0j33L7R5J22J31j94l66M77M7j3
$$ -18 39 50 -198 80 -24 -118 -306 204 -114 -20 203 203 -66 -46 -179 -142 -47 75 206 12 -354 123 170 157
4586A57j74k9L39k80r1K4N8J26m7J21r3m44K27J75J16l44K36K5k06J68j50J98
$$ 157 -17 -46 293 13 -78 -54 4 130 83 204 111 -333 -106 69 185 -159 77 102 -104 64 -86 112
4608A12r6j85L00j36j58J04K23j17k18J11m3K25j77M8k84K98m1R7j54K01j76J33
$$ 112 16 -169 131 -5 -163 -59 164 47 -171 -60 -103 122 -55 -7 -291 7 -34 63 -91 110 -66 67
4630F7j02q8J25J16j04r1J02K87j99j26J15r7k81K05r7K27r5o8J72J36M1l58R3
$$ 67 -35 -123 2 118 14 -77 25 312 113 -13 102 5 -276 -71 -168 59 -36 -104 68 204 245 -113 -20
4653b0Q3or9K37l65K74k68L48m8k16O9M4l1Nj08J31J5j54L17p6k9k67L35l57K64
$$ -20 63 57 -42 195 -170 104 -164 184 136 -80 -11 33 2 7 -101 30 45 -109 208 132 103 -164 171 -186 78
4678G8k08L77m33J47NJ49k44J09k7j66K46k6q3J14q8QK63k12k35L17l42M19m65
$$ 78 -130 247 -186 -39 -34 115 -129 -20 -47 -213 33 7 -76 38 -50 -42 221 9 -226 91 -251 168 -297
4701b97L31K22l05J74k24J14lP2m4K07k62J30k08K16j76R9N9j23l4J98j63Q3k35
$$ -297 34 256 -49 125 -99 15 12 84 40 247 -15 115 -93 123 -53 46 105 -18 -52 146 -17 66 -169
4724a69K20L2m40L71K27k75m9K15j86M4N0kO2k53J76l8L3L2N5j70K34j02j83j5
$$ -169 51 83 -357 14 241 -34 -83 132 -54 -10 40 38 100 -153 23 -15 18 50 105 -65 169 67 -116 -131
4748a31j9K27J93l02j69L63k19K18j32r8K88m19J40J41k52qK40n6r5M0K4p8K85
$$ -131 -150 77 270 -32 -201 162 -57 161 29 -69 219 -200 -60 81 -171 -179 61 5 -90 -50 -26 -104 181
4771A81l34q2J74K56L9k14q2o5P7J48J82k12R8k16K31L4l06J92m08K15j81L58
$$ 181 -153 -235 -61 195 234 20 -62 -127 -50 98 280 68 166 -50 181 215 -91 101 -307 -92 -273 85
4793H5n7j25j3K42j65N2m4rK8q3L1J77j84k58N77k19j17k8K58R8l46jJ66p4j08
$$ 85 28 -97 -110 132 -33 19 -25 -34 -6 -89 -58 119 -65 -323 254 35 -82 -110 148 246 -100 -101 65 -9 -117
4818a17L7m3K47N2k91L53k93J30J12k73J27l79O01j23o8p3J38j25j6L35k14k57
$$ -117 -80 -123 124 176 -115 238 -55 75 187 -86 41 -338 263 140 72 -1 137 12 -4 331 117 -140
4840a40K5R4J58k37J71J38k81j95J43J98Kj90K46n3j45J7K83k15O2M4m3R3K1k33
$$ -140 -115 -21 137 -100 71 209 -72 -267 -124 74 76 -114 132 79 -66 -49 234 19 81 125 82 175 196 -37
4864c7j22L07L7j66l66L92O9r3l29L25N6P5j04k00J14k46K96L39l82ln7J66j03
$$ -37 -159 148 185 19 -347 45 114 21 -308 17 73 148 44 -156 -42 -288 8 347 -35 -38 -95 71 -32
4887c2P9L0L1j73M4J65j20j00J78k43J90J77j74j25K4P9j82M2L08l12J68j35R7
$$ -32 47 77 108 -65 -21 144 24 -76 102 -141 49 226 52 -73 -49 30 -152 -110 198 -114 54 -81 16
4910A6J01k1l03K37Q7n5k74O6L37k97J23p5J45J20j46p0L2J93Kk94J64K75m97
$$ 16 117 96 -207 30 117 62 -212 -146 191 -106 17 -58 87 207 61 -9 23 216 218 -76 88 363 -134
4933a34o6M22j93l33K70o4K01k00J97Q6j87j4J41k04j86M86l08P3j42K56jQ4k40
$$ -134 -200 222 29 -304 -34 -98 103 -97 100 186 -1 -15 126 -78 -264 222 -86 -13 -155 101 100 184 -56
4956e6J29n6j83J54j24K42J55m49J03n3Q2q8K23k18R4K2j3qO5J84k59J11r6L4
$$ -56 73 17 -166 -12 -136 106 261 -188 -85 -138 -56 -144 79 -139 -45 -23 -36 -44 21 205 -54 57 -39 -5
4980eo3j13K66L1j18j42K08k5k93L01j49J2nK05k37L5ON9k89K80R4k1J00k07Q9
$$ -5 -68 -181 85 116 -2 -144 64 39 -254 47 -102 -90 -95 110 -127 -92 -86 -27 -316 -36 58 37 137 -70 19
5005A9P0l8J60k15J4Kn8J58j33o4J88J19j52r7Q8r6K7p4K19O7k00J67k55j55L03
$$ 19 89 51 211 -4 10 12 -46 112 -21 -85 103 222 70 -27 61 -35 -8 -82 137 204 4 171 -84 -239 64
5030F4l54M90j20l20N07j75j06n4n0K5j5L46j22k72Q9J21POK40Jj95m5j90J04
$$ 64 -290 200 80 -240 267 92 -14 -68 -118 -93 -108 238 116 -156 -67 54 61 67 307 308 113 68 -122 -18
5054a8J08k01RJ39n6P5m5O2m1J43L2k59n9J30J62k57j21K12M4m9p5K12j66P8R3
$$ -18 90 -111 -102 37 -19 56 11 73 32 175 207 -52 -111 19 181 -76 -197 15 59 10 -65 147 -19 59 152
5079A52j45J01k22q5L24m3q3j59K56Nj13r7L43r0j73l7j3o8L29k30J46J72k66
$$ 152 7 108 -114 -199 125 82 -1 -160 96 101 -12 -109 234 144 -29 -66 -79 -147 182 -48 98 270 4
5102Dk9j1j71Q4L57j85k06K68o8J00j03m7K10j08k3l13K90J58k50K37j52j97J73
$$ 4 -25 -36 -207 -123 234 49 -157 111 43 143 40 -7 203 95 72 -241 49 207 -43 194 42 -155 18
5125A8Pn5q1L71l30j5J11L02k53P2j17k3K25k13K24m25P8L15q8k20j75K99j66
$$ 18 25 -30 -111 260 -70 -85 26 328 75 147 30 7 232 19 243 -182 -104 211 123 -97 -272 27 -139
5148a39l7J76l6j27J35p2j71L07m8O0J28m13J76J69j16J22k95L61l27N0l2P8J92
$$ -139 -176 0 -36 -163 -28 -100 -271 36 -12 48 176 -237 -61 108 -8 114 -181 180 -147 -97 -129 -51 141
5171A41k19J53k0l29L84l95L02k99M32j9k53J23ln7j5K2J55j5K28m53P2q8K8O0
$$ 141 -78 75 55 -274 110 -285 17 -282 150 131 -122 1 -2 -59 -74 -52 103 88 316 -137 -65 -153 -125 -65
5195f5J46j70J81l17q3N64j90o3k3j16p1P6L43k88k7J20Pj60m2j47L33P3K9J2
$$ -65 81 -89 92 -225 -308 256 66 3 -20 -136 -207 -131 212 -76 -103 17 24 -136 -178 -325 8 81 110 122
5219A22R8j12J86k69j33K8K08n2J32l7N0j12q0J07o9j71O1J82k00K7J56l2p0K34
$$ 122 220 108 294 25 -108 -80 128 76 208 171 221 109 29 136 67 -104 -43 139 -61 -34 122 90 20 254
5243B54j8k12J01n55M47j01K5p4K71q7J86j48j47k23J67nJ02j58J05J11N9J06
$$ 254 236 24 125 -430 17 -84 -59 -133 138 51 237 89 -58 -281 -114 -119 -17 -175 -70 41 100 206
5265B06L6j19j26J35l8j30O6j36J24O8l7J47q2k72J90O7j10j37J28K64j0l55K64
$$ 206 242 123 -3 132 94 -36 30 -106 18 86 49 196 114 -158 32 99 -11 -148 -20 244 234 -121 143
5288A43j74J1L46l75R9M6j03k35j5N78l12j02L32j69J4n9m6k35L19q6J45l9j07
$$ 143 -31 -20 326 -49 50 96 -7 -242 -257 321 9 -93 239 70 84 25 -21 -256 63 -23 122 83 -24
5311b4l0k2K20j74J40j39K3po3q4jJ91j94J76K26K0j48j10Q1j39J27n1j75J93
$$ -24 -54 -76 144 -30 110 -29 -6 -13 -76 -160 -161 30 -164 12 238 258 110 0 81 -58 69 18 -157 36
5335C6j33K60l55Q7R9P%R1L6j83L1J41p1j0j20o1N5n3J43r1K35k24k21L17R1k15
$$ 36 -97 163 -192 -105 -6 1 1 92 128 -55 -24 117 46 36 -84 -145 -90 -143 0 -91 144 -80 -301 16 107 -108
5361a08K18k68K64j47J9ql9K32qj69m8l3L26j54k19R4k2N9J09o3K36j95L8k11
$$ -108 110 -158 106 -41 -22 -30 -69 163 155 -14 -62 -95 231 77 -142 -48 -70 -11 98 35 271 76 114 -97
5385i7O1M3l04L79m2j76J23l8R2J74j08o8o7j05M8J85L45k27l49K68q2L5m8N2
$$ -97 -36 7 -297 82 40 -136 -13 -51 41 215 107 39 -28 -133 -85 100 445 218 -131 137 55 90 42 94
5409I4n2l1j16j86N8L42j6j7l45K45L52l72p0J54k23J64J26k11K04j32K75l12
$$ 94 42 11 -105 -291 -233 109 93 76 -269 -24 328 -44 -114 40 -183 -19 107 -104 100 -32 243 -69
5431f9J13L62j78j86j49J51rQ7j49Q0k47j77L68q3J38j78J72J35l6j31M4P7j72
$$ -69 44 406 228 42 -107 44 35 122 -27 53 -194 -371 -3 -86 52 -126 46 181 145 14 58 135 -37
5454c7J26j52J61J9L1j5l5k89L38k21k8k3J78k90L57N3l42J54k71L27NR2N9k84
$$ -37 89 -63 98 117 148 133 98 -191 147 -74 -102 -125 53 -237 120 173 -169 -15 -286 41 46 138 197 -87
5478h7J32j67K13j53j60J37l2J4L61j99j4m26L43J41M7l5Kr9j05Q1J48j98L8L2
$$ -87 45 -122 91 -62 -222 -85 -117 -103 258 59 45 -381 -38 103 150 115 117 18 -87 -6 142 -56 -18 14
5502A4k34L24J19k10R3Q4k33J59J45k85j27J25n5J22r5K81k05K33j13k13j0rN7
$$ 14 -220 104 223 13 106 190 -43 116 261 -24 -151 -26 -81 41 -54 227 22 255 142 -71 -81 -90 -33
5525c3rp0j49J51M5L50l36J33l42L11j92O5rJ22K9j48q9L51k33m1j04L72n0j66
$$ -33 -42 -112 -261 -110 -65 285 -51 82 -260 51 -141 -76 -85 37 66 -82 -171 180 -53 -94 -198 174 124 -42
5549d2j0r6J26j08L01j30m0o9R2j79N9M0k05J88K03l51K64o6j02J62j44K23l88
$$ -42 -52 -148 -22 -130 171 41 1 -68 24 -155 -96 -56 -261 -73 130 -221 43 -23 -125 37 -107 116 -272
5572b72J88M4k50M53J0k51K32j57q3j23K79k85J71j10K62k58J94J1p7j52O9K13
$$ -272 -84 -40 -290 163 173 -78 154 -3 -86 -209 70 -215 -44 -154 108 -150 44 55 -22 -174 -105 108
5594A08k75L56n1p5L8j80L0P9J57k65L04m19J03L9K62J5j59k29L21j81L5j3J00
$$ 108 -167 189 138 63 101 -79 -49 30 187 -78 226 -193 -90 -51 211 226 67 -162 159 -22 13 0 100
5617A00L5k69m6K23r2O5n6K1J22j84M5N0p2J6O4K52k04Q9j88j52m04L75L63N9
$$ 100 135 -134 -180 43 -49 16 -40 -19 103 -81 -36 14 -58 -42 22 274 70 159 -29 -181 -585 -210 153 212
5641B12k84L6J66M0k19m4M1ll1J78J69m44K15O7j95J27j00O2J16j59J77lJ06n9
$$ 212 -72 -36 130 170 -49 -93 -52 -55 -86 92 261 -183 32 99 -96 31 -69 -7 109 -50 127 124 230 171
5665A71q6M5j48K50j27j69p5L2L33l06k26M4J71K45k54K14K51m67JJ79j26J37
$$ 171 85 130 -18 232 105 -64 -139 -107 226 -80 -306 -262 -91 154 -100 114 365 -102 -101 78 -48 89
5687H9k48J83O2O7r3J10o7L8l55M39j93J3J35l77L96p7oj6R7n52J80J9j23J12
$$ 89 -159 24 86 153 60 170 103 141 -214 225 32 45 180 -197 199 122 116 100 197 -355 -175 -156 -279 -167
5711a67K58R3k25k5J23O7l31j7J37J36n3J83m2n1k02K26j61k15K44K89r8l13J89
$$ -167 91 184 -41 -66 57 124 -207 -224 -87 49 -4 179 137 86 -116 110 -51 -266 -22 267 169 -144 45
5734D5M57n86q3P7K23J90l13p9L41q0k69K85p1m31M86k15K78m49L63o5j93M6J61
$$ 45 502 -84 -167 -90 133 323 10 -69 272 192 -77 208 137 -294 192 -23 255 -194 169 104 -89 -43 118
5757A18K04l97j23Q8J20j66J45K04L3l28L04Kk59K9p2K14j31j58K29k34L46k01
$$ 118 322 -75 -198 -110 10 -156 -11 193 226 -102 202 204 -55 -26 -98 116 -15 -173 56 -178 168 -33
5779c3O9L6j93P7Q9j0l50K03L41j43j32N0mQ8j35K23N6l65J00K31l21K20j8J3
$$ -33 36 72 -121 -44 45 35 -315 -112 229 86 -46 4 0 88 -47 176 232 -133 -33 198 -123 97 79 92
5803I2j42K01k86J74J0j72J83r1k8J78j6J97m69K99q3l35K57M0K23m45pN31r5
$$ 92 -50 151 -135 39 49 -123 60 -31 -59 119 103 300 -169 130 47 -288 -31 9 232 -213 -220 311 216
5826B16p18L76J84K1L6l18J52J86j14j48L25K5o28L74J88J25j18j21J7N2j38m4
$$ 216 -502 -126 58 79 115 -203 -51 135 21 -127 198 223 -405 -31 157 282 164 43 60 112 -26 -70
5848g0k8J4R7K1K4N4k44P8l9Q6J41j05l0L9n3l5j02K14j26K58p0p9K32k05L6k83
$$ -70 -98 -84 13 34 58 112 -132 -54 -93 -7 134 29 -1 38 -15 -50 -152 62 -64 194 124 45 277 72 108 -175
5874a75J83j20L05j84qo4j57M5L57n10K76K8J6l31L25O7j22Q8q2R2J37J7j39N2
$$ -175 8 -112 193 9 1 -63 -220 -175 182 -328 -52 -24 -8 -339 -14 53 -69 19 -63 29 166 183 44 96
5898I6j84k0J84K29k93n0J19Q6l57L94L9l39j2J13m6K46j93J69j00N9l53K64J44
$$ 96 -88 -108 76 305 12 -38 81 167 -190 204 243 -96 -108 5 -41 205 12 181 81 140 -213 51 195
5921A95l33K91j53J67n81J96M13j73j30M3R2J47l84J25K26N2k34L2J09k89M8J73
$$ 195 -138 153 0 167 -414 -218 195 22 -108 -65 27 174 -210 -85 141 193 -41 -9 100 -189 -141 32
5943C2k30M49m18K59o7j65L53j0l05J89r0l8J82j70J45L3j77K79j86j63o0J12
$$ 32 -198 251 -167 92 25 -140 213 203 -102 87 -3 -41 141 -29 116 149 -28 251 65 -98 -158 -46
5965d6J32k91J22J9J86k14J13J48l07L9P7p2K83l61K96k42K0j4j91K50K82l62
$$ -46 86 -205 -83 -64 122 -92 21 169 -138 -99 -22 -94 189 -172 124 -118 -98 -112 -303 -53 229 -133
5987a33o8R2J72k4K4k5o4rJ09N3Ok31K59k24K39l65N09j98j6P5k94J31q3K28k99
$$ -133 -201 -109 63 39 63 38 -26 -35 74 127 133 -98 161 -63 176 -189 320 122 106 181 -113 18 -65 163 -136
6012a36j10K70K08l2k41p6J85K18j65k31O3P6P5l37mL26m7P9n1l4q0J32l7k48
$$ -136 -246 24 232 200 -41 -117 68 286 121 -110 -47 29 104 -233 -237 89 42 121 70 36 -44 88 51 -197
6036a97q1N36k72K5l2r6q3L75o2L7k31J05J01n3Q7r1J00k64r7J71k80J40J3J60
$$ -197 -278 258 -14 11 -21 -117 -200 175 113 150 -81 24 125 72 159 68 168 -96 -193 -22 -302 -162 -149 11
6060A1j01m4K30J16k38j59K72k2O8k9j06j03R3k23L56M7j61N6k35L20l94J68q0
$$ 11 -90 -134 96 212 -26 -185 87 65 133 104 -2 -105 -12 -235 121 168 7 63 -172 148 -246 -78 -158
6083a58J95k02K96j83K4Q5k57J67J91j00r3LJ03k69L97j23L8j95J84K06k11k57
$$ -158 37 -165 131 -52 -28 57 -200 -33 158 58 -35 -32 71 -198 199 76 114 -81 103 309 98 -159
6105a59K76k39J53o0j40J20o8O9O9k91K53J45k23L52m13R7J87l3j18O9j16K82
$$ -159 117 -122 31 -29 -169 -49 -117 -48 21 -270 -17 128 -95 257 -156 -59 128 95 -23 46 -70 212
6127B12l21J39J36j26j84K75m00M33M4n8J5l0k12J04k34J02K49pO7l63J58j3P1
$$ 212 -109 30 166 40 -144 131 -269 164 208 150 165 135 -77 27 -207 -105 144 137 204 -159 -1 -14 57
6150E7J34K0o8k79P2L88j35O4j78R1j13J7o8j8K8n5J8K48k66K52m25J60p8J76
$$ 57 191 211 143 -136 -64 324 189 253 75 166 53 70 2 -16 12 -43 -25 223 -43 209 -216 -56 -134 42
6174D2J29k70j40K19K43k60J57k06kJ43l5p1J4j73Q9K82j43Lj9r7L6k8J65q6J28
$$ 42 171 -99 -239 -20 223 -37 120 -86 -88 55 20 -51 -37 -210 -121 161 18 21 2 -95 -59 -87 78 -8 120
6199A20k10K53m2Lj57J77J52l43J55J04q7m4J86k08Jn2op4J17q6j74M0J6N9J58
$$ 120 -90 163 121 124 -33 144 296 -47 108 212 125 81 267 59 60 8 2 -72 45 -41 -215 -175 -159 -100 58
6224E8j03O8j02R8L0L3j82L22k63q1N4p7L11k48j23P4J48l4j21J22o0L5K61m05
$$ 58 -45 23 -79 19 49 82 -100 222 -41 -122 -68 -145 166 -82 -205 -131 17 -17 -138 -16 -76 -41 220 -185
6248a85M1q3L77p9j79m0K02q9j03L77j06l70O9J28J21j6j33J34j96L1K02j48k52
$$ -185 -144 -227 150 71 -108 -148 54 -35 -138 239 133 -237 -168 -40 81 65 -68 66 -130 -99 103 -45 -297
6271b97M36l73M04k27J55o3j74K51k47P5J12r5o3J19Q9k08M9L09k70O7J46j31
$$ -297 139 -234 170 -57 98 35 -139 112 -135 -60 52 -43 -106 13 102 -106 -57 252 -18 49 195 64
6293F4j40K56j0k52J7J12k06K66kj53j88M11l38m8L24k19J39p7Q1Pj48RJ23k4
$$ 64 -76 180 170 -82 -65 47 -159 107 105 -48 -236 175 -163 -211 113 -106 33 -44 37 44 -104 -95 28 4
6317DO5j69K69k30k25K24j71M7J73M2k77K43m7J82k32L02k45j43K89j14k08K44
$$ 4 69 -100 169 -61 -286 -62 -233 -186 -13 29 -248 -5 -52 130 -102 200 -45 -188 101 -13 -221 23
6339B3j32m9L84p9ll17o4J59q9J41K07l81J90OL77m35J06q5J05l2N1j33m0M71
$$ 23 -109 -158 226 147 144 -173 -237 -78 -167 -26 181 -200 -10 -4 373 -62 44 -41 64 32 83 -50 -90 381
6363C81p9m17K04k49j5J25K77l32J08K5m3L2M7K8l69M39l96M75j83j27P6J54k19
$$ 381 302 -115 89 -160 -175 -50 227 -105 3 28 -15 17 64 92 -277 162 -234 241 58 -69 7 161 -58
6386e8P7K36l42L01q8k73QL46j6J72m32J60k69P9j0M8J3R6j42J88j38J37k72L37
$$ -58 19 255 -87 214 126 -147 -139 207 191 363 -69 91 -178 -99 -109 -61 -48 48 -94 94 -44 93 -179 158
6410A58l11k4Q9K3K79j54k9j53K0n0k4K11N0k0k32J94K13k49j49N40n62M2K02
$$ 158 -153 -177 -88 -65 214 60 31 -122 -102 -152 -176 35 85 65 -167 27 240 -9 -158 382 -180 -138 64
6433F4j84JO9K6J40l7j52K3O5l2ML2j39J56j51K56k99K79k29K3j76J72K33l77
$$ 64 -120 -119 -50 -24 116 79 -73 -50 15 -17 -13 19 -120 36 -115 141 -158 121 -108 -85 -261 -89 144 -233
6457b33OM9L45o5oRJ15k27J81j39k01J53k1J79j63N7j45J79k29j6J18q6L09l37
$$ -233 -227 -178 167 102 96 105 220 -7 174 35 -166 -13 -34 145 -18 39 -106 73 -156 -172 -54 -140 169 -168
6481a68J51R7P1q3j23J38J42j42l83M16k39L01k58J88j87M43m28r8J51nJ02l0
$$ -168 -17 80 151 68 -55 83 225 83 -300 116 -123 178 -80 108 -79 364 -64 -162 -11 -16 86 56
6503E6R5k70K97l06P9O9k79j63N49k94J52j63j14O4J16J70J19J79n10K60k35L10
$$ 56 151 -119 178 -128 -49 20 -259 -422 127 -167 -15 -178 -292 -228 -112 58 177 356 -154 106 -129 181
6525A81k74K2K53k60J85j71J9Q9J38j90k67L4K27j10J53J13j14k96L57n4J13Q
$$ 181 -93 -71 182 -78 107 -64 -45 44 182 -8 -275 -241 -14 -124 29 142 28 -268 89 35 148 156
6547A56l14M6K03j81L26j33j05l3Q3l42K65%%oJ29J76M0n04K4J97r8L8m4n2n2
$$ 156 -158 -112 91 -90 236 103 -2 -35 48 -294 -29 -29 -29 -35 94 270 310 -194 -170 27 -71 -33 -77 -129 -181
6572a81L25j1m4k79J08k31L67J03k63j56Q6K60j20P1J10%j1j48J31j19J92L9l37
$$ -181 144 133 89 -190 -82 -313 54 157 -106 -262 -176 84 -36 35 145 145 134 -14 117 -2 190 229 -108
6595a08l3J85J65l11l7L71l25K18n60M53r3o3K05k85M78j72j66N7K12j07Km7j40
$$ -108 -141 44 209 -102 -139 232 -93 125 -435 18 -75 -138 67 -218 260 88 -78 -21 191 84 86 39 -101
6618a01J0L08k37k14J58L4K63r4j81R7j74O6K84j50p6Jmq9L38j90Nl16L60m5k75
$$ -101 -91 217 -20 -234 -76 -42 221 127 -54 43 -131 -65 219 69 -7 -6 -10 -99 239 49 54 -262 98 53 -222
6643b22L12l9N1k6j4l5P8j33p1J46p8n4n4J59J64l10J43q8J78m2Kk4k06RN94o25
$$ -222 90 51 102 76 62 27 105 -28 -99 47 -31 -85 -139 20 184 -126 17 -71 107 65 67 43 -163 -154 440 -185
6669a85j23J31J40J74r6j34R4Q0J1k40J35J44k94K27j34K64l30MK07k80J89L8
$$ -185 -308 -177 -37 137 41 -93 1 81 92 -148 -13 131 -163 64 -70 194 -136 -132 75 -205 -16 22
6691B2q4J15p2j82J77L27l87K30r7k0q0Oq0J26l5J96k84K86r5O3k3k15J54R1l69
$$ 22 -62 53 -19 -201 -24 303 -84 146 49 29 -51 -45 -125 1 -34 162 -122 164 69 132 109 -106 48 139 -230
6716b30K69J3p4J5RM5PP0k7N4j40N1k07j0K69r7n7M7L5M7l21M10k97M18l00J71
$$ -230 39 52 -22 -7 2 47 54 124 97 151 11 62 -145 -155 114 17 -40 7 42 89 -232 178 -119 299 -1 170
6742A70RN2l50K5j26N15k60j08NJ49j06n6R1km10N27L0O1j11k54J48j77L74l24
$$ 170 179 231 -119 -94 -220 295 35 -73 -68 81 -25 -81 10 8 -402 125 155 216 105 -149 -1 -178 196 -128
6766a28k2o3K05q5J49n5K96j87K38l80j30n6J42L8p6K22K55k20l50J20J12on0
$$ -128 -150 -213 -8 -93 56 1 297 110 348 -32 -162 -218 -76 -38 -114 108 363 143 -207 -87 25 19 -31
6789c1J1j74J00R9m4K52k17K28k08j8p3Q8J85j88K59j96l42J48K28jj4m4J46l56
$$ -31 -20 -194 -94 5 -39 213 -4 224 16 -2 -75 13 198 10 269 73 -269 -121 107 106 92 48 194 -162
6813a62J81j85O0J06P7m2l9q9J34m92L29j56k3L96L68l20r1P8j01N3j47J1J22
$$ -162 19 -166 -106 0 77 35 -4 -93 41 -451 -122 -278 -301 95 463 143 52 130 29 82 -65 -54 68
6836F8n8J09j65N7j98K78J92o52N46N8j99L43j62j24k24J20j24J01K23k85K58
$$ 68 10 119 -46 11 -187 91 283 -369 177 235 36 379 217 93 -131 -11 -135 -34 189 -96 162
6857A62j71J09r4K22k36J01Q4o4l13J32J31jj63M6j63K02J26j57N3N1J9l6j08
$$ 162 -9 100 6 228 -8 93 177 113 -200 -68 63 62 -101 -55 -218 -16 110 -47 6 57 76 40 -68
6880f8K18lp9l41M16j91Q1J39k21J16j49J65j15K88l14J86k70M1R0j92J41J29
$$ -68 150 147 68 -273 143 -48 33 172 -49 67 -82 83 -32 256 -58 128 -142 -101 -11 -203 -62 67
6902F7k16j7J34N8j12J33j67J70j3j49Q1L9J05q8J75k33j49J90j23p4N0J2K75
$$ 67 -149 -166 -32 26 -86 47 -120 50 37 -112 -31 8 113 25 200 -33 -182 8 -115 -189 -139 -127 148
6925A48k90Q6j6M0MK04j82o6j39J15J83QJl38K19J7j88K58J24l51Qk3J17J47k41
$$ 148 -142 -56 -72 -32 -28 176 -6 -72 -211 -96 87 95 96 -242 -23 -6 -194 64 188 -163 -155 -178 -61 86 -155
6950a55K58j55p1J77j54n8K54j62N9L9k7l75K50K63m58K88K2oN4J08P2n22L50
$$ -155 103 -52 -123 54 -100 -158 96 -66 -7 32 5 -370 -120 143 -315 -27 -5 -11 43 151 223 -299 51
6973E1L1O1l47L63j54K2J47l03K80m8O5l16L01k46l1M10j68k39J32J58q7l14K07
$$ 51 82 143 -204 159 5 27 174 -129 151 103 168 -148 153 -93 -124 286 118 -121 11 169 82 -232 -25
6996b5m3j87k7J58J07J00k07J16p2J56j36K4J02N6j54q6J56NK2j90M5q5J05J44
$$ -25 -68 -255 -282 -124 -17 83 -124 -8 -80 76 -60 -36 66 122 -32 -118 38 43 65 -125 -80 -165 -60 84
7020H4J4o9j28L0R3Q0l24L88K6j81r8pm5L06k95O5K19k57K29j67J90l77J11J72
$$ 84 98 29 -99 -69 24 104 -220 168 194 13 -85 -92 -137 169 -126 -61 158 -99 130 -37 153 -224 -113 59
7044E9j03L2J28j07R6j42K5L9J14k76K16o5j14rL6J70n8M8o9j16K00p5n8M2k27
$$ 59 -44 -12 116 9 105 -37 -12 27 141 -135 81 16 -98 -107 -71 99 41 89 20 -96 104 29 -29 13 -214
7069b14L72k74J53o6Q9j38K05j39J18j39K06l7j42K45l21r5K96j8j38M8Q9j43
$$ -214 158 -116 37 -29 60 -78 127 -12 106 -33 173 136 -6 239 -82 -177 119 101 -37 11 100 -43
7091d3n5L62k11J55j29k19Q6j5J79j25J32n7J14l74J43J83r8m6K8j74M9L76m12
$$ -43 -98 264 53 208 79 -140 -54 -69 110 -15 117 60 174 -200 -57 126 28 -18 10 -164 -115 261 -151
7114a51j2Q5J16J65q1j89J22j61j88M65m34K10J50j48k13L58J3N4k25m6J96k0
$$ -151 -163 -78 38 203 122 -67 55 -106 -294 171 -263 -53 97 -51 -264 94 107 161 -64 -110 86 66
7136F6o5O1j28m6m6q8J75K78m12J34k7K69k31J53J70m36L23j36l7m4O6L6J11J53
$$ 66 1 62 -66 -112 -158 -246 -71 207 -205 -71 -98 171 -60 93 263 -173 150 14 -23 -67 -1 35 146 299
7160B99k92j2J7R8j25K7k2L3q5K5m8Q9j29J32O9j33Ok0j06L4K3K95k88K07j30
$$ 299 7 -5 12 110 -15 12 -10 23 -62 -37 -85 4 -125 7 76 -57 -51 -71 -177 -143 -120 175 -113 94 -36
7185c6k19K12j9k3M0L3R5K9r7j03J54J36j89K66l48J17p8J79m33K39J81k08J45
$$ -36 -255 -43 -62 -85 -45 -12 83 112 15 -88 66 202 13 279 -69 48 -30 149 -284 -45 136 -72 73
7208G3L3p1J02j00L8k94L01n3k3n1J0R2q4K18l57K5J10r2j0O4M4J89n2J1k40k5
$$ 73 106 35 137 37 75 -219 82 29 6 -45 -35 57 -27 191 -166 -141 -31 -123 -133 -69 -25 164 112 123 -117 -142
7234a42J17K5Q9j71K74l29K53L0k39L27l13J56j09J14m5j51k9j55J56O2O1MK4
$$ -142 -25 0 89 -82 192 -137 116 146 -93 234 -79 77 -32 82 37 -114 -143 -298 -142 -80 -19 -15 9
7257Ij97L6K61ql31J9J38J44L2k45J70J14k99K02j19jJ05J07N1ll06J70k13j12
$$ 9 -188 -152 109 101 -230 -211 -73 71 103 -142 28 142 -157 45 -74 -75 30 137 188 185 -121 49 -164 -276
7281b76K87j39J94k15K89j13M9J9j00J65J15l64J65L1l55L52j35m5M4j54K97j58
$$ -276 11 -128 66 -149 140 27 76 95 -5 160 275 -89 76 107 -248 104 -31 -76 -32 -186 111 -47
7303d7l5J68lj39J58j01J4j87K49J7o9j81L53j25k64J20o0K66j53j18K98j20N3
$$ -47 -82 86 83 -56 102 1 15 -172 77 94 25 -156 197 72 -192 -72 -132 134 -19 -137 161 41 94
7326I4q7j03K28Mo20N73L67l04m3M6j31m0J37RL5o6K29k90n9O1k67J68R4j89J64
$$ 94 7 -96 132 136 -484 89 456 152 109 155 24 -16 121 130 165 99 328 38 -21 40 -227 -59 35 -154 10
7351A0m5j32K11m04M04j74K04j34j61N29k40N8k17l6m6J81P4l05K6J33J05k09
$$ 10 -35 -167 44 -360 44 -130 74 -60 -221 308 68 126 -91 -127 -173 8 82 -223 -197 -64 41 -168
7373a68K94k07Pj79L44l2l1K12k36K34k25J64l59m7M11q2q9j25K66k19L04l30
$$ -168 126 -81 -74 -253 91 59 28 240 4 238 13 177 -182 -229 182 100 11 -114 152 -67 237 -93
7395i3O9J29P5l60J75n4J49m7k45M36k62NJ07k35J16O6L1k08p5M0J81K47k28K25
$$ -93 -24 105 180 -180 -5 -59 90 43 -202 234 -28 -23 84 -151 -35 31 62 -146 -221 -181 0 247 19 244
7419B44j10r9j40R9k3M3O0j01Q9k04J98L8k68J09J48KJ1k2k27jJ55K07k63J43
$$ 244 134 35 -105 -6 -29 14 74 -27 62 -142 56 94 -174 -65 83 85 96 74 -153 -154 1 208 -55 88
7443H8j26j79M36k27J19q5k90K05k3K62l38K51k67J81J38k92K3L1J48k64J94N1
$$ 88 -38 -217 219 -8 111 26 -264 -59 -82 180 -158 93 -174 7 145 -147 -124 -93 55 -209 -15 36
7465C6J36k07p0K00k4q2J31J24k08O9q0K02r3k09m3j06O3K77j35J97j79jq6Q6
$$ 36 172 -35 -105 95 71 -11 120 244 36 105 25 227 134 -75 -118 -224 -161 116 -19 178 -1 -2 -88 -2
7489bn2N9l8n1L6j53M43j54j58J29k81K44P4j92J66j11o3K47q0K73m03NJ05j09
$$ -2 -54 5 -33 -84 -48 -201 242 88 -70 59 -222 22 96 -96 70 -41 -104 143 63 336 -67 -62 43 -66
7513f6K97O4q1k99J4L05l28J73R7j40J40l34M61l42O3Q7J48r4m33K86k1o0L27
$$ -66 231 295 214 -85 -71 234 -94 79 176 36 176 -158 303 -39 24 111 259 165 -268 18 -3 -63 264
7536B64l78J70r6J18J23j29k25J26L2q1K97j88R3j4k85J63O1N5p6L1k4j84J6J06
$$ 264 -114 56 -40 78 201 72 -153 -27 5 -76 221 33 126 112 -173 -10 51 106 30 61 37 -147 -131 -25
7560b5M6j47L26k12J5Nr2K30k55K88Lk13j16R3K98j57l0Q1Q0j74L19l39j7j27
$$ -25 21 -126 200 -12 3 8 -84 146 -109 179 182 -31 -147 -54 244 87 57 138 218 44 363 24 7 -120
7584a20J39l1j31L01j14J59k31o2Q9j1j58K03j16K2n3Q0J23r0k59p0K50L07O2
$$ -120 19 -12 -143 158 44 203 -28 -90 -1 -12 -170 33 -83 -61 -114 -34 89 -1 -260 -330 -80 227 289
7607B89l81J05J11r7j29L09j66m26L11p6k04L62j89J61R6n1K2r7QQ7l9n0M6n6
$$ 289 -92 13 124 27 -102 207 41 -385 -74 -150 -354 8 -181 -20 76 25 47 -50 -42 45 6 -44 2 -54
7631e4%P6j46J94P2j49j02j29j28K81J03k6p2k6J3jJ23P0K0Rj20J17j73J54k02
$$ -54 -54 22 -124 70 142 -7 -109 -238 -366 -85 18 -8 -80 -106 -93 -94 29 99 119 128 8 125 -48 106 -96
7656i6J42k41R5K4K5K7j89K17o9m7Q0j20L0K60j04k77K45K89m17Q7Q9J63M6q1
$$ -96 46 -195 -100 -76 -51 -24 -213 4 -65 -112 -32 -152 -122 138 34 -243 2 291 -126 -39 50 213 259 178
7680A78l39K56O6k50J50L1N2l33J91j72Q8J8j5K27j91J30o5j18J74n9P7k21P4
$$ 178 -161 95 161 -89 61 92 144 -189 2 -170 -82 -64 -79 148 -43 87 22 -96 78 19 96 -125 -51
7703e1N0k3K11p7q1q4J44N8k06J77k62K27j03L04m96K38j06J72k18J03K4k57O1
$$ -51 -1 -24 187 110 29 -55 89 147 -59 118 -144 83 -20 284 -212 26 -80 92 -126 -23 1 -256 -195
7726a95L09j02q7P7j05K70m04O1M24k81j20K7J49J11n3J19q3k24J41k6P7J28k64
$$ -195 114 12 -75 2 -103 167 -237 -176 248 -33 -153 -126 23 134 81 200 117 -107 34 8 85 213 -51
7749e1R6j30J2j27J93N0Q5j92J78M5k30L1M7Q6j68M2m5p8K83K5j19q5j03J20J77
$$ -51 45 -85 -73 -200 -7 43 128 -64 114 159 -71 -40 7 93 -75 -33 -78 -156 127 152 33 -52 -155 -35 142
7774A42j8L1j78J48n8J2r2K0K54k69n4l08K71J1Q0p5L63l20J04j01J39Lj41k26
$$ 142 124 155 -23 125 67 79 -13 7 261 -8 -62 -370 -99 -88 -8 -83 280 -40 64 -37 102 105 -36 -262
7798b62M75nm30K20q2L64n99L66l00K63j9j22R3Q1j54J84j61k1J70j8j67K21q0
$$ -262 213 208 -222 -2 -84 280 -319 47 -253 10 -9 -131 -38 43 -111 73 -88 -109 61 43 -124 97 17
7821A7J34o6o4r5J28k9O8j40QJ89j54k01J08k24K19K47j32J1j8j15J94k54J83
$$ 17 151 85 21 -74 54 25 93 -47 -39 150 -4 -205 -97 -321 -102 145 13 24 6 -109 85 -169 14
7844A4j9j18k8J83k13K18K9j59J03P2p5k61N38m57K83j18l3N0m7L13l10K01j16
$$ 14 -5 -123 -151 32 -181 37 66 -93 10 82 7 -254 284 -173 110 -8 -41 9 -38 275 -35 166 50
7867E0Q5k96K54j63O5P4j20K08j02l46J75K16l48J68J8K50l48K79m2j2J2m2j39
$$ 50 135 -161 93 -70 -5 69 -51 157 55 -291 -116 100 -248 -80 -62 188 -160 119 77 65 77 35 -104
7890a04K25j07Q2p0K4o7l0j06J88O8lj87O8j38P7l4O7Lj26K04J06j90L94l32j03
$$ -104 121 14 96 26 50 -17 -47 -153 35 103 100 -87 -19 -157 -80 -114 -47 -44 -170 34 140 -50 344 12 -91
7915i1kL91l36k43J28J39o9J61k9q2l1j84K57l77N47j32j72r6K65n4p6J88n9O0
$$ -91 -93 298 -38 -281 -153 -14 -83 78 49 -33 -64 -248 9 -368 179 47 -125 -221 44 -10 -86 102 43 103
7939A03q8R0j17j74L87j28J4j14J89l64J22qp4L55m23L19k60J96j16K06k39J54
$$ 103 15 105 -12 -186 201 73 87 -27 162 -202 -80 -88 -162 193 -230 89 -171 25 -91 115 -124 30
7961C0j27K10o2R1p1m19L89j62LJ06K0J20k64J56N1Lm0n5K9k14J52l6J01J6k43
$$ 30 -97 113 51 142 71 -348 41 -121 -118 -12 8 128 -136 20 71 74 34 -21 8 -206 -54 -90 11 27 -216
7986b16L55kl04J84j07J63r7K50l49Q3o8K38Q3l74L98k53n6K32l26M43k34j66
$$ -216 139 137 -167 17 -90 73 -24 226 -123 -40 -108 130 213 -161 237 -16 -72 160 -166 277 43 -123
8008a23J17o0j7k8Q0J96j83q5ql7J01O7j0j91K40K58n05O25l45k53K0M3K28l04
$$ -123 -6 -66 -83 -111 -31 165 -18 -103 -111 -148 -47 20 10 -181 59 317 -188 437 92 -161 -141 -98 130 -174
8032a74QO9K29K1j49K8R2k11K5R8l5ol5N8j33jL44m07J76J83N6k81nQ0N5j94R0
$$ -174 -166 -97 132 153 4 32 124 -87 -62 36 1 -5 -40 18 -115 -116 228 -179 -3 180 236 -45 -50 30 85 -109 -19
8059a9J21o6M6j40Q8m6N9J1l42J96J83p6l7j35k0k9K49R8m6k32q8K74j33L0K03
$$ -19 102 36 82 -58 30 -16 43 54 -288 -92 91 15 -22 -157 -177 -206 43 141 95 -137 -225 49 -84 -54 149
8084A49O3l85M6J12j06L74k27J73%j14N6j06n8R0r0kk54M09mj90J05k4J35j93
$$ 149 212 -173 -127 -15 -121 253 26 199 199 85 141 35 -23 67 -23 -25 -279 130 126 -64 41 17 152 -41
8108d1K17k41J33J18m16K34J31j36Lj48Q4k4O2O6k11L87k62K63k41K86n6l18j9
$$ -41 176 -65 68 186 -230 4 135 -1 2 -146 -62 -86 -24 42 -169 218 -44 219 -22 264 208 -110 -129
8131a29O5J6k40M68r3k3P2l45J23Q7j16J6K69j19Ok32J84lr6M24k34j96K8L91
$$ -129 -64 -48 -288 180 87 64 136 -209 -86 1 -115 -99 170 51 57 -175 9 6 -90 334 100 -96 -68 323
8155C23j82J98k27j36O3k03o9M55p1k67J47j19Jp9J29j63K35j63J19L8j94k03
$$ 323 141 339 112 -24 39 -164 -233 222 151 -116 31 -88 -87 -166 -37 -200 35 -128 -9 29 -165 -368
8177c68J62L60j56l42L41J43k60J86J30l54K15j07J30j38
$$ -368 -206 154 -2 -344 -3 140 -120 66 196 -158 57 -50 80 -58
8191e8
$$ Imaginary data points
##PAGE= N=2
##DATA TABLE= (X++(I..I)), XYDATA
0@%%%%%%%%%%%%%qJ6j6J6j6K4l2L2m0M8n6O7p5Q8j04J20j36J55j76J99k24K52
$$ 0 0 0 0 0 0 0 0 0 0 0 0 0 0 -8 8 -8 8 -8 16 -16 16 -24 24 -32 35 -40 48 -56 64 -72 83 -93 106 -118 134
35A34k85L20l59M00m45M96n52O13o79P49q25R10j004J108j222J345j480J633j802
$$ 134 -151 169 -190 210 -235 261 -291 322 -357 392 -433 477 -527 581 -641 704 -776 857 -945
54i45J990k204K451k735L065l456L928m512N252o229P579r569J2799j8905L4307
$$ -945 1045 -1159 1292 -1443 1622 -1834 2094 -2418 2834 -3395 4184 -5385 7414 -11491 22816
69B2816j41834k85132K96169K33808k0228j486N510q8179Q2713J87711j3169j92993
$$ 22816 -119018 -404150 -107981 125827 105599 104113 109623 21444 104157 291868 278699 85706
81H5706j43965m0287R7628J15084p1150j63591j0853P0876M2795L4758p0733k03100
$$ 85706 -58259 -98546 -918 114166 43016 -120575 -131428 -60552 -17757 17001 -53732 -256832
93b56832k7349K29051J24768j02125n0347N9548L0544O3674J14162l9728j71159
$$ -256832 -284181 -55130 69638 -32487 -82834 -23286 7258 70932 185094 145366 -25793
104b5793l6392J36251J16028m808r3702q3344J3717N8650j0160p1594r0452q4968
$$ -25793 -62185 74066 190094 185286 91584 8240 21957 80607 70447 -1147 -91599 -176567
116a76567K4858J34996K9342j12439l6618O8052K7466Q875K9692m6675p9490O6948
$$ -176567 -151709 -16713 12629 -99810 -136428 -68376 -40910 -32035 -2343 -49018 -128508 -61560
128f1560J61368M8036o7802m1788K4826M5928K1065k9678o8577o1038o017O1048
$$ -61560 99808 147844 80042 38254 63080 109008 130073 100395 31818 -29220 -35237 25811
140B5811N6558m0740r8594k8452M6104J0131l5650k5145k7615j5983P0840J00164
$$ 25811 82369 41629 -56965 -85417 -39313 -29182 -64832 -89977 -117592 -133575 -62735 37429
152C7429p528o8815R458O4318K2670q289p349k1237q678M6749O0595j996o7692
$$ 37429 29901 -38914 -29456 34862 57532 49243 41894 20657 11979 58728 119323 117327 49635
165D9635n5116J3051L0397k4340n2662k5968q664O099M4899L1288m6699n6126
$$ 49635 -5481 7570 37967 13627 -39035 -65003 -73667 -67568 -22669 8619 -38080 -94206
177i4206K4145N1387P25j8513P513J4405K0222M8363M0981k1345n0295k364L8315
$$ -94206 -70061 -18674 -17949 -36462 -28949 -14544 5678 54041 95022 73677 23382 21018 59333
190E9333P916l4917k7315O97N895O985J1702j6962n7520l4839K8425K6494k4642
$$ 59333 67249 32332 5017 5714 11609 18594 30296 13334 -44186 -79025 -50600 -24106 -48748
203d8748k4598J5171K2367J5392K9028J4924k7278k2478K9507M0322j270k0668
$$ -48748 -73346 -58175 -35808 -20416 8612 23536 -3742 -26220 3287 43609 42339 21671
215B1671M493K1615R579N82l289k6130m1250q466K5948Q26l5592j6073J9085J0266
$$ 21671 26164 47779 57358 57940 54651 28521 -12729 -21195 4753 5579 -30013 -46086 -27001 -16735
229a6735o736N38p062k6918l437L8642K8149j0914p133K4041K3404L564j47k178
$$ -16735 -23471 -22933 -29995 -56913 -60350 -21708 6441 -4473 -11606 12435 35839 39403 39256 37078
243C7078j6727j2519J4301K1614q796k7767l995J5444n132k2613j2243j0388j8965
$$ 37078 20351 7832 22133 43747 34951 7184 3189 18633 13501 -9112 -21355 -31743 -50708
256e0708K593K7710P146k0588K77K5674J0671p580j457K326k230R006K6537J6995
$$ -50708 -48115 -20405 -13259 -33847 -33570 -7896 2775 -4805 -6262 -3936 -6166 2840 29377 46372
270D6372j0211j2892P248J0117j3025k1549p316l173q451N288J4323r390k4579
$$ 46372 36161 23269 30517 40634 27609 6060 -1256 -4429 -12880 -7592 6731 -2659 -27238
283b7238r25J4393o789j7139J315R032L782J3933K2561N979j0433L9J3808N436
$$ -27238 -28163 -13770 -20559 -37698 -36383 -27351 -23569 -9636 12925 18904 8471 8510 22318 27754
297B7754j1688r015M840O912K171O036M152j4774k1313j335L354j5377j6805M423
$$ 27754 16066 7051 11891 18803 20974 27010 31162 16388 -4925 -6260 -2906 -18283 -35088 -30665
311c0665R780J948O716J0551n488j2605L436J1529P8n119O406J5365J1466M615
$$ -30665 -20885 -18937 -12221 -1670 -7158 -19763 -16327 -4798 -4720 -9839 -3433 11932 23398 28013
325B8013M451j945j2719j0518K926J111j3174q653P809P903m257k553j585j2582
$$ 28013 32464 30519 17800 7282 10208 11319 -1855 -10508 -2699 5204 947 -1606 -3191 -15773
339a5773j3418K323P614l160j426J2986J5097N852J972J408m222p325J00P303
$$ -15773 -29191 -26868 -19254 -22414 -23840 -10854 4243 10095 12067 13475 9253 1928 2028 9331
353I331L040k467K912J0587L130q529r509p442j2051r435L486M391m090l8J0628
$$ 9331 12371 9904 12816 23403 26533 18004 8495 1053 -10998 -20433 -16947 -12556 -16646 -16684 -6056
368f056O697l622m819j631m488k315O421J0219N012L931Q745Q317j165q804p475
$$ -6056 641 -2981 -7800 -9431 -13919 -16234 -9813 406 5418 9349 18094 26411 25246 16442 8967
383H967n187o016j697M757L579k647L4M595k934j2106q846k611k819J392Q827
$$ 8967 3780 -2236 -3933 824 4403 1756 1790 6385 3451 -8655 -17501 -20112 -22931 -21539 -12712
398a2712R008L465L425O622J945n303o101k316J575K598M349P295L843j610j226
$$ -12712 -3704 -239 3186 9808 11753 6450 349 -1967 -392 2206 6555 13850 17693 16083 14857
413A4857j124q021j2864p239k95K23K363P443M673j029j65N44m776o876k491K540
$$ 14857 13733 5712 -7152 -14391 -14686 -14463 -12100 -4657 16 -1013 -1178 -634 -5410 -12286 -14777 -12237
429a2237N987P064P988O256K229j508l212l336o611o980n89M717L194J555K955
$$ -12237 -6250 814 8802 15058 17287 15779 12567 9231 2620 -4360 -4949 -232 2962 4517 7472
444G472r04n440m773l412o622n555J503M767O737P670M453J286m46k416l478k951
$$ 7472 6568 1128 -3645 -7057 -13679 -19234 -17731 -12964 -6227 1443 5896 7182 6736 4320 842 -2109
460b109j157L85M687P975M735N79J76m065q433o475l849n067j227M880N532K984
$$ -2109 -3266 -2881 1806 9781 14516 15095 15271 11206 2773 -3702 -7551 -12618 -13845 -8965 -3433 -449
476d49K234k80m041l114j484k913m15M177M726O110P405L264k237k374l749n804
$$ -449 1785 1505 -2536 -5650 -7134 -10047 -10462 -6285 -1559 4551 11956 15220 12983 10609 6860 1056
492A056l649L09q2J969M698K374j580k142l993o876m009j383r77K066P509O318
$$ 1056 -2593 -2284 -2366 -397 4301 6675 5095 2953 -1040 -7916 -11925 -13308 -14285 -12219 -4710 1608
508A608L629K811j003n010l130q71q26J114M318L557K918L986R0n252m575n564
$$ 1608 5237 8048 7045 2035 -1095 -1966 -2792 -1678 2640 6197 9115 13101 13191 7939 3364 -2200
524b200n964k396J572J412K699N188K297j678j515j905n005j356J361J470L578
$$ -2200 -8164 -10560 -8988 -7576 -4877 311 2608 930 -585 -2490 -7495 -8851 -7490 -6020 -2442
539b442O512N208K900Q62l139n863m444j889j362J418L988J997N75R42k058m866
$$ -2442 4070 9278 12178 13040 9901 4038 -406 -2295 -3657 -2239 1749 3746 4321 5263 3205 -1661
555a661m241l497l209L59L972M229M387M430J889j626k225k680k794j70K094K501
$$ -1661 -5902 -9399 -12608 -12249 -8277 -4048 339 4769 6658 5032 2807 127 -2667 -2837 -743 1758
571A758K700M061K108q75j412l862o678m864j668R4K063M312K731M60O8j419m107
$$ 1758 4458 8519 10627 9752 8340 4478 -2200 -7064 -8732 -8638 -6575 -2263 468 928 996 -423 -4530
588d530k510o42K27J937N272M625L337K816K29k861l825l089k949n70K486K339
$$ -4530 -7040 -7682 -7455 -5518 -246 4379 7716 10532 10761 7900 4075 986 -1963 -2533 -47 2292
604B292J012J290l08k802l298l458l845k505K82K515M135N247L501P70l80j606
$$ 2292 3304 4594 4286 1484 -1814 -5272 -9117 -11622 -11340 -8825 -4690 557 4058 4828 4448 2842
620B842k719k227O99J841J570M155L217O41o25k098m966m821k897k505n82K885
$$ 2842 123 -2104 -1405 436 2006 6161 9378 10019 9394 7296 2330 -2491 -5388 -7893 -8475 -5590
636e590L211J610P62k64k458k286j266q92L91L423L343L583M612K683j345k222
$$ -5590 -2379 -769 -7 -271 -2729 -5015 -6281 -7173 -6782 -3359 -16 3567 8179 10862 9517 7295
652G295k285l813k892L34J379J184J871J997q27k895l533l967l527j491M85K373
$$ 7295 5010 1197 -1695 -1361 18 1202 3073 5070 4243 1348 -2185 -6152 -9679 -11170 -10685 -8312
668h312M483L921K746R94Q3k412k615k5L66N46L734L816J576K86N33k898m765
$$ -8312 -3829 92 2838 3832 3915 1503 -1112 -1137 -771 -225 3509 7325 8901 9187 9720 6822 2057
685B057l339k885k471l74K019K279J270J485r12k032k420k261q78J483K474L350
$$ 2057 -1282 -4167 -6638 -7012 -4993 -2714 -1444 41 -871 -2903 -5323 -7584 -8462 -6979 -4505 -1155
701a155N106M321Q90n51o98k932m059j058J071O74N77L228N68k382k361k966m219
$$ -1155 3951 8272 9162 8611 7913 4981 922 -136 935 1609 2186 5414 5982 3600 1239 -1727 -5946
718e946l399j459P53J847L036L127L023J335j050j258l62j049q19K771M051J807
$$ -5946 -9345 -10804 -10051 -8204 -5168 -2041 982 2317 1267 9 -353 -1402 -2221 550 4601 6408
734F408J808K829j43l495l975l154l530k938P46K090J409J106K58q50k502l129
$$ 6408 8216 11045 10902 7407 3432 278 -3252 -6190 -5444 -3354 -1945 -839 -581 -1431 -3933 -7062
750g062j577l57O29K504M808M691K310J436J023q41l321k510M52o18J02K250K730
$$ -7062 -8639 -8996 -8367 -5863 -1055 3636 5946 7382 8405 7564 4243 1733 2185 1567 1669 3919 6649
767F649n92k101j017l397m812l754p42p1J174K681L700K607K13k30j054j361j051
$$ 6649 6057 3956 2939 -458 -5270 -9024 -9766 -9837 -8663 -5982 -2282 325 538 308 -746 -2107 -3158
784c158P17K949L033J883L707K455j601k847k329k998m177j515J216O52M0J407
$$ -3158 -2441 508 3541 5424 9131 11586 9985 7138 4809 1811 -2366 -3881 -2665 -2013 -1973 -566
800e66P18j804l097j678j611j504M24K881L533L715K760K544J181k185k006l74
$$ -566 152 -1652 -4749 -6427 -8038 -9542 -9118 -6237 -2704 1011 3771 6315 7496 5311 3305 2931
816B931o48j151J536L284P33k41j38j936m441m307k209j662q88J245K839K304
$$ 2931 2283 1132 2668 5952 6685 6444 6306 4370 -71 -4378 -6587 -8249 -9137 -7892 -5053 -2749
832b749J265K88M51j494j557l06J747J952K041L433L739J003r41p72j946m142
$$ -2749 -1484 -1196 -745 -2239 -3796 -4102 -2355 -403 1638 5071 8810 9813 8872 8100 6154 2012
848B012k590p37n57j14J431J710m88k424j625k372k628j402N60K650L016K946
$$ 2012 -578 -1315 -1872 -1986 -555 1155 667 -1757 -3382 -5754 -8382 -9784 -9224 -6574 -3558 -612
864f12L692K071j63j352m32q39j281N16K615J617N68O18J16k812l665k748k558
$$ -612 3080 5151 4988 3636 3204 2365 1084 1600 4215 5832 6400 7018 7134 4322 657 -2091 -4649
881d649k526p80J538J683J405J175J006k57j762j215K37L14J505L206M064K074
$$ -4649 -7175 -7955 -6417 -4734 -3329 -2154 -1148 -1405 -3167 -4382 -4145 -3831 -2326 880 4944 7018
897G018J157R28j089l020k770j619p94r28J051J562K67r61j610j697k940k489
$$ 7018 8175 9103 8014 4994 2224 605 -189 -1117 -66 1496 1763 802 -808 -2505 -5445 -7934
913g934r17Q86J356K016L292L048J234o4Q1n69j570J5J323J444J236J755J025
$$ -7934 -8851 -7965 -6609 -4593 -1301 1747 2981 2917 2998 2429 859 874 2197 3641 4877 6632 7657
930G657p00k146k547l043k931j970o46J089J119Q27J643N78j597j259r57m79N20
$$ 7657 6957 4811 2264 -779 -3710 -5680 -6326 -5237 -4118 -3291 -1648 -1070 -2667 -3926 -4883 -5362 -4842
947d842J999L358L139J946J823M25j380j500j709j825p53k39Q20R20J04n11j463
$$ -4842 -2843 515 3654 5600 7423 7848 6468 4968 3259 1434 681 442 1262 2182 2286 1775 312
964C12j923k891k646o26L7N70K807K641J973J000J177k39j450m62J72Q20J539
$$ 312 -1611 -4502 -7148 -7774 -7737 -7167 -4360 -1719 254 1254 2431 2192 742 280 452 1272 2811
981B811K554J126J128k86j976k689k555k696j660j11M11M20J142R75n27j179o67
$$ 2811 5365 6491 7619 7333 5357 2668 113 -2583 -4243 -4354 -3943 -3523 -2381 -1406 -1933 -3112 -3779
998c779j308j075R00J859K351K900K931R48O82m48r67j866j082n94l01Q67Q81
$$ -3779 -5087 -6162 -5262 -3403 -1052 1848 4779 5727 6409 5961 4994 3128 2046 1452 1151 2018 2899
1015B899L21o18r39k655k905k079j198o00J324K075J795J476J420J55N1n86o14
$$ 2899 3220 2602 1663 -992 -3897 -5976 -7174 -7774 -6450 -4375 -2580 -1104 316 471 522 -64 -678
1032f78J84J579J521K023J847P12j46j370j883k647k169j233n48l09P89P72L30
$$ -678 -494 1085 2606 4629 6476 7188 7042 5672 3789 1142 -1027 -2260 -2808 -3117 -2328 -1556 -1226
1049a226l04j052j461j757l34N60J207K832K478K108J369P95n55j058q43n20j074
$$ -1226 -1530 -2582 -4043 -5800 -6134 -5574 -4367 -1535 943 3051 4420 5215 4660 3602 2759 2239 1165
1066A165P56R70Q19L13j43j658k605k097j997j857O3Q66R94J463J545O52j40K36
$$ 1165 1921 2891 3710 4023 3880 2222 -383 -2480 -4477 -6334 -6271 -5405 -4411 -2948 -1403 -751 -891 -655
1084f55p93m93N65J306J506K209J967J144m7p84j890k450j633j007q85K25R92
$$ -655 -1448 -1941 -1376 -70 1436 3645 5612 6756 6709 5925 4035 1585 -48 -1055 -1940 -1715 -723
1101g23M01l33J07j555j836j376p11J55J454K068J960K035J333N80m5n64q10p20
$$ -723 -322 -655 -548 -2103 -3939 -5315 -6026 -5871 -4417 -2349 -389 1646 2979 3559 3514 2950 2140 1420
1119A420K33P04N26R66Q55r96r33j385k258k748j521K51m3Q50J580J341J88R1
$$ 1420 1653 2357 2883 3849 4704 3708 2775 1390 -868 -3616 -5137 -4886 -4929 -4079 -2499 -1158 -970 -879
1137h79m73o47o94N13J176J971J840J674J361M30j128j498j381j626j484k7O81
$$ -879 -1352 -1999 -2693 -2180 -1004 967 2807 4481 5842 6272 5144 3646 2265 639 -845 -872 -191
1154a91K60j37L50l93j581j496q18j297k95J205J600J853J498J436J028m10o99
$$ -191 69 -68 282 -111 -1692 -3188 -4006 -5303 -5598 -4393 -2793 -940 558 1994 3022 2612 1913
1171A913r85m5K33J71J659J534j83k94m28j504k808j962n90o89k48J073J830L96
$$ 1913 928 883 1116 1287 2946 4480 4297 4003 3575 2071 -737 -2699 -3289 -3978 -4226 -3153 -1323 -927
1189i27m38M45m14j221p34P33J352Q16J484K530J396m15o07j15j136k454p74J116
$$ -927 -1365 -920 -1334 -2555 -3289 -2556 -1204 -388 1096 3626 5022 4607 4000 3885 2749 295 -479 637
1207F37k40l31J129L99j318j646p99j209j752l39J448J561P15J582J905O58j801
$$ 637 397 66 1195 1594 276 -1370 -2169 -3378 -5130 -5469 -4021 -2460 -1745 -163 1742 2400 599
1224E99n9N67o94n45J649J978J89j32Q30k72k813j842p05r10j891M40K014N71
$$ 599 540 1107 413 -132 1517 3495 3684 3552 4382 4110 1297 -545 -1250 -2160 -4051 -3611 -1597 -1026
1242a026m46L64R27j469j705L49R91l80P16K908K480l61J98Q73q12k581j183J017
$$ -1026 -1472 -1108 -181 -1650 -3355 -3006 -2015 -2395 -1679 1229 3709 3348 3546 4419 3607 1026 -157 860
1260H60j59p68J070J519o72k213M8o50k248j773J042J126n83J284K758R26j552
$$ 860 701 -67 1003 2522 1850 -363 -315 -965 -3213 -4986 -3944 -2818 -3401 -2117 641 1567 15
1277A5J16J465j208j722J336J981pJ32J837J218k129k111K73r28k681r07J932
$$ 15 131 1596 388 -1334 2 1983 1976 2108 3945 5163 3034 923 1196 268 -2413 -3320 -1388
1294a388O84j246R71J869j274k623K78Q98j273p12K937K566k27K14K298J78k713
$$ -1388 -704 -1950 -979 890 -384 -3007 -2729 -1831 -3104 -3816 -879 1687 1460 1674 3972 4150 1437
1311A437j058J124k25k008Q00K508n37j420L58P29k762k625N61O87j457N9L294
$$ 1437 379 1503 1278 -730 70 2578 2041 621 979 1708 -1054 -3679 -3118 -2431 -3888 -3829 -535
1328e35J525j305j82K030r52k408M66K451k62p39K701K366j366k071Q74m47l346
$$ -535 990 -315 -497 1533 581 -1827 -1361 1090 828 89 2790 5156 3790 1719 2593 2146 -1200
1345a200j494J864M19j396K38K728m27l029j6J547j545k227J883L029o38k40L403
$$ -1200 -2694 -830 -411 -1807 -1569 1159 732 -2297 -2313 -766 -2311 -4538 -2655 374 -264 -504 2899
1362B899J325k490j159J759k97k815M5K776L23k024Q96J915k476l241L80P93k096
$$ 2899 4224 1734 575 2334 2037 -778 -733 2043 2366 342 1238 3153 677 -2564 -2184 -1391 -3487
1379c487j063K764K342j781j67K894K6l508k3K415J49j953K114L366q56j675J589
$$ -3487 -4550 -1786 556 -1225 -1392 1502 1528 -1980 -2003 412 561 -1392 722 4088 3232 1557 3146
1396C146J055l629k722K033K57k210N7L107K34k616k06J624j564l140R58L024
$$ 3146 4201 572 -2150 -117 140 -2070 -2013 1094 1328 -1288 -1494 130 -1434 -4574 -3616 -592
1412e92r54p12L351K395j828j333J906J02l148q35L331N22k187J138K828j516
$$ -592 -1546 -2258 1093 3488 1660 327 2233 2335 -813 -1648 1683 2205 18 1156 3984 2468
1428B468l549J40J237k527k147J792K489j374q61L234Q31l072r94K540j97k243
$$ 2468 -1081 -941 296 -2231 -4378 -2586 -97 -1471 -2332 902 1733 -1339 -2333 207 10 -2233
1444b233J092L787k23j714K164J624k330k870J254Q18k887r21L248R67k769k73
$$ -2233 -1141 2646 2423 709 2873 4497 2167 -703 551 1369 -1518 -2439 809 1776 -993 -1266
1460a266K508j103l855Q0K674o96j988K827L360j231j750K219J134l123j171K553
$$ -1266 1242 139 -3716 -3636 -962 -1658 -3646 -819 2541 1310 -440 1779 2913 -210 -1381 1172
1476A172R85k525M42L389j45l124O3J455k203l451J266K403j835p20K956J932
$$ 1172 2157 -368 74 3463 3318 194 257 1712 -491 -3942 -2676 -273 -2108 -2828 128 2060
1492B060k868j412K675k64l110O16L774K99k030J798K827j664k800R04J690k895
$$ 2060 -808 -2220 455 191 -2919 -2303 1471 1770 -260 1538 4365 2701 -99 805 2495 -400
1508d00k021K757J388k153q70K691j15l883m65K458q75k376J815L695r84j701
$$ -400 -2421 336 1724 -429 -1299 1392 1277 -2606 -3071 -613 -1488 -3864 -2049 1646 662 -1039
1524a039K482J647k573j954K108P51k131J82L215K86k260k78K264j928l143K66
$$ -1039 1443 3090 517 -1437 671 1422 -709 -527 2688 2974 714 436 2700 772 -2371 -2105
1540b105J973j323j844K497K375k042j611K294P75l394n40L397M34j991J646L253
$$ -2105 -132 -1455 -3299 -802 1573 -469 -2080 214 989 -2405 -2945 452 886 -1105 541 3794
1556C794q22k720J027J529k451k445J950J711k025n19K222P49k870j349J733n12
$$ 3794 2972 252 1279 2808 357 -2088 -138 1573 -452 -971 1251 2000 -870 -2219 -486 -998
1572i98k708O27L523k57j601J964K437j943k293J591J338k570o79L163J021j882
$$ -998 -3706 -3079 444 187 -1414 550 2987 1044 -1249 342 1680 -890 -1569 1594 2615 733
1588G33j89K177j045k929Q4J270j263k178J739K344r06j903K250J069k674j556
$$ 733 544 2721 1676 -1253 -1169 101 -1162 -3340 -1601 743 -163 -2066 184 1253 -1421 -2977
1604b977K350Q36j830R74L216p1j831Q41J558j950k287R95J548j733l47J678J045
$$ -2977 -627 209 -1621 -647 2569 2498 667 1508 3066 1116 -1171 -176 1372 -361 -708 970 2015
1621B015k046j487J703l82k874k09K699L25j760J330K714j042j715J426P24j859
$$ 2015 -31 -1518 185 -197 -3071 -3280 -581 -256 -2016 -686 2028 986 -729 697 1421 -438
1637d38j117K329J339j368j01K055j66k128j324J249p12k188P52K188n79j347
$$ -438 -1555 774 2113 745 644 2699 2533 405 -919 330 -382 -2570 -1818 370 -209 -1556
1653a556J414J221k051j161J181Q73j701m8L174L39j055N84J399p30k206L78J047
$$ -1556 -142 1079 -972 -2133 -952 -79 -1780 -1828 1346 1685 630 1214 2613 1883 -323 55 1102
1670A102r92j451J716J514j467j061J241j15k372q17J358L15j402R89K552j65
$$ 1102 110 -1341 375 1889 422 -639 602 487 -1885 -2702 -1344 -1029 -2431 -1442 1110 945
1686I45j528R42J150j577j406J554J279p96l74J934N85j563j054R95q15k097O3
$$ 945 -583 359 1509 -68 -1474 80 1359 563 189 2123 2708 1145 91 1086 271 -1826 -1763
1703a763J577l90q76R10J412j158j320O70P57j662j14J774J155q04L43J935n67
$$ -1763 -186 -576 -1452 -542 870 -288 -1608 -938 -181 -1843 -1957 -183 972 168 511 2446 1879
1720A879j485l65J033r46q54P63J326q08o17R12K61j729j229O38P1p68n5J839
$$ 1879 394 29 1062 116 -738 25 1351 543 -74 838 1099 -630 -1859 -1221 -1150 -1918 -1973 -134
1738a34L61q32Q18N55n60j222Q10O51k66k15J177Q47q02j70K79j82j606m83Q03
$$ -134 227 -605 213 768 208 -1014 -204 447 181 -34 1143 1990 1188 1018 1297 1115 -491 -974 -171
1757a71j70n35K14J315p95q60M26K79r89r10J226Q01m48R27J340k00p28l31O95
$$ -171 -341 -876 -662 653 -142 -1002 -576 -297 -1286 -2196 -970 -169 -617 310 1650 1450 722 391 1086
1776A086m37r38M30Q70k33l05N54L32j056j394M07j99q57j46J096M79k75N66L92
$$ 1086 649 -289 141 1011 778 473 1027 1359 303 -1091 -684 -883 -1740 -1886 -790 -311 -586 -20 372
1795C72k20r14L63O33m86j91Q50P92J4J47K71M9j280o56K19m01l90L80M45O0l61
$$ 372 152 -762 -399 234 -252 -443 407 1199 1213 1360 1631 1680 400 -256 -37 -438 -828 -448 -3 57 -304
1816c04Q5L3n28j133M96M52k39N36J081P45n29r8K77k62n53n6O05O9k05L96M43
$$ -304 -219 -186 -714 -1847 -1351 -899 -1138 -602 479 1224 695 597 874 612 59 3 608 677 472 868 1311
1837A311m06o87j02m68o60o70N28M42m02M50O24N9m74j70K17k07o7K49Q89J35
$$ 1311 905 218 116 -352 -1012 -1682 -1154 -712 -1114 -664 -40 19 -455 -625 -408 -615 -682 -433 456 591
1857E91L41M29J69k40j150N26l05m68m58P52K65o09L76k49l77o44l29RL27k46
$$ 591 932 1361 1530 1290 140 666 361 -107 -565 187 452 -157 219 -30 -407 -1051 -1380 -1371 -1044 -1290
1877a290Q78M54N2M15J47jn76j44J09L80J26J72O03j05l53j95j73r35l97J07j75
$$ -1290 -412 42 94 509 656 655 79 -65 44 424 550 722 1325 1220 867 672 499 -436 -833 -726 -901
1898i01K77P0K95K16m09k91N3J9m21J28N85M40N36K26K79p5k77Q6l35o09J72J58
$$ -901 -624 -554 -259 -43 -452 -743 -690 -671 -1092 -964 -379 61 597 823 1102 1027 750 836 501 -108 64 222
1920B22K36k9J57k29k93l57k21m44j85LL15M51K17P8K64o0l8l9m45L80L1K84M42
$$ 222 458 429 586 357 64 -293 -514 -958 -1143 -1140 -825 -374 -157 -79 185 125 87 48 -397 -17 14 298 740
1943G40K58J20j50Np05j22l66m07j84M04J60N0o1K03l88k93J9k38q9M37O58J90
$$ 740 998 1118 968 973 268 146 -220 -627 -811 -407 -247 -197 -258 -55 -443 -736 -717 -955 -1044 -607 51 241
1965B41N00M2K60l83K7m68o0k56N24j4K41j27nj19l55o25j58m10K71L7J56K63
$$ 241 741 783 1043 660 687 219 159 -97 427 413 654 527 522 403 48 -577 -735 -1145 -874 -837 -681 -418
1987d18J86R0M8R4m49K93j07J73L10L95K57J7J40k22m43Nn71M7p1J86j33J45K23
$$ -418 -232 -142 -94 0 -449 -156 -263 -90 220 615 872 889 1029 807 364 369 -202 -155 -226 -40 -173 -28 195
2010A95l72o18K51n39pJ99L55K15L30K40K28J04j19Ol92K82p7J34J78J09K1j05
$$ 195 -177 -795 -544 -1083 -1090 -891 -536 -321 9 249 477 581 462 468 76 358 281 415 593 702 723 618
2032F18j41k62l92n45n00QK30O18j30L03nP9j19l12MM6K36K80M15J84L02K97l33
$$ 618 477 215 -177 -722 -1222 -1214 -984 -366 -496 -193 -198 -119 -238 -550 -546 -500 -264 16 431 615 917 1214 881
2055H81l26l15k23o6K0R4J70R2k59l71R4k40m46j64q1K99K93M30L61K88Mj17J8
$$ 881 555 240 17 -49 -29 65 235 327 68 -303 -209 -449 -895 -1059 -1140 -841 -548 -118 243 531 535 418 436
2078D36j95R7l1J05K45K42m2k00R6n95j32o67Q5k30J26M7K78J19j74p5K12o87
$$ 436 241 338 307 412 657 899 857 657 753 158 26 -641 -556 -786 -660 -613 -335 -216 -390 -465 -253 -940
2100i40N0M06J64M07J83N65K82j92k82j29O6m33j30K53k25n6J82O4j63n23k74
$$ -940 -890 -484 -320 87 270 835 1117 925 643 514 580 147 17 270 45 -11 171 235 72 -451 -725
2121g25j2k29J52k55N91O0M77K74j08k62K98k07j09K31K98K75k18M98j25k46l70
$$ -725 -737 -966 -814 -1069 -478 -418 59 333 225 -37 261 54 -55 176 474 749 531 1029 904 658 288
2142B88m54J04l82P6Q2j46K8k22L93L1m31q1J27K24J70J96J13L95P2J61k87p2
$$ 288 -166 -62 -444 -368 -286 -432 -404 -626 -233 -202 -633 -714 -587 -363 -193 3 116 511 583 744 457 385
2164C85Mn7j31q4o2L72k66M1k59J74n39l09K07m77K44Q8K22K65q5J14L1L77l30
$$ 385 389 332 201 117 55 427 161 202 -57 117 -422 -731 -524 -1001 -757 -669 -447 -182 -267 -153 -122 255 -75
2187g5Jq8M77J19L42J99m06J20k12l09j85l7j11k72L68k0pp2nm1K3l69j90P8N42
$$ -75 -74 -162 315 434 776 975 569 689 477 168 -17 -54 -165 -437 -69 -89 -96 -168 -173 -214 -191 -560 -750 -672 -130
2212a30L41p1J82L87k7k36l11p3qN2L46j0k71RKk66k06l94R6P6k30q5O16O8j23
$$ -130 211 140 322 709 682 446 135 62 54 106 452 442 171 180 182 -84 -290 -684 -588 -512 -742 -827 -211 -143 -266
2237b66M45j20L3j95k39O52j3J22J95K8j7l44J21q3k12lo23M23k5K74J34l65j94
$$ -266 179 59 92 -103 -342 310 297 419 614 642 625 281 402 319 107 104 -519 -96 -121 153 287 -78 -272
2260b72l54J54k07K52m4N51o9M20l6J3l71K27j02j59J00k93M97J90J33k20j47
$$ -272 -626 -472 -679 -427 -471 80 11 431 395 408 37 264 162 3 103 -190 307 497 630 410 263
2281B63j65m82J14L2m82K36K41J80l3r6J45j41l08L90l76J16M50K70L31qk62J89
$$ 263 98 -384 -270 -238 -720 -484 -243 -63 -96 -192 -47 -188 -496 -106 -482 -366 84 354 685 677 415 604
2303F04k29J15m23j38J06p4J18J65j66k69J4J98n14j16j68L95k65M30M76j62m
$$ 604 375 490 67 -71 35 -39 79 244 78 -191 -177 21 -493 -609 -777 -382 -647 -217 259 97 93
2324I3L01m60J50l32L09K43o4J02O9N0k77l7l32J16l07j1O7n8J49l5M88k79r2
$$ 93 394 -66 84 -248 61 304 240 342 411 461 184 147 -185 -69 -376 -387 -320 -378 -229 -264 224 -55 -147
2347a47rj38k2j99L40J96L73P4l1J17j39n9J55o31j9L11j38k5k34K77K8n3o97
$$ -147 -156 -294 -316 -515 -175 21 394 468 437 554 415 356 511 -120 -139 172 34 9 -225 52 80 27 -670
2370f70J27L64p0j89K22L67k50j05N96K4l44J7PM5N8j22M59M3j87k58k49q3J97
$$ -670 -543 -179 -249 -438 -216 151 -99 -204 392 416 72 89 96 141 199 77 536 579 392 134 -115 -198 -1
2393aj95n1p0O1J40J48k42k8l6l8K6p0L31N3O9K93L8m8j13m8O1m15L65j88L47
$$ -1 -196 -247 -317 -256 -116 32 -210 -238 -274 -312 -286 -356 -25 28 97 390 428 380 267 219 280 -135 230 42 389
2418C89r7j50L3k8j99Ln17L81k32J59K51j96K26L27l04k6qp8J0j13M09K3K77r1
$$ 389 292 142 175 147 -52 -49 -566 -185 -417 -258 -7 -203 23 350 46 20 12 -66 -56 -169 240 263 540 449
2442D49j14O4l14j03n3j45k4L83j48j22k52J39K36l54K06j24J69n2L30J58r7J30
$$ 449 335 399 85 -18 -71 -216 -240 143 -5 -127 -379 -240 -4 -358 -152 -276 -107 -159 171 329 232 362
2464C62j31o1l0p4r2Q2L41l8k80J40j91K46n40l83L18j69L05J5j51K90K3p9l1
$$ 362 231 170 140 66 -26 56 397 359 79 219 28 274 -266 -649 -331 -500 -195 -180 -331 -41 -18 -97 -128
2487a28K64o4k24K67n0J04J52m7mJ67j92j22j78p7j43J29j03J08P5JL3k68J9m
$$ -128 136 72 -152 115 65 169 321 274 270 437 245 123 -55 -132 -275 -146 -249 -141 -66 -65 -32 -300 -281 -285
2511b85m8r0K38P1J96K9K33l32m6L3J74k82J11k92N91M2k85O4n4j76j52k05Q9
$$ -285 -333 -423 -185 -114 82 111 344 12 -34 -1 173 -109 2 -290 301 343 58 122 68 -108 -260 -465 -376
2534c76Q9q9L16l15M64M5k54j0J36Q2l81L39Q3k5L17j0p0j03j28k66O2p4m3N1
$$ -376 -287 -376 -60 -375 89 134 -120 -130 6 88 -293 46 129 104 421 411 341 238 110 -156 -94 -168 -211 -160
2558a60J79J60K26k24j53k38k38p9M72Kl0Q7rL85k60K77k33k09J61k0P1K0J02
$$ -160 19 179 405 181 28 -210 -448 -527 -55 -53 -83 4 -5 380 120 397 164 -45 116 96 167 187 289
2581B89l55K97j20J0j62q7k04j9L5L06l34M34J71j48j46J30Q3l09J23J22K03O7
$$ 289 -66 231 111 121 -41 -128 -332 -351 -316 -10 -344 90 261 113 -33 97 180 -129 -6 116 319 386
2603C86K24m32k0lj48q0L3K18m29J72K37j88j15O9J27l60j08R3K93q3K78j64L31
$$ 386 610 178 158 155 7 -73 -40 178 -251 -79 158 -30 -145 -76 51 -309 -417 -324 -31 -114 164 0 331
2626C31J8m21K69n6j25N8M9p8k5K50J0k83j78K35k21j34j89K72K25k95J42J22
$$ 331 349 -72 197 141 16 74 123 45 20 270 280 -3 -181 54 -167 -301 -490 -218 7 -288 -146 -24
2648b4k36M6J56l2R9M2j14J16J73j53N11k16k29k22J36k85J41j38J75%j93M62
$$ -24 -260 -214 -58 -90 9 51 -63 53 226 73 584 368 139 -83 53 -232 -91 -229 -54 -54 -247 215
2670B15l55O5j31J39k01K0K07R8O2M8N7j09J90l31O3j9J13j60j01L33k28j25K4
$$ 215 -140 -75 -206 -67 -268 -248 -41 57 119 167 224 115 305 -26 37 18 131 -29 -130 203 -25 -150 -126
2693a26k5J08m76K81P8j14L49j13L3N2l04j7L83k46J30J02P3Pj72L83j60m65L59
$$ -126 -151 -43 -519 -238 -160 -274 75 -38 -5 47 -257 -274 109 -137 -7 95 168 175 3 386 226 -239 120
2716A20K41m29l06M10K53o13M81k21j4k7l03K88j29q9J1N64l4j56o1L33o87J12
$$ 120 361 -68 -374 36 289 -324 157 -64 -78 -105 -408 -120 -249 -338 -327 237 203 47 -14 319 -368 -256
2738b56J91K23JJ69j15J37l97j21L76k78pj83J8J19O9L7J33P6m09L15j7l35J89
$$ -256 -65 158 159 328 213 350 -47 -168 208 -70 -77 -260 -242 -123 -54 -17 116 192 -217 98 81 -254 -65
2761f5l1L61k40L6M60j01n13K39k07J5r6jK94qn98N76J19k48m33M13j8k08J91
$$ -65 -96 265 25 61 521 420 -93 146 -61 -46 -142 -143 151 143 -455 121 240 -8 -441 -28 -46 -254 -63
2784f3L3Q9j1J32R0l97M3j55M00k56q9M92K77l48o2P3j93m39K04J55m5k08K73
$$ -63 -30 59 48 180 270 -127 -84 -239 161 -95 -184 308 585 237 175 248 55 -384 -180 -25 -70 -278 -5
2807eK3J40l50K43P3m18n3L41J48k26Q4J17K3m2k1M66n40Q9j35J69l6j55O5K69
$$ -5 18 158 -192 51 124 -294 -347 -6 142 -84 0 117 140 98 77 543 3 92 -43 126 90 -65 0 269
2831B69k45n09M02r6r0j09N68K5n42K19L35j95o6j95M16j37k01K83K76k11r8J97
$$ 269 24 -485 -83 -179 -269 -378 190 215 -327 -108 227 32 -34 -229 187 50 -151 132 408 197 99 296
2853B96O4o41Q9L75l41k42K30K35l40q1L40K88j83l60K85K58k34k83M78Q6k20
$$ 296 360 -281 -192 183 -158 -400 -170 65 -275 -356 -16 272 89 -271 14 272 38 -245 233 319 99
2874I9l43N35K1m54o8M14k0l87J93J50Jn00J54J3k8n2N3L31l13O8K34j2l76K7
$$ 99 -244 291 312 -142 -210 204 184 -203 -10 140 141 -359 -205 -192 -220 -272 -219 112 -201 -133 101 89 -287 -260
2898b60O82m46j92J42L88n7n40M42K78n83m3K12L9k98n4M14J61o34K65L04J77
$$ -260 422 -24 -216 -74 314 257 -283 159 437 -146 -189 23 62 -236 -290 124 285 -349 -84 220 397
2919C97p34J27N21p16K14R2L75k89K93K58j17l69j25L36j48m33K36K08j4k62J57
$$ 397 -337 -210 311 -405 -191 -99 276 -13 280 538 421 52 -73 263 115 -318 -82 126 112 -150 7
2940GK08k65o75L22M75o83K51M16J09j17j80N69j35p24J74O55l43k00M16J11P4
$$ 7 215 -50 -725 -403 72 -611 -360 56 165 48 -132 437 302 -422 -248 407 64 -136 280 391 465
2961D65m97L74k07k97j28N31n6k66l43N66J2l99p3N22n35m55R01K29n36o4N64
$$ 465 -32 342 135 -162 -290 241 185 -81 -424 142 154 -245 -318 204 -331 -786 115 344 -192 -256 308
2982C08J88l46k87K74L9k55p5N63j93k07N8J64l85K7K80k63k84J88P7J65l15r5
$$ 308 496 150 -137 137 176 -79 -154 409 216 9 67 231 -154 -127 153 -110 -394 -206 -129 36 -279 -374
3004c74O02j19n93J11O35l12k81M00L90k42o11P02J63m56k26K68J73l47j29N70
$$ -374 228 109 -484 -373 262 -50 -331 69 459 217 -394 308 471 15 -211 57 230 -117 -246 324
3024C24m94k47J47M02j92k18K22M10l53k94N07J71j06m41M09K21l91l9M28j78
$$ 324 -170 -417 -270 132 -60 -278 -56 354 1 -293 214 385 279 -162 247 468 77 38 466 288
3044B88m76M21J87j93m76J73M23o19j81O17j29j84l45P23q5l70o7K35j1r8K42
$$ 288 -188 233 420 227 -249 -76 347 -272 -453 164 35 -149 -494 229 144 -226 -293 -58 -69 -167 75
3065G5M07k05m59N10J5k13k78K35J83k49k59M03l5j78r5K27Q2n67K65M9p5l93
$$ 75 482 277 -182 328 343 130 -148 87 270 21 -238 165 130 -48 -143 84 166 -401 -136 -87 -162 -555
3087e55L88O62l82k30L95L55p05K7J64J82m24j83Q09k57k89lJ37k47l49N28J4
$$ -555 -167 495 113 -117 278 633 -72 -45 119 301 -123 -306 503 246 -43 -46 91 -156 -505 23 37
3108C7l55J43L7J96k68r1M51q8n43K03N62M9l21J3J92o5j68PK28k80q5K18J64
$$ 37 -318 -175 -138 58 -210 -301 150 62 -481 -278 284 333 12 25 217 152 -16 -9 219 -61 -146 72 236
3131B36j43k94M95p7l78M2K03j74j12K72O4k3k11J00o4j91J21K59P3j54J06J12
$$ 236 93 -201 294 217 -161 -119 84 -90 -202 70 134 111 -100 0 -64 -255 -134 125 198 44 150 262
3153B62L5j78n7P3j86J0j8K05k60K3O2M44l69j17p9K09k51MM64Pn93L42L49j8
$$ 262 297 119 62 135 -51 -41 -59 146 -114 -91 -29 415 46 -71 -150 59 -192 -188 276 283 -310 32 381 363
3177C63m80R4J88n3m30J54J99K03n65N39j30k19j74K42J19l27R4J27K76n52L68
$$ 363 -117 -23 165 112 -318 -164 35 238 -327 212 82 -137 -311 -69 50 -277 -183 -56 220 -332 36
3198C6L1j28L4O5J21j77p5K73J22l34J67N9j25k9J48j57lk10J00N11j22o18L09
$$ 36 67 -61 -27 38 159 -18 -93 180 302 -32 135 194 69 40 188 31 28 -182 -82 429 307 -311 -2
3221bQ8l67J86k7J52j08q4K60K09k08q4K22j52l78L91J2J92j25R0r6j91o3nK35
$$ -2 86 -281 -95 -122 30 -78 -162 98 307 99 15 237 85 -293 98 110 302 177 267 171 -20 -83 -88 147
3245A47n52J92J3L02m53L30M6p8P6r9Q4N4j36M14k93j21J38O5J6m0j42L1J0M3
$$ 147 -405 -213 -200 102 -351 -21 25 -53 23 -76 8 62 -74 340 47 -74 64 129 145 105 -37 -6 4 47
3269D7k48K65j96J93j46K67m6m44K72J24j98L8pK37k20J94K46l54k29K57j9q3
$$ 47 -201 64 -132 61 -85 182 136 -308 -36 88 -110 -72 -79 158 -62 132 378 24 -205 52 33 -50
3291e0L6j8L96Km38O6p2k10L75k50M16m34J0R3K75m0k37K01l3q7J7Q3j42l6l1
$$ -50 -14 -32 364 366 -72 -6 -78 -288 87 -163 253 -181 -171 -78 197 157 -80 121 88 1 18 101 -41 -77 -108
3316a08L36l10L29m83K67j13k36M72k75j5J02J45j48j10K0J55o4J7j84M6L65k07
$$ -108 228 -82 247 -236 31 -82 -318 154 -121 -136 -34 111 -37 -147 -127 28 -36 -19 -203 -157 208 1
3338AJ29j0L7m1m9j93Q6M4j16K30q4J2j37j18J28J33m15L09o4j00K62k37J23J30
$$ 1 130 120 157 116 67 -126 -40 4 -112 118 34 46 -91 -209 -81 52 -363 -54 -118 -218 44 -193 -70 60
3362F0J33j33m8m2n8j52N40Q3l12k00J05R2O8k23mJ18j87K09p5o8p7Nj12mM5J62
$$ 60 193 60 12 -30 -88 -240 300 383 71 -129 -24 68 136 -87 -91 27 -160 49 -26 -94 -171 -166 -278 -282 -237 -75
3388g5J67j7J75j45j16J06j93J63lR9j15J52j01o1k3p9J40k50J2J59r4l38N8K83
$$ -75 92 75 250 105 -11 95 -98 65 62 161 46 198 97 36 13 -66 74 -176 -164 -5 -99 -437 -379 -96
3412i6K8M9L8J2k2Kj05M0j83J54l7M19l1j95L7l03J43K43k35J71L4l71J51m0M9
$$ -96 -68 -19 19 31 9 11 -94 -54 -237 -83 -120 299 268 73 110 -193 -50 193 -42 129 163 -208 -57 -97 -48
3437d8N5j60k73M14k15L48k30J99J06l03M37n0l91L8MQ3J87k15J21m4q0L33l68
$$ -48 7 -153 -426 -12 -227 121 -109 90 196 -107 330 280 -111 -73 -69 14 201 -14 107 63 -17 316 -52
3460e2r3j8j20K14K06m31J95K82l51K1P1L47m06K52j58R2J51j04J39j02l0P2j75
$$ -52 -145 -163 -283 -69 137 -294 -99 183 -168 -147 -76 271 -135 117 -41 51 202 98 237 135 105 177 2
3483Bj14J19j20K76Q8j5m28K90Nj88J38j88J85j47Q4qj02M00k61K56m6k27n3K42
$$ 2 -112 7 -113 163 251 236 -192 98 103 -85 53 -135 50 -97 -13 -21 -123 277 16 272 226 -1 -54 188
3507A88n3j1J41j30O7k09K31l17nno0jK86j40o4J28L4N2j79qM2Q7k24L84j37J71
$$ 188 135 124 265 135 202 -7 224 -93 -98 -103 -163 -164 122 -18 -82 46 80 132 -47 -55 -13 74 -150 234 97 268
3533B68k95q0J77n7l60M76k63L42j34O3k37J11J07r7k40J79L9q5Q6K2N9q1J76
$$ 268 -27 -107 70 13 -347 129 -134 208 74 137 -100 11 118 21 -219 -40 -1 -86 0 22 81 0 176
3556A76j71J10k20J96J17k2k96M4J59m0K22l90K21j12Q3n5l8q1l2J86l7J5J85
$$ 176 5 115 -105 91 208 186 -110 -66 93 53 275 -115 106 -6 77 22 -16 -97 -129 57 20 35 220
3579B20k76j20J14K10k81J3J19R2J89j39q0j7j56K30k71J25R8j56J28l36N87m22
$$ 220 -56 -176 -62 148 -133 -120 -1 91 280 141 61 44 -112 118 -153 -28 70 -86 42 -294 293 -129
3601a29K7%Rk20K94j10P7J65k24J54j59L04k02R9K3J7jk53K50j09m4k30J19K76
$$ -129 -102 -102 -93 -313 -19 -129 -52 113 -111 43 -116 188 -14 85 108 125 124 -129 121 12 -32 -262 -143 133
3625A33j94k2j47J47j89K29K8Q0k44m9P5l3Q3J84N1j32J63l11N8J79O0P0k78K63
$$ 133 -61 -83 -230 -83 -272 -43 -15 65 -179 -228 -153 -186 -103 81 132 0 163 -148 -90 89 149 219 -59 204
3649B04k38J67j69J4n7j36J48p2L00l09m6j1K47M5%Pj53N1R8J28M1m11K01j42
$$ 204 -34 133 -36 -22 -79 -215 -67 -139 161 -148 -194 -205 42 87 87 94 -59 -8 90 218 259 -152 49 -93
3673i3K70j2j04O3k97j7L90j58O7l2N8m05J14L41l42J84j07m8M9l5N0K33n0j49
$$ -93 177 165 61 124 -173 -190 200 42 109 77 135 -270 -156 185 -157 27 -80 -128 -79 -114 -64 169 119 -30
3697c0L66m36J40j53N8j8O3K87j45k22q3O7LK45k37k35M54l39K54k03K21j55j1
$$ -30 336 -100 40 -113 -55 -73 -10 277 132 -90 -173 -106 -103 142 -95 -330 124 -215 39 -164 57 -98 -109
3720a09K4n2J24J2o8L93k59j79J18j60Q4p9j1K34k1r2P3J8r8R8J08P2l41K41k41
$$ -109 -85 -137 -13 -1 -69 324 65 -114 4 -156 -72 -151 -162 72 51 -41 32 50 -48 50 158 230 -111 130 -111
3745a11l0q6N27n9P2l41J19o1M8l0j23l8J18o2q6Q5K56k44j83r1L22k7j40L38
$$ -111 -141 -227 300 241 313 -28 91 30 78 48 -75 -113 5 -57 -143 -58 198 -46 -229 -320 2 -25 -165 173
3769A73l06N43k65k25K82k13K2j90k8N5L55O6j10l86K60j85K18kq9J7J32N5k06
$$ 173 -133 410 145 -80 202 -11 11 -179 -207 -152 203 269 159 -227 33 -152 66 64 -25 -8 124 179 -27
3792b7O7k34J57l3p2K77l43J92R5R9O4k31J14o9r1J17k03J34J03k40l3K0K57j75
$$ -27 40 -194 -37 -70 -142 135 -208 -16 79 178 242 11 125 56 -35 82 -121 13 116 -124 -157 -137 120 -55
3816e5o1p0L06Kk90l7K21r7J57j61J42L5j89M36m43q0K01j30K94j48J48J3k13
$$ -55 -116 -186 120 122 -168 -205 16 -81 76 -85 57 92 -97 339 -104 -184 17 -113 181 33 181 194 -19
3839a9Q7O2j55P4pm29N28Q9k32J4n2O0R7Kj64j06K41j86K25n1j77Q1L6j52K92
$$ -19 68 130 -25 49 42 -387 141 230 -2 12 -40 20 117 119 -45 -151 90 -96 129 78 -99 -18 18 -134 158
3864A58o7r8J3k9J74j15p0O0K6k1J97l79J32M9m8L09l31O7R4l25K99J19j35J02
$$ 158 91 -7 6 -23 151 36 -34 26 52 31 228 -151 -19 30 -18 291 -40 27 121 -204 95 214 79 181
3888A81n6j21J40J19m92K7L05L4K2j27j7l5k5M3K2j32K01k02L2j41J22qK31j30
$$ 181 125 4 144 263 -229 -202 103 137 159 32 15 -20 -45 -2 20 -112 89 -113 -81 -222 -100 -108 123 -7
3912gm3K06l66L21l57M02k20L1o0K72k41J75j36J85j84j54K23Q2m2R7l7J9j78
$$ -7 -50 156 -210 111 -246 156 -64 -33 -93 179 -62 113 -23 162 -22 -176 47 129 87 184 147 166 -12
3935a2RP0R1p8m85M05j3L05l41J56k76o9K94j44k9l4J87j62L1K76k94k06L20j26
$$ -12 -3 67 158 80 -405 0 -13 292 -49 107 -169 -238 56 -88 -117 -151 36 -126 -95 181 -113 -319 1 -125
3959a25J65j75K70m15J73K97m8K78n89M27l33O4r7J28J19j48k21K31P6j90j96
$$ -125 40 -135 135 -280 -107 190 142 420 -169 258 -75 -11 -108 20 139 -9 -230 1 77 -113 -309
3980c09J66Q0J13j03P5J03r4j5k9j35P2J6m5J10JK16J03m23J96K5k39M2L79k84
$$ -309 -143 -63 50 -53 22 125 31 16 -13 -148 -76 -60 -105 5 6 222 325 -98 98 123 -116 -74 305 21
4004B1J58l03qK47rj23J15m87J80j25K49M2N4m5L50j60j62K57l81Q4K07j13j54
$$ 21 179 -124 -132 115 106 -17 98 -389 -209 -334 -85 -43 11 -34 316 156 -6 251 -130 -46 161 48 -106
4027a06L02k4j89P1j88J62j98m6J42j2K1K28j23m9J24j90j0O0J74m20K40J15k5
$$ -106 196 172 -17 54 -134 28 -170 -216 -74 -86 -65 163 40 -9 115 -75 -85 -25 149 -271 -31 84 59
4050E9k04J54qO5j01j57K10j11k02J84J55q7j66N22l71J31j74K26l9l9l90K35
$$ 59 -145 9 1 66 -35 -192 18 -93 -295 -111 44 -43 -209 313 -58 73 -101 125 86 47 -343 -108
4072a08J56l75L90m9P1j01P9k25J50q9K02K1j8n3M4jL2j46j68K64m64J95J70N
$$ -108 48 -327 63 14 85 -16 63 -162 -12 -101 101 122 104 51 95 94 126 -20 -188 76 -388 -193 -23 -18
4096a8p4j7k7NQ7J48k66p8K15O2P3k82K38Lj34J88k57j0R5J76m6j17j00L5M5J8
$$ -18 -92 -109 -136 -131 -44 104 -162 -240 -25 37 110 -172 66 69 -65 123 -134 -144 -49 127 81 -36 -136 -101 -56 -38
4122c8J71J3K48m13J8r9J51K7J48k12k40J00J24p6Q5J78j9j32J88J63m84M3k2
$$ -38 133 146 394 -19 -1 -100 51 78 226 14 -226 -126 -2 -78 7 185 166 34 222 385 -99 -56 -78
4145g8L13q1L6k14j88K23N5j65J90N8j56N2NL8P9j12L49n88L19L6J3J4k60K27
$$ -78 235 154 190 -24 -212 11 66 -99 91 149 -7 45 50 88 167 55 404 -184 135 171 184 198 -62 165
4169A65j36R0j08j18J54o4m6j20P8L6m73P85k27p2p0J58P6k84R4K93j17o8PJ87
$$ 165 29 119 11 -107 47 -17 -63 -183 -105 -69 -542 243 16 -56 -126 32 108 -176 -82 211 94 26 33 220
4193B20l55j39N76k04o6k69J18Q5L5J63p9p9p9q9O3J86l13J78J57j92k24L43O9
$$ 220 -135 -274 302 98 32 -237 -119 -34 1 164 85 6 -73 -162 -99 87 -226 -48 109 -83 -307 36 105
4216A05j05j85J47l7M5PJ06J36l80J01J80k26JK42M0j63Jp0K5q0M82j32j43j67
$$ 105 0 -185 -38 -75 -30 -23 83 219 -161 -60 120 -106 -105 137 177 14 15 -55 -30 -110 372 240 97 -70
4240g0n9N2K87m16M17J31n5l04O4k70L31n6q1L18l00k61K81K41l85l5L70j83l50
$$ -70 -129 -77 210 -206 211 342 287 -17 47 -223 108 52 -29 289 -11 -272 9 250 -135 -170 200 17 -333
4263c33L37L74n62J24Q2J06k66Rj17M02j15l5J21k4k95J13J74J29j64n1J13k57
$$ -333 4 378 -184 -60 22 128 -138 -129 -246 156 41 6 127 103 -192 -79 95 224 60 9 122 -135
4285a35J75J30k75K30l60M28Q1j01m22L09K5j86n3K03K31k19j61J65J57l98m9
$$ -135 40 170 -105 125 -235 193 274 173 -249 60 85 -101 -154 49 280 61 -100 65 222 -176 -225
4306b25K65J22l36Q7J28j40O2K47p0p3O0L2N0l73kL34j39k42J04L00l15J08J4
$$ -225 40 162 -174 -87 41 -99 -37 210 140 67 127 159 209 -164 -166 168 29 -213 -109 191 -124 -16 -2
4329bM0N7p2J4p7k15JJ19J40j11rl9M6J36O7L1l1k79J84K18l78J20J38k95K42
$$ -2 38 95 23 37 -40 -255 -254 -135 5 -106 -115 -154 -108 28 95 126 95 -184 0 218 -160 -40 98 -197 45
4354D5j83P2J84j79n4K34J73j49o03O50j16Q9p1q5n7n2o0M1j47K16m5J72l22J45
$$ 45 -138 -66 118 -61 -115 119 292 143 -460 190 74 163 92 7 -50 -102 -162 -121 -268 -52 -97 75 -247 -102
4378a02M91n89q0K50J24j18R5k0J38j57l87L88J33j68j32M5J60k51q1L86q3k2
$$ -102 389 -200 -280 -30 94 -24 71 51 189 32 -355 33 166 -2 -134 -89 71 -180 -261 125 42 20
4400B0K43k89P8p8K90j74l8k49R9M29o63M53n0j90K1Q5M6J97n14M97k03r0J11
$$ 20 263 -26 52 -26 264 90 52 -197 -98 331 -332 121 71 -119 -98 -13 33 230 -284 213 10 -80 31
4423C1k40N54l73j15P7K80j94o8J34L1j57K10n6n1j68j05J20j45J46O8M94p24
$$ 31 -209 345 -28 -143 -66 214 20 -48 86 117 -40 170 114 63 -105 -210 -90 -235 -89 -21 473 -251
4445b51RN52k02l25l7K94j72J82p6K05k75j37mM88l04Q7N2L60o12M2M23l48j66
$$ -251 -242 310 108 -217 -254 40 -132 50 -26 179 -96 -233 -237 251 -53 34 86 446 -166 -124 299 -49 -215
4468b15j2K14J59j84p0L12j23l54L65K44o51K64J66j21j80J23J69K5k02q8L10
$$ -215 -227 -13 146 -38 -108 204 81 -273 92 336 -315 -51 115 -6 -186 -63 106 131 -71 -159 151
4489A51L4l77K38j16N6l3L0K41n02oK39p4pNK11o9j93J76L11l26j48J17L39l13
$$ 151 185 -192 46 -70 -14 -47 -17 224 -278 -284 -45 -119 -126 -121 90 21 -172 4 315 -11 -159 -42 297 -16
4513a6j47L56J6k98N5L17M0l79J08M4J35k64k21K54k6j62K29l1j94L4Q7J22j24
$$ -16 -163 193 209 -89 -34 283 323 -56 52 96 231 -33 -254 0 -26 -188 41 10 -184 -150 -63 59 -65
4536f5j58M33j58j67J71n1j66LJ08J81P2m73J27J64j68j03O9L74m56K00o8L82
$$ -65 -223 210 52 -115 56 5 -161 -158 -50 131 203 -270 -143 21 -147 -250 -181 193 -263 -63 -131 251
4558B51l18N3k9K39j39j90M03k42l40L27J68l12NM00k69k03K23m5l44J83J81L49
$$ 251 -67 -14 -43 196 57 -133 270 28 -312 15 183 -129 -124 276 7 -196 27 -18 -362 -179 2 351
4580C51l47Qo2J70l43K73M0k4R2l66L23j33J67k32k8lk13K51O2P4j17j96K69J86
$$ 351 4 12 -50 120 -223 50 90 66 158 -208 115 -18 149 -83 -111 -114 -327 -76 -14 60 -57 -253 16 202
4604B02m15K6J45K13m46K81Q0j05J06j2m03L16k21M83j32k37K73j54j15Q3Q8J20
$$ 202 -213 -187 -42 171 -275 6 86 -19 87 75 -328 -12 -233 250 118 -119 154 0 -115 -32 56 176
4626A76j13j68k4lJ14r8K68m9j37qk5j46jM9K31Pj14J87j51J25R0NK08o11J66
$$ 176 63 -105 -129 -132 -18 -116 152 103 -34 -42 -67 -213 -214 -165 66 73 -41 146 -5 120 210 215 423 -188 -22
4651b2N7q1K04j22j35J20m5K3P4j11j04j5J10K5k51L59J61n49J34K01J35m58Q8
$$ -22 35 -46 158 36 -99 21 -24 -1 73 -38 -142 -157 -47 -22 -273 86 247 -302 -168 33 168 -290 -202
4674b02K60O1n7l06L84r4k04K03R7j57J29K4j9k68Q0r1k4J28jl0J87k01p5J22
$$ -202 58 119 62 -244 140 46 -158 45 142 -15 114 138 119 -149 -69 -160 -184 -56 -57 -87 100 -101 -176 -54
4698e4k22J47M36j95j61j19J01K68k14r1L08j62K28j99j71Q4O6m4J88j63k14J5
$$ -54 -276 -129 307 112 -49 -168 -67 201 -13 -104 204 42 270 71 -100 -16 50 6 194 31 -183 -168
4720a68Q9J71Ok40K9J72l25P5K64o3J70k54o7j46O79j74k01N6L3R8l11R6M9J90
$$ -168 -79 92 98 -142 -113 59 -266 -191 73 10 180 -74 -141 -287 392 218 17 73 106 204 -107 -11 38 228
4744B28k00J55p3k37J24q7J84k00L00k43K86j86J12r1J97l68P2Q3K91l58j79P0
$$ 228 28 183 110 -127 -3 -90 94 -106 194 -49 237 51 163 72 269 -99 -27 56 347 -11 -190 -120
4766a20K94l51O9R1KK28n24L65k42n5K21Nj89M30k52JJ06j25m3J79J49k3j53l60
$$ -120 174 -177 -108 -17 -15 213 -311 54 -188 -243 -22 -17 -206 224 -28 -27 79 -46 -89 90 239 216 63 -297
4790b97K58L20k25k56n1J73j8J81M3n8r4n2p9K75j38n1j15K67n9R1l9j12J4M0
$$ -297 -39 281 56 -200 -251 -78 -96 85 128 70 -24 -76 -155 120 -18 -69 -184 83 24 115 76 -36 -22 18
4814A8L9M3m5J46k08J21k82J74J35j35j60K03j71j15L14p3n0K40j93m2r7J68J56
$$ 18 57 100 55 201 -7 114 -168 6 141 6 -154 49 -122 -237 77 4 -46 194 1 -41 -138 30 186
4837A86p2j46K29k21K52l43J22l8k86L54k47R1J73k2r1J09N4j85k06M27j92M2
$$ 186 114 -32 197 -24 228 -115 7 -31 -317 37 -210 -119 54 32 -59 50 104 -81 -287 140 -52 -10
4859a0L46k36n0K18j49k05J24l6l10M24j50R1p8J25KJ11p2j62j66M3J47J34R2
$$ -10 336 100 50 268 119 -86 38 2 -308 116 -34 57 -21 104 106 217 145 -17 -183 -140 7 141 233
4882B33m48L15k59L28k43K53k58J20Kk28P3n5K19p5K56k7k79K97l01m1J56j00
$$ 233 -215 100 -159 169 -74 179 -79 41 43 -185 -112 -167 52 -23 233 206 -73 224 -77 -118 38 -62
4904f2M8n1o2J89j36j40M6N5K23k99J66q6K01N2j30M3j57n7J1M5J60L9j15p2J20
$$ -62 -14 -65 -127 62 -74 -214 -168 -113 110 -189 -23 -109 92 144 14 57 -100 -157 -146 -101 59 98 -17 -89 31
4929C1j00K09j86j86N1k17M99j06K58j08k2j81J97l5R6m10Q2J98n8K06K9j46k04
$$ 31 -69 140 -46 -232 -181 -398 101 -5 253 145 123 -58 139 104 200 -210 -128 70 12 218 247 101 -103
4952a03L02j94K32q8j35j02K92l23p7J57J80rj73j02L16j61J43j53M00l24O3j39
$$ -103 199 5 237 149 14 -88 204 -119 -196 -39 141 132 -41 -143 173 12 155 2 402 78 141 2
4974BL91k68l9J04j31M2l8K01m37L71n9m28L52k32J54q0J89K99j10n08n7L59j44
$$ 2 393 125 86 190 59 101 63 264 -173 198 139 -289 63 -169 -15 -95 94 393 283 -225 -282 77 -67
4997f7Q2j34L09k63J82r8j05J72p8J07J13k92j42P8M1J84o8r1r0N8N2j6L9R1k59
$$ -67 15 -119 190 -73 109 11 -94 78 0 107 220 -72 -214 -136 -95 89 21 -70 -160 -102 -50 -66 -27 64 -195
5022a95O4R4N1p1j13K36l5j14L12k51J96j33p7K90r6j53L32m45J44N7o2J23l94
$$ -195 -131 -37 14 -57 -170 66 31 -83 229 -22 174 41 -36 254 158 5 337 -108 36 93 31 154 -240
5045b40M42j99Q2l36J11N5J5N5Q3M5J49k69m2j09L23k69L30kr7m7O6J28l73q4
$$ -240 202 3 85 -251 -140 -85 -70 -15 68 113 262 -7 -49 -158 165 -104 226 224 127 80 146 274 -99 -183
5069a83J36R2N8j37R7j29K00o1k34J25l9oL9J02l6jL7O4k3Pj34J74k37n6M80l14
$$ -183 -47 45 103 -34 63 -66 134 73 -161 -36 -75 -81 -42 60 24 23 60 124 101 108 -26 148 -89 -145 335 21
5095B1J45R6k09k06K38k7r2M0Q4J9K8k00Q3o4k19L67k9m9L1q8pJ61J0r2j75L03
$$ 21 166 262 53 -153 85 58 -34 6 90 109 137 -63 20 -44 -263 104 75 26 57 -31 -38 123 133 41 -134 169
5121A69j13j44K8J10n5N7k69K57J21j31q2O1R8q6j21L6l5Q2L7P3j10Q5n7k62L30
$$ 169 56 -88 -60 50 -5 52 -217 40 161 30 -52 9 107 21 -100 -64 -99 -17 20 93 -17 68 11 -251 79
5146G9n5k09M51l06N6r4M7l9J89j44j3J5J03l06j8L34j35P2KJ12k00J27j27J40
$$ 79 24 -185 266 -40 16 -78 -31 -70 119 -25 -38 -23 80 -226 -244 90 -45 27 29 141 -59 68 -59 81
5170H1j23K83m55J79j7k63K06J38j1q0O6l54K71J65j14J22k48J33j6LK25j04q3
$$ 81 -42 241 -214 -35 -52 -315 -109 29 18 -62 4 -350 -79 86 -28 94 -154 -21 -37 -34 191 87 4
5193DJ99k20kN7J1J16j10l2J8J46l04Q1N1k1p8K57K0l9k21j39m3n5M28p5j37J3
$$ 4 203 -17 -19 38 49 165 55 23 41 187 -117 -36 15 -6 -84 173 193 154 -67 -206 -249 -304 124 49 -88 -75
5219g5p2N5K95j14r6L9O8J7rj73K72k88M2q4J15k66K59N9j84K19j10J22k9n7j20
$$ -75 -147 -92 203 89 -7 32 100 117 108 -65 207 -81 -39 -123 -8 -274 -15 44 -140 79 -31 91 62 5 -115
5244a15j08l5K05J01j27l8J72P5l7m9j45J4p0J65k92M26j3j89J17p5J2j42l2K33
$$ -115 -223 -258 -53 48 -79 -117 55 130 93 44 -101 -87 -157 8 -284 142 129 -60 57 -18 -6 -148 -180 53
5268E3j87J52K75k92k09J9K61k31L32j91J51r4mj34K46j52Q4Q2l07Q1K70j43k97
$$ 53 -134 18 293 1 -208 -189 72 -159 173 -18 133 39 35 -99 147 -5 79 161 -146 -65 205 62 -235
5291b35K72J43k48J6L4p7J44r8l6lK32K7k79L26k7j52J12k95J29l8O0K5j52m2
$$ -235 37 180 -68 -52 -18 -95 49 -49 -85 -88 144 171 -108 218 191 39 151 -144 -15 -53 7 32 -120 -162
5315a62M9J6K46k99O2p4K81n8pj81q5J29R6j37O4R5k1J7j91J83J5j04J50n5M6
$$ -162 -113 -97 149 -150 -88 -162 119 61 54 -127 -212 -83 13 -124 -60 35 14 31 -160 23 38 -66 84 29 75
5340G5lj07m1Q4q2J31k28m5K80k6k3j04K28m3M1j62o8J35m3j20K12Q3l37J61K42
$$ 75 72 -35 -76 8 -74 57 -171 -216 64 38 15 -89 139 96 137 -25 -93 42 -1 -121 91 174 -163 -2 240
5365B40l66K52K4k70R4j19j0k6M27j62l12L03K4P8k32n5K37Q7Ko5l2o1%P0k01
$$ 240 -126 126 150 -120 -26 -145 -155 -181 246 84 -228 75 99 177 -55 -110 127 214 216 151 119 58 58 128 -73
5390g3r3K38j11o9N5r5M92l33J54k81J29Q7k16N9Jj55M5J40k18J13J59n0L%j32
$$ -73 -166 72 -39 -108 -53 -148 344 11 165 -116 13 100 -116 -57 -56 -211 -166 -26 -244 -131 28 -22 -19 -19 -151
5415a51k7J15N7m2J06K2j73qQ4q1J17J4J0j14J28n3M1j2j94K83k98R0J18p6k3
$$ -151 -178 -63 -6 -48 58 80 -93 -101 -17 -98 19 33 43 -71 57 4 45 33 -161 122 -176 -86 32 -44 -67
5440f7L16j19j1o8JP9J36n55K75k9j40J48m4N3k5k2J0P6l50M58j81r1J10L47k84
$$ -67 249 130 119 51 52 131 267 -288 -13 -42 -182 -34 -78 -25 -50 -72 -62 14 -336 122 -59 -150 -40 307 23
5465B3j08K30rj71J93k50J04k3L4M8L21l94K05j20r8l64L77K71l91K96r8j75j5
$$ 23 -85 145 136 -35 158 -92 12 -11 23 71 392 -2 203 83 -15 -379 -2 269 -122 174 76 -99 -114
5488a14K98l94J31J73j56m7J01p3j01J40J05n7%jK2J12q7%l30J08M17k45n8n4
$$ -114 184 -210 -79 94 -62 -109 -8 -81 -182 -42 63 6 6 5 27 139 52 52 -278 -170 247 2 -56 -110
5512a10J39Pk5R0k04K17j36R3q7m4j49K73K4l27M18o04L49J29r2lK33j01K9k32
$$ -110 29 36 11 101 -103 114 -22 71 -16 -60 -209 64 88 -239 179 -425 -76 53 -39 -42 191 90 119 -113
5536a13K64k8o8j11K35j90k27K42Q5j37L8R2nl5J5j93J33pM00k78k08J43J54k04
$$ -113 151 123 55 -56 179 -11 -238 4 89 -48 -10 82 77 42 57 -136 -3 -10 390 112 -96 47 201 -3
5560cQ2n8N7L7Kj75J27K53k55J51m0R0j49k20L70j31q4K5l10J89j6o6N2m0J43
$$ -3 79 21 78 115 117 -58 69 322 67 218 178 268 119 -101 269 138 54 79 -231 -42 -58 -124 -72 -112 31
5585C1R9k24n3m4R9q4J55j65J66L9j59K23k75J61mr7K47l17J73l5J06o2L7Q7j47
$$ 31 130 -94 -147 -191 -92 -176 -21 -186 -20 19 -140 83 -192 -31 -35 -132 115 -202 -29 -64 42 -20 17 104 -43
5610d3ON8n9J5J33p4o3no5K40l03N4J03K06j52l2J86j89P5k0k3j12K42j37J52
$$ -43 -37 21 -38 -23 110 36 -27 -32 -97 143 -160 -106 -3 203 51 19 205 16 91 71 48 -64 178 41 193
5635A93k20j5J94Ql58K75R8j39QK4o8P1j17l16K66K03P9q2kj73Q1j91L02p7l29
$$ 193 -27 -42 152 160 -198 77 175 36 44 68 0 71 -46 -362 -96 107 186 104 102 -71 10 -181 121 44 -285
5660b85J24K35J96l00J46q2j39J39R9k08L10k44M7m5N4l4k30K33K02l32J61j16
$$ -285 -161 74 270 -30 116 34 -105 34 133 -75 235 -9 38 -7 47 13 -217 16 218 -114 47 -69
5682f9p1M77l06j42J97p3L2j34K31J18n5Pk02J58k91L84m34L13p3j88K58l85J73
$$ -69 -140 337 31 -111 86 13 45 -89 142 260 205 212 10 168 -123 261 -173 140 67 -121 137 -248 -75
5705g5L5K95o2P8m82J76j0NJ44k2j69k58L22J7R7k04K9J25J16m52N11j55J80k73
$$ -75 -40 255 193 271 -211 -35 -45 -40 104 82 -87 -345 -23 -6 91 -113 -84 41 157 -295 216 61 241 -32
5729c2QJ15J09l16J39j88j92K44K45j52k43L96k39n6K07M7m1K5J6j26M4o2j41
$$ -32 -24 91 200 -116 23 -165 -357 -113 132 -20 -263 133 -106 -162 45 92 51 76 92 -34 10 -52 -193
5752a93L39j04J03j66P9j99J10J22l5k48Q3L20j13m24M40j94j09o7K68K30n11
$$ -193 146 42 145 -21 58 -141 -31 91 56 -192 -109 211 98 -326 114 -80 -189 -256 12 242 -269
5773b69JL55m3O7k05J68l90j6L06J45k16o9J61J39o7m4j89J58j7Jq1q9J63Q6o9
$$ -269 -268 87 44 111 -94 74 -316 -332 -26 119 -97 -166 -5 134 67 23 -166 -8 -25 -24 -105 -194 -31 55 -14
5798a4J43k45m1K25R5l37L67j92N0o5K10k20j24j51K11J7k81J86K57K01k70j23
$$ -14 129 -116 -157 68 163 -174 193 1 51 -14 196 -24 -148 -299 -88 -71 -352 -166 91 292 22 -101
$$ [...]
8191e1
##END NTUPLES=NMR FID
##END=
