##TITLE=1H_LR-0139-B-IPS
 D2O
 8 sc, 
 3.7.2023
##JCAMPDX= 6.0         $$ Bruker NMR JCAMP-DX V2.0
##DATA TYPE= NMR FID
##DATA CLASS= NTUPLES
##ORIGIN= UXNMR, Bruker Analytische Messtechnik GmbH
##OWNER= root
$$ XWIN-NMR		Version 3.5
$$ Mon Jul  3 15:27:28 2023 Russian Standard Time (UT+4h)  she@DPX200
##.OBSERVE FREQUENCY= 200.13135
##.OBSERVE NUCLEUS= ^1H
##.DELAY= (6, 6)
##.ACQUISITION MODE= SIMULTANEOUS
##.ACQUISITION SCHEME= undefined
##.AVERAGES= 8
##.DIGITISER RES= 18
##SPECTROMETER/DATA SYSTEM= spect
##.PULSE SEQUENCE= zg30
##.SOLVENT NAME= D2O
##.SHIFT REFERENCE= (INTERNAL, D2O, 0, 15.7039)
##AUDIT TRAIL= $$ (NUMBER, WHEN, WHO, WHERE, WHAT)
$$ ##TITLE= Audit trail, XWIN-NMR		Version 3.5
$$ ##JCAMPDX= 5.01
$$ ##ORIGIN= Bruker BioSpin GmbH
$$ ##OWNER= she
$$ F:/spectra/data/she/nmr/H-F/1/audita.txt
$$ ##AUDIT TRAIL=  $$ (NUMBER, WHEN, WHO, WHERE, WHAT)
(   1,<2023-07-03 15:26:16.01 +0400>,<she>,<DPX200>,
      <created by zg, POWCHK disabled, PULCHK disabled
       configuration hash MD5:
       00 E9 B6 7A A2 85 ED C7 34 08 36 98 17 FE 4E 26
       data hash MD5: 16K
       0F 9B 1A F4 F5 C6 04 F4 39 2D 7B 3D 33 18 FB 0F>)
$$ ##END=
$$ 
$$ hash MD5
$$ 95 9B C3 93 1D 55 5B 7F 05 3D 73 15 70 46 4D B2
##$RELAX= 
##$RELAX= 
##$RELAX= 
##$RELAX= 
##$RELAX= 
##$RELAX= 
$$ Bruker specific parameters
$$ --------------------------
##$DU= <F:/spectra>
##$EXPNO= 1
##$NAME= <H-F>
##$PROCNO= 1
##$TYPE= <nmr>
##$USER= <she>
##$AMP= (0..31)
100 100 100 100 100 100 100 100 100 100 100 100 100 100 100 100 100 100 
100 100 100 100 100 100 100 100 100 100 100 100 100 100 
##$AQSEQ= 0
##$AQ_mod= 1
##$AUNM= <au_zg>
##$AUTOPOS= <>
##$BF1= 200.13
##$BF2= 200.13
##$BF3= 200.13
##$BF4= 200.13
##$BF5= 200.13
##$BF6= 200.13
##$BF7= 200.13
##$BF8= 200.13
##$BYTORDA= 1
##$CFDGTYP= 0
##$CFRGTYP= 5
##$CHEMSTR= <none>
##$CNST= (0..31)
1 1 145 1 1 1 1 1 1 1 1 1 1 1 1 1 1 1 1 1 1 1 1 1 1 1 1 1 1 1 1 1 
##$CPDPRG= <>
##$CPDPRG1= <>
##$CPDPRG2= <>
##$CPDPRG3= <>
##$CPDPRG4= <mlev>
##$CPDPRG5= <mlev>
##$CPDPRG6= <mlev>
##$CPDPRG7= <mlev>
##$CPDPRG8= <mlev>
##$CPDPRGB= <>
##$CPDPRGT= <>
##$D= (0..31)
0 1.2 0 0 0 0 0 0 0 0.06 0 0.03 0 0 0 0 0.0002 0 0 0 0 0 0 0 0 0 0 0 0 
0 0 0 
##$DATE= 1688383575
##$DBL= (0..7)
120 120 120 120 120 120 120 120 
##$DBP= (0..7)
150 150 150 150 150 150 150 150 
##$DBP07= 0
##$DBPNAM0= <>
##$DBPNAM1= <>
##$DBPNAM2= <>
##$DBPNAM3= <>
##$DBPNAM4= <>
##$DBPNAM5= <>
##$DBPNAM6= <>
##$DBPNAM7= <>
##$DBPOAL= (0..7)
0.5 0.5 0.5 0.5 0.5 0.5 0.5 0.5 
##$DBPOFFS= (0..7)
0 0 0 0 0 0 0 0 
##$DE= 6
##$DECBNUC= <off>
##$DECIM= 32
##$DECNUC= <off>
##$DECSTAT= 4
##$DIGMOD= 1
##$DIGTYP= 9
##$DL= (0..7)
0 120 120 120 120 120 120 120 
##$DP= (0..7)
150 150 150 150 150 150 150 150 
##$DP07= 0
##$DPNAME0= <>
##$DPNAME1= <>
##$DPNAME2= <>
##$DPNAME3= <>
##$DPNAME4= <>
##$DPNAME5= <>
##$DPNAME6= <>
##$DPNAME7= <>
##$DPOAL= (0..7)
0.5 0.5 0.5 0.5 0.5 0.5 0.5 0.5 
##$DPOFFS= (0..7)
0 0 0 0 0 0 0 0 
##$DQDMODE= 0
##$DR= 18
##$DS= 0
##$DSLIST= <SSSSSSSSSSSSSSS>
$$ [...]
##$SUBNAM2= <"">
##$SUBNAM3= <"">
##$SUBNAM4= <"">
##$SUBNAM5= <"">
##$SUBNAM6= <"">
##$SUBNAM7= <"">
##$SUBNAM8= <"">
##$SUBNAM9= <"">
##$SW= 18.05172834244
##$SWIBOX= (0..15)
0 0 2 0 0 0 0 0 0 0 0 0 0 0 0 0 
##$SW_h= 3612.71676300578
##$TD= 16384
##$TD0= 1
##$TE= 0
##$TE2= 300
##$TE3= 300
##$TEG= 300
##$TL= (0..7)
0 120 120 120 120 120 120 120 
##$TP= (0..7)
150 150 150 150 150 150 150 150 
##$TP07= 0
##$TPNAME0= <>
##$TPNAME1= <>
##$TPNAME2= <>
##$TPNAME3= <>
##$TPNAME4= <>
##$TPNAME5= <>
##$TPNAME6= <>
##$TPNAME7= <>
##$TPOAL= (0..7)
0.5 0.5 0.5 0.5 0.5 0.5 0.5 0.5 
##$TPOFFS= (0..7)
0 0 0 0 0 0 0 0 
##$TUNHIN= 0
##$TUNHOUT= 0
##$TUNXOUT= 0
##$USERA1= <user>
##$USERA2= <user>
##$USERA3= <user>
##$USERA4= <user>
##$USERA5= <user>
##$V9= 5
##$VALIST= <valist>
##$VCLIST= <CCCCCCCCCCCCCCC>
##$VD= 0
##$VDLIST= <DDDDDDDDDDDDDDD>
##$VPLIST= <PPPPPPPPPPPPPPP>
##$VTLIST= <TTTTTTTTTTTTTTT>
##$WBST= 1024
##$WBSW= 4
##$XGAIN= (0..3)
0 0 0 0 
##$XL= 0
##$YL= 0
##$YMAX_a= 791999
##$YMIN_a= -769884
##$ZGOPTNS= <>
##$ZL1= 120
##$ZL2= 120
##$ZL3= 120
##$ZL4= 120
##$ABSF1= 10
##$ABSF2= 0
##$ABSG= 5
##$ABSL= 3
##$ALPHA= 0
##$AQORDER= 0
##$ASSFAC= 0
##$ASSFACI= 0
##$ASSFACX= 0
##$ASSWID= 0
##$AUNMP= <proc_1d>
##$AZFE= 0.1
##$AZFW= 0.1
##$BCFW= 1
##$BC_mod= 2
##$BYTORDP= 1
##$COROFFS= 0
##$CY= 11.3945322036743
##$DATMOD= 1
##$DC= 2
##$DFILT= <>
##$DTYPP= 0
##$F1P= 15.7292609196834
##$F2P= 12.9074282941183
##$FCOR= 0.5
##$FTSIZE= 0
##$FT_mod= 4
##$GAMMA= 1
##$GB= 0.15
##$INTBC= 1
##$INTSCL= 1
##$ISEN= 128
##$LB= 0.24
##$LEV0= 0
##$LPBIN= 0
##$MAXI= 10000
##$MC2= 0
##$MEAN= 0
##$ME_mod= 0
##$MI= 1.114404
##$NCOEF= 0
##$NC_proc= 0
##$NLEV= 6
##$NOISF1= 3.799351
##$NOISF2= 2.8
##$NSP= 1
##$NTH_PI= 0
##$NZP= 0
##$OFFSET= 15.70392
##$PC= 1
##$PHC0= -20634.03
##$PHC1= 11.85272
##$PH_mod= 1
##$PKNL= yes
##$PPARMOD= 0
##$PSCAL= 0
##$PSIGN= 0
##$REVERSE= no
##$SF= 200.130013532006
##$SI= 16384
##$SIGF1= 3
##$SIGF2= 2
##$SINO= 400
##$SIOLD= 16384
##$SREGLST= <1H.CDCl3>
##$SSB= 0
##$STSI= 0
##$STSR= 0
##$SW_p= 3612.71676300578
##$SYMM= 0
##$S_DEV= 0
##$TDeff= 0
##$TDoff= 0
##$TI= <>
##$TILT= no
##$TM1= 0
##$TM2= 0
##$TOPLEV= 0
##$USERP1= <user>
##$USERP2= <user>
##$USERP3= <user>
##$USERP4= <user>
##$USERP5= <user>
##$WDW= 1
##$XDIM= 8192
##$YMAX_p= 0
##$YMIN_p= 0
$$ End of Bruker specific parameters
$$ ---------------------------------
##NTUPLES= NMR FID
##VAR_NAME=  TIME,          FID/REAL,        FID/IMAG
##SYMBOL=    X,             R,               I
##VAR_TYPE=  INDEPENDENT,   DEPENDENT,       DEPENDENT
##VAR_FORM=  AFFN,          ASDF,            ASDF
##VAR_DIM=   8192,          8192,            8192
##UNITS=     SECONDS,       ARBITRARY UNITS, ARBITRARY UNITS
##FACTOR=    0.0002768,     1,               1
##FIRST=     0,             0,               0
##LAST=      2.2672688,     0,               0
##MIN=       0,             -769884,         0
##MAX=       2.2672688,     791999,          0
$$ Real data points
##PAGE= N=1
##DATA TABLE= (X++(R..R)), XYDATA
$$ [...]
$$ plain form
2624 -10948 -2284 7778 13805 13312 6624 -3347 -11554 -14514 -10447 -1208 8366 13904 12923 5782 -4094
2639 -4094 -12063 -14177 -9538 -497 8661 13907 12451 4958 -4713 -12027 -13829 -8824 224 9250 13853
2654 13853 12031 4402 -5464 -12586 -13523 -8283 1103 9858 13681 11410 3357 -6023 -12644 -13188 -7435
2669 -7435 1719 10143 13695 10770 2700 -6498 -12797 -12785 -6728 2591 10583 13744 10015 2012 -7327
2684 -7327 -12837 -12390 -6140 3298 11040 13466 9566 1149 -7947 -12934 -11822 -5192 4056 11314 13077
2699 13077 8612 293 -8344 -12979 -11431 -4584 4498 11487 13090 8132 -356 -8870 -13012 -10703 -3627
2714 -3627 5133 11673 12619 7483 -1063 -9218 -12714 -10468 -2968 5865 11916 12266 6735 -1759 -9631
2729 -9631 -12922 -9748 -2270 6494 11887 11797 6053 -2530 -9915 -12634 -9134 -1615 6833 11965 11494 5317
$$ packed form
2624a0948Q664J0062O027m93o688r971q207k960M067R239R574N538r81p141r876
2639d094p969k114M639R041R158N246j456p493r671p314j802N005R048R026M603
2654A3853j822p629r866p122r37N240R386Q755L823k271q053r380o621n44N753
2669g435R154Q424L552k925q070r198o299J2O057R319P992L161l729q003r339
2684g327n510M47O250R438P742K426l900q417r096m987J112O630R248P258J763
2699A3077m465q319q637m635J548O847R082O989J603m958q488q514m142K309P076
2714c627Q760O540R46n136q546q155l496K246P500Q833O051L50n531q494p872
2729i631l291L174P478Q764N393r0n744q583p385k719L500P519Q448N132m71o177
$$ plain form
2745 5317 -3145 -10388 -12453 -8513 -732 7557 12091 10881 4772 -3692 -10379 -12232 -7985 -50 7739
2760 7739 12111 10485 3970 -4297 -10724 -11911 -7293 501 8261 12011 10000 3369 -5118 -10759 -11462
2775 -11462 -6847 1232 8477 11758 9421 2777 -5415 -10941 -11227 -6141 1789 9002 11830 8820 1872
2790 1872 -6031 -11187 -10685 -5709 2297 9320 11589 8785 1274 -6356 -11289 -10615 -4818 2852 9453
2805 9453 11560 7965 644 -6842 -11097 -10042 -4339 3449 9830 11128 7470 -5 -7282 -11162 -9670
2820 -9670 -3707 4099 9854 11052 6790 -399 -7711 -11100 -9408 -3088 4652 9966 10643 6364 -1020
2835 -1020 -7969 -11116 -8712 -2412 5043 10129 10457 5876 -1655 -8053 -10928 -8268 -1838 5488 10312
2850 10312 10150 5242 -2379 -8636 -10580 -7849 -1310 6065 10405 9893 4442 -2691 -9028 -10704 -7266
$$ packed form
2745E317q462p243k065L940P781Q289M534j210o109q464o687j853M247P935P789
2760G739M372j626o515q267o427j187M618P794P760L750k011o631q487n641p03
2775a1462M615Q079P245L281k337o644q192n526k86N086P930P213K828l010o948
2790A872p903n156N02M976Q006P023K269k804p511p630m933O74N797P670O601
2805I453K107l595p321p486m255J055N703P788O381J298l658p475p277l880J492
2820i670N963P806N755J198m262p189p312l389J692O320P740N314O77m279p384
2835a020o949l147K404O300P455N086L28m581p531o398k875K660O430P326M824
2850A0312j62m908p621o257j944K731O539P375M340n12n451p133o337j676L438
$$ plain form
2865 -7266 -539 6438 10380 9377 3872 -3230 -8842 -10429 -6808 45 6770 10482 8885 3261 -3867
2880 -3867 -9153 -10380 -6237 482 7353 10320 8656 2757 -4415 -9403 -9814 -5559 1137 7600 10104
2895 10104 8044 2132 -4887 -9642 -9507 -4948 1929 7839 10021 7538 1234 -5321 -9504 -9373 -4604
2910 -4604 2508 7923 10037 7091 937 -5610 -9560 -8906 -3850 2764 8375 9695 6684 361 -6146
2925 -6146 -9614 -8390 -3358 3333 8617 9685 6210 -294 -6639 -9726 -8134 -2804 3760 8656 9443
2940 9443 5479 -859 -6798 -9535 -7823 -2175 4420 8885 9058 5027 -1347 -6850 -9541 -7280 -1628
2955 -1628 4672 8770 8657 4560 -2141 -7419 -9164 -6840 -975 5129 9004 8447 3963 -2249 -7623
2970 -7623 -9194 -6200 -705 5372 9029 7926 3528 -2925 -7791 -8906 -5906 67 5711 8760 7720
$$ packed form
2865g266O727O977L942j003n505p102n612j587L621O853O725L712j597n624p128
2880c867n286j227M143O719O871K967j664n899p172m988m11M255O696O463K504
2895A0104k060n912p019m755J35M559O877N910K182k483o304o555m183J31M769
2910d604P112N415K114k946o154o547l950O54N056O614N611J320l011o323o507
2925f146l468J224N032O691N284J068l475o504o345l087J592N330O564M896P87
2940I443l964o338n939k737J712N648O595M465J73m031o374n503k691K261N652
2955a628O300M098j13m097o701n278j745K324N865O104L875n57m484o212n374
2970g623j571K994N495O077L657j103m398o453m866j115L000N973N644L049j040
$$ plain form
2985 7720 3030 -3239 -7902 -8610 -5450 590 6235 8888 7426 2233 -3739 -8051 -8513 -4969 874
3000 874 6301 8798 7213 1928 -4004 -8131 -8459 -4474 1406 6655 8778 6662 1371 -4422 -8136
3015 -8136 -7979 -4203 1815 6798 8628 6279 973 -4841 -8257 -7592 -3581 2260 7059 8339 5599
3030 5599 462 -5176 -8270 -7474 -3104 2902 7206 8122 5343 -174 -5430 -8364 -7139 -2644 3109
3045 3109 7503 7977 4768 -570 -5692 -8208 -6672 -1961 3663 7579 7792 4506 -1090 -6124 -8304
3060 -8304 -6543 -1678 3877 7728 7587 4056 -1583 -6338 -8032 -5902 -935 4311 7646 7526 3446
3075 3446 -2019 -6568 -8019 -5656 -556 4616 7716 7144 3245 -2257 -6617 -7753 -5252 -202 4873
3090 4873 7692 6741 2523 -2692 -6804 -7663 -4815 352 5174 7577 6468 2351 -3091 -6875 -7305 -4395
$$ packed form
2985G720m690o269m663p08L160O040N645K653j462n193n972m312m62L544N843
3000H74N427K497j585n285n932m127l28L985N880N249K123k116n291n793l714
3015h136J57L776O018M983J830k349n306n814l416O65M011N841M799J280k740
3030E599n137n638l094P96M370O006M304R16k779n517n256k934J225M495N753
3045C109M394M74l209n338n122k516J536M711N624L916K13l286n596n034k180
3060h304J761M865N555L851j41l531n639m755j694K130M967N246L335j20m080
3075C446n465m549j451K363N100N172L100n72l899n502m360j136K501N050N075
3090D873K819r51m218n215m112q59K848N167M822K403j109m117n442l784m30K910
$$ plain form
3106 -4395 802 5450 7596 6125 1691 -3469 -6964 -7107 -3888 1280 5783 7409 5800 1205 -3744
3121 -3744 -6918 -7088 -3555 1697 5952 7461 5502 798 -4107 -7057 -6584 -3073 1930 6160 7301
3136 7301 5119 542 -4401 -7254 -6584 -2842 2218 6265 7082 4634 74 -4463 -7144 -6114 -2186
3151 -2186 2651 6289 7103 4324 -458 -5034 -6877 -5965 -2050 2781 6393 6881 3932 -783 -5086 -6910
3167 -6910 -5801 -1629 3220 6389 6516 3623 -1100 -5352 -6889 -5229 -1223 3389 6529 6657 3275
3182 3275 -1365 -5298 -6824 -4981 -780 3802 6736 6221 2955 -1785 -5564 -6712 -4704 -378 3984
3197 3984 6528 5783 2519 -2142 -5533 -6564 -4194 -77 4360 6585 5767 2151 -2769 -5955 -6375 -4196
3213 -4196 341 4582 6552 5470 1697 -2842 -5946 -6107 -3546 651 4807 6325 5000 1373 -3111
$$ packed form
3106d395N197M648K146j471m434n160l495j43L219N168M503J626j609m595m949
3121c744l174j70L533N252M255J509j959m704m905k950M73L511N003M230J141
3136G301k182m577m943k853O70L742N060M047Q17k448m560m537k681J030L928
3151b186M837L638Q14k779m782m576j843R12L915M831L612M88k949m715m303j824
3167f910J109M172M849L169J27k893m723m252j537J660M006M612L140J28l382
3182C275m640l933j526J843M201M582K934n15l266m740l779j148K008M326M362
3197C984K544p45l264m661l391j031K370M117M437K225q18l616m920l186m20K179
3213d196M537M241J970j082l773m539l104j61K561M197M156J518j325l627m484
$$ plain form
3228 -3111 -5986 -5973 -3120 1085 4824 6474 4709 1000 -3307 -5974 -5806 -2967 1424 5073 6404 4624
3244 4624 478 -3664 -6116 -5648 -2617 1805 5220 6247 4392 153 -3884 -6065 -5307 -2210 2133
3259 2133 5198 6173 3895 -178 -4054 -6218 -5246 -1983 2196 5451 5875 3651 -319 -4118 -6023 -5062
3275 -5062 -1669 2780 5461 5709 3289 -673 -4383 -5797 -4771 -1308 3022 5612 5514 2937 -997 -4605
3291 -4605 -5903 -4413 -793 3075 5571 5351 2716 -1299 -4592 -5849 -4136 -366 3335 5795 5139
3306 5139 2324 -1643 -4762 -5732 -3821 -35 3465 5565 5026 1955 -1853 -4974 -5516 -3584 -101 3771
3322 3771 5675 4656 1671 -2308 -5081 -5548 -3297 459 3899 5597 4446 1458 -2457 -5068 -5055 -3125
3338 -3125 775 4119 5436 4248 1056 -2649 -5222 -5129 -2669 1099 4298 5329 4174 651 -3052
$$ packed form
3228c111k875J3K853M205L739J650j765l709m307k667J68K839M391L649J331j780
3244D624m146m142k452M68L031M422L415J027j855m239m037k181P58L097M343
3259B133L065R75k278m073l876k164R72L263M179L255M24k224l970l799j905R61
3275e062L393M449K681K48k420l962l710j414J026L463M330K590r8k577l934l608
3291d605j298J490L620L868K496k20k635m015l293j257J713L770L701K460o56
3306E139k815l967l119r70J911L786L500K100n39l071l808l121n42J932L483L872
3322C771J904j019k985l979k773m67K251L756L440J698j151k988l915k611J3J930
3338c125L900L344J317j188l192l705k573R3K460L768L199J031j155l523l703
$$ plain form
3353 -3052 -5086 -4879 -2428 1340 4454 5306 3989 500 -3012 -5196 -4672 -2151 1495 4430 5359 3441
3369 3441 100 -3324 -5076 -4424 -1725 1953 4596 5112 3193 -274 -3468 -5118 -4355 -1415 2043 4632
3385 4632 5047 3100 -377 -3633 -5205 -4129 -1244 2405 4708 4804 2693 -753 -3692 -5135 -3776 -894
3401 -894 2564 4738 4714 2427 -1060 -3921 -4755 -3594 -566 2662 4741 4449 2038 -1329 -4056 -4919
3417 -4919 -3362 -209 2902 4588 4252 1739 -1654 -4086 -4876 -3078 -23 3231 4750 4178 1501 -1778
3433 -1778 -4212 -4775 -2770 182 3075 4602 4002 1279 -1835 -4112 -4519 -2592 496 3543 4715 3738
3449 3738 990 -2232 -4408 -4110 -2266 791 3506 4523 3298 761 -2323 -4434 -4213 -2111 995
3464 995 3689 4580 3313 491 -2557 -4326 -3967 -1842 1315 3790 4334 3042 231 -2841 -4357 -3911
$$ packed form
3353c052k034K07K451L768L114Q52j317l489l512k184N24K521L646K935R29j918
3369C441l341l424j752O52K699L678K643N16j919l467l194j650P63K940L458K589
3385D632M15j947l477l256j572J076K885L649K303R6k111l446k939j443J359K882
3401h94L458K174k4k287l487k861q34J161L028L228K079k92k411l367k727q63
3417d919J557L153L111J686l36k513l393k432p90J798L055L254J519n72k677l279
3433a778k434n63K005K952K893J527o00k723l114k277m07J927L088L047J172r77
3449C738k748l222k176K98J844L057K715J017j225k537l084k111K21K102L106
3464I95K694Q91j267k822l048j769L59K125L157K475N44j292k811l072j516M46
$$ plain form
3480 -3911 -1465 1419 3885 4492 2840 -118 -2909 -4247 -3625 -1180 1720 3807 4089 2556 -300 -3072
3496 -3072 -4237 -3436 -1010 2027 3965 4015 2195 -671 -3246 -4127 -3109 -815 2313 4084 4137 2161
3512 2161 -734 -3309 -4069 -3104 -380 2235 3991 3730 1800 -1130 -3389 -4070 -2877 -392 2380 3931
3528 3931 3540 1227 -1353 -3480 -3946 -2586 -116 2602 4054 3400 1183 -1509 -3596 -3710 -2252 306
3544 306 2774 3902 3272 1139 -1769 -3464 -3860 -2281 475 2934 4030 3187 805 -1771 -3599 -3748
3560 -3748 -2049 638 2842 3735 2861 732 -1964 -3615 -3468 -1860 729 3148 3777 2730 380 -2157
3576 -2157 -3715 -3391 -1639 1013 3196 3748 2754 163 -2289 -3664 -3386 -1600 1342 3290 3612 2484
3592 2484 -55 -2510 -3573 -3166 -1113 1465 3146 3544 2126 -333 -2393 -3702 -2872 -904 1532 3390
$$ packed form
3480c911K446K884K466O07j652k958k791j338O22K445K900K087K82j533k856k772
3496c072j165Q01K426L037J938N0j820k866k575q81J018K294L128J771N3j976
3512B161k895k575p60R65K724K615J756k61j930k930k259o81J193K485K772J551
3528C931l91k313k580k127m66J360K470K718J452o54k217k692k087j14J458K558
3544C06K468J128o30k133k908j695l96J579K756K459J096q43k382k576j828j49
3560c748J699K687K204Q93q74k129k696j651J47J608K589K419O29j047k350k537
3576b157j558L24J752K652K183N52r94k591k452j375K78J786K942J948L22j128
3592B484k539k455j063M07K053K578J681L98j418k459k060j309Q30J968K436J858
$$ plain form
3608 3390 3416 1937 -421 -2699 -3622 -2862 -578 1809 3266 3483 1884 -787 -2710 -3727 -2737 -378
3624 -378 2017 3427 3189 1660 -845 -2932 -3424 -2485 -139 2072 3271 3025 1330 -1112 -2972 -3438
3640 -3438 -2362 49 2100 3405 3024 1227 -1329 -3045 -3388 -2193 296 2386 3492 2911 923 -1382
3656 -1382 -3150 -3231 -1884 565 2531 3307 2823 694 -1594 -3040 -3213 -1974 556 2603 3454 2420
3672 2420 475 -1734 -3131 -3206 -1532 757 2641 3308 2292 344 -1788 -3038 -2940 -1306 791 2580
3688 2580 3091 2000 122 -2002 -3171 -2746 -1255 1027 2851 3044 1998 -123 -2011 -2951 -2691 -861
3704 -861 1233 2813 2966 1759 -293 -2059 -3190 -2778 -828 1255 2766 2865 1523 -447 -2309 -2985
3720 -2985 -2409 -498 1466 2942 2956 1511 -450 -2351 -2982 -2241 -311 1646 2845 2841 1348 -787 -2340
$$ packed form
3608C390K6j479k358k278r23P60K284K387J457K17j599k671j923j017R90K359
3624c78K395J410k38j529k505k087m92R39K346K211J199k46j695k442j860m66
3640c438J076K411K051J305l81j797k556j716l43J195K489K090J106n81j988k305
3656a382j768q1J347K449J966P76m84k129k288j446j73J239K530K047Q51j034
3672B420j945k209j397p5J674K289J884O67j016j948k132j250R8J634K097J789
3688B580N11j091j878k124j169M25J491K282J824J93j046k121j888r40K60J830
3704h61K094J580J53j207k052j766j131M12J950K083J511R9j342j970j862o76
3720b985N76J911J964J476J4j445j961j901o31P41J930J957J199mj493k135j553
$$ plain form
3737 -2340 -2868 -2257 -174 1667 2737 2625 1148 -879 -2432 -2770 -2042 -147 1927 2887 2576 951 -1051
3754 -1051 -2636 -2846 -1690 132 2167 2812 2480 637 -1202 -2515 -2651 -1561 302 2115 2854 2312
3770 2312 802 -1295 -2536 -2704 -1577 313 2118 2756 2136 442 -1454 -2544 -2468 -1307 591 2115
3786 2115 2799 1965 285 -1448 -2527 -2491 -1294 589 2114 2501 1818 269 -1712 -2569 -2599 -956 823
3803 823 2153 2630 1928 56 -1762 -2796 -2170 -899 1160 2431 2446 1548 32 -1712 -2766 -2187 -631
3820 -631 1146 2436 2437 1379 -470 -1902 -2572 -2129 -470 1190 2395 2428 1247 -476 -1933 -2468 -1910
3837 -1910 -272 1241 2236 2400 1312 -619 -2025 -2484 -1755 -253 1387 2244 2197 1044 -639 -2168 -2388
3854 -2388 -1684 -226 1497 2478 2078 868 -737 -2097 -2393 -1444 -65 1597 2398 1951 837 -1133 -2035
$$ packed form
3737b340n28O11K083J841J070j12j477k027j553l38P28J895K074R60l11j625k002
3754a051j585k10J156J822K035O45l32j843j839j313j36J090J863J813P39n42
3770B312j510k097j241j68J127J890J805O38o20j694j896j090P6J161J898J524
3786B115O84q34j680j733j079L6J197J883J525L87o83j549j981q57l0J643J779
3803H23J330M77p02j872j818j034O26J271K059J271J5q98j516j744j054N79J556
3820f31J777J290Jj058j849j432o70M43J659J660J205L3j181j723j457n35N58
3837a910J638J513R95J64j088j931j406m59P29J502J640Q57m7j153j683j529k20
3854b388P04J458J723R81m00j210j605j360k96R49J379J662Q01m47j114j970r02
$$ plain form
3871 -2035 -2268 -1445 110 1742 2260 1854 606 -1019 -1995 -2262 -1372 230 1649 2472 1897 284 -1016
3888 -1016 -2132 -2210 -1111 471 1924 2247 1584 447 -1399 -2229 -2214 -1114 499 1893 2419 1559 -44
3905 -44 -1413 -2124 -1888 -870 693 1888 2259 1543 -11 -1383 -2210 -1919 -604 835 2198 2129 1215 -67
3923 -67 -1612 -2265 -1772 -602 933 2016 1988 1229 -385 -1508 -2154 -1765 -541 1232 1931 1925 988 -521
3941 -521 -1716 -2114 -1552 -161 1345 2060 1884 930 -679 -1745 -2033 -1398 -309 1223 2180 1989 628
3958 628 -476 -1719 -2014 -1386 -72 1366 2036 1880 752 -653 -1716 -1979 -1272 6 1347 2066 1650
3975 1650 670 -852 -1820 -2094 -1101 208 1549 1954 1806 574 -956 -1927 -1831 -1119 250 1677 2040 1565
3993 1565 443 -966 -1648 -1688 -804 454 1499 1930 1288 90 -1090 -1933 -1747 -801 425 1483 1940
$$ packed form
3871b035k33Q23J555J632N18m06j248j625r76k67Q90J602J419Q23n75j613j300
3888a016j116p8J099J582J453L23o63j137j846q30J5J100J613J394N26q60j603
3905d4j369p11K36J018J563J195L71p16j554j372q27K91J315J439J363o9r14j282
3923f7j545o53M93J170J535J083k8p59j614j123o46L89J224J773O99or37j509
3941e21j195l98N62J391J506P15j76r54j609j066k88O35J089J532R57j91j361
3958F28j104j243k95O28J314J438O70j56j128j405j063k63P07J278J341P19m16
3975A650r80j522r68k74R93J309J341M05j48j232j530r71R6P12J369J427L63m75
3993A565j122j409o82m0Q84J258J045M31o42j198j180q43J86R46J226J058M57
$$ plain form
4010 1940 1324 105 -1155 -1987 -1700 -703 474 1516 1899 1160 -39 -1187 -1804 -1521 -640 710 1645
4027 1645 1888 1153 -206 -1386 -1854 -1352 -436 845 1607 1868 1001 -178 -1399 -1981 -1416 -264 783
4044 783 1777 1563 919 -253 -1472 -1799 -1347 -247 1047 1754 1728 789 -529 -1381 -1617 -1113 -39 948
4062 948 1619 1408 573 -436 -1478 -1783 -1280 218 1244 1730 1488 563 -513 -1544 -1605 -973 211 1320
4080 1320 1606 1399 381 -613 -1528 -1533 -853 250 1326 1701 1211 405 -835 -1583 -1602 -739 181 1157 1655
4099 1655 1251 302 -889 -1514 -1468 -749 309 1242 1533 1216 211 -1005 -1445 -1432 -399 560 1383 1425 1030
4118 1030 90 -873 -1459 -1432 -409 590 1376 1540 945 -91 -936 -1443 -1407 -350 572 1498 1388 875 -46
4137 -46 -1032 -1594 -1262 -248 665 1346 1364 895 -295 -1293 -1577 -1006 -304 744 1331 1274 764 -306 -1126 -1531
$$ packed form
4010A940o16j219j260q32K87R97J177J042L83p39j199j148o17K83Q81J350R35
4027A645K43p35j359j180m68N02R16J281P62K61q67j179j221n82N65J152J047
4044G83R94k14o44j172j219l27M52J100J294P07k6r39j318q52k36N04J074R87
4062I48O71k11q35j009j042l05N03J498J026M86k42r25j076j031o1O32J184J109
4080A320K86k07j018r94r15nO80J103J076L75m90q06j240p48j9Q63R20R76M98
4099A655m04r49j191o25M6P19J058R33K91l17j005j216m40J3J033R59Q23M2l95
4118A030r40r63n86K7J023R99P86J64n95j036q45n07L6J057R22R26j10n13r21
4137d6r86n62L32J014R13O81J8m69j190r98k84N71P02J048N87n7n10j070q20m05
$$ plain form
4157 -1531 -1132 46 857 1422 1242 689 -362 -1230 -1563 -802 29 871 1443 1348 402 -454 -1219 -1368 -770
4176 -770 74 880 1468 995 465 -443 -1222 -1305 -757 54 924 1475 976 338 -701 -1242 -1310 -707 46 1018
4196 1018 1437 999 215 -646 -1300 -1258 -587 383 1012 1254 977 223 -836 -1124 -1209 -572 283 990 1295 845
4216 845 118 -786 -1244 -1078 -442 332 959 1161 764 -190 -784 -1329 -1146 -368 281 1129 1143 886 -16 -973
4236 -973 -1225 -1109 -246 425 981 1240 582 -255 -854 -1112 -775 -254 550 1190 1008 661 -281 -761 -1204 -830
4256 -830 -58 753 1161 923 498 -254 -883 -1433 -875 -148 788 1165 1152 439 -312 -1115 -1125 -710 29 879 1150
4277 1150 950 257 -176 -1041 -1144 -668 11 751 1171 1009 185 -517 -892 -1156 -602 150 691 1102 1013 338
4297 338 -522 -823 -998 -454 178 882 1096 941 234 -359 -1078 -842 -477 409 963 1024 758 54 -728 -900
$$ packed form
4157a531L99J178Q11N65j80n53j051q68l33P61Q31Q42N72r5r46q56p65j49N98
4176g70Q44Q06N88m73n30r08p79q3N48Q11Q70N51m99o38j039n41o8O03P53R72
4196A018M19m38p84q61o54M2O71R70O29K42k77p54j059k88q5O37Q55P07L05m50
4216H45p27r04m58J66O36P74O27K02l97r54n94n45J83P78O49Q48J4k57r02r57
4236i73k52J16Q63O71N56K59o58q37n99k58L37N21Q04O40j82l47r42m80m43L74
4256h30P72Q11M08k38m25p52o29n50N58P27R36L77j3p13p51q03j0M15P39Q50K71
4277A150k00o93m33q65j03M76O79P40M20j62q24p02l75k64N54P52N41M11q9o75
4297C38q60l01j75N44O32P04K14j55p07n93p19K36L65Q86N54O1k66p04p82j72
$$ plain form
4317 -900 -860 -485 298 839 1181 772 50 -563 -1132 -877 -429 299 855 986 516 -64 -681 -1144 -837 -383
4337 -383 292 842 927 588 -128 -713 -1065 -963 -310 462 1002 920 441 -293 -654 -698 -929 -255 524 845 820
4358 820 408 -283 -619 -940 -662 -80 511 832 915 357 -336 -695 -1052 -560 50 552 982 973 242 -156 -886
4379 -886 -957 -582 28 551 762 834 372 -221 -744 -810 -471 55 625 739 797 343 -429 -863 -901 -403 11 731
4401 731 721 817 94 -655 -744 -880 -458 229 604 932 604 151 -465 -894 -772 -327 277 785 830 625 5
4422 5 -515 -742 -787 -406 268 735 829 427 37 -398 -945 -650 -158 236 615 812 438 -215 -469 -816 -741 -230
4444 -230 339 631 680 335 -43 -583 -880 -681 -110 398 797 903 522 -67 -695 -634 -503 -158 474 684 741
4465 741 455 -239 -435 -667 -478 -185 484 721 631 428 -138 -645 -749 -454 136 570 735 614 157 -229
$$ packed form
4317i00M0L75P83N41L42m09p22o13n69K55M48P28N56J31m70n80o17m63L07M54
4337c83O75N50Q5l39p16n85l52J02O53P72N40q2m79p34l61m4k31O74P79L21k5
4358H20m12o91l36l21K78N82N91L21Q3n58o93l59l57M92O10N02M30rp31l98p30
4379h86p1L75O10N23K11P2m62n93n23o6L39N26N70J14N8m54p72m34l8M98M14P20
4401G31j0R6p23p49q9j36M22O87L75L28l28m53o16m29J22M45O04N08M5k05o20
4422En20k27m5L81O74M67R4m02l90m35n47K95M92L94L79J97l74o53k54l47P5N11
4444b30N69K92M9l45l78n40k97J99N71N08L99J06l81n89o28O1J31L45O32K10N7
4465G41k86o94j96k32J89K93O69K37r0k03n66n07j04K95N90M34J65j21m57l86
$$ plain form
4485 -229 -554 -730 -417 61 432 687 534 145 -243 -479 -712 -316 161 427 668 388 193 -387 -484 -511 -256
4506 -256 314 514 610 395 121 -359 -769 -664 -118 101 628 707 382 -24 -265 -503 -577 -70 96 378 632
4527 632 441 41 -335 -596 -541 -209 197 468 755 392 -212 -463 -479 -526 -113 358 578 562 246 -173 -490
4548 -490 -627 -486 -13 375 590 504 435 -68 -418 -705 -358 -185 266 629 649 105 -192 -490 -411 -374 -47 459
4570 459 449 370 180 -18 -532 -439 -406 21 481 600 608 334 -300 -439 -576 -297 -25 324 556 397 304 -260
4592 -260 -497 -422 -143 290 383 411 427 163 -213 -574 -583 -147 305 498 560 335 57 -343 -481 -370 -245 67
4614 67 559 377 289 -55 -363 -549 -310 -140 220 595 490 504 -69 -350 -508 -497 -244 312 454 445 188 -275
4636 -275 -384 -399 -338 -83 396 576 490 275 -88 -479 -424 -278 -112 404 599 361 281 -299 -402 -427 -443 94
$$ packed form
4485b29l25j76L13M78L71K55j53l89l88k36k33L96M77K66K41k80j95n80r7k7K55
4506b56N70K00R6k15k74m80m10J05N46K19N27P9l25m06k41k38p4N07J66K82K54
4527F32j91m00l76k61N5L32M06K71K87l63o04k51j6m7M13M71K20j6l16m19l17
4548d90j37J41M73L88K15q6o9n03l50k87L47J73M51L63K0n44k97k98P9L7L27N06
4570D59j0p9j90j98n14R3L3M27M60J19Qk74o34j39j37K79K72L49K32j59r3n64
4592b60k37P5K79M33R3K8J6k64l76l61rM36M52J93O2k25k78m00j38J11J25L12
4614F7M92j82q8l44l08j86K39J70L60L75j05J4n73k81j58J1K53N56J42rk57m63
4636b75j09j5O1K55M79J80q6k15l63l91N5J46J66N16J95k38q0n80j03k5j6N37
$$ plain form
4658 94 300 353 491 276 -235 -444 -340 -250 17 237 551 379 98 -312 -570 -561 -201 -7 297 460 400 -12
4680 -12 -210 -455 -435 -255 56 381 515 313 77 -259 -406 -529 -38 123 410 485 265 104 -291 -494 -437
4701 -437 -125 238 502 380 108 -222 -403 -623 -386 -208 95 322 308 158 -37 -289 -393 -450 -3 293 239
4722 239 442 209 -96 -342 -358 -288 59 302 494 258 148 -208 -365 -424 -291 63 320 375 412 238 -249 -291
4744 -291 -446 -330 -98 146 488 338 -14 -312 -376 -429 -413 183 165 273 295 -33 -224 -334 -454 -5 199 299
4766 299 474 166 226 -266 -494 -247 -136 209 454 256 306 -104 -279 -357 -209 -87 272 404 315 103 23 -285
4788 -285 -470 -264 -71 190 222 367 163 67 -379 -339 -239 -218 89 355 205 165 24 -227 -616 -344 71 231
4810 231 415 553 93 -178 -268 -358 -249 129 146 483 428 61 -217 -329 -371 -247 159 346 380 335 219 -145
$$ packed form
4658I4K06N3J38k15n11k09J04R0K67K20L14j72k81m10k58RL60J94L04J63o0m12
4680a2j98k45K0J80L11L25J34k02k36l36j47j23M91J61K87P5k20j61l95k03N7
4701d37L12L63K64j22k72l30j81k20K37J78L03K27j4j50j95k52j04n7M47K96n4
4722B39K03k33l05k46j6P0L47K43J92k36j10l56j57n9J33L54K57N5L7j74m87m2
4744b91j55J16K32K44L42j50l52k98o4n3J6N96j8J08K2l28j91j10j20M49K04J00
4766B99J75l08O0m92k28K47J11L45K45j98N0m10j75p8J48J22L59J32q9k12q0l08
4788b85j85K06J93K61L2J45k04r6m46M0J00K1L07K66j50m0j41k51l89K72M15J60
4810B31J84J38m60k71r0r0J09L78J7L37n5l67k78j12m2J24M06J87L4m5j16l64
$$ plain form
4832 -145 -369 -328 -2 -58 272 428 194 -30 -241 -397 -237 -128 147 541 416 242 23 -332 -471 -209 -181
4853 -181 318 111 274 192 -95 -236 -277 -332 -314 167 421 372 192 -81 -291 -311 -362 -78 66 406 307 211 -188
4876 -188 -224 -485 -231 -28 320 352 477 175 -117 -284 -503 -170 -251 296 457 118 70 -202 -386 -421 -209 39
4898 39 301 475 271 158 -69 -246 -204 -338 40 314 397 324 38 -77 -502 -268 -247 72 182 302 285 -125
4920 -125 -167 -267 -228 -161 -17 262 261 97 22 -274 -363 -340 -11 151 347 181 244 -29 -214 -325 -320 -135 14 385
4944 385 387 231 122 -140 -414 -316 16 214 297 329 117 -163 -353 -477 -378 -71 32 235 347 185 -51 -125
4966 -125 -236 -252 83 158 266 266 207 -70 -326 -385 -256 -3 375 216 344 146 -38 -339 -363 -179 146 448
4988 448 360 219 138 -275 -330 -223 -242 117 301 541 237 64 -232 -219 -368 -204 6 139 226 314 -175 -240 -277
$$ packed form
4832a45k24M1L26n6L30J56k34k24k11j56J60J09K75L94j25j74k19l55j39K62K8
4853a81M99k07J63q2k87j41m1n5J8M81K54m9j80k73k10k0n1K84J44L40r9r6l99
4876a88l6k61K54K03L48L2J25l02k92j67k19L33q1N47J61l39m8k72j84l5K12K48
4898C9K62J74k04j13k27j77M2j34L78K74Q3p3k86j15m25K34K1L19J10J20j7m10
4920a25m2j00L9O7J44K79jj64p5k96q9K3L29J62J96j66O3k73j85j11NJ85J49L71
4944C85Kj56j09k62k74R8L32J98Q3L2k12k80j90j24R9L07J03K03J12j62k36p4
4966a25j11j6L35P5J08%n9k77k56n9J29K53L78j59J28j98j84l01k4J84L25L02
4988D48q8j41q1m13n5J07j9L59J84K40l04j73k96J3j49J64K10J33Q7Q8m89o5l7
$$ plain form
5011 -277 -394 -30 162 123 254 146 -40 -161 -223 -350 -263 238 249 313 99 5 -258 -306 -134 -23 -15 280 368
5034 368 269 -119 -288 -279 -438 -63 168 455 339 221 12 -384 -292 -414 -55 121 218 199 -51 18 -280 -367 -151
5057 -151 8 297 209 383 2 -32 -378 -309 -310 89 275 291 203 181 -100 -242 -307 -29 58 266 361 299 100 -315
5081 -315 -404 -227 -280 -6 432 282 250 66 -130 -299 -259 -118 57 176 454 213 79 -168 -443 -329 -155
5102 -155 134 281 387 284 12 -350 -367 -370 -30 138 219 286 103 -193 -234 -257 -325 140 278 314 377 105 -52
5125 -52 -297 -333 -332 17 260 329 370 389 -165 -235 -168 -146 -47 150 326 459 213 -158 -321 -421 -241 -127 253 445
5149 445 359 18 -53 -171 -199 -110 -25 245 366 537 95 -20 -188 -462 -72 14 211 280 34 150 -351 -199
5171 -199 -352 -97 89 327 478 250 168 -360 -388 -246 -153 -8 309 433 366 -122 -152 -362 -263 -189 194 243 428
$$ packed form
5011b77j17L64J92l9J31j08j86j21o2j27Q7N01J1O4k14r4k63m8J72J11QK95Q8
5034C68r9l88j69Rj59L75K31K87j16j18k09l96R2j22L59J76R7j9k50O9k98q7K16
5057a51J59K89q8J74l81l4l46O9jL99J86J6q8k2k81j42o5K78Q7K08R5o2j99m15
5081c15q9J77n3K74M38j50l2j84j96j69M0J41J75J19K78k41j34k47k75J14J74
5102a55K89J47J06j03k72l62j7lL40J68Q1O7j83k96m1k3o8M65J38L6O3k72j57
5125e2k45l6JL49K43O9M1J9n54p0O7K2R9J97J76J33k46l71j63j00J80J14L80J92
5149D45q6l41p1j18k8Q9Q5K70J21J71m42j15j68k74L90Q6J97O9k46J16n01J52
5171a99j53K55J86K38J51k28q2n28k8J42R3J45L17J24o7m88l0k10R9P4L83M9J85
$$ plain form
5194 428 219 64 -152 -280 -404 65 276 329 221 287 12 -368 -243 -382 -68 53 326 458 174 40 -194
5215 -194 -381 -425 -213 44 248 258 123 201 -196 -350 -307 10 257 243 541 251 -107 -361 -520 -332 -46 274
5237 274 390 247 253 -90 -275 -268 -380 -30 289 353 481 219 -140 -396 -246 -226 65 255 455 404 183 135 -286
5260 -286 -575 -244 -53 225 399 302 247 -138 -335 -381 -172 50 233 297 415 27 -199 -393 -206 -211 136 250
5282 250 346 246 70 -106 -464 -344 25 154 295 213 392 140 -134 -308 -322 -203 73 373 446 223 141 -267
5304 -267 -261 -355 -245 235 530 350 270 21 -345 -481 -358 -173 65 258 288 166 5 -237 -338 -305 -235 136
5326 136 349 413 160 51 -187 -398 -255 -56 151 358 268 351 60 -319 -361 -358 -108 116 479 332 175 -192
5348 -192 -281 -417 -336 -16 123 530 272 37 -65 -301 -283 -188 213 319 238 390 248 -26 -322 -392 -343 -55
$$ packed form
5194D28k09j55k16j28j24M69K11N3j08O6k75l80J25j39L14J21K73J32k84j34k34
5215a94j87m4K12K57K04J0j35P8l97j54M3L17K47j4K98k90l58k54j59J88K86L20
5237B74J16j43Ol43j85Pj12L50L19O4J28k62l59k56J50K0K91J90K00n1k21m8m21
5260b86k89L31J91K78J74r7n5l85j97m6K09K22J83O4J18l88k26j94J87nL47J14
5282B50R6j00j76j76l58J20L69J29J41q2J79k52k74j74j4J19K76L00P3k23q2m08
5304b67Or4J10M80K95j80q0k49l66j36J23J85K38J93L0j22j61k42j01L3P0L71
5326A36K13O4k53j09k38k11J43J99K07K07r0Q3k91l79m2LK50K24L63j47j57l67
5348a92q9j36Q1L20J39M07k58k35j02k36J8R5M01J06q1J52j42k74k96p0M9K88
$$ plain form
5370 -55 376 391 373 123 -77 -204 -393 -192 -55 458 405 155 47 -177 -437 -448 -160 243 307 316 424 -1 -315
5393 -315 -541 -260 -212 -27 380 344 228 40 -149 -426 -548 -314 10 391 289 303 17 -276 -302 -384 -302 45
5415 45 326 361 453 -197 -273 -349 -372 -68 44 238 400 146 -9 -205 -322 -279 -130 141 305 381 142 129 -185
5438 -185 -250 -247 -125 219 442 284 355 -97 -426 -161 -380 97 233 333 453 191 -113 -338 -241 -263 -124 355
5460 355 240 413 71 -248 -516 -424 -245 -55 141 303 274 261 38 -180 -274 -231 -25 177 419 251 89 -69
5482 -69 -353 -582 -203 -55 248 410 365 121 -248 -276 -401 -5 61 362 400 309 65 -221 -474 -257 111 177
5504 177 243 399 229 -52 -173 -501 -245 -179 133 395 409 260 -94 -245 -306 -356 -136 43 370 423 143 40
5526 40 -275 -345 -315 -195 98 291 431 270 55 -112 -435 -149 -147 191 353 349 165 -140 -219 -490 -437 -212 205
$$ packed form
5370e5M31J5j8k50k00j27j89K01J37N13n3k50j08k24k60j1K88M03O4RJ08m25l14
5393c15k26K81M8J85M07l6j16j88j89k77j22K34L24L81j02J4k86k93k6q2Q2L47
5415D5K81L5R2o50p6p6k3L04J12J94J62k54j55j96j17M3J49K71J64P6k39j3l14
5438a85o5LJ22L44K23j58P1m52l29K65k19M77J36J00J20k62l04k25R7k2J39M79
5460C55j15J73l42l19k68R2J79J90J96J62k9j3k23k18r4M3K06K02K42j68j62j58
5482f9k84k29L79J48L03J62m5k44l69k8j25L96O6L01L8r1k44k86k53K17L68O6
5504A77O6J56j70k81j21l28K56O6L12K62J4j49l54j51o1n0K20J79L27N3k80j03
5526D0l15p0L0J20K93J93J40j61k15j67l23K86KL38J62mj84l05p9k71N3K25M17
$$ plain form
5549 205 305 475 349 -136 -276 -394 -340 -121 17 486 277 281 -66 -256 -333 -343 -144 61 420 460 115 -152
5571 -152 -201 -457 -187 81 219 277 291 141 -262 -306 -331 -265 16 303 323 211 76 -62 -246 -348 -108 150
5593 150 530 486 196 101 10 -351 -358 -139 90 254 475 401 145 -268 -244 -497 -235 64 300 325 365 100 -182
5616 -182 -396 -389 -110 192 347 427 290 74 -138 -391 -330 -202 71 257 262 148 -65 -184 -278 -304 -177 66 294
5639 294 440 213 -73 -200 -411 -215 -58 231 280 386 262 -193 -216 -401 -271 -57 330 456 334 176 -59
5660 -59 -354 -329 -235 -56 182 431 476 347 -13 -282 -312 -306 31 264 236 429 48 -183 -454 -322 -141 -37 204
5683 204 399 521 143 -142 -421 -363 -179 -59 194 377 543 36 -63 -484 -503 -384 -222 395 300 308 250 -189
5705 -189 -250 -391 -216 6 208 407 329 239 -280 -311 -453 -153 10 247 401 275 232 -190 -395 -502 -51 253
$$ packed form
5549B05J00J70j26m85j40j18N4K19J38M69k09Ml47j90p7j0J99K05L59M0l45k67
5571a52m9k56K70K68J38N8J4j50m03m4k5O6K81K87K0j12j35j38j84j02K40K58
5593A50L80m4k90r5r1l61pK19K29J64K21p4k56m13K4k53K62K99K36K5M0k65k82
5616a82k14PK79L02J55Q0j37k16k12k53O1J28K73J86Nj14k13j19r4k6J27K43K28
5639B94J46k27k86j27k11J96J57K89M9J06j24m55k3j85J30K14L87J26j22j58k35
5660e9k95K5R4J79K38K49M5j29l60k69l0OL37K33k8J93l81k31k71J32J81J04K41
5683B04J95J22l78k85k79N8J84J20K53J83J66n07r9m21j9J19J62O17r5Qn8m39
5705a89o1j41J75K22K02J99p8r0n19l1j42L00J63K37J54j26m3m22k05j07M51L04
$$ plain form
5727 253 281 408 185 -125 -230 -494 -317 -148 -15 201 404 220 -25 -320 -478 -589 -120 -34 317 357 267
5748 267 44 -80 -283 -449 -15 78 474 335 258 -63 -269 -394 -326 -67 211 389 387 313 31 -253 -264 -237 -77
5771 -77 326 317 447 125 -52 -341 -367 -225 178 101 444 414 159 9 -231 -459 -345 25 305 315 406 140 -143
5794 -143 -291 -346 -417 30 162 465 414 66 31 -331 -488 -298 58 190 376 297 100 -154 -385 -278 -281 111
5816 111 460 217 363 115 -168 -334 -366 -275 -68 236 470 258 32 -109 -453 -330 -275 261 445 485 271
5837 271 138 -144 -487 -424 -76 195 211 353 215 -67 -120 -454 -390 -364 183 314 353 257 181 -318 -366 -319 -136
5860 -136 22 281 392 305 10 -275 -447 -293 -330 157 353 256 170 38 -431 -284 -315 -73 313 264 366 157
5882 157 25 -223 -360 -383 -108 300 415 256 175 -52 -333 -427 -382 40 254 542 482 284 -99 -248 -370 -146
$$ packed form
5727B53K8J27k23l10j05k64J77J69J33K16K03j84k45k95j58j11M69Q6L51M0r0
5748B67k23j24k03j66M34R3L96j39p7l21k06j25O8K59K78J78kp4k82k84j1K7J60
5771g7M03rJ30l22j77k89k6J42M03p7L43l0k55j50k40k28J14L70K80J0R1k66k83
5794a43j48n5p1M47J32L03n1l48l5l62j57J90L56J32J86p9j97k54k31J07lL92
5816A11L49k43J46k48k83j66l2R1K07L04K34k12k26j41l44J23N5N36J84M0k14
5837B71j33k82l43O3L48K71J6J42j38k82n3l34O4K6N47J31L9r6p6m99m8M7J83
5860a36J58K59J11q7k95k85j72J54l7M87J96r7q6j32m69J47l1K42L86m9J02k09
5882A57j32k48j37k3K75M08J15j59q1k27k81r4M5M22K14K88o0j98l83j49j22K24
$$ plain form
5904 -146 -96 26 521 165 142 -25 -297 -392 -249 132 86 457 409 123 -34 -413 -293 -200 219 336 518 418
5926 418 31 -266 -289 -255 -275 137 201 362 515 258 -158 -381 -186 -409 20 382 527 189 223 -33 -254 -225
5948 -225 -260 95 237 373 293 47 -148 -336 -241 -139 -25 419 481 164 -44 -226 -487 -367 -194 152 290
5969 290 430 159 91 -28 -190 -327 22 141 343 376 246 -77 -178 -288 -431 -50 -17 375 303 222 -35 -433
5991 -433 -375 -325 -110 218 418 374 253 -128 -328 -420 -411 -169 203 434 333 189 -67 -304 -365 -293 -107 141 359
6014 359 274 220 -72 -420 -525 -274 -81 415 336 311 86 -155 -320 -341 -389 -152 289 341 485 249 -15 -282
6036 -282 -482 -215 24 197 352 363 255 -244 -251 -308 -233 89 236 516 446 -30 -51 -349 -521 -125 164 261 479
6059 479 433 27 -35 -347 -365 -192 -119 288 322 349 79 -190 -227 -395 -220 286 198 332 242 -65 -148 -227 -454 -250
$$ packed form
5904a46N0J22M95l56k3j67k72r5J43L81m6L71m8k86j57l79J20R3M19J17J82j00
5926D18l87k97k3L4k0M12O4J61J53k57m16k23J95k23M29L62J45l38L4k56k21K9
5948b25l5L55J42J36q0k46j95j88R5J02J14M44O2l17k08j82k61J20J73L46J38
5969B90J40k71o8j19j62j37L49J19K02L3j30l23j01j10j43L81L3L92p2q1k57l98
5991d33N8N0K15L28K00m4j21l81k00r2RK42L72K31j01j44k56k37o1P2J86K48K18
6014C59q5n4k92l48j05K51J93M96p9k5k25k41j65k1m8K37M41N2J44k36k64k67
6036b82k00K67K39J73J55J1j08m99pn7P5L22J47K80p0m76k1k98j72L96K89R7K18
6059D79m6m06o2l12j8J73P3M07L4K7k70k69l7j68J75N06q8J34r0l07q3p9k27K04
$$ plain form
6083 -250 -52 241 461 184 -52 -236 -307 -239 -183 -88 322 327 201 -63 -235 -338 -321 -158 199 257 427 326 -56
6106 -56 -436 -335 -414 -237 191 270 517 -24 -21 -426 -384 -398 34 242 484 374 96 -111 -355 -336 -230 -20 129
6129 129 382 300 209 52 -322 -331 -223 -29 180 435 428 78 -65 -323 -521 -89 -39 36 353 177 144 -21 -270
6152 -270 -382 -221 -205 218 346 240 207 -318 -202 -387 -186 -26 220 307 325 63 -143 -240 -423 -239 -42 176
6174 176 247 443 32 -17 -288 -448 -322 82 136 459 210 46 -193 -442 -498 -209 179 342 447 273 -19
6195 -19 -210 -411 -397 -243 132 380 341 204 83 -219 -210 -304 -124 58 175 368 262 -18 -269 -455 -439 -173
6217 -173 7 281 281 241 -42 -294 -281 -214 26 -31 380 318 267 -68 -235 -430 -209 -19 201 385 276 157 -88
6240 -88 -234 -371 -207 -96 68 378 304 225 -113 -218 -311 -99 -171 223 440 247 122 -68 -381 -514 -354 -29
$$ packed form
6083b50J98K93K20k77k36j84p1O8N6R5M10Nj26k64j72j03J7J63L57N8J70j01l82
6106e6l80J01p9J77M28P9K47n41Lm05M2j4M32K08K42j10k78k07k44J9J06K10J49
6129A29K53q2r1j57l74rJ08J94K09K55pl50j43k58j98M32N0P5L17j76l3j65k49
6152b70j12J61J6M23J28j06l3n25J16j85K01J60K46Q7J8k62k06r7j83J84J97K18
6174A76P1J96m11m9k71j60J26M04N4L23k49j64k39k49n6K89L88J63J05j74k92
6195a9j91k01J4J54L75K48l9j37j21l02Rr4J80J82J17J93j06k80k51j86J6K66
6217a73J80K74%m0k83k52J3O7K40n7M11o2n1l35j67j95K21J90K20J84j09j19k45
6240h8j46j37J64J11J64L10p4p9l38j05r3K12p2L94K17j93j25j90l13j33J60L25
$$ plain form
6262 -29 321 432 371 234 -188 -277 -378 -306 45 345 451 309 233 -36 -375 -245 -255 -99 293 387 362 33 -31
6285 -31 -345 -383 -166 50 176 229 363 94 -171 -338 -229 -56 72 234 307 467 56 -79 -249 -457 -134
6306 -134 -68 468 424 418 136 -146 -345 -328 -141 154 209 192 363 6 -157 -377 -232 -258 27 411 506 213 38
6329 38 -160 -468 -295 -125 134 247 213 436 -81 -122 -271 -291 -213 220 253 281 311 -189 -192 -422 -309 -129 267
6352 267 341 271 275 -137 -305 -307 -253 -219 209 221 430 141 -120 -448 -392 -401 84 197 199 352 172 -127 -490 -467 -161
6377 -161 -187 202 233 208 91 -105 -222 -410 -218 122 108 483 329 126 -42 -221 -341 -154 0 212 402
6398 402 272 182 -295 -179 -355 -86 -45 359 418 436 245 -212 -437 -430 -178 189 312 388 432 -37 -204 -446 -447
6421 -447 -330 43 215 339 311 129 -180 -267 -245 -154 47 284 452 239 188 -236 -281 -396 -16 83 181 337 317
$$ packed form
6262b9L50J11o1j37m22q9j01P2L51L00J06j42p6k69l39J30j0J56L92R4k5l29o4
6285c1l14l8K17K16J26N3J34k69k65j67J09J73J28J62P3J60m11j35j70k08L23
6306a34O6N36m4ok82k82j99J7J87K95N5j7J71l57j63k20J45k6K85L84R5k93j75
6329C8j98l08J73J70K59J13l4K23n17m1j49k0P8M33L3K8L0n00lk30J13J80L96
6352B67P4p0Mm12j68kN4L4M28J2K09k89k61l28N6rM85J13KJ53j80k99l63K3L06
6377a61k6L89L1k5j17j96j17j88J92L40j4L75j54k03j68j79j20J87J54K12J90
6398D02j30r0m77J16j76K69M1M04N9J8j91m57k25PK52L67J23P6M4m69j67k42j
6421d47J17L73J72J24k8j82l09q7K2R1K01K37J68k13n1m24m5j15L80R9R8J56k0
$$ plain form
6444 317 49 -243 -341 -326 -77 90 387 316 139 -3 -337 -527 -285 -59 88 229 268 130 -31 -273 -462
6465 -462 -208 -165 234 418 398 158 6 -269 -245 -256 -25 206 304 307 269 -119 -141 -284 -71 -193 57 243 293
6488 293 -4 -46 -338 -381 -361 -55 196 271 354 35 -52 -417 -296 -213 -48 104 264 319 103 -2 -155 -511 -243
6511 -243 -45 277 399 89 139 -133 -120 -379 -74 35 351 402 271 92 5 -214 -359 -167 25 221 405
6532 405 306 51 -252 -373 -152 -209 36 297 268 294 98 -200 -294 -289 -143 149 300 277 254 -196 -57 -370 -168
6555 -168 -136 -88 421 300 270 143 -162 -153 -262 -114 -72 363 375 181 -193 -178 -374 -365 -146 175 216 285 78 68
6579 68 -115 -351 -240 -167 327 273 316 196 -93 -184 -224 -225 -118 135 318 429 314 -230 -342 -229 -328 -101 218
6602 218 463 506 196 -106 -429 -364 -360 -119 224 398 376 162 -146 -205 -332 -397 -71 83 276 182 110 -82 -283
$$ packed form
6444C17k68k92r8J5K49J67K97p1j77j42l34j90K42K26J47J41L9j38j61k42j89
6465d62K54M3L99J84k0k40j52k75K4j1K31K31R8Ll8l88k2j43K13j22K50J86N0
6488B93k97m2k92m3K0L06K51P5Q3l19q7l65J21Q3J65J52J60N5k16j05j53l56K68
6511b43J98L22J22l10N0k72J3k59L05J09L16N1j31j79q7k19j45J92J92J96J84
6532D05r9k55l03j21K21n7K45K61k9K6j96k98r4NJ46K92J51k3k3m50J39l13K02
6555a68L2M8N09j21l0j27l05Rj09J48M2M35J2j94l74J5j96RK19L21M1O9k07j0
6579F8j83k36J11P3M94n4M3j20k89r1m0jJ07K53J83J11j15n44j12J13r9K27L19
6602B18K45M3l10l02l23O5MK41L43J74k2k14l08n9j27o5L26J54J93r4p2j92k01
$$ plain form
6625 -283 -287 -145 -200 111 301 214 130 -97 -415 -359 -224 -99 277 372 287 149 -240 -183 -383 -145 -58 357 436 197
6649 197 187 -229 -371 -262 -298 -87 367 412 231 132 -114 -478 -250 -146 132 253 328 227 -61 -43 -266 -401
6671 -401 -205 201 343 350 136 73 -299 -340 -632 -241 -25 168 320 240 -24 -257 -321 -188 -159 306 338 312 201
6694 201 74 -123 -316 -129 -148 352 178 297 338 103 -135 -259 -375 -159 117 357 200 257 20 -393 -242
6715 -242 -329 -111 74 374 247 201 0 -277 -460 -332 -52 102 161 243 243 -17 -285 -481 -400 83 266 279 266
6738 266 120 -102 -121 -516 -226 -194 286 348 170 87 -133 -338 -418 -154 71 96 270 126 115 -224 -299 -217 -231
6761 -231 -38 152 285 287 71 -102 -335 -234 30 -56 261 339 424 184 -89 -259 -255 -110 191 214 230 398 35
6784 35 -104 -360 -520 -92 164 238 401 231 -13 -94 -188 -291 -108 176 372 322 264 -134 -290 -415 -217 -86
$$ packed form
6625b83mJ42n5L11J90q7q4k27l18N6J35J25L76R5q5j38l89N7k00K38Q7M15P9k39
6649A97j0m16j42J09l6K11M54M5j81r9k46l64K28J04K78J21P5j01k88J8k23j35
6671d01J96M06J42Pk14o3l72m1k92L91K16J93J52q0k64k33o4J33K9M65L2k6j11
6694B01j27j97j93J87j9N00j74J19M1k35k38j24j16K16K76K40j57N7k37m13J51
6715b42q7K18J85L00j27m6k01k77j83J28K80J54N9Q2%k60k68j96Q1M83J83J3j3
6738B66j46k22j9l95K90L2M80O2j78q3k20k05q0K64K25K5J74j44j1l39p5Q2j4
6761b31J93J90J33Kk16j73k33J01K64q6L17P8Q5k40k73j70MJ45L01K3J6J68l63
6784C5j39k56j60M28K56P4J63j70k44q1r4j03J83K84J96n0n8l98j56j25J98J31
$$ plain form
6806 -86 74 387 248 281 193 -148 -310 -463 -7 162 59 415 136 -178 -394 -383 -221 -104 164 359 238
6827 238 215 -133 -320 -409 -340 115 164 232 367 21 103 -127 -362 -315 11 261 265 286 83 -144 -257 -236 -107 -123
6851 -123 113 296 216 180 -16 -283 -408 -277 99 236 196 291 74 -152 -308 -505 -328 61 156 389 353 188
6873 188 -242 -343 -432 -322 48 98 386 347 117 -178 -260 -194 -268 32 212 268 186 178 -141 -360 -375 -90 -8 238
6897 238 285 332 11 -163 -234 -247 -126 105 295 418 194 90 -172 -297 -402 -118 251 155 303 391 272 -152
6919 -152 -370 -325 -218 236 331 258 310 21 -193 -347 -309 -80 83 91 389 157 132 -216 -370 -345 -171 79 363
6942 363 355 156 -185 -314 -253 -348 -86 135 305 450 136 -57 -255 -228 -271 -175 104 300 280 110 -224 -266 -282
6965 -282 -248 -90 141 312 281 70 2 -166 -327 -257 -136 200 235 346 5 -272 -291 -227 -310 26 200 364 188
$$ packed form
6806h6J60L13j39L3q8l41j62j53M56J69j03L56k79l14k16J1J62J17K68J95j21
6827B38k3l48j87q9O9M55M9O8J35l46Q2k30k35M7L26K50MK1k03k27j13K1J29j6
6851a23K36J83q0l6j96k67j25J31L76J37m0R5k17k26j56j97J77L89R5K33l6j65
6873A88m30j01q9J10L70N0K88l9k30k95q2O6p4L00J80N6q2ql19k19j5K85Q2K46
6897B38M7M7l21j74p1j3J21K31J90J23k24j04k62j25j05K84L69r6J48Q8j19m24
6919a52k18M5J07M54R5p3N2k89k14j54L8K29J63QK98k32k5l48j54K5J74K50K84
6942C63qj99l41j29O1r5K62K21J70J45l14j93j98K7m3R6K79J96k0j70l34m2j6
6965b82L4J58K31J71l1k11o8j68j61P0J21L36L5J11l41k77j9O4q3L36J74J64j76
$$ plain form
6988 188 99 -233 -353 -327 -220 177 287 241 307 -2 -221 -244 -393 -162 52 221 246 215 79 -141 -255 -346 -179
7011 -179 -133 251 368 188 84 -204 -339 -323 -128 -96 272 326 179 24 -188 -275 -131 -208 -3 236 273 167
7033 167 -62 -70 -206 -154 -24 241 261 339 367 48 -63 -367 -242 29 113 394 394 372 -104 -229 -372 -346 -76 34
7057 34 233 323 325 -73 -198 -223 -246 -88 183 208 215 236 46 -248 -320 -211 -54 29 53 288 158 -217 -356 -257 -233
7082 -233 -15 217 369 355 180 -151 -151 -395 -209 29 259 288 323 233 -189 -208 -335 -148 -115 110 382 304 136
7105 136 -254 -407 -502 -142 -58 339 47 362 178 -79 -164 -326 -143 -80 206 276 366 190 -91 -249 -339 -304 -88
7128 -88 139 361 316 193 -348 -353 -268 -272 135 254 294 175 110 -401 -408 -254 -82 174 249 172 198 -48 -352 -438 -363
7153 -363 -99 66 254 446 276 38 -168 -247 -167 -61 -5 127 282 154 -49 -361 -222 -248 -99 42 294
$$ packed form
6988A88q9l32j20K6J07L97J10m6O6l09k19k3j49K31K14J69K5l1j36k20j14r1J67
7011a79M6L84J17j80j04k88j35J6J95L2L68N4j47j55k12q7J44p7K05K39L7j06
7033A67k29qj36N2J30K65K0P8K8l19j11l04J25K71Q4K81%k2m76j25j43K6K70J10
7057C4J99R0Kl98j25k5k3J58K71K5PK1j90k94p2J09J57Q3K4K35j30l75j39R9K4
7082b33K18K32J52j4j75l31%k44J86K38K30K9L5r0m22j9j27J87L3K25K72p8j68
7105A36l90j53r5L60Q4L97k92L15j84k57q5j62J83O3K86P0R0j76k81j58r0L5K16
7128h8K27K22m5j23n41nQ5mM07J19M0j19o5n11pJ54J72K56P5p7K6k46l04q6P5
7153c63K64J65J88J92j70k38k06p9Q0J06N6J32J55j28k03l12J39k6J49J41K52
$$ plain form
7174 294 239 44 190 -236 -401 -357 -168 28 194 190 116 80 -250 -287 -228 -9 361 91 307 144 -91 -183 -126
7197 -126 -174 143 335 264 380 144 -101 -216 -443 -267 -91 125 343 299 190 -86 -270 -294 -192 -111 216 289
7219 289 440 256 -68 -235 -365 -182 116 142 344 141 132 -215 -353 -386 -170 41 310 350 220 161 -205 -272
7241 -272 -319 -49 211 230 230 331 213 -3 -123 -339 -36 86 293 273 239 -50 -294 -302 -407 -151 179 419 259
7264 259 170 -19 -182 -360 -267 -212 152 210 401 49 20 -53 -220 -146 -26 87 299 321 122 -109 -210 -384 -311
7287 -311 -55 218 255 328 276 -143 -169 -289 -286 -193 151 319 339 45 -13 -130 -321 -360 53 134 299 291 171 -83
7311 -83 -279 -250 -172 -116 296 483 284 140 -117 -309 -669 -222 -206 192 226 174 21 -168 -171 -311 -301 -29 119
7334 119 345 193 10 -162 -274 -385 -231 -45 243 272 380 222 -81 -190 -212 -151 -119 233 272 253 -24 -253
$$ packed form
7174B94n5j95J46m26j65M4J89J96J66mp4l6l30l7N9K19L70k70K16j63k35r2N7
7197a26m8L17J92p1J16k36k45j15k27J76J76K16K18m4j09k76j84k4J02Q1L27P3
7219B89J51j84l24j67j30J83K98K6K02k03rl47j38l3K16K11K69M0j30n9l66o7
7241b72m7K70K60J9%J01j18k16j20k16L03J22K07k0l4k89k44qj05K56L30K40j60
7264B59q9j89j63j78R3N5L64N8J91l52k9p3j67P4J20J13K12K2j99k31j01j74P3
7287c11K56K73L7P3n2m19k6j20LR3L44J68K0k94n8j17j91l9M13Q1J65qj20k54
7311h3j96K9P8N6M12J87j99j44k57j92l60M47J6L98L4n2j53j89lj40J0K72J48
7334A19K26j52j83j72j12j11J54J86K88K9J08j58l03j09k2O1L2L52L9j9k77k29
$$ plain form
7356 -253 -466 -255 -274 155 273 386 211 3 -44 -111 -255 -191 30 231 358 297 19 -63 -309 -266 -115 155
7378 155 278 337 234 -50 -123 -385 -419 -231 34 203 281 157 68 -157 -351 -223 -113 184 388 308 363 -2
7400 -2 -246 -165 -312 20 209 299 357 -20 2 -71 -200 -296 8 250 228 503 192 -16 -226 -320 -192 -41 202
7423 202 315 254 92 -28 -165 -337 -225 4 -83 300 260 6 -219 -354 -239 -164 -108 161 269 240 219 -95
7445 -95 -397 -274 -185 -23 134 347 253 157 -48 -243 -346 -291 -12 269 447 337 81 -116 -288 -309 -88 4
7467 4 227 303 208 -70 -114 -280 -182 -36 -129 413 214 72 207 -129 -359 -328 -97 21 211 370 175 -55 -208
7490 -208 -269 -262 -86 74 111 242 239 83 -250 -173 -274 -182 55 138 303 149 -3 -182 -512 -389 -135 225 222 378
7514 378 171 51 -154 -403 -327 -132 212 306 215 -2 -60 -333 -160 -118 -70 334 314 272 33 -10 -313 -227 -142 -30
$$ packed form
7356b53k13K11j9M29J18J13j75k08m7o7j44O4K21K01J27o1k78q2k46M3J51K70
7378A55J23N9j03k84p3k62l4J88K65J69P8j24q9k25j94J28J10K97K04q0N5l65
7400bk44Q1j47L32J89R0N8l77K2p3j29r6L04K42k2K75l11k08k10r4J28J51K43
7423B02J13o1j62j20j37j72J12K29q7L83m0k54k25j35J15P5N6K69J08k9k1l14
7445i5l02J23Q9J62J57K13r4r6k05j95j03N5K79K81J78j10k56j97j72k1K21R2
7467DK23P6r5k78m4j66R8J46r3N42j99j42J35l36k30L1K31J18J90J59j95k30j53
7490b08o1PJ76J60L7J31lj56l33P7j01R2K37Q3J65j54j52j79l30J23K54L60lJ56
7514C78k07j20k05k49P6J95L44R4r1k17n8k73J73M2M8M04k0m2k39m3l03Q6Q5J12
$$ plain form
7538 -30 18 307 368 98 -135 -387 -312 -288 81 255 493 339 118 104 -303 -232 -159 73 262 333 357 150 -227
7561 -227 -353 -332 -284 29 95 441 259 134 -191 -367 -428 -184 -40 79 248 256 -6 -195 -197 -400 -210 139 290
7584 290 146 400 105 -207 -274 -227 -66 195 175 104 200 -42 -38 -383 -206 -119 -132 254 309 111 152 -197 -472 -208
7608 -208 -88 -21 182 210 146 -52 -51 -222 -244 50 123 175 290 21 141 -70 -267 -225 -235 199 293 301 233 -31 -237
7633 -237 -210 -256 -35 91 221 244 166 -8 -232 -267 -332 -79 164 245 148 121 -174 -292 -136 -275 -101 31 214
7656 214 266 124 -152 -198 -343 -261 25 117 248 221 183 -83 -166 -279 -175 39 265 430 258 159 -60 -253 -330
7679 -330 -107 55 222 195 232 -2 -131 -287 -210 -21 8 134 315 399 -51 -168 -360 -217 -235 96 369 275
7701 275 313 -48 -164 -360 -110 42 -12 314 167 180 161 -257 -366 -167 -263 -80 295 401 199 9 -108 -225
$$ packed form
7538c0M8K89O1k70k33k52P5K4L69J74K38j54k21j4m07P1P3K32J89P1K4k07l77
7561b27j26K1M8L13O6L46j82j25l25j76o1K44J44J19J69Qk62j89kk03J90L49J51
7584B90j44K54k95l12o7M7J61K61k0p1R6k42Ml45J77Q7j3L86N5j98M1l49k75K64
7608b08J20O7K03K8o4j98Jj71k2K94P3N2J15k69J20k11j97M2j0M34R4Qo8k64k06
7633b37K7m6K21J26J30K3p8j74k24l5o5K53K43Q1r7k7k95j18J56j39J74J32J83
7656B14N2j42k76m6j45Q2K86R2J31k7l8k66q3j13J04K14K26J65j72r9k19j93p7
7679c30K23J62J67k7L7k34j29j56P7J89K9J26J81Q4m50j17j92J43j8L31K73r4
7701B75L8l61j16j96K50J52n4L26j47J3j9m18j09J99r6J83L75J06k02j90j17j17
$$ plain form
7723 -225 -446 28 -30 222 339 179 71 -250 -157 -208 -200 157 322 265 338 57 -240 -291 -315 -43 267 333 436
7746 436 287 -56 -47 -506 -253 -149 132 254 187 311 15 -70 -371 -252 -142 55 145 441 142 23 -71 -360
7768 -360 -258 -96 238 217 364 82 -42 -100 -334 -107 -128 165 191 275 190 -181 -300 -219 -153 -69 159 261 255 10
7792 10 -308 -345 -127 -183 -57 177 202 174 218 -106 -206 -124 -148 90 266 420 155 22 -114 -240 -189 -51 36
7815 36 262 413 66 120 -167 -169 -326 1 -111 285 204 247 86 -85 -264 -392 -114 47 132 168 413 89 -51
7838 -51 -155 -129 -151 205 379 321 34 15 -28 -247 -236 129 128 259 249 225 -92 -96 -253 -210 -124 -1 171 309 244
7863 244 68 -97 -394 -220 -133 204 254 365 299 107 -109 -160 -185 -69 148 323 235 337 -35 -85 -298 -352 -8
7886 -8 154 271 364 308 67 -239 -139 -28 -96 188 360 289 161 21 -263 -364 -99 -20 310 287 232 172 -106
$$ packed form
7723b25k21M74n8K52J17j60j08l21R3n1QL57J65n7P3k81k97n1k4K72L10O6J03
7746D36j49l43Rm59K53J04K81J22o7J24k96q5l01J19J10J97R0K96k99j19r4k89
7768c60J02J62L34k1J47k82j24n8k34K27k1K93K6Q4q5l71j19Q1O6Q4K28J02ok45
7792A0l18l7K18n6J26K34K5k8M4l24j00Q2k4K38J76J54k65j33j36j26N1J38Q7
7815C6K26J51l47N4k87kj57L27j12L96q1M3j61j71j79j28K78J61Q5L6K45l24j40
7838e1j04K6k2L56J74n8k87j9m3k19J1L65jJ31j0k4l17mj57M3Q6J23J72J38o5
7863B44j76j65k97J74Q7L37N0J11o6j92k16n1k5J16K17J75q8J02l72n0k13n4L44
7886hJ62J17R3n6k41l06J00J11o8K84J72p1j28j40k84j01K65P9L30k3n5o0k78
$$ plain form
7909 -106 -466 -231 -234 -45 187 299 288 119 -109 -278 -307 -275 177 217 291 360 2 -126 -287 -209 -74 141 309
7932 309 285 145 150 113 -393 -231 -258 28 184 331 302 86 -153 -232 -127 -80 11 169 358 193 31 -230 -246
7955 -246 -365 -249 67 361 249 73 15 -167 -167 -193 -197 39 347 242 187 -119 -398 -292 -156 -86 -141 294 366
7978 366 102 242 -244 -244 -76 -62 -30 276 294 118 -33 -147 -233 -218 -52 -12 356 151 175 -58 -326 -206 -258
8001 -258 -91 311 256 394 187 -15 -379 -368 -114 -90 165 344 276 70 -85 -120 -141 -280 19 93 336 266 39
8024 39 -250 -281 -230 -163 94 182 189 68 107 -93 -273 -192 -176 -49 173 311 114 130 -247 -410 -301 -135 33 228
8048 228 136 171 127 -47 -333 -247 -50 86 230 391 157 45 -267 -428 -112 -25 -18 251 372 132 123 -123 -298
8071 -298 -140 -102 56 373 279 36 -64 -149 -261 -272 -82 113 221 338 87 -63 -48 -390 -194 -76 251 277
$$ packed form
7909a06l60K35lJ89K32J12j1j69k28j69k9L2M52M0P4O9l58j28j61P8J35K15J68
7932C09k4j40Nl7n06J62k7K86J56J47k9k16k39p9J05M7R1J58J89j65j62k61j6
7955b46j19J16L16K94j12j76n8j82%k6mK36L08j05n5l06k79J06J36P0n5M35P2
7978C66k64J40m86%J68J4L2L06J8j76j51j14q6J5J66M0L68k05K4k33k68J20n2
8001b58J67M02n5J38k07k02l64J1K54K4K55J79o8k06j55l5k1j39K99P4K43p0k27
8024C9k89l1N1O7K57Q8Pj21L9k00j80Q1J6J27K22J38j97J6l77j63J09J66J68J95
8048B28r2L5m4j74k86Q6J97J36J44J61k34j12l12j61L16Q7PK69J21k40rk46j75
8071b98J58L8J58L17r4k43j00q5j12j1J90J95J08J17k51j50J5l42J96J18L27K6
$$ plain form
8093 277 287 24 100 -130 -411 -186 -94 134 260 237 384 -53 -163 -206 -218 8 169 235 211 219 -240 -115 -310
8116 -310 -345 -58 206 196 314 195 -144 -206 -305 -183 -27 205 202 316 120 -179 -418 -253 -295 -8 156 110 190
8139 190 24 -11 -316 -284 -249 214 206 341 247 123 -222 -182 -231 -174 -17 226 401 112 91 -57 -216 -341 -186
8162 -186 14 170 141 321 115 -128 -291 -228 -112 -106 125 288 161 146 -204 -267 -460 -20 154 232 443 349 -11
8185 -11 -97 -247 -298 26 16 197
$$ packed form
8093B77J0k63P6k30k81K25R2K28J26k3J47m37j10m3j2K26J61O6k4Qm59J25j95
8116c10l5K87K64j0J18j19l39o2r9J22J56K32lJ14j96k99k39J65m2K87J64m6Q0
8139A90j66l5l05L2L5M63qJ35r4j24l45M0m9N7J57K43J75k89k1j48j59j25J55
8162a86K00J56k9J80k06k43j63O3J16OK31J63j27j5l50o3j93M40J74P8K11r4l60
8185a1q6j50n1L24j0J81
8191A97
$$ Imaginary data points
##PAGE= N=2
##DATA TABLE= (X++(I..I)), XYDATA
$$ plain form
0 0 0 0 0 0 0 0 1 0 0 -8 8 -9 16 -16 24 -25 34 -46 49 -65 75 -90 112 -128 153 -177 203 -240 273 -314 360
31 360 -408 468 -526 595 -671 751 -843 942 -1050 1171 -1297 1443 -1597 1766 -1954 2153
47 2153 -2374 2619 -2883 3177 -3499 3857 -4260 4705 -5210 5785 -6442 7213 -8114 9203
61 9203 -10539 12224 -14434 17456 -21876 28990 -42347 76381 -360330 -555423 126250 490905
73 490905 777911 640075 208876 -370190 -698847 -756610 -426421 90256 565720 749733
83 749733 628765 177539 -350134 -692735 -685919 -378717 135112 572477 734741 565368
93 565368 142336 -381180 -690875 -642523 -322631 122493 551119 709624 494112 53862
103 53862 -388359 -669283 -636788 -295645 171815 545729 664667 453383 23230 -403117
$$ packed form
0@%%%%%%Jj%qJ6j7K5l2M0m9N9q0R5j14J40j65K02k40K81l30L80m43N13n87O74
31C60p68Q76r94J121j266J422j594J785j992K221k468K740l040L363l720M107
47B153m527M993n502O060o676P356q117Q965r915J0995j2227J3655j5327J7317
61I203j9742K2763k6658L1890l9332N0866p1337J18728m36711j95093O81673L64655
73D90905K87006j37836m31199n79066l28657n7763L30189N16677M75464J84013
83G49733j20968m51226n27673l42601O816L07202N13829M37365J62264j69373
93E65368m23032n23516l09695M8352L19892M45124M28626J58505k15512m40250
103E3862m42221k80924L2495L41143M67460L73914J18938k11284m30153m26347
$$ plain form
113 -403117 -638942 -581526 -241466 213055 561386 649044 427949 2407 -403650 -610074
123 -610074 -538967 -201616 248214 566585 608575 379721 -24327 -423554 -613862 -507749
133 -507749 -169138 245444 540868 570987 329437 -65299 -435458 -602456 -482133 -139176
143 -139176 261623 533676 545941 296703 -87087 -429723 -570171 -433149 -89470 287679
153 287679 530268 528269 274030 -106497 -424513 -537038 -393486 -57363 305430 518919
163 518919 489948 232104 -138230 -438816 -525152 -365358 -36253 307546 499126 448994
173 448994 185700 -168394 -444927 -508805 -333751 -6374 321111 493471 426020 156553
183 156553 -182964 -434987 -479527 -292868 32628 340852 489947 408935 135225 -197894
$$ packed form
113d03117k35825N7416L40060M54521L48331Q7658k21095m25542m06057k06424
123f10074P1107L37351M49830L18371M1990k28854m04048l99227j90308J06113
133e07749L38611M14582K95424L0119k41550l94736l70159j66998J20323L42957
143a39176M00799K72053J2265k49238l83790l42636j40448J37022L43679L77149
153B87679K42589j999k54239l80527l18016j12525J43552L36123L62793K13489
163E18919k8971k57844l70334l00586q6336J59794L29105L43799J91580n0132
173D48994k63294l54094k76533o3878J75054L27377L27485J72360o7451k69467
183A56553l39517k52023m4540J86659L25496L08224J49095q1012k73710l33119
$$ plain form
193 -197894 -430759 -456376 -263809 55555 348492 475080 376801 100869 -221712 -437471
203 -437471 -445405 -244052 69820 346211 454898 344855 69021 -240302 -436109 -426371 -216343
214 -216343 93492 355286 446227 325119 49619 -247138 -422711 -396050 -181264 121346
224 121346 366868 437631 303155 29394 -255672 -416075 -374317 -154466 137679 364880
234 364880 418540 271616 -2372 -273859 -416128 -360787 -135729 149827 360795 398409
244 398409 243246 -28873 -286390 -409161 -339799 -109052 171492 367079 388344 225343
254 225343 -44641 -291047 -396183 -312102 -78670 193958 374454 377958 204692 -63551
264 -63551 -299635 -389840 -293184 -58051 205161 370913 358540 175989 -89025 -312725 -388292
$$ packed form
193a97894k32865k5617J92567L19364K92937J26588r8279k75932l22581k15759
203d37471p934K01353L13872K76391J08687j10043k75834l09323j95807R738K10028
214b16343L09835K61794R0941j21108k75500k96757j75573K6661K14786L02610
224A21346K45522P0763j34476k73761k85066j60403M1758K19851K92145K27201
234C64880N3660j46924k73988k71487j42269N5341K25058K85556K10968L7614
244C98409j55163k72119k57517j22771O9362K30747K80544J95587K1265j63001
254B25343k69984k46406j05136Q4081K33432K72628J80496L504j73266k68243
264f3551k36084r0205R6656K35133K63212J65752j2373j82551k65014k23700p5567
$$ plain form
275 -388292 -279605 -40959 214090 365262 340474 151703 -109044 -318214 -377350 -257336
285 -257336 -16170 230103 366796 329171 134654 -121616 -316497 -360148 -231593 9482
295 9482 246160 365322 313021 114043 -137330 -320845 -349396 -211564 26897 252079 355723
306 355723 289543 85668 -158791 -328223 -342011 -194091 43531 257910 347166 269518 62874
317 62874 -174283 -328856 -326752 -169890 66364 270433 345262 256523 46713 -183896 -324885
328 -324885 -309302 -145773 87422 280417 341001 239579 26198 -197235 -326101 -298785
338 -298785 -128342 101603 282109 328937 217974 1770 -213782 -327834 -288711 -112925
348 -112925 115395 285559 317950 199483 -15200 -223175 -323461 -270937 -90856 132773
$$ packed form
275c88292J08687K38646K55049J51172k4788j88771k60747k09170n9136J20014
285b57336K41166K46273J36693l7625j94517k56270j94881m3651J28555K41075
295I482K36678J19162n2301j98978k51373j83515k8551J37832K38461K25182J03644
306C55723o6180k03875k44459j69432j3788J47920K37622K14379Q9256p7648k06644
317F2874k37157j54573K104J56862K36254K04069P4829q8739k09810k30609j40989
328c24885J5583J63529K33195J92995O0584j01422k13381k23433j28866K7316
338b98785J70443K29945J80506M6828j10963k16204k15552j14052L9123J75786
348a12925K28320J70164L2391j18467k14683k07975j00286N2524J80081K23629
$$ plain form
358 132773 293053 312112 184634 -27784 -227245 -316699 -252221 -67921 147715 295350
368 295350 302956 166214 -46977 -235998 -312739 -240065 -52643 157891 291999 287188 144681
379 144681 -67381 -246786 -309837 -226813 -36586 168603 291261 275318 127705 -82351
389 -82351 -252096 -300737 -207615 -16692 183197 295771 267184 112806 -93408 -253836 -292071
400 -292071 -190130 2875 195033 294714 255217 95532 -109005 -260714 -287057 -177187
410 -177187 15239 200383 290025 239673 74457 -125288 -265912 -281665 -164117 30352
420 30352 208900 286717 226709 58755 -136265 -266187 -269924 -145006 49199 219522 285451
431 285451 216404 44917 -146092 -265437 -258005 -127518 65163 227277 280005 200131 26856
$$ packed form
358A32773J60280J9059j27478k12418j99461q9454O4478J84300K15636J47635
368B95350P606j36742k13191j89021p6741P2674J87422K10534J34108m811j42507
379A44681k12062j79405o3051Q3024J90227K05189J22658j5943j47613k10056
389h2351j69745m8641R3122J90923J99889J12574k8587j54378k06214j60428l8235
400b92071J01941J93005J92158R9681l9497j59685k04537j51709k6343J09870
410a77187J92426J85144Q9642n0352j65216j99745j40624j5753J17548J94469
420C0352J78548P7817o0008j67954j95020j29922l737J24918J94205J70323O5929
431B85451o9047j71487j91009j19345P432J30487J92681J62114N2728p9874j73275
$$ plain form
442 26856 -158686 -268549 -250577 -112985 77994 229959 270766 182882 8598 -171370 -270906
453 -270906 -240989 -97056 91250 234482 265207 170048 -6043 -179572 -267621 -226697 -78258
464 -78258 106321 241138 261751 158139 -18875 -186273 -264941 -214495 -60643 118972 242378
475 242378 254194 144165 -36788 -197122 -261497 -204242 -50900 127343 243634 242933 126421
486 126421 -51639 -205036 -259658 -193378 -37066 138573 246845 234542 112243 -62392
496 -62392 -208973 -253582 -176260 -18761 148608 248869 228838 98268 -73684 -209274 -247952
507 -247952 -166071 -3251 159178 245719 216705 83842 -87553 -215928 -243632 -155694 8519
518 8519 165413 240788 203441 69037 -100599 -221289 -236369 -141814 20516 173796 241107
$$ packed form
442B6856j85542j09863J7972J37592J90979J51965M0807q7884j74284j79968r9536
453b70906K9917J43933J88306J43232L0725r5159j76091j73529q8049M0924J48439
464g8258J84579J34817K0613j03612j77014j67398p8668N0446J53852J79615J23406
475B42378J1816j10029j80953j60334o4375N7255J53342J78243J16291p01j16512
486A26421j78060j53397n4622O6280J56312J75639J08272j2303j22299j74635
496f2392j46581m4609P7322J57499J67369J00261k0031j30570j71952j35590l8678
507b47952Q1881J62820J62429Q6541k9014j32863j71395j28375k7704Q7938J64213
518H519J56894P5375l7347j34404j69636j20690j5080R4555J62330J53280O7311
$$ plain form
529 241107 193200 55940 -108859 -222112 -227106 -125084 35075 180717 240548 184873 44428
540 44428 -116473 -223290 -221288 -111737 47965 184758 236516 173852 27865 -127841 -223568
551 -223568 -215655 -103032 57995 187128 228309 162181 15932 -137021 -223465 -207282 -92804
562 -92804 68492 193828 224712 152659 6994 -144753 -222856 -193381 -76696 78352 199478
573 199478 221923 139235 -3880 -147212 -222634 -186589 -61940 87592 198154 216639 127842
584 127842 -20499 -155871 -220218 -180281 -51374 97908 198119 207556 116490 -33954 -164418
595 -164418 -215396 -169307 -41052 109222 202773 199676 105758 -41039 -170108 -212467 -153858
606 -153858 -27084 116220 206877 194819 91597 -50793 -171564 -211037 -146014 -13220 123609
$$ packed form
529B41107m7907j37260j64799j13253m994J02022J60159J45642N9831n5675j40445
540D4428j60901j06817K002J09551J59702J36793N1758o2664j45987j55706r5727
551b23568P913J12623J61027J29133M1181o6128j46249j52953q6444J6183J14478
562i2804J61296J25336L0884p2053j45665j51747p8103K9475J16685J55048J21126
573A99478K2445q2688j43115j43332p5422L6045J24649J49532J10562J8485q8797
584A27842j48341j35372o4347L9937J28907J49282J00211R437r1066j50444j30464
595a64418n0978M6089J28255J50274R3551l097r3918j46797j29069m2359N8609
606a53858J26774J43304R0657j2058j03222j42390j20771l9473O5023J32794J36829
$$ plain form
617 123609 204461 187548 78197 -65147 -176422 -207228 -138578 -2249 131493 201424 177688
628 177688 67167 -76256 -180683 -199917 -127207 7879 140195 202651 169152 57246 -82856
639 -82856 -183552 -194254 -113041 20808 146454 202478 160914 44563 -91668 -185114 -189382
650 -189382 -102295 31900 150672 198174 150959 31478 -102240 -187467 -184133 -92928 41750
661 41750 155411 194491 140986 19607 -110835 -188153 -176453 -80678 53024 161255 192383
672 192383 132370 9319 -117078 -187069 -167742 -68279 63993 165847 188389 122077 -1612
683 -1612 -123999 -187225 -160787 -57918 72202 167483 182354 110724 -13404 -131688 -187147
694 -187147 -153608 -47732 80086 169127 177232 100603 -23398 -136265 -184846 -144980 -36058
$$ packed form
617A23609Q0852j6913j09351j43344j11275l0806O8650J36329J33742O9931k3736
628A77688j10521j43423j04427j9234P2710J35086J32316O2456l3499j11906j40102
639h2856j00696j0702Q1213J33849J25646N6024m1564j16351j36231r3446m268
650a89382Q7087J34195J18772M7502m7215j19481j33718q5227L334R1205J34678
661D1750J13661L9080n3505j21379j30442p7318J1700R5775J33702J08231L1128
672A92383o0013j23051j26397o9991J9327R9463J32272J01854K2542o6312j23689
683a612j22387o3226K6438J02869J30120R5281J4871p1630j24128j18284n5459
694a87147L3539J05876J27818Q9041Q105p6629j24001j12867m8581L9866J08922
$$ plain form
705 -36058 89176 171269 172641 92465 -31882 -140633 -181391 -134938 -24971 96654 173022
716 173022 167524 81955 -41890 -144909 -178850 -127577 -15884 102789 172174 160012 70803
727 70803 -52158 -149822 -176059 -119493 -6815 108889 172032 153168 60962 -60407 -152056
738 -152056 -171184 -109911 3426 115945 172859 146774 51771 -66607 -153098 -166755 -100148
749 -100148 13823 121298 171296 139475 41739 -74709 -155482 -162653 -91876 22818 125255
760 125255 167736 130239 30491 -83492 -157793 -157568 -82650 31632 130023 165050 122124 21302
772 21302 -90280 -158660 -150780 -71259 41552 134630 163649 115172 12240 -96154 -158188
783 -158188 -144057 -61385 50450 138119 160601 106166 1723 -103175 -158518 -138468 -52636
$$ packed form
705c6058J25234Q2093J372q0176j24347j08751m0758M6453J09967J21625P6368
716A73022n498q5569j23845j03019l3941N1273J11693J18673O9385j2162q9209
727G0803j22961r7664k6237N6566J12678J15704O3143j8864r2206j21369r1649
738a52056j9128O1273J13337J12519N6914k6085r5003j18378q6491j3657O6607
749a00148J13971J07475M9998l1821r7736j16448q0773p171P0777J14694J02437
760A25255M2481l7497r9748j13983p4301K25P4918J14282R8391L5027m2926j00822
772B1302j11582o8380P880P9521J12811R3078K9019m8477j02932j08394o2034
783a58188J4131Q2672J11835Q7669K2482n4435j04443j04898n5343K0050Q5832
$$ plain form
794 -52636 57952 140274 155589 96511 -8726 -109516 -158359 -131929 -43187 65577 142668
805 142668 151300 87747 -17454 -113813 -156106 -123560 -32497 73897 144995 147133 79491 -25459
817 -25459 -117759 -153649 -115506 -22549 80972 145777 141689 70195 -34748 -122803 -151545 -108836
829 -108836 -14321 86546 145741 134943 60041 -43650 -126730 -149009 -100854 -5534 92410
840 92410 146133 129490 51264 -50569 -128388 -145185 -92131 4271 98587 146192 124470 43161
852 43161 -57361 -129941 -141165 -84519 12798 103410 144609 117707 34472 -65480 -132788 -137271
864 -137271 -77550 19704 107353 142490 109314 25860 -71592 -135054 -133533 -68840 27491 110635
876 110635 141344 104040 17290 -76938 -134696 -127831 -59742 35837 114582 139657 97624 9205
$$ packed form
794e2636J10588Q2322J5315n9078j05237j00790m8843K6430Q8742J08764P7091
805A42668Q632o3553j05201r6359m2293L2546R1063J06394P1098K138o7642j04950
817b5459r2300l5890L8143R2957J03521O4805m088p1494j04943q8055k8742M2709
829a08836R4515J00867N9195j0798p4902j03691q3080k2279M8155R5320R7944
840I2410N3723j6643p8226j01833p7819j6797N3054R6402R4316M7605k1722q1309
852D3161j00522p2580j1224N6646R7317R0612M1199k6902q3235r9952o7308m483
864a37271N9721R7254Q7649L5137l3176q3454r7452o3462J521O4693R6331Q3144
876A10635L0709l7304q6750r4228n7758O865O8089R5579P8745K5075m2033q8419
$$ plain form
888 9205 -81916 -133835 -122694 -52154 43656 117132 135204 90259 1466 -88431 -134688 -116904
900 -116904 -44852 48212 119088 132121 81530 -7301 -92274 -133700 -111846 -36905 55706 121290
912 121290 128383 74938 -13808 -96014 -132315 -105005 -27701 62295 122931 125587 68224 -21164
924 -21164 -99561 -130378 -99279 -20799 68249 124249 120270 59780 -28261 -103549 -130251 -93707
936 -93707 -13167 72457 123498 116051 52995 -35841 -106776 -127181 -87708 -6387 77826 124307
948 124307 111625 46316 -41094 -108464 -124207 -80343 1694 82516 123822 107078 39840 -46537
960 -46537 -110558 -120850 -73607 7723 85865 123448 101277 30985 -53393 -112599 -118197 -67438
972 -67438 14507 89089 121210 95523 23770 -59119 -113469 -113887 -60342 21224 93084 120495
$$ packed form
888I205r1121n1919J1141P0540R5810P3476J8072m4945q8793q9897m6257J7784
900a16904P2052R3064P0876J3033n0591q8831q4973m1426K1854P4941R2611O5584
912A21290P093n3445q8746q2206l6301K7310P7304Q9996O0636K656n7363q9388
924b1164p8397l0817L1099P8480Q9048N6000l979o0490q8041p5288k6702L6544
936i3707Q0540Q5624N1041p447o3056q8836p0935k0405L9473Q1321Q4213M6481
948A24307j2682o5309q7410o7370j5743M3864Q2037Q0822M1306j6744o7238q6377
960d6537o4021j0292M7243Q1330P8142L7583k2171p0292q4378n9206n598N0759
972f7438Q1945P4582L2121k5687p1753q2889n4350m18N3545Q1566P1860K7411
$$ plain form
984 120495 90459 16881 -63935 -113695 -109359 -53297 29040 97134 118738 84532 10179 -68835
996 -68835 -114415 -105408 -46990 34451 99708 116424 77611 2868 -73423 -115097 -101940 -40585
1008 -40585 39825 101292 113997 71771 -3667 -77143 -115133 -97675 -32910 45815 102790 111616
1020 111616 66917 -9753 -80931 -113161 -92205 -26630 52222 104696 107825 60819 -15404 -84535
1032 -84535 -112325 -87185 -20909 55971 105427 104162 53966 -21876 -88309 -111874 -81780 -14124
1044 -14124 59900 105982 100611 46996 -28085 -89922 -109665 -76426 -6874 64695 106106 97794
1056 97794 42146 -33358 -91972 -107159 -71140 -530 69706 106422 93545 35741 -39150 -94484
1068 -94484 -104896 -66140 4528 73172 105753 88583 29485 -44518 -96821 -102557 -60639 9308
$$ packed form
984A20495l0036p3578q0816m9760M336N6062Q2337O8094K1604l4206p4353p9014
996f8835m5580R007N8418Q1441O5257J6716l8813p4743p6291m1674J3157O1355
1008d0585Q0410O1467J2705m2226p5438p3476l7990J7458O4765P8725N6975Q826
1020A11616m4699p6670p1178l2230K0956O5575P8852N2474L129m7006p6223o9131
1032h4535k7790K5140O6276P6880M9456j265n0196p5842o6433k3565L0094O7656
1044a4124P4024M6082n371n3615p5081o1837j9743L3239O9552P1569M1411q312
1056I7794n5648p5504n8614j5187L6019P0610P0236L6716j2877n7804p4891n5334
1068i4484j0412L8756P0668O8644L2581j7170n9098p4003n2303n736M1918O9947
$$ plain form
1080 9308 75850 105748 84276 23826 -48160 -97840 -100176 -54276 15802 79155 105602 80328
1092 80328 17632 -51946 -97936 -97205 -48717 22224 81590 103299 76187 11717 -56960 -97942
1104 -97942 -93790 -44501 26881 83854 100548 70622 6335 -61911 -99319 -89509 -38780 31077
1116 31077 86636 99166 64856 663 -64588 -99382 -85486 -31490 36200 88075 97931 60363
1128 60363 -5038 -67161 -98087 -82051 -25839 41613 89115 95172 55554 -11070 -71319 -97570
1140 -97570 -78229 -21486 45972 90483 91444 49720 -15790 -74758 -97075 -73475 -15847 49624
1152 49624 91519 88983 44287 -20851 -76247 -95642 -69082 -9385 54168 92008 86399 39617
1164 39617 -25615 -78318 -93777 -64256 -4034 58002 92022 82618 33934 -30941 -80830 -91991
$$ packed form
1080I308O6542K9898k1472o0450p1986m9680k336M5900P0078O3353K6447k5274
1092H0328o2696o9578m5990P31M8488P0941N9366K1709k7112o4470o8677m0982
1104i7942M152M9289P1382N6973J6694k9926o4287o8246l7408R810N0729O9857
1116C1077N5559J2530l4310o4193o5251l4794J3896N3996O7690N1875R856l7568
1128F0363o5401o2123l0926J6036N6212O7452M7502O057l9618o6624o0249k6251
1140i7570J9341N6743O7458M4511R61m1724o5510n8968k2317K3600N7628O5471
1152D9624M1895k536m4696o5138n5396j9395K6560N9697O3553L7840n609m6782
1164C9617o5232n2703j5459K9521O0222O2036L4020r404m8684o4875m9889j1161
$$ plain form
1176 -91991 -59603 885 61089 91499 78220 27941 -35799 -82728 -90214 -54197 6728 63958
1188 63958 91184 74720 22133 -40517 -83289 -86854 -48802 12745 67645 90523 70788 17085
1200 17085 -44305 -84479 -84227 -43630 17503 70315 89535 66066 11538 -48856 -85617 -81551
1212 -81551 -39354 21686 72267 88168 61788 6049 -52054 -85960 -78948 -34242 26484 74099
1224 74099 86669 58173 1771 -55069 -85161 -75186 -29348 30524 76008 85176 54043 -2664
1236 -2664 -57505 -84784 -72072 -24825 34257 76843 82782 49309 -7170 -60416 -84813 -68814
1248 -68814 -20410 37491 77448 80181 44798 -11733 -62851 -83918 -65297 -15496 41419 78511
1260 78511 77877 40731 -15984 -64730 -82613 -61136 -10314 45094 79180 75507 36194 -20183
$$ packed form
1176i1991L2388O0488O0204L0410j3279n0279o3740m6929p486L6017O0925N7230
1188F3958K7226j6464n2587o2650m2772l565L8052O1547N4900K2878j9735n3703
1200A7085o1390m0174K52M0597O1133N2812J9220k3469n4528o0394l6761M066
1212h1551M2197O1040N0581J5901k6380n5739n8103l3906P012M4706O0726M7615
1224G4099J2570k8496n6402n6840l0092R975M5838N9872M5484R168l1133n6707
1236b664n4841k7279J2712M7247N9082M2586N939l3473n6479n3246k4397J5999
1248f8814M8404N7901L9957K733l5383n6531n1118k1067J8621M9801N6915L7092
1260G8511o34l7146n6715m8746j7883K1477N0822N5408L4086l673l9313n6377
$$ plain form
1272 -20183 -66713 -81314 -57079 -5838 48052 79184 72566 31301 -25028 -68940 -80269 -53457
1284 -53457 -1506 51042 79156 69326 26372 -28949 -70425 -78437 -49302 3426 54169 79008
1296 79008 66443 22213 -32557 -71283 -76073 -44594 8280 57181 78707 62908 17591 -35907
1308 -35907 -72321 -74037 -40454 12386 59167 77611 59087 12515 -39849 -73297 -71857 -36144
1320 -36144 16234 60783 76388 55333 7936 -43195 -73613 -68988 -31497 20635 62773 75171
1332 75171 51709 3765 -45818 -73416 -65825 -26998 24892 64618 73847 47909 -547 -48909
1344 -48909 -73581 -62943 -22849 28258 65907 71888 43586 -5369 -51683 -73743 -60201 -18499
1356 -18499 31639 66801 69976 39480 -9434 -53899 -72735 -56897 -13821 35287 67762 68393
$$ packed form
1272b0183m6530j4601K4235N1241N3890L1132o618m1265n6329m3912j1329K6812
1284e3457N1951N2548K8114r830m2954n5321m1476q012K9135N2728N0743K4839
1296G9008j2565m4230n4770l8726m790L1479N2874M8901K1526j5799m5317n3498
1308c5907l6414j716L3583N2840M6781J8444j8524m6572n2364l3448J440L5713
1320c6144N2378M4549J5605k1055m7397n1131l0418M625L7491N2132M2138J2398
1332G5171k3462m7944m9583k7598P591L8827N1890L9726R229k5938m8456m8362
1344d8909k4672J0638M0094N1107L7649N981k8302m8955m6314k2060J3542M1702
1356a8499N0138L5162L175l0496m8914m4465j8836J5838M3076M9108L2475O31
$$ plain form
1368 68393 36123 -13214 -55801 -71393 -53483 -10039 38735 68420 65683 32069 -16898 -57827
1380 -57827 -70801 -50009 -5999 41294 68850 63037 27403 -20771 -59619 -69851 -46563 -1530
1392 -1530 43608 68606 60525 23138 -24476 -60354 -67941 -43236 2746 46857 68393 57878
1404 57878 19920 -27766 -61704 -65950 -39415 6642 49638 68079 54628 15448 -31018 -62827
1416 -62827 -64460 -35599 9965 50940 67571 51560 11237 -34130 -63663 -63089 -31974 13879
1428 13879 52587 66609 48773 7732 -36897 -64016 -60581 -28108 17479 54540 65667 46088
1440 46088 4319 -39344 -64058 -57926 -24335 20753 55745 64661 42540 253 -41965 -64004
1452 -64004 -55695 -20976 23587 56904 62895 39143 -3599 -44585 -63970 -53051 -17199 26662
$$ packed form
1368F8393l2270m9337m2587j5592J7910M3444M8774K9685k737l3614m8967m0929
1380e7827j2974K0792M4010M7293K7556n813l5634m8174l8848j0232K3288M5033
1392a530M5138K4998q081l7387m7614l5878p587K4705M5982M4111K1536j0515
1404E7878l7958m7686l3938m246K6535M6057M2996J8441j3451l9180m6466l1809
1416f2827j633K8861M5564M0975J6631j6011m0323m5367k9533N74L1115M5853
1428A3879L8708J4022j7836m1041m4629k7119L435L2473M5587L7061J1127j9579
1440D6088m1769m3663k4714O132L3591M5088L4992Q916k2121m2287m2218k2039
1452f4004Q309L4719M4563L3317N991k3752m2742m0986j9385J0919L5852M3861
$$ plain form
1464 26662 57830 61323 35630 -7186 -46322 -63351 -49825 -13185 29618 58924 60003 31924
1476 31924 -10316 -47673 -62758 -47420 -9243 32840 59376 57916 28639 -14336 -49873 -61951
1488 -61951 -44744 -6065 35411 59630 55276 24958 -17449 -51592 -61063 -41653 -2592 37788
1500 37788 59576 53139 21471 -20292 -52381 -59577 -38130 1397 40088 59958 51112 18080
1512 18080 -23243 -53573 -58243 -35010 4685 42219 59505 48395 14344 -26480 -54508 -56640
1524 -56640 -31914 7833 43405 58754 45774 10834 -29049 -55095 -55095 -28777 10938 45212 58148
1537 58148 43217 7771 -31362 -55365 -53017 -25267 14260 47127 57278 40463 4765 -33575
1549 -33575 -55665 -50708 -22260 17026 48281 56548 37609 998 -35890 -55889 -49050 -19093
$$ packed form
1464B6662L1168L493k5693m2816l9136j7029J3526L6640M2803K9306J079k8079
1476C1924m2240l7357j5085J5338L8177M2083K6536j460k9277m2975l5537j2078
1488f1951J7207L8679M1476K4219m354l0318m2407l4143r471J9410L9061M0380
1500C7788K1788o437l1668m1763l2089p196K1447L9527L8691J9870q846l3032
1512A8080m1323l0330m670K3233L9695L7534J7286j1110l4051m0824k8028k132
1524e6640K4726L9747L5572J5349j2980l4940l9883k6046%K6318L9715L4274J2936
1537E8148j4931l5446l9133k4003K348K7750L9527L2867J0151j6815l5698l8340
1549c3575k2090M957K8448L9286L1255Q267j8939l6611l6888j9999O839K9957
$$ plain form
1561 -19093 19675 48879 54929 34828 -2112 -37880 -55710 -46983 -15923 22358 49913 53781
1573 53781 32213 -4782 -39266 -54853 -44372 -12757 24939 50727 52638 29411 -7627 -40845
1585 -40845 -54524 -42031 -9843 27186 51079 50783 26292 -10776 -42558 -53807 -39988 -7040
1597 -7040 29105 51047 48946 23398 -13264 -43353 -53275 -37364 -4275 31118 51572 47363 20586
1610 20586 -15643 -44085 -51896 -34846 -1012 33264 51455 45480 18115 -18179 -45172 -50994
1622 -50994 -32579 1600 34957 51244 43281 15018 -20563 -46439 -49783 -29738 4200 36057
1634 36057 50835 41051 11879 -22874 -47018 -48547 -26921 7177 37655 50745 39263 9251
1646 9251 -24682 -46974 -47074 -24387 10045 39137 49814 37083 6592 -27238 -47324 -45179 -21840
$$ packed form
1561a9093L8768K9204O050k0101l6940l5768j7830Q727L1060L8281K7555L868
1573E3781k1568l6995l4484j5587J0481L1615L7696K5788J911k3227l7038l3218
1585d0845j3679J2493L2188L7029K3893k96k4491l7068l1782j1249J3819L2948
1597g040L6145K1942k101k5548l6662l0089r922J5911L3089L5393K0454m209k6777
1610B0586l6229k8442p811J7050L3834L4276J8191n975k7365l6294k6993n822
1622e0994J8415L4179L3357J6287p963k8263l5581k5876l344K0045L3938L1857
1634C6057J4778r784k9172l4753k4144j529K1626L4098L0478J3090j1482l0012
1646I251l3933k2292j00K2687L4432K9092J0677j2731l0491l3830k0086K145K3339
$$ plain form
1659 -21840 12163 40466 49081 34458 3576 -29105 -47744 -43898 -19024 14543 41163 48059
1671 48059 31955 747 -30890 -47700 -41877 -16024 17092 42133 47261 29781 -1862 -32233
1683 -32233 -47248 -39904 -13372 19613 43002 45996 27287 -4218 -33846 -47293 -37953 -10716
1695 -10716 21298 43385 44861 24647 -7255 -35408 -46827 -36196 -8136 23385 43888 43206
1707 43206 22126 -9483 -36484 -46155 -33934 -5726 25350 44227 41956 20028 -11504 -37419
1719 -37419 -45263 -31592 -3154 26936 44360 40443 17343 -13602 -38165 -44719 -29704 -805
1731 -805 28448 43930 38712 14939 -15887 -39117 -43861 -27589 1444 29783 43881 37267 12662
1744 12662 -17836 -39809 -42593 -25356 3930 31323 43734 35355 10565 -19308 -40228 -41475
$$ packed form
1659b1840L4003K8303Q615j4623l0882l2681j8639L846K4874L3567K6620O896
1671D8059j6104l1208l1637j6810N823K5853L3116K5041N128j7480l1643l0371
1683c2233j5015P344K6532L2985K3389K994j8709l1505k9628j3447R340K7237
1695a0716L2014K2087J476k0214l1902k8153j1419J0631K8060L1521K0503o82
1707D3206k1080l1609k7001r671J2221K8208L1076J8877k271k1928l1532k5915
1719c7419p844J3671K8438L0090J7424l917k3100l0945k4563o554J5015K8899
1731h05K9253J5482n218k3773l0826k3230m744J6272K9033K8339J4098o614k4605
1744A2662l0498k1973k784J7237K9286K7393J2411q379k4790k9873k0920j247
$$ plain form
1756 -41475 -22958 6241 32393 43288 33565 7898 -21445 -40412 -40200 -20872 8210 33481
1768 33481 42561 31450 5320 -23417 -40877 -38905 -18484 10528 34671 42003 29293 2881
1780 2881 -24937 -40843 -37219 -15861 12887 35728 41457 27282 500 -26454 -40796 -35757 -13504
1793 -13504 14999 36423 40407 25171 -2084 -28027 -40817 -34163 -11250 17102 36968 39080
1805 39080 22800 -4352 -29472 -40660 -32428 -8799 19027 37386 38063 20595 -6554 -30539
1817 -30539 -40113 -30318 -6300 20832 37790 36984 18578 -8674 -31511 -39466 -28383 -3827 22336
1830 22336 38382 35676 16186 -10881 -32722 -39069 -26659 -1584 23747 38057 34274 13858
1842 13858 -13005 -33681 -38137 -24649 298 25432 38155 32701 11569 -14968 -34279 -37148
$$ packed form
1756d1475J8517K9199K6152J0895r723k5667k9343j8967K12J9328K9082K5271
1768C3481R080j1111k6130k8737j7460J972K0421K9012K4143P332j2710k6412
1780B881k7818j5906L624K1358K8748K2841N729j4175k6782k6954j4342N039K2253
1793a3504K8503K1424L984j5236k7255k5943j2790O654K2913K8352J9866K112
1805C9080j6280k7152k5120j1188Q232K3629K7826J8359O77j7468k7149k3985
1817c0539r574R795K4018K7132J6958q06j8406k7252k2837p955J1083K4556K6163
1830B2336J6046k706j9490k7067k1841o347J2410K5075K5331J4310l783k0416
1842A3858k6863k0676m456J3488K4947K5134J2723n454k1132k6537j9311k869
$$ plain form
1854 -37148 -22502 2802 27045 38132 31010 9311 -16630 -34860 -36127 -20374 5098 28202
1866 28202 37762 29254 7040 -18633 -35121 -35171 -18249 7517 29310 37078 27358 4668 -20315
1879 -20315 -35687 -33887 -16151 9621 30330 36490 25633 2534 -21987 -35679 -32359 -13772
1891 -13772 11407 31175 35912 23680 313 -23245 -35799 -30948 -11575 13194 31925 35196
1903 35196 21727 -1854 -24445 -35491 -29667 -9408 15020 32115 34324 19901 -4150 -26000
1915 -26000 -35268 -28020 -7355 17017 32768 32940 17963 -5914 -26988 -34860 -26149 -5492 18231
1928 18231 33267 32080 15704 -7743 -27815 -34552 -24537 -3090 19797 33296 30883 13897
1940 13897 -9648 -28451 -33837 -22996 -1038 21083 33192 29631 11833 -11846 -29381 -33090
$$ packed form
1854c7148J4646K5304K4243J1087p122k1699k5941j8230j267J5753K5472K3104
1866B8202R560q508k2214k5673j6488n0J6922K5766K1793P768r720k2690k4983
1879b0315j5372J800J7736K5772K0709O160j0857k3099k4521j3692L320J8587
1891a3772K5179J9768M737j2232k3367k3558j2554M851J9373K4769J8731L271
1903C5196j3469k3581k2591j1046N824K0259K4428J7095K209j4423k4051k1850
1915b6000r268P248K0665K4372J5751J72j4977k3877k1074p872Q711K0657K3723
1928A8231J5036j187j6376k3447k0072o737J0015K1447K2887J3499k413j6986
1940A3897k3545j8803n386J0841K1958K2121J2109l561j7798k3679j7535l709
$$ plain form
1952 -33090 -21354 740 22536 33194 28148 10093 -13164 -30013 -32324 -19390 2724 23609
1964 23609 33236 26874 7887 -14837 -30420 -31493 -17741 4526 24456 32843 25448 5902 -16401
1977 -16401 -30799 -30553 -15986 6389 25477 32422 23784 3881 -17552 -31116 -29438 -13945 8164
1990 8164 26283 31945 22215 1978 -18952 -30761 -28303 -11949 9889 27060 31319 20729 362
2003 362 -20176 -31045 -27072 -10211 11405 27645 30780 18969 -1382 -21336 -31151 -25807 -8506
2016 -8506 12947 28112 29943 17164 -3397 -22387 -30777 -24733 -6509 14338 28580 29224 15839
2029 15839 -5106 -23153 -30429 -23225 -4967 15866 28872 28055 14200 -6615 -24223 -30146 -21795
2042 -21795 -2882 17013 28867 27116 12332 -8293 -24866 -29633 -20286 -1340 17999 29025
$$ packed form
1952c3090J1736K2094K1796J0658n046j8055k3257j6849k311J2934K2114K0885
1964B3609R627o362j8987k2724j5583j073J3752K2267J9930Q387p395j9546k2303
1977a6401j4398K46J4567K2375J9088O945q638j9903k1433j3564J678J5493K2109
1990H164J8119N662r730k0237k0930j1809K458J6354K1838J7171M259j0590k0367
2003C62k0538j0869L973J6861K1616J6240L135j1811k0351j9954r815N344J7301
2016h506K1453J5165J831j2779k0561j8990q390O044J8224K0847J4242O44j3385
2029A5839k0945j8047p276P204J8258K0833J3006q17j3855k0815j7608n923Q351
2042b1795J8913J9895J1854j751j4784k0625j6573m767R347J8946J9339J1026
$$ plain form
2054 29025 25945 10549 -9677 -25423 -28989 -18795 479 19185 29030 24852 9316 -11065 -25917
2067 -25917 -28316 -17304 1984 20049 28955 23975 7340 -12474 -26501 -27763 -15735 3398 21345
2080 21345 28577 22632 5604 -13991 -26708 -26872 -14413 4994 22096 28434 21304 4154 -15166
2093 -15166 -27016 -26081 -12857 6575 22860 28058 19941 2645 -16197 -27237 -25043 -11030 7915
2106 7915 23358 27580 18722 902 -17340 -27312 -24344 -9594 9495 23831 27125 17190 -764
2119 -764 -17968 -27077 -23328 -8070 10574 24275 26663 16039 -2128 -19005 -26934 -22220 -6693
2132 -6693 11980 24900 25796 14775 -3300 -19859 -26646 -20757 -5152 12975 25075 24982 13183
2145 13183 -4716 -20502 -26444 -19703 -3574 13928 25193 24234 11836 -6195 -20977 -26112 -18690
$$ packed form
2054B9025l080j5396k0226j5746l566J0194J9274J8706R845m178j5536k0381j4852
2067b5917k399J1012J9288J8065Q906m980j6635j9814j4027j262J2028J9133J7947
2080B1345P232n945j7028j9595j2717j64J2459J9407J7102O338p130j7150j9320
2093a5166j1850R35J3224J9432J6285N198q117j7296j8842j1040K194J4013J8945
2106G915J5443M222q858j7820j8242r972K968J4750J9089J4336L294r935j7954
2119g64j7204r109L749J5258J8644J3701K388j0624j8167j6877p929M714J5527
2132f693J8673J2920Q96j1021j8075j6559o787N889J5605J8127J2100r3j1799
2145A3183j7899j5786n942O741J6129J7502J1265r59j2398j8031j4782n135P422
$$ plain form
2158 -18690 -2304 14896 25247 23698 10460 -7526 -21541 -25608 -17452 -1020 16099 25262 22520
2171 22520 9184 -8440 -22455 -25116 -16076 425 16914 25302 21598 7675 -9590 -22773 -24677
2184 -24677 -14901 1606 17548 25064 20707 6182 -10895 -23064 -24168 -13851 3082 18411 25004
2197 25004 19691 4872 -12056 -23201 -23302 -12187 4265 18991 24702 18412 3536 -12912 -23395
2210 -23395 -22385 -10864 5689 19668 24413 17482 2212 -13802 -23368 -21878 -9916 6849 20193
2223 20193 24003 16210 903 -15096 -23461 -21039 -8608 8107 20647 23487 15137 -564 -15784
2236 -15784 -23391 -20027 -7039 9192 21138 22934 13966 -1594 -16553 -23194 -19014 -5785 10187
2249 10187 21442 22283 12735 -2893 -17062 -22965 -18064 -4487 11160 21634 21493 11366 -4017
$$ packed form
2158a8690J6386J7200J0351j549j3238j7986j4015m067Q156J6432J7119R163k742
2171B2520j3336j7624j4015k661R040J6501J6489Q388l704j3923j7265j3183j904
2184b4677R776J6507J5942P516m357j4525j7077j2169j104J0317J6933J5329O593
2197B5004n313j4819j6928j1145j01J1115J6452J4726N711o290j4876j6448j0483
2210b3395J010J1521J6553J3979M745o931j5270j6014r566J490J1962J6765J3344
2223B0193L810p793j5307j5999q365K422J2431J6715J2540K840q350j5701j5220
2236a5784p607L364J2988J6231J1946J796q968j5560j4959o641M180J3229J5972
2249A0187J1255Q41r548j5628j4169n903M901J3577J5647J0474j41j0127j5383
$$ plain form
2262 -4017 -17919 -23063 -17203 -3326 12100 21639 20910 10123 -5196 -18180 -22488 -16251 -1858
2275 -1858 12927 21737 20268 8964 -6251 -18754 -22024 -15020 -788 13761 21761 19476 7998
2288 7998 -7506 -19154 -21593 -13930 245 14482 21767 18596 6627 -8352 -19359 -21260 -12903
2301 -12903 1410 15125 21509 17680 5555 -9370 -19799 -20824 -11743 2717 15910 21522 16975
2314 16975 4192 -10222 -19933 -20149 -10518 3598 16262 21273 15933 3126 -11180 -20091 -19518 -9496
2328 -9496 4962 16892 20705 14933 1922 -11980 -20199 -18650 -8469 5724 17490 20519 13940
2341 13940 527 -12740 -20134 -18021 -7250 7034 17766 20160 13003 -359 -13515 -20051 -17115
2354 -17115 -6157 8093 18171 19659 11664 -1542 -14327 -20149 -16421 -4771 8811 18425 18936
$$ packed form
2262d017j3902n144N860J3877J5426R539p29j0787j5319j2984m308O237J4393
2275a858J4785Q810j469j1304j5215j2503l270P004J4232J4549Q000k285j1478
2288G998j5504j1648k439P663J4175J4237P285l171j1969j4979j1007j901Q357
2301a2903J4313J3715O384l829j2125j4925j0429j025R081J4460J3193N612m547
2314A6975j2783j4414r711k16R631J4116J2664N011n340j2807j4306q911N73J0022
2328i496J4458J1930L813n772j3011j3902q219J549J0181J4193J1766L029o579
2341A3940j3413j3267p394K113J0771J4284J0732K394p157j3362j3156o536K936
2354a7115J0958J4250J0078J488p995j3206j2785n822L728J1650J3582R614N11
$$ plain form
2367 18936 10681 -2795 -14860 -19978 -15449 -3645 9647 18774 18392 9645 -3662 -15277 -19611
2380 -19611 -14528 -2543 10596 18634 17749 8557 -4733 -15607 -19321 -13607 -1462 11306 18598
2393 18598 17212 7495 -5724 -16306 -18899 -12657 -544 11968 18824 16436 6530 -6481 -16589
2406 -16589 -18492 -11703 516 12721 18744 15789 5540 -7465 -16978 -18037 -10741 1788 13178
2419 13178 18662 15272 4096 -8294 -17031 -17545 -9902 2805 13876 18304 14349 3271 -9323
2432 -9323 -17219 -17130 -8981 3442 14338 18171 13246 2315 -9967 -17470 -16541 -7749 4602 14926
2446 14926 18124 12387 1064 -10553 -17435 -16088 -6712 5647 15177 17738 11726 145 -11525
2459 -11525 -17523 -15169 -5826 6526 15539 17168 10764 -848 -12151 -17357 -14338 -4769 7233 15991
$$ packed form
2367A8936q255j3476j2065n118M529J1804J3292R127l82q747j3307j1615m334
2380a9611N083J1985J3139Q038q85r192j3290j0874l714N714J2145J2768P292
2393A8598j386r717j3219j0582k593O242J2113J2512O856k388r906j3011j0108
2406a6589j903O789J2219J2205O023k955j0249j3005r513j059P296J2529J1390
2419A3178N484l390j1176j2390q737n14P643J2707J1071M428l955j1078j2594
2432i323p896Q9Q149J2423J0896L833m925j0931j2282p503R29Q792J2351J0324
2446A4926L198n737j1323j1617o882J347R376J2359R530K561o012j1581j1670
2459a1525n998K354R343J2352R013J629o404j1612j1303n206L019R569J2002Q758
$$ plain form
2473 15991 16635 9601 -1935 -12716 -17301 -13709 -3625 8216 16010 16374 8694 -2845 -13060 -17214
2487 -17214 -12889 -2633 9070 16409 15808 7826 -3798 -13639 -16851 -12222 -1664 9588 16465 15224
2501 15224 6884 -4683 -14096 -16664 -11368 -632 10286 16564 14563 5913 -5537 -14426 -16679 -10603
2515 -10603 519 11127 16230 14026 5195 -6529 -14694 -16032 -9658 1308 11557 16408 13415
2528 13415 4029 -7214 -14991 -15424 -8736 2087 12028 16299 12623 2903 -7995 -15067 -15131 -7911 3079
2543 3079 12466 16049 11808 1930 -8658 -15240 -14642 -6841 4023 12903 15723 11031 971 -9405
2557 -9405 -15283 -13968 -5879 4809 13284 15651 10283 36 -9946 -15307 -13477 -5136 5645 13887
2571 13887 15164 9382 -777 -10653 -15302 -12811 -4045 6376 13927 14742 8499 -1443 -11069 -15132
$$ packed form
2473A5991O44p034j1536j0781m585L592J0084J1841P794L64p680j1539j0215m154
2487a7214M325J0256J1703P339o01p982j1624r841l212M629J0558J1252O877j241
2501A5224q340j1567r413k568N296J0736J0918O278k001q650j1450q889k253O076
2515a0603J1122J0608N103k204q831j1724q165j338O374J0966J0249M851k993
2528A3415r386j1243p777m33O688J0823R941M271l676r720j0898p072o4P220J0990
2543C079R387L583m241r878j0588o582N98P801J0864Q880K820m692j0060j0376
2557i405n878J315Q089J0688Q475K367n368j0247r982n361J830Q341J0781Q242
2571A3887J277n782j0159r876m649K491Q766J0421P551Q15o243r942r626m063
$$ plain form
2585 -15132 -12097 -3258 7097 14188 14351 7727 -2522 -11621 -15077 -11460 -2398 7876 14269 13926
2599 13926 6867 -3319 -11915 -14931 -10848 -1645 8410 14261 13415 6127 -4112 -12179 -14802 -10068
2613 -10068 -717 9178 14273 12902 5255 -4804 -12718 -14392 -9015 360 9715 14401 12332 4408
2627 4408 -5472 -12815 -14148 -8689 999 9779 14131 11695 3523 -6360 -13043 -13751 -7773 1811 10452
2642 10452 14202 11201 2892 -6952 -13331 -13224 -6978 2696 10961 14157 10489 2075 -7436 -13308 -12849
2657 -12849 -6365 3242 11223 13917 9935 1174 -7955 -13561 -12482 -5255 4197 11558 13686 9131 369
2672 369 -8595 -13484 -11832 -4930 4610 11732 13413 8656 -169 -9137 -13649 -11267 -4000 5363 11985
2687 11985 13072 7842 -1040 -9508 -13426 -10726 -3112 5922 12417 12715 7070 -1790 -9914 -13182 -10254
$$ packed form
2585a5132L035Q839J0355P091J63o624j0249r099l456L617R062J0274O393l43
2599A3926p059j0186q596l016M083R203J0055N851q46p288j0239q067k623M734
2613a0068R351R895N095j371p647j0059p914j674N377R375R355M686k069p924
2627D408r880p343j333N459R688Q780M352k436q172r883o683p08N978R584Q641
2642A0452L750l001q309r844o379J07O246R674Q265L196l668q414r511n872M59
2657a2849O484R607P981K694l982q761r129n606J079P227R452P361K128m555q762
2672C69q964m889J652O902R540P122J681m757q825q968m512K382P267R363O622
2687A1985J087n230q882q468l918K700P614R034O495K98n645q860q124l268K928
$$ plain form
2702 -10254 -2462 6486 12393 12321 6277 -2525 -10210 -13278 -9774 -1463 6975 12485 11755 5680 -3164
2717 -3164 -10741 -12934 -9145 -861 7509 12634 11390 4830 -3996 -10861 -12641 -8235 -266 7880 12599
2732 12599 10995 4305 -4428 -10954 -12322 -7756 554 8533 12592 10478 3520 -5008 -11275 -12117 -7171
2747 -7171 1113 8868 12310 9976 2704 -5531 -11540 -11759 -6410 1798 9303 12248 9513 2049 -6224
2762 -6224 -11563 -11272 -5670 2666 9554 12204 8735 1485 -6711 -11421 -10990 -5289 3176 9827 12020
2777 12020 8389 734 -7088 -11700 -10618 -4485 3623 10069 11630 7709 -29 -7631 -11696 -9974 -3876
2792 -3876 4139 10393 11519 7143 -478 -7828 -11523 -9757 -3249 4639 10354 11209 6572 -979 -8249
2807 -8249 -11533 -9413 -2632 5241 10554 10898 5919 -1671 -8723 -11317 -8888 -1950 5613 10730 10487
$$ packed form
2702a0254P792Q948N907p2o044q802p685l068L504Q311Q438N510p30o075q844
2717c164p577k193L789Q284Q370N125j244o560q826o865j780M406P969Q146M719
2732A2599j604o690q733o526j368M566Q310P979M059k114o958q528o267q42M946
2747g171Q284P755L442k334p272q235o009k19N349Q208P505K945k735p464q273
2762f224n339K91N602Q336O888K650l469p250q196m710M31N701Q465O651K193
2777A2020l631p655p822m612J082O133Q108O446J561l921p738p602m065J722O098
2792c876Q015O254J126m376p621p350l695J766O508P888N715Q55m637p551p270
2807h249l284K120O781P873N313L44m979p590p052k594K429O938P563N117k43
$$ plain form
2822 10487 5341 -2336 -8979 -11395 -8262 -1418 6125 10663 10140 4695 -2835 -9119 -11210 -7788 -581
2837 -581 6476 10848 9756 4281 -3596 -9349 -10775 -7296 -26 7137 10907 9322 3655 -3838 -9664
2852 -9664 -10682 -6653 499 7562 10548 9096 2956 -4262 -9787 -10227 -5973 1062 7677 10535 8531
2867 8531 2342 -4959 -9762 -10028 -5382 1623 7933 10457 7981 1802 -5297 -9917 -9705 -4698 2211
2882 2211 8382 10485 7612 1205 -5765 -9863 -9268 -4181 2915 8495 10196 7033 510 -6193 -9831
2897 -9831 -8890 -3660 3243 8773 9866 6478 -160 -6638 -9983 -8621 -3020 3753 8799 9717 5912
2912 5912 -662 -6967 -10013 -8043 -2392 4411 9018 9422 5197 -1455 -7371 -9905 -7503 -1823 4720
2927 4720 9194 9257 4748 -1914 -7447 -9801 -7337 -1409 5299 9163 8901 4179 -2356 -7903 -9573 -6928
$$ packed form
2822A0487n146p677o643k416L133O844P543M538n23n445p530o284k091L422P207
2837e81P057M372j092n475p877n753j426L479P270P163L770j585n667p493n826
2852i664j018M029P152P063K986j452o140p218n525m40M254P035O615K858k004
2867H531o189p301m803k66M646P005O310K524k476o179p099m620K12N007O909
2882B211O171K103k873o407o970m098N95N087P096N580J701l163o523o703l638
2897i831R41N230O903N530J093l388o638o478l345J362N601O773N046R18l805
2912E912o574o305l046J970N651O803M607M04m225o652n916k534K402N680O543
2927D720M474O3m509o662n533k354K464N928O708L864k62m722o535n547j670K645
$$ plain form
2943 -6928 -790 5623 9267 8483 3729 -2756 -8145 -9318 -6064 -247 5888 9203 8061 3412 -3388
2958 -3388 -8181 -9209 -5617 418 6306 9210 7847 2582 -3853 -8199 -8808 -5174 960 6638 9171
2973 9171 7398 2049 -4343 -8461 -8568 -4785 1505 6945 9068 6811 1508 -4665 -8527 -8427 -4219
2988 -4219 1799 7012 8859 6350 932 -4979 -8491 -8211 -3599 2380 7335 8889 6173 481 -5296
3003 -5296 -8587 -7947 -3333 2825 7388 8689 5644 60 -5636 -8554 -7311 -2878 3192 7695 8467
3018 8467 5134 -491 -5664 -8528 -7146 -2222 3607 7694 8223 4842 -942 -6056 -8431 -6699 -1872
3033 -1872 3923 7743 7985 4210 -1573 -6564 -8330 -6403 -1355 4461 7841 7572 3734 -1857 -6651
3048 -6651 -8201 -5750 -693 4746 7988 7382 3383 -2410 -6841 -8169 -5536 -136 5004 7848 7173
$$ packed form
2943f928O138O413L644p84m754o485n389j173L254N817O135L315j142m649o800
2958c388m793j028L592O035N888K904j363n265o435m346o09L634O134N678K533
2973I171j773n349o392m118j07L783O290N440K123k257n303o173l862J00M208
2988d219O018N213J847k509n418n911l512K80M612N979M955J554k716n692n777
3003e296l291O40M614O158M563J301l045n584n696k918J243M433O070M503P72
3018H467l333n625n173k864J382M924N829M087N29l381n784n114k375J732M827
3033a872N795L820K42l775n783m991j766J927N048N816L380k69l838n591m794
3048f651j550K451N057N439L242o06l999n793m431j328K633N400N140K844o75
$$ plain form
3063 7173 2825 -2753 -6903 -8162 -4982 203 5349 7803 6732 2333 -3187 -7048 -7681 -4582 578
3078 578 5677 7840 6367 1873 -3533 -7444 -7656 -4205 1072 5863 7702 6066 1518 -3759 -7366
3093 -7366 -7201 -3780 1468 6132 7559 5612 936 -4333 -7483 -6975 -3420 2051 6376 7669 5174
3108 5174 449 -4525 -7300 -6757 -2852 2266 6502 7456 4823 287 -4713 -7248 -6385 -2429 2881 6625
3124 6625 7190 4474 -238 -5025 -7327 -6128 -1956 3071 6620 7184 4120 -657 -5283 -7236 -5915
3139 -5915 -1467 3456 6684 6960 3764 -1105 -5497 -7219 -5416 -1281 3836 6758 6725 3272 -1506 -5649
3155 -5649 -6935 -5252 -802 3860 6727 6466 3126 -1823 -5853 -7012 -4879 -382 4173 6798 6162
3170 6162 2461 -2152 -5963 -6810 -4530 52 4486 6976 6027 2191 -2263 -6143 -6631 -4196 408 4828
$$ packed form
3063G173m348n578m150j259L180N185N146K454j071m399n520l861o33L099N160
3078E78N099K163j473m494n406l911k12L451N277M791J839j636m548n277l607
3093g366J65L421N248M664J427j947m676n269l150N08L555N471M325J293k495
3108E174m725m974k775N43L905N118M236R54k633m536n000k535Q63L956N310L744
3124F625N65k716m712m787k302J199M172N027L549N64l064m777m626j953J321
3139e915M448M923L228K76l196m869m392j722J803M135N117K922l3l453m778m143
3155e649j286J683M450M662K867k61l340m949m030j159K133M497M555K625o36
3170F162l701m613l811q47K280M582M434K490r49l836m454l880m88K435M604M420
$$ plain form
3186 4828 6826 5859 1938 -2824 -6060 -6554 -3814 788 4954 6873 5293 1385 -3152 -6306 -6447 -3498
3202 -3498 1116 4978 6637 5099 1063 -3400 -6323 -6212 -3034 1245 5166 6553 4733 772 -3704
3217 -3704 -6362 -5968 -2819 1817 5294 6455 4405 218 -3827 -6350 -5558 -2346 1921 5482 6288 4198
3233 4198 -67 -4102 -6292 -5372 -1964 2328 5576 6151 3897 -583 -4405 -6248 -5136 -1587 2640
3248 2640 5666 6026 3312 -806 -4482 -6227 -4958 -1227 2923 5774 5746 3072 -974 -4901 -6186 -4514
3264 -4514 -769 3271 5737 5592 2677 -1315 -4937 -6072 -4233 -551 3483 5799 5240 2462 -1699
3279 -1699 -5149 -5854 -3977 -241 3795 5838 5230 2174 -1997 -5069 -5694 -3817 227 3962 5831 5002
3295 5002 1701 -2207 -5198 -5644 -3521 409 4005 5622 4708 1481 -2400 -5403 -5638 -3199 717 4188
$$ packed form
3186D828J998r67l921m762l236m94K740M602M166J919j580l908m537l154j41K949
3202c498M614L862J659j538m036m463k923J11L178M279L921J387j820l961m476
3217c704k658L94L149M636L477J161k050m187m045k523P92L212M267L561Q06k090
3233D198m265m035k190R20L408M292L248N75k254m480l822j843J112L549M227
3248B640L026L60k714m118l676j745J269L731M150K851k8k674m046l927j285J672
3264d514L745M040K466j45k915l992l622j135J839L682M034K316n59k778m161
3279a699l450p05J877L736M036K043o08l056m171l072o25J877M044L735J869q29
3295E002l301l908k991m46K123L930L596J617r14l227l881l003k35K439L916L471
$$ plain form
3311 4188 5633 4460 1071 -2669 -5286 -5332 -2712 955 4375 5657 4239 709 -3010 -5166 -5270 -2440
3327 -2440 1292 4632 5531 3778 452 -3288 -5319 -5040 -2298 1657 4638 5473 3618 60 -3306 -5385
3343 -5385 -4730 -1967 1902 4768 5232 3307 -263 -3734 -5220 -4499 -1472 2252 4852 5283 3158 -399
3359 -399 -3835 -5273 -4403 -1162 2372 4881 5083 2827 -747 -3856 -5137 -4088 -1100 2714 4945 4912
3375 4912 2431 -1074 -4133 -5080 -3948 -624 2884 5000 4671 2191 -1372 -4230 -5117 -3480 -191 3117
3391 3117 5012 4472 2030 -1483 -4331 -4930 -3206 -199 3300 4919 4234 1677 -1670 -4407 -4656 -2964
3407 -2964 227 3411 4885 4177 1550 -2102 -4468 -4731 -2641 489 3483 4708 3731 885 -2285 -4383
3423 -4383 -4511 -2343 591 3724 4873 3666 852 -2625 -4551 -4427 -2255 1103 3663 4696 3466
$$ packed form
3311D188J445j173l389l740k617m6K620L667L420J282j418l530l719k156j04K830
3327b440L732L340Q99j753l326l740k031K79K742L955K981Q35j855l558l366k079
3343e385O55K763L869K866M64j925l570l471j486P21L027L724K600M31k125l557
3359c99l436j438Q70L241L534K509K02k256l574l109j281J049K988L814K231l3
3375D912k481l505l059r47J132L324L508K116l29k480l563k858q87J637L289L308
3391C117J895n40k442l513k848n99J724L007L499J619o85k557l347k737k49J692
3407b964L191L184J474p08k627l652k366k63K090L130K994J225r77k846l170k098
3423d383j28K168K934L133J149j207k814l477j926J24K172L358K560J033j230
$$ plain form
3438 3466 649 -2788 -4561 -4319 -2031 1357 3914 4494 3202 403 -2977 -4633 -4090 -1562 1633 3920
3454 3920 4645 2972 82 -2943 -4564 -4039 -1398 1840 3985 4639 2614 -322 -3237 -4594 -3607 -1112
3470 -1112 1881 4055 4207 2478 -538 -3394 -4513 -3415 -870 2098 4148 4205 2323 -772 -3320 -4547
3486 -4547 -3529 -525 2390 4193 4020 1964 -926 -3448 -4366 -3005 -286 2411 4162 3884 1736 -1184
3502 -1184 -3587 -4075 -2858 -94 2761 4093 3526 1392 -1631 -3706 -4025 -2647 213 2781 4250 3450
3518 3450 1188 -1711 -3711 -3938 -2215 462 2927 4172 3349 970 -1855 -3800 -3870 -2107 592 3096
3534 3096 4198 3053 786 -2071 -3849 -3723 -1885 878 3072 4075 2735 287 -2238 -3922 -3675
3549 -3675 -1760 935 3383 3923 2632 210 -2344 -3859 -3357 -1498 1259 3105 3984 2577 119 -2558
$$ packed form
3438C466k817l437j773K42K288L388K557N80j292k799l380j656N43K528L195K287
3454C920P25j673k890l025j621N25K641L238K145O54k025k936k915j357R87K495
3470a112K993K174J52j729l016k856j119J098K545K968K050N7j882l095k548j227
3486d547J018L004K915J803j73k056k890k522r18J361K719K697J751k78k148k920
3502a184k403m88J217K764K855J332n67k134l023k075l19J378K860K568J469q00
3518C450k262k899k000k27J723K677K465J245q23k379k825j945p0J763K699K504
3534C096J102j145k267k857j778J26J838K763K194J003j340k448k525j684K47
3549c675J915K695K448N40j291k422k554j515N02J859K757J846Q79j407k458k677
$$ plain form
3565 -2558 -3983 -3314 -1095 1441 3553 3758 2181 -12 -2634 -3806 -3054 -1025 1781 3495 3501 2119
3581 2119 -386 -2721 -3639 -2977 -844 1745 3342 3546 1945 -489 -2874 -3722 -2817 -572 1893 3676
3597 3676 3495 1786 -1010 -2894 -3688 -2753 -333 2113 3580 3181 1465 -977 -3171 -3533 -2453 -224
3613 -224 2280 3503 3062 1153 -1390 -3155 -3457 -2245 196 2402 3657 3015 1060 -1357 -3251 -3242 -1996
3630 -1996 394 2636 3451 2833 998 -1583 -3095 -3235 -1907 612 2578 3256 2687 728 -1663 -3188
3646 -3188 -3132 -1582 766 2914 3344 2457 328 -2033 -3360 -3169 -1440 860 2780 3301 2259 160
3662 160 -1818 -3413 -2893 -1278 1162 2809 3336 2043 -60 -2201 -3244 -2715 -1048 1313 2936 3273
3678 3273 1995 -273 -2174 -3292 -2827 -820 1358 3234 3127 1806 -458 -2337 -3267 -2476 -714 1428
$$ packed form
3565b558j425O69K219K536K112K05j577k193k622j172P52K029K806J714Oj382
3581B119k505k335r18O62K133K589J597K04j601k434k385q48R05K245K465J783
3597C676j81j709k796j884p94R35K420K446J467l99j716k442k194l62J080K229
3613b24K504J223m41j909k543j765l02J212K441K206J255o42j955k417j894RJ246
3630a996K390K242Q15o18j835k581j512j40J328K519J966O78n69j959k391j525
3646c188N6J550K348K148M30q87k129k361j327J91J729K300J920N21j042k099
3662A60j978j595N20J615K440J647N27j293k103k141j043N29J667K361J623L37
3678C273j278k268j901j118M65K007K178J876j07j321k264j879r30P91J762K142
$$ plain form
3694 1428 3032 3038 1475 -416 -2384 -3016 -2410 -573 1759 3057 2889 1398 -766 -2420 -3037 -2147 -195
3711 -195 1691 3030 2964 1239 -961 -2627 -3035 -2037 -96 1899 2853 2720 1047 -1037 -2500 -3029 -2033
3728 -2033 93 2065 3062 2471 852 -978 -2554 -2786 -1678 358 2208 2943 2471 871 -1258 -2812
3744 -2812 -2814 -1543 563 2273 2797 2284 352 -1530 -2690 -2808 -1446 640 2275 3054 2196 502 -1495
3761 -1495 -2715 -2593 -1385 745 2453 2878 1919 133 -1709 -2709 -2580 -965 891 2349 2681 1856
$$ packed form
3694A428J604Oj563j891j968o32O06J837K332J298j68j491k164j654o17Q90J952
3711a95J886J339o6j725k200j666m08R98J941J995R54j33j673k084j463n29R96
3728b033K126J972R97n91j619j830j576k32J108K036J850P35m72j600k129j554
3744b812kJ271K106J710N24n13j932j882j160j18J362K086J635P79q58j694j997
3761a495j220J22J208K130J708M25r59j786j842j000J29J615J856J458L32q25
$$ [...]
8191A35
##END NTUPLES=NMR FID
##END=
