##TITLE=1H_LR-0138-C1-EtOAc
 CD3CN
 8 sc, 
 14.3.2023
##JCAMPDX= 6.0         $$ Bruker NMR JCAMP-DX V2.0
##DATA TYPE= NMR FID
##DATA CLASS= NTUPLES
##ORIGIN= UXNMR, Bruker Analytische Messtechnik GmbH
##OWNER= root
$$ XWIN-NMR		Version 3.5
$$ Tue Mar 14 14:50:06 2023 Russian Standard Time (UT+4h)  she@DPX200
##.OBSERVE FREQUENCY= 200.13135
##.OBSERVE NUCLEUS= ^1H
##.DELAY= (6, 6)
##.ACQUISITION MODE= SIMULTANEOUS
##.ACQUISITION SCHEME= undefined
##.AVERAGES= 8
##.DIGITISER RES= 18
##SPECTROMETER/DATA SYSTEM= spect
##.PULSE SEQUENCE= zg30
##.SOLVENT NAME= CDCl3
##.SHIFT REFERENCE= (INTERNAL, CDCl3, 0, 15.7039)
##AUDIT TRAIL= $$ (NUMBER, WHEN, WHO, WHERE, WHAT)
$$ ##TITLE= Audit trail, XWIN-NMR		Version 3.5
$$ ##JCAMPDX= 5.01
$$ ##ORIGIN= Bruker BioSpin GmbH
$$ ##OWNER= she
$$ F:/spectra/data/she/nmr/H-F/1/audita.txt
$$ ##AUDIT TRAIL=  $$ (NUMBER, WHEN, WHO, WHERE, WHAT)
(   1,<2023-03-14 14:48:48.51 +0400>,<she>,<DPX200>,
      <created by zg, POWCHK disabled, PULCHK disabled
       configuration hash MD5:
       00 E9 B6 7A A2 85 ED C7 34 08 36 98 17 FE 4E 26
       data hash MD5: 16K
       ED 88 74 24 63 B8 41 CA 81 3D 0C D9 75 E4 D4 3F>)
$$ ##END=
$$ 
$$ hash MD5
$$ 88 D6 41 40 1E 48 D3 24 49 86 C0 CC 72 D9 3C 56
##$RELAX= 
##$RELAX= 
##$RELAX= 
##$RELAX= 
##$RELAX= 
##$RELAX= 
$$ Bruker specific parameters
$$ --------------------------
##$DU= <F:/spectra>
##$EXPNO= 1
##$NAME= <H-F>
##$PROCNO= 1
##$TYPE= <nmr>
##$USER= <she>
##$AMP= (0..31)
100 100 100 100 100 100 100 100 100 100 100 100 100 100 100 100 100 100 
100 100 100 100 100 100 100 100 100 100 100 100 100 100 
##$AQSEQ= 0
##$AQ_mod= 1
##$AUNM= <au_zg>
##$AUTOPOS= <>
##$BF1= 200.13
##$BF2= 200.13
##$BF3= 200.13
##$BF4= 200.13
##$BF5= 200.13
##$BF6= 200.13
##$BF7= 200.13
##$BF8= 200.13
##$BYTORDA= 1
##$CFDGTYP= 0
##$CFRGTYP= 5
##$CHEMSTR= <none>
##$CNST= (0..31)
1 1 145 1 1 1 1 1 1 1 1 1 1 1 1 1 1 1 1 1 1 1 1 1 1 1 1 1 1 1 1 1 
##$CPDPRG= <>
##$CPDPRG1= <>
##$CPDPRG2= <>
##$CPDPRG3= <>
##$CPDPRG4= <mlev>
##$CPDPRG5= <mlev>
##$CPDPRG6= <mlev>
##$CPDPRG7= <mlev>
##$CPDPRG8= <mlev>
##$CPDPRGB= <>
##$CPDPRGT= <>
##$D= (0..31)
0 1.2 0 0 0 0 0 0 0 0.06 0 0.03 0 0 0 0 0.0002 0 0 0 0 0 0 0 0 0 0 0 0 
0 0 0 
##$DATE= 1678790927
##$DBL= (0..7)
120 120 120 120 120 120 120 120 
##$DBP= (0..7)
150 150 150 150 150 150 150 150 
##$DBP07= 0
##$DBPNAM0= <>
##$DBPNAM1= <>
##$DBPNAM2= <>
##$DBPNAM3= <>
##$DBPNAM4= <>
##$DBPNAM5= <>
##$DBPNAM6= <>
##$DBPNAM7= <>
##$DBPOAL= (0..7)
0.5 0.5 0.5 0.5 0.5 0.5 0.5 0.5 
##$DBPOFFS= (0..7)
0 0 0 0 0 0 0 0 
##$DE= 6
##$DECBNUC= <off>
##$DECIM= 32
##$DECNUC= <off>
##$DECSTAT= 4
##$DIGMOD= 1
##$DIGTYP= 9
##$DL= (0..7)
0 120 120 120 120 120 120 120 
##$DP= (0..7)
150 150 150 150 150 150 150 150 
##$DP07= 0
##$DPNAME0= <>
##$DPNAME1= <>
##$DPNAME2= <>
##$DPNAME3= <>
##$DPNAME4= <>
##$DPNAME5= <>
##$DPNAME6= <>
##$DPNAME7= <>
##$DPOAL= (0..7)
0.5 0.5 0.5 0.5 0.5 0.5 0.5 0.5 
##$DPOFFS= (0..7)
0 0 0 0 0 0 0 0 
##$DQDMODE= 0
##$DR= 18
##$DS= 0
##$DSLIST= <SSSSSSSSSSSSSSS>
$$ [...]
##$SUBNAM2= <"">
##$SUBNAM3= <"">
##$SUBNAM4= <"">
##$SUBNAM5= <"">
##$SUBNAM6= <"">
##$SUBNAM7= <"">
##$SUBNAM8= <"">
##$SUBNAM9= <"">
##$SW= 18.05172834244
##$SWIBOX= (0..15)
0 0 2 0 0 0 0 0 0 0 0 0 0 0 0 0 
##$SW_h= 3612.71676300578
##$TD= 16384
##$TD0= 1
##$TE= 0
##$TE2= 300
##$TE3= 300
##$TEG= 300
##$TL= (0..7)
0 120 120 120 120 120 120 120 
##$TP= (0..7)
150 150 150 150 150 150 150 150 
##$TP07= 0
##$TPNAME0= <>
##$TPNAME1= <>
##$TPNAME2= <>
##$TPNAME3= <>
##$TPNAME4= <>
##$TPNAME5= <>
##$TPNAME6= <>
##$TPNAME7= <>
##$TPOAL= (0..7)
0.5 0.5 0.5 0.5 0.5 0.5 0.5 0.5 
##$TPOFFS= (0..7)
0 0 0 0 0 0 0 0 
##$TUNHIN= 0
##$TUNHOUT= 0
##$TUNXOUT= 0
##$USERA1= <user>
##$USERA2= <user>
##$USERA3= <user>
##$USERA4= <user>
##$USERA5= <user>
##$V9= 5
##$VALIST= <valist>
##$VCLIST= <CCCCCCCCCCCCCCC>
##$VD= 0
##$VDLIST= <DDDDDDDDDDDDDDD>
##$VPLIST= <PPPPPPPPPPPPPPP>
##$VTLIST= <TTTTTTTTTTTTTTT>
##$WBST= 1024
##$WBSW= 4
##$XGAIN= (0..3)
0 0 0 0 
##$XL= 0
##$YL= 0
##$YMAX_a= 321284
##$YMIN_a= -491591
##$ZGOPTNS= <>
##$ZL1= 120
##$ZL2= 120
##$ZL3= 120
##$ZL4= 120
##$ABSF1= 10
##$ABSF2= 0
##$ABSG= 5
##$ABSL= 3
##$ALPHA= 0
##$AQORDER= 0
##$ASSFAC= 0
##$ASSFACI= 0
##$ASSFACX= 0
##$ASSWID= 0
##$AUNMP= <proc_1d>
##$AZFE= 0.1
##$AZFW= 0.1
##$BCFW= 1
##$BC_mod= 2
##$BYTORDP= 1
##$COROFFS= 0
##$CY= 11.3945322036743
##$DATMOD= 1
##$DC= 2
##$DFILT= <>
##$DTYPP= 0
##$F1P= 2.36226072786647
##$F2P= -0.459571619588291
##$FCOR= 0.5
##$FTSIZE= 0
##$FT_mod= 4
##$GAMMA= 1
##$GB= 0.15
##$INTBC= 1
##$INTSCL= 1
##$ISEN= 128
##$LB= 0.24
##$LEV0= 0
##$LPBIN= 0
##$MAXI= 10000
##$MC2= 0
##$MEAN= 0
##$ME_mod= 0
##$MI= 1.114404
##$NCOEF= 0
##$NC_proc= 0
##$NLEV= 6
##$NOISF1= 3.799351
##$NOISF2= 2.8
##$NSP= 1
##$NTH_PI= 0
##$NZP= 0
##$OFFSET= 15.70392
##$PC= 1
##$PHC0= -19111.71
##$PHC1= 19.20074
##$PH_mod= 1
##$PKNL= yes
##$PPARMOD= 0
##$PSCAL= 0
##$PSIGN= 0
##$REVERSE= no
##$SF= 200.130013532006
##$SI= 16384
##$SIGF1= 3
##$SIGF2= 2
##$SINO= 400
##$SIOLD= 16384
##$SREGLST= <1H.CDCl3>
##$SSB= 0
##$STSI= 0
##$STSR= 0
##$SW_p= 3612.71676300578
##$SYMM= 0
##$S_DEV= 0
##$TDeff= 0
##$TDoff= 0
##$TI= <>
##$TILT= no
##$TM1= 0
##$TM2= 0
##$TOPLEV= 0
##$USERP1= <user>
##$USERP2= <user>
##$USERP3= <user>
##$USERP4= <user>
##$USERP5= <user>
##$WDW= 1
##$XDIM= 8192
##$YMAX_p= 0
##$YMIN_p= 0
$$ End of Bruker specific parameters
$$ ---------------------------------
##NTUPLES= NMR FID
##VAR_NAME=  TIME,          FID/REAL,        FID/IMAG
##SYMBOL=    X,             R,               I
##VAR_TYPE=  INDEPENDENT,   DEPENDENT,       DEPENDENT
##VAR_FORM=  AFFN,          ASDF,            ASDF
##VAR_DIM=   8192,          8192,            8192
##UNITS=     SECONDS,       ARBITRARY UNITS, ARBITRARY UNITS
##FACTOR=    0.0002768,     1,               1
##FIRST=     0,             0,               0
##LAST=      2.2672688,     0,               0
##MIN=       0,             -491591,         0
##MAX=       2.2672688,     321284,          0
$$ Real data points
##PAGE= N=1
##DATA TABLE= (X++(R..R)), XYDATA
$$ [...]
$$ plain form
1898 -238 -172 -343 -91 244 487 487 -83 93 -332 -458 -233 316 361 -63 417 496 285 205 79 245 117 -50
1920 -50 114 305 -451 -638 -469 -304 -5 119 373 110 131 194 -160 -151 -271 -281 -95 12 82 88 -144 -240 -23
1943 -23 268 485 604 385 83 -253 -304 33 -212 -221 -57 -254 137 57 -139 -424 -128 26 398 118 228 -265
1965 -265 -419 -515 -298 -103 113 335 359 388 380 714 232 -214 -133 77 157 11 -240 -577 -328 -395 325 523 212
1988 212 -78 162 38 -203 81 -364 -70 -68 15 63 41 144 18 101 172 501 286 159 -58 -323 -113 -85 -194
2011 -194 -341 -142 240 443 20 168 17 -240 277 178 103 84 -98 -435 -332 -23 -121 -98 47 252 382 198
2033 198 222 -103 -131 -269 -224 11 163 -304 -566 -54 -103 -209 195 314 305 264 120 -36 -506 -379 -162 96
2055 96 182 53 150 81 138 152 363 469 86 -93 -207 -196 -253 -385 -306 -245 -52 358 502 459 265 -209 -520 -205
$$ packed form
1898b38O6j71K52L35K43%n70J76m25j26K25N49M5m24M80P9k11q0j26J66j28j67
1920e0J64J91p56j87J69J65K99J24K54k63K1O3l54Rj20j0J86J07P0Ok32r6K17
1943b3K91K17J19k19l02l36n1L37k45rJ64j97L91q0j96k85K96J54L72k80J10m93
1965b65j54r6K17J95K16K22K4K9qL34m82m46Q1K10Q0j46k51l37K49o7P20J98l11
1988B12k90K40j24k41K84m45K94KQ3M8k2J03j26Q3P1L29k15j27k17k65K10K8j09
2011a94j47J99L82K03m23J48j51k57N17r9p5j9j82l37J03L09r8K3J45K05J30j84
2033A98K4l25k8j38M5K35J52m67k62N12m9j06M04J19rm1j44j56m70J27K17K58
2055I6Q6j29R7o9N7J4K11J06l83j79j14J1n7j32P9O1J93M10J44m3j94m74l11L15
$$ plain form
2079 -205 -9 22 202 -87 -102 8 -152 -248 278 449 144 287 232 26 -304 -490 -312 -288 -96 -28 -263 8
2101 8 -142 70 208 200 79 21 245 9 -241 -374 -313 -333 -110 284 149 165 323 -10 34 283 288 -171 -51 -133
2125 -133 -573 -368 -396 -234 -218 78 305 499 641 204 -19 135 35 -158 -85 -92 -379 226 -153 -96 92 146
2147 146 146 333 236 146 -483 -241 -547 -582 -93 -22 -158 -174 117 108 -41 202 234 -124 -175 40 -98 269 25 -472
2171 -472 -282 312 349 473 265 98 -385 -28 -125 -119 -152 42 -11 -370 -57 -12 -294 -15 104 450 455 302 -94
2194 -94 -396 -218 -97 4 -14 -125 -41 405 487 107 23 -2 -154 10 246 -53 -333 -551 -519 -254 -87 -59 238
2217 238 276 113 121 305 260 66 -31 164 110 -150 -44 -16 93 -156 244 465 270 -92 -27 -56 -299 -339 -90
2240 -90 -275 -312 53 103 31 105 155 22 279 320 42 300 -181 -394 -380 77 -281 -148 149 27 -49 110 81
$$ packed form
2079b05J96L1J80k89j5J10j60r6N26J71l05J43n5k06l30j86J78K4J92O8k35K71
2101Hj50K12J38qj21n8K24k36k50j33O1k0K23L94j35J6J58l33M4K49Nm59J20q2
2125a33m40K05k8J62J6K96K27J94J42m37k23J54j00j93P3pk87O05l79N7J88N4
2147A46%J87r7r0o29K42l06l5M89P1j36j6K91rj49K43L2l58n1K15j38L67k44m97
2171d72J90N94L7J24k08j67m83L57r7Ol3J94n3l59L13M5k82K79J19L46Nj53l96
2194i4l02J78J21J01j8j11Q4M46Q2l80q4k5j52J64K36k99k80k18L2K65J67K8K97
2217B38L8j63QJ84m5j94r7J95n4k60J06K8J09k49M00K21j95l62O5k9k43m0K49
2240i0j85l7L65N0p2P4N0j33K57M1k78K58m81k13J4M57l58J33K97j22p6J59k9
$$ plain form
2263 81 -137 -242 -85 -154 -345 -398 -93 127 -254 -386 220 281 126 575 355 458 230 -231 -109 -92 -264 189
2285 189 128 55 -309 -28 40 92 -59 430 -51 105 86 86 -204 -256 -255 48 137 262 168 494 -337 -440 97 98 101
2310 101 -225 35 -68 -329 -345 -68 -184 -77 196 254 231 -80 -71 30 -22 -7 167 -52 -145 -388 308 53 64
2333 64 95 286 28 174 36 63 -67 -165 -169 -351 36 62 162 -1 136 35 257 57 -130 259 233 -9 -161
2356 -161 -240 -180 -125 -250 184 353 221 313 -11 166 -108 -14 -9 -126 -134 -188 25 -107 -232 215 88 -108 185
2379 185 199 106 -38 13 -206 -256 169 12 143 24 205 149 81 358 75 51 252 -193 -83 -287 -407 -28
2401 -28 -122 233 -24 -82 147 298 86 277 -24 -199 218 136 -91 -140 -170 114 227 292 86 226 309 -60 -63
2424 -63 -59 -103 -328 -106 -152 -260 -74 -100 42 -131 138 98 89 228 -70 -156 -130 -33 63 3 -66 -60 283 82 304 211
$$ packed form
2263H1k18j05J57o9j91n3L05K20l81j32O06O1j55M49k20J03k28m61J22J7j72M53
2285A89o1p3l64K81O8N2j51M89m81J56j9%k90n2JL03Q9J25r4L26q31j03N37JL
2310A01l26K60j03k61j6K77j16J07K73N8k3l11RJ01n2J5J74k19r3k43O96k55J1
2333F4L1J91k58J46j38K7j30r8mj82L87K6J00j63J37j01K22k00j87L89k6k42j52
2356a61p9O0N5j25M34J69j32R2l24J77k74R4Nj17qn4K13j32j25M47j27j96K93
2379A85J4r3j44N1k19n0M25j57J31j19J81n6o8K77k83k4K01m45J10k04j20L79
2401b8r4L55k57n8K29J51k12J91l01j75M17q2k27m9l0K84J13O5k06J40Q3l69l
2424f3Mm4k25K22m6j08J86k6J42j73K69m0rJ39k98q6K6R7R6o0o9OL43k01K22r3
$$ plain form
2450 211 62 -231 110 21 78 92 -248 -284 -318 -369 -104 229 128 193 369 178 147 241 -319 99 203 -111 -62
2473 -62 16 -263 -129 -3 50 -360 39 14 -72 -79 -162 -211 144 -81 -235 66 146 58 -15 400 31 287 228 34
2497 34 152 32 -88 -7 -245 -59 23 -114 243 33 83 98 288 -212 -60 70 3 -351 -69 -301 -289 -65
2519 -65 103 10 329 300 456 205 207 -138 -389 76 -119 -253 163 57 -270 83 -40 -105 -124 231 93 -220
2541 -220 -183 -77 33 -157 -50 -229 -7 148 137 -56 318 156 64 74 -78 -220 -5 -217 -273 -107 -243 -33
2563 -33 -153 246 -5 75 234 -52 -69 -12 -73 -150 -22 -243 -8 181 254 110 106 237 70 340 209 147 117 -455
2587 -455 -219 -51 -67 -166 -315 143 60 140 296 11 3 -241 107 -151 -88 -166 -84 -86 62 198 242 124 64 52 99
2612 99 -90 -239 -43 204 -500 76 57 -55 43 -62 -15 273 95 99 207 3 -46 -49 -23 -222 -105 0 221
$$ packed form
2450B11j49k93L41q9N7J4l40l6l4n1K65L33j01O5J76j91l1R4n60M18J04l14M9
2473f2P8k79J34J26N3m10L99k5q6pq3m9L55k25j54L01Q0q8p3M15l69K56n9j94
2497C4J18j20j20Q1k38J86Q2j37L57k10N0J5J90n00J52J30o7l54K82k32J2K24
2519f5J68r3L19k9J56k51Kl45k51M65j95j34M16j06l27L53j23o5j9L55j38l13
2541b20L7J06J10j90J07j79K22J55j1j93L74j62r2J0j52j42K15k12n6J66j36K10
2563c3j20L99k51Q0J59k86j7N7o1p7J28k21K35J89P3j44mJ31j67K70j31o2l0n72
2587d55K36J68j6r9j49M58q3Q0J56k85qk44L48k58O3p8Q2kJ48J36M4j18o0j2M7
2612I9j89j49J96K47p04N76j9j12R8j05M7K88j78MJ08k04m9lK6j99J17J05K21
$$ plain form
2635 221 -42 319 24 86 -20 77 138 52 -64 55 -139 -336 3 -160 127 68 -39 67 199 -170 49 -164
2657 -164 -14 -154 -460 -95 -276 59 84 140 336 308 315 409 86 -80 120 -154 -246 -210 11 281 -191 23 176
2680 176 184 -90 153 335 -255 -353 -186 34 -297 -352 285 -63 39 90 171 219 32 171 53 245 -180 -337
2702 -337 235 42 -540 154 345 -108 -203 205 340 -151 -98 100 -278 -330 -246 -17 110 -182 108 174 273 112
2724 112 159 163 32 -128 188 152 -365 -567 257 14 -353 24 185 -99 -256 64 75 -57 -103 -204 -124 103
2746 103 -329 132 -46 -255 -79 344 190 -191 -79 368 51 -115 102 175 -356 -239 375 82 -226 -217 -73
2767 -73 317 -174 -197 215 136 -212 -13 101 -210 -488 183 595 113 145 291 337 26 -28 353 171 -237 -179
2789 -179 220 -92 -451 64 78 218 1 126 148 -396 -188 -285 400 -15 -315 304 354 -67 -349 206 23
$$ packed form
2635B21k63L61k95O2j06R7O1q6j16J19j94j97L39j63K87n9j07J06J32l69K19k13
2657a64J50j40l06L65j81L35K5N6J96k8PR4l23j66K00k74r2L6K21K70m72K14J53
2680A76Qk74K43J82n90r8J67K20l31n5O37l48J02N1Q1M8j87J39j18J92m25j57
2702c37N72j93n82O94J91m53r5M08J35m91N3J98l78n2Q4K29J27k92K90O6R9j61
2724A12M7Mj31j60L16l6n17k02Q24k43l67L77J61k84j57L20J1j32m6j01Q0K27
2746A03m32M61j78k09J76M23j54l81J12M47l17j66K17P3n31J17O14k93l08RJ44
2767g3L90m91k3M12p9l48J99J14l11k78O71M12m82L2J46M6l11n4L81j82m08N8
2789a79L99l12l59N15J4J40k17J25K2n44K08r7O85m15l00O19N0m21k82N55j83
$$ plain form
2810 23 -142 148 540 162 -252 -23 53 -21 -322 77 143 -187 -367 113 287 -401 -266 73 131 -269 44 54
2832 54 -219 -706 -163 198 -20 -9 263 607 -344 -227 256 85 -584 -132 434 -237 -217 -67 364 -195 13
2853 13 227 400 -56 -404 45 -61 -401 -293 74 -16 -342 -158 174 210 -102 -24 495 193 -334 267 280 -366
2875 -366 -447 75 297 -229 -198 68 481 -170 87 296 54 -349 -52 195 -188 -390 12 191 -291 -558 214
2896 214 267 -243 -60 221 232 -290 -238 591 -58 -215 44 428 -193 -379 230 164 -235 -313 321 154 -264 -298
2918 -298 206 62 -335 -225 379 -22 -300 152 428 115 -205 225 403 -5 -359 259 37 -716 -181 373
2938 373 192 -306 311 452 75 -530 -209 302 -127 -566 124 392 -49 -243 135 89 -231 -219 376 209 -216
2959 -216 79 378 -26 -824 -69 212 -184 -467 329 324 -261 -480 251 184 -339 -188 295 56 -555 -21 259
$$ packed form
2810B3j65K90L92l78m14K29P6p4l01L99O6l30j80M80J74o88J35L39N8m00L13J0
2832E4k73m87N43L61k18J1K72L44r51J17M83j71o69M52N66o71K0J50M31n59K08
2853A3K14J73m56l48M49j06l40J08L67r0l26J84L32L6l12P8N19l02n27O01J3o46
2875c66q1N22K22n26L1K66M13o51K57K09k42m03K97K47l83k02M02J79m82k67P72
2896B14N3n10J83K81J1n22N2Q29o49j57K59L84o21j86O09o6l99p8O34j67m18l4
2918b98N04j44l97J10O04m01k78M52K76l13l20M30J78m08l54O18k22p53N35N54
2938C73j81m98O17J41l77o05L21N11m29m39O90K68m41j94L78m6l20J2N95j67m25
2959b16K95K99m04p98P55K81l96k83P96nn85k19P31o7n23J51M83k39o11N34K80
$$ plain form
2980 259 82 -307 508 404 -83 -201 329 286 -309 -326 533 230 -437 -388 177 227 -460 -77 312 -50 -330
3001 -330 33 228 -266 -481 214 221 -335 -198 305 35 -153 -113 366 337 -37 22 632 -100 -452 78 171 -81
3023 -81 -529 237 562 -383 -322 456 273 -411 -336 632 -25 -170 -78 -77 28 -328 163 324 29 -273 201 191
3045 191 121 -69 364 176 -263 -90 269 -54 -366 -7 313 48 -296 275 360 -367 -380 -60 -176 -388 -72
3066 -72 425 -13 -91 -48 437 168 -167 314 218 142 -350 -5 201 -345 -184 236 179 -125 -93 377 147 -299
3088 -299 -244 37 -41 -188 54 239 36 -145 130 481 -169 -399 350 -53 -108 -107 224 241 -386 -374 261 240 -144
3111 -144 -80 310 -137 -212 58 83 -207 -60 123 280 -270 -121 376 159 -26 -11 169 -105 -20 54 296 18
3133 18 -227 -109 257 -102 -227 60 166 24 -162 552 232 -64 -286 397 -122 -279 -193 96 -50 -141 328
$$ packed form
2980B59j77l89Q15j04m87j18N30m3n95j7Q59l03o67M9N65N0o87L83L89l62k80
3001c30L63J95m94k15O95Pn56J37N03k70j88M0M79k9l74N9O10p32l52N30R3k52
3023h1m48P66L25r45O1P78j83o84P5R68o57j45R2JJ05l56M91J61k95l02M74j0
3045A91p0j90M33j88m39J73L59l23l12L59L20k65l44N71Q5p27j3L20j16k12L16
3066g2M97m38p8M3M85k69l35M81r6p6m92L45K06n46J61M20n7l04L2M70k30m46
3088b99N5K81p8j47K42J85k03j81K75L51o50k30P49m03n5JL31J7o27J2O35k1l84
3111a44O4L90m47p5K70K5k90J47J83J57n50J49M97k17j85J5J80k74Q5P4K42k78
3133A8k45J18L66l59j25K87J06j42j86P14l20k96k22O83n19j57Q6K89j46r1M69
$$ plain form
3154 328 94 -120 -10 216 -85 -26 -13 380 -52 -183 -138 48 43 -227 -14 211 -241 -83 368 46 -66 -37
3176 -37 -11 293 -65 -65 48 -74 -14 -12 469 112 62 528 17 -86 -85 -142 213 7 -151 211 108 -320 8 434
3200 434 -232 -121 -209 203 -182 -564 -118 194 -80 -110 -107 70 228 292 299 205 19 210 174 91 -30 18 248 -54
3224 -54 7 -10 293 -210 -30 219 29 39 -99 98 -111 -191 -92 61 -8 -120 -70 206 81 -23 316 131 -369
3247 -369 -92 196 92 -35 -338 325 -84 -80 -97 100 -47 -203 -161 179 52 -123 150 -70 88 -2 -154 257
3269 257 1 17 236 229 -9 -258 271 -102 16 -6 -94 -132 -212 -69 -148 -65 -124 205 107 -137 327 128 72 -353
3293 -353 -173 -204 99 -10 54 177 -214 -49 201 139 183 -13 35 -263 -175 28 -139 -282 -213 -62 -44 -20 -127
3316 -127 372 176 0 -62 -39 137 -236 -16 92 75 -110 -105 408 113 -12 265 -24 -37 65 -94 73 -106
$$ packed form
3154C28k34k14J10K26l01N9J3L93m32j31M5J86nk70K13K25m52J58M51l22j12K9
3176c7K6L04l58%J13j22O0KM81l57n0M66n11j03Jn7L55k06j58L62j03m28L28M26
3200D34o66J11q8M12l85l82M46L12k74l0LJ77J58O4Pr4j86J91l6q3j21M8K30l02
3224e4O1j7L03n03J80K49j90J0j38J97k09q0R9J53o9j12N0K76j25j04L39j85n00
3247c69K77K88j04j27l03O63m09Mj7J97j47j56M2L40j27j75K73k20J58r0j52M11
3269B57k56J6K19pk38k49N29l73J18k2q8l8q0J43p9Q3n9L29r8k44M64j99n6m25
3293c53J80l1L03j09O4J23l91J65K50o2M4j96M8k98Q8K03j67j43O9J51J8K4j07
3316a27M99j96j76o2K3J76l73K20J08j7j85NN13k95j25K77k89j3J02j59J67j79
$$ plain form
3338 -106 -174 11 -135 30 -111 27 43 -17 -395 100 56 -90 -5 8 113 -154 86 20 134 174 -169 109 -38
3361 -38 -79 78 -94 -30 -237 -35 -32 -169 -204 -100 174 -159 115 145 9 -130 -118 224 86 16 1 -162 153
3384 153 75 -13 202 -279 126 162 138 90 16 13 -212 111 -333 88 -216 -389 -13 -146 -81 -97 25 239 -48
3407 -48 -5 -238 -27 -69 -98 43 -121 66 113 -101 93 -33 103 0 -103 -32 -111 -141 -199 92 -102 -211 48
3430 48 -51 39 176 104 132 46 79 -20 36 -100 -77 -14 58 87 168 -138 211 39 211 9 57 52 241 -77 152 -87
3456 -87 -8 -161 204 208 -1 187 212 122 67 -140 -74 66 -40 48 33 43 155 -152 1 -37 30 164 -113 30
3480 30 -96 -81 55 -57 -54 73 -188 -67 3 -25 249 163 -8 -9 62 113 -84 -32 164 8 151 -8 -30 -9 58
3505 58 291 87 33 94 -31 -215 81 38 24 -191 155 -181 -14 150 -111 -148 57 -108 323 110 20 146
$$ packed form
3338a06o8J85j46J65j41J38J6o0l78M95m4j46Q5J3J05k67K40o6J14M0l43K78j47
3361c8m1J57j72O4k07K02Lj37l5J04K74l33K74L0j36j39J2L42j38p0j5j63L15
3384A53p8q8K15m81M05L6k4m8p4lk25L23m44M21l04j73L76j33O5j6J22K14k87
3407d8M3k33K11m2k9J41j64J87M7k14J94j26J36j03j03P1p9l0n8K91j94j09K59
3430D8r9R0J37p2K8q6L3r9N6j36K3O3P2K9Q1l06L49j72J72k02M8nJ89l18K29k39
3456h7P9j53L65Mk09J88K5r0n5k07O6J40j06Q8j5J0J12l07J53l8O7J34k77J43
3480C0j26J5J36j12LJ27k61J21P0k8K74q6j71jP1N1j97N2J96j56J43j59k2K1O7
3505E8K33k04n4O1j25j84K96m3j4k15L46l36J67J64k61l7K05j65M31k13r0J26
$$ plain form
3527 146 6 205 -98 99 141 15 179 146 -142 -275 76 -215 100 115 -155 12 23 69 309 -125 -221 -99
3549 -99 252 -135 -173 -15 85 -143 70 -36 62 -162 -44 297 132 161 130 -88 -30 -153 -329 -55 -38 -44 -19
3572 -19 -87 126 5 31 -43 149 257 -85 27 -22 -4 -44 -3 194 -4 -14 190 -96 83 -148 142 242 -24
3595 -24 -227 -13 -225 29 35 -264 68 48 158 -78 -54 -138 -106 116 -56 11 83 -113 174 141 32 -8 61 95
3619 95 -93 92 -94 -177 -132 -120 31 -232 -111 -144 186 -148 38 286 -118 71 295 94 82 149 84 -53 -120
3642 -120 -141 -274 298 201 -88 -48 -179 -142 187 272 49 84 -129 -24 -107 28 -94 -165 -2 36 155 -119 114
3665 114 -171 -168 246 -5 219 -32 -60 -16 -6 314 17 -175 22 44 17 -201 95 -127 -50 -1 -114 -338 -266
3688 -266 23 150 -130 237 -133 252 14 -62 -31 -140 -114 -203 50 -213 7 -41 73 22 257 206 -96 -22 -76
$$ packed form
3527A46j40J99l03J97M2j26J64l3k88j33L51k91L15J5k70J67J1M6K40m34r6J22
3549i9L51l87l8J58J00k28K13j06R8k24J18L41j65K9l1k18N8j23j76K74J7oK5
3572a9o8K13j21K6p4J92J08l42J12m9J8m0M1J97j98j0K04k86J79k31K90J00k66
3595b4k03K14k12K54Ok99L32k0J10k36K4q4L2K22j72O7P2j96K87l3j09m0O9L4
3619I5j88J85j86q3M5J2J51k63J21l3L30l34J86K48m04J89K24k01j2O7o5j37o7
3642a20k1j33N72r7k89M0j31L7L29Q5k23L5k13J05q3J35j22p1J63L8J19k74K33
3665A14k85LM14k51K24k51k8M4J0L20k97j92J97K2k7k18K96k22P7M9j13k24P2
3688b66K89J27k80L67l70L85k38p6L1j09K6q9K53k63K20m8J14n1K35n1l02P4n4
$$ plain form
3711 -76 -451 49 -227 6 46 -104 96 128 69 -46 193 -29 82 216 22 -76 -123 -256 -201 -129 121 49 31
3734 31 -129 52 -58 -96 16 -150 -300 -11 -60 -235 -31 -51 226 -169 161 128 -7 236 -18 -65 -176 -103
3756 -103 100 -281 131 -115 211 61 -196 -33 279 -84 49 17 173 89 6 -255 -50 39 -202 150 160 -116
3778 -116 -257 4 -138 -35 -4 84 -43 32 136 70 74 111 -95 -5 -187 175 164 -29 16 -16 -195 -165 -40 -184
3802 -184 -127 -71 114 26 6 -183 16 83 -256 -134 72 -98 -118 113 -37 19 244 -38 157 -49 95 83 278
3825 278 -141 -17 -129 -348 79 171 -62 101 69 78 87 100 -32 367 -130 78 -155 -74 -40 11 -46 -67 134 -173
3849 -173 -1 -65 34 -142 -241 267 -75 -110 54 -151 163 -54 -196 75 -57 -38 -148 -128 56 -38 161 -70
3871 -70 26 -32 -68 0 219 262 131 58 -74 -17 215 63 -208 -86 41 -147 30 40 -127 -136 -54 135 162 -92
$$ packed form
3711g6l75N00k76K33M0j50K00L2n9j15K39k22J11J34j94r8m7j33N5P2K50p2j8
3734C1j60J81j10l8J12j66j50K89m9j75K04k0K77l95L30l3j35K43k54m7j11P3
3756a03K03l81M12k46L26j50k57J63L12l63J33l2J56q4q3k61K05Q9k41L52J0k76
3778a16j41K61j42J03L1Q8j27P5J04o6ML7k06R0j82L62j1j93M5l2j79L0J25j44
3802a84N7N6J85q8k0j89J99O7l39J22K06j70k0K31j50N6K25k82J95k06J44j2J95
3825B78m19J24j12k19M27R2k33J63l2RRJ3j32L99m97K08k33Q1L4N1n7k1K01l07
3849a73J72o4R9j76r9N08l42l5J64k05L14k17j42K71j32J9j10K0J84r4J99k31
3871g0R6n8l6O8K19M3j31p3j32N7K32j52k71J22J27j88J77J0j67rQ2J89K7k54
$$ plain form
3895 -92 102 -25 99 12 -220 -80 -187 -35 -215 -185 80 57 12 130 141 42 53 -224 -57 -165 149 25 -152
3918 -152 -118 -104 92 -93 -3 118 -59 60 -69 184 -194 -278 -155 44 67 83 9 120 -46 98 110 24 -262
3941 -262 -127 -8 -205 -148 -35 -66 189 1 -168 125 47 21 -1 -107 57 -93 -155 -306 -80 157 -34 -10
3963 -10 213 -149 -12 69 85 176 -240 149 -55 -171 122 -136 45 3 -197 69 -83 -155 61 -31 289 -150
3985 -150 -157 -88 22 -172 -355 -71 12 183 -3 -78 146 152 -206 -29 -116 89 29 -166 -87 -96 106 95 59 94 233
4010 233 -183 75 -66 -12 130 -185 -119 29 -123 58 137 261 -110 40 16 31 -45 -89 35 -41 55 33 -19 52
4034 52 51 232 22 74 -88 -35 7 -180 22 153 -137 -34 168 -106 67 66 -199 230 47 144 79 -102 -78 -232
4058 -232 135 -190 44 -126 70 -10 42 -6 54 -105 79 -174 -98 -5 38 -62 -49 -59 -49 12 -435 157 118 -77
$$ packed form
3895i2J94j27J24q7k32J40j07J52j80L0K65k3m5J18J1r9J1k77J67j08L14j24j77
3918a52L4J4J96j85R0J21j77J19j29K53l78q4J23J99K3J6p4J11j66J44J2q6k86
3941b62J35J19j97N7J13l1K55j88j69K93p8k6k2j06J64j50o2j51K26K37j91K4
3963a0K23l62J37Q1J6R1m16L89k04j16K93k58J81m2k00K66j52p2K16r2L20m39
3985a50pO9J10j94j83K84Q3J71j86p5K24Ol58J77q7K05o0j95P9rK02j1l6L5J39
4010B33m16K58j41N4J42l15O6J48j52J81P9J24l71J50k4J5p6m4J24p6R6k2n2P1
4034E2jJ81k10N2j62N3M2j87K02J31k90J03K02k74J73jk65M29j83R7o5j81K4j54
4058b32L67l25K34j70J96q0N2m8O0j59J84k53P6R3M3j00J3j0J0O1m47N92l9j95
$$ plain form
4082 -77 149 -196 -47 -7 -37 -110 -96 12 189 160 43 -85 156 105 -156 -13 228 -213 40 6 -71 37 160
4105 160 152 -65 -198 -30 13 253 -26 318 136 92 -140 -220 -156 -71 -129 167 282 -1 -268 -36 316 -88 217
4128 217 -52 174 75 -210 55 14 10 35 175 -162 -15 -28 -16 130 -66 52 236 170 -60 71 -142 83 144
4151 144 -117 -60 141 99 87 248 -241 -240 79 -166 -295 6 -179 -54 -141 3 50 80 50 176 211 -78 -62 221
4175 221 94 -198 69 61 122 -38 275 34 206 -181 -83 108 45 77 -166 -139 -130 -121 -4 292 102 -63 35 7
4199 7 -106 12 302 -295 -149 -4 67 46 75 130 65 116 93 331 -200 -165 193 -133 -29 -196 -79 218 -89
4222 -89 -12 -2 -175 -45 -10 62 -271 -111 -128 71 216 -201 120 398 21 104 197 37 -57 -185 205 199 -177 -24
4246 -24 123 -115 -143 38 150 -136 97 -158 274 -20 29 -79 170 125 -85 -36 -90 -25 -138 -140 -84 -44 81 19
$$ packed form
4082g7K26l45J49M0l0p3J4J08J77k9j17j28K41n1k61J43K41m41K53l4p7J08J23
4105A60qk17j33J68M3K40k79L44j82m4k32q0O4Q5n8K96J15k83k67K32L52m04L05
4128B17k69K26r9k85K65m1mK5J40l37J47j3J2J46j96J18J84o6k30J31k13K25O1
4151A44k61N7K01m2j2J61m89JL19k45j29L01j85J25q7J44M7L0l0J26L5k89J6K83
4175B21j27k92K67qO1j60L13k41J72l87R8J91o3L2k43K7RRJ17K96j90j65R8k8
4199Gj13J18K90n97J46J45P1k1K9N5o5N1k3K38n31L5L58l26J04j67J17K97l07
4222h9P7J0j73J30L5P2l33J60j7J99J45m17L21K78l77Q3R3j60r4j28L90ol76J53
4246b4J47k38k8J81J12k86K33k55M32k94M9j08K49m5k10M9n4O5j13kN6M0J25o2
$$ plain form
4270 19 -118 -42 30 270 -30 -144 191 79 -96 -72 1 120 -21 -11 175 73 -23 109 -79 -223 -140 137 -180
4293 -180 188 -81 74 179 -430 -69 -66 297 -246 13 2 -24 -74 257 57 -7 -22 24 90 -83 -81 3 212 18
4317 18 -129 -49 85 -194 14 260 99 -132 28 -29 -113 -72 -89 -40 -37 -121 238 -90 14 -99 106 10 44 -52
4341 -52 444 -70 -105 200 451 136 -292 -118 121 -224 -58 239 8 43 -63 202 32 -54 -130 314 123 -156
4363 -156 61 158 -48 -219 -24 202 -227 78 -74 125 38 -106 139 -159 -219 184 -136 64 -108 120 -23
4384 -23 -81 199 -5 7 -203 -89 -71 109 9 -120 135 169 -313 -57 72 -48 -205 -33 16 50 -299 -64
4406 -64 -104 -257 -344 17 55 -114 -280 43 169 18 -125 157 -115 -184 -59 111 -69 -201 -70 462 109 -206
4428 -206 218 -98 -73 -159 94 142 -133 -95 118 -283 -131 259 103 -99 -156 258 48 10 5 249 -129 -81 -7
$$ packed form
4270A9j37P6P2K40l00j14L35j12j75K4P3J19j41J0J86j02r6J32j88j44Q3K77l17
4293a80L68k69J55J05o09L61LL63n43K59j1k6n0L31k00o4j5M6O6j73KQ4K09j94
4317A8j47Q0J34k79K08K46j61k31J60n7q4M1j7M9Lq4L59l28J04j13K05r6L4r6
4341e2M96n14l5L05K51l15m28J74K39l45J66K97k31L5j06K65j70q6p6M44j91k79
4363a56K17R7k06j71J95K26m29L05j52J99q7j44K45k98o0M03l20K00j72K28j43
4384b3n8K80k04J2k10J14J8J80j00j29K55L4m82K56J29j20j57J72M9L4l49K35
4406f4m0j53q7L61L8j69j66L23J26j51j43K82k72o9J25J70j80j32J31N32l53l15
4428b06M24l16K5q6K53M8k75L8K13m01J52L90j56k02n7M14k10l8nK44l78M8P4
$$ plain form
4451 -7 133 -197 -65 5 242 -73 -131 43 68 -122 -13 -58 34 2 -316 303 198 -174 14 236 259 -35 135
4474 135 131 83 -241 120 -46 -184 -103 -94 402 269 10 350 130 134 -61 107 22 -172 -81 -49 225 -67 120 41
4498 41 -31 -247 23 95 -343 -56 93 115 156 -113 49 -170 174 120 -47 -61 -99 4 -59 -198 -147 -30 -85 -248
4522 -248 -99 193 -54 -42 394 151 -204 79 188 354 18 -147 158 194 -282 -189 85 -18 -132 -109 189
4543 189 119 -68 -218 -131 71 -107 -108 -100 -120 -194 -212 115 128 -63 127 73 -79 -117 176 212 -159 -184 181 -11 -71
4568 -71 -81 -155 181 -81 44 79 10 32 202 -149 -131 127 -245 22 145 30 131 23 -7 157 291 -282 -127
4591 -127 -158 -46 79 148 163 103 187 -191 152 96 134 -109 134 -139 -14 -258 -23 180 -166 26 -163 -19
4613 -19 237 21 106 74 1 120 -157 132 17 4 -155 -55 91 84 -122 -79 -163 -57 -206 51 82 60 -23 59
$$ packed form
4451gJ40l30J32P0K37l15n8J74K5j90J09m5R2l2l18O19j05l72J88K22K3k94J70
4474A35mm8l24L61j66j38Q1RM96j33k59L40k20Mj95J68q5j94R1L2K74k92J87p9
4498D1p2k16K70P2m38K87J49K2M1k69J62k19L44n4j67j4l8J03o3j39N1J17n5j63
4522b48J49K92k47J2M36k43l55K83J09J66l36j65L05L6m76R3K74j03j14K3K98
4543A89p0j87j50Q7K02j78jQk0p4j8L27J3j91J90n4j52l8K93L6l71k5L65j92o0
4568g1j0p4L36k62J25L5o9K2J70l51J8K58l72K67J23j15J01j08l0J64J34n73J55
4591a27l1J12J25O9J5o0Q4l78L43n6L8k43K43k73J25k44K35K03l46J92j89J44
4613a9K56k16Q5l2p3J19k77K89j15j3j59J00J46pk06M3q4J06j49K57L1k2q3Q2
$$ plain form
4637 59 118 -118 -187 135 244 -277 -276 -22 167 48 51 -5 113 -122 -21 -207 19 149 87 71 33 -54 -60 297 -6
4662 -6 -236 -58 248 -302 -271 8 -170 -158 -67 -193 46 157 97 202 51 -119 -75 38 70 55 90 178 -62 94
4686 94 266 -77 -155 -140 99 23 -135 -102 117 -80 -49 -45 -43 188 158 434 -95 21 -165 48 34 46 -8 72 249
4711 249 -82 411 193 -103 -99 42 -178 178 39 -94 120 -229 40 152 23 -184 -187 61 -143 -43 -33 371
4733 371 190 142 -32 255 -250 -39 237 -284 -112 -88 -23 192 -185 -91 31 -198 -184 -249 -123 -8 321 80
4755 80 87 35 -12 142 -66 116 -218 120 -94 159 -184 -97 -194 -201 -26 29 -170 82 10 121 -270 -18 -32 -115
4779 -115 0 -93 221 -294 74 37 -121 -85 -140 -69 93 117 241 65 -123 -332 -158 -86 60 -90 143 112 -6
4802 -6 37 238 -79 -110 -38 -209 -59 -125 -41 -43 15 197 -102 -188 -11 -179 -63 -50 157 31 2 23 90 -108 -6
$$ packed form
4637E9N9k36o9L22J09n21JK54J89j19Ln6J18k35J01j86K26J30o2j6l8q7oL57l03
4662fk30J78L06n50L1K79j78J2R1j26K39J11o0J05j51j70M4J13L2j5L5Q8k40J56
4686I4J72l43p8J5K39p6j58L3K19j97L1MKK31l0K76n29J16j86K13j4J2n4Q0J77
4711B49l31M93k18k96MJ41k20L56j39j33K14l49K69J12j29k07lK48k04J00J0M04
4733C71j81m8j74K87n05K11K76n21J72K4O5K15l77R4J22k29J4o5J26J15L29k41
4755H0Pn2m7J54k08J82l34L38k14K53l43Q7r7pJ75N5j99K52p2J11l91K52j4q3
4779a15J15r3L14n15L68l7j58L6n5P1J62K4J24j76j88k09J74P2J46j50K33l1j18
4802fM3K01l17l1P2j71J50o6Q4kN8J82k99q6J77j68J16J3K07j26k9K1O7j98J02
$$ plain form
4827 -6 -69 25 15 25 269 -183 156 44 136 131 165 -345 30 60 -24 -36 -154 5 -279 -79 9 223 9 254 -24
4852 -24 -23 -11 -150 103 83 108 -56 -35 214 45 333 18 102 -87 -150 133 -53 -68 -154 46 3 96 72 -198 -70
4877 -70 -108 290 -85 83 14 -15 -119 -70 -125 229 3 -92 86 -20 14 -4 -24 -210 68 -35 99 48 34 150
4901 150 -283 65 -170 -42 89 25 161 35 221 84 -122 45 -171 -2 34 174 -23 217 -77 -21 -59
4922 -59 -127 -228 -45 83 142 105 5 115 -51 -47 -166 94 125 -188 -44 -4 77 -16 77 39 -105 -94 -10 217 63
4947 63 39 -284 -5 230 116 -29 -6 -6 -142 -155 66 154 -9 -93 95 246 -33 -266 165 -136 119 -47 -50
4970 -50 62 -42 193 -142 71 199 -69 -82 18 145 -102 -26 -176 -22 -145 -243 -82 59 -164 105 40 223
4992 223 70 16 -30 -167 -63 21 35 -121 0 -33 -143 -98 118 -92 30 114 -285 -242 -268 43 241 103 -62
$$ packed form
4827fo3R4j0J0K44m52L39j12R2nL4n10L75L0q4j2j18J59k84K00Q8K14k14K45k78
4852b4JJ2j39K53k0K5j64K1K49j69K88l15Q4j89o3K83j86j5q6K00m3R3k4k70J28
4877g0l8L98l75J68o9k9j04M9n5L54k26r5J78j06L4j8k0j86K78j03J34n1j4J16
4901A50m33L48k35J28J31o4J36j26J86j37k06J67k16J69L6J40j97K40k94N6l8
4922e9o8j01J83J28N9l7j00J10j66Mj19K60L1l13J44M0Q1r3R3l8j44J1Q4K27j54
4947F3k4l23K79K35j14j45K3%j36j3K21Q8j63q4J88J51k79k33M31l01K55j66l
4970e0J12j04K35l35K13J28k68j3J00J27k47P6j50J54j23r8J61J41k23K69o5J83
4992B23j53n4m6j37J04Q4J4j56J21l3j10M5K16k10J22Q4l99M3k6L11J98j38j65
$$ plain form
5015 -62 -128 91 -4 -27 41 -18 136 122 -53 9 198 -163 -51 -278 91 -57 7 135 -86 100 89 137 -122 211
5039 211 119 214 84 137 76 -199 83 -41 150 -123 -168 147 153 325 -72 -79 79 -14 -21 -122 -188 -162 169 85 -11
5064 -11 19 116 -208 -43 -28 76 89 -190 -105 123 217 188 163 202 329 -138 -5 363 -109 -166 -212 -293 -91 -81 212
5089 212 29 84 203 39 128 -109 -70 -54 19 -160 -164 -21 -89 -6 46 -74 233 191 -66 -46 -263 114 -218 -28
5113 -28 -100 -146 0 93 -19 123 -257 12 179 123 200 -141 -224 66 -75 -101 -233 -5 84 -40 234 -157 65
5136 65 137 -187 -147 -117 142 12 -213 78 -134 -9 -96 -62 217 -18 156 56 173 18 -185 -70 273 -144
5158 -144 7 -60 150 178 50 220 28 75 -196 -33 18 168 -345 -96 164 139 -107 42 90 192 -122 33
5180 33 149 -100 231 -199 162 -113 3 -4 -3 -164 -138 -137 124 2 20 50 -129 287 -163 120 78 142 49 40 15
$$ packed form
5015f2o6K19r5k3O8n9J54j4j75O2J89l61J12k27L69j48O4J28k21J86j1M8k59L33
5039B11r2R5j30N3o1k75K82j24J91k73m5L15OJ72l97pJ58r3pj01o6K6L31q4r6
5064a1L0R7l24J65J5J04J3k79Q5K28R4k9k5L9J27m67J33L68m72n7m6q1K02J0K93
5089B12j83N5J19j64Q9k37L9J6P3j79mJ43o8Q3N2j20L07m2k57K0k17L77l32J90
5113b8p2m6J46R3j12J42l80K69J67n6P7l41q3K90j41k6j32K28Q9j24K74l91K22
5136F5P2l24M0L0K59j30k25K91k12J25q7L4K79k35J74j00J17j55k03J15L43m17
5158a44J51o7K10K8j28J70j92M7k71J63N1J50n13K49K60k5k46J49M8J02l14J55
5180C3J16k49L31m30L61k75J16pJj61K6JK61j22J8L0j79M16m50K83m2O4r3rk5
$$ plain form
5205 15 120 -206 -49 109 -97 74 265 158 -137 -4 -72 91 -24 -26 -224 -165 -168 61 -209 101 -84 -35 -81
5228 -81 -73 -125 173 101 28 -18 -248 3 57 278 124 302 105 -12 -63 -99 -40 90 23 67 -82 121 21 13 -63
5253 -63 -68 167 220 76 -134 15 -9 -295 163 -76 -130 240 51 -22 230 12 139 -102 -15 -220 -124 28 205
5276 205 203 197 -77 -120 -9 -43 -128 52 102 164 15 -31 -134 54 35 -21 44 -153 69 11 255 60 -11 -9 -98 21
5302 21 53 -122 -11 137 164 46 189 50 53 -225 95 206 98 -61 108 6 9 213 -169 80 5 -46 -2
5325 -2 54 132 -103 142 93 -68 -99 3 21 -43 17 40 43 -89 10 -81 85 -48 -57 -114 -34 -62 -48 24 234 -104 -207
5352 -207 -18 -97 67 -36 140 135 -126 -257 77 8 29 -128 -67 71 150 -147 -39 -87 -14 90 -54 183 111
5375 111 -38 87 4 141 -222 178 -8 9 -200 -69 -201 99 37 130 32 -140 66 -195 -14 -24 -2 64 121
$$ packed form
5205A5J05l26J57J58k06J71J91j07k95J33o8J63j15kj98N9lK29k70L10j85M9m6
5228h1Qn2K98p2p3m6k30K51N4K21j54J78j97j17n1l6N9J30o7M4j49K03j00qp6
5253f3nK35N3j44k10J49k4k86M58k39n4L70j89p3K52k18J27k41Q7k05R6J52J77
5276B05kok74m3J11l4q5J80N0O2j49m6j03J88j9n6O5j97K22n8K44j95p1Kq9J19
5302B1L2j75J11J48K7j18J43j39Lk78L20J11j08j59J69j02LK04l82K49p5n1M4
5325bN6P8k35K45m9j61l1J02J8o4O0K3Lj32R9r1J66j33rn7Q0k8J4P2K10l38j03
5352b07J89p9J64j03J76nk61j31L34o9K1j57O1J38P9k97J08m8P3J04j44K37p2
5375A11j49J25q3J37l63M00j86J7k09J31j32L00o2R3r8j72K06k61J81j0K2O6N7
$$ plain form
5398 121 86 -14 -35 100 -163 154 -314 -195 -147 82 -143 -25 301 -61 -107 119 -65 80 -10 -3 4 44 142 0
5422 0 102 -251 21 247 96 -84 -346 -237 -104 78 150 -168 -145 74 -32 -75 213 107 54 111 -152 1
5444 1 -37 78 18 -9 -141 125 110 -15 -54 200 -18 18 81 -398 103 140 -105 159 -99 -120 44 -47 39 5 136
5469 136 252 -6 -185 -147 -87 55 -61 281 90 -56 1 -152 42 -277 181 143 -109 9 -2 -146 -428 67
5491 67 133 -111 -24 116 -20 -260 -142 300 137 9 -51 12 261 161 13 32 -227 -7 -15 -13 -59 -187 -26 96
5515 96 119 78 -47 141 -203 -133 4 50 38 -69 -14 -93 -150 -37 88 -133 -28 174 188 155 -16 -52 -73 70
5539 70 336 36 -91 61 -59 42 -125 42 83 18 -133 -141 248 260 -219 -64 261 62 -58 -12 4 -38 306
5562 306 -30 -76 -300 -86 -120 46 -156 -72 6 -49 -36 -168 -194 -125 -118 17 199 -157 143 -32 98 80 -175 70
$$ packed form
5398A21l5j00k1J35k63L17m68J19M8K29k25J18L26l62m6K26j84J45r0PPM0R8j42
5422@J02l53K72K26j51j80k62J09J33J82P2l18K3K19j06m3K88j06n3N7k63J53
5444Al8J15o0k7j32K66j5j25l9K54k18L6O3m79N01L7k45K64k58k1J64r1Q6l4J31
5469A36J16k58j79L8O0J42j16L42j91j46N7j53J94l19M58l8k52J18j1j44k82M95
5491F7O6k44Q7J40j36k40J18M42j63j28o0O3K49j00j48J9k59K20qKm6j28J61J22
5515I6K3m1j25J88l44P0J37M6j2j07N5p9n7J13J25k21J05K02J4l3j71l6k1J43
5539G0K66l00j27J52j20J01j67J67M1o5j51qL89J2m79J55L25j99j20M6J6m2L44
5562C06l36m6k24K14l4J66k02Q4P8n5J3j32k6O9PJ35J82l56L00j75J30j8k55K45
$$ plain form
5586 70 -7 61 -172 92 -2 -113 -127 -126 -114 -104 -64 112 294 -16 79 4 10 89 -273 222 96 -86 265 161 79
5611 79 -122 9 -101 -41 -244 -47 28 -220 26 97 53 -183 81 -24 -53 -164 3 -54 -63 -166 -36 24 58 -103
5635 -103 -91 -85 98 55 55 -198 9 -6 83 46 189 54 5 46 1 -172 -52 125 3 181 -101 -109 118 35 111
5660 111 -154 -75 52 -227 -25 127 -137 -95 -170 14 107 44 -220 -70 36 -30 186 67 149 22 86 9 -136
5683 -136 -105 -98 50 -222 22 69 -13 -1 79 35 14 -238 90 43 -78 -114 13 131 167 37 -121 -18 -28 -195
5707 -195 -14 188 126 157 -4 190 -147 -352 92 -44 -145 263 204 -17 107 229 -22 -331 -398 38 -76
5728 -76 -133 -224 330 95 117 -135 74 -264 -21 39 49 112 112 -70 122 -167 -175 -144 194 68 46 226 161 33 44
5753 44 28 312 -80 188 122 -64 3 164 144 -111 -12 -34 -134 17 73 -229 45 242 -23 64 -121 -429 -96
$$ packed form
5586G0p7O8k33K64r4j11j4JJ2J0M0J76J82l10R5p5OP9l62M95j26j82L51j04q2
5611G9k01J31j10O0k03J97P5k48K46P1m4k36K64j05k9j11J67n7rj03J30O0L4j61
5635a03J2OJ83m3%k53K07j5Q9l7J43j35m9M1m5j73J20J77j22J78k82qK27q3P6
5660A11k65P9J27k79K02J52k64M2p5J84R3o3k64J50J06o6K16j19Q2j27O4p7j45
5683a36L1PJ48k72K44M7q2J2Q0m4k1k52L28m7j21l6J27J18L6j30j58J03j0j67
5707a95J81K02o2L1j61J94l37k05M44j36j01M08n9k21J24J22k51l09o7M36j14
5728g6n7r1N54k35K2k52K09l38K43O0J0O3%j82J92k89qL1L38j26k2J80o5j28J1
5753D4j6K84l92K68o6j86O7J61k0k55R9k2j00J51N6l02K74J97k65Q7j85l08L33
$$ plain form
5776 -96 10 42 82 132 -73 10 100 49 -52 -94 265 49 -162 107 -142 137 146 -123 123 93 66 -181 -123 191
5800 191 -199 132 3 -66 -199 116 125 -176 -142 53 22 138 323 212 84 -86 -156 72 -76 153 -23 -11
5822 -11 -90 -155 -7 4 -247 0 156 180 -65 -177 287 23 -227 -82 137 199 -132 -23 82 84 -17 -67 -153
5845 -153 -329 27 270 -87 -54 -142 82 -211 168 90 1 4 -155 41 -145 91 -40 12 -134 -28 20 11 71 12
5869 12 118 82 156 -232 305 -106 -212 -92 18 102 -148 116 158 268 238 -80 205 7 12 133 92 52 43 -55
5893 -55 59 184 -25 49 -65 -35 69 -5 -114 -293 -195 -36 -225 -119 -160 -60 -95 34 225 -1 -169 66
5915 66 -182 -43 -103 -140 -165 44 -42 -3 -155 31 -34 -134 20 253 -102 -30 181 -39 -182 -91 154 117 -200
5938 -200 257 14 -36 -130 90 138 -124 -76 -20 -71 -126 164 -213 81 -78 89 -29 -212 -246 50 56 196 275 220
$$ packed form
5776i6J06L2M0N0k05Q3R0n1j01m2L59k16k11K69k49K79Rk69K46l0k7k47N8L14
5800A91l90L31j29o9j33L15Rl01L4J95l1J16J85j11j28j70p0K28j48K29j76J2
5822a1p9o5J48J1k51K47J56K4k45j12M64k64k50J45K19O2l31J09J05Kj01n0q6
5845a53j76L56K43l57L3q8K24k93L79p8q9Lj59J96j86K36j31N2j46J06M8rO0n9
5869A2J06l6P4l88N37m11j06J20J10Q4k50K64M2J10l0l18K85j98NJ21m1m0rr8
5893e5J14J25k09P4j14L0J04p4j09j79R8J59j89J06m1J00l5J29J91k26j68K35
5915F6k48J39o0l7k5K09q6L9j52J86o5j00J54K33l55P2K11k20j43R1K45l7l17
5938b00M57k43n0r4K20M8k62M8N6n1n5K90l77K94j59J67j18j83l4K96OJ40P9n5
$$ plain form
5962 220 30 -148 69 6 -27 -42 44 78 298 -49 -16 67 365 157 -20 52 -232 46 -226 -289 -18 -39 134
5985 134 -183 -1 106 173 -377 66 199 -169 49 -144 -60 26 187 -130 137 -98 -195 -47 -15 2 22 -18 -161
6008 -161 0 88 252 49 -145 -44 247 111 218 -117 -107 250 -39 43 -30 177 -116 224 -72 -143 -27 100
6030 100 3 13 151 -32 63 -92 -303 101 -80 -263 39 135 -106 -186 52 1 -10 12 70 27 59 -103 167 -54
6054 -54 167 29 36 163 -87 -76 -37 -186 -85 18 232 -39 -63 -165 123 57 -361 86 187 50 -152 -48
6076 -48 220 54 -217 -95 30 -44 -32 -63 -159 -96 270 145 -65 -78 -14 191 -2 136 24 2 -29 -65 -187 23
6100 23 -63 118 -153 13 48 198 144 -66 -82 17 -143 -203 176 50 -147 -138 104 -110 212 5 -91 220 -221
6123 -221 -138 -191 -46 -211 39 212 -170 85 152 -53 -9 -96 7 -204 -263 -42 17 150 -111 -94 12 215 -11
$$ packed form
5962B20j90j78K17o3l3j5Q6L4K20l47L3Q3K98k08j77P2k84K78k72o3K71k1J73
5985A34l17J82J07O7n50M43J33l68K18j93Q4Q6J61l17K67k35r7J48L2J7K0m0j43
6008a61J61Q8J64k03j94J01K91j36J07l35J0L57k89Q2p3K07k93L40k96p1J16J27
6030A00r7J0J38j83R5j55k11M04j81j83L02R6k41q0K38n1j1K2N8m3L2j62K70k21
6054e4K21j38PJ27k50J1L9j49J01J03K14k71k4j02K88o6m18M47J01j37k02J04
6076d8K68j66k71J22J25p4J2l1r6O3L66j25k10j3O4K05j93J38j12k2l1l6j22K10
6100B3q6J81k71J66L5J50n4k10j6R9j60o0L79j26j97RK42k14L22k07r6L11m41
6123b21Q3n3J45j65K50J73l82K55O7k05M4q7J03k11n9K21N9J33k61J7J06K03k26
$$ plain form
6146 -11 68 -21 105 157 124 -11 -74 -262 92 -24 182 -88 97 -35 -93 -65 15 14 56 -7 -203 152 165 -160 289
6171 289 245 -130 87 86 -81 37 23 37 -58 -63 -74 -21 -169 -181 -192 -150 151 165 6 -10 222 108 -7 251 -159
6196 -159 93 188 -235 65 -196 -120 -68 7 -76 -24 124 191 178 32 -134 213 -25 -297 -319 13 -7 416 117
6219 117 14 -67 -118 38 62 203 -310 22 5 -75 12 -26 233 134 43 244 45 16 -75 141 -150 -121 -14 175
6243 175 -71 -52 -236 -124 -84 -18 179 -153 -131 -311 97 -198 -65 155 -81 -13 114 172 22 -112 -88 -57 256
6266 256 105 -7 177 43 267 -163 131 -119 -81 -152 160 133 -157 -272 -202 -53 160 112 20 53 -128 145
6288 145 86 -48 -106 140 -227 7 -9 -30 11 169 72 -278 -70 119 17 -127 144 260 108 378 58 34
6310 34 -72 181 174 25 -58 -90 -151 3 27 63 -21 133 -112 10 95 -130 38 90 -116 60 117 34 12 81 -103
$$ packed form
6146a1P9q9J26N2l3j35o3j88L54j16K06k70J85j32n8K8Q0jM2o3j96L55J3l25M49
6171B89m4l75K17jj67J18j4J4r5nj1N3j48j2j1M2L01J4j59j6K32j14j15K58m10
6196a59K52R5m23L00k61P6N2P5q3N2J48O7j3j46j66L47k38k72k2L32k0M23k99
6219A17j03q1n1J56K4J41n13L32j7q0Q7l8K59r9r1K01j99k9r1K16k91K9J07J89
6243A75k46J9j84J12M0O6J97l32K2j80M08k95J33K20k36O8J27N8j50j34K4L1L13
6266B56j51j12J84j34K24m30K94k50L8p1L12k7k90j15P0J49K13m8r2L3j81K73
6288A45n9j34n8K46l67K34j6k1M1J58r7l50K08J89j02j44K71J16j52K70l20k4
6310C4j06K53pj49q3l2o1J54K4L6q4J54k45J22Q5k25J68N2k06J76N7q3k2O9j84
$$ plain form
6335 -103 93 195 -125 -85 44 47 -43 -24 -107 -29 109 102 -2 -86 25 -135 34 -33 53 -82 32 -220 58 -2
6359 -2 -98 90 129 104 27 -27 -123 -81 251 246 98 199 -50 71 -15 12 138 53 128 131 -14 47 -46 5 62 -189 79
6386 79 -62 55 -17 -341 -116 102 -350 171 67 -263 27 341 -231 109 137 -158 -118 207 157 159 -19 58 243
6409 243 -266 14 -40 225 -17 -118 27 201 141 78 -23 -55 -22 -5 -17 -143 149 -324 3 64 49 -101 242
6432 242 -88 109 259 94 170 108 82 -159 -13 47 -42 92 -211 -134 -116 -6 -247 68 149 199 80 -208 -156
6455 -156 57 99 -81 186 -116 -14 25 -14 169 38 347 -123 -15 -94 92 44 46 -67 -68 -76 -245 -145 70 -46
6479 -46 -89 67 -184 84 -75 96 -199 -57 21 17 197 64 154 -50 11 333 181 -145 271 -31 -34 82 101
6502 101 136 -9 -39 129 -53 -231 366 19 -53 -200 -180 105 209 48 -75 -143 85 18 1 -106 -33 1 -164
$$ packed form
6335a03J96J02l20M0J29Lr0J9q3P8J38pj04q4J11j60J69o7Q6j35J14k52K78o0
6359br6J88L9k5p7n4r6M2L32nj48J01k49J21q6K7J26q5P5Lj45O1r3N1N7k51K68
6386G9j41J17p2l24K25K18m52N21j04l30K90L14n72L40K8k95M0L25n0Kj78P7J85
6409B43n09K80n4K65k42j01J45J74o0o3j01l2L3J7j2j26K92m73L27O1j5j50L43
6432B42l30J97J50j65P6o2k6k41J46O0q9J34l03P7J8J10k41L15Q1N0j19k88N2
6455a56K13M2j80K67l02J02L9l9J83j31L09m70J08p9J86m8Kj13jqj69J00K15j16
6479d6m3J56k51K68j59J71k95J42P8mJ80j33R0k04O1L22j52l26M16l02lJ16J9
6502A01L5j45l0J68j82j78N97l47p2j47K0K85J04j61j23o8K28o7j7j07P3L4j65
$$ plain form
6525 -164 91 131 -35 -152 0 -205 -24 91 200 0 -91 72 -17 -295 40 -8 18 -106 -61 -247 8 139
6547 139 182 -35 28 101 -226 -214 -25 -49 -238 -169 -48 245 -182 302 -38 -28 -96 -57 5 102 -6 -7 1 -149 -28
6572 -28 30 -343 -259 -77 -156 -9 -112 229 129 52 104 -5 204 -66 265 -20 23 17 -209 228 55 -27 41 -102
6596 -102 -64 178 -117 -47 56 -134 52 28 -173 -75 179 -73 -134 37 46 221 -305 14 -9 47 41 59 244 -1
6620 -1 335 117 173 143 140 59 -196 -80 -35 -46 -30 117 -181 42 -177 7 -37 -108 -289 -71 78 -24 87 62
6644 62 -34 -117 -65 -231 -85 -26 213 -183 152 75 209 -196 74 -67 -100 25 -234 -20 -25 -209 -2 -17 -151
6667 -151 95 -90 93 64 262 -131 117 244 -174 11 170 -109 12 -131 -165 62 -23 164 122 177 -71 156
6689 156 -205 289 -212 32 114 -171 -25 2 -83 -38 -127 -44 87 -232 221 -4 157 40 1 -75 64 66 63 17
$$ packed form
6525a64K55M0j66j17J52k05J81J15J09k00r1J63q9k78L35m8K6j24M5j86K55J31
6547A39M3k17O3P3l27J2J89k4j89O9J21K93m27M84l40J0o8L9O2R7j08jQj50J21
6572b8N8l73Q4J82p9J47j03L41j00p7N2j09K09k70L31k85M3ok26M37j73q2O8j43
6596a02L8K42k95P0J03j90J86k4k01R8K54k52o1J71RJ75n26L19k3N6oJ8J85k45
6620aL36k18N6l0lq1k55J16M5j1J6J47k98K23k19J84m4p1j81K18J49j02J11k5
6644F2r6q3N2j66J46N9K39l96L35p7J34m05K70j41l3J25k59K14nj84K07j5j34
6667a51K46j85J83k9J98l93K48J27m18J85J59k79J21j43l4K27q5J87m2N5k48K27
6689A56l61M94n01K44Q2k85J46K7q5M5q9Q3J31l19M53k25J61j17l9p6J39Klm6
$$ plain form
6713 17 -206 -11 -122 -165 -39 -232 -19 -68 113 196 10 -112 90 -71 -75 80 18 3 65 -76 -129 -164 -176 409
6737 409 28 192 -53 59 270 -80 161 6 -43 -24 -103 91 150 -131 -107 102 28 -161 55 5 98 8 -123
6760 -123 -45 -161 -131 -60 -174 25 -42 19 -2 -78 -97 -131 -241 373 -82 -87 11 -83 223 131 -30 -124 45 156 -147
6785 -147 -177 74 -41 -175 226 -315 -9 71 52 128 -176 209 72 68 -30 -237 61 17 145 -168 52 -263 48
6808 48 161 -43 -11 350 55 -123 -129 141 67 44 364 -75 75 -19 -86 44 110 -33 21 -190 -34 68 -89
6831 -89 -105 -54 -86 102 -96 6 -115 104 23 106 145 0 -111 -19 -50 -201 -42 2 -156 14 -140 -135 56 -61
6855 -61 8 -25 -187 -118 -67 -80 118 -47 -183 -102 -58 -74 8 54 135 -20 -81 -312 47 -37 -2 429 286 180 243
6880 243 123 -56 81 -239 -118 -96 43 -101 3 169 -47 67 5 301 96 13 227 5 -82 -252 5
$$ packed form
6713A7k23J95j11m3J26j93K13m9J81Q3j86j22K02j61mJ55o2j5O2j41n3l5j2N85
6737D09l81J64k45J12K11l50K41j55m9J9p9J94N9k81K4K09p4j89K16n0R3r0j31
6760a23P8j16L0P1j14J99o7O1k1p6j9l4j10O14m55nR8r4L06r2j61r4J69J11l03
6785a47l0K51j15j34M01n41L06Q0j9P6l04L85j37mr8k07K98m4J28l13K20l15L11
6808D8J13k04L2L61k95j78oK70p4k3L20m39J50r4o7J30O6j43N4k11J56J02j57
6831h9j6N1l2J88j98J02j21K19q1Q3L9j45j11R2l1j51J59M4j58J70j54NJ91j17
6855f1O9l3j62O9N1j3J98j65j36Q1M4j6Q2M6Q1j55o1k31L59q4L5M31j43j06O3
6880B43j20j79J37l20J21K2J39j44J04J66k16J14o2K96k05q3K14k22q7j70K57
$$ plain form
6901 5 54 -148 -161 -122 -188 31 -65 8 -19 148 80 63 63 -71 -294 -21 163 84 66 53 144 12 -275 -37 -86 -22
6927 -22 185 -106 258 -132 167 135 -139 -98 -140 -90 -142 -159 -123 197 -48 221 137 190 148 161 -67 73 -147 399
6951 399 -23 37 -47 -91 81 2 68 116 37 -45 -95 -50 -206 -80 3 -71 51 -23 -56 124 78 -162 -88 165 -207
6976 -207 -235 -51 -102 -221 -69 -311 44 213 -122 -139 108 15 176 -21 28 -45 45 -107 -86 -32 -13 166 -72
6999 -72 82 -196 50 105 -98 -179 -168 77 77 98 0 203 160 -119 3 -201 101 -220 -97 -179 -76 -21 -43 34
7023 34 -3 64 -87 -137 -84 -154 -108 -186 -100 54 120 33 17 -90 -361 48 -150 101 -155 31 -7 -126 -113 11 200
7048 200 176 -124 -54 232 -50 127 173 -100 185 83 131 151 -46 95 -103 142 -35 -40 -30 -24 -77 -264 108 38
7072 38 270 -129 -101 -221 24 -77 -65 -66 146 140 -78 199 -68 25 -56 -20 79 -61 79 43 -107 -73 -89 -65 -81
$$ packed form
6901EM9k02j3L9o6K19r6P3k7J67o8j7%j34k23K73J84p9j8j3R1j32k87K38m9O4
6927b2K07k91L64l90K99l2k74M1m2N0n2j7L6L20k45K69q4N3m2J3k28J40k20N46
6951C99m22O0q4m4J72p9O6M8p9q2n0M5j56J26Q3p4J22p4l3J80m6k40P4K53l72
6976b07k8J84n1j19J52k42L55J69l35j7K47r3J61j97M9p3R0j52K1N4J9J79k38
6999g2J54k78K46N5k03q1J1K45%K1r8K03m3k79J22k04L02l21J23q2J03N5k2P7
7023C4l7O7j51n0N3p0M6p8Q6J54O6q7j6j07k71M09j98K51k56J86l8j19J3J24J89
7048B00k4l00P0K86k82J77M6k73K85j02M8K0j97J41j98K45j77nJ0On3j87L72p0
7072C8K32l99K8j20K45j01J2jK12ok18K77k67R3q1L6R9j40J40l6j50L4j6K4j6
$$ plain form
7097 -81 -208 -155 119 74 62 28 171 -34 -9 93 -47 -149 -137 135 154 137 -409 -144 -170 -306 -184 -48 208
7120 208 125 203 -10 -66 -112 -47 62 43 252 -21 -45 35 -219 -212 12 27 26 146 -92 14 145 146 -71 -15 286
7145 286 147 -131 -216 128 97 53 78 199 54 45 -22 12 169 -114 187 -117 70 -29 -8 -3 -9 -137 83 296 33
7170 33 -212 163 185 -138 7 198 -67 -52 -46 271 47 -77 307 51 -143 -239 155 -174 63 -160 -1 46
7192 46 -127 -185 341 73 167 72 39 11 -245 81 -196 58 -152 -274 240 36 63 159 37 267 27 111 38
7215 38 66 15 68 -108 -377 -201 93 -80 -38 -28 241 -137 9 111 -311 -42 136 39 25 -121 -150 -212 203
7238 203 5 138 1 134 -396 82 44 24 -12 72 16 -16 -59 -23 69 170 -206 26 189 53 112 -198 195
7261 195 -99 0 92 -379 25 21 137 -13 -69 210 261 178 134 67 91 -8 -93 94 -174 -105 -10 -69 -79 -21 161 -83
$$ packed form
7097h1j27N3K74m5j2l4J43k05K5J02j40j02J2K72J9j7n46K65k6j36J22J36K56
7120B08q3P8k13n6m6O5J09j9K09k73k4Q0k54PK24J5jJ20k38J06J31Jk17N6L01
7145B86j39k78q5L44l1m4K5J21j45ro7L4J57k83L01l04J87r9K1Noj28K20K13k63
7170C3k45L75K2l23J45J91k65J5OL17k24j24L84k56j94r6L94l29K37k23J59M7
7192D6j73n8N26k68R4r5l3k8k56L26k77K54k10j22N14k04K7R6j22K30k40Q4p3
7215C8K8n1N3j76k69J76K94j73M2J0K69l78J46J02m22K69J78r7j4j46k9o2M15
7238B03j98J33j37J33n30M78l8k0l6Q4n6l2m3L6R2J01l76K32J63j36N9l10L93
7261A95k94R9R2m71M04mJ16j50n6K79N1q3m4o7K4r9q5J87k68O9R5n9j0N8J82k44
$$ plain form
7287 -83 -371 128 -104 -50 230 -40 169 -184 150 -12 263 -48 -11 100 164 -250 -33 199 66 166 -106
7308 -106 -71 105 -199 119 299 -11 -154 -100 137 -51 89 -135 12 104 -183 271 77 -36 121 134 114 -179
7330 -179 153 -96 123 -219 -91 -76 65 -192 83 237 6 -166 -163 269 99 -261 9 122 -186 -139 -69 -34
7352 -34 -187 -28 98 122 105 10 -42 -67 -63 175 -66 -278 86 4 -133 -83 -1 -35 240 75 149 -62 -136 1 -153
7377 -153 -72 -463 -496 -37 89 14 74 211 -3 -244 43 96 -152 -53 72 -93 167 -235 105 -129 22 -93
7399 -93 187 92 -15 11 83 -4 53 -242 -171 -26 -274 129 -5 84 8 -18 52 24 -80 360 21 -91 -239 -50
7423 -50 -159 -177 -46 -11 119 112 85 12 14 -151 98 -5 4 19 -33 188 -83 227 -15 23 5 -65 286 -198 221
7448 221 -107 -8 -181 -104 256 -50 -153 165 39 110 -6 96 312 -12 15 14 85 -123 154 245 -247 12 -18
$$ packed form
7287h3k88M99k32N4K80k70K09l53L34j62K75l11L7J11O4m14K17K32j33J00k72
7308a06L5J76l04L18J80l10j43N4K37j88J40k24J47R2k87M54j94j13J57J3k0k93
7330a79L32k49K19l42J28J5J41k57K75J54k31j72LM32j70l60K70J13l08M7P0L5
7352c4j53J59J26K4j7r5n2k5MK38k41k12L64q2j37N0Q2l4K75j65P4k11p4J37j54
7377a53Q1l91l3M59J26p5O0J37k14k41K87N3k48R9J25j65K60m02L40k34J51j15
7399i3K80r5j07K6P2q7N7k95P1J45k48M03j34Q9p6k6P0k8j04M40l39j12j48J89
7423e0j09j8J31L5J30pk7p3Kj65K49j03RJ5n2K21k71L10k42L8j8p0L51m84M19
7448B21l28R9j73P7L60l06j03L18j26P1j16J02K16l24K7jP1k08K77R1m92K59l0
$$ plain form
7471 -18 -97 102 -14 -112 -56 225 -22 -171 79 343 58 -116 161 -312 223 -202 3 -67 -42 147 95 -57
7493 -57 -280 -66 -22 69 -110 114 88 20 156 -75 -400 7 87 -200 -164 30 148 202 -104 72 -201 84 62
7516 62 4 -144 -22 69 27 271 145 -215 54 -29 -43 -74 84 -23 -27 -452 -121 -56 -123 -75 175 20 19 -19 -307
7541 -307 62 -24 213 95 135 144 210 321 209 59 -58 -31 -213 -65 44 -88 231 -96 119 -12 46 95 132
7564 132 -71 50 133 -247 -204 -113 104 85 22 217 124 -43 -194 3 -57 -139 230 -78 40 -257 48 -72 114
7587 114 -37 -179 233 111 62 106 -162 -17 31 -71 176 -147 -296 -40 69 88 118 130 -138 -123 272 -123
7609 -123 -150 74 -188 142 -468 -20 -212 -295 5 3 -83 -109 -162 192 85 -199 -72 90 -31 -66 73 164 -126
7632 -126 -121 -7 -60 -48 7 162 57 -15 90 58 96 41 180 -148 14 -135 120 -134 128 -203 -90 40 -2
$$ packed form
7471a8p9J99j16r8N6K81k47j49K50K64k85j74K77m73N35m25K05p0K5J89n2j52
7493e7k23K14M4R1j79K24k6o8J36k31l25M07Q0k87L6J94J18N4l06J76k73K85k2
7516F2n8j48J22R1m2K44j26l60K69q3j4l1J58j07mm25L31O5o7M8K50j55jl8k88
7541c07L69q6K37j18M0RO6J11j12j50j17K7j82J48J09j32L19l27K15j31N8M9L7
7564A32k03J21Q3l80M3R1K17j9o3J95r3j67j51J97o0q2L69l08J18k97L05j20J86
7587A14j51j42M12j22m9M4k68J45M8j02K47l23j49K56J09J9L0J2k68J5L95l95
7609a23k7K24k62L30o10M48j92q3L00kq6k6n3L54j07k84J27J62j21l5J39R1k90
7632a26NJ14n3J2N5J55j05p2J05l2L8n5J39l28J62j49K55k54K62l31J13J30m2
$$ plain form
7655 -2 85 -7 114 -126 -232 -107 -127 -54 -247 6 -33 28 -14 -181 -165 -264 201 149 112 217 38 -58 40 150 23
7680 23 71 65 171 4 -284 -234 93 124 -76 146 14 53 181 -70 -190 174 -12 -59 -25 9 200 -138 -2
7703 -2 -147 -103 -97 -129 8 82 -34 -172 59 83 -5 126 4 -319 -112 57 264 -153 0 -253 85 -54 174
7726 174 205 55 -55 26 -52 326 -171 68 -2 -61 -74 60 -107 -65 -126 160 -94 -20 3 -33 72 -34 220 -124
7750 -124 166 71 186 204 54 107 -30 74 -134 -148 -22 -35 129 -62 -51 -218 44 -62 -142 -181 122 39 68
7773 68 -72 -12 -43 20 61 0 -68 130 127 -82 53 198 18 -203 12 -11 -147 79 24 -114 -40 13 205 118 -99
7798 -99 -85 -6 22 20 262 53 65 -29 -94 -11 229 71 -73 -24 19 132 58 -43 -58 174 36 22 94 -76 -368
7823 -368 -13 55 48 101 46 62 -192 -135 159 89 19 -149 -283 161 -37 36 -231 28 194 -102 -215 -151 -63 34
$$ packed form
7655bQ7r2J21k40j06J25k0P3j93K53l9O1m2j67J6r9M65n2l7J05j79r6R8J10j27
7680B3M8oJ06j67k88N0L27L1k00K22j32L9J28k51j20L64j86m7L4L4J91l38J36
7703bj45M4Ol2J37P4j16j38K31K4q8J31j22l23K07J69K07m17J53k53L38j39K28
7726A74L1j50j10Q1p8L78m97K39p0n9j3J34j67M2o1K86k54P4K3l6J05j06K54l44
7750a24K90r5J15J8j50N3j37J04k08j4J26j3J64j91J1j67K62j06q0l9L03q3K9
7773F8j40O0l1O3M1o1o8J98lk09J35J45j80k21K15k3j36K26n5j38P4N3J92q7k17
7798i9J4P9K8kK42k09J2r4o5Q3K40j58j44M9M3J13p4j01j5K32j38j4P2j70k92
7823c68L55O8pN3n5J6k54N7K94p0p0j68j34M44j98P3k67K59J66k96j13O4Q8R7
$$ plain form
7847 34 -31 94 39 -146 -7 -20 136 203 209 -91 -78 244 71 106 10 -25 -17 167 8 -126 -114 318 24 9 -279
7872 -279 16 -79 174 -77 -115 110 -16 -21 -81 157 -150 -74 -48 -102 -127 -125 269 123 -205 310 -7 152 10 131
7896 131 101 109 253 245 -25 111 -63 153 -8 -116 159 41 180 -150 125 -66 134 -19 -49 -150 -75 -155 -52
7919 -52 -185 -3 -10 102 -210 -229 -151 61 91 143 316 137 -265 -30 -50 -22 5 77 -164 28 -3 -389 177 75
7943 75 -56 30 -51 124 -50 93 109 -184 72 -141 26 -38 -47 76 193 -110 -214 119 -114 -27 -62 14 -60 175
7967 175 -6 15 -90 110 -2 -60 -12 -114 171 -104 79 -138 135 -40 -15 127 -11 72 0 74 177 130 -188
7990 -188 -9 77 57 20 -19 -133 -163 -154 -75 53 25 -146 57 38 -64 -10 15 -38 175 94 -34 -153 -204 0 101
8015 101 -87 67 -217 55 42 17 -117 -55 60 149 66 -171 113 -25 44 86 16 -99 -60 -41 -100 -76 -78 -13 -154
$$ packed form
7847C4o5J25n5j85J39j3J56O7Ol00J3L22j73L5r6l5QJ84j59j34J2M32k94j5k88
7872b79K95r5K53k51l8K25j26no0K38l07P6K6n4k5KL94j46l28N15l17J59j42J21
7896A31l0QJ44qk70J36j74K16j61j08K75j18J39l30K75j91K00j53l0j01P5q0J03
7919e2j33J82pJ12l12j9P8K12L0N2J73j79m02K35k0K8K7P2k41J92l1l86N66j02
7943G5j31Q6q1J75j74J43J6k93K56k13J67o4rJ23J17l03j04L33k33Q7l5P6p4K35
7967A75j81K1j05K00j12n8M8j02K85k75J83k17K73j75K5J42j38Q3p2P4J03m7l18
7990a88J79Q6k0l7l9j14l0RP9J28k8j71K03j9j02N4K5n3K13q1j28j19n1K04J01
8015A01j88J54k84K72j3k5j34O2J15Q9q3k37K84j38O9M2p0j15L9J9n9K4kO5j41
$$ plain form
8040 -154 -31 45 53 136 -162 200 42 -270 69 53 -10 215 -158 -92 60 -207 95 -54 -38 19 37 23 -57 127
8064 127 -1 254 -25 -4 131 115 49 -118 20 -66 -114 -90 75 -47 -46 97 -8 31 -7 24 -29 -58 -85 28 -38
8089 -38 -44 -150 147 -125 -146 42 73 -250 -150 -30 43 96 -3 -11 21 141 38 19 -27 203 8 -118 67 67 -152
8114 -152 195 60 172 -281 7 31 47 60 120 -58 27 -157 -81 -20 -280 -15 -228 -212 -43 179 -12 -73 -110
8137 -110 28 3 -209 -7 -161 -100 113 -112 -31 91 -153 132 -9 -59 -13 20 58 -220 -139 223 -15 46 12
8160 12 131 121 98 150 -179 -187 -92 234 183 9 -49 -117 65 -65 -230 146 14 220 251 32 54 152 -31 39 -130
8185 -130 53 37 -88 -71 -114 -161
$$ packed form
8040a54J23P6QQ3k98L62j58l12L39j6o3K25l73O6J52k67L02j49J6N7J8j4q0J84
8064A27j28K55k79K1J35j6o6j67J38q6m8K4J65j22JJ43j05L9l8L1n3k9k7J13o6
8089c8oj06K97k72k1J88L1l23J00J20P3N3r9qL2J20j03j9m6K30j95j26J85%k19
8114a52L47j35J12m53K88K4J6J3O0j78Q5j84P6O1k60K65k13J6J69K22j91o1l7
8137a10J38k5k12K02j54O1K13k25Q1J22k44K85j41n0M6L3L8k78Q1L62k38O1l4
8160A2J19j0k3N2l29qR5L26n1j74n8o8J82j30j65L76j32K06L1k19K2R8j83P0j69
8185a30J83j6j25J7m3m7
8191a61
$$ Imaginary data points
##PAGE= N=2
##DATA TABLE= (X++(I..I)), XYDATA
$$ plain form
0 0 0 0 0 0 0 0 0 0 0 0 0 -5 0 -8 8 -8 8 -14 16 -16 24 -24 32 -37 41 -48 56 -65 77 -86 100 -110 127 -143 164
35 164 -183 204 -229 253 -284 315 -350 388 -430 474 -524 577 -638 703 -774 852 -938 1036
53 1036 -1145 1265 -1403 1560 -1744 1956 -2209 2520 -2904 3396 -4055 4981 -6380 8736 -13430
68 -13430 26457 -140526 -491591 -266737 9205 142179 231449 296712 203475 75841 4338
79 4338 -14842 -25249 -12973 35277 155264 226634 136031 -32977 -167456 -287808 -282908 -76710
91 -76710 99867 54736 -38154 -54249 -98767 -174364 -147936 -60239 -12329 45790 151251 209461
103 209461 165997 46378 -72528 -86949 26795 168397 239147 193773 65615 -23269 -24289
114 -24289 -50490 -126999 -107062 57 15649 -36843 -28679 -38477 -141214 -207958 -154221 -53307
$$ packed form
0@%%%%%%%%%%%nNqJ6j6J6k2L0l2M0m8N6o9P8q9J04j21J42j63J86k10K37k70L07
35A64l47L87m33M82n37N99o65P38q18R04r98J101j215J341j477J626j790J974
53A036k181K410k668K963l304L700m165M729n424O300p451R036j1361J5116k2166
68a3430L9887j66983l51065K24854K75942J32974Q9270O5263r3237j27634p1503
79D338j9180j0407J2276M8250J19987P1370r0603j69008j34479j20352M900K06198
91g6710J76577m5131r2890j6095m4518p5597K6428Q7697M7910N8119J05461N8210
103B09461m3464j19619j18906j4421J13744J41602P0750m5374j28158q8884j020
114b4289k6201p6509J9937J07119J5592n2492Q164r798j02737o6744N3737J00914
$$ plain form
126 -53307 26389 65188 55020 17512 -12053 -15974 7510 33325 44818 84966 150402 145615
138 145615 70741 27949 4916 -48713 -59035 13575 60833 21496 -30388 -44588 -58929 -91198
150 -91198 -110661 -103489 -68707 -8962 48695 59253 8327 -50106 -55033 -23891 3780 50064
162 50064 115686 127279 68212 28930 39705 23015 -29000 -29500 26937 61188 51368 17103 -42547
175 -42547 -110797 -130804 -83570 -24176 -2984 -2467 1438 -13151 -47953 -54041 -26369 -18076 -19214
188 -19214 39322 119468 117799 45850 -6680 -18291 -9054 23854 75177 93675 54815 2846
200 2846 -22369 -37071 -58374 -64643 -44551 -26085 -14845 9443 15791 -37914 -98343 -84075 -20595
213 -20595 21026 37528 49739 39048 1650 -13610 9567 27565 24354 29909 53117 64660
$$ packed form
126e3307P9696L8799j0168l7508k9565l921K3484K5815J1493M0148O5436m787
138A45615p4874m2792k3033n3629j0322P2610M7258l9337n1884j4200j4341l2269
150i1198j9463P172L4782N9745N7657J0558n0926n8433m927L1142K7671M6284
162E0064O5622J1593n9067l9282J0775j6690n2015n00N6437L4251r820l4265n9650
175d2547o8250k0007M7234N9394K1192N17L905j4589l4802o088K7672Q293j138
188a9214N8536Q0146j669p1949n2530j1611R237L2908N1323J8498l8860n1969
200B846k5215j4702k1303o269K0092J8466J1240K4288O348n3705o0429J4268O3480
213b0595M1621J6502J2211j0691l7398j5260K3177J7998l211N555K3208J1543
$$ plain form
225 64660 49082 21745 -10632 -47668 -57160 -16116 26191 14074 -23768 -35069 -35749 -50299 -47802
238 -47802 -19351 -8752 -18219 -4371 25548 27880 3250 -13396 -8820 7357 30589 55127 58310
251 58310 32558 8325 13706 22522 5669 -10997 -4345 -2961 -14110 -8047 1947 -22632 -59224
264 -59224 -56743 -25912 -6746 -2103 2792 168 -9799 -9471 2547 5494 -5271 -1916 28337 53704
278 53704 48300 32282 19176 -2865 -18871 1025 31844 26297 -1294 -10374 -10145 -23544 -35949
291 -35949 -35530 -33167 -27155 -5480 17762 15272 -13446 -37517 -35941 -15290 10255 34456 43916
304 43916 27806 5087 5246 14923 8245 385 13200 30734 33770 28644 12848 -21172 -50648
317 -50648 -44570 -14027 7316 9867 545 -15442 -31009 -33451 -20811 -8198 -6304 -387 18784
$$ packed form
225F4660j5578k7337l2377l7036r492M1044M2307j2117l7842j1301o80j4550K497
238d7802K8451J0599r467J3848K9919K332k4630j6646M576J6177K3232K4538L183
251E8310k5752k4233N381Q816j6853j6666O652J384j1149O063R994k4579l6592
264e9224K481L0831J9166M643M895k624r967L28J2018K947j0765L355L0253K5367
278E3704n404j6018j3106k2041j6006J9896L0819n547k7591r080K29j3399j2405
291c5949M19K363O012K1675K3242k490k8718k4071J576K0651K5545K4201R460
304D3916j6110k2719J59R677o678p860J2815J7534L036n126j5796l4020k9476
317e0648O078L0543K1343K551r322j5987j5567k442J2640J2613J894N917J9171
$$ plain form
330 18784 31087 18166 -3831 -13434 -11897 1180 29954 52440 41868 11136 -7126 -10783 -11492
343 -11492 -7289 286 1486 -4439 -5144 -3599 -13753 -31912 -38932 -23930 -664 14585 18215 10037
357 10037 -7054 -19690 -10512 8322 15738 13782 16384 20484 17689 13416 10181 779 -7873 -1165
371 -1165 14618 17974 3335 -14532 -24700 -25900 -18530 -7091 -2069 -7125 -11368 -6197 936 -311
385 -311 -7181 -9635 -5594 2851 14294 21730 15317 1769 -1166 8557 15564 14032 10418 5956 2393
400 2393 3682 6907 -577 -14710 -22049 -17628 -8136 -353 164 -6568 -13536 -13728 -6279 2531 2834 -3295
416 -3295 -3158 6160 13053 11146 6466 612 -2958 5430 19659 23428 14618 3939 -5032 -9670 -6496
431 -6496 -2765 -6373 -10848 -9434 -4210 -1040 -4555 -15208 -18957 -10112 1587 9099 11912 5969 -6414
$$ packed form
330A8784J2303j2921k1997r603J537J3077K8774K2486j0572l0732j8262l657p09
343a1492M203P575J200n925p05J545j0154j8159p020J5002K3266J5249L630q178
357A0037j7091j2636R178J8834P416j956K602M100k795m273l235r402q652O708
371a165J5783L356j4639j7867j0168j200P370J1439N022n056m243N171P133j247
385c11o870k454M041Q445J1443P436o413j3548k935R723P007j532l614m462l563
400B393J289L225p484j4133p339M421R492P783N17o732o968j92P449Q810L03o129
416c295J37R318O893j907m680n854l570Q388J4229L769q810j0679q971m638L174
431f496L731l608m475J414N224L170l515j0653l749Q845J1699P512K813n943j2383
$$ plain form
446 -6414 -8912 68 7123 10447 11636 9473 7992 11957 12568 3273 -5327 -6446 -1308 6082 8160
461 8160 -804 -12728 -17545 -15977 -9639 539 4136 -1616 -5566 -3092 -1881 -2883 -3238 -5400 -3537
476 -3537 6966 15333 11613 4047 -222 -371 5473 13431 13740 6899 28 -4963 -6209 -1653 -430
491 -430 -7036 -10960 -7032 -2075 -858 -3552 -9989 -12809 -5656 3118 5268 3581 -158 -4717 -2829
506 -2829 6117 11935 11007 6894 3507 4264 8500 9448 3243 -2775 -2556 124 1015 -1289 -8488 -14666
522 -14666 -12258 -4188 867 1411 -1786 -8418 -11549 -5520 2567 4330 3693 2188 1985 5989 9224 5206
538 5206 390 2786 7438 11205 12577 7798 -2928 -9601 -8902 -4711 1214 3320 -4011 -10773 -9487
553 -9487 -5666 -6156 -6126 -4299 -1359 3868 7737 4360 -1832 -5171 -4755 1214 10816 15178 10250 4336
$$ packed form
446f414k498Q980P055L324J189k163j481L965O11r295q600j119N138P390K078
461H160q964j1924m817J568O338J0178L597n752l950K474J211j002l55k162J863
476c537J0503Q367l720p566m269j49N844P958L09o841o871m991j246M556J223
491d30o606l924L928M957J217k694o437k820P153Q774K150j687l739m559J888
506b829Q946N818r28m113l387P57M236R48o205o018K19K680Q91k304p199o178
522a4666K408Q070N055N44l197o632l131O029Q087J763o37j505k03M004L235m018
538E206m816K396M652L767J372m779j0726o673O99M191N925K106p331o762J286
553i487L821m90L0J827K940N227L869l377o192l339M16N969R602M362m928n914
$$ plain form
569 4336 461 -1250 813 3840 2430 -154 962 1384 -1692 -6324 -10665 -12953 -8176 -114 3712
584 3712 3640 24 -7658 -11126 -4171 3108 5025 4458 4004 3666 4894 5639 1401 -54 4422 7506 9319
601 9319 10511 5039 -5136 -9551 -8036 -5190 -1194 -310 -6029 -9221 -5920 -4591 -4512 -3124 -3551 -2383
617 -2383 3699 7606 4087 765 -865 -1793 3313 11595 12472 6996 3098 1438 1932 4806 2829 -4311
633 -4311 -6286 -4223 -3672 -3688 -4105 -8889 -11308 -6547 -810 752 1804 -28 -3991 -2689 4245 6164
649 6164 2741 1008 611 3403 9115 10279 4962 2192 1863 1228 3044 4221 -999 -7001 -6527 -5189
665 -5189 -4912 -3518 -5919 -10647 -7704 338 3566 1544 -1274 -4178 -3646 1556 4930 4857 5156 3694
681 3694 1925 5587 8719 5350 1968 2158 2969 3881 4618 -176 -8485 -11250 -7415 -3845 -2174 -2156 -4675
$$ packed form
569D336l875j711K063L027j410k584J116M22l076m632m341k288M777Q062L826
584C712p2l616p682l468O955P279J917n67m54l38J228P45m238j455M476L084J813
601I319J192n472j0175m415J515K846L996Q84n719l192L301J329P9J388m27J168
617b383O082L907l519l322j630r28N106Q282Q77n476l898j660M94K874j977p140
633d311j975K063N51j6m17m784k419M761N737J562J052j832l963J302O934J919
649F164l423j733l97K792N712J164n317k770l29o35J816J177n220o002M74J338
665e189K77J394k401m728K943Q042L228k022k818k904N32N202L374p3K99j462
681C694j769L662L132l369l382J90Q11R12P37m794q309k765L835L570J671J8k519
$$ plain form
698 -4675 -5792 -4581 -2743 -815 128 -1396 -695 3906 7218 4640 262 -629 1040 5940 11522 10990
714 10990 5158 645 -644 -1117 -1086 -946 -3258 -5469 -5754 -4041 -3819 -5952 -9257 -8270 -2416 3110 4127
731 4127 1893 -1306 -3956 -2232 3334 6728 5722 5143 5331 4997 4601 4551 2804 190 -152 2994 3988
748 3988 -489 -7343 -10524 -9202 -6052 -2154 -899 -2105 -4689 -4743 -1998 375 -118 -252 1132 3430
764 3430 4926 5664 3888 -31 -425 4502 9047 9046 5545 1709 -2077 -3652 -2142 -1237 -2478 -4619 -4817
781 -4817 -3983 -4044 -5368 -5761 -5079 -3111 759 4392 4064 -479 -3685 -1476 2468 4627 6068 6326 4215
798 4215 2813 3805 4667 2651 372 59 663 1003 -768 -3806 -7548 -9807 -7708 -2561 578 -937
814 -937 -3071 -2717 -1788 -1143 1219 2722 1834 1383 3572 5294 3708 1691 1202 2354 4367 6529 6424
$$ packed form
698d675j117J211J838J928R43j524P01M601L312k578m378q91J669M900N582n32
714A0990n832m513j289m73L1J40k312k211k85J713K22k133l305R87N854N526J017
731D127k234l199k650J724N566L394j006n79J88l34l96n0j747k614l42L146R94
748C988m477o854l181J322L150L898J255j206k584n4K745K373m93j34J384K298
764C430J496P38j776l919l94M927M545jl501l836l786j575J510R05j241k141j98
781d817Q34o1j324l93O82J968L870L633l28m543l206K209L944K159J441K58k111
798D215j402R92Q62k016k279l13O04L40j771l038l742k259K099N147L139j515
814i37k134L54R29O45K362J503q88m51K189J722j586k017m89J152K013K162j05
$$ plain form
831 6424 2354 -2602 -4334 -3362 -2253 -3116 -4121 -4251 -4790 -4458 -2662 -1504 -3278 -3398 -8 3604 3409
848 3409 2537 1366 -417 -177 2909 5642 5003 3296 2812 3331 2857 2085 631 -1264 -2594 -2565 -1663 -2088
866 -2088 -5141 -7366 -6014 -3632 -1647 -126 284 -797 -1234 1029 3232 2151 1223 1499 2353 3535
882 3535 4344 4500 2878 1035 1481 2769 3167 787 -1418 -3019 -3337 -3794 -3784 -3996 -5407 -5569 -2897 -82
900 -82 350 -365 -310 -484 410 2685 4168 2898 1604 1733 2950 3614 3439 2164 1276 1536 2189 2409 1713
919 1713 -2136 -5121 -4921 -3574 -3014 -3024 -2667 -4091 -4432 -1805 -157 -380 -107 883 2338 3430 4006 2665
937 2665 535 8 1366 3917 5798 4486 1857 711 225 -426 -155 -656 -3031 -3996 -2452 -2570 -4121
954 -4121 -5092 -5152 -4352 -1600 2007 2775 1195 -511 -761 505 2793 3748 3309 3481 3399 2694 3144 2592 404
$$ packed form
831F424m070m956j732R72J109q63j005j30n39L32J796J158j774j20L390L612j95
848C409q72j171j783K40L086K733o39j707m84N19m74p72j454j895j330K9R02m25
866b088l053k225J352K382J985J521M10j081m37K263K203j081r28K76Q54J182
882C535Q09J56j622j843M46J288L98k380k205j601l18m57J0k12j411j62K672K815
900h2M32p15N5j74Q94K275J483j270j294J29J217O64j75j275q88K60O53K20o96
919A713l849k985K00J347N60j0L57j424l41K627J648k23K73R90J455J092N76j341
937B665k130n27J358K551J881j312k629j146m86o51K71n01k375r65J544j18j551
954d121r71o0Q00K752L607P68j580j706k50J266K288R55m39J72q2p05M50n52k188
$$ plain form
973 404 -414 1463 2220 1255 -508 -3588 -6071 -5857 -4063 -3196 -1811 -1987 -2426 -2106 -597 -511 204 985
991 985 2307 3302 4521 3948 1058 2 534 1994 3566 4654 3219 688 -124 -961 -1406 -1775 -2571
1008 -2571 -3125 -2997 -2517 -2618 -3494 -4080 -4374 -1845 1272 2987 2276 1435 373 124 877 2445 2861 2721
1026 2721 2844 2169 2160 1975 573 -564 309 1104 1102 485 -1840 -4657 -5313 -3959 -2856 -1777 -874 -1575 -1558
1045 -1558 -153 427 354 597 888 1448 3189 3712 2181 794 -213 219 1760 3556 3335 1353 -19
1062 -19 -693 -1540 -1663 -1726 -2740 -3362 -2809 -1907 -1829 -2537 -3224 -2657 -287 2173 2420 2094 818 590 911 2120
1082 2120 2319 1791 1374 2004 2578 2560 2023 571 -1015 -1060 -7 361 -665 -2822 -4414 -4241 -3243 -1786
1100 -1786 -1069 -1394 -1159 60 1179 1586 898 468 623 1220 2693 2557 1768 703 221 1202 2153 1602
$$ packed form
973D04q18J877P57r65j763l080k483K14J794Q67J385j76m39L20J509Q6P15P81
991I85J322R95J219n73k890j056N32J460J572J088j435k531q12q37m45l69p96
1008b571n54J28M80j01q76n86k94K529L117J715p11q41j062k49P53J568M16j40
1026B721J23o75rj85j402j137Q73P95ko17k325k817o56J354J103J079R03p01J7
1045a558J405N80p3K43K91N60J741N23j531j387j007M32J541J796k21j982j372
1062a9o74q47j23o3j014o22N53R02P8p08o87N67K370K460K47l26j276k28L21J209
1082B120J99n28m17O30N74j8n37j452j586m5J053L68j026k157j592J73R98J457
1100a786P17l25K35J219J119M07o88m30J55N97J473j36p89j065m82R81R51n51
$$ plain form
1118 1602 1160 445 -588 -1217 -574 -1549 -3605 -3673 -2696 -2024 -1110 -291 -1272 -1815 -982 444 1564 2221 1014
1137 1014 451 1283 1670 802 1156 1423 1039 1558 3129 2574 689 -259 -690 -1583 -1458 -997 -1895 -2569 -2531
1156 -2531 -2536 -1815 -1366 -1724 -877 747 1387 919 1715 1215 -631 -88 1982 2054 1519 1802 1729 728 811 1640
1176 1640 825 -471 -385 -103 -236 -1202 -2982 -3194 -2751 -3023 -1652 719 644 -1097 -950 524 539 -182 1315
1195 1315 1796 879 1231 2229 1207 -109 73 1136 2274 2364 1524 911 -828 -2644 -1822 -962 -1491 -2425
1213 -2425 -1647 -1249 -1763 -1876 -772 -562 -1145 425 2621 2658 778 299 369 -38 470 1747 2922 1761
1231 1761 450 1254 1309 -404 -840 -12 361 -1480 -1504 -787 -2152 -4157 -3190 -664 44 -434 752 1352
1249 1352 -312 -1030 1146 1619 -19 223 2176 2332 512 702 1522 612 -76 1283 2990 1194 -1222
$$ packed form
1118A602m42p15j033o29O43r75k056o8R77O72R14Q19r81n43Q33J426J120O57j207
1137A014n63Q32L87q68L54K67l84N19J571n55j885r48m31q93J25M61q98o74L8
1156b531nP21M49l58Q47J624O40m68P96n00j846N43K070P2n35K83p3j001Q3Q29
1176A640q15j296Q6K82j33r66j780k12M43k72J371K371p5j741J47J474J5p21J497
1195A315M81r17L52R98j022j316J82J063J138R0q40o13j739j816Q22Q60n29r34
1213b425P78L98n14j13J104K10n83J570K196L7j880m79P0m07N08J277J175j161
1231A761j311Q04N5j713m36Q28L73j841k4P17j365k005R67K526P08m78J186O00
1249A352j664p18K176M73j638K42J953J56j820J90Q20r10o88J359J707j796k416
$$ plain form
1266 -1222 -1563 -1371 -2617 -3253 -1141 -606 -2340 -2015 92 270 -1686 -1174 1525 1219 447 1722 2381
1283 2381 52 -1173 751 2136 1392 683 2366 2275 60 -462 786 31 -2588 -2136 794 -318 -2969
1300 -2969 -2437 -1000 -2169 -2471 740 2318 140 -1106 1045 1553 -379 -405 1596 1262 -418 865
1316 865 2673 1607 -1013 7 2479 1023 -523 604 640 -2499 -3590 -968 -438 -3083 -2618 575
1332 575 787 -1352 -121 1602 -84 -1542 1123 3229 873 -779 830 1803 -346 -594 2274 2247
1348 2247 -513 -431 2271 1003 -2430 -2282 -287 -1473 -2921 -638 659 -2010 -2929 244 1713 -574
1364 -574 -832 2222 1942 -291 34 2080 788 -1855 -142 2968 1583 -496 1011 1949 -813 -1974
1380 -1974 1182 1612 -1774 -2606 211 -139 -3381 -2761 321 -430 -2080 551 3094 700 -1737 210
$$ packed form
1266a222l41J92j246o36K112N35j734L25K107J78j956N12K699l06p72J275O59
1283B381k329j225J924J385p44p09J683r1k215n22J248p55k619M52K930j112k651
1300b969N32J437j169l02L211J578k178j246K151N08j932k6K001l34j680J283
1316H65J808j066k620J020K472j456j546J127L6l139j091K622N30k645M65L193
1332E75K12k139J231J723j686j458K665K106k356j652J609R73k149k48K868k7
1348B247k760Q2K702j268l433J48J995j186j448K283J297k669r19L173J469k287
1364e74k58L054k80k233L25K046j292k643J713L110j385k079J507R38k762j161
1380a974L156M30l386q32K817l50l242O20L082p51j650K631K543k394k437J947
$$ plain form
1396 210 2241 -81 -934 2132 2505 -753 -874 2281 1903 -1583 -464 2528 1536 -1377 -576 998 -2382
1413 -2382 -4368 -1044 1488 -1744 -2480 705 1248 -1930 -1080 2216 1924 -814 297 3359 1583 -1640
1429 -1640 -519 1889 270 -1080 1971 3222 -750 -2073 879 1222 -2505 -2698 885 -59 -3032 -1604
1445 -1604 1073 -1356 -3299 -314 3179 845 -987 1674 2645 -1108 -1783 2037 2322 -1143 -537 2728
1461 2728 1874 -1927 -870 2189 59 -2125 441 2548 -1173 -3726 -984 323 -2598 -2735 1354
1476 1354 1878 -1477 -821 2181 1271 -1818 -37 3098 1127 -1359 565 2182 -1009 -2372 1484 3055
1492 3055 -283 -1061 2554 1392 -2658 -1914 1296 -227 -3402 -1126 1729 -888 -3096 -290 1689
1507 1689 -467 -1264 2272 3020 -809 -1893 2091 1692 -2057 -654 2846 1515 -1317 776 3046 -99
$$ packed form
1396B10K031k322q53L066L73l258j21L155l78l486J119K992r92k913Q01J574l380
1413b382j986L324K532l232p36L185N43l178Q50L296k92k738J111L062j776l223
1429a640J121K408j619j350L051J251l972j323K952L43l727j93L583r44k973J428
1445a604K677k429j943K985L493k334j832K661R71l753o75L820K85l465O06L265
1461B728q54l801J057L059k130k184K566K107l721k553K742J307k921j37M089
1476A354N24l355O56L002r10l089J781L135j971k486J924J617l191j363L856J571
1492C055l338p78L615j162m050P44L210j523l175K276K855k617k208K806J979
1507A689k156p97L536P48l829j084L984l99l749J403L500j331k832K093K270l145
$$ plain form
1523 -99 -2405 357 1991 -1022 -2150 327 57 -3014 -2870 706 984 -1988 -668 2539 1451 -1838
1539 -1838 156 2729 -272 -2041 1627 3051 -758 -1742 1479 1696 -1051 -387 2433 1430 -1860 -1017
1555 -1017 1368 -312 -3454 -1868 943 -856 -2702 629 1999 -1635 -1946 1943 2249 -699 -535 2138
1571 2138 926 -1958 -446 1841 306 -1607 904 2950 784 -1706 26 1456 -1488 -2273 848
1586 848 895 -2888 -2268 1167 279 -2093 -501 2028 599 -1431 994 2690 1 -2230 164 1597
1602 1597 -385 -945 1828 1693 -1439 -819 2391 1107 -2007 -537 1987 -500 -2683 -539 930 -1704
1618 -1704 -2340 749 1654 -944 -1270 1305 1261 -1453 -585 2146 1161 -1315 -34 2445 406 -2028 298
1635 298 1915 142 -803 1828 1608 -1450 -2062 114 355 -2154 -1420 703 359 -2255 -743 1361 -87
$$ packed form
1523i9k306K762J634l013j128K477k70l071J44L576K78k972J320L207j088l289
1539a838J994K573l001j769L668J424l809r84L221K17k747O64K820j003l290Q43
1555a017K385j680l142J586K811j799j846L331J370l634l11L889L06k948J64K673
1571B138j212k884J512K287j535j913K511K046k166k490J732J430k944p85L121
1586H48M7l783O20L435q88k372J592K529j429k030K425J696k689k231K394J433
1602A597j982n60K773j35l132O20L210j284l114J470K524k487k183K144J469k634
1618a704o36L089R05k598l26K575m4k714Q68K731r85k476J281K479k039k434K326
1635B98J617j773r45K631k20l058o12K176K41k509P34K123l44k614J512K104j448
$$ plain form
1652 -87 -1521 749 2440 114 -1028 922 1034 -1272 -939 1456 1502 -748 17 1804 626 -1609 -421
1669 -421 1319 -215 -1868 151 1053 -1497 -2544 59 593 -1016 -470 1520 1059 -1475 -595 1523
1685 1523 359 -1028 152 1643 216 -1214 719 1400 -535 -1099 1368 1953 -742 -974 455 -361
1701 -361 -2344 -1433 273 -323 -1267 -323 1251 -126 -1289 369 853 -276 -443 1067 1046 -1237 -1120
1718 -1120 785 434 -958 283 1719 296 -990 207 1141 -182 -1536 -93 704 -425 -1179 217
1734 217 -111 -1650 -983 1168 991 -360 0 1350 -14 -1065 29 720 -213 -681 893 945 -365
1751 -365 -998 472 1023 -275 -174 1382 186 -1543 -751 126 -568 -1465 -286 671 -270 -428 807 632
1769 632 -378 -428 900 809 -262 -209 288 -56 -904 305 914 192 -145 292 1248 -254 -1069 -23 -123
$$ packed form
1652h7j434K270J691k326j142J950J12k306L33K395M6k250P65J787j178k235J188
1669d21J740j534j653K019R02k550j047K603N34j609N46J990m61k534Q80K118
1685A523j164j387J180J491j427j430J933O81j935n64K467N85k695k32J429q16
1701c61j983R11J706n96r44R44J574j377j163J658M84j129j67J510k1k283J17
1718a120J905l51j392J241J436j423j286J197R34j323j354J443P97j129p54J396
1734B17l28j539O67K151j77j351L60J350j364j051J094O91r33m68J574N2j310
1751c65o33J470N51j298J01J556j196j729P92Q77o94q97J179R57r41j58J235j75
1769F32j010n0J328r1j071N3M97l44q48J209O09p22l37M37R56j502q15J046j00
$$ plain form
1788 -123 -1084 -857 366 102 -903 -873 459 488 -108 248 897 227 -272 123 520 -379 -886 82 623 2
1808 2 14 393 329 -303 -189 703 222 -469 -409 -147 -481 -1101 -500 312 -423 -122 898 1245 311 -115 238
1829 238 -64 -263 -36 624 -70 -534 -426 432 37 -339 538 665 181 -269 361 261 -927 -1002 -217 34
1849 34 -386 -443 299 -50 -370 303 772 73 -89 231 390 -145 -497 -271 -177 -357 195 608 695 105 124 504
1871 504 -9 -486 -155 114 -490 -777 -509 -306 -547 -251 275 529 431 274 518 331 -145 -526 -225 -39
1891 -39 -43 48 9 -16 -178 203 -26 26 -187 399 120 -305 -562 -652 -403 -568 -372 96 489 164 195 165 232 42
1915 42 59 126 -94 -236 -193 -257 -368 -48 -77 519 674 789 474 -211 -136 -260 -225 -137 -307 -246 -126 -66 -91 -265
1939 -265 -83 88 245 886 539 129 -48 -256 -466 -199 162 67 176 235 382 404 321 176 87 67 -54 -16
$$ packed form
1788a23r61K27J223k64j005L0J332K9n96L56O49o70m99L95L97q99n07R68N41o21
1808BJ2L79o4o32J14Q92m81o91O0K62l34o20O01Q12p35L01J020L47r34m26L53
1829B38l02j99K27O60o94m64J08Q58l95l76Q77J27m84m50O30j00j188p5P85K51
1849C4m20n7P42l49l20O73M69o99j62L20J59n35l52K26R4j80N52M13Q7n90J9L80
1871E04n13m77L31K69o04k87K68K03k41K96N26K54r8j57K44j87m76l81L01J86
1891c9mR1l9k5j62L81k29N2k13N86k79m25k57r0K49j65J96M68L93l25L1l0O7j90
1915D2J7O7k20j42M3o4j11L20k9N96J55J15l15o85P5j24L5Q8j70O1J20O0k5j74
1939b65J82J71J57O41l47m10j77k08k10K67L61r5J09N9J47K2q3j45q9k0j21L8
$$ plain form
1961 -16 -120 -301 -771 -802 65 136 243 27 383 196 49 94 -115 -306 -241 -151 -175 171 -18 -132 -202 82 350
1984 350 725 491 158 -444 -440 -265 -291 -338 -124 -310 109 243 265 -3 78 20 58 268 184 250 -397 -65 -246
2007 -246 -100 -4 -25 48 392 530 561 -294 -243 -289 -398 30 -13 -276 -515 -441 -243 16 187 167 186 430 289
2030 289 -38 249 -299 -258 -227 34 83 -2 83 123 -11 226 358 153 78 210 14 78 -237 -617 -608 -248 337
2053 337 6 274 -60 -101 -273 21 74 -141 58 -57 -336 27 -193 69 129 246 -6 94 567 345 87
2074 87 -329 -460 -718 -17 5 -153 -165 -114 -69 388 304 100 439 267 172 8 201 -229 -424 26 151 146 460
2097 460 302 38 -6 205 295 76 -13 -185 -553 -343 -379 -314 -32 122 -59 260 542 291 -184 23 -224 -77
2119 -77 222 254 20 -152 9 97 -131 -83 -206 -53 158 157 -205 -14 -309 -747 -504 88 -303 -137 302 54
$$ packed form
1961a6j04j81m70l1Q67P1J07k16L56j87j47M5k09j91O5R0k4L46j89j14p0K84K68
1984C50L75k34l33o02MJ75k6m7K14j86M19J34K2k68Q1n8L8K10q4O6o47L32j81
2007b46J46R6k1P3L44J38L1q55N1m6j09M28m3k63k39P4J98K59J71k0J9K44j41
2030B89l27K87n48M1L1K61M9q5Q5M0j34K37J32k05p5J32j96O4l15l80RL60N85
2053C37l31K68l34m1j72K94N3k15J99j15k79L63k20K62O0J17k52J00M73k22k58
2074H7m16j31k58P01K2j58j2N1M5M57q4k04L39j72r5j64J93m30j95M50J25nL14
2097D60j58k64m4K11R0k19q9j72l68K10l6O5K82J54j81L19K82k51m75K07k47J47
2119g7K99L2k34j72J61Q8k28M8j23J53K11jl62J91k95m38K43N92l91J66M39k48
$$ plain form
2141 54 53 134 139 360 318 457 164 -44 -56 -354 -255 -83 38 314 348 65 133 28 -103 -109 -13 -56 -333 -248 263
2166 263 147 -188 -254 236 226 365 202 382 184 3 -426 36 236 -108 15 70 221 -131 161 -107 -167
2187 -167 102 515 284 -235 -213 -256 -559 -189 -111 220 162 155 -198 376 -1 -60 106 180 65 -5 271 60 -301
2210 -301 -287 -220 47 88 95 266 3 -220 -101 -61 -462 -488 -147 121 17 -51 -7 -72 -32 262 399 442 91 -190
2234 -190 -133 102 -234 -391 -82 -148 -2 184 252 127 87 4 274 150 100 -66 -211 -290 65 -98 -12 204 15
2257 15 436 468 87 318 307 -6 -197 20 226 -89 -66 -148 -165 -156 -260 165 288 -152 147 50 99 30 -218 -83
2281 -83 91 -129 177 -59 96 122 236 462 252 50 114 -69 -393 -321 -106 -106 -357 -199 31 310 250 153 245
2304 245 -67 -91 -37 22 -79 38 70 36 -27 -143 38 97 84 127 252 33 -374 -461 -29 -103 3 21 154 14
$$ packed form
2141E4jQ1NK21m2J39k93k08j2k98R9J72J21K76L4k83O8j05j31oR6m3k77Q5N11
2166B63j16l35o6M90j0J39j63J80j98j81m29M62K00l44J23N5J51l52K92k68o0
2187a67K69M13k31n19K2m3l03L70P8L31n8pl53N74l77n9J66P4j15p0K76k11l61
2210c01J4O7K67M1PJ71k63k23J19M0m01k6L41K68j04o8M4o5M0K94J37M3l51k81
2234a90N7K35l36j57L09o6J46J86O8j25m0q3K70j24n0j66j45p9L55j63Q6K16j89
2257A5M21L2l81K31j1l13j91K17K06l15K3q2j7Rj04M25J23m40K99r7M9o9k48J35
2281h3J74k20L06k36J55K6J14K26k10k02O4j83l24P2K15%k51J58K30K79o0r7R2
2304B45l12k4N4N9j01J17L2l4o3j16J81N9j3M3J25k19m07q7M32p4J06J8J33j40
$$ plain form
2328 14 16 282 204 -137 62 102 279 163 110 -402 -182 -200 -25 212 306 -37 117 18 -141 -118 -55 191 -199 -203
2352 -203 19 -48 -65 24 5 130 181 358 185 -14 6 -15 159 -70 -214 -53 74 -91 55 239 78 47 126
2375 126 171 4 -153 -76 -163 -453 -332 -107 48 -122 46 -120 87 366 156 168 202 6 131 99 -99 -279
2397 -279 -274 94 -58 104 328 202 193 63 -41 -32 -261 -98 -22 -44 -33 -126 83 302 -176 440 133 280 249 60
2421 60 -53 68 -374 -222 -261 -235 81 208 431 136 19 -260 -52 -67 -39 174 -409 24 -28 -279 129 63
2443 63 -72 231 339 362 177 154 -245 -51 -29 197 114 -113 -116 -118 -8 422 73 116 19 -116 6 -56 -311 -440
2467 -440 -238 -352 -27 -159 -20 165 72 -1 190 193 173 -118 -89 -355 -13 -132 -118 -440 -52 -174 48 183
2489 183 113 280 -210 152 -195 -41 -55 185 -86 -30 -101 136 162 361 221 183 254 -25 188 -165 -2 -133
$$ packed form
2328A4KK66p8l41J99M0J77j16n3n12K20j8J75K37R4l43J54r9j59K3O3K46l90m
2352b03K22o7j7Q9j9J25N1J77j73j99K0k1J74k29j44J61J27j65J46J84j61l1P9
2375A26M5j67j57P7q7k90J21K25J55j70J68j66K07K79k10J2L4j96J25l2j98j80
2397b79NL68j52J62K24j26rj30j04Rk29J63P6k2J1r3K09K19m78O16l07J47l1j89
2421F0j13J21m42J52l9K6L16J27K23k95j17k79K08j5K8K13n83M33n2k51M08o6
2443F3j35L03J08K3j85k3l99J94K2K26q3k27lkJ10M30l49M3r7j35J22o2k55j29
2467d40K02j14L25j32J39J85r3p3J91Lk0k91K9k66L42j19J4l22L88j22K22J35
2489A83p0J67m90L62l47J54j4K40k71N6p1K37K6J99j40l8P1k79K13l53J63j31
$$ plain form
2511 -133 59 -64 -241 -189 -87 -129 24 175 -37 -59 -245 58 -17 -69 -375 -193 -335 108 308 302 193 100 158
2534 158 -25 263 -167 -92 -345 74 -272 -134 -68 -172 -177 -67 103 31 -246 -160 -183 11 -178 -115 -177 164 128
2557 128 -108 82 -118 76 87 9 149 -111 -44 -181 -486 3 -169 1 53 69 -360 -41 303 74 199 126
2579 126 96 -339 44 -182 32 -152 -148 -141 138 -77 36 307 -49 171 -3 242 5 -108 -302 -405 -40 -178
2601 -178 -138 -248 8 -139 60 141 135 -146 -225 -102 92 80 -31 297 -144 -73 44 59 -276 56 -8 -22 6 -201
2625 -201 -80 195 -125 -34 35 -19 -301 -155 143 88 -13 120 -74 -91 27 -17 66 -157 -192 123 -42 250 397
2648 397 200 246 57 296 -16 -58 -183 -52 -90 -309 -37 88 -106 11 17 180 -6 70 15 173 -413 -394 -71
2671 -71 -191 -10 -15 -43 157 -148 -10 -113 143 -229 -185 161 -86 -408 -177 -164 -185 -359 252 -75 256 133
$$ packed form
2511a33J92j23j77N2J02m2J53J51k12k2j86L03p5n2l06J82j42M43K00oj09r3N8
2534A58j83K88m30P5k53M19l46J38O6j04nJ10J70p2k77Q6k3J94j89O3o2L41l6
2557A28k36J90k00J94J1p8J40k60O7j37l05M89j72J70N2J6m29L19L44k29J25p3
2579A26l0m35L83k26K14j84MPK79k15J13K71l56K20j74K45k37j13j94j03L65j38
2601a78M0j10K56j47J99Q1ok81p9J23J94j2j11L28m41P1J17J5l35L32o4j4K8k07
2625b01J21K75l20R1O9n4k82J46K98n5j01J33j94j7J18m4Q3k23l5L15j65K92J47
2648C97j97M6j89K39l12m2j25J31l8k19K72J25j94J17OJ63j86P6n5J58n86J9L23
2671g1j20J81nk8K00l05J38j03K56l72M4L46k47l22K31J3k1j74O11l27L31j23
$$ plain form
2693 133 240 138 -150 -107 58 -180 -207 42 64 371 -144 79 152 71 -79 110 509 -174 -300 104 -279 -229
2715 -229 -128 227 -29 -213 86 245 229 -140 176 200 -178 -77 194 437 18 -297 79 323 -3 -30 527
2736 527 -74 -166 196 283 -117 -311 33 -57 -218 -144 10 163 -27 -168 194 379 -390 -215 243 -25 -241
2757 -241 -31 129 22 -294 114 190 121 61 190 135 -4 -96 60 288 -238 -152 66 -273 -319 21 83 18 -488
2780 -488 84 197 -175 -333 115 297 -359 -215 137 343 -93 132 448 102 204 -154 319 -81 -453 22
2800 22 281 -86 -151 102 353 -332 196 474 68 -92 43 394 -10 -689 35 181 111 -306 147 340 -76
2821 -76 -195 23 255 -194 -113 156 85 -319 -129 472 -91 -529 -102 177 12 -194 105 576 -126 -224 -112
2842 -112 -10 -346 -187 298 84 -369 91 468 60 -316 213 428 -350 -308 219 129 -400 -345 235 100 -316
$$ packed form
2693A33J07j02k88M3J65k38k7K49K2L07n15K23P3q1j50J89L99o83j26M04l83N0
2715b29J01L55k56j84K99J59j6l69L16K4l78J01K71K43m19l15L76K44l26k7N57
2736E27o01r2L62Q7m00j94L44r0j61P4J54J53j90j41L62J85p69J75M58k68k16
2757b41K10J60j07l16M08P6o9o0J29n5j39r2J56K28n26Q6K18l39m6L40O2o5n06
2780d88N72J13l72j58M48J82o56J44L52K06m36K25L16l46J02l58M73m00l72M75
2800B2K59l67o5K53K51o85N28K78m06j60J35L51m04o79P24J46p0m17M53J93m16
2821g6j19K18K32m49Q1K69p1m04J90O01n63m38M27K79j65k06K99M71p02r8J12
2842a12J02l36J59M85k14m53M60L77m08l76N29K15p78M2N27r0n29N5N80j35m16
$$ plain form
2863 -316 91 88 56 -278 -135 337 141 -332 5 354 54 -150 235 498 -114 -138 104 498 -82 -46 373 227
2885 227 -354 -155 293 -185 -367 56 369 -232 -328 22 333 -397 -245 174 349 -448 -274 195 8 -326
2905 -326 53 280 144 -259 2 565 -22 -338 156 117 -507 -285 244 390 -393 -193 237 278 -154 -195 343
2926 343 226 -335 20 199 -197 -396 229 366 -338 -230 227 226 -3 -108 284 -60 -292 -47 422 -123 -327
2947 -327 88 497 -184 -287 271 346 -253 -112 210 -129 -450 -214 504 39 -505 -237 523 175 -318 248
2967 248 599 -124 -179 233 365 -224 -317 213 56 -621 -65 291 192 -265 90 504 -323 -628 199 204 -380 -262
2989 -262 -21 136 -259 26 529 74 -58 -38 386 -66 -694 10 -140 -234 -428 45 320 -421 -390 344 320
3010 320 -413 -226 175 3 -396 -127 390 -232 -369 77 -34 -35 -101 335 300 -100 -148 236 72 -341 -402 280
$$ packed form
2863c16M07ll2l34J43M72j96m73L37L49l00k04L85K63o12k4K42L94n80L6M19j46
2885B27n81J99M48m78j82M23L13o01r6L50L11p30J52M19J75p97J74M69j87l34
2905c26L79K27j36m03K61N63n87l16M94l9o24K22N29J46p83K00M30M1m32m1N38
2926C43j17n61L55J79l96j99O25J37p04J08M57jk29j05L92l44k32K45M69n45k04
2947c27M15M09o81j03N58P5n99J41L22l39l21K36P18m65n44K68P60l48m93N66
2967B48L51p23n5M12J32n89r3N30j57o77N56L56r9m57L55M14q27l05Q27Nn84J18
2989b62K41J57l95K85N03m55j32K0M24m52o28P04j50r4j94M73K75p41L1P34k4
3010C20p33J87M01j72l99K69N17o22j37M46j11jo6M36l5m00m8L84j64m13o1O82
$$ plain form
3032 280 227 -582 -29 202 142 -477 130 287 -60 -423 191 336 -500 -383 329 54 -275 27 32 287 -396
3053 -396 44 304 106 -439 -82 188 -350 -416 -67 218 -369 -254 287 296 -221 179 415 -1 -493 -116 401
3074 401 -249 -116 62 -278 -93 -127 436 214 -285 39 278 252 -391 48 240 -100 -181 15 344 -146 -481
3095 -481 272 600 -101 -359 187 -151 -248 -241 191 63 -217 -73 186 117 -150 99 297 65 -263 168 525
3116 525 -346 -210 -74 -90 -540 -391 141 172 -59 -84 49 160 -140 -243 8 -69 -59 127 246 -167 -122 311
3138 311 343 -288 11 137 24 -330 -115 -31 -105 -206 17 401 -163 -139 71 94 -64 27 49 380 -295 -136
3160 -136 200 207 -251 -351 178 -15 -81 208 290 -164 -168 160 -194 -266 -114 170 -84 -541 -116 201 -7 -184
3182 -184 62 514 -88 -324 5 191 42 -122 502 149 -125 106 372 404 -42 -90 296 55 -69 -250 25
$$ packed form
3032B80n3q09N53K31o0o19O07J57l47l63O14J45q36J17P12k75l29L02NK55o83
3053c96M40K60j98n45L57K70n38o6L49K85n87J15N41Rn17M00K36m16m92L77N17
3074D01o50J33J78l40J85l4N63k22m99L24K39k6o43M39J92l40q1J96L29m90l35
3095d81P53L28p01k58N46l38r7PM32j28k80J44K59o9k67K49J98k32l28M31L57
3116E25q71J36J36j6m50J49N32L1k31k5J33J11l00j03K51p7J0J86J19m13M5M33
3138C11L2o31K99J26j13l54K15Q4p4j01K23L84n64K4K10K3j58R1K2L31o75J59
3160a36L36Pm58j00N29j93o6K89Q2m54mL28l54p2J52K84k54m57M25L17k08j77
3182a84K46M52o02k36L29J86j49j64O24l53k74K31K66L2m46m8L86k41j24j81K75
$$ plain form
3203 25 -148 74 139 54 -111 -150 9 -26 -8 -219 131 15 -10 -155 159 -74 -146 -185 274 55 -119 181 145
3226 145 97 86 407 241 -240 -114 -54 15 -222 -205 283 -112 -299 -89 -46 157 -19 19 277 195 -165 211 -160
3249 -160 278 46 217 329 -211 89 134 -121 -182 71 -33 -321 -172 133 -164 41 -155 -8 133 109 83
3270 83 -3 168 93 6 -96 2 -94 51 244 -23 278 336 131 257 78 156 185 -67 -186 -157 -223 -130 -161 53
3294 53 -160 119 121 -137 -154 -143 -10 270 2 -263 45 119 28 152 197 247 172 108 75 -2 -132 147 -162 -236 -257
3319 -257 -114 449 -202 -111 131 106 -108 -46 140 54 -180 12 2 -179 -81 100 166 293 -51 110 204 171 -112
3342 -112 230 123 -349 161 18 -45 142 -147 -66 31 -14 269 -38 -13 -49 111 153 -94 -13 81 59 -47 -26 -98
3366 -98 63 -63 -152 -16 199 -265 101 -15 -206 -36 -264 98 -301 -42 -124 144 163 86 -36 -155 98 168
$$ packed form
3203B5j73K22O5q5j65l9J59l5J8k11L50j16k5j45L14k33p2l9M59k19j74L00l6
3226A45m8j1L21j66m81J26O0O9k37J7M88l95j87K10M3K03j76L8K58q2l60L76l71
3249a60M38k32J71J12n40L00M5k55o1K53j04k88J49L05k97K05j96J47J41k4k6
3270H3q6J71p5q7j02R8r6J45J93k67L01N8k05J26j79P8K9k52j19K9o6R3l1K14
3294E3k13K79Kk58j7J1J33K80k68k65L08P4r1J24M5N0p5o4l3p7j30K79l09p4k1
3319b57J43N63o51R1K42k5k14O2J86q6k34J92j0j81R8J81O6J27l44J61R4l3k83
3342a12L42j07m72N10j43o3J87k89Q1R7m5K83l07K5l6J60M2k47Q1R4k2j06K1p2
3366i8J61j26q9J36K15m64L66j16j91J70k28L62l99K59q2K68J9p7j22j19K53P0
$$ plain form
3388 168 150 103 57 -173 120 192 -46 -4 190 -15 368 178 -144 -55 23 -97 53 -152 -248 64 -86 -93 177
3411 177 -65 -49 47 149 -10 89 -5 301 94 -9 -117 64 -46 206 -125 117 81 -27 42 -235 -236 -51 160
3434 160 42 -149 -308 -179 -81 -22 -98 79 40 -289 31 -8 -119 -42 69 308 -202 13 -54 -134 134 -103 -159
3457 -159 40 -178 100 -129 -225 -53 5 -244 -252 40 210 79 170 72 0 -91 -14 350 108 -229 181 46 108
3480 108 -14 275 252 -111 90 95 147 -71 51 134 -183 -202 1 -103 -38 -165 56 119 161 312 204 312 74
3503 74 193 190 -235 67 61 -158 151 40 -229 -402 64 -41 85 219 -39 -203 -100 -37 -132 12 -194 -64
3525 -64 -184 207 99 272 1 240 365 123 -79 35 -165 -202 180 15 -138 -144 -58 94 50 226 80 226
3547 226 -36 -204 -67 -65 248 277 -196 60 14 242 184 79 64 179 312 34 106 26 -309 97 5 -58 -111 82
$$ packed form
3388A68j8m7m6k30K93P2k38M2J94k05L83j90l22Q9P8j20J50k05r6L12j50pK70
3411A77k42J6R6J02j59R9r4L06k07j03j08J81j10K52l31K42l6j08O9k77jJ85K11
3434A60j18j91j59J29R8N9p6J77l9l29L20l9j11P7J11K39n10K15o7q0K68k37n6
3457a59J99k18K78k29r6J72N8k49qK92J70j31R1r8p2r1P7L64k42l37M10j35O2
3480A08j22K89k3l63K01NN2k18J22Q3l17j9K03j04O5j27K21O3M2J51j08J08k38
3503G4J19lm25L02ok19L09j11k69j73M66j05J26J34k58j64J03O3r5J44k06J30
3525f4j20L91j08J73k71K39J25k42k02J14k00l7L82j65j53oQ6J52m4J76j46J46
3547B26k62j68J37KL13K9m73K56m6K28n8j05j5J15J33k78P2q0l35M06r2o3n3J93
$$ plain form
3571 82 166 368 344 -65 33 53 -99 72 130 -71 -249 63 -99 232 191 231 -45 -252 77 65 9 217 63
3594 63 42 164 26 -21 19 -39 89 99 -146 73 -35 -131 -261 -24 -33 41 53 18 164 27 -10 22 1 -220 114
3619 114 27 -242 13 -78 -244 154 -21 84 -238 15 -54 -141 -64 87 40 -31 32 -14 -55 66 30 -270 229 170
3643 170 179 241 213 278 129 -90 71 47 -277 -302 158 5 -163 274 200 -108 141 37 -51 31 -361 -256 -282 19
3667 19 54 -31 128 20 20 1 148 -39 -170 28 1 -8 61 -203 -349 -193 -22 155 -53 -162 49 62 65 -71
3691 -71 9 144 94 -97 -51 153 45 -188 156 150 -166 12 84 352 56 116 -127 9 -116 -147 -1 -64 103
3714 103 33 -202 -48 239 -55 -91 71 -104 140 -133 -169 241 -49 -75 -18 84 282 95 38 130 7 14 16 267
3738 267 63 -117 6 -41 76 91 216 215 -7 -47 -72 -254 -132 -347 -219 -119 31 100 -25 51 166 173 -265
$$ packed form
3571H2Q4K02k4m09R8K0j52J71N8k01j78L12j62L31m1M0k76k07L29j2n6K08j54
3594F3k1J22j38m7M0n8J28J0k45K19j08r6j30K37rP4J2l5J46j37l7L2k1k21L34
3619A14q7k69K55r1j66L98j75J05l22K53o9q7P7J51m7p1O3m6m1J21l6l00M99n9
3643A70RO2k8O5j49k19J61k4l24k5M60j53j68M37p4l08K49j04q8Q2l92J05k6L01
3667A9L5q5J59j08%j9J47j87j31J98k7rO9k64j46J56J71J77k08j09K11J3Lj36
3691g1Q0J35n0j91M6K04j08k33L44ol16J78P2K68k96O0k43J36j25l1J46o3J67
3714A03p0k35J54K87k94l6J62j75K44k73l6M10k90k6N7J02J98j87n7R2j23PKK51
3738B67k04j80J23m7J17J5J25jk22m0k5j82J22k15J28J00J50O9j25P6J15Pm38
$$ plain form
3761 -265 -28 117 -25 116 -21 22 -239 -55 -101 -218 366 56 -24 5 110 70 -41 -188 -135 -156 -74 -176 156
3784 156 74 175 -61 -40 208 -87 -6 28 -233 -45 -37 -14 -49 -168 152 134 12 31 135 99 101 -297 -165 135
3808 135 -130 94 -260 -110 119 276 -169 66 219 221 193 304 -17 45 24 35 -65 21 -61 -60 234 132 179 151
3832 151 59 68 232 -20 -52 -54 -174 -207 -95 -76 129 -55 -179 -4 -76 165 -2 -221 142 -192 -2 9 211
3855 211 65 -244 -166 13 21 196 -102 -131 24 138 163 -23 200 61 83 -114 -136 66 -76 125 -40 24 -111
3878 -111 -227 -191 31 42 103 -216 -94 207 126 -98 170 203 -45 150 221 -175 -53 -11 197 156 -26 -204 -122
3901 -122 128 5 162 -98 -31 70 21 -99 156 -220 72 83 -71 275 60 355 124 107 -154 -62 32 -138
3923 -138 92 -9 -117 -127 -30 -191 25 49 -20 251 -47 100 64 10 102 -29 -187 -47 -45 -12 140 162 264 -270
$$ packed form
3761b65K37J45j42J41j37M3k61J84m6j17N84l10q0K9J05m0j11j47N3k1Q2j02L32
3784A56q2J01k36K1K48k95Q1L4k61J88QK3l5j19L20j8j22J9J04l6Kl98J32L00
3808A35k65K24l54J50K29J57m45K35J53Kk8J11l21O2k1J1j00Q6q2JK94j02M7k8
3832A51r2RJ64k52l2kj20l3J12J9K05j84j24J75p2K41j67k19L63l34J90J1K02
3855B11j46l09P8J79QJ75k98k9J55J14K5j86K23j39K2j97k2K02j42K01j65O4j35
3878a11j16L6K22J1O1l19J22L01q1k24K68L3k48J95P1l96J22M2K08m1j82j78Q2
3901a22K50j23J57k60O7J01m9j20K55l76K92J1j54L46k15K95k31j7k61R2R4j70
3923a38K30j01j08j0R7j61K16K4o9K71k98J47l6n4R2j31j58J40KL3J52K2J02n34
$$ plain form
3947 -270 73 236 22 201 203 -179 -108 -64 56 0 25 -21 97 107 -25 233 45 -61 32 29 26 -171 -146 -2 116
3972 116 -76 -13 -43 -237 -173 -22 29 88 -93 31 -223 -65 -5 -72 69 -106 250 44 301 134 -52 -34 61
3995 61 182 116 -149 136 -125 -19 59 -173 -86 -34 97 -77 142 -157 18 -133 -45 40 -185 137 92 313 192
4018 192 137 -16 -58 -28 125 419 61 87 186 -25 37 -65 -42 51 43 27 -146 36 31 44 -124 -218 21 232 -53
4043 -53 -214 32 -147 -52 -141 7 57 -15 -147 -11 -121 126 -11 -323 -351 35 88 26 36 77 -84 65 -97
4066 -97 -71 -165 -109 54 70 99 -100 94 90 112 -121 69 156 191 39 -49 122 -6 256 -109 222 -37 -114 0
4090 0 130 214 180 153 -214 -140 95 -35 -128 115 113 152 109 90 -35 23 -67 124 41 66 293 2 -130 17 -103
4115 -103 136 -116 71 47 92 -164 300 -27 -32 327 -12 -113 -240 150 -14 -193 -279 -32 -70 85 309 -11
$$ packed form
3947b70L43J63k14J79Kl82P1M4J20n6K5m6J18J0j32K58j88j06R3llj97K5J44J18
3972A16j92O3l0j94O4J51N1N9j81J24k54J58O0o7J41j75L56k06K57j67j86J8R5
3995F1J21o6k65K85k61J06P8k32Q7N2J31j74K19k99J75j51Q8Q5k25L22m5K21j21
4018A92n5j53m2L0J53K94l58K6R9k11O2j02K3R3qj6j73J82nJ3j68r4K39K11k85
4043e3j61K46j79R5q9J48N0p2j32J36j10K47j37l12k8L86N3o2J0M1j61J49j62
4066i7K6r4N6J63J6K9j99J94mK2k33J90Q7L5j52q8J71j28K62l65L31k59p7J14
4090@J30Q4l4k7l67P4K35j30r3K43kL9m3j9j25N8r0J91q3K5K27k91j32J47j20
4115a03K39k52J87k4M5k56M64l27nL59l39j01j27L90j64j79q6K47l8J55K24l20
$$ plain form
4137 -11 331 87 99 54 89 -170 7 186 -359 15 -48 101 -133 -2 -80 -106 -36 53 99 -104 -179 236 -5 -279
4161 -279 -12 86 154 100 202 -41 -71 -108 110 -25 -29 145 7 -194 126 11 68 4 18 -51 106 27 -301 18
4185 18 -52 -104 -142 -184 -16 241 126 271 188 -85 -250 185 162 -47 117 -138 52 -259 209 5 85 228 90
4208 90 -19 112 -36 -168 41 -254 -5 71 66 -87 -31 205 -69 -235 429 49 -128 -321 116 -115 -77 -24
4230 -24 32 43 33 -103 -11 -235 98 49 63 -184 -32 146 5 143 -108 1 -89 -216 42 163 89 41 78 121
4254 121 136 -290 111 195 -81 -44 219 -34 -135 -50 -20 200 -143 -117 96 134 -7 92 141 -216 -327 -31 108
4277 108 110 -54 168 -63 -9 -78 10 30 -150 3 -9 214 -296 -89 174 85 -45 158 124 -131 -200 -170 72 -236
4301 -236 -303 182 45 11 47 295 -162 -167 5 100 -170 -101 120 100 109 -19 -25 105 -65 112 246 6 -88 125
$$ packed form
4137a1L42k44J2m5L5k59J77J79n45L74o3J49k34J31p8k6P0Q9M6k03p5M15k41k74
4161b79K67R8O8n4J02k43l0l7K18j35mJ74j38k01L20j15N7o4J4o9J57p9l28L19
4185A8p0n2l8m2J68K57j15J45q3k73j65M35k3k09J64k55J90l11M68k04Q0J43j38
4208I0j09J31j48j32K09k95K49P6nj53N6K36k74j66O64l80j77j93M37k31L8N3
4230b4N6J1j0j36R2k24L33m9J4k47J52J78j41J38k51J09r0j27K58J21p4m8L7M3
4254A21J5m26M01Q4k76L7K63k53j01Q5L0K20l43K6K13L8j41R9M9l57j11K96J39
4277A08Kj64K22k31N4o9Q8K0j80J53j2K23n10K07K63q9j30K03l4k55o9L0K42l08
4301b36o7M85j37l4L6K48m57nJ72R5k70O9K21k0Rj28oJ30j70J77J34k40r4K13
$$ plain form
4325 125 54 169 -470 -71 28 -5 -449 64 -104 31 -206 366 91 -120 -14 89 -34 -239 -115 -39 -151
4346 -151 -11 -16 200 118 -139 -8 31 -81 -136 297 -38 -109 -157 265 107 -187 89 209 38 15 63 213 60
4369 60 3 76 21 -94 89 296 181 -188 -205 227 143 -48 18 202 -111 -73 -108 19 -158 -226 -16 -37 -214 52
4393 52 102 -106 -1 -56 104 337 93 -118 200 -228 -229 159 29 -162 -303 193 -48 26 -206 114 226 -200
4415 -200 -40 129 -114 135 7 120 -51 -83 202 274 107 -85 132 181 -18 -263 114 -67 23 28 327 0
4437 0 -68 -15 50 -328 -38 133 172 158 -50 -347 24 17 -176 -29 138 127 -330 60 59 -95 -100 -12 92 -113 378
4462 378 325 -86 -1 305 50 -145 86 0 47 -181 -266 70 -84 -137 20 65 72 39 207 273 -49 123 62 -37
4486 -37 -126 -107 166 82 -316 4 270 8 -24 11 311 14 -287 -182 -61 -300 -99 -15 -20 -252 -79 -6 316
$$ packed form
4325A25p1J15o39L99R9l3m44N13j68J35k37N72k75k11J06J03j23k05J24P6j12
4346a51J40nK16q2k57J31L9j12n5M33l35p1m8M22j58k94K76J20j71k3M8J50j53
4369F0n7P3n5j15J83K07j15l69j7M32q4j91O6J84l13L8l5J27j77o8K10k1j77K66
4393E2N0k08J05n5J60K33k44k11L18m28jL88j30j91j41M96k41P4k32L20J12m26
4415b00J60J69k43K49j28J13j71l2K85P2j67j92K17M9j99k45L77j81R0NK99l27
4437@o8N3O5l78K90J71L9j4k08k97L71pj93J47J67j1m57L90jj54nQ8J04k05M91
4462C78n3m11Q5L06k55j95K31q6M7k28q5L36j54n3J57M5Pl3J68O6l22J72o1r9
4486c7q9J9K73q4l98L20K66k62l2L5L00k97l01J05J21k39K01Q4nk32J73P3L22
$$ plain form
4509 316 54 -40 113 -84 -306 -219 28 -309 -81 50 -12 -140 -148 -175 47 -218 -50 -115 10 -139 85 104 89
4532 89 -438 -57 144 -306 -117 61 -61 -137 102 -70 268 -136 23 45 68 -159 -101 108 97 -2 8 -96 6
4555 6 63 -247 7 -118 -100 -72 188 28 63 -120 138 -94 -55 -23 106 -234 -7 56 -96 -66 -318 -69 -158 -101
4579 -101 92 -61 37 146 153 110 82 -178 204 -51 -92 -4 196 75 53 158 117 17 -62 2 -84 -383 -358 200
4603 200 -119 93 -23 112 -260 -177 -57 99 -211 -17 -67 50 51 -7 257 -29 -193 -56 -13 57 75 -30 102
4626 102 -67 -89 73 45 -43 -10 16 -41 -208 -165 329 186 -161 177 -22 46 -233 -54 48 -78 -219 153 20
4649 20 -162 -210 -159 151 22 -87 23 177 59 -40 -41 -14 -110 -149 -29 -140 -215 57 -163 -164 -164 54 81 183 175 -25
4675 -25 99 133 244 81 46 -346 94 -33 -88 -45 131 87 -96 -94 -192 -5 -133 -50 -3 230 -364 116 135 126 -83
$$ packed form
4509C16k62r4J53j97k22Q7K47l37K28J31o2j28qk7K22k65J68o5J25j49K24J9j5
4532H9n27L81K01m50J89J78j22p6K39j72L38m04J59K2K3k27N8K09j1r9J0j04J02
4555FN7l10K54j25J8K8K60j60L5j83K58k32L9L2J29l40K27O3j52L0k52K49q9N7
4579a01J93j53R8J09Pm3k8k60L82k55m1Q8K00j21k2J05m1j00p9O4q6k99K5N58
4603B00l19K12j16J35l72Q3J20J56l10J94n0J17Jn8K64k86j64J37M3P0J8j05J32
4626A02j69k2J62k8q8L3K6n7j67M3M94j43l47L38j99O8k79J79J02j26j41L72j33
4649B0j82m8N1L10j29j09J10J54j18r9jK7r6l9J20j11p5K72k20j%K18K7J02qk00
4675b5J24L4J11j63l5l92M40j27n5M3J76m4j83Kr8J87j28Q3M7K33n94M80J9rk09
$$ plain form
4700 -83 -1 -41 -131 -34 206 -167 -106 -38 222 -111 50 -207 245 -31 65 -7 -74 -131 -159 -206 -123 -87 -144 -79 16 -49
4726 -49 85 100 -64 40 67 -121 51 -143 -109 -36 -36 187 165 99 -173 -34 54 -19 -150 -101 217 75 -116 58
4750 58 -149 121 50 -174 1 -156 56 236 -30 114 120 -212 -207 -116 -149 -76 35 176 33 -8 251 -27 -86 72
4774 72 -42 -119 202 279 -167 -47 167 95 44 56 -80 -63 -79 -79 175 54 -31 34 -132 10 74 1 134 7 -51
4799 -51 185 -76 -61 226 55 -143 40 -154 -69 -14 -134 -17 -22 77 -140 81 -142 60 29 19 148 24 -64
4822 -64 -153 124 -118 -3 141 104 -98 94 -33 -78 -77 -169 -155 -274 15 -10 19 116 -237 -30 -110 165 259 -80
4846 -80 101 11 28 160 113 12 7 106 85 115 -3 -91 -154 39 72 -272 -309 -102 -184 -134 -1 0 -127 184 -148 -380
4872 -380 67 26 -261 -112 149 199 -237 29 124 50 -4 -7 -114 13 87 -102 54 -40 138 -13 -119 -98 -51 -133
$$ packed form
4700h3Q2m0r0R7K40l73O1O8K60l33J61k57M52k76R6p2o7n7k8m7Q3L6n7O5R5o5
4726d9J34J5j64J04K7j88J72j94L4P3%K23k2o6k72J39Q8p3j31M9L18j42j91J74
4750E8k07K70p1k24J75j57K12J80k66J44Ol32NR1l3P3J11J41j43m1K59k78n9J58
4774G2j14p7L21P7m46J20K14p2n1J2j36J7j6%K54j21q5O5j66J42O4p3J33j27n8
4799e1K36k61J5K87j71j98J83j94Q5N5j20J17nR9k17K21k23K02l1j0J29j24q8
4822f4q9K77k42J15J44l7k02J92j27m5Jr2J4j19K89k5K9R7l53K07q0K75R4l39
4846h0J81r0J7J32m7j01nR9k1L0j18q8o3J93L3l44l7K07q2N0J33Jj27L11l32k32
4872c80M47m1k87J49K61N0m36K66R5p4n4lj07J27P4j89J56r4J78j51j06K1M7q2
$$ plain form
4896 -133 -291 208 -87 -72 -64 81 -19 79 -107 68 -70 -14 42 7 -65 135 108 -229 13 -132 71 -314 151
4919 151 135 41 -127 -313 -47 -33 -53 -32 -39 -5 209 71 127 8 -214 -171 181 159 -173 75 -75 257 110 -118
4943 -118 -53 -32 -107 197 -135 242 -284 -52 -116 88 134 151 -74 7 -81 55 -63 -251 -143 296 -33 7 465
4966 465 -52 -2 70 104 139 228 -46 215 173 156 80 129 -10 51 181 -170 -10 -76 -127 260 54 -68 50 79
4990 79 -324 -207 -178 -58 77 26 -137 207 87 -114 246 22 -64 -241 -107 -36 -104 19 -55 -188 -40 8 27
5013 27 -26 70 53 119 25 -15 24 19 -45 -68 155 84 -5 -161 116 119 -93 38 149 247 203 -133 96 19 62 -130 1
5040 1 -11 136 191 -116 265 209 117 -75 -24 -151 -98 85 51 268 -116 148 -14 -32 -142 -136 37 229 -11 205
5064 205 299 -242 -40 -34 198 30 186 -191 -227 -96 -30 69 -18 98 -172 -81 -128 -57 -8 9 103 -196 160 -34
$$ packed form
4896a33j58M99k95J5QJ45j00R8j86J75j38N6N6l5p2K00k7l37K42j45K03l85M65
4919A51j6r4j68j86K66J4k0K1pL4K14j38N6j19k22M3L52k2l32K48j50L32j47k28
4943a18O5K1p5L04l32L77n26K32o4K04M6J7k25Q1q8J36j18j88J08M39l29M0M58
4966D65n17N0P2L4L5Q9k74K61m2j7p6M9j39O1J30l51J60o6n1L87k06j22J18K9
4990G9m03J17K9J20J35n1j63L44j20k01L60k24q6j77J34P1o8J23p4j33J48M8J9
5013B7n3R6j7O6r4m0L9no4k3K23p1q9j56K77Lk12J31J11R8m4l36K29p7M3j92J31
5040Aj2J47N5l07L81n6r2j92N1j27N3J83l4K17l84K64j62j8j10OJ73J92k40K16
5064B05R4n41K02OK32j68J56l77l6J31O6R9q7J16k70R1m7P1M9J7R4k99L56j94
$$ plain form
5088 -34 192 36 -69 -154 102 218 -35 -154 -141 -55 58 212 100 186 317 29 75 24 -87 -196 57 -118
5110 -118 212 116 -154 -27 238 -24 -81 -114 -73 156 -110 76 -73 61 65 -68 -89 -127 -3 -276 101 1 47
5133 47 281 -61 -19 -32 -53 44 -85 -15 -22 202 -15 -33 -2 -89 279 174 -291 -13 -79 -22 4 17 49 -47 -252 28
5159 28 178 -81 88 247 158 -30 23 -77 -53 37 56 -108 25 -54 -18 -136 162 -46 -133 96 80 -138 -143 45
5183 45 168 221 24 47 264 78 -37 -156 -90 1 231 -209 -12 -52 -72 -84 -69 231 -53 38 -150 185 -98
5206 -98 -68 112 -271 300 -67 -188 31 134 -31 30 190 70 33 50 11 -63 37 -41 82 98 -73 304 13
5229 13 91 84 47 124 42 41 81 76 117 -83 -27 66 210 -246 -140 406 -96 -136 -164 122 22 314 -94 -151 -48 -52 3
5256 3 -168 28 -82 -67 -49 78 118 -9 -188 28 102 -98 37 -191 57 7 268 218 112 -74 -23 -240 81
$$ packed form
5088c4K26j56j05q5K56J16k53j19J3Q6J13J54j12Q6J31k88M6n1j11j09K53j75
5110a18L30r6k70J27K65k62n7l3M1K29k66J86j49J34Mj33k1l8J24k73L77j00M6
5133D7K34l42M2j3k1R7j29P0pK24k17j8L1q7L68j05m65K78o6N7K6J3L2r6k05K80
5159B8J50k59J69J59q9j88N3j00K4R0J9j64J33p9L6j18K98k08q7K29j6k18nJ88
5183D5J23N3j97K3K17j86j15j19O6R1K30m40J97m0k0j2J5L00k84R1j88L35k83
5206i8L0J80l83N71l67j21K19J03j65O1J60j20l7J7l9p4J00p8J23J6j71L77k91
5229A3P8pl7P7q2jM0nM1k00N6R3J44m56J06N46n02m0k8K86j00K92m08n7J03mN5
5256Cj71J96j10J5J8J27M0j27j79K16P4k00J35k28K48n0K61n0j06j86N1k17L21
$$ plain form
5279 81 1 -185 83 103 -140 -4 22 242 -37 -31 -4 -202 -26 -18 0 -171 -119 -33 73 2 53 -103 35 121 371
5304 371 490 -89 12 -322 52 108 -56 8 -103 -56 199 147 -46 -52 39 10 7 -39 144 -86 38 -97 6 113
5328 113 -130 246 -158 135 135 224 116 -90 63 -42 114 23 -248 57 95 -117 64 -46 33 7 86 98 -61
5351 -61 -87 -52 138 29 138 -90 177 -21 -57 154 -156 -79 11 407 176 -72 -101 265 141 203 23 54 125
5374 125 35 -46 142 175 -257 3 -137 -319 -169 15 -28 -93 39 125 3 121 -8 -103 -19 -89 1 196 115 -40
5398 -40 224 -207 -117 225 230 229 -162 53 -66 -138 106 -54 -20 96 -128 -180 3 -51 177 -182 -63 3 12 -148
5422 -148 -144 89 31 8 97 128 44 -119 -198 -80 -89 105 -167 253 125 41 -326 24 77 -145 -30 35 -147 -32
5446 -32 128 54 16 -94 -280 -84 6 -160 48 29 74 -232 38 71 -55 49 67 -114 19 -9 253 -271 -75
$$ packed form
5279H1q0j86K68K0k43J36K6K20k79OK7j98J76QJ8j71N2Q6J06p1N1j56J38Q6K50
5304C71J19n79J01l34L74N6j64O4j11M7K55n2j93oR1k9lm6J83k30J24j35J03J07
5328A13k43L76m04K93%Q9j08k06J53j05J56r1k71L05L8k12J81j10P9k6P9J2j59
5351f1k6L5J90j09J09k28K67j98l6K11l10P7R0L96k31k48k9L66j24O2j80L1P1
5374A25r0q1J88L3m32K60j40j82J50J84m3o5J32Q6j22J18j29r5Q4p0R0J95q1j55
5398d0K64m31R0L42Njl91K15j19p2K44j60L4J16k24n2J83n4K28l59J19O6Rj60
5422a48MK33n8k3Q9L1q4j63p9J18rJ94k72M20j28q4l67L50N3k22J15O5j82J15
5446c2J60p4l8j10j86J96R0j66K08j9M5l06K70L3j26J04J8j81J33k8K62n24J96
$$ plain form
5469 -75 305 -173 85 -100 -130 -4 24 -145 -12 33 -168 -209 -100 -43 -134 93 57 -31 -138 -15 -54 -19 244 160
5493 160 184 -53 -31 62 16 -224 -302 -22 83 -78 122 176 -25 -26 -86 -264 -17 -215 8 -315 110 -186 -37
5516 -37 293 -33 455 -110 -54 -195 107 -153 -163 169 -65 -21 -31 -114 -8 -190 12 -63 34 -252 22 -49 77
5539 77 -25 -49 89 95 -57 -151 -127 194 259 107 -91 -138 166 51 -88 -148 54 -59 -7 60 100 195 50 314
5563 314 96 3 -64 93 273 -10 -64 53 -24 138 122 -28 -164 -102 12 -115 -136 -146 60 -71 -42 183 190 -25
5587 -25 77 -123 314 -52 122 204 -8 299 255 88 56 46 -321 -28 -21 58 -52 -86 208 75 75 322 -189 -145
5611 -145 37 -20 -98 -37 -48 -203 -102 97 124 -101 -87 53 -96 -178 -107 118 2 -33 160 67 21 -65 8 -30 -120
5636 -120 -30 250 -96 78 -48 -37 19 -56 -28 309 -38 -207 -9 39 -197 82 396 109 11 -249 -119 -86 84
$$ packed form
5469g5L80m78K58j85l0J26K8j69J33M5k01m1J09N7r1K27l6q8j07J23l9L5K63q4
5493A60K4k37K2R3m6k40p8K80J05j61K00N4k01jo0j78K47j98K23l23M25k96J49
5516c7L30l26M88n65N6j41L02k60j0L32k34M4j0q3J06j82K02p5R7k86K74p1J26
5539G7j02k4J38Oj52r4K4L21O5j52j98m7L04j15j39o0K02j13N2O7M0R5j45K64
5563C14k18r3o7J57J80k83n4J17p7J62j6j50j36O2J14j27k1j0K06j31K9K25Pk15
5587b5J02k00M37l66J74Q2k12L07m4j67l2j0l67K93PP9j10l4K94j33%K47n11M4
5611a45J82n7p8O1j1j55J01J99K7k25J4J40j49q2P1K25j16l5J93r3m6q6P3l8r0
5636a20R0K80l46J74j26J1N6p5K8L37l47j69J98M8k36K79L14k87r8k60J30L3J70
$$ plain form
5659 84 -125 18 -8 -94 52 -98 113 -185 28 222 101 -5 -250 -102 77 -117 -27 157 -68 108 12 -188
5681 -188 -306 93 -67 210 97 20 -42 -125 74 -223 -302 112 -69 28 -138 1 69 -78 153 -74 -34 93
5703 93 -112 -102 -155 -106 80 129 -85 -50 -60 -74 116 34 78 129 -73 -422 -169 -296 -274 128 -32 -182 181 -127
5727 -127 211 -219 -102 -90 -127 108 -157 -99 -92 -13 160 -99 -174 -31 -118 -40 54 68 63 -61 168 220 -130 57 -172
5752 -172 -132 -47 41 100 112 -54 -204 132 223 -105 124 37 162 118 97 109 169 -141 -14 -252 -107 -231 -206 83
5776 83 -61 60 -14 34 32 146 8 -56 37 60 164 -307 -52 41 -102 -155 77 47 134 -208 20 71 -55 129
5800 129 39 -82 -23 -236 170 -56 103 63 440 51 -205 54 -16 -158 48 -14 191 -134 -11 -50 133 -128
5822 -128 140 -35 -137 -136 -90 -81 101 -242 -131 67 -254 147 -28 44 -61 -2 66 210 80 74 26 247 135 -282
$$ packed form
5659H4k09J43k6q6J46j50K11k98K13J94j21j06k45J48J79j94R0J84k25J76r6k00
5681a88j18L99j60K77j13p7o2q3J99k97p9M14j81R7j66J39O8j47K31k27M0J27
5703I3k05J0n3M9J86M9k14L5j0j4J90q2M4N1k02l49K53j27K2M02j60j50L63l08
5727a27L38m30J17J2l7K35k65N8PP9J73k59p5J43q7P8R4J4nj24K29N2l50J87k29
5752a72M0Q5Q8N9J2j66j50L36R1l28K29q7J25m4k1J2O0l10J27k38J45j24K5K89
5776H3j44J21p4M8kJ14j38o4R3K3J04m71K55R3j43n3K32l0Q7l42K28N1j26J84
5800A29r0j21N9k13M06k26J59m0L77l89k56K59p0j42K06o2K05l25J23l9J83k61
5822a28K68j75j02JM6RJ82l43J11J98l21M01j75P2j05N9O8J44j30om8K21j12m17
$$ plain form
5846 -282 -38 67 -59 -65 -3 -109 -46 -113 -17 40 -95 -258 -265 -46 -105 150 -27 280 5 -142 -18 90 59 91
$$ packed form
5846b82K44J05j26oO2j06O3o7R6N7j35j63pK19n9K55j77L07k75j47J24J08l1L2
$$ [...]
8191c20
##END NTUPLES=NMR FID
##END=
