##TITLE=1H_KX0403
 CDCl3, 8 sc, 
 5.3.2019
##JCAMPDX= 6.0         $$ Bruker NMR JCAMP-DX V2.0
##DATA TYPE= NMR FID
##DATA CLASS= NTUPLES
##ORIGIN= UXNMR, Bruker Analytische Messtechnik GmbH
##OWNER= root
$$ XWIN-NMR		Version 3.5
$$ Tue Mar  5 14:15:47 2019 Russian Standard Time (UT+4h)  she@DPX200
##.OBSERVE FREQUENCY= 200.1316
##.OBSERVE NUCLEUS= ^1H
##.DELAY= (6, 6)
##.ACQUISITION MODE= SIMULTANEOUS
##.ACQUISITION SCHEME= undefined
##.AVERAGES= 8
##.DIGITISER RES= 18
##SPECTROMETER/DATA SYSTEM= spect
##.PULSE SEQUENCE= zg30
##.SOLVENT NAME= CDCl3
##.SHIFT REFERENCE= (INTERNAL, CDCl3, 0, 15.7039)
##AUDIT TRAIL= $$ (NUMBER, WHEN, WHO, WHERE, WHAT)
$$ ##TITLE= Audit trail, XWIN-NMR		Version 3.5
$$ ##JCAMPDX= 5.01
$$ ##ORIGIN= Bruker BioSpin GmbH
$$ ##OWNER= she
$$ F:/spectra/data/she/nmr/H-F/1/audita.txt
$$ ##AUDIT TRAIL=  $$ (NUMBER, WHEN, WHO, WHERE, WHAT)
(   1,<2019-03-05 14:14:48.01 +0400>,<she>,<DPX200>,
      <created by zg, POWCHK disabled, PULCHK disabled
       configuration hash MD5:
       00 E9 B6 7A A2 85 ED C7 34 08 36 98 17 FE 4E 26
       data hash MD5: 16K
       88 05 EA 0B 0E 63 FF EF E0 E2 D1 9F 44 CC E3 B5>)
$$ ##END=
$$ 
$$ hash MD5
$$ 15 45 00 07 0A 1F 74 63 8F DE F0 AB AA 4A 6C 59
##$RELAX= 
##$RELAX= 
##$RELAX= 
##$RELAX= 
##$RELAX= 
##$RELAX= 
$$ Bruker specific parameters
$$ --------------------------
##$DU= <F:/spectra>
##$EXPNO= 1
##$NAME= <H-F>
##$PROCNO= 1
##$TYPE= <nmr>
##$USER= <she>
##$AMP= (0..31)
100 100 100 100 100 100 100 100 100 100 100 100 100 100 100 100 100 100 
100 100 100 100 100 100 100 100 100 100 100 100 100 100 
##$AQSEQ= 0
##$AQ_mod= 1
##$AUNM= <au_zg>
##$AUTOPOS= <>
##$BF1= 200.13
##$BF2= 200.13
##$BF3= 200.13
##$BF4= 200.13
##$BF5= 200.13
##$BF6= 200.13
##$BF7= 200.13
##$BF8= 200.13
##$BYTORDA= 1
##$CFDGTYP= 0
##$CFRGTYP= 5
##$CHEMSTR= <none>
##$CNST= (0..31)
1 1 145 1 1 1 1 1 1 1 1 1 1 1 1 1 1 1 1 1 1 1 1 1 1 1 1 1 1 1 1 1 
##$CPDPRG= <>
##$CPDPRG1= <>
##$CPDPRG2= <>
##$CPDPRG3= <>
##$CPDPRG4= <mlev>
##$CPDPRG5= <mlev>
##$CPDPRG6= <mlev>
##$CPDPRG7= <mlev>
##$CPDPRG8= <mlev>
##$CPDPRGB= <>
##$CPDPRGT= <>
##$D= (0..31)
0 1.2 0 0 0 0 0 0 0 0 0 0.03 0 0 0 0 0 0 0 0 0 0 0 0 0 0 0 0 0 0 0 0 
##$DATE= 1551780887
##$DBL= (0..7)
120 120 120 120 120 120 120 120 
##$DBP= (0..7)
150 150 150 150 150 150 150 150 
##$DBP07= 0
##$DBPNAM0= <>
##$DBPNAM1= <>
##$DBPNAM2= <>
##$DBPNAM3= <>
##$DBPNAM4= <>
##$DBPNAM5= <>
##$DBPNAM6= <>
##$DBPNAM7= <>
##$DBPOAL= (0..7)
0.5 0.5 0.5 0.5 0.5 0.5 0.5 0.5 
##$DBPOFFS= (0..7)
0 0 0 0 0 0 0 0 
##$DE= 6
##$DECBNUC= <off>
##$DECIM= 24
##$DECNUC= <off>
##$DECSTAT= 4
##$DIGMOD= 1
##$DIGTYP= 9
##$DL= (0..7)
0 120 120 120 120 120 120 120 
##$DP= (0..7)
150 150 150 150 150 150 150 150 
##$DP07= 0
##$DPNAME0= <>
##$DPNAME1= <>
##$DPNAME2= <>
##$DPNAME3= <>
##$DPNAME4= <>
##$DPNAME5= <>
##$DPNAME6= <>
##$DPNAME7= <>
##$DPOAL= (0..7)
0.5 0.5 0.5 0.5 0.5 0.5 0.5 0.5 
##$DPOFFS= (0..7)
0 0 0 0 0 0 0 0 
##$DQDMODE= 0
##$DR= 18
##$DS= 0
##$DSLIST= <SSSSSSSSSSSSSSS>
##$DSPFIRM= 0
$$ [...]
##$SUBNAM2= <"">
##$SUBNAM3= <"">
##$SUBNAM4= <"">
##$SUBNAM5= <"">
##$SUBNAM6= <"">
##$SUBNAM7= <"">
##$SUBNAM8= <"">
##$SUBNAM9= <"">
##$SW= 24.9336934301222
##$SWIBOX= (0..15)
0 0 2 0 0 0 0 0 0 0 0 0 0 0 0 0 
##$SW_h= 4990.01996007984
##$TD= 16384
##$TD0= 1
##$TE= 0
##$TE2= 300
##$TE3= 300
##$TEG= 300
##$TL= (0..7)
0 120 120 120 120 120 120 120 
##$TP= (0..7)
150 150 150 150 150 150 150 150 
##$TP07= 0
##$TPNAME0= <>
##$TPNAME1= <>
##$TPNAME2= <>
##$TPNAME3= <>
##$TPNAME4= <>
##$TPNAME5= <>
##$TPNAME6= <>
##$TPNAME7= <>
##$TPOAL= (0..7)
0.5 0.5 0.5 0.5 0.5 0.5 0.5 0.5 
##$TPOFFS= (0..7)
0 0 0 0 0 0 0 0 
##$TUNHIN= 0
##$TUNHOUT= 0
##$TUNXOUT= 0
##$USERA1= <user>
##$USERA2= <user>
##$USERA3= <user>
##$USERA4= <user>
##$USERA5= <user>
##$V9= 5
##$VALIST= <valist>
##$VCLIST= <CCCCCCCCCCCCCCC>
##$VD= 0
##$VDLIST= <DDDDDDDDDDDDDDD>
##$VPLIST= <PPPPPPPPPPPPPPP>
##$VTLIST= <TTTTTTTTTTTTTTT>
##$WBST= 1024
##$WBSW= 4
##$XGAIN= (0..3)
0 0 0 0 
##$XL= 0
##$YL= 0
##$YMAX_a= 224318
##$YMIN_a= -314882
##$ZGOPTNS= <>
##$ZL1= 120
##$ZL2= 120
##$ZL3= 120
##$ZL4= 120
##$ABSF1= 10
##$ABSF2= 0
##$ABSG= 5
##$ABSL= 3
##$ALPHA= 0
##$AQORDER= 0
##$ASSFAC= 0
##$ASSFACI= 0
##$ASSFACX= 0
##$ASSWID= 0
##$AUNMP= <proc_1d>
##$AZFE= 0.1
##$AZFW= 0.1
##$BCFW= 1
##$BC_mod= 2
##$BYTORDP= 1
##$COROFFS= 0
##$CY= 11.3945322036743
##$DATMOD= 1
##$DC= 2
##$DFILT= <>
##$DTYPP= 0
##$F1P= 18.9103706918063
##$F2P= -1.10871071338519
##$FCOR= 0.5
##$FTSIZE= 0
##$FT_mod= 4
##$GAMMA= 1
##$GB= 0.15
##$INTBC= 1
##$INTSCL= 1
##$ISEN= 128
##$LB= 0.24
##$LEV0= 0
##$LPBIN= 0
##$MAXI= 10000
##$MC2= 0
##$MEAN= 0
##$ME_mod= 0
##$MI= 1.114404
##$NCOEF= 0
##$NC_proc= 0
##$NLEV= 6
##$NOISF1= 3.799351
##$NOISF2= 2.8
##$NSP= 1
##$NTH_PI= 0
##$NZP= 0
##$OFFSET= 15.70392
##$PC= 1
##$PHC0= -8873.147
##$PHC1= 30.40014
##$PH_mod= 1
##$PKNL= yes
##$PPARMOD= 0
##$PSCAL= 0
##$PSIGN= 0
##$REVERSE= no
##$SF= 200.130013532006
##$SI= 16384
##$SIGF1= 3
##$SIGF2= 2
##$SINO= 400
##$SIOLD= 16384
##$SREGLST= <1H.CDCl3>
##$SSB= 0
##$STSI= 0
##$STSR= 0
##$SW_p= 3612.71676300578
##$SYMM= 0
##$S_DEV= 0
##$TDeff= 0
##$TDoff= 0
##$TI= <>
##$TILT= no
##$TM1= 0
##$TM2= 0
##$TOPLEV= 0
##$USERP1= <user>
##$USERP2= <user>
##$USERP3= <user>
##$USERP4= <user>
##$USERP5= <user>
##$WDW= 1
##$XDIM= 8192
##$YMAX_p= 0
##$YMIN_p= 0
$$ End of Bruker specific parameters
$$ ---------------------------------
##NTUPLES= NMR FID
##VAR_NAME=  TIME,          FID/REAL,        FID/IMAG
##SYMBOL=    X,             R,               I
##VAR_TYPE=  INDEPENDENT,   DEPENDENT,       DEPENDENT
##VAR_FORM=  AFFN,          ASDF,            ASDF
##VAR_DIM=   8192,          8192,            8192
##UNITS=     SECONDS,       ARBITRARY UNITS, ARBITRARY UNITS
##FACTOR=    0.0002004,     1,               1
##FIRST=     0,             0,               0
##LAST=      1.6414764,     0,               0
##MIN=       0,             -314882,         0
##MAX=       1.6414764,     224318,          0
$$ Real data points
##PAGE= N=1
##DATA TABLE= (X++(R..R)), XYDATA
$$ [...]
2028f70l99K089J4j227O82O88j250n61J531O44j409l5O91j090p82J375R56j532
$$ -670 -1069 1020 1034 -193 489 1177 -73 -634 897 1541 132 97 788 -302 -1084 291 1247 -285
2046b85n41Q26J34r10Q42N60j129q82Q02P11p56j77Q42q18k21Q97R42q29p83O81
$$ -285 -826 0 134 -776 66 626 -503 -1385 -583 128 -628 -805 37 -781 -1002 -105 837 8 -775 -94
2066i4K30n60M73J117r80j132R82P21n43k27P63m19j146N21J555p60j100J003
$$ -94 136 -424 49 1166 186 -946 36 757 214 -13 750 331 -815 -294 1261 501 -599 404
2084D04K39j006j19J863p32k027R79J279j077m58J576l33k097N90K202o87j590
$$ 404 643 -363 -482 1381 649 -1378 -399 880 -197 -655 921 588 -1509 -919 1283 596 -994
2101i94J181M83j772N4K490o77k088J030J116j553l47K531o20k764Q15K145q90
$$ -994 187 670 -1102 -1048 1442 765 -1323 -293 823 -730 -1077 1454 834 -1930 -1115 1030 140
2118A40j513J769O47k925M65K835m78k609J556J042k176q1L111l24k931Q27K370
$$ 140 -1373 396 1043 -1882 -1417 1418 940 -1669 -113 929 -1247 -1328 1783 1459 -1472 -645 1725
2135A725k148o19K420J74l052L76K717p71j824J795Q31l042K79K257l04k513R61
$$ 1725 -423 -1042 1378 1552 -1500 -1124 1593 822 -1002 793 1624 -1418 -1139 1118 814 -1699 -738
2152g38J487j757m11K253q1k495O07K052j095j392K204J66k464M72J994m72j094
$$ -738 749 -1008 -1419 834 753 -1742 -1135 917 -178 -1570 634 800 -1664 -1192 802 330 -764
2169g64J156K09j641J04K116L6j858K48J457j251K06J123k8j702j07J292k90n40
$$ -764 392 601 -1040 -936 1180 1216 -642 -394 1063 -188 18 1141 1113 -589 -696 596 306 -234
2187b34M20N15j119j92P95M38n29m14J97K62l66K85Q81p33p93O98P59l42l77O23
$$ -234 186 701 -418 -610 185 623 94 -320 -123 139 -227 58 939 206 -587 111 870 528 151 774
2207G74m9j411P49J274j81j439O80P37j308p0J623o01j425M23J282q58o82J370
$$ 774 725 -686 63 1337 1156 -283 397 1134 -174 -244 1379 778 -647 -224 1058 200 -482 888
2225H88j81k048N06K090p89j661J539K59j908M63K296p58k265J187J424j768r6
$$ 888 707 -1341 -835 1255 466 -1195 344 603 -1305 -842 1454 696 -1569 -382 1042 -726 -822
2242h22K307k60k834J325K276j994q49K181j92k536P86K402j145j895J689Q20
$$ -822 1485 1225 -1609 -284 1992 -2 -851 1330 1138 -1398 -612 1790 645 -1250 439 1259
2258A259k361P9K824j184k674J418J961k184l63K388r69k549J216K137j630j150
$$ 1259 -1102 -1023 1801 617 -2057 -639 1322 -862 -1225 1163 194 -2355 -1139 998 -632 -1782
2274a782K194K8k809J170K312j383j400J603O44j848N83J849o94j746J089J063
$$ -1782 412 440 -2369 -1199 1113 -270 -1670 -67 577 -1271 -688 1161 467 -1279 -190 873
2290H73j446OJ372m94j526O49J432o64q91J377l33j408N75J395p19r38P35J16
$$ 873 -573 -567 805 311 -1215 -566 866 202 -689 688 355 -1053 -478 917 198 -740 -5 111
2308A11o58M21J139j052l23K69J82P1l79P78n32q5J19J55P0qj4k69J79J17j9k6
$$ 111 -547 -126 1013 -39 -362 -93 89 160 -219 559 27 -58 61 216 286 278 264 -5 174 291 272 246
2330B46K66o91l37O34l0k81K6M57q50k1J155k36o14L5P83q27K76P67r7r53J72
$$ 246 512 -179 -516 118 88 -193 -167 290 -560 -581 574 338 -276 -241 542 -285 -9 758 661 -292 -120
2351a20J035k29q93P68M01j273K17J176m21j241O48O05p62l59J730o90j259O24
$$ -120 915 686 -207 561 962 -311 -94 1082 661 -580 68 673 -89 -448 1282 592 -667 -43
2369d3R32j306k96J403k94j526M42J389j101p69J736k06j527K89J584r61p30J101
$$ -43 889 -417 -713 690 396 -1130 -688 701 -400 -1169 567 361 -1166 -877 707 -254 -984 117
2387A17L49j359M36J365q78j322J412M07r05k70J119m07r40P02O68q62m19J039
$$ 117 466 -893 -457 908 30 -1292 120 527 -378 -648 471 64 -876 -174 494 -368 -787 252
2405B52k50r61M13J250j025m90J343l67j050Q44L76p30m45R39N43j154P04L95
$$ 252 2 -959 -546 704 -321 -811 532 165 -885 -41 335 -395 -840 99 642 -512 192 587
2423E87n95m30R29n3n82N0N02m35l77O85J17p51q0P70n3n28J51M35n18o9M61m12
$$ 587 -8 -438 491 438 -144 -94 408 -27 -404 281 398 -353 -433 337 284 -244 -93 342 -176 -245 216 -196
2445a96P1J44J50l16j91L67r5O7j28O33o05k9O29l24k7N3N1j68K6K45j36%L72
$$ -196 -125 19 169 -147 -338 29 -66 1 -127 506 -99 -128 501 177 150 203 254 86 112 357 221 221 593
2468E93m76J16k08J73m8k38K10k05o2K31l3l10m5L05N3n57M14N27n74m0K39K9
$$ 593 117 233 25 198 150 -88 122 -83 -145 86 53 -257 -302 3 56 -501 -87 440 -134 -174 65 94
2490I4n40K96M53l02J51K1K35k03j28N12o18j0M53J01m90Q3N52o14j3n4o6J4k98
$$ 94 -446 -150 303 1 152 173 408 205 77 589 -29 -39 414 515 25 108 660 46 33 -21 -87 -73 -371
2513c71P17l86k14N04l29k95k2N84j55l44M56L5j41j74L15j98k9Q3K12j3j24O74
$$ -371 346 -40 -254 250 -79 -374 -396 188 33 -311 145 180 39 -135 180 -18 -47 36 248 235 111 785
2535G85l92n65J22M87q7l55J30K01j60J7K85m09k14J15K47k26R5J25n24J3N06
$$ 785 393 -172 -50 437 350 -5 125 326 166 183 468 59 -155 -40 207 -19 76 201 -323 -310 196
2556A96l91r2J23J2J11l53K17R2j5l26M21K1m64L77J95j20j77K36n2Q1m30L61
$$ 196 -195 -287 -164 -152 -41 -394 -177 -85 -100 -426 -5 16 -448 -71 124 4 -173 63 11 92 -338 23
2578B3K19j67k67J65L7J86n4n73O08l83q7L14l30O5R8J41k08J95J9l82K63j42
$$ 23 242 75 -192 -27 10 196 142 -431 177 -206 -293 21 -309 -244 -146 -5 -213 -18 1 -381 -118 -260
2600b60q1L13j28Q1k50K20K93k06J09q2J78K2l77K86j39R1k39J44oM9k52K50j00
$$ -260 -341 -28 -156 -75 -325 -105 188 -18 91 9 187 209 -168 118 -21 70 -169 -25 -31 18 -234 16 -84
2623h4m06L53K7m28L39J26k9j73K84r1Q8N4L42k31k59P5M40K93n04J18J28l42
$$ -84 -490 -137 -110 -538 -199 -73 -102 -275 9 -82 6 60 402 171 -88 -13 427 720 216 334 462 120
2645A20oN41p1l57l01O12o45J56M26k49m65J81K48q2o64M90L45n24k31N34J82
$$ 120 114 655 584 227 -74 538 -107 49 475 226 -239 -58 190 108 -556 -66 279 -245 -476 58 240
2666B40l77j54M22o3n49M05K21o55R4L61j66J03N57L60p39l62N27l04l38J38Q23
$$ 240 -137 -291 131 68 -481 -76 145 -510 -416 -55 -221 -118 439 799 60 -302 225 -79 -417 -279 544
2687E44m86k45J58N78m88j19M56j82o23M10N45o67n20O31J64q30M29N00o15l55
$$ 544 58 -187 -29 549 61 -58 398 216 -407 3 548 -119 -639 -8 156 -674 -245 255 -360 -715
2707g15N09L69o15mO91m71j30N10M9k21k65L10Jj12L3L00k68o20Q06K06p67J15
$$ -715 -206 163 -452 -456 235 -236 -366 144 193 -28 -293 17 18 -94 -61 239 -29 -649 157 363 -404 -289
2729b89L60r2n26M42J96k26m19N66K72q86K52P17l43o53Q45Mj85j96N98r7q82
$$ -289 71 -21 -547 -105 91 -135 -554 12 284 -602 -350 367 24 -629 216 220 35 -161 437 340 -542
2750e42M29J059q46l70R06j76o40j06Q35j73o02O57J39r72K95P77k07j295O24
$$ -542 -113 946 100 -270 636 460 -180 -286 549 376 -226 431 570 -402 -107 670 463 -832 -208
2769b08P90m37m57P65r8q02J01J004k46q42N38L39r11O8J121p7j065K71R74o17
$$ -208 582 145 -312 453 355 -447 -346 658 412 -430 108 447 -464 -396 725 648 -417 -146 828 211
2789B11n29Q98J09j104N2J053n82m65O45R7p20k94R50k50p87M55N85n31m72J087
$$ 211 -318 580 689 -415 -363 690 108 -357 288 385 -335 -629 321 71 -716 -261 324 -207 -679 408
2809D08L1j165J22P96j37k17L24N56q75m48J015Q8o32p5M97n95K29N70R6o06l87
$$ 408 439 -726 -604 192 55 -162 162 718 -157 -605 410 498 -134 -209 288 -307 -78 492 588 -18 -405
2830d05N20M01o16K87L12q68p0M48O2r4m28O03l23m28L13O24r60k44P90J18q77
$$ -405 115 516 -100 187 499 -369 -439 9 71 -23 -451 152 -171 -599 -286 338 -622 -866 -76 42 -835
2851h35K34R56o69k67O8P90n05K14N41l16r05O51Q71j063k5M99L16o58j22P64
$$ -835 -601 355 -314 -581 -513 277 -228 -14 527 211 -694 -43 828 -235 -260 239 555 -103 -225 539
2871E39m90l08L92M88r45J4P33k90p55P90L91r58l44J190O3j154L61O53l22r21
$$ 539 49 -259 133 621 -324 -310 423 133 -622 168 559 -399 -743 447 510 -644 -283 370 48 -873
2891h73R12N41j098P4R72l48j108Q88O80p88n72R62j32p80L24J095o26q96J020
$$ -873 39 580 -518 -444 528 180 -928 -40 640 -148 -720 242 110 -670 -346 749 123 -773 247
2910B47M95j059N1Q35o41n74Q94N40j153r9R60R3j151M16R48q70n35R23M56p54
$$ 247 742 -317 -266 569 -72 -646 248 788 -365 -464 496 589 -562 -146 802 -68 -603 320 776 22
2930B2j52R10n28o12Q22o1q32k78J018O9q02L45L84m95m73O00N6k10j20L25k81
$$ 22 -130 780 252 -360 462 401 -431 -709 309 378 -424 -79 305 -190 -663 -63 -7 -217 -337 -12 -293
2951b93m61P49L27m71j94M39q7m42M41K80r6o75O64kj97k43Q04k18l55j38L26
$$ -293 -754 -5 322 -149 -343 96 9 -433 8 288 192 -483 181 179 -18 -261 543 325 -30 -168 158
2972A58j30J48j17j27k66L00R1K03n54J50N0J56m07K82R0l42r5L21J33n45J02
$$ 158 28 176 59 -68 -334 -34 57 260 -294 -144 -94 62 -345 -63 27 -315 -410 -89 44 -501 -399
2993c99M92k84k35O61k69o0j54M43m56k97M23O16o47l16Q65p9q36N32O42r23R5
$$ -399 93 -191 -426 235 -34 -94 -248 195 -261 -558 -135 481 -166 -482 383 304 -532 0 642 -281 -186
3014a86M76P7j005N23M44l26n75Q43K25j395J91J355o46k75J85O83p16k83R13
$$ -186 290 367 -638 -115 329 3 -572 271 496 -899 -708 647 1 -274 -89 594 -122 -405 508
3033E08k06o42M52M69q05l03J052J52r56K23P51l83n33P29J48m02m55P67o02k32
$$ 508 302 -340 112 581 -224 -527 525 677 -279 -56 695 312 -221 508 656 254 -201 566 -36 -268
3053b68M77L77m46m94O43j37n32O01J09n21O7L74J77n97J40L40k01m04O45L8j93
$$ -268 209 586 140 -354 289 152 -380 221 330 -191 -124 250 427 -170 -30 310 109 -295 350 388 195
3074A95LK1r4o30O16K85p03L21L14l53k15J58K86n24j0K68K05m95L38k7j96K40
$$ 195 198 219 125 -505 111 396 -307 14 328 -25 -240 -82 204 -320 -330 -62 143 -352 -14 -41 -237 3
3096Cp7Q9l6J02P5k96M7J24J02j07L15j50J92M4L0k07k93J01k68L29j00K9Q6l18
$$ 3 -74 15 -21 81 156 -140 -93 31 133 26 341 191 383 427 457 250 -43 58 -210 119 19 48 134 -184
3120a84L86m52j10L93j93k21R4J05j87j95N36n1l91K46m5j73n2J76R2j30K77J49
$$ -184 202 -250 -360 33 -160 -381 -287 -182 -369 -564 -28 -79 -470 -224 -269 -442 -494 -318 -226 -356 -79 70
3142G0J57n67j1N72k79J17K66l39j22M03N03q02K73M06m59k17L83k12n91M64L71
$$ 70 227 -340 -351 221 -58 59 325 -14 -136 267 770 -32 241 647 188 -29 354 142 -449 15 386
3163C86j57k81q1M08l09j66M67k03l26K05K33l48O0L46j53j22p2L59l20P9L25
$$ 386 229 -52 -133 275 -34 -200 267 64 -262 -57 176 -172 -112 234 81 -41 -113 246 -74 5 330
3184C30k60m0j98O82k99n31O26O9n76R6M78k75j46J08J21l24j94M08j50J33O6
$$ 330 70 30 -168 514 215 -316 310 379 -197 -101 377 102 -44 64 185 -139 -333 75 -75 58 124
3205A24j14L3L9K29j15l50J96N5%p4R8q5j14J83K94j55j13J13o34K56K83l12K85
$$ 124 10 43 82 311 196 -154 42 97 97 23 121 36 -78 105 399 244 131 244 -390 -134 149 -163 122
3228A22q5j55O2J33j40R4j29k28K7j5k19M11J96l13J32k49K05Q2J27q3q5L40l42
$$ 122 37 -118 -56 77 -63 31 -98 -326 -299 -314 -533 -122 74 -239 -107 -356 -151 -69 58 -25 -110 230 -112
3251a12K83j70J18r9j05L69j42J5R7q4l04J64q2lJ4j49N02m06L1m7J88N3o3J5
$$ -112 171 1 119 20 -85 284 142 157 254 170 -134 30 -52 -55 -41 -190 312 -94 -63 -110 78 131 68 83
3275H3j22L5o2j00O8o6J47j00J90j23J35L1j26jK55j71j5p2J7J1K06K3J8l71K85
$$ 83 -39 -4 -66 -166 -98 -164 -17 -117 73 -50 85 116 -10 -11 244 73 58 -14 3 14 220 243 261 -110 175
3300A75j44m1R0N5k57j36M69j36l26J91J24j98J87L5Qj52J02r5l2J11k22n1K73
$$ 175 31 -10 80 135 -122 -258 211 75 -251 -60 64 -134 53 88 96 -56 46 -49 -81 30 -192 -243 30
3323C0M0L12n76K56K0n9J98k91K21J80m37j84N95j33k90j00L90l07J87J38l46
$$ 30 70 382 -194 62 82 23 221 -70 151 331 -106 -290 305 172 -118 -218 172 -135 52 190 -156
3344a56j25J28P4j07L6p8L41k20j58N61k44j09l18N81j44m19O08o9k21R6j50L38
$$ -156 -281 -153 -79 -186 -150 -228 113 -107 -265 296 52 -57 -375 206 62 -357 251 182 -39 57 -93 245
3366B45m30K27l11K96m7Q6k31k24K07K91l68K74K5K40o74J3N20j84j70K82K39
$$ 245 -185 42 -269 27 -20 66 -165 -389 -182 109 -259 15 40 280 -394 -381 139 -45 -215 67 306
3387C06q07M23J11L9k21K0L47m8k77M39R5n66M7L48j40k16K8J71j95j7M12k76
$$ 306 -501 -78 33 72 -149 -129 218 170 -107 332 427 -139 -92 256 116 -100 -72 99 -96 -113 299 23
3409B3k91J48O4j88O9K89l6m43L59j46K3j41N34j09n24Q9L19j15M6K7J29k31j82
$$ 23 -268 -120 -56 -244 -175 114 78 -365 -6 -152 -129 -270 264 155 -369 -280 39 -76 -30 -3 126 -105 -287
3432b87M51J21k23j95L88k16R3j23N12q04Q3L57j5k10R4J70m3o09L83M91n12J06
$$ -287 164 285 62 -133 255 39 132 9 521 -283 -200 157 142 -68 26 196 153 -456 -73 418 -94 12
3454A2k16K43q26P57M26l49o71L64N19l84K01L40n51j63J92J20M1q7L68L7o32
$$ 12 -204 39 -787 -30 396 47 -624 -260 259 -125 76 416 -135 -298 -106 14 55 -32 336 373 -259
3475b59j8R07m07m01J80l9k04P7O76l65m78L2K19K3m18P60m14n63N40M56l68l65
$$ -259 -277 630 223 -178 2 -37 -241 -164 512 147 -331 -299 -80 -57 -475 285 -129 -692 -152 304 -64 -429
3497d29N38n1p28M53P47j94m18j25O04m45J99K18l99k91J13O40l02m54M54K6n91
$$ -429 109 58 -670 -217 530 336 -82 -207 397 -48 151 369 -30 -321 -208 432 130 -324 130 156 -435
3518d35j52Q96k47k57K02P6m07M4N26J22n94n28Q46m4r5K29K79p64j03O25r6m62
$$ -435 -587 309 62 -195 7 83 -324 -280 246 368 -226 -754 92 48 -47 182 461 -303 -406 219 123 -339
3540c39P18j82l40M8L28J35o15l05L11L53k50M61J67m58l09M50K21p56N21L76
$$ -339 379 197 -143 -95 233 368 -247 -552 -241 112 -138 323 490 32 -277 173 394 -362 159 535
3560E35n70m38O30L2n70M11J4k35o18J092J37n38k8K92L2k71L01L68n38k34O41
$$ 535 -35 -473 157 189 -381 30 44 -191 -809 283 420 -118 -146 146 178 -93 208 576 38 -196 445
3581D45p6m83K62K80k33l76K13N06o89nN89o0m70K19M66m92p06L96K46k65K67
$$ 445 369 -114 148 428 195 -181 32 538 -151 -156 433 373 -97 122 588 96 -610 -214 32 -233 34
3602C4L27k57m58J64L72Qm13N06m2l50l00Q84j75m59J42L85l80J9LL90p35RN58
$$ 34 361 104 -354 -190 182 190 -223 283 241 -109 -409 475 300 -159 -17 368 -12 7 10 400 -335 -326 232
3625B32j13l20J40M56q71L03M74j87n53K11L42l79lM95R8o63L33M31m83k33L75
$$ 232 119 -201 -61 395 -476 -173 301 114 -439 -228 114 -265 -268 227 325 -338 -5 426 -57 -290 85
3646H5J29n40K83L78l16k50J85J36j16k83O48j41m51K92M7k13JL00J87p02k68
$$ 85 214 -326 -43 335 19 -231 -46 90 -26 -309 339 198 -253 39 86 -127 -126 174 361 -341 -609
3667f09Q11k24k95N37O5l97j4M82j45m11K33K97l32k87N98j60m26l9N55l16K37
$$ -609 202 -22 -317 220 285 -112 -126 356 211 -200 33 330 -2 -289 309 149 -277 -316 239 -77 160
3688A60L32N7p40ML94J44p32N21J18l98j68O86l00l90L93J62J32n24N11j98o07
$$ 160 492 549 -191 -187 207 351 -381 140 258 -140 -308 378 78 -312 81 243 375 -149 362 164 -443
3709d43J4L19K68k91L29L16m49l44N52o3m24P2J62J06p3K60N0o10j9L41P6l65
$$ -443 -429 -110 158 -133 196 512 63 -281 271 208 -216 -144 18 124 51 311 361 -249 -268 73 149 -216
3731b16N06l63p6k8N8K06j53O2j3o7k16L34j13OO1j12K53l80l9N48m90R3J5L13
$$ -216 290 -73 -149 -177 -119 87 -66 -4 -17 -84 -300 34 -79 -73 -12 -124 129 -251 -290 258 -232 -139 -124 189
3755A89k23j46K68J74l12r7L35j38j12q9N29n65p4N67j70k02K64j02q3L1j03J08
$$ 189 -34 -180 88 262 -50 -147 188 50 -62 -151 378 -187 -261 306 136 -66 198 96 13 44 -59 49
3777D9l24k1L28R1j50lk32L32m09M69j69o7q7N28k71k82K10K93l92j8N22m58m1
$$ 49 -275 -296 32 123 -27 -30 -262 70 -339 130 -39 -106 -193 335 64 -218 -8 285 -107 -125 397 -61 -102
3800a02q6L96l2r3Pj94j37K60Q3J83l11jL00n91K18L19l29r8M04n7j44L3K27k11
$$ -102 -188 208 176 83 90 -104 -241 19 102 285 -26 -27 273 -318 -100 219 -110 -208 196 139 -5 28 255 44
3824D4p8n3K51j67j18M25k2l49j35K20J51j82K18J48m99P7M36p41L89j15K53k28
$$ 44 -34 -87 164 -3 -121 304 282 -67 -202 18 169 -13 205 353 -146 -69 367 -374 15 -100 153 -75
3846g5k6L49m68l3J28J09K72k70l0J16Q7k29M44o83J47L45j29L7k00K78k85N74
$$ -75 -101 248 -220 -253 -125 -16 256 -14 -44 72 159 -70 374 -309 -162 183 54 91 -109 169 -116 458
3868D58n35J4j0J03O1m04J17J04l8L46j97J52o25L71J20l41L41m22L0J66J61L7
$$ 458 -77 -63 -73 30 91 -313 -196 -92 -130 216 19 171 -454 -83 37 -304 37 -385 -355 -189 -28 9
3890IO6k72J36j02J88j94J80J74j62r1L40l14J75L7p2l18L63J33j72k43o3M83
$$ 9 75 -197 -61 -163 25 -169 11 185 23 -68 272 -42 133 170 98 -220 143 276 104 -139 -202 281
3912B81m14J06o4j49K62m1L8j34j12M4O2K49l0k18j92L01J86o6J2k59L47k66j60
$$ 281 -133 -27 -91 -240 22 -19 19 -115 -227 -183 -121 128 98 -120 -312 -11 175 109 121 -138 209 -57 -217
3935b17O77n22j20P7R0J9M6J8j45M22n35N38m63M4K94l10j2l5L4J57J86k14J26
$$ -217 460 -62 -182 -105 -15 4 50 68 -77 345 -190 348 -115 -71 223 -87 -99 -134 -100 57 243 29 155
3958A55k75L32m31M33j45k3k6k59O12j03j87k4P3j87J77m32M70l67J60N7lj51
$$ 155 -120 212 -219 214 69 46 20 -239 373 270 83 59 132 -55 122 -310 160 -207 -47 10 7 -144
3980a44K75l13L17k10n5L17l77L05j35J56l46J21J0J05k52L99Ok34o2q3J60o4
$$ -144 131 -182 135 -75 -130 187 -190 115 -20 136 -210 -89 -79 26 -226 173 179 -55 -117 -200 -40 -104
4002a04k2L88%o02M29R3l62J85r7p9JK83p0q6J23J24l08J29J15j13L24l71O5j86
$$ -104 -126 262 262 -340 89 182 -180 5 -92 -171 -170 113 43 -43 80 204 -104 25 140 27 351 -20 45 -141
4026a41J4k1J68k54K10K11k94j3J01R7r2M9qJ4k39K35k65K71l08L92k0j93J88
$$ -141 -127 -148 20 -234 -24 187 -107 -120 -19 78 -14 35 27 41 -198 37 -228 43 -265 127 107 -86 102
4049A02k7M8j34K26j82PL0O4j24J32k73L48j4l80M4J38q1k27K14L98k86k60K22
$$ 102 75 123 -11 215 33 40 70 134 10 142 -131 217 203 -177 -133 5 -76 -303 -89 309 23 -237 -15
4072a5J70j65j24k26M60q3J2K7o9J14j79J83j60K81Nj64j84M06M2l61k3L6j9q3
$$ -15 155 -10 -134 -360 100 17 29 56 -13 101 -78 105 -55 226 231 67 -117 289 331 -30 -53 -17 -36 -119
4096a19j18N32m65J67J19r7m93M22kR2j56K09j4k65K2L53m11L47R6K12l56L5J4
$$ -119 -237 295 -170 -3 116 19 -474 -52 -54 38 -118 91 77 -188 -166 187 -224 123 219 431 75 110 124
4119A24r9j63J84L47n06o7M33j2m63J10M7Q9k79K70J62m15k0J30L6j14J66J78
$$ 124 25 -138 46 393 -113 -180 253 241 -222 -112 -65 24 -255 15 177 -238 -258 -128 -92 -206 -40 138
4141A38l01K73pO6l30J20J3j59M11l54J71m54K96M44l09k01J27K03k83j51O58
$$ 138 -163 110 103 169 -161 -41 -28 -187 224 -130 41 -413 -117 327 18 -183 -56 147 -136 -287 371
4162C71o05K82q5R9N3n20M58l6j08K6mo8k18K08l3K33k17M08J21n49J29l3j09
$$ 371 -234 48 -37 62 115 -405 53 17 -91 -65 -69 -137 -355 -147 -180 53 -164 244 365 -184 -55 -88 -197
4185a97K18j30N50n07j51N74l80Q1o3L20k26k13J19J72k33J30m5L4l03M37q6p7
$$ -197 21 -109 441 -66 -217 357 -23 58 -5 315 89 -124 -5 167 -66 64 19 53 -250 187 101 24
4207B4oJ40j65k18o3M60o5k3P1m0k95J26K05k13jP5K24r5l94P46l70l77M80K85
$$ 24 18 158 -7 -225 -288 172 107 84 155 115 -180 -54 151 -62 -63 12 236 141 -253 493 123 -254 226 511
4231E11p18j2J45J66k55L5J67K7k64J65p3J33j60K22J20o53L69R5j05m7K33q2
$$ 511 -207 -219 -74 92 -163 -128 39 66 -198 -33 -106 27 -133 89 209 -444 -75 20 -85 -132 101 19
4253A9p5j57L97Q5l06M8j20j50L70K42l8l91j93M75k17j89J74M8k3n2K33o3R0
$$ 19 -56 -213 184 269 -37 11 -109 -259 111 353 315 -76 -269 206 -11 -200 -26 22 -1 -53 180 117 207
4276B07j22K18n09J63M5m3k28mLL77n53N32n5j77J2K28j12O4O7k9j35L2J76Q6
$$ 207 85 303 -206 -43 2 -41 -269 -273 -270 107 -446 86 31 -146 -134 94 -18 46 113 84 -51 -19 157 243
4300B43l11K41J73l26k05L71M7k78q0L67n9k81J36L02l42m44M53K60m63J30K66
$$ 243 -68 173 346 20 -185 186 233 -45 -125 242 183 -98 38 340 -2 -446 7 267 -196 -66 200
4321B00m72l37O90L63p04P7J37J75m91P31n3l42k5M18j53q5OJ93k57m34L47M42
$$ 200 -272 -609 81 444 -260 -183 -46 129 -362 369 316 -26 -51 367 214 129 135 328 71 -363 -16 426
4343D26n23O5J06l02m1N16L26m70j45J96r6k22R1J89l60j10L13L82l9k73j5J57
$$ 426 -97 -32 74 -228 -269 247 573 103 -42 154 58 -164 -73 116 -244 -354 -41 341 302 29 14 171
4365A71l26J87j57O6k2K76k20l18O05N3k59j53oK2J44O2K8k82j31M9K73j32j72
$$ 171 -155 32 -125 -59 -81 195 -25 -343 262 315 56 -97 -103 -81 63 125 153 -129 -260 -211 62 -70 -242
4388b42O8J35j58J37L81k46k36L3J17L22m17J30k0k9l31M26P3n9J71l06j27K05
$$ -242 -174 -39 -197 -60 321 75 -161 -128 -11 311 -106 24 4 -25 -356 70 143 84 255 -51 -178 27
4410B7J35N9l68P9J32l11L11j28M46n06K51k46k8K25j91J57k09L28j69K14j66
$$ 27 162 221 -147 -68 64 -247 64 -64 382 -124 127 -119 -147 78 -113 44 -165 163 -6 208 42
4431D2J04k04K2r4L46r0j27j83L73l90j49N94l06K14l78K69o8n1K46P9l67l4K16
$$ 42 146 -58 -36 -130 216 126 -1 -184 189 -201 -350 244 -62 152 -226 43 -25 -76 170 249 -118 -152 64
4454F4K79j92k81J80r9k49m8N70j90j70L58r9q66Q97j12r2N9l7K41p3l25K25m08
$$ 64 343 151 -130 50 -49 -298 -346 224 34 -136 222 123 -743 154 42 -50 9 -28 213 140 -185 40 -368
4477c68L86J92j00O8Q8l03L11m19Q8K64m67J28J18k01LJ93K59m29J96k26K80j45
$$ -368 18 210 110 178 266 -37 274 -145 -57 207 -260 -132 -14 -215 -212 -19 240 -189 7 -219 61 -84
4499h4m4J30k86o9L50j49m7R8k5O55m88j15O1K9K65Jj22N0j98J52j18N1j09J20
$$ -84 -128 2 -284 -353 -3 -152 -199 -101 -126 529 41 -74 -13 16 281 282 160 210 12 164 46 97 -12 108
4523A08k01RJ62K1j97QK90k24k07J74K85j91j01L64l47M1o3J45K29j14j94M19
$$ 108 -93 -84 78 99 -98 -90 200 -24 -231 -57 228 37 -64 300 -47 -6 -69 76 305 191 -3 416
4545D16l26j00j32L96l02o3M77k91j40J92k20j63K62q5j7Q6j26L37J74m67K97
$$ 416 90 -10 -142 254 -48 -111 366 75 -65 127 -93 -256 6 -79 -96 -10 -136 201 375 -92 205
4566B05k05J71m02q5J51n2K90l50K90l22K16J72j52Q9J11q2j2M0j14j35K89j97
$$ 205 0 171 -231 -316 -165 -217 73 -277 13 -309 -93 79 -73 16 127 45 33 73 -41 -176 113 -84
4588h4N7M59j50m42K69q7K96l21J50J7j1j58m40L03k0K57J8O4k25l2qL92n79L44
$$ -84 -27 432 282 -160 109 22 318 -3 147 164 153 -5 -445 -142 -162 95 113 177 -48 -80 -88 304 -275 69
4612F9l10J39k0L28k49k9K23Mp8l3N8R9l89M71k18r4r7L17k00m1M07j20m14J65
$$ 69 -241 -102 -122 206 -43 -72 151 155 77 44 102 201 -188 283 65 -29 -126 191 -9 -50 357 237 -177 -12
4636a2K18j93n0n4J56l3R9k22J96L7k87K91m8K26m22J3J61k58N80m13Q2Q6j95
$$ -12 206 13 -37 -91 65 32 131 -91 105 142 -145 146 98 324 -98 -85 76 -182 398 -15 67 153 -42
4659d2k9j37J08o6K42k73K08r1J24j85J2K21l50K85L15l34q4pJ00K5k19K93k99
$$ -42 -71 -208 -100 -166 76 -197 11 -80 44 -141 -129 92 -258 27 342 8 -76 -83 17 42 -177 116 -183
4682a83J27K84k84j48K83j01L39l27J97l04J0O7qL09k64j26j78M80J92l48j35
$$ -183 -56 228 -56 -204 79 -22 317 -10 187 -117 -107 -40 -48 261 -3 -129 -307 173 365 17 -118
4703a18J64j31k6K79j87J91m34L37m6n0j42O1J11K9J69k45r7l7J00P1k20M59j93
$$ -118 46 -85 -111 168 -19 172 -262 75 29 -21 -163 -102 9 38 207 -38 -135 -172 -72 -1 -221 238 45
4726D5J37o9j44J25k27K39m8k9k07M93k83K25j76l7j46R4j94J10l06L53J26j17
$$ 45 182 113 -31 94 -133 106 58 29 -178 315 32 257 81 44 -102 -8 -202 -92 -398 -45 81 -36
4748c6Q3P8R2k91J30N2l06j0L35k59O3J13J28k55j61J33R3M2j01K08j03K36j49
$$ -36 47 125 217 -74 56 108 -198 -208 127 -132 -69 44 172 -83 -244 -111 -18 24 -77 131 28 264 115
4771A15n1k42j13L57n5M0j26J94r9j48N4L76l07j52N1L63m24M09k59r7l7J04M10
$$ 115 64 -178 -291 66 11 51 -75 119 20 -128 -74 302 -5 -157 -106 257 -167 242 -17 -114 -151 -47 363
4794C63l09k85L18j21l19J68L90l73J05P8K31j20j23N6m22J43J32L80n48J79j5
$$ 363 54 -231 87 -34 -353 -185 205 -168 -63 15 246 126 3 59 -363 -220 -88 292 -256 -77 -92
4815i2M9j00R1K95j07k83L77r6m70M05L2p6p7j49L03r8M4j43k9K38K22j04k08
$$ -92 -43 -143 -52 243 136 -147 230 134 -336 69 101 25 -52 -201 102 4 48 -95 -124 114 336 232 24
4838B4M2J58Q3k50r5J21j26l04M25R9n3m35M29j21k99L75k41R7j1J76o8j36Q2
$$ 24 66 224 307 57 -38 83 -43 -347 78 177 124 -311 118 -3 -302 73 -168 -71 -82 94 26 -110 -28
4861b8P3j7l0q3J24j44J01p7J2N7l8J33l2n1K67R8k88j83M85m34p5k1J54J79m03
$$ -28 45 28 -2 -85 39 -105 -4 -81 -69 -12 -50 83 51 0 267 365 77 -106 379 -55 -130 -151 3 182 -221
4886b21M20l73K7J75J37j3k19K83j53j68k88O81J52l22J31l69N9L7K78L7l89K69
$$ -221 199 -174 -147 28 165 152 -67 216 63 -105 -393 288 440 118 249 -120 -61 -24 254 291 -98 171
4908A71l6m60K17rK73O1o2j68r6J05Q3K63l07j40O07l33n72J89K77R7j46j16J62
$$ 171 135 -325 -108 -117 156 217 155 -13 -109 -4 79 342 35 -105 502 169 -403 -214 63 160 14 -102 60
4931F0o9m92M20J83j87J47K49k20r8K56l0k19K77m12N45l91j61K84l66N95k11
$$ 60 -9 -501 -81 102 -85 62 311 91 -7 249 219 0 277 -135 410 19 -142 142 -224 371 160
4952A60n2m43O23j76j07j29L13k42r6j40L54j59j78j5M33l42J40K96l73J77j0
$$ 160 108 -335 288 112 5 -124 189 -53 -149 -289 65 -94 -272 -287 146 -196 -56 240 -133 44 34
4973C4J66j81m2J09j80N5p5J77j53n3J39L8r2J28p2l9J74k27L62k88k9j10J06
$$ 34 200 19 -23 86 -94 -39 -114 63 -90 -143 -4 34 -58 70 -2 -41 133 -94 268 -20 -49 -159 -53
4996e3n4j10L65q4l88R1M11l22j52N59l05Q0k30K87l15RN3L26l08O2J39p4m00
$$ -53 -107 -217 148 64 -324 -233 178 -144 -296 263 -42 38 -192 95 -220 -211 -158 168 -140 -78 61 -13 -413
5019d13N81K48o04K69k27L60l77p8K17n6K51l61K25l09J86J41k13n0M61k14j66
$$ -413 168 416 -188 81 -146 214 -163 -241 -24 -80 171 -190 35 -274 -88 53 -160 -210 251 37 -129
5040a29K88j83K29k14j13O35m00n07J80L45k19J16j23L0J54k72L45J0j6k4m6q2
$$ -129 159 -24 205 -9 -122 513 113 -394 -214 131 -88 28 -95 -65 89 -183 162 172 156 132 86 4
5062Dk6K75j18l14O0J46o9o9L91l53j12l8J47P2mj38L90m57J21J27J5n3q6K45
$$ 4 -22 253 135 -179 -119 27 -42 -111 280 -73 -185 -223 -76 -4 -8 -146 244 -213 -92 35 50 -3 -89 156
5086A56j62k52K15L16L8k59Q2J00k05k27J18j25J74K33m80M3O8M53k39j41J56
$$ 156 -6 -258 -43 273 311 52 134 234 29 -198 -80 -205 -31 202 -278 -235 -167 286 47 -94 62
5107F2R5l33L05J87m93K96k30J58j55J82j61r3M86k91m9O3J5R3J2j6L5k02K29
$$ 62 157 -176 129 316 -177 119 -111 47 -108 74 -87 -180 306 15 -34 29 44 137 149 133 168 -34 195
5130A95p9M1K3l88J97Q7r3j11J72r2j25O4P6L41l95K64K5k7q1k11L72l02j39N78
$$ 195 116 157 180 -208 -11 76 -17 -128 44 -48 -173 -109 -33 308 -87 177 202 175 94 -117 255 -47 -186 392
5154C92m12J65j20J76o11L56Q2K55k67n3K29k41j2Q3J81m29J81r6J20r3J58OM2
$$ 392 -20 145 25 201 -410 -54 28 283 16 -37 192 -49 -61 22 203 -226 -45 -141 -21 -114 44 50 92
5177I2q2j38R8K04l14J93J3k73L20N3l68jK46k18J12j12o1K59k30L28j99K1K35
$$ 92 10 -128 -30 174 -140 53 66 -207 113 166 -202 -203 43 -175 -63 -175 -236 23 -207 121 -78 -57 178
5200A78r1k00L65l82J72j31RQ1R8k09M6J29j65J51o7K21m82N4J68J75k21J61j03
$$ 178 87 -113 252 -130 42 -89 -80 1 99 -110 -64 65 -100 51 -16 205 -277 -223 -55 120 -101 60 -43
5223d3q0K00j50P9j5o9J64j84k4J30M8j81L2m5K89l56K20L92m3k87m6Q4j60N2
$$ -43 -123 77 -73 6 -9 -78 86 -98 -122 8 56 -125 -93 -138 151 -205 15 407 364 77 31 115 -45 7
5247Gp6J2K75o3j10J24l05K1J51nk6MK4J21K55m32O3l7l13L78J07r3l09K23r5
$$ 7 -69 -57 218 155 45 169 -136 -115 36 31 5 9 33 154 409 -23 40 3 -310 68 175 82 -227 -4 -99
5272i9J55q8j9J22k48J68m5m7M2j60J04Q0k26K08l2K6J49p0J98k29j48O7J47J70
$$ -99 56 -32 -51 71 -177 -9 -54 -101 -59 -219 -115 -35 -261 -53 -85 -59 90 20 218 -11 -159 -92 55 225
5296B25k76L0Q2o6J15J04l32J63l28K63K77p7k53J02L1J30k25K12l91N2J95qr2
$$ 225 -51 -21 61 -5 110 214 -118 45 -283 -20 257 180 -73 29 60 190 -35 177 -214 -162 33 25 -67
5319f7j32PJ08JJ16j26k31J49J77j02Lj55L06m22N40k80J43k67mM03k15n1O4J8
$$ -67 -199 -192 -84 -83 33 -93 -324 -175 2 -100 -97 -252 54 -368 172 -108 35 -232 -236 167 -48 -99 -35 -17
5343a7j27K40J28m24J93P7j8j98j05K40j00L95q7J46k42l10K34K73k10j9k32O21
$$ -17 -144 96 224 -200 -7 70 52 -146 -251 -11 -111 284 197 343 101 -209 25 298 88 69 -163 458
5365D58l36N5k34l35K76O0qN7J18o0M01p79J54m5J21J90j52K47k83Q9Kj18L0j64
$$ 458 122 177 -57 -392 -116 -56 -64 -7 111 51 452 -327 -173 -218 -97 93 -59 188 -95 -6 -4 -122 -92 -256
5389b56J05J71K10l79K46k06J69m90N45j39N9j32k38K38j04J27K7k10M20n3o9
$$ -256 -151 20 230 -149 97 -109 60 -430 115 -24 35 -97 -335 -97 -201 -74 -47 -257 163 110 41
5410D1L56k59q3P1l47m1J27J18K69k01j65o9L1Q8O3j18j03L54k25Q7L10m38k1
$$ 41 397 138 55 126 -221 -262 -135 -17 252 51 -114 -183 -152 -64 -1 -119 -222 132 -93 -6 304 -134 -155
5433a55j11K26j64M25k02K1j94j60K99O4q2M6j3j55j19K43j89rq8M13j92K36k36
$$ -155 -266 -40 -204 221 19 40 -154 -314 -15 49 -33 13 0 -155 -274 -31 -220 -229 -317 96 -96 140 -96
5456i6j94L08k99K12L74n38K97j01j69M55m37j31P25l36j32j19j3M84m39J14J25
$$ -96 -290 18 -281 -69 305 -233 64 -37 -206 249 -188 -319 406 70 -62 -181 -194 290 -149 -35 90
5477I0k35J93q8q0L28l59K36j15J72j30P1J23j15j2J5J32l33J9L7m6K04j88L32
$$ 90 -145 48 -40 -120 208 -151 85 -30 142 12 83 206 91 79 94 226 -107 -88 -51 -97 107 -81 251
5500B51j57J29m85L26N9l03k24L57r3J24mK42k14j56J10q0L98l37J40j32K35k23
$$ 251 94 223 -262 64 123 -180 -404 -47 -140 -16 -20 222 8 -148 -38 -118 280 -57 83 -49 186 -37
5522c7J55L77k76L9k69L19o05J87k78M97k23k96L92k2L8j17K22k21K74k52l2K32
$$ -37 118 495 219 258 -11 308 -297 -110 -388 109 -114 -410 -18 -40 -2 -119 103 -118 156 -96 -128 104
5544A04j07j39L57l13J98K11j82l02J38l38P02l00M39n63k25L88J56o7k44m1J27
$$ 104 -3 -142 215 -98 100 311 129 -173 -35 -373 329 29 468 -95 -320 68 224 157 -87 -128 -1
5565ak9m17L90r8P4l17O53j58q7j24L68j57l98P1L02j64j24L24j04R0J01l07K23
$$ -1 -30 -447 -57 -155 -81 -398 255 97 10 -114 254 97 -301 -230 72 -92 -216 108 4 94 195 -112 111
5588A11k65j70O26k26ok45J46n8J41M16k54k34O7K60j58k85J88j67j59K00j18
$$ 111 -154 -324 302 76 70 -175 -29 -87 54 470 216 -18 49 309 151 -134 54 -113 -272 -72 -190
5609a90P8Mo2J72j2r1M83J9m86J62Q3O2l82J55J05k01J79O1j94J36j88L99k25
$$ -190 -112 -108 -170 2 -10 -101 382 401 -85 77 160 222 -160 -5 100 -101 78 139 -55 81 -107 292 67
5632F7m5j40j16L42m86M45k16JM40l7l58L88n0j78m0k49R8P8k86L09J25j80J01
$$ 67 22 -118 -234 108 -378 67 -149 -148 292 255 -103 285 235 57 17 -232 -134 -56 -342 -33 92 -88 13
5655A3q9J84j68J38R1m05r1N32k05k2K72j60l31J16J18n8J73j13j56K0k7P7L12
$$ 13 -76 108 -60 78 169 -236 -327 205 0 -22 250 90 -241 -125 -7 -65 108 -5 -161 -141 -168 -91 221
5678B21q7k65J61pk95L56j26K62k08n5K2O0q7J03N5k68L43k08o9K7K74k92j87
$$ 221 134 -131 30 23 -272 84 -42 220 12 -43 -21 39 -48 55 110 -158 185 -23 -92 -65 209 -83 -270
5701b70J4P48l33K5o1l82M37k78R2P4m36M32k36J63R3O0k83K60J5M6k72O5N5P1
$$ -270 -256 492 159 184 123 -259 178 -100 -8 66 -370 62 -174 -11 82 142 -141 119 134 180 -92 -27 28 99
5725I9J85l19J10k6j88L7K82l09K68J28j26k24K75q9J76l17J54kj91J53j30o3
$$ 99 284 -35 75 49 -139 -102 180 -129 139 267 141 -83 192 103 279 -38 116 114 -77 76 -54 -117
5747a17kJ56j00K61m1K08k24l65N1p5K89j53K62J32k73J73l08O3J41j90n9k3K96
$$ -117 -119 37 -63 198 157 365 141 -224 -173 -248 41 -112 150 282 9 182 -126 -63 78 -112 -171 -194 102
5770A02j36J21k21K81j83n2K14j03O8l48O3L66l23q1O85m97Nj13O18l08n3Rk7
$$ 102 -34 87 -134 147 -36 -88 126 23 91 -257 -194 172 -151 -232 453 -44 -39 -152 466 158 105 114 87
5793H7j49k5J93J69n66J24J60O6L59n29Q3J44j84L1K20l88n9J37K2M1j24K69O4
$$ 87 -62 -87 106 275 -291 -167 -7 59 418 -111 -28 116 -68 -37 183 -205 -264 -127 -105 -64 -188 81 145
5816A45k9L1m96L59rJ08j37K7J62p1l64O2L54l59K2J38o2k16L35L48m39j80L96
$$ 145 116 147 -349 10 1 109 -28 -1 161 90 -274 -212 142 -217 -195 -57 -119 -335 0 348 -91 -271 125
5839A25j39J58l68L80K7k60k3K56r1R3k5k75q5L01j0k04M81n25K38K14n55M45
$$ 125 -14 144 -224 156 183 -77 -100 156 65 158 133 -142 -227 74 64 -140 341 -184 54 268 -287 158
5861A58j44j03m9P1j27J79K40j07k78QR7J78l50J68n3k6j10K40O2j3j56Q1Q4J71
$$ 158 14 -89 -138 -67 -194 -15 225 118 -160 -152 -55 123 -227 -59 -112 -138 -248 -8 54 41 -115 -34 50 221
5885B21m37K39M2n7J84l39l4K89j22j57J05K55k93N6l3K32q5k25J04P0j53n5K86
$$ 221 -216 23 65 8 192 -147 -181 108 -14 -171 -66 189 -104 -48 -81 151 66 -159 -55 15 -138 -193 93
5908I3l16N51l85P9j60K68j06K15p9j98R5Lp5j76J73J72j27p4l12K66O6n7j26
$$ 93 -223 328 -57 22 -138 130 24 239 160 -38 57 60 -15 -191 -18 154 27 -47 -359 -93 -27 -84 -210
5931b10J94J69O6k60j79J55K95l72K62k02J50k10L6L4N4J19Nj41k12R7P4L13l34
$$ -210 -16 153 219 -41 -220 -65 230 -142 120 -82 68 -142 -106 -72 -18 101 106 -35 -247 -150 -76 237 -97
5954i7j22N64k38j32J97k90J1M12j64J18j42l86M60j08j53n1K83n06N6J88K0K51
$$ -97 -219 345 107 -25 172 -118 -107 305 141 259 117 -269 191 83 -70 -121 162 -344 -288 -100 -80 171
5976A71k3j93l1m2K12r1L2q9k39L01M6l84K19n8J89j15o4o6M10j28MKL3k76J27
$$ 171 148 -45 -76 -118 94 3 35 -54 -293 8 54 -330 -111 -169 20 -95 -159 -225 185 57 61 63 96 -180 -53
6001e3l1J71j69O6m1PO8K16j71j60L9N4k46J08J37j30J25n7o4J14O7K82m2l25
$$ -53 -84 87 -82 -16 -57 -50 18 234 63 -97 -58 -4 -250 -142 -5 -135 -10 -67 -131 -17 50 332 290 -35
6025c5J22n1j6R5L4k0M8l36K90J23j34J61m08L99k8oj47m5L76k03j92LP1k20l7
$$ -35 87 36 20 115 149 129 177 -159 131 254 120 281 -127 272 244 238 91 46 422 219 27 30 101 -119 -156
6050a56L31p5l00K1M14O8n68L63k12k68O39l53K1P0K58o7J1N8q0k17K05m03L07
$$ -156 175 100 -200 -179 235 303 -265 98 -114 -382 257 -96 -75 -5 253 186 197 255 175 -42 163 -240 67
6073F7J54k15j13J62m3j77J65J26k80K45J06l15M44m77K12j58L24k54K28Ql08
$$ 67 221 6 -107 55 12 -165 0 126 -154 91 197 -118 326 -151 61 -97 227 -27 201 209 -99
6094i9K04m3J27k72L62j20J4p0j38R4n2%j3M2j0l11K22L40l20o8P1k41nL73r4
$$ -99 105 62 189 -83 279 159 173 103 -35 59 7 7 -6 36 26 -285 -63 277 -43 -111 -40 -281 -286 87 -7
6119gJ20k60M9M0j06P3o3K92l38L34k50J49l4M85o16J63k61J98J79j59j11j71
$$ -7 113 -147 -98 -58 -164 -91 -154 138 -200 134 -116 33 -1 484 -132 31 -230 -32 147 -12 -123 -294
6141b94J92J42M9q3k8J49l71J57M2K71k75j6MJ63j03j52J9J54o4p6l3r2M00k23
$$ -294 -102 40 89 6 -22 127 -244 -87 -45 226 -49 -65 -61 102 -1 -153 -134 20 -44 -120 -153 -245 155 -68
6165f8N3j1K75k66j59K71p3ol47L49k0r5K69J30k10M6j99pR5O8j30R8k4m8r2j20
$$ -68 -15 -26 249 -17 -176 95 22 16 -331 18 -2 -97 172 302 92 138 -61 -68 27 95 -35 63 39 -9 -101 -221
6191b21m5M45N3l69L01l29J86J0j21K45l17M13l50L0K82k06J84j31j4j13J69j74
$$ -221 -266 179 232 -137 164 -165 21 31 -90 155 -162 251 -99 -69 213 7 191 60 46 -67 102 -72
6213g2K25m7r4J69l53L38j36j45k8J5K85l37J74j05OJ96j06Q0J39m2q3m7j02m9
$$ -72 153 106 12 181 -172 166 30 -115 -143 -128 157 -180 -6 -111 -105 91 -15 65 204 162 79 32 -70 -119
6237a19r7L10J70l12q3K98l03JO3pJ61k30J19l8J18l3P5j25j87O6K02j92O1p9
$$ -119 -216 94 264 -48 -131 167 -136 -135 -72 -79 82 -148 -29 -67 51 18 93 -32 -219 -153 49 -143 -82 -161
6261a61M7j7j46L86N7j11k52L44k70N4K9K9R4K19k61j65o9N52k60N3k16j27M57
$$ -161 -114 -131 -277 109 166 55 -197 147 -123 -69 -40 -11 83 302 41 -124 -193 359 99 152 -64 -191 266
6284B66j06JJ05l54J70j66j33K14j05R4K88k30j53O9k9l3j7J19k65K11K2O3Mj83
$$ 266 160 161 266 -88 82 -84 -217 -3 -108 -14 274 44 -109 -40 -69 -102 -119 0 -265 -54 -32 31 35 -148
6308a48L09J14j29j63J07P6j73K36j86k09J82J3R4m00M40k12l02P4K83o1K07k55
$$ -148 161 275 146 -17 90 166 -7 229 43 -166 16 29 123 -277 163 -49 -351 -277 6 -55 152 -103
6330a03K00k11p9M71r4j95J05k08Q0j18r9M91l92L34k18J5Q1nj96J01q5K16K33
$$ -103 97 -114 -193 278 184 -11 94 -114 -34 -152 -251 240 -152 182 -36 -21 60 55 -141 -40 -125 91 324
6353C24o46K58M56l07K28k10J8k38j11M42j56l40K75M2J62j47k56L60k97K27r3
$$ 324 -322 -64 392 85 313 103 121 -117 -228 214 58 -282 -7 35 197 50 -206 154 -143 84 -9
6374ik30K87j57L01R9m37J39q8j12L35O8l18K05R1Ml06L86M5m72j39L30J4j57
$$ -9 -239 48 -109 192 291 -146 -7 -95 -207 128 196 -122 83 174 178 -128 258 303 -169 -308 22 36 -121
6397a21L59n00J65o1K40k22K62j73J28k48o8L70q2j30N8L23J65l72q3m3L30k11
$$ -121 238 -262 -97 -158 82 -140 122 -51 77 -171 -239 131 49 -81 -23 300 465 93 10 -33 297 86
6419H6L6r5j81K56j01O9j83r3K93j55K04J4J0j76j02J42J35K1k06J6P8j28K69
$$ 86 122 27 -154 102 1 70 -113 -206 87 -68 136 150 160 -16 -118 24 159 180 -26 -10 68 -60 209
6442B09m19K60K62k95j40j55L17pJ97K72k31k83N6RJ97k71J2Q2pl03J13J36J59
$$ 209 -210 50 312 17 -123 -278 39 32 229 501 270 -13 43 52 249 -22 -10 72 65 -238 -125 11 170
6465A70J0p3k97J6j04L55M1k15J03k3L5Q3j94n2R6R6L9N3j35k54J86l4R6k33K79
$$ 170 180 107 -190 -174 -278 77 118 -97 6 -17 18 101 -93 -145 -49 47 86 139 4 -250 -64 -98 -2 -235 44
6490D4j60J09J88j95K09p3K20m85Q5oJ56j31L8Q8N6j0j70L5k06P5j3J34m7p2L06
$$ 44 -116 -7 181 -14 195 122 342 -143 -58 -64 92 -39 -1 87 143 133 -37 -2 -208 -133 -146 -12 -59 -131 175
6515A75l70K28k35K42J57Jp7o03L92L32l84J38j11J51k13N8L32k70on1M5J43r2
$$ 175 -195 33 -202 40 197 198 121 -482 -90 242 -142 -4 -115 36 -177 -119 213 -57 -63 -114 -69 74 -18
6538a8k28L41l96K07r9K67l34m7j37M67k24J83r1J49j40K98j20Q1p9j76o0K62
$$ -18 -246 95 -301 -94 -193 74 -260 -307 -444 23 -201 -18 -109 40 -100 198 78 159 80 -96 -156 106
6560A06j20L0K66m35J12JJ0p1J21Q8R5O6k98j3p0K20o0N3P1k66j50K18L09l79
$$ 106 -14 16 282 -153 -41 -40 -30 -101 20 108 203 269 -29 -42 -112 108 48 101 172 -94 -244 -26 283 -96
6584i6L94k91M12m92L9P6J35m49P3P4Jm8M7l3K68m14L05K04k33J87N9k22K23j75
$$ -96 298 7 419 -73 -34 42 177 -272 -199 -125 -124 -172 -125 -158 110 -304 1 205 -28 159 218 -4 219 44
6608D4jj5K16k8k58l2k91N0L14l6M9P9j42J10jk71K42q7N7KJ74m12K84j18J52
$$ 44 43 28 244 216 -42 -74 -365 -315 -1 -37 12 91 -51 59 58 -213 29 -58 -1 1 175 -237 47 -71 81
6633H1J59l74L86k97j1K48k28oK97m04J71R0qL1j41J33l24K7J30p1j54K36J50
$$ 81 240 -134 252 -45 -56 192 -36 -42 255 -149 22 112 104 135 -6 127 -197 -170 -40 -111 -265 -29 121
6656A21k98K29j04R9n9J24K19n49J55K54j77j81J81n5K53j35p5J69k01M15l79
$$ 121 -177 52 -52 47 -12 112 331 -218 -63 191 14 -167 14 -41 212 77 2 171 -30 385 6
6677Fl5J60j69j49L6j31Q2R4r8M7J39j19k12K72k71M39j77J56l1j17M4R1Op4o
$$ 6 -29 131 -38 -187 -151 -282 -200 -106 -204 -157 -18 -137 -349 -77 -348 91 -86 70 39 -78 -34 57 63 -11 -17
6702a7j25P9M8k35K09N3M2P5k7oO8K1j60j23L08n38M38M9l1j2K5J17n18N52j63
$$ -17 -142 -63 -15 -250 -41 12 54 129 102 96 164 185 25 -98 210 -328 110 159 128 116 141 258 -260 292 129
6727A29j82J44k99J5j0K49k3k56J89K00j43k07J72J61o3O8j80R1O4l7J23j00k
$$ 129 -53 91 -208 -193 -203 46 23 -233 -44 156 13 -194 -22 139 76 144 -36 55 119 82 205 105 103
6750A03J8j09N6l73M73k67J54J76m24J25m8M3j3nk43P6O20m56j12Q1k69L78j90
$$ 103 121 12 68 -305 168 -99 55 231 -193 -68 -116 -73 -86 -91 -334 -258 362 -94 -206 -125 -394 -16 -206
6773b06L70m34L0L98J66l83m2K30m62M10J09l33L2N7J15k27K15J3j02j37K80J1
$$ -206 164 -270 -240 158 324 -59 -101 129 -333 77 186 -147 -115 -58 57 -170 45 58 -44 -181 99 110
6795A10j79K73m88K67O5n1j10O8J52r2J04J7k21j58J78R6%o1K56j19l24J57R8
$$ 110 -69 204 -284 -17 48 -3 -113 -45 107 15 119 136 -85 -243 -65 31 31 -30 226 107 -217 -60 38
6818C8J8k32L15l5o4O9j60Q8O9QJ88m95N45n10r1Q5M9R8j1J12j28K5p0J05m1j7
$$ 38 56 -176 139 104 40 109 -51 37 106 114 302 -193 352 -158 -249 -164 -115 -17 -28 84 -44 -19 -89 16 -25 -42
6844d2k02M93l55L79n29L16k21M6K06N2k08j66K59j87l7L02O5p6j82r1q2J58j88
$$ -42 -244 249 -106 273 -256 60 -161 -115 91 143 -65 -231 28 -159 -196 106 171 95 -87 -178 -260 -102 -290
6867b90N7L63p5k6k0J52o4j41j6j86K26P8P1j42O7J50l10r5J76%N1K07j50j55
$$ -290 -233 130 55 29 9 161 97 -44 -60 -246 -20 58 129 -13 54 204 -106 -201 -25 -25 26 233 83 -72
6891g2M07j56l00P7J64LK0k11L54j79j31L8j07K3J46J30j65r3j74L8J08Q2J52
$$ -72 335 179 -121 -44 120 123 143 -68 286 107 -24 14 -93 -70 76 206 41 -52 -226 -188 -80 2 154
6914A54L3j21r6q1k4R8J56l95L25jk27J78j49m14P14p0j69K11j00J5M0L03j7n48
$$ 154 187 66 -30 -111 -135 -37 119 -276 49 48 -179 -1 -150 -564 150 80 -89 122 22 37 77 380 363 -185
6938a85l9L92k69J43o6j80J89j74K16j08k28P15n0l83R5j40K31j37Ok1j83L42
$$ -185 -224 168 -101 42 -24 -204 -15 -189 27 -81 -309 406 356 -27 68 -72 159 22 28 7 -176 166
6960A66j08K43n44L24k47N0J00J16m1Oj0L7q7L24mn83K12M4j79M30l50J12ooo3
$$ 166 58 301 -243 81 -166 -116 -16 100 59 65 55 92 5 329 325 -258 -46 -2 -181 249 -101 11 5 -1 -64
6985f4L08m09K40j13N6K2j37N63m12j46K7J24K17k49k78L9K34J4J2P1j15j95J96
$$ -64 244 -165 75 -38 18 40 -97 466 54 -92 -65 59 276 27 -251 -212 22 36 48 119 4 -191 5
7008Ej2K22j38j67J01J84k16N3m1l92M30L1j62J13J03K1k08k34M76j64j28M5J65
$$ 5 -7 215 77 -90 11 195 -21 32 -9 -401 29 60 -102 11 114 135 -73 -307 169 5 -123 -78 87
7031H7j45O8K9K25k10%K56k17j37J41R5l20K54r6j68j74J21J21r9J03J7M1K80
$$ 87 -58 10 39 264 54 54 310 93 -44 97 192 -128 126 30 -138 -312 -191 -70 -169 -66 -49 -8 272
7054B72j70R7l73qL90l8k19J97q4K1j54j20M37j25j00J30m2l9j99K14j17K12m62
$$ 272 102 199 -174 -182 208 170 -49 148 64 85 -69 -189 248 123 23 153 111 72 -127 87 -30 182 -280
7077b80L69j38j9L9N9L80l29K70n56K33k27M3J25K21l90N28l88J14k02L2J33L48
$$ -280 89 -49 -68 -29 30 410 81 351 -205 28 -199 -156 -31 190 -200 328 -60 54 -148 -116 17 365
7099C65k57l7j36J57j78o2J56l8j62L47J0k99K74j11j9Kk6P3k50R3l1j1j51K46
$$ 365 108 71 -65 92 -86 -148 8 -30 -192 155 165 -134 140 29 10 12 -14 59 -191 -98 -129 -140 -291 -45
7123d5L66k29k05j40N38j30j53k13J83r4J62k8Qk81L23Q8j44M7J44Kk00K89k73
$$ -45 321 92 -113 -253 285 155 2 -211 -28 -122 40 12 20 -261 62 150 6 53 197 199 -1 288 15
7146A5K5n6J37l51K64j07l91L08J4P0j36K98Q3k42j64J06N8O3pj64L12k13K24
$$ 15 40 -16 121 -230 34 -73 -464 -156 -142 -72 -208 90 173 -69 -233 -127 -69 -6 -13 -177 135 -78 146
7169A46l43J96J12Q3n30L93j13K6K3q6L84l20R1R0k78k34P68n32J46K8j97N3o2
$$ 146 -197 -1 111 194 -336 57 -56 -30 -7 -93 291 -29 62 152 -126 -360 408 -124 22 50 -147 -94 -156
7192a56J62NL3q4J63l41L34p2j20j34L66k43O2n7J44l62K43J01J39M0l69K92q
$$ -156 6 11 44 -40 123 -218 116 44 -76 -210 156 -87 -25 -82 62 -300 -57 44 183 223 -146 146 138
7215A38J08j24j63Kj33P6j49n7M2P9N9n5K3J81Q3r4M9K3Lk71L34P0j52P4j73J47
$$ 138 246 122 -41 -39 -172 -96 -245 -302 -260 -181 -122 -177 -154 27 110 16 65 88 91 -180 154 224 72 146 -27 120
7241A20k31J63K07n95N77r9k44j23M57k33j08L85k57J40qk75O4J8j5OJ8j12K10
$$ 120 -111 52 259 -336 241 142 -102 -225 232 -1 -109 276 19 159 151 -124 -60 -42 -57 -51 -33 -145 65
7264F5O6j4j6k68k16K57J01Q5r4J41m27J22l8J67k5J31j9k48L32j78R3r5K94j20
$$ 65 131 117 101 -167 -383 -126 -25 60 -34 107 -320 -198 -236 -69 -94 37 18 -230 102 -76 17 -78 216 96
7288I6R6k69J59K79k77l01M8K36J23j25k07L63m74L33k25K80j88k11M58n7k28
$$ 96 192 -77 82 361 84 -217 -169 67 190 65 -142 221 -253 80 -145 135 -53 -264 194 137 -91
7309i1K07j96j89K85K4j16M7R5p5K05j83p7J20m25N43j26j70J38J60l32L5L08
$$ -91 116 -80 -269 16 40 -76 -29 66 -9 196 13 -64 56 -369 174 48 -122 16 176 -156 -121 187
7331A87k22j65K74q3j77N5J08l43J50pL04r1P1K58j13k55K99P6q2k66K25k39K
$$ 187 -35 -200 74 -9 -186 -131 -23 -366 -216 -223 81 -10 61 319 206 -49 250 326 244 -22 203 -36 -34
7354c4N7m88M26q7P1j94J80j23m5K12j48o6M31j70l7J75PK6k3N5n21O2K01J8k92
$$ -34 23 -465 -39 -126 -55 -249 -69 -192 -237 -25 -173 -239 192 22 -15 160 167 193 170 225 -296 -234 -33 -15 -307
7379c07L89k68L23j44K8L4k3P6k31j3J75K9l52K93Q4m0m0K91j81j64K80k46K79
$$ -307 82 -186 137 -7 21 55 32 108 -123 -136 39 68 -284 9 93 53 13 304 123 -41 239 -7 272
7402B72m24J42j38L57j38O1N9k58LQ5L19m78R6k2R4j6n7N1J33j14K62l02O7k96
$$ 272 -152 -10 -148 209 71 132 191 -67 -64 21 340 -138 -42 -64 30 14 -43 8 141 27 289 -13 54 -242
7426b42P39l10l4k37k2M70l56L0k5j02K11k00q4M23j3j82j53K04j04l40M75K43
$$ -242 497 187 153 -84 -106 364 8 38 13 -89 122 -78 -162 261 248 66 -87 117 13 -327 148 391
7448C91n25J65J01m17L88j38j95M11k8m35L66J35l84P4j68N59l89J82J83L5l15
$$ 391 -134 31 132 -285 103 -35 -230 181 153 -282 84 219 -165 -91 -259 300 -89 93 276 311 -4
7469dM4J31k40K20k67j5j54K85k7k26L04J09j28j22K15m89L85j3R3j87k7J84j8
$$ -4 40 171 -69 151 -116 -131 -285 0 -27 -253 51 160 32 -90 125 -364 21 8 101 -86 -113 71 53
7492E3j34RK35k03J76j32K17k10J55l20Q0q6J68L3J58l68rK26J00j13r9q6M1o
$$ 53 -81 -72 163 -40 136 4 221 11 166 -154 -74 -160 8 41 199 -169 -178 48 148 35 -64 -150 -109 -115
7516a15K90j70o3Q4k87L30p9j03J61k75j05L72j00nK15k04Q5k1J46k65J69o0m6
$$ -115 175 5 -58 26 -261 69 -10 -113 48 -227 -332 40 -60 -65 150 -54 31 10 156 -109 60 0 -46
7539d6k8J34M3j12j05L0q4j01L08j38j8K11q7j36L57k73j52K5l5K95j91r7J5N49
$$ -46 -74 60 103 -9 -114 -84 -168 -269 39 -99 -117 94 7 -129 228 -45 -197 -172 -207 88 -103 -200 -185 364
7563C64m04P7l86L34n4J70m2j53J43J93l20O5n0J09P9p3k95J35N85m90J57k56
$$ 364 -40 37 -349 -15 -69 101 59 -94 49 242 -78 -13 -63 46 125 52 -243 -108 477 -13 144 -112
7585a12M67l25K20n29J53K62l84J75j2J26j5r6L75k66K3k3k12K07Q3ml40L61q3
$$ -112 355 30 250 -279 -126 136 -248 -73 -85 41 26 -70 305 39 62 39 -173 34 117 113 -227 134 51
7608E1n8K93K7j65j59K75j61l2j94j1J44k24Q9M9l0J33L9r6Q8J15j56R8k65J76
$$ 51 -7 286 313 148 -11 264 103 71 -123 -134 10 -214 -125 -76 -106 27 66 -30 58 173 17 115 -150 26
7632B6J59M2o73M47j73J28k13J49L34k34L16m46ML7J68N9k76k0L19j54J15ml61
$$ 26 185 227 -446 1 -172 -44 -257 -108 226 -8 308 -138 -134 -97 71 130 -146 -166 153 -1 114 110 -251
7655b51L76M3j14r4m2Q5j5m4oO8Qp1K21j21k2R3q8P1j27j43M83j25m03J54N6j15
$$ -251 125 168 54 -40 -82 3 -12 -56 -62 6 14 -57 164 43 21 114 26 97 -30 -173 310 185 -218 -64 -8 -123
7681a23j80M87ro1j44j50Q9J03Q1m46K77J5J45O2j08j05rL6J98J46k0l50O0N7
$$ -123 -303 184 175 114 -30 -180 -91 12 93 -353 -76 -61 84 146 38 -67 -76 -40 158 304 284 -66 -6 51
7705E1j28L29j45j30K14j35o4N7j54K50j33l27J97K9j7K69k17kL8N8l1J18m70
$$ 51 -77 252 107 -23 191 56 -8 49 -105 145 12 -315 -118 -89 -106 163 -54 -56 -18 40 9 127 -343
7728c43M34m68N69j16k34p7J23J88j21j29J36R2L1O5q2k56K84l76O52j66j50j36
$$ -343 91 -377 192 76 -158 -235 -112 76 -45 -174 -38 54 85 150 68 -188 96 -280 372 206 56 -80
7750h0L8kl6mK20j89R2l30J92o7N3L29k50l4J19J16l88K63j05J36k40K8j65N77
$$ -80 -42 -44 -80 -84 136 -53 39 -291 -99 -166 -113 216 -34 -68 51 167 -221 42 -63 73 -167 -139 -304 273
7774B73m20Q7K2j78K30Q5j47j5K65j66J65M2k20j95M25j10k20L57l38o9K54J33
$$ 273 -147 -60 -38 -216 14 99 -48 -63 202 36 201 243 23 -172 253 143 -77 280 -58 -127 127 260
7796B60l2k11J23Nj50m3K37l28K10j09n7l01J34M80m10L5J19O7j25j04J64jJ82
$$ 260 228 17 140 145 -5 -48 189 -139 71 -38 -95 -396 -262 218 -192 -157 -38 29 -96 -200 -36 -37 145
7819A45j00K13j94m91L70j5R4J58k21K0J10J24l78J22qj45N32k71J74k74M1J18
$$ 145 45 258 64 -427 -57 -72 22 180 -41 -21 89 213 -165 -43 -51 -196 336 65 239 -35 6 124
7841A24J41k88J44Jj81l70L0O70p4j85j71J40P1k93K36J00k33K36j58k1M30k88
$$ 124 265 -23 121 122 -59 -429 -399 271 197 12 -159 -19 52 -241 -5 95 -138 98 -60 -81 349 61
7863F1J64j38r4N7j93K03%j91N2J10j6j63j0J81j12K5K87l90K73k51K75Kl14J98
$$ 61 225 87 -7 50 -143 60 60 -131 -79 31 15 -148 -158 23 -89 -64 223 -167 106 -145 130 132 -182 16
7887A6J34k49J07q7j25L19j11l9Q9J70j02j97M7J38j95OK68k64O0j5K6N4J16P0
$$ 16 150 -99 8 -79 -204 115 4 -35 54 224 122 -75 -28 110 -85 -79 189 -75 -15 -30 -4 50 166 236
7911B36k97N8n3J97k65P0J51r1J20m1k03J85p4Ln6o7K76k47RK12J18l95N4J67
$$ 236 -61 -3 -56 141 -124 -54 97 6 126 85 -118 67 -7 -4 -60 -127 149 -98 -89 123 241 -154 -100 67
7935F7j32j17K78k59J6n1M6Q4J7O0m2J05J49k66k46K43p5L00k30K35k4J6m47K04
$$ 67 -65 -182 96 -163 -147 -198 -152 -68 -51 9 -33 72 221 -45 -291 -48 -123 177 -53 182 158 174 -273 -69
7959f9J67J70l86K91j8j67n5j71K17J19O4L8l81J60k42Q9N63l59K7j8k28K75l75
$$ -69 98 268 -118 173 155 -12 -67 -238 -21 98 162 200 -181 -21 -263 -174 389 30 57 39 -189 86 -289
7982b89L77j09j32JK31j49J46j28J31k43r1K51J30k56J73J25j28K41l57o7Q6J13
$$ -289 88 -21 -153 -152 79 -70 76 -52 79 -164 -255 -4 126 -130 43 168 40 281 -76 -143 -57 56
8004E6k09J23m3L96l30j7Q3Q3k39K79Lq5j74k65L63l9k04J7M41j98J07p6k84q2
$$ 56 -153 -30 -73 323 -7 -24 59 142 -97 182 185 100 -74 -339 24 -15 -219 -202 239 41 148 72 -212 -294
8028b94L69j36J10pl14Mj34M63K86m87r1M68k27K95l96J65j0O8P4j59j69j29R3
$$ -294 75 -61 49 42 -272 -268 -402 61 347 -140 -231 237 10 305 -91 74 64 132 206 47 -122 -251 -158
8051a58J24j00K86j93J65J59l07j8J97l47R0J59pj02J47o2j97J53Nl2k7o6J81
$$ -158 -34 -134 152 -41 124 283 -24 -42 155 -192 -102 57 50 -52 95 33 -164 -11 -6 -38 -65 -131 50
8074E0K5k13k6M43l01P5O9Q9k54J75j82lK2l31N26k54J38j82L84m61K58k71P6
$$ 50 75 -138 -164 279 -22 53 122 211 -43 132 -50 -53 -31 -362 164 -90 48 -134 250 -211 47 -224 -148
8097a48qK40j98J58q3mJ11q7R6P2k17K95nj20q8J14l1j01j66J80k7m6J14M4J48
$$ -148 -156 84 -114 44 -39 -43 68 -19 77 149 -68 227 222 102 14 128 97 -4 -170 10 -17 -63 51 95 243
8122B43k54p6J4j72L01J15l64J47l3j38K90j88r4J60J12j13J60q5qK12j91K42
$$ 243 -11 -87 -73 -245 56 171 -193 -46 -79 -217 73 -115 -209 -49 63 -50 110 25 17 229 38 280
8144B80o0l18K73j52K67m28K07J6k18M79l89K5m2K98k38R3P5n05L51n7r6o0L9
$$ 280 220 -98 175 23 290 -138 69 85 -133 346 -43 -18 -60 238 0 93 168 -337 14 -43 -139 -199 -160
8167a60P7j4M5j56J58J43j85J53o1L87k79M1k79J72O7k25J26j92L8M61k79l47
$$ -160 -83 -97 -52 -208 -50 93 -92 61 0 387 108 149 -130 42 109 -116 10 -182 -144 317 38 -309
8189c09K45m1
$$ -309 -64 -105
8191a05
$$ Imaginary data points
##PAGE= N=2
##DATA TABLE= (X++(I..I)), XYDATA
0@%%%%%%%Qj6J6j6K4l2L7m5N6o9P8r1J08j27J49j73K01k32K65l00L41l88M37m94
$$ 0 0 0 0 0 0 0 0 8 -8 8 -8 16 -16 21 -24 32 -37 41 -50 58 -69 80 -93 108 -124 141 -159 182 -206 231 -263
31b63N57o24O96p76Q66r62J069j186J315j458J614j787J979k193K433k704L010
$$ -263 294 -330 366 -410 456 -506 563 -623 692 -766 848 -939 1040 -1153 1280 -1424 1586
48A586l360L770m253M831n542O437p602R190j1495J5158k1888L8200j47748j92166
$$ 1586 -1774 1996 -2257 2574 -2968 3469 -4133 5057 -6438 8720 -13168 25032 -122716 -314882
62c14882K72238J6796j89426M9143J77357j34355j34407J44851R6448j33997j0848
$$ -314882 -42644 -25848 -215274 -166131 11226 -123129 -257536 -112685 -16237 -150234 -161082
73a61082J05774m6534p2682J07358M5262r8079J6666J10306l9703m6325J02868
$$ -161082 -55308 -101842 -174524 -67166 -21904 -119983 -103317 6989 -32714 -79039 23829
84B3829K5161j29449Q077J29962k1118q1638P1393M8384j00989k1401J13280J1100
$$ 23829 48990 -80459 -72382 57580 36462 -45176 26217 74601 -26388 -47789 65491 76591
96G6591q2107Q732L0006n5264k1145N2377m578m5995J1776Q444l2034J4723L0896
$$ 76591 -5516 3216 33222 -22042 -43187 9190 4612 -41383 -29607 -21163 -53197 -38474 -7578
109g578m6059l7311M5024J1071n0881J4051M2743m6931l9277O6777M3457m4969
$$ -7578 -53637 -90948 -45924 -34853 -85734 -71683 -28940 -75871 -115148 -48371 -4914 -49883
121d9883n033L8129k3681l0029M5649L1303k9903r32K5381j4923J310M5814N84
$$ -49883 -54916 -16787 -40468 -70497 -24848 6455 -23448 -24380 1001 -13922 -12612 33202 33786
134C3786l6932K2227K9237l6059q761M9400j3510n5771L0151N1786l3243k6099
$$ 33786 -3146 19081 48318 12259 3498 52898 39388 -16383 13768 65554 32311 6212
146F212M2030o218n2780K2672M6127l4454k9737L0827r673l9842L5633L9975m3854
$$ 6212 48242 42024 -10756 11916 58043 23589 -6148 24679 15006 -24836 10797 50772 6918
159F918k0466M6950j1717n0671L7200M1241n8848k7262O7328M801o3198K7080
$$ 6918 -13548 33402 21685 -28986 8214 49455 -9393 -36655 30673 35474 -27724 -644
171f44N4186n1817l6256P0971J8191p1962M811N4342l9320m0349O4396K6112o8528
$$ -644 53542 1725 -34531 36440 54631 -17331 -12520 41822 2502 -37847 26549 52661 -15867
184a5867k696N8094k7639m4623N2387K5766o9045r482O1873j7354n0357M2773
$$ -15867 -18563 39531 11892 -32731 19656 45422 -23623 -33105 28768 11414 -38943 3830
196C830L4569n8225j3385O4391o696n7553K5734L9492m4114j9690N6525L890n2019
$$ 3830 38399 -19826 -33211 31180 24484 -33069 -7335 32157 -11957 -31647 24878 28768 -23251
209b3251J3897M2297k6678j9663M1333M335m5166O491L5047j9344j9401L0736
$$ -23251 -9354 32943 6265 -13398 27935 32270 -12896 -6405 28642 9298 -10103 20633
221B0633M947l5365O624L0289j6513k1951K1003L624k8117L670K3143j5127j8868
$$ 20633 25580 -9785 -3161 27128 10615 -11336 9667 13291 -14826 -11156 11987 -3140 -22008
234b2008J5994O622j8591L899J6465j3341j4432J3537M332j2970N081J1702j0669
$$ -22008 -6014 608 -17983 -14084 2381 -10960 -25392 -11855 -7523 -20493 -15412 -3710 -14379
247a4379o330J5952K992r943P233R001j0976k376J5466K82j0749P946Q905j0338
$$ -14379 -20709 -4757 -1765 -11708 -4475 4526 -6450 -8826 6640 6922 -3827 4119 13024 2686
261B686J78J4824l674j1705Q854O796j2852p20J3733o902j3319J0022P341j4518
$$ 2686 2864 17688 14014 2309 11163 17959 5107 4387 18120 11218 -2101 7921 15262 744
275G44j398J3307p926j4556J1284P598j6175l266J4597n893j4583J1586R747j5973
$$ 744 -654 12653 4727 -9829 1455 9053 -7122 -10388 4209 -1684 -16267 -4681 5066 -10907
289a0907m140J6253l705j4398J0660J0961j5414m970J8284j325j5579R147J2933
$$ -10907 -15047 1206 -2499 -16897 -6237 4724 -10690 -15660 2624 1299 -14280 -5133 7800
302G800j3732p108J7014K312j5183N013J2993r511p472J4225K851j3993L631J1801
$$ 7800 -5932 -13040 3974 6286 -8897 -3884 9109 -402 -7874 6351 9202 -4791 -1160 10641
316A0641p947p289J2758L088j3002K941J2537p120q738J0489M507j2472r2J2509
$$ 10641 2694 -4595 8163 11251 -1751 1190 13727 6607 -2131 8358 12865 393 301 12810
330A2810m176j0290O667O290r109k780R253k073q845L322L977o997k528O793j715
$$ 12810 8634 -1656 5011 11301 2192 -588 8665 6592 -2253 1069 5046 -1951 -4479 2314 599
345E99o939L631L992o503k536O349o31o784L157M992m638l995N867K403m085J325
$$ 599 -6340 -2709 1283 -5220 -7756 -1407 -2038 -8822 -5665 -673 -5311 -9306 -3439 -1036 -5121 -3796
361c796N045j423l184K207K268j737M96L087j48q20J661l49p04J982J388k237
$$ -3796 1249 -174 -3358 -1151 1117 -620 -124 2963 2815 1995 3656 3307 2603 4585 5973 3736
377C736k93J538k077k825J485K035k004n98J901m84l314k34J216p43o05O96r02
$$ 3736 3443 4981 2904 79 1564 3599 1595 997 2898 2414 -900 -1134 82 -661 -1266 -570 -1472
394a472j634o9J86l41J644K241r03k161O98K46k743J20L681R64k710r1K473r29
$$ -1472 -3106 -3175 -2989 -3330 -1686 555 -348 -2509 -1811 -1565 -4308 -4188 -507 457 -2253 -2344 129 -800
412h00k222K319K986j277k120O94k09k195O2K318J472j99k42K65j266l19J199
$$ -800 -3022 -703 2283 1006 -1114 -420 -629 -2824 -2762 -444 1028 829 587 852 -414 -733 466
429D66L91N21O80k38j838m31J651J414L87J058Q41j453j769k5O09jO05J477m94
$$ 466 857 1378 2058 1820 -18 -449 1202 2616 3003 4061 4902 3449 1680 1655 2264 2263 2868 4345 3851
448C851j889q43k03R03J13K55K09o92j834k227m8J554P9j2J140J80k555j161J095
$$ 3851 1962 1119 916 1819 1932 2187 2396 1704 -130 -2357 -2405 -851 -772 -784 356 536 -2019 -3180 -2085
467b085l7o33R36J508k279j773R73O38n53R18K467j361k458J19j51j147N97J991
$$ -2085 -2122 -2755 -1819 -311 -2590 -4363 -3390 -2752 -3305 -2387 80 -1281 -3739 -3620 -3771 -4918 -4321 -2330
485b330J6j720P45K57j800nK973M21j482L28R32j794j188K314K516J87M84Q97
$$ -2330 -2314 -4034 -3289 -3032 -4832 -4837 -1864 -1443 -2925 -2597 -1665 -3459 -4647 -2333 183 370 854 1751
503A751n22j713P20J984N95L57P70o41j211j68J112R24m02J50N74r13k746m51
$$ 1751 1229 -484 236 2220 2815 3172 3942 3301 2090 1922 3034 3958 3556 3706 4280 3367 621 170
521A70R32n94j108J338P08k873j651K190l31k197K151K810l005k350K979J074
$$ 170 1102 508 -600 738 1446 -1427 -3078 -888 -1219 -3416 -1265 1545 -1460 -3810 -831 243
537B43k998K711N653k400l412M962K427m918J505P608j762n536N470M406p045
$$ 243 -2755 -44 5609 3209 -203 4759 7186 2268 3773 11381 9619 4083 9553 13959 6914
552F914j175R073k62q338M082O065q481m765Q911Q11j0174L072Q054q646p340
$$ 6914 5739 14812 14550 6212 10294 16359 7878 3113 12024 12835 2661 5733 13787 5141 -2199
567b199R340J689j1755J369J0720p280j0205R211M874j2225m10J3309m474j1882
$$ -2199 7141 8830 -2925 -1556 9164 1884 -8321 890 5764 -6461 -6871 6438 1964 -9918
581i918Q326P774j2108k679J4622j905j3476P195J0704j0719o142J4209J260j4107
$$ -9918 -1592 6182 -5926 -8605 6017 4112 -9364 -2169 8535 -2184 -8326 5883 7143 -6964
595f964M622J2146r467q599J2582K923j3389K145J2626p885j0619J0350N774j2758
$$ -6964 -2342 9804 337 -8262 4320 7243 -6146 -4001 8625 740 -9879 471 6245 -6513
609f513n19J1656m995j1131Q126O717j0530j832J0396l007r611N747O974q374
$$ -6513 -7032 4624 -371 -11502 -3376 3341 -7189 -9021 1375 -1632 -11243 -5496 1478 -6896
623f896l412Q284n39p197M259N474o190k471O116k62l629K698K845m635j007M536
$$ -6896 -10308 -2024 -2563 -9760 -5501 -27 -6217 -8688 -2572 -2834 -6463 -3765 -920 -5555 -6562 -2026
639b026n27j518K506L7k831K322K356k638J65L543l119k705N633J772o544J718
$$ -2026 -2553 -4071 -1565 -1528 -4359 -2037 319 -2319 -2154 1389 -1730 -4435 1198 2970 -3574 -1856
655a856N569m969m164Q903J539j0619J651R847o722p012J0998L660j4532J257
$$ -1856 3713 -1256 -5420 3483 5022 -5597 -3946 5901 -821 -7833 3165 6825 -7707 -6450
669f450J4395o474j1290J1950O338j6372l34J8447n449j5560J2357J0254j7456
$$ -6450 7945 1471 -9819 2131 8469 -7903 -8237 10210 4761 -10799 1558 11812 -5644
682e644l060K1940m211k0817J1605J5784j7547p457K2435j157k4242Q963K0886
$$ -5644 -8704 13236 9025 -11792 -187 15597 -1950 -9407 13028 11871 -12371 -3408 17478
695A7478j6207j3634K1799L027k5740N773K3853j4302j7987J9769P882k4509K498
$$ 17478 1271 -12363 9436 12463 -13277 -7504 16349 2047 -15940 3829 11711 -12798 -10300
708a0300K4733j1503k1198J8537J2319k2942j826K5219p829k3155J5845J7576
$$ -10300 14433 2930 -18268 269 12588 -10354 -12180 13039 5210 -17945 -2100 15476
720A5476k0678o850K3653l464k2651J2455J9336j7590j0521K0096J407k1341Q063
$$ 15476 -5202 -12052 11601 8137 -14514 -2059 17277 -313 -10834 9262 10669 -10672 -2609
733b609J9232j4609j3955J7240N249j8736L796J6872j1551j4015J4522P274j6003
$$ -2609 16623 2014 -11941 5299 10548 -8188 -4392 12480 929 -13086 1436 8710 -7293
746g293l9J4529p895j2116J1681P821j2278k643J1418l525q523P705O234q878
$$ -7293 -7332 7197 -698 -12814 -1133 6688 -5590 -8233 3185 -340 -8863 -1158 5076 -3802
760c802k193P996k009m539N497K964p155L07N565k715j662M564j604n432L658
$$ -3802 -5995 2001 -8 -4547 950 3914 -3241 -2934 2631 -84 -1746 2818 1214 -4218 -560
775e60L289m341p7M409m489m268P188K077p974J986O501p272m458J1233J397j2525
$$ -560 2729 -1612 -1689 2720 -1769 -6037 1151 3228 -4746 -2760 3741 -3531 -7989 3244 4641 -7884
791g884L154J0762p937p171J3374K584j5736K267J5045p627j0818J3330M578j6943
$$ -7884 -4730 6032 -1905 -9076 4298 6882 -8854 -6587 8458 831 -9987 3343 7921 -9022
805i022J307J7578p592j4377J2661P924j8181k06J9688p111j7948J2644J1683
$$ -9022 -7715 9863 2271 -12106 555 8479 -9702 -9908 9780 2669 -15279 -2635 9048
818I048j7848l530K0978m993k0365J1796J6299j6765p631K0740j304k1647J0582
$$ 9048 -8800 -12330 8648 3655 -16710 -4914 11385 -5380 -13011 7729 6425 -15222 -4640
831d640J9037j5540j1151J9415K655k0705P281K0075j3506j4665J8527O077k0041
$$ -4640 14397 -1143 -12294 7121 9776 -10929 -3648 16427 2921 -11744 6783 12860 -7181
844g181L492K0082j2051j6383J6813R357j8987o18J8773q614j6963J4535J1965
$$ -7181 -3689 16393 4342 -12041 4772 14129 -4858 -5476 13297 4683 -12280 2255 14220
857A4220j7612m742J7222l938j5471J0805J2172j4698o545J4973j58j2958P331
$$ 14220 -3392 -8134 9088 5150 -10321 484 12656 -2042 -8587 6386 6228 -6730 601
870F01J0561j2177o142J3190Q87j1085M923Q922r643n557J1996J600j0474K508
$$ 601 11162 -1015 -7157 6033 6920 -4165 758 9680 37 -5520 6476 8076 -2398 110
884A10P256o588l982R105Q84q467J715N359m154k060O625j153o427K439M041l743
$$ 110 7366 778 -3204 5901 6785 -1682 33 5392 1238 -822 5803 4650 -1777 662 4703 960
900I60n47M905l045m829M444L283m809l81M687m027l925N749K080o035K7M750
$$ 960 413 5318 2273 -2556 1888 5171 362 -19 4668 641 -3284 2465 4545 -1490 -1463 3287
916C287m412l038O935O99q207J418O133n065l530P835O14j0083K316Q710n159
$$ 3287 -1125 -4163 2772 3471 -4736 -3318 2815 -2250 -5780 2055 2669 -7414 -5098 3612 -1547
931a547n254Q626P55j0224K394J0714n313p597Q409L461j0330J775J0989m945
$$ -1547 -6801 1825 2580 -7644 -5250 5464 151 -7446 963 4424 -5906 -4131 6858 1913
945A913q948P765N029r958K03J0959m775j0020P826O793r970k283J1119l363j0631
$$ 1913 -7035 730 5759 -4199 -3996 6963 2188 -7832 -6 6787 -3183 -5466 5653 2290 -8341
960h341O775Q270q934m538R844r26r873N194Q856q016n009Q973J006r164L582
$$ -8341 -1566 6704 -2230 -6768 3076 2150 -7723 -2529 6327 -1689 -6698 2275 3281 -5883 -2301
975b301Q513o965n907Q684K587q673J768P905n451o020P860L305q128k82P326
$$ -2301 6212 -753 -6660 2024 4611 -4062 -2294 5611 160 -5860 2000 5305 -2823 -3105 4221
990D221k884o417O007L943p059j259O205j882n000M522K975n740j224N933j087
$$ 4221 1337 -5080 927 4870 -2189 -3448 2757 875 -4125 397 3372 -2368 -3592 2341 1254
1005A254m773L974K753m796j026N352q96l877K694K677m157p96M761r68l639J593
$$ 1254 -3519 455 3208 -1588 -2614 2738 1842 -2035 659 3336 -821 -1617 3144 2176 -1463 130
1021A30K917l185r48L205n06l198J461J725k468n29K820j100k643J774J642k514
$$ 130 3047 -138 -1086 2119 1613 -1585 -124 1601 -867 -1396 1424 324 -2319 -545 1097 -1417
1037a417n43K479r18k117J957J333j902m84K446j014j289J640J633k357m71K385
$$ -1417 -1960 519 -399 -2516 -559 774 -1128 -1612 834 -180 -1469 171 1804 -553 -1024 1361
1053A361n86j669J332J170j893k69K030o77k052J937Q08j913m60K013q45k063
$$ 1361 775 -894 438 1608 -285 -554 1476 799 -1253 684 1492 -421 -881 1132 287 -1776
1069a776J476J434j873o88J967J74j796O49J189r98o48J456M02j941J048J746
$$ -1776 -300 1134 -739 -1427 540 714 -1082 -433 756 -242 -890 566 968 -973 75 1821
1085A821j341l27R20K69j521O86J099j074o38J389l25j216M91Q22p95r14J130
$$ 1821 480 153 1073 1342 -179 507 1606 532 -106 1283 958 -258 233 1055 260 -654 476
1102D76J90j187J08O76l64q73O11M28r08J71Q36l39n38J054L22j045o6J218n92
$$ 476 666 -521 -413 263 -101 -974 -363 65 -843 -672 164 -175 -713 341 663 -382 -448 770 178
1121A78k99O10M64p15j00J226j93j104N25Q61r26p70Q36L50r32k65P41k14q97
$$ 178 -121 489 953 238 138 1364 1171 67 592 1453 527 -243 593 943 11 -254 487 273 -624
1140f24M57J75l88l66K99pn79N03O24j051N1Q76K82r81K71R13r9r04J125L07p80
$$ -624 -167 8 -380 -746 -447 -454 -1033 -530 94 -957 -906 -30 252 -729 -458 455 356 -548 577 884 104
1161A04R6J066l13p02k2J155o86p67O84n5o94m70N34N09j007K45K75o35J03J26
$$ 104 200 1266 953 251 229 1384 698 -69 615 560 -134 -604 -70 439 -568 -323 -48 -683 -580 -454
1181d54J62m83P4M36l86m19N94N81l25l57R69l95n55O40P49o40l81M49J042q77
$$ -454 -292 -775 -701 -265 -651 -1070 -476 105 -220 -577 392 -3 -558 82 831 191 -190 259 1301 424
1201D24l71N33K62q15j63J265m62q20k2O26p06m45P46L30j328J63O80k91q98J311
$$ 424 53 586 848 33 -130 1135 673 -147 -169 457 -249 -694 52 382 -946 -783 -103 -394 -1292 19
1221A9l98q20K72J413n60j417J067O45q57n45J819k34j389P44J098q85p10J114
$$ 19 -379 -1199 -927 486 -74 -1491 -424 221 -636 -1181 638 404 -985 -241 857 -28 -738 376
1239C76K62j812M73J833j049j181J486N01k248J14K338q96j709R90J439k057j70
$$ 376 638 -1174 -701 1132 83 -1098 388 889 -1359 -1245 1093 197 -1512 -522 917 -1140 -1310
1256a310K335l65k577J231J852j202j109J770M93k266M3K131K31j730N66P49j801
$$ -1310 1025 660 -1917 -686 1166 -36 -1145 625 1118 -1148 -1105 1026 1257 -473 93 842 -959
1273i59k52K412m5k325M45R18m67q01J627L52k598k27K086L61j421O46J143j657
$$ -959 -1211 1201 1156 -1169 -724 194 -273 -1074 553 905 -1693 -1920 166 527 -894 -248 895 -762
1291g62j036K168J265j640j089J994k27j408J296J516j788j895J856J639j872
$$ -762 -1798 370 1635 -5 -1094 900 673 -735 561 2077 289 -1606 250 1889 17
1306A7l35K020j341k108J530K393j977k118K024K07k448J165L559k944l178K587
$$ 17 -318 1702 361 -1747 -217 2176 199 -1919 105 312 -2136 -971 2588 -356 -3534 -947
1322i47J842k912k90M225j247m621K223M192k638k004L551K8m249K041N134k938
$$ -947 895 -2017 -2307 1918 671 -3950 -1727 2465 -173 -2177 1374 1402 -2847 -806 4328 1390
1338A390m151L627K041m084N38N408k839m980K912M124l975j663M967j548o256
$$ 1390 -2761 866 2907 -1177 -639 4769 1930 -3050 -138 3986 11 -1652 3315 1767 -4489
1353d489K885N374l632l790M440N92n923J814O032l078m894L819K647m838N24
$$ -4489 -1604 3770 138 -3652 788 1380 -4543 -2729 3303 225 -4669 -850 1797 -3041 -2517
1368b517N700k637n493L432M827l727j187M008r09n018K659N518k860l320L359
$$ -2517 3183 546 -4947 -1515 3312 -415 -1602 2406 1497 -3521 -862 4656 1796 -1524 1835
1383A835j72l463J937M553k629m271K100K327k491J60L420k060m301K017L282
$$ 1835 1663 -1800 137 4690 2061 -2210 -110 2217 -274 -114 3306 1246 -3055 -1038 2244
1398B244j580j303J335r19k106J460K845j073k628M51P10J1P52J374j024k141
$$ 2244 664 -639 696 -223 -2329 -869 1976 903 -1725 -1274 -564 -553 199 1573 549 -1592
1414a592m71J957J170q4p60n29q47l69J633J987j319k510N56J347m84J52K686
$$ -1592 -2063 -106 1064 980 220 -309 -1156 -1525 108 2095 776 -1734 -1178 169 -315 -163 2523
1431B523j782l748J628L740j593j480J987p57l739K162N186k376m192K695J418
$$ 2523 741 -3007 -1379 2361 768 -712 1275 518 -3221 -1059 4127 1751 -2441 254 1672
1446A672m362J800N395k610n849L355L605m433p6N337k650o735M449N703n092
$$ 1672 -2690 -890 4505 1895 -3954 -599 3006 -1427 -1503 3834 1184 -5551 -1102 4601 -491
1461d91k780N915r96p174L865P149n166n680N951K190o627J902P857n049o891
$$ -491 -3271 2644 1648 -5526 -1661 5488 322 -5358 593 2783 -3844 -1942 5915 866 -6025
1476f025N888M592o614K30P096l764p039N698N965o412k605O585j547o729M275
$$ -6025 -137 4455 -2159 -1929 5167 1403 -5636 62 6027 -385 -2990 3595 2048 -4681 -406
1491d06O558o480m491O749O57o593L017O099n424n286O326K836n755N55N357l536
$$ -406 6152 -328 -4819 1930 2587 -4006 -989 5110 -314 -5600 726 3562 -2193 -1638 3719 183
1507A83n040N332L637n093j168M488j669l895M188L641m867k324M711m86l117
$$ 183 -4857 475 4112 -981 -2149 2339 670 -3225 963 4604 -263 -2587 2124 1638 -1479
1522a479K683K113l947j519L134L95k666J017J999k855j090K774M61k450L22R45
$$ -1479 1204 3317 -630 -2149 985 1380 -1286 -269 1730 -1125 -2215 559 1020 -1430 -1108 -163
1538a63j374l24J912n1j723N87K73j00N67J131j030o17O45K44m63J955J09j917
$$ -163 -1537 -1861 51 0 -1723 -1136 -863 -963 -396 735 -295 -912 -267 -23 -486 1469 1578 -339
1556c39j5K160r04j420K373k5k488R3K945j095k542K348Q90l558N39L325j968
$$ -339 -354 1806 902 -518 1855 1830 -658 -565 2380 1285 -1257 1091 1981 -1577 -1038 2287 319
1573C19l021K630J575l919N39L918k107l614L125K536m492k0M756j435m642L200
$$ 319 -2702 -72 1503 -2416 -1877 2041 -66 -3680 -555 1981 -2511 -2531 2225 790 -3852 -652
1589f52L909m443j822N306n43m726K286M213l994k315M818L77m477J420M407l470
$$ -652 3257 -1186 -3008 2298 1755 -2971 -685 3528 -466 -2781 2037 2414 -2063 -643 3764 294
1605B94l675N090J562n660R35N377l548m106M374K442m880m14N411k260m271L704
$$ 294 -3381 1709 3271 -2389 -1454 3923 375 -3731 643 3085 -1795 -2209 3202 942 -3329 375
1621C75L041m503j317M801p49m496K696L215m008j595M351K06m058J342L081l101
$$ 375 3416 -1087 -2404 2397 1648 -2848 -152 3063 -945 -2540 1811 2017 -2041 -699 2382 -719
1637g19k019M062P62m543J566L007k575k267L368R66l023M99K256j523j780K530
$$ -719 -2738 1324 2086 -2457 -891 2116 -459 -2726 642 1608 -1415 -916 1340 -183 -1963 567
1653E67N25k008K0K272q03j826J995L54j497J20J893j029q54R76J65j260P98Q18
$$ 567 1092 -916 -896 1376 573 -1253 742 1096 -401 -281 1612 583 -271 705 870 -390 408 1226
1671A226r41p85Q91K05j284O50R42j128o44J233l3j348Q54O99j400O1J471l80
$$ 1226 285 -500 391 596 -688 -38 904 -224 -868 365 332 -1016 -162 537 -863 -802 669 289
1689B89j562R58Q26j422m2J633m49j726J686O77j564q1J904o97j618J489N55j391
$$ 289 -1273 -315 511 -911 -953 680 231 -1495 191 868 -696 -777 1127 430 -1188 301 856 -535
1707e35m2J475k20j802R45J397j604m97J517k0k191J228J371j306q96J748J17
$$ -535 -577 898 678 -1124 -179 1218 -386 -883 634 614 -1577 -349 1022 -284 -1180 568 685
1724F85j529O27J457j407r16J899J94j688O22J498j478j078J965K70k008M97J495
$$ 685 -844 -217 1240 -167 -1083 816 1010 -678 -56 1442 -36 -1114 851 1121 -887 -390 1105
1741A105n52j496J198N67j693K73J217n18j053J050J63p98k54J006l54j109J378
$$ 1105 553 -943 255 822 -871 -598 619 101 -952 98 261 -537 -791 215 -139 -1248 130
1758A30M54j499M77J271n12j287J364M14j168J6J355k62j143P40O26j077j24J149
$$ 130 584 -915 -438 833 321 -966 398 812 -356 -340 1015 753 -390 350 976 -101 -225 924
1776I24j52j028L35M44n30n82R35k82m70K99M76o60n42P02J72q07L02L11m13k39
$$ 924 772 -256 79 523 -7 -589 346 64 -406 -107 369 -291 -833 -131 41 -766 -464 -153 -566 -805
1796h05O99J28m57K39N59n44l68P53K05n22L91K29k72k73J26J33m24M86o4n98
$$ -805 -106 22 -435 -196 363 -181 -549 204 409 -113 278 507 235 -38 88 221 -203 283 219 -379
1816c79K62K03L1p95K61J90j35n14L06k21k95L26Q6k16J18N94m23j10K5O62l33
$$ -379 -117 86 117 -678 -417 -227 -362 -876 -570 -791 -1086 -760 -674 -890 -772 -178 -601 -711 -686 -24 -357
1837c57N7M69L12o42M2M90J43m58N60K5p4k7JL5k29J62J08k41l14L14l53q3K10
$$ -357 -300 169 481 -161 -119 371 514 56 616 641 567 540 541 576 347 509 617 376 62 376 23 -60 150
1860A50M9n06K28L1k19j66L53q3K4l53O37l56k01L58N9q9J58J18J23k46k6M31
$$ 150 199 -307 -79 -48 -267 -433 -80 -163 -139 -492 145 -211 -412 -54 5 -84 74 192 315 69 43 474
1882D74l65M00L13M1l03K27j31j41k43N30J86q06J47Q99o31p97Q27q4l28k06M75
$$ 474 109 509 822 863 560 787 656 515 272 802 988 182 329 1228 597 -200 627 543 215 9 484
1903D84p5n67M52K94k48n35M96M72r16J53K46k32j72L13K06m61j54O39k56n27
$$ 484 409 -158 294 588 340 -195 301 773 -143 10 256 24 -148 165 371 -90 -244 395 139 -388
1923c88O03K29p41j44O18k9o99J39M90j79j316J261M84q50J39M99n21j82K82O17
$$ -388 215 444 -297 -441 177 148 -551 -412 78 -101 -1417 -156 328 -522 -383 116 -405 -587 -305 312
1943C12m99j69L15jn13M22Q14p66p39P99M48j054L47Q75k88j034L04P17p42k24
$$ 312 -187 -356 -41 -42 -555 -133 681 -85 -824 -25 423 -631 -284 591 303 -731 -427 290 -452 -676
1963f76O03P5q05M75M46k44p78N52K59n31J74Q18l12p59L43Q03m89m83P20K35
$$ -676 -73 2 -803 -328 118 -126 -904 -352 -93 -624 -450 368 56 -703 -360 443 -46 -529 191 426
1983D26j038L4J041j91o45L95Q69j382L1J213j96j359J87J037n84l56J013N4j877
$$ 426 -612 -578 463 272 -373 22 891 -491 -460 753 557 -802 -615 422 -162 -518 495 549 -1328
2002a328J29J806n25o17M08M55j119m45J962k81j246O96P51r53l87J685P5j459
$$ -1328 -1199 607 82 -535 -127 328 -791 -1236 726 445 -801 -105 646 -307 -694 991 1066 -393
2020c93J3J331k04r63J176N25j790j81J491M2j222K97P81j474m92J606J33j168
$$ -393 -380 951 747 -216 960 1485 -305 -486 1005 1047 -175 122 903 -571 -1063 543 676 -492
2038d92l75Q48l71p75J154Q90j747p07J641L94j150J83Q49q30r04J454R88j072
$$ -492 -867 -19 -390 -1165 -11 879 -868 -1575 66 460 -690 -507 342 -488 -1392 62 1050 -22
2056b2o45R97k86k88O08Q89q84j044Q29P55q76N16M43n79j335J004Q38r10k80
$$ -22 -667 330 44 -244 364 1253 369 -675 154 909 33 549 992 413 -922 82 920 10 -270
2075b70Q76k45j167M74J483p49j658R10N50q60J41J292n99j629P79J486r43p19
$$ -270 606 361 -806 -332 1151 402 -1256 -346 204 -656 -515 777 178 -1451 -672 814 -129 -848
2093h48J401l31j223R4K085q56j693J434P82j920J75K454n54k695Q48J722r00
$$ -848 553 222 -1001 -907 1178 322 -1371 63 845 -1075 -900 1554 1000 -1695 -847 875 -25
2110b5q94J905k24k333M44K272m29k181J519J092k269k07L530r34k724J305J307
$$ -25 -919 986 762 -1571 -1127 1145 716 -1465 54 1146 -1123 -1330 2200 1266 -1458 -153 1154
2127A154j591n76K570O6l251O97K656j364j624K388K63l072L09K965m36k838J634
$$ 1154 -437 -1013 1557 1623 -1628 -931 1725 361 -1263 1125 1388 -1684 -1375 1590 1154 -1684 -50
2144e0J155k565K34K850n22l012J016J729j278o92J940K64k686L81K633r52j219
$$ -50 1105 -1460 -1226 1624 1102 -1910 -894 835 -443 -1135 805 1069 -1617 -1236 1397 445 -774
2161g74J501O91k688O73K399k74k214Q31J061j350k63J903j26j860K77J110n46
$$ -774 727 1418 -1270 -597 1802 1528 -686 145 1206 -144 -407 1496 1370 -490 -213 897 351
2178C51p85P65O35j837J31J570k01j025N36J39o20l21J126O57j019o49P65J52
$$ 351 -434 331 966 -871 -740 830 629 -396 140 279 -341 -662 464 1121 102 -547 218 370
2196C70n69M94M54n05j037Q94N21l85j54M03p4r99K61J241m62j072L10Q89p74
$$ 370 -199 295 749 244 -793 101 622 237 83 486 412 -587 -326 915 453 -619 -309 580 -194
2215a94o31J263J4j849K88J614n20j335J363M09j721K28K020k22k132Q04J160
$$ -194 -825 438 452 -1397 -1109 505 -15 -1350 13 422 -1299 -1071 949 727 -1405 -601 559
2232E59j311n93K494o8k713R09J845j321p23K025j69k911J043K241r92j790J789
$$ 559 -752 -1345 1149 1081 -1632 -723 1122 -199 -922 1103 934 -1977 -934 1307 315 -1475 314
2249C14O91k431o0K904j017k527J818J021j991l52L091j040k695J264J969j795
$$ 314 1005 -1426 -1486 1418 401 -2126 -308 713 -1278 -1630 1461 421 -2274 -1010 959 -836
2265h36p00K055J90k969J222K415j031j833J873P02k161M26K408j101k018J772
$$ -836 -1536 519 709 -2260 -1038 1377 346 -1487 386 1088 -1073 -647 1761 660 -1358 414
2281D14R08k017K74K352r17k114O30J773j255q22J788m26j526O19J965j035j431
$$ 414 1322 -695 -421 1931 1014 -1100 -470 1303 48 -774 1014 588 -938 -319 1646 611 -820
2298h20J178R9j322O73J278n47j463R76O14r31M18P50l55q37K81O07l63k57L20
$$ -820 358 457 -865 -192 1086 539 -924 52 666 -265 153 903 548 -289 -8 599 236 -21 299
2317B99k53k01Q9K83o4j48k00k43K87K08r4J04q3n49K10N82l6k85r2K92n21M66
$$ 299 46 -155 -66 217 153 5 -195 -438 -151 57 -37 67 -16 -565 -355 227 191 -94 -186 106 -415 51
2339E1L22L7p57lR28l08l67R09k90j119R2J075j78p33N58M85j308n4J318m64j506
$$ 51 373 410 -347 -350 578 270 -97 812 522 -597 -505 570 392 -341 217 702 -606 -660 658 194 -1312
2360a312R61R95j218o02J475r3j479K73J502r98o18J336l4j667N91J624p66r31
$$ -1312 -351 644 -574 -1176 299 206 -1273 -1000 502 -496 -1114 222 188 -1479 -888 736 -30 -961
2378i61J235L68j469L18J261o53j144J140R50j455lJ599n41j763R63J356j127
$$ -961 274 642 -827 -509 752 99 -1045 95 1045 -410 -413 1186 645 -1118 -155 1201 74
2395G4l81Q50j81j427Q93J227j293l71J323k28j406Q16J017j028m90R86J63q17
$$ 74 -307 543 362 -1065 -172 1055 -238 -609 714 486 -920 -104 913 -115 -605 381 544 -273
2413b73j4J029o84l59M37L50n83J29Q10o64n05O12M89r53J18O18k31o05M22L25
$$ -273 -287 742 58 -301 136 486 -97 32 842 178 -327 285 774 -179 -61 557 326 -279 143 468
2433D68o51q1O58j43m43M52j07k06m7M33l27l14M94K36o84M80K99m94j74M95j4
$$ 468 -183 -264 394 251 -192 260 153 -53 -100 333 6 -308 186 422 -262 218 517 23 -151 344 330
2454C30m02N7M23k82l09N67k9k40r4L57r3m82K67j30l01L08l8M9j65K47O4n10
$$ 330 -72 -15 408 126 -183 384 355 115 21 378 285 -197 70 -60 -361 -53 -91 -42 -207 40 104 -406
2476d06J58J49k1o2M4L92k66o2N30m33m51O31K27l97J54R6l41J52M24k78o2j98
$$ -406 -248 -99 -120 -182 -138 254 -12 -74 456 23 -428 203 430 33 187 283 -58 94 518 240 178 -20
2498b0M65k63l98N51j97p00L23J90J7m11L63R9k13j37K78L08p15L90J10j23l67
$$ -20 445 182 -216 335 138 -562 -239 -49 -32 -443 -80 19 -194 -331 -53 255 -460 -70 40 -83 -450
2519d50Q35j12m83J2Q30n26j47P0K29m13J82M48m31k73M52q6k24P6M11j57o96
$$ -450 385 273 -210 -198 632 106 -41 29 258 -155 27 475 44 -229 223 137 -87 -11 400 243 -453
2540d53K72M63m15j42N2K53o17M92k21L4L6J22P5j00q7J62J47n84L12K28N5l44
$$ -453 -181 282 -133 -275 -223 30 -587 -95 -316 -282 -246 -124 -49 -149 -236 -74 73 -511 -199 29 84 -260
2562b60K77n7k9J56K37k39l95L84N7n0L33m52j29O6k25O67k80j70L05l38k28K97
$$ -260 17 -40 -69 87 324 85 -310 74 131 81 414 -38 -167 -101 -326 341 61 -109 196 -142 -370 -73
2584g3J73m00J88J69k3n7L7M2nj00K82j41j34OM2L03k67p8L93n27J27L28k32j09
$$ -73 100 -300 -112 57 34 -23 14 56 51 -49 233 92 -42 -36 6 309 42 -36 357 -170 -43 285 53 -56
2608e6m8K70Mk58Qk6J32j96K44K20n87L53q8k8J28n9P2m0R4J86j0k93j94P10l76
$$ -56 -104 166 170 -88 -80 -106 26 -170 74 294 -293 60 -28 -56 72 13 85 45 139 325 315 22 -172 538 162
2633A62k02P28q2n13P5N03l70q0j62K55o87O06K02l65j49J17j04j53j94M05p4
$$ 162 -40 688 606 93 168 671 301 221 59 314 -373 233 435 70 -79 38 -66 -219 -413 -8 -82
2654h2m20q2M86O3l05p1L14j31k51O98k0l80j20N40k24k30N87k6p63j6P26m13
$$ -82 -502 -584 -98 -35 -340 -411 -97 -228 -479 219 199 -181 -301 239 15 -215 372 346 -417 -433 293 -120
2676a20p1L40J41j54l84N76l1k54j77N8j07l94M19K84n16J67L69j53o21M96L86
$$ -120 -191 149 290 136 -248 328 297 43 -134 -76 -183 -577 -158 126 -390 -223 146 -7 -628 -132 254
2697B54m56NM7L25m90K48O87m75l57L64L24p33J88L20J32p17O56K84k58p17M24
$$ 254 -202 -197 -150 175 -315 -67 620 145 -212 152 476 -257 -69 251 383 -334 322 606 348 -369 55
2718E5M67q48L05J84j45m11K50P43p46j46P47k32n07P3P66l31m59P95j47p36M51
$$ 55 522 -326 -21 163 18 -393 -143 600 -146 -292 455 223 -284 -211 555 224 -235 560 413 -323 128
2739A28M16j82n61L90M86o08KM12k32p11M18N10k46n45M18L42j008L67P83j15
$$ 128 544 362 -199 191 677 69 71 483 251 -460 -42 468 222 -323 95 437 -571 -204 579 464
2759D64r84O13N49q97o6N64j94p80K47J059m13q86J186L9j147K05J209l64o56
$$ 464 -520 93 642 -255 -321 243 49 -731 -484 575 162 -724 462 501 -646 -441 768 404 -252
2778b52MN95n44k90J109j63j357M48Q49m55o81P11K87r58K92R56k13j048K03P14
$$ -252 -248 347 -197 -487 622 459 -898 -450 399 -56 -737 -26 261 -697 -405 551 338 -710 -507 207
2798B07n78l87J076O3r99L20P02q85L8O65K46q06k57J077j02o49J51O00o17l53
$$ 207 -371 -758 318 381 -618 -298 404 -481 -443 222 468 -338 -595 482 380 -269 -118 482 -135 -488
2818d88R21J42j139K75R62q18l13K23N73r44J24L37J91n85J72J85j26p05J048
$$ -488 433 575 -564 -289 673 -145 -458 -235 338 -606 -482 -145 46 -539 -367 -182 -308 -1013 35
2837C5J88o02L5K68j1m48M17O28r21J0M92L57n97J35L99k08m30M72J82m22jO33
$$ 35 223 -379 -344 -76 -87 -535 -118 510 -411 -401 91 448 -149 -14 385 177 -253 219 401 -21 -22 611
2859F11l28o76K79R48n57p50R88j6p40J69M57k53n73L72L34n47j92O47r9q53N31
$$ 611 283 -393 -114 834 277 -473 515 499 -241 -72 385 132 -441 -69 265 -282 -474 173 74 -779 -248
2880b48O93m92o99J085Mr04J7J024r2j233R44O09j013k11Q75l67n39M49Q29q76
$$ -248 445 -47 -746 339 343 -561 -544 480 388 -845 99 708 -305 -516 359 -8 -547 -98 731 -145
2900a45m80J235O1r88k26J667j089p56J037P14j372R8Q89j82j012M82R61j143
$$ -145 -625 610 671 -317 -543 1124 35 -721 316 1030 -342 -244 645 463 -549 -67 894 -249
2918b49k29J096K15j230J71J002o33q69R47L42j115J00R10m18p06O98M94j148
$$ -249 -478 618 833 -397 -226 776 143 -726 221 563 -552 -452 458 40 -666 32 526 -622
2936f22j13Q13K4o88R6J056o56q08R22L59r31K49P32m14m58L56O08n73j47P47
$$ -622 -735 78 102 -586 -490 566 -90 -898 24 383 -548 -299 433 19 -439 -83 525 -48 -195 552
2956E52m58O4o5K98L1l21j01L80j91q3K17j6o52L52J56R6o10J31J13Q4k03L36
$$ 552 94 158 93 391 422 101 0 380 189 106 323 307 -345 7 163 259 -351 -220 -107 -23 -226 110
2978A10Q8o75L50J62O4l10j73M18Q4l32K72L08o06O5P82n07m16O14J27o08L28
$$ 110 198 -477 -127 35 99 -211 -384 34 118 -214 58 366 -240 -175 607 100 -316 298 425 -183 145
2999A45L07L3m43K25K15p00j40P86l21n98L16O61p57k15O94J21r93K20Q65n16
$$ 145 452 485 42 267 482 -218 -358 428 107 -491 -175 486 -271 -486 208 329 -664 -444 421 -95
3019i5l48O29J86p65j33J118nr16O83L48p96K01M77J01j100K69J180r99j54N71
$$ -95 -443 186 372 -393 -526 592 587 -329 354 702 -94 107 584 685 -415 -146 1034 35 -119 452
3039D52j55p80M67M87l50n86P16K64o87l60O99r5l47L08L82p41j99P71J18p33
$$ 452 297 -483 -16 471 121 -465 251 515 -172 -532 167 72 -275 33 415 -326 -525 246 364 -369
3059c69L83L13l31n48R19j6o13J26O81o33m1J43K92o65J83L57l15L4K50Q3m92
$$ -369 14 327 -4 -552 367 351 -262 -136 545 -88 -129 14 306 -359 -176 181 -134 -100 150 233 -259
3080b59J3J94j76q8M24l05j69P1J18j06k30O28l7l49L17l2O9j07m4p1J13r6J85
$$ -259 -246 -52 -228 -316 108 -197 -366 -295 -177 -283 -513 115 78 -271 46 14 83 -24 -68 -139 -26 -122 63
3103F3J75k55j84J27J6J11k01j01Q3J74q8m13M49j12j3j61j95K51R3K87l3k17
$$ 63 238 -17 -201 -74 -58 53 -148 -249 -166 8 -80 -493 -44 -156 -169 -330 -525 -274 -181 106 73 -144
3125a44m7M57m65p6j0L50k25P0L69k49j98M15J30m24P5M18j40k95K63M22l52m3
$$ -144 -191 266 -199 -275 -285 65 -160 -90 279 30 -168 247 377 -47 28 446 306 11 274 696 344 301
3147C01J6O8l00J1K56m05j6L22J33l81J71R9k67l98L22K14l06QL96j96o1K31o2
$$ 301 317 385 85 96 352 -53 -69 253 386 5 176 275 8 -390 -68 146 -160 -152 244 48 -13 218 156
3170A56l11J01M34l97k32K27M47m92k30K86M3k43L01k34N6J31l8j84l80Q02p6
$$ 156 -155 -54 380 -17 -249 -22 425 -67 -297 -11 32 -211 90 -144 -88 43 5 -179 -559 243 167
3191A67N5m41L72q4q4J14k48J41k28J80K03m59K40J93l67P0K01l4m7j46K49K47
$$ 167 222 -219 153 69 -15 99 -149 -8 -236 -56 147 -312 -72 121 -246 -176 25 -9 -56 -202 47 294
3213B94m99J46K42l61j06J72p2%L6k0O2N0j38k3j7m7L76m04K89jQ1j73J75l36
$$ 294 -205 -59 183 -178 -284 -112 -184 -184 -148 -168 -106 -56 -194 -217 -234 -281 95 -309 -20 -21 60 -113 62 -274
3237b74K30K31j84K31J08k5j29J62l79K6l6J21K50k80N1K53j96P1K6l10L86m66
$$ -274 -44 187 3 234 342 317 188 350 -29 -3 -39 82 332 52 103 356 160 231 257 -53 333 -133
3259a33L97l01k59K60J67l13J29J20q4q8N25q8k69j87K62j83J41k89J62K35n9
$$ -133 264 -37 -296 -36 131 -182 -53 67 -17 -105 420 332 63 -124 138 -45 96 -193 -31 204 145
3280A45j72K79l24K92n6K6M8k31Q5L7j73K53k32k72J30L19k52l1J04J32k79J72
$$ 145 -27 252 -72 220 164 190 238 7 92 129 -44 209 -23 -295 -165 154 -98 -129 -25 107 -172 0
3302@m5q0mJ03o2j97L16J8Qo14N75j18j8P4K73j98L4l25L64J2n23M37J54l68j5
$$ 0 -45 -125 -129 -26 -88 -285 31 49 57 -557 18 -100 -118 -44 229 31 65 -260 104 116 -407 30 184 -184 -199
3327a99L96l19n8j8K34j91k15N54j67n6k45M5K54j73j24M48o87J74K78m9n7J16
$$ -199 197 -122 -180 -198 36 -155 -370 184 17 -39 -284 -239 15 -158 -282 166 -521 -347 -69 -118 -175 -59
3349e9P2q5J70j00L10l42J87R6j4k63K53j47l00K27K52j98j89K67j64L69p10N68
$$ -59 13 -72 98 -2 308 -34 153 249 235 -28 225 78 -222 5 257 59 -130 137 -27 342 -368 200
3371B00l31j37K97o8L17m16Q2K54l28K44P8k6l95K25J45m3m08K86K48l17L49k22
$$ 200 -131 -268 29 -39 278 -138 -56 198 -130 114 192 166 -229 -4 141 98 -310 -24 224 -93 256 34
3393C4j19J6M27l27k58j43O47k41l09J37M27m06RR5J50l45k5J80n4k5J02K14k25
$$ 34 -85 -69 358 31 -227 -370 277 36 -273 -136 291 -115 -106 -11 139 -206 -231 -51 -105 -130 -28 186 -39
3416c9l36J46M17r1m36O44n14J07L80L40l96l25J72J03l24K65M50n39k40K82r
$$ -39 -375 -229 188 97 -339 305 -209 -102 278 618 222 -103 69 172 -152 113 563 24 -216 66 57
3437E7j43m8L60l75l77M14K11j71l36O70j77o83N39P75r47j34M47K21l25l2M12
$$ 57 -86 -134 226 -149 -526 -112 99 -72 -408 262 85 -598 -59 716 -231 -365 82 303 -22 -54 358
3458C58k69k44K08J10l86K85K57j08m22L43L01m80l9K21l15k22K26O37l05o25
$$ 358 89 -155 53 163 -223 62 319 211 -211 132 433 -47 -86 135 -180 -402 -176 461 156 -469
3478d69N91K2m95j42O61P8o51J82L37J07n36N86j17m46q0O20j19m88P12k00l92
$$ -469 122 144 -351 -493 168 246 -405 -223 114 221 -315 271 154 -292 -372 248 129 -359 353 153 -239
3499b39k14J116l37q33J81N02k45j69N71j21p47J78Q46l41m02M62k84m0m46Q75
$$ -239 -453 663 326 -507 -326 176 -69 -238 333 212 -535 -357 489 148 -254 208 -76 -116 -562 313
3519C13l14m10J84J68K04m07P09k05n93qM83r1k73M61N15j144K5O74L86j055M30
$$ 313 -1 -411 -227 -59 145 -262 447 242 -351 -359 124 33 -240 221 736 -408 -383 291 677 -378 52
3540E2J15m95k15R28j75l46m04O60o8k49J25M74j041P4R79m04l78K58K28j89m99
$$ 52 167 -328 -543 385 210 -136 -540 120 52 -197 -72 402 -639 -565 414 10 -368 -110 118 -71 -570
3561e70P21K44p76J32M08j43j81M21K12n68k28P48j02k88m6L06j93m27M63L11
$$ -570 151 395 -381 -249 159 16 -165 256 468 -100 -328 420 318 30 -16 290 97 -330 133 444
3581D44o67j0N26k24n18K19N97p71j11M34L09n17r2P86m35p07R00M12q20Q2L43
$$ 444 -223 -233 293 69 -449 -230 367 -404 -515 -81 228 -289 -381 405 -30 -737 163 575 -245 -163 180
3602A80n20O0L67N77n53k64L26j43k88K36L27m71j88O9O82q3p06N38j6o58O84
$$ 180 -340 -280 87 664 111 -153 173 30 -258 -22 305 -166 -354 -285 397 314 -392 146 130 -528 156
3623A56L63k57p53K56L54n66M97L68l30m71K83L25j10k20L76q6m87J37N60k6l23
$$ 156 519 262 -491 -235 119 -447 50 418 88 -383 -100 225 115 -105 271 185 -302 -165 395 369 46
3644D6J34J49m34l28R01k28o28K55N13m90l33O80J30m57k64N97j92l80N22j27
$$ 46 180 329 -105 -433 468 240 -388 -133 380 -110 -443 237 367 -90 -354 243 51 -329 193 66
3664F6L4l49N03J58m84J22L13n64j50L89N61q70J38M49m2l02K74L01n29j83N38
$$ 66 100 -249 254 412 -72 50 363 -201 -351 38 599 -271 -133 316 274 -28 246 547 18 -165 373
3685C73j72l56J02K88m00k95N90L12r08K22N47l02m77P74j62o48K18M21J09m62
$$ 373 201 -155 -53 235 -165 -460 130 442 -466 -244 303 1 -476 298 136 -512 -294 127 236 -226
3705b26M28L53p09j11P45l75k60M0J26L78p26Q75n06k95J5K89j42k57O27m4m49
$$ -226 202 555 -154 -265 480 105 -155 -115 11 389 -337 538 32 -263 -248 41 -101 -358 269 225 -224
3726b24k22N46j66JO3q2j54j46L36Q7n6l70L70j49l19N62j42j98K1M31j85J0j51
$$ -224 -446 100 -66 -65 -2 -84 -238 -384 -48 39 -17 -387 -17 -166 -485 77 -65 -263 -242 189 4 14 -137
3749a37Q0j17j26M10r0P3o7J07k09J31j36Q6K4J0jJ97k48j48L74rn66L60J57K16
$$ -137 -57 -174 -300 110 20 93 26 133 -76 55 -81 5 29 39 38 235 -13 -161 213 204 -362 -2 155 371
3773C71q18M26J72k4j76K66r0l7j99L81o6k90L39J13m12n1J20Q1k94J52J73j24
$$ 371 -447 -21 151 127 -49 217 127 90 -109 272 206 -84 255 368 -44 -95 25 106 -188 -36 137 13
3795A3o4M14j10l77J84O0P6k49R2J00j71J82p7k01k6J98K1k89K30J04N3l43M36
$$ 13 -51 363 253 -124 60 120 196 -53 39 139 -32 150 73 -128 -154 44 65 -224 6 110 163 -180 256
3818B56M4k26J14j31oKJ80j19m19J68j1K51j09l01J49j1j48M11L7l5K40m67M7
$$ 256 300 74 188 57 51 53 233 114 -305 -137 -148 103 -6 -307 -158 -169 -317 94 131 96 336 -131 -84
3841h4j30ML78m61K71k5O2l17M59l6j12K34k01q6k12N09j16j67l7J37j5j5K14
$$ -84 -214 -210 168 -293 -22 -47 15 -302 157 121 9 243 42 -44 -256 253 137 -30 -67 70 55 40 254
3864B54l69j00K43k35P5l7K68j83M7NJ78l82L55k21q8L66l50o2K43K00k2m12J6
$$ 254 -115 -215 28 -207 -132 -169 99 -84 -37 -32 146 -236 119 -102 -190 176 -174 -236 7 207 185 -227 -211
3887b11L18j54L73p4J72k99L4N1m4k23J08K35j78k00J83L2k48K03l8J65j64R1
$$ -211 107 -47 326 252 424 125 159 210 166 -57 51 286 108 -92 91 123 -125 78 40 205 41 132
3909A32j18M4o7l8j38L69j74j5J1n4j47K96m2K1k02J13j55P4K8j63K1K28K3J06
$$ 132 14 58 -9 -47 -185 184 10 -5 6 -48 -195 101 59 80 -122 -9 -164 -90 -62 -225 -204 24 47 153
3933A53R7j39o1j21j99J71J99r3J52j99j62M08l01K5K44k20k57K48L4n8j25M4
$$ 153 250 111 50 -71 -270 -99 100 7 159 -40 -202 206 -95 -70 174 -46 -303 -55 -21 -79 -204 -160
3955a60J84N7j23L40j76j80K84k47j59J79%q8K41k39K29m9j67k23K69j73j16L64
$$ -160 24 81 -42 298 122 -58 226 -21 -180 -1 -1 -89 152 -87 142 93 -74 -297 -28 -201 -317 47
3977D7K46m44L1L7k5J20k36K63k01O3Q5k38O02j71k67m9K62J61kk77J64k87j25
$$ 47 293 -151 -120 -83 -108 12 -224 39 -162 -99 -14 -252 350 179 -88 -137 125 286 284 7 171 -116 -241
4000b41K91R2j09L19l25J55M6j79M27n90Q2R7NRj90k35K67j83J65K04l24K56l19
$$ -241 50 142 33 352 27 182 228 49 476 -114 -32 65 70 79 -111 -346 -79 -262 -97 107 -217 39 -280
4023b80L35j95l6J16M2l02n8L64J59j81j81K04L81l92M8J63l4k25K20J06k60J84
$$ -280 55 -140 -176 -60 -18 -320 -378 -14 145 -36 -217 -13 368 -24 24 187 153 -72 148 254 -6 178
4045A78J4k87J71n5j14J81k49K90j9k01J16J19k53J7j41M32n25K10K73J84l39
$$ 178 192 -95 76 21 -93 88 -161 129 110 -91 25 144 -109 -92 -233 199 -326 -116 157 341 2
4066Bl6K79l34K92j04pn3p1J64j04K8MJ67l49J67L11m22j45K56O5l42J45J8M8
$$ 2 -34 245 -89 203 99 92 39 -32 132 28 56 60 227 -122 45 356 -66 -211 45 110 -232 -87 -69 -21
4090b1k3j81M3m3J97Q5k60K6K35J16l40K20j28M14k75K8q2J05l16K78P4j56j42
$$ -21 -44 -225 -182 -225 -28 57 -203 -177 58 174 -166 54 -74 340 65 93 11 116 -200 78 152 -4 -146
4113a46K89k6l57Q1K49J24l7k97M27m00j97L46P6l53K38J02m07L77j34K48m40
$$ -146 143 117 -240 -159 90 214 177 -120 307 -93 -290 56 132 -221 17 119 -288 89 -45 203 -237
4134b37K73J49j37k39K63J81l78k2o0P4k7J59J43o8R8lP2m5j98K65l25m9J04P1
$$ -237 36 185 48 -191 72 253 -125 -147 -207 -133 -160 -1 142 74 172 169 241 196 -2 263 -62 -111 -7 64
4158F4k15J9j97M54j30j39J06pj47M10M4l87o2K39L7k1m1j21K37n31P46k49k75
$$ 64 -151 -132 -329 125 -5 -144 -38 -45 -192 218 262 -125 -187 52 89 68 27 -94 143 -388 358 109 -166
4181a66J75J24m5l17L36j20K91o63Q28m08m08L86j39M43o51L59K9m53KN00J35
$$ -166 9 133 88 -229 107 -13 278 -385 443 35 -373 13 -126 317 -334 25 54 -399 -397 103 238
4202B38m98L20j89l3J43L67k10m18L31K92n92L0K87J26l23M4K31J29n82L9M44
$$ 238 -260 60 -129 -162 -19 348 138 -280 51 343 -249 -219 68 194 -129 -85 146 275 -307 -268 176
4223A76J70n44M99j63o19M34K02j38k51L1J32j9j54N90k28L7l24L66p9j84L69
$$ 176 346 -198 301 138 -481 -47 155 17 -234 -203 -71 -90 -244 346 118 155 -169 197 118 -66 303
4244C03M4n96L27M39o81j34L59K93l04k11M57l15J6K88l11j85q5J69L14m65JK04
$$ 303 347 -249 78 517 -164 -298 61 354 50 -161 296 -19 -3 285 -26 -211 -296 -127 187 -278 -277 -73
4266g3j55q2M58p1m10L19J49j04k41J68M08n46q0K74M31n49k9J82J39k24N2J63
$$ -73 -228 -310 148 77 -333 -14 135 31 -210 -42 366 -180 -260 14 445 -104 -133 49 188 -36 16 179
4288A79r6k22M69j35r9P8j5j13l01L14K40j86k69J45j90K50Q3j85K9k16J66K26
$$ 179 83 -139 330 195 96 174 159 46 -255 59 299 113 -156 -11 -201 49 132 -53 -24 -240 -74 152
4310A52l80N12r9k40NJ71K6j5k53O5M91o86K00K83l35k7L31k2k78L22K51k87l14
$$ 152 -228 284 185 -55 -50 121 147 132 -121 -56 435 -251 -51 232 -103 -130 201 179 -99 223 474 187 -127
4333a27o8M17n09m7N21k06r2K31m5K4k83l1K72M6QK78o6l03M1K61l16n3L21l43
$$ -127 -195 222 -287 -334 187 -19 -111 120 75 99 -184 -215 57 103 111 389 323 20 61 322 6 -47 274 -69
4357f9J26j41K38o8k9K77l55j12K14Qj72j30J88K44m63K36l4k55j37K48K77j23
$$ -69 57 -84 154 86 57 334 -21 -133 81 89 -83 -213 -25 219 -244 -8 -42 -297 -434 -186 91 -32
4379c2j3N0J22k44l53M79o8J72j83J94j74k24K70k36L0p2O88n06PL95l76l0n2
$$ -32 -45 5 127 -117 -470 9 -59 113 -70 124 -50 -274 -4 -240 -210 -282 406 -100 -93 302 -74 -104 -156
4402a56L80k90J10j33J52k89K55K10m7k36P7K63o65M45J25l12J22r0J84q9O1l68
$$ -156 224 -66 44 -89 63 -226 29 239 192 -44 33 296 -369 76 201 -111 11 -79 105 16 77 -291
4424b91N75n8j1q4Nj31K3J93l4m52M11J30m90L62j10k36p2O4L88N5m42Q7K2J83
$$ -291 284 226 215 131 136 5 28 221 187 -265 146 276 -214 148 38 -198 -270 -206 182 237 -205 -118 -96 87
4448H7j76K22l03j92N99j81P3l93L28k60J6K72K50o95K06L51o0k83L20N1k16L1
$$ 87 -89 133 -170 -362 237 56 129 -264 64 -196 -180 92 342 -353 -147 204 144 -139 181 232 16 47
4470D7L4J35l47l0M7j58O4L95j45O1l39J03R4K30k72J78j53J40j05K93n30J41
$$ 47 81 216 -131 -161 -114 -272 -208 187 42 103 -236 -133 -39 191 -81 97 -56 84 -21 272 -258 -117
4492a17k7J35L3j39M49k40M7j31K8P8J36k40M07l70j12j22K15j9p6j6k19m4J97
$$ -117 -144 -9 24 -115 334 94 141 10 38 116 252 12 419 49 -63 -185 30 11 -65 -81 -300 -344 -147
4515a47J86j15k17O61l37k22K73J13k08J13j93J54j93Q3K6J03k12J7M25k50qj43
$$ -147 39 -76 -293 368 31 -191 82 195 -13 100 -93 61 -132 -49 -23 80 -132 -115 310 60 52 -91
4537i1K53j24K04rM9m40J84J88k00r3R9k41K10j15J3K23m24M51k77J12j52L07
$$ -91 162 38 242 233 282 -158 26 214 14 -79 20 -221 -11 -126 -113 110 -314 137 -140 -28 -180 127
4559A27k72pm1n8K12l00L54k0R2M5Jl61K01J07k60J19J62r0n1J46J14J26l97K44
$$ 127 -145 -152 -193 -251 -39 -339 15 -5 87 132 133 -228 -27 80 -180 -61 101 11 -40 106 220 346 -51 193
4583A93j85J6o5K39J03j32l03L8J95n0k5K88l01L5j5J36l20L95k21j29M5J78k01
$$ 193 8 24 -41 198 301 169 -134 -96 99 49 24 312 11 46 31 167 -153 242 21 -108 -63 115 -86
4606h6K72j91m3L29k01J73K7l71jj6J72K31l48q6J46r2K66o6k52J16k93J99R9
$$ -86 186 -5 -48 281 80 253 280 -91 -92 -108 64 295 -53 -139 7 -85 181 115 -137 -21 -314 -115 -16
4629a6K89l49J32k35K80m24L95j0l7j92K56K8p4j7l3J46N6j19j47p0K75K13k99
$$ -16 273 -76 56 -179 101 -323 72 62 25 -167 89 117 43 26 -7 139 195 76 -71 -141 134 347 48
4652D8k80L86j47n5J66J23j30n58M16J98k05K39j53j3k35K48j94J14K0J73k30
$$ 48 -232 154 7 -48 118 241 111 -447 -31 167 -38 201 48 35 -200 48 -146 -32 -12 161 -69
4673f9K00Mm48M27p9P3k31J34K73j94k10J24R3n1J47K73m75J08k57J73k93L55
$$ -69 131 135 -313 114 35 108 -123 11 284 90 -120 4 97 46 193 466 -9 99 -158 15 -278 77
4695G7j60J55j37K55j19k95M6J1M08l67J84K44n69J55l6N5K35m4l2r4J16K67k85
$$ 77 -83 72 -65 190 71 -224 -178 -167 241 -126 58 302 -267 -112 -148 -93 142 98 66 -28 88 355 70
4718G0m79N35J67j45r0R7J13l78J50j01j5O5J89j56J0K26m40K37o2K0J95m79J84
$$ 70 -409 126 293 148 58 155 268 -110 40 -61 -76 -11 178 22 32 258 -182 55 -7 13 208 -271 -87
4741h7J04j26M5k4L91l18N2j43n8J26m9M7j49j3K29M3J17j28J14k99J12K41Q2
$$ -87 17 -109 -64 -88 303 -15 37 -106 -164 -38 -87 -40 -189 -202 27 70 187 59 173 -126 -14 227 309
4764C09k72oq8J76Q7j21M2j57J37n7Pj12K3P1j35l6J46p9K23j31J78j78n3j94
$$ 309 37 31 -57 119 206 85 127 -30 107 50 57 -55 -32 39 -96 -132 14 -65 158 27 205 27 -26 -220
4788b20M98k19K5j26L79k44rj22J80j23j08j19J52k8P3L01o82K51N6L30n79N46
$$ -220 278 59 84 -42 337 93 84 -38 142 19 -89 -208 -56 -84 -11 290 -392 -141 -85 245 -334 212
4810B12l15l1j2J83K32k33l00L24M4j26J02K04l12j38K0R8k6L38O1nk33j0k58
$$ 212 -103 -134 -146 37 269 36 -264 60 104 -22 80 284 -28 -166 -146 -48 -74 264 325 320 87 77 -181
4833a81R2K28o3J58k02J47l32J83OK90j98m60L71k9j45k0K65j92q9J57R4n7k67
$$ -181 -89 139 76 234 32 179 -153 30 36 326 128 -332 39 10 -135 -155 110 -82 -171 -14 80 23 -244
4856b44L48o7j71O8L30K1o20N70K94o71K90j91L09l74M7L15l57O0R7K25l88l0
$$ -244 104 37 -134 -66 264 285 -335 235 529 -142 148 -43 266 -108 -61 254 -103 -43 54 279 -109 -139
4878a39J53Q1p9M4j53r8K2J12K99n47J35K88K4j64K16k47J13M6K23j59k93m2M90
$$ -139 14 95 16 60 -93 -191 -169 -57 242 -305 -170 118 142 -22 194 -53 60 106 329 170 -123 -165 325
4901C25r8l52K01J01j99j98K82j2k37L5L95m51O6P2K40k74rK96k85LJ9J1j17N1
$$ 325 227 -125 76 177 -22 -220 62 50 -187 -152 243 -208 -142 -70 170 -104 -113 183 -102 -99 -80 -69 -186 -135
4925a35K28j33l60L94L28j51j90J13n7k84P2K93k08L52o2k00O3k18J02p8n3r6
$$ -135 93 -40 -400 -6 322 171 -19 94 37 -247 -175 118 -90 262 200 0 63 -155 -53 -131 -184 -280
4947b80M45o50N36J32k00m5j1M08n99j61L02L51k59j8J28j75O7M0J71l38N3K02
$$ -280 165 -485 51 183 -17 -62 -73 335 -264 -425 -123 228 -31 -49 79 -96 -29 11 182 -156 -103 99
4969I9J55k63JL49m58o4J59N12n82L33n5j02j84K21K41l50J23J22O3m57K97p4
$$ 99 254 -9 -8 341 -117 -181 -22 490 -92 241 186 84 -100 121 362 12 135 257 320 -137 160 86
4991H6j4j71k30M17k60K42J23l26k25R3N44m63N9K98J4p7n83N91J49n49L70k86
$$ 86 72 -99 -329 88 -172 70 193 -133 -358 -265 279 -184 -125 173 187 110 -473 118 267 -282 88 -198
5013a98j40O7M53m5j48J16j38j72m0m3J60N7l12L87K59k67J3K00q8j0j01q5K83
$$ -198 -338 -271 182 137 -11 105 -33 -205 -245 -288 -128 -71 -383 4 263 -4 9 209 121 111 10 -75 208
5036B08k37M43m24r9J82M1m79K40J48J11j10K07r3r2m54O72j09k22L0j37L07j09
$$ 208 -29 414 -10 -109 73 114 -365 -125 23 134 24 231 138 46 -408 264 155 -67 -37 -174 133 24
5058B4r4Q2j54P8Q9k27J0p4P9J94j38J16J94j56j66K55k42l24L65J59j02q9L67
$$ 24 -70 12 -142 -64 25 -202 -192 -266 -187 7 -131 -15 179 23 -143 112 -130 -454 -89 70 -32 -121 246
5081B46j22j80Q5pk43J99L20k67l19Q2K20ml16K37r4J18M4K18j21l3J5j13k04
$$ 246 124 -56 29 22 -221 -22 298 31 -288 -206 14 10 -306 -69 -163 -45 -1 217 96 63 78 -35 -239
5104b39J19L90j64k18k59N16n1j94K30J00j83L8Mj41P2j50L25m14M00n4L9k43
$$ -239 -120 270 106 -112 -371 145 94 -100 130 230 47 85 89 -52 20 -130 195 -219 181 127 166 -77
5126g7j53L9N17k45j98M71n17p4M30R9k17j83j49L08j01J42Q0j66J47m65L32j54
$$ -77 -230 -191 326 81 -117 354 -163 -237 193 292 75 -108 -257 51 -50 92 172 6 153 -312 20 -134
5148a34K76K44n97M94l50K70l4l27J91Q0k25J56j60K10k5k24J8m9J70L2k99L70
$$ -134 142 386 -211 283 -67 203 169 -158 33 113 -112 44 -116 94 69 -155 -137 -186 -16 16 -283 87
5170H7k61K01J24j95K43j12j00J84j18j0j54R9K37m50K21J6J04rk56L27l18J53
$$ 87 -174 27 151 -44 199 87 -13 171 53 43 -111 -12 225 -225 -4 12 116 107 -149 178 -140 13
5192A3j2K43j97M4k71K90K44m02r3jl8K10L7l57L20P2n6j15P4k91K67L99n24P5
$$ 13 1 244 47 91 -180 110 354 -48 -141 -142 -180 30 67 -290 30 102 46 -69 5 -286 -19 380 -144 -69
5216f9J31j23J99k81K25M8K6j03J43j10n09O42l34J33p2Rj63j85L94k96L65j37
$$ -69 62 -61 138 -143 82 130 156 53 196 86 -423 219 -115 18 -54 -45 -208 -393 1 -295 70 -67
5238f7k00L16j37J04K48j58P8l61n5Q3K13l2r5n1j18J52J60J81k91Q1O8k07l6
$$ -67 -267 49 -88 16 264 106 184 -177 -232 -149 64 32 -63 -114 -232 -80 80 261 -30 51 119 -88 -124
5261a24p8K83qN5k80o4J01J27J04l77J35m4K28j18j03N2L07l68K15q7J08j29J4
$$ -124 -202 81 73 128 -152 -216 -115 12 116 -261 -126 -170 58 -60 -163 -111 196 -172 43 -44 64 -65 -51
5284e1PJ87m7O1j69l65M90Q7J2j63l87K53N0j87M50k34j20K03K9j93J34Rm1j00
$$ -51 -44 143 96 157 -12 -377 113 200 212 49 -338 -85 -35 -222 228 -6 -126 77 106 -87 47 56 15 -85
5308h5k5K65K2j61K0M9n3l9k10K05j43O32l47o2j14r7J68j29K17l06J15J39J07
$$ -85 -110 155 177 16 36 85 32 -7 -217 -12 -155 477 130 68 -46 -143 25 -104 113 -193 -78 61 168
5331A68j04m2K14k59O2j67J89k2N1l55L79q1Qk96N49k08J85l29L72l21j79p4L68
$$ 168 64 22 236 -23 39 -128 61 39 90 -265 114 33 41 -255 294 86 271 -58 314 -7 -186 -260 108
5354A08l08P5Q2J76r9j19k18M87m54N43j3k33Kj71L57j96n2K36o5p8R4k26K63
$$ 108 -200 -125 -43 133 34 -85 -303 184 -270 273 260 27 29 -142 215 19 -33 203 138 60 154 -72 191
5377A91j12j3N0l34j11K51J44k41J96l3L1L87n65LKl4L66l46K07R2J22j87Ml37
$$ 191 79 66 116 -218 -329 -78 66 -175 21 -12 19 406 -159 -156 -154 -188 178 -168 39 131 253 66 70 -267
5401b67Q6J22L32l92J57N1k2P2j73j43J36N5K1K4O2q0N1P8N9m06M30n33M08l97
$$ -267 -181 -59 273 -119 38 89 67 139 -34 -177 -41 14 35 59 121 41 92 170 229 -177 253 -280 128 -269
5425b69K8L49nl09J93J94k0o5k16J86r7NmL32p3j64J63L4p0j62L3r5j7K01l4J33
$$ -269 -241 108 103 -206 -13 181 161 96 -120 66 -31 -26 -30 302 229 65 228 262 192 30 63 -32 -49 152 118 251
5451B51N4j98j81L71n19R0J06k6J4J55r2j32J22j52J08L82m76L78j92K41l38j41
$$ 251 305 107 -74 297 -222 -132 -26 -52 -38 117 25 -107 15 -137 -29 353 -123 255 63 304 -34 -175
5473a75O00l34O8l69J0K73p6J7J72j53n0K9K18l37L73k17J39j47k5j67J10Rp0
$$ -175 425 91 159 -210 -200 73 -3 14 186 33 -17 12 230 -107 266 49 188 41 16 -151 -41 -32 -102
$$ [...]
8191A70
##END NTUPLES=NMR FID
##END=
