##TITLE=1H_KB 1211
 CDCl3, 8 sc, 
 12.11.2019
##JCAMPDX= 6.0         $$ Bruker NMR JCAMP-DX V2.0
##DATA TYPE= NMR FID
##DATA CLASS= NTUPLES
##ORIGIN= UXNMR, Bruker Analytische Messtechnik GmbH
##OWNER= root
$$ XWIN-NMR		Version 3.5
$$ Tue Nov 12 14:01:35 2019 Russian Standard Time (UT+4h)  she@DPX200
##.OBSERVE FREQUENCY= 200.1315
##.OBSERVE NUCLEUS= ^1H
##.DELAY= (6, 6)
##.ACQUISITION MODE= SIMULTANEOUS
##.ACQUISITION SCHEME= undefined
##.AVERAGES= 8
##.DIGITISER RES= 18
##SPECTROMETER/DATA SYSTEM= spect
##.PULSE SEQUENCE= zg30
##.SOLVENT NAME= CDCl3
##.SHIFT REFERENCE= (INTERNAL, CDCl3, 0, 15.7039)
##AUDIT TRAIL= $$ (NUMBER, WHEN, WHO, WHERE, WHAT)
$$ ##TITLE= Audit trail, XWIN-NMR		Version 3.5
$$ ##JCAMPDX= 5.01
$$ ##ORIGIN= Bruker BioSpin GmbH
$$ ##OWNER= she
$$ F:/spectra/data/she/nmr/H-F/1/audita.txt
$$ ##AUDIT TRAIL=  $$ (NUMBER, WHEN, WHO, WHERE, WHAT)
(   1,<2019-11-12 14:00:40.70 +0400>,<she>,<DPX200>,
      <created by zg, POWCHK disabled, PULCHK disabled
       configuration hash MD5:
       00 E9 B6 7A A2 85 ED C7 34 08 36 98 17 FE 4E 26
       data hash MD5: 16K
       19 0D A9 4B 9E 21 E7 16 79 76 18 AF D4 02 EC 3C>)
$$ ##END=
$$ 
$$ hash MD5
$$ B8 30 D4 B3 BB 5F 2D 42 B8 40 F0 F0 41 88 89 ED
##$RELAX= 
##$RELAX= 
##$RELAX= 
##$RELAX= 
##$RELAX= 
##$RELAX= 
$$ Bruker specific parameters
$$ --------------------------
##$DU= <F:/spectra>
##$EXPNO= 1
##$NAME= <H-F>
##$PROCNO= 1
##$TYPE= <nmr>
##$USER= <she>
##$AMP= (0..31)
100 100 100 100 100 100 100 100 100 100 100 100 100 100 100 100 100 100 
100 100 100 100 100 100 100 100 100 100 100 100 100 100 
##$AQSEQ= 0
##$AQ_mod= 1
##$AUNM= <au_zg>
##$AUTOPOS= <>
##$BF1= 200.13
##$BF2= 200.13
##$BF3= 200.13
##$BF4= 200.13
##$BF5= 200.13
##$BF6= 200.13
##$BF7= 200.13
##$BF8= 200.13
##$BYTORDA= 1
##$CFDGTYP= 0
##$CFRGTYP= 5
##$CHEMSTR= <none>
##$CNST= (0..31)
1 1 145 1 1 1 1 1 1 1 1 1 1 1 1 1 1 1 1 1 1 1 1 1 1 1 1 1 1 1 1 1 
##$CPDPRG= <>
##$CPDPRG1= <>
##$CPDPRG2= <>
##$CPDPRG3= <>
##$CPDPRG4= <mlev>
##$CPDPRG5= <mlev>
##$CPDPRG6= <mlev>
##$CPDPRG7= <mlev>
##$CPDPRG8= <mlev>
##$CPDPRGB= <>
##$CPDPRGT= <>
##$D= (0..31)
0 1.2 0 0 0 0 0 0 0 0.06 0 0.03 0 0 0 0 0.0002 0 0 0 0 0 0 0 0 0 0 0 0 
0 0 0 
##$DATE= 1573552840
##$DBL= (0..7)
120 120 120 120 120 120 120 120 
##$DBP= (0..7)
150 150 150 150 150 150 150 150 
##$DBP07= 0
##$DBPNAM0= <>
##$DBPNAM1= <>
##$DBPNAM2= <>
##$DBPNAM3= <>
##$DBPNAM4= <>
##$DBPNAM5= <>
##$DBPNAM6= <>
##$DBPNAM7= <>
##$DBPOAL= (0..7)
0.5 0.5 0.5 0.5 0.5 0.5 0.5 0.5 
##$DBPOFFS= (0..7)
0 0 0 0 0 0 0 0 
##$DE= 6
##$DECBNUC= <off>
##$DECIM= 24
##$DECNUC= <off>
##$DECSTAT= 4
##$DIGMOD= 1
##$DIGTYP= 9
##$DL= (0..7)
0 120 120 120 120 120 120 120 
##$DP= (0..7)
150 150 150 150 150 150 150 150 
##$DP07= 0
##$DPNAME0= <>
##$DPNAME1= <>
##$DPNAME2= <>
##$DPNAME3= <>
##$DPNAME4= <>
##$DPNAME5= <>
##$DPNAME6= <>
##$DPNAME7= <>
##$DPOAL= (0..7)
0.5 0.5 0.5 0.5 0.5 0.5 0.5 0.5 
##$DPOFFS= (0..7)
0 0 0 0 0 0 0 0 
##$DQDMODE= 0
##$DR= 18
##$DS= 0
##$DSLIST= <SSSSSSSSSSSSSSS>
$$ [...]
##$SUBNAM2= <"">
##$SUBNAM3= <"">
##$SUBNAM4= <"">
##$SUBNAM5= <"">
##$SUBNAM6= <"">
##$SUBNAM7= <"">
##$SUBNAM8= <"">
##$SUBNAM9= <"">
##$SW= 24.0689530833862
##$SWIBOX= (0..15)
0 0 2 0 0 0 0 0 0 0 0 0 0 0 0 0 
##$SW_h= 4816.95568400771
##$TD= 16384
##$TD0= 1
##$TE= 0
##$TE2= 300
##$TE3= 300
##$TEG= 300
##$TL= (0..7)
0 120 120 120 120 120 120 120 
##$TP= (0..7)
150 150 150 150 150 150 150 150 
##$TP07= 0
##$TPNAME0= <>
##$TPNAME1= <>
##$TPNAME2= <>
##$TPNAME3= <>
##$TPNAME4= <>
##$TPNAME5= <>
##$TPNAME6= <>
##$TPNAME7= <>
##$TPOAL= (0..7)
0.5 0.5 0.5 0.5 0.5 0.5 0.5 0.5 
##$TPOFFS= (0..7)
0 0 0 0 0 0 0 0 
##$TUNHIN= 0
##$TUNHOUT= 0
##$TUNXOUT= 0
##$USERA1= <user>
##$USERA2= <user>
##$USERA3= <user>
##$USERA4= <user>
##$USERA5= <user>
##$V9= 5
##$VALIST= <valist>
##$VCLIST= <CCCCCCCCCCCCCCC>
##$VD= 0
##$VDLIST= <DDDDDDDDDDDDDDD>
##$VPLIST= <PPPPPPPPPPPPPPP>
##$VTLIST= <TTTTTTTTTTTTTTT>
##$WBST= 1024
##$WBSW= 4
##$XGAIN= (0..3)
0 0 0 0 
##$XL= 0
##$YL= 0
##$YMAX_a= 805154
##$YMIN_a= -315274
##$ZGOPTNS= <>
##$ZL1= 120
##$ZL2= 120
##$ZL3= 120
##$ZL4= 120
##$ABSF1= 10
##$ABSF2= 0
##$ABSG= 5
##$ABSL= 3
##$ALPHA= 0
##$AQORDER= 0
##$ASSFAC= 0
##$ASSFACI= 0
##$ASSFACX= 0
##$ASSWID= 0
##$AUNMP= <proc_1d>
##$AZFE= 0.1
##$AZFW= 0.1
##$BCFW= 1
##$BC_mod= 2
##$BYTORDP= 1
##$COROFFS= 0
##$CY= 11.3945322036743
##$DATMOD= 1
##$DC= 2
##$DFILT= <>
##$DTYPP= 0
##$F1P= 19.5091578491511
##$F2P= -0.509923556040331
##$FCOR= 0.5
##$FTSIZE= 0
##$FT_mod= 4
##$GAMMA= 1
##$GB= 0.15
##$INTBC= 1
##$INTSCL= 1
##$ISEN= 128
##$LB= 0.24
##$LEV0= 0
##$LPBIN= 0
##$MAXI= 10000
##$MC2= 0
##$MEAN= 0
##$ME_mod= 0
##$MI= 1.114404
##$NCOEF= 0
##$NC_proc= 0
##$NLEV= 6
##$NOISF1= 3.799351
##$NOISF2= 2.8
##$NSP= 1
##$NTH_PI= 0
##$NZP= 0
##$OFFSET= 15.70392
##$PC= 1
##$PHC0= -9452.942
##$PHC1= 13.40088
##$PH_mod= 1
##$PKNL= yes
##$PPARMOD= 0
##$PSCAL= 0
##$PSIGN= 0
##$REVERSE= no
##$SF= 200.130013532006
##$SI= 16384
##$SIGF1= 3
##$SIGF2= 2
##$SINO= 400
##$SIOLD= 16384
##$SREGLST= <1H.CDCl3>
##$SSB= 0
##$STSI= 0
##$STSR= 0
##$SW_p= 3612.71676300578
##$SYMM= 0
##$S_DEV= 0
##$TDeff= 0
##$TDoff= 0
##$TI= <>
##$TILT= no
##$TM1= 0
##$TM2= 0
##$TOPLEV= 0
##$USERP1= <user>
##$USERP2= <user>
##$USERP3= <user>
##$USERP4= <user>
##$USERP5= <user>
##$WDW= 1
##$XDIM= 8192
##$YMAX_p= 0
##$YMIN_p= 0
$$ End of Bruker specific parameters
$$ ---------------------------------
##NTUPLES= NMR FID
##VAR_NAME=  TIME,          FID/REAL,        FID/IMAG
##SYMBOL=    X,             R,               I
##VAR_TYPE=  INDEPENDENT,   DEPENDENT,       DEPENDENT
##VAR_FORM=  AFFN,          ASDF,            ASDF
##VAR_DIM=   8192,          8192,            8192
##UNITS=     SECONDS,       ARBITRARY UNITS, ARBITRARY UNITS
##FACTOR=    0.0002076,     1,               1
##FIRST=     0,             0,               0
##LAST=      1.7004516,     0,               0
##MIN=       0,             -315274,         0
##MAX=       1.7004516,     805154,          0
$$ Real data points
##PAGE= N=1
##DATA TABLE= (X++(R..R)), XYDATA
$$ [...]
2257D209N23O62r00k706j044K311L454P73j860k016q09o45n05J047L443L519k28
2274I228m225m603q36K210K357J827J981K212j527o068n770N45N607M852R71j192
2290G569j707k097m461m040J171O485O854j34n724n363j412L82n79O49M995N335
2306G923n46p351p015k21M588L665O86q9J114j80m340n756j63O127O425J83m960
2323I0l389R9L43j834l27M204N057j39n875n568l72L847K929K71K83J280P3l725
2341b753n002p00N068N820J059k652k404k86j033k229L9L815N110J707k857m228
2357a526j823L10J228P77J854K798J470j620m360l030M62K216J534J423J130P15
2373C558j350l402k409l04J337K730J973Q41o43j854k457k000l28J661K646K162
$$ plain form
2257 4209 4732 5394 4494 1788 744 3055 6509 7282 5422 3406 2597 1952 1447 2494 5937 9456 9228
2274 9228 5003 400 -436 1774 4131 5958 7939 10151 8624 2556 -3214 -2669 2938 7790 8761 7569
2290 7569 5862 3765 -696 -4736 -3565 2920 9774 9640 3916 -1447 -2859 -2477 -3056 -2407 2588 7923
2306 7923 7377 26 -6989 -7210 -2622 1043 1729 1640 2754 2574 -1766 -7522 -7685 -1558 4867 5050 90
2323 90 -3299 -3200 -2857 -4691 -5018 -814 4243 4104 -1771 -7339 -7711 -3864 -935 -664 -381 899 972 -2753
2341 -2753 -7755 -8455 -3387 2433 3492 840 -1564 -1850 -2883 -5112 -5073 -1258 3852 5559 2702 -1526
2357 -1526 -3349 -3039 -1811 -1034 820 3618 5088 3468 -892 -3922 -3460 -1244 290 1713 2843 3558
2373 3558 2208 -1194 -3603 -3907 -2570 160 2133 2974 2331 477 -1980 -3980 -4308 -2647 -1 2161
2389B161R46p16k700l528j721J052K827K434J170K01j450l140l526j267K371L846
2405a040K576k65j979k617k112j813k74K703M361K540j637m550l315l6J144J305
2421e009J906L117J477k383m782l495R35L899L702J462o50r15j854l178k624J196
2437g196N008M961P26k650l668k231j318OJ850M274M155N94l456n436l170P49
2453f802K879L256K625K138J10l340n243l346J436M655M716K592n49k194l332
2468c99l558k180J227M989N740K802k424n220l925j780J25K398M542M525J411
2483H273l033o516m750k90L321M306L053J664m53l450n655m285Q68N521N745K133
2499F452j506l399l591l350j219K260N353M835Q38l707n601l525m3K554L157L788
$$ plain form
2389 2161 3107 2391 -309 -3837 -5558 -4506 -1679 755 1925 2126 676 -2464 -5990 -7257 -4886 -1040
2405 -1040 1536 1271 -708 -3325 -5437 -7250 -7524 -4821 -460 2080 443 -4107 -7422 -7458 -6314 -5009
2421 -5009 -3103 14 1491 -892 -5674 -9169 -8234 -4335 -633 829 179 -736 -2590 -5768 -8392 -7196
2437 -7196 -2188 2773 3499 849 -2819 -5050 -6368 -6362 -4512 -238 3917 4511 1055 -4381 -7551 -6802
2453 -6802 -3923 -667 1958 4096 4206 866 -4377 -7723 -6287 -1632 3084 5676 5127 2933 -399
2468 -399 -3957 -6137 -4910 79 5819 8621 6197 977 -2948 -4728 -4603 -2205 2337 6862 8273
2483 8273 5240 -1276 -6026 -6316 -2995 1311 4364 6028 5575 2125 -3530 -7815 -6947 -1426 4319 6452
2499 6452 4946 1547 -2044 -5394 -6613 -4353 1000 5835 6673 2966 -2635 -6160 -6203 -3649 -492 3296
2515C296K087j038n146n540j744K631M687L727J363j460l461m408k741P82L827
2530c138M975K739j214l935m263k281K46L025M470L586j3l036m514k541k68K194
2546c968M229L799J144k158m325l196n32J750K733K949J842k85k592l968k224
2561d802R87L535K792M48l62o20j574k692j739J232L668K703j82k202j640J52
2577b96j72r82j44K383K795L33k917k480K62J835K85j128K04K276J469k173l451
2594a901p59K147K325n17j278K36J637q49k876k437J760M153J476k000k360P7
2610a166J79j178k322J690M141L099j552m640k714N71J336P53Q42K891K613j797
2626B746n350m620O70M013L883J316L78k55k453n032l984J445N592N484J677k162
$$ plain form
2515 3296 5383 4345 -801 -6341 -8085 -5454 -767 2960 4323 2863 -598 -5006 -7747 -6965 -3138
2530 -3138 1837 4576 3362 -573 -4836 -7117 -6871 -3846 624 4210 4197 1161 -3353 -5894 -6162 -3968
2546 -3968 261 4060 5204 3046 -1279 -4475 -5007 -3257 -524 2425 4267 3982 1390 -2578 -4802
2561 -4802 -3815 -280 2512 2960 2598 1978 404 -2288 -4027 -2795 873 3576 3394 1192 -448 -296
2577 -296 -468 -1450 -1594 789 3584 3917 1000 -1480 -1218 617 902 -226 -22 2254 3723 1550 -1901
2594 -1901 -2660 -513 1812 1295 17 253 1890 1041 -1835 -4272 -2512 1641 3117 1117 -1243 -1166
2610 -1166 -987 -2165 -4487 -2797 1344 4443 2891 -1749 -4463 -3892 -2556 -1803 -961 1930 4543 2746
2626 2746 -2604 -7224 -6554 -2541 1342 2658 3036 2781 328 -4704 -8688 -7243 -1651 3833 5510 3348
2642C348l842l445k995r88K385O014N492L65m205n552l519o67J997M155N358L205
2658G106j498n486n738k268J846M001M614L592M96l426n853m457m56M263N202
2673A938L247P94j553m041n284k948K000N792M607J345j536l182l454l261j025
2688f561K907N827M695j87m376m557k195K19O92K723M624L893r92n835n424j262
2704e809K650L285K497K214J358j133n367n532j379M316N836K817m27j624j711
2719A991l896m288j242N093P181L504k520m805l526j809r51P64L926O180L208
2734H810l142o601n152n4K493K904K788L622J454l243o693n120N07N256M857K102
2750D788k38j300l075m583l426J124N515N375J383k622l696k858j898p36J877
$$ plain form
2642 3348 -494 -3939 -6934 -7922 -5537 477 5969 6334 2129 -3423 -6942 -7609 -5612 -1457 3901 7106
2658 7106 5608 122 -5616 -7884 -6038 -2037 2577 6169 6665 3239 -2614 -7071 -7527 -3264 1938
2673 1938 5185 5979 4426 385 -4899 -7847 -5847 -55 4552 5897 4361 1179 -2275 -5536 -6561
2688 -6561 -3654 2173 6868 6681 2305 -2252 -4447 -4228 -3536 -813 3811 7704 6712 877 -4547 -5809
2704 -5809 -3159 126 2623 4837 6195 5062 -305 -5837 -7216 -2900 2936 5753 5326 3702 1991
2719 1991 -1905 -6193 -7435 -2342 4839 8343 5823 1018 -2508 -4317 -5268 -4504 -578 5602 8810
2734 8810 5668 -933 -6085 -6139 -3646 -742 2046 5668 7122 3879 -2814 -7934 -7427 -2171 2686 4788
2750 4788 4550 3250 175 -4408 -7834 -6710 -1195 4180 5563 2941 -755 -3613 -5511 -6247 -4370
2765d370M509M148L46l562m263k306N7J621K664K818J991p56l417l494j506J411
2781d109K764K501J389M3j424l207k789k58K384L065J804J35j128k299k502j427
2797e058J185K755K952R05r73k041k325j298n95J826L382L082L27k779l241j408
2813c304m04R99K492L370K248q61l608m172j685J452L194L210K097K08j756m197
2829g17m269q89K829N206L438N58k285l440l720k595O26M156N352L191j182m605
2845A654m920k631P75K820M414M055J225l049n350m724p63L316M979L634R22j809
2861D548m065m458k659J208M508N227K240j946m523l977k107M34K981M123L531
2876E065J1l627n041l194L95L310M063K647L76j892l753l457j472J747M433M025
$$ plain form
2765 -4370 139 4287 4633 1071 -3192 -5498 -5441 -3820 -1156 1662 3653 2897 -520 -4014 -5520 -4109
2781 -4109 -1345 1156 2545 2588 1164 -2043 -4832 -5090 -2706 359 2163 2298 1170 -1129 -3631 -5058
2797 -5058 -3873 -1118 1834 2739 1766 -275 -2600 -3898 -4493 -2667 715 3797 4124 1345 -1896 -3304
2813 -3304 -3708 -2709 -217 3153 5401 4540 932 -3240 -4925 -3473 -279 2931 5028 5236 3480 -717
2829 -717 -4986 -5875 -3046 2160 5598 6156 3871 431 -3289 -5884 -5258 -1102 4250 7441 6259 1654
2845 1654 -3266 -5897 -5122 -2302 2112 6167 7392 4343 -1007 -5731 -6494 -3178 1801 5435 6357 4548
2861 4548 483 -3975 -6634 -5426 -918 4309 6549 4603 80 -3897 -6004 -5570 -2589 1534 5065
2876 5065 5076 1449 -3592 -6786 -6391 -3081 982 3629 4005 2113 -1640 -5097 -6569 -4822 -389 3636
2892C636J174k402l385k850j358N22K570L658K591j39k946m090k554P09K347K688
2908A71J976J057q27k857l441j994J493L220L061J055n19j558k199k031j333J254
2924c472L708K976R44j639k406j873j085l67J258L200K896P55j861l315k449n55
2940c285J107K092K319J980K14k003l760k684j01K663L024K012O42j105k717l159
2956b761j506R71L215L295J551r41k527l284j764N14K312L258K170J80k547l489
2972a353k488j41K182L352K683R8k099l238k719j092J259L262L537J234j978l847
2988a348l204j018J459K899L057J631o63k915m124k298R69L498L862J693p38k228
3004E32l019k574j011J866M542L497M58k567l683k662o80J129K445L147K255j63
$$ plain form
2892 3636 4810 2408 -977 -3827 -5185 -4663 -2093 1565 4156 4017 1071 -3019 -5573 -4864 -2517 171
2908 171 2147 3204 2377 -480 -3921 -5915 -4422 -1202 1859 2914 2395 837 -1362 -3393 -4726 -3472
2924 -3472 236 3212 4156 2517 111 -1762 -2847 -3214 -1956 1244 4140 4895 3034 -281 -2730 -3285
2940 -3285 -2178 -86 2233 4213 4427 2424 -1336 -4020 -4121 -1458 1566 3578 4220 3115 398 -2761
2956 -2761 -4267 -3296 -81 3214 4765 3824 1297 -1987 -3751 -3237 -925 2333 4503 4683 2136 -1353
2972 -1353 -3841 -3982 -1800 1552 4235 4333 2234 -1004 -3723 -4815 -3556 -294 3243 4477 2499 -1348
2988 -1348 -4552 -5570 -4111 -1212 1845 3476 2813 -102 -4226 -6524 -5555 -2057 1805 3498 2760 532
3004 532 -2487 -5061 -6072 -4206 336 3833 4291 1724 -1959 -4621 -5301 -4172 -1727 1420 3675 3512
3020C512l518l795k132J251K734K413J703L99j205k794k952j115J694L469K729
3035B393J90j049k036j608j547j10J606L207K238l83k314k092j042j39J051J625
3051a0J696J043p16k170k216p87J347J585J360N61l58r42j804j606J21J691K044
3068H39J090m32j391j651q80k81Q82J863J421O88j122k072j457l59J001J575J775
3085A489N89o98j610j762q42J4J485J995J065J78j780k066j108j56Q54J476J597
3102G20R20o40k057j999q23P99J797J523P86k41n05j620j550o57J455K201J229
3119A338m3o93r61j043q59k74J115J792J440j04j454j554p20j63M15R73J184J350
3137A739l78j790j701q45P71J050J247Q87L80o11j543j504m50R17K066J605J19
$$ plain form
3020 3512 -6 -3801 -5933 -4682 -1948 465 2168 2567 1362 -1432 -4384 -5499 -3805 -336 2393
3035 2393 2583 1534 -502 -2110 -3657 -3767 -2161 1046 3284 2901 587 -1505 -2547 -2686 -1635 -10
3051 -10 1686 2729 2013 -157 -2373 -3160 -1813 -228 1132 1693 1335 393 -1411 -3017 -2896 -1205 839
3068 839 1929 1497 106 -1545 -2425 -2706 -1824 39 1460 2148 1026 -1046 -2503 -2862 -1861 -286 1489
3085 1489 2078 1380 -230 -1992 -2834 -2820 -1335 660 1725 1903 123 -1943 -3051 -3207 -2353 -877 720
3102 720 1640 1000 -1057 -3056 -3879 -3080 -1283 240 1026 785 280 -1340 -2890 -3547 -2092 109 1338
3119 1338 1295 602 -359 -1402 -2261 -2535 -1420 372 1812 1708 254 -1300 -2020 -2183 -1768 -795 389 1739
3137 1739 1361 -429 -2130 -2975 -2204 -1154 93 980 1360 749 -794 -2298 -2748 -1831 235 1840 1959
3154A959p04j524j239o63K20J493K103J054k41j797k139j299M83J657K113J167
3170B643L07j530k551k097m03J750K779K220J29j356k740k380j054J243K692L220
3186B872J380j059k937l146j725Q01K954L070J788K4k344l674k564l05K694L335
3202A164K768M56k010l233k799r50R69K820L706J543j031l376l350j224J012J956
3218a579K939J846R8j726l051k594P4J994L025J927q5r72j895j853j131Q61K127
3235EK408J259j277j931j460q26N41Q99J416J544M78j395k072j379K55J525Q00
3252G90M92L64pq65r58j160L44Q22J221O60l26m42o07n03p09k9R21J598N12k43
3272A875q61p40o86m92L65Q51J268Q76k66j230j623r48M03Q28J173P80P84m72
$$ plain form
3154 1959 1255 -269 -1508 -2171 -1951 -458 1645 2699 2458 661 -1478 -2777 -2294 -637 1476 2643
3170 2643 2950 1420 -1131 -3228 -3631 -1881 898 3118 3247 1891 -849 -3229 -4283 -3040 -348 2872
3186 2872 4252 3193 256 -2890 -4615 -3814 -860 2210 3998 4022 1678 -1996 -4560 -4865 -2171 1164
3202 1164 3932 4388 2378 -855 -3654 -4604 -3635 -815 2891 4434 3403 27 -3323 -4547 -3535 -1579
3218 -1579 1360 3206 3304 1578 -1473 -4067 -3993 -1999 1026 2953 2868 1896 1 -1852 -2983 -2122 5
3235 5 2413 3672 2395 464 -996 -1822 -1281 -382 1034 2578 3056 1661 -411 -1790 -1535 -10 790
3252 790 1282 1646 1639 774 -184 -1344 -1000 -178 1043 1703 1377 935 328 -175 -884 -913 8 1606 2118 1875
3272 1875 1014 274 -412 -904 -539 312 1580 2456 2190 960 -663 -1611 -1208 -380 793 1573 2357 1885
3290A885j669j719q40Q64J542J724P20m76j150j611j082l95J080K449J669J85
3306C176j653j706j547k67R44J606J744R26n94j836k185q08N48J938J441P26k19
3323B234j126j643j266p4J017J760J074M6j050j317j091j99N62J368J059N71m48
3340A477j662j065j89O34J115P49L02j70p14j147m59R7R99P89O86m78j066o05
3358g07k67l6O40L93O06K85q21p80j016L97N37P92M12r8j68o85p88k07K86Q60
3378c65J058L7l72o56m61o7O2M9Q91O17J33m20q66p35K0O67L19N08K68L5o65o28
3400e71p16R9J100P51K48n25j33n01m42j14L11N80M93N21o68q92k40K03M94K39
3420B37K91K18l8o88p09k86P17Q08L35o2o69m85l33J12j80P52P86J89m44j173
$$ plain form
3290 1885 216 -1503 -2343 -1479 63 1787 2507 2031 881 -730 -1812 -2207 -1127 1322 2991 3176
3306 3176 1523 -183 -1730 -1997 -1053 553 2297 3223 2629 793 -1392 -2200 -1652 286 1727 2453 2234
3323 2234 1108 -535 -1801 -1875 -858 902 1976 2022 972 -345 -1436 -1635 -1073 295 1354 1925 1477
3340 1477 -185 -1250 -1439 -805 310 1059 1361 1191 477 -670 -1129 -1032 -33 756 1442 964 -102 -707
3358 -707 -974 -1010 -370 23 629 914 93 -687 -1703 -1306 -769 23 435 337 169 -516 -1304 -1511 -1225 -365
3378 -365 693 730 358 -298 -759 -826 -764 -715 176 793 926 506 -360 -1095 -1075 -408 -89 419 687 722 57 -571
3400 -571 -1287 -1188 -88 663 911 386 253 -248 -690 -804 -493 87 580 1101 433 -459 -699 -496 -2 237
3420 237 528 746 708 20 -689 -975 -258 550 885 823 154 -331 -664 -552 -732 20 806 995 551 -622
3440f22m53j62O53O25L21K86l69o51q22m37M26J124N40J49l97o42m39m72K57L10
3460g75O72P06p0m38r81m95L13M22L35L05J8K01m99o84l31K12O76Q5Q6j41l0J51
3482b62j50m96m2L61ML15j17Q9k6K97m07l93j44K37O52J42M8r2kl96m58m4N83
3505c01N32O62j73m82n74m91L6J72N72O47L56k79p76n89k76M35M12N57L28k72
3525D96n22n65l30J31N84N38N23l04p23m39j37K06M98L27M29l04l29m42o52J63
3545h52P81O66K25o49n80m64J02N5K85O64M10l44o57n65p4J74P98K95k3k54r7
3566a04m91m69N6Q56O46p5j58p34j53m3K03L44J81K52Q5l71o81j47Q13L10K50
3587E70n9n33l09p8k24M47N47L45J89o29q89k14L50N39L71L53K18k69o84p03l01
$$ plain form
3440 -622 -1075 -1237 -584 41 362 648 279 -372 -1194 -1631 -1205 -81 459 608 211 -431 -870 -1342 -1085 -775
3460 -775 -103 603 533 95 -886 -1381 -1068 -646 -311 -6 12 213 -286 -970 -1301 -1089 -413 -328 -242 -383 -413 -262
3482 -262 -412 -908 -950 -589 -585 -270 -387 -298 -324 -27 -434 -827 -971 -734 -82 60 108 16 14 -382 -840 -884 -301
3505 -301 231 893 720 238 -336 -827 -791 -619 -47 600 956 677 -99 -688 -964 -529 -117 440 768 496
3525 496 -26 -591 -921 -790 -206 332 855 551 -172 -611 -748 -542 -44 283 712 408 79 -363 -1015 -852
3545 -852 -71 595 820 171 -409 -873 -771 -716 -431 233 643 299 -358 -923 -997 -823 -25 270 247 -7 -104
3566 -104 -595 -1064 -1008 -152 494 419 261 -473 -626 -669 -466 -122 59 311 396 25 -656 -803 10 320 570
3587 570 511 -22 -331 -409 -633 -186 361 706 895 266 -623 -837 -487 52 423 776 994 725 41 -662 -963
3608i63O33P17R00j2m51n07o36j47m4P59P97N18k24o23q06m56J70K8P35O57K53
3629A298j85q26p31k86K56M15P21M4K84l74n84p12l59L26M91Q49N6k22l05p46
3649e90P2p6R9N62K38J53j40m76m79k49R3N14l4M62M6j72n44m90R6J99O49J33
3671F6k47k5j06l24j66j50N99L55J14j89n16r5K11P6j04M48K30rm38l16r3K56
3693d23M37L71j06r1l07k95Jo7J54P97J8k60j89k83lJ18J34K08J37J79k94l55
3715a19j96N9K53J24m5J11l0R0k23l30K44J25K59j38j45k48M40l8k5k33n3K5J09
3738A6n0k8J24L4j09K2j24m48J77J05L60m0p8j78j86j37j4O6M10L28j80m64l6
3761d30j00P4J92m9R9L2j54q9J54j2J19O3o5n8l24K08L54J29M4k20J32o40j7j53
$$ plain form
3608 -963 -330 387 1287 1275 824 317 -319 -466 -510 249 1046 1564 1340 717 -89 -545 -375 -347 388 1045 1298
3629 1298 1113 287 -444 -730 -474 -59 662 706 990 616 32 -680 -1039 -713 -222 627 683 461 156 -590
3649 -590 -518 -594 -495 67 305 458 318 -158 -637 -886 -793 -279 -313 149 195 23 -521 -1011 -915 -716 -67 66
3671 66 -181 -206 -312 -636 -802 -952 -353 2 116 -73 -589 -684 -473 -397 -501 -53 177 168 -270 -586 -679 -423
3693 -423 14 385 279 188 -119 -414 -413 -480 -326 471 489 229 40 -243 -246 -128 6 214 351 530 236 -119
3715 -119 -315 -256 -3 121 76 187 157 247 24 -306 -62 63 322 184 39 -209 231 193 168 -65 -118 -93 16
3738 16 -34 -62 62 96 -13 9 -115 -563 -386 -281 79 39 -39 -217 -403 -540 -554 -488 -78 250 70 -394 -430
3761 -430 -530 -456 -264 -313 -214 -182 -336 -425 -271 -283 -164 -101 -166 -224 -548 -340 14 143 187 -33 99 -541 -558 -711
3785g11M43M55L79j22n99n53j24J44M59L88L31K09l76q49o87l7O21Q68O54M9l75
3806E67p19n89n75M19Q50Q74M73n03o26r47l60K63N48Q55Q00l9q16j133m25l1
3826a114O01J097O64l05k05r74p24k6M66R30O71K02m54p93q31R8L51N43Q72J56
3846A225m29l19p00o39L52Q14N89J08r4m44p08m46O4L96R45K29J16n91q03l35
3866f70k25L85M57O13K39J03r09o13l10J60M72O61K78K9q4m87p44k50J94O80O14
3887E93J75l1q1p66o99l72M09O51Q60O3o1n52q05n83n5K31J007J004R0m50j060
3908d32p60l66L38N72R99R08k7q74j270p44J44O46Q92J001K90m58j091j119l65
3927a716K74J412R59J93o6q34j110q61K44J025J098O16j00o41j085r07p4N62J144
$$ plain form
3785 -711 -268 187 566 444 -155 -708 -832 -688 -229 159 490 699 323 -526 -1213 -1250 -629 239 893 942 567
3806 567 -152 -741 -1316 -897 -47 827 1300 797 171 -776 -1136 -873 -325 530 1330 1291 475 -658 -1083 -1114
3826 -1114 -513 584 1248 943 738 -236 -960 -986 -520 410 1081 1283 829 36 -795 -697 -346 197 1069 1225
3846 1225 796 477 -223 -862 -510 304 893 1001 907 463 -245 -691 -627 -231 714 943 1059 468 -335 -670
3866 -670 -895 -510 -53 560 799 902 -7 -620 -930 -770 -298 363 641 670 586 99 -645 -895 -701 -21 593
3887 593 768 737 656 -110 -809 -1181 -772 -121 739 802 741 189 -616 -1199 -1254 -1023 -16 988 1078 628 -432
3908 -432 -1192 -1558 -1220 -648 351 1259 1232 358 -912 -1656 -1512 -866 26 1027 1317 859 -232 -1351 -1716
3927 -1716 -1442 -30 929 1122 1056 222 -888 -1749 -1505 -480 618 1234 1134 493 -592 -1499 -1573 -1011 133
3946A33R20K94o24j072q71l03N15P63J014O96m20r48r92n10L50N41J031P42q0
3965A179l88j069j003l8O16R88P66J86m75p30q21m66J07R78J144N08n51o65q86
3984f20n54P3K02R89P09M83m97j006p65j01K88P50O02O81p7m55j188p08K01P54
4004b39N30M97K14k71o14j004k10J81R82N89K58l37n45l37m09k80L80Q97K84n8
4024E08n16m84l49o9M66K43M08N40l84o32l81M9N0N46L15n6n7k41m40k12J38M64
4046i4M02P6r8k96k71m91Q5O62J63M47k28l67l12l86p3M12L64L99K00k83n10l89
4068e88K6KN00L72N88j41o79l10n65K58K73O33J08L01R6p57p06k34K42P21M33
4089E73J42P0n03n31m32j20O1J032N10L8m28l49p54k33L81J56Q40N10n4m74q56
$$ plain form
3946 133 1053 1347 723 -349 -1220 -1523 -1008 -245 769 1465 1045 97 -895 -1405 -1055 -514 517 1259 1179
3965 1179 791 -278 -1281 -1319 -703 285 1051 1237 762 32 -789 -1255 -1148 -170 974 1482 931 266 -620
3984 -620 -1174 -1101 -899 90 799 1282 785 -221 -986 -1087 -799 -49 553 1234 1157 702 -486 -1194 -993 -239
4004 -239 291 788 1002 731 117 -887 -1097 -916 66 655 913 576 31 -306 -715 -995 -615 282 566 508
4024 508 -8 -492 -841 -910 -444 -201 207 747 363 -269 -650 -601 -551 -5 310 254 197 -44 -484 -696 -558 -94
4046 -94 308 384 286 -10 -281 -772 -687 -25 138 585 357 -10 -322 -708 -781 -369 -5 394 594 311 -199 -588
4068 -588 -562 -560 -60 312 900 759 80 -230 -795 -537 -264 369 477 778 874 117 -589 -823 -581 140 573
4089 573 715 785 282 -249 -681 -801 -740 292 802 840 412 63 -691 -924 -543 -387 453 963 909 435 -421
4110d21m23j1N86N02L25M13j92q34p93k95L65P80Q02J26k76n98p48o22J17Q00
4130c97Q44N17l80o29p42n74m4O00N85R68J31n92q99m98m24N31Q20P99N51n50
4150F17j045p40l13J75J042R21M63j38o97j304n27R1Q18J139N23m0m20j112o06
4169a153n06O11J082Q37L31n20q83n72m13O8O64J082O01m12m84o39o13J54M07
4188c58K66P53K28l32n19p80j21L68L51M81M12j81j88m60m40k20N52L30M84n1
4208E75m44m7l37k66j2L85K30L04j9l56j67j82m3L7M4K48L85L9m43k67q0N9j94
4231e51N81J12P8q7l37j50l61J57L27M36L17k95l53k41n39K04L60K08N83j40l55
4252d6o66j52q9L94M66M81J02m90l11m62j89K04M63M88K66k93m20o11k17K56N06
$$ plain form
4110 -421 -844 -855 -269 233 558 971 779 -55 -848 -1143 -778 2 804 930 654 56 -692 -1314 -1197 -397
4130 -397 447 964 584 -45 -787 -1361 -1405 -805 -220 748 879 287 -612 -1110 -1534 -1003 -183 616 1167 617
4150 617 -428 -1168 -1481 -1306 -264 657 1120 982 285 -1019 -1546 -1455 -637 502 1025 985 565 -547 -1153
4169 -1153 -1659 -1048 34 871 1202 682 -201 -773 -1186 -1118 -454 628 1229 817 333 -306 -919 -765 -358
4188 -358 -92 661 889 557 38 -742 -863 -495 -144 337 749 568 380 -80 -520 -740 -188 142 626 575
4208 575 131 84 -253 -519 -531 -146 84 388 369 13 -154 -336 -379 -342 -298 -50 335 374 -69 -336 -416 -357 -551
4231 -551 30 142 220 133 -204 -354 -715 -558 -231 205 522 227 -126 -367 -906 -702 -342 -134 449 309 -46
4252 -46 -712 -864 -953 -559 -93 388 490 0 -311 -773 -962 -758 -295 193 459 166 -254 -865 -1082 -826 -320
4273c20N30K73M4n23p26l97K5N77N72M40n9k01o10n97k04M69O47N26j11j86m01
4294b32m63l61L08N23N32M00j51m90r08K64MM05N38J70J70m86m91m74R7N31L34
4315B20K47J12k95n18m09l9J91P15L60Q0k68l99m05l91O9M83N09N68k23m65l99
4336b57n43o4M79N46O79P2m36o58n35k68L44O24N94J59J04p15p99o25K35P53M57
4357A46N36J60k82o93o89m30L36R70N51J68k10n91n70n58R7N19Q10P77k45l68
4377D34p29n76j71M87M91P12M50j97r79m96j92J31M54N71N33J5o31o85l75k55
4397a008P80M71M88P3j56n51n62l89K00N56Q60J79j78l89o65k83j76M43Q16M11
4417I20J35l82q44k72k14K92L35N41M27No97m72k89j08M03N92L10J54j07n31o68
$$ plain form
4273 -320 210 483 527 4 -722 -1119 -1094 -517 55 495 436 235 -375 -972 -1176 -707 -60 466 355 169 -232
4294 -232 -695 -1056 -748 -225 307 707 556 66 -842 -578 -574 -169 369 539 709 223 -268 -742 -645 -114 220
4315 220 467 579 284 -234 -643 -682 -491 224 584 664 396 -3 -408 -799 -730 -247 262 830 607 142 -257
4336 -257 -800 -864 -385 161 840 912 476 -182 -717 -985 -641 -17 577 736 840 125 -674 -1299 -1064 -311 146
4357 146 682 842 560 -133 -822 -1252 -916 54 605 773 563 -28 -598 -1156 -1059 -540 270 1047 802 434
4377 434 -295 -871 -1042 -555 -64 648 1098 901 -78 -574 -766 -635 -181 390 923 938 307 -378 -753 -1008
4397 -1008 -228 243 731 804 648 97 -465 -854 -654 -98 762 941 763 374 -291 -574 -750 -307 509 920
4417 920 1055 673 -171 -443 -657 -365 -30 511 938 943 246 -226 -515 -623 -220 372 682 836 729 198 -470
4438d70k46K17O25M35K53L5k09p53m42k47O46M80K97L90k28m17p62l63J84N72
4458cP31L08k19k85n58m62o3L39P01L83K48l29q82k43k26O0M49N67M51Ro05p13
4480c42l37K81K18O21M06L3k87o12o12j21M59L75O65j26L8n98k47m72M32J26N56
4501D56J66j57m53l57p6J17K65K87K13Nm63l37l50L13J61L80L28l96K17m93l58
4522e32%L24L48K62m7l26k73l20K10N7K97K19L0j39j73k42k2J31j15L18K22J4
4544B43Pm62m6O7M5P1K29L8l11N8l47Q2J78P8J29K0o4K6k7l27p6L92M9K43l23
4569b8%j28k6N6j37R4L56J8o4m52j0J62j06K40m7L08j29m5k81l7j34J58J62J33
4593F3r7Q6k11k08k79K98M54M2k9q9j27j77r0j87K64M22J15k83j27k65p2J02K9
$$ plain form
4438 -470 -716 -499 126 561 814 849 640 -113 -555 -802 -156 324 621 1011 783 366 -396 -759 -575 -3
4458 -3 728 1036 817 532 -26 -488 -551 -212 489 872 1120 791 -91 -334 -560 -500 -51 516 967 976 371 -342
4480 -342 -679 -398 -180 441 847 880 593 -19 -631 -752 -293 82 747 621 659 61 -186 -658 -226 -100 456
4501 456 622 465 12 -345 -421 -304 -39 248 461 466 3 -334 -684 -371 -210 170 498 102 319 -174 -532
4522 -532 -532 -208 140 402 355 29 -244 -564 -354 -297 0 219 249 110 -63 -305 -327 -196 -311 7 229 243
4544 243 250 -212 -258 -191 -146 -75 154 192 -119 -61 -408 -326 -148 -70 59 79 15 41 14 -313 -389 3 52 295 -28
4569 -28 -28 -156 -182 -126 -263 -169 187 205 141 -311 -321 -159 -265 -25 -72 236 107 62 -219 -256 -390 -232 -70 63
4593 63 -34 52 -159 -367 -646 -348 106 148 119 30 -97 -274 -364 -551 -287 135 250 -33 -160 -425 -497 -395 -366
4616c66L01J85J83j73l11m76K21R6J11Q2J49J66j48n84p1r2N05J71j15L00j42
4637hl15j22k26K12L56K18L6j40j20j75n8j27j04M85L18l4l54p5k69K34k45L40
4659a73K39K08k16j53j82k28K60J7O0J22K53j55j64m09M0J55M76J5j7j5nm02k32
4682e06l9L97K03N9J65l87k9J3j16j91L03L23J74j20n83J2j06R9J07M60N4L34
4704F26n05n02k15J90M13rN73j55l11m64k76J3K39O92J99m8j86k34k78j21j44
4725e03L54M55P5K5k37l43k13k9K15J26N55O9l00m58j68M2J22M67j57M16j36l61
4747A6l19K05k04L74J18Ql0j88m5j5j16Q2M08k0m0k57n3N1O5lj43K18J94j38k24
4772e6J43r7j37J25n2J89N3j00q1l05K38P9O0l4J2K73k34r9m7P4k9J8l2K90M4
$$ plain form
4616 -366 -65 120 303 130 -181 -657 -436 -340 -229 -147 2 168 20 -564 -635 -727 -222 -51 -166 134 -8
4637 -8 -323 -445 -671 -459 -103 115 151 11 -109 -284 -342 -469 -573 -88 230 196 -158 -233 -502 -268 -513 -173
4659 -173 66 274 58 -95 -277 -505 -245 -228 -168 -46 207 52 -112 -521 -481 -326 150 165 148 133 128 -274 -506
4682 -506 -545 -148 55 114 279 -108 -137 -124 -240 -431 -128 195 369 249 -334 -322 -428 -329 -222 238 292 626
4704 626 121 -381 -596 -406 7 -2 571 416 105 -359 -635 -622 -383 309 508 460 274 40 -238 -359 -503
4725 -503 -149 306 381 406 169 -174 -387 -416 -201 -75 480 549 249 -209 -377 -335 -213 254 97 513 377 16
4747 16 -303 -98 -302 72 190 198 168 -20 -65 -80 -196 -114 294 274 234 -23 -76 -25 40 37 -106 112 306 168 -56
4772 -56 87 -10 -147 -22 -74 115 168 68 -13 -318 -80 -1 59 25 37 310 76 -23 -70 4 -25 -7 -39 251 295
4797B95q7j15j58j49J48K40N8j45j66KR9j76J58J31J14Jp7K15l56k04J55J37o1
4820E9L73r5j93k00j07k2J29K57Q8j20n3p4q5j76K83K42m9j30%k2j59N7j24L59
4844B38N9n1j96p0m7j0pJ86K88l8M0j84l00J36R3Q0R1P5j36n2l43o6M43K38j74
4869B93J50k28k8j51m46K64J30N33j35Lk91j71n7M8J23K15J85q0J6n22O3J14K9
4892E7m7K13Q9l9L7m94j86l7L95K01kr3m7K8k97L7m4K41K29j40J62l1j87j93j71
4917c19L69O2j9J73k26o3j32R7k05J65J8M28m8J2j79r1k52RQ0K37J29Ok38J78
4941A91k61j3L0J26J20o7RJ4m03K14N7K9J41j83K23j94p9k7O6J48J15K4k51K4
4965E3K02m25K18K1q9J55r4j31J21J01J8q4j71Q8K32J00k07k25j04N19l06J08
$$ plain form
4797 295 208 93 -65 -214 -66 174 232 87 -79 -77 22 -154 4 135 249 250 173 388 32 -172 -17 120 59
4820 59 432 337 144 -56 -163 -185 -56 201 289 169 116 42 -43 -219 64 306 257 127 127 105 -54 3 -121 238
4844 238 297 246 50 -20 -67 -77 -84 102 390 352 392 208 -92 44 137 217 308 383 247 195 -148 -214 229 467 293
4869 293 443 215 187 36 -410 -146 -16 517 382 385 94 -77 -134 -86 37 252 437 357 373 -149 -86 28 57
4892 57 10 223 312 273 310 -184 -370 -407 -12 189 187 94 47 75 -222 -185 -229 12 241 101 263 232 45 -148 -319
4917 -319 50 112 93 266 40 -23 -155 -58 -263 -98 -80 348 300 312 133 42 -210 -201 -121 116 245 251 13 191
4941 191 -70 -83 -53 73 193 126 135 149 -254 -40 17 46 187 4 227 33 -46 -73 -7 141 256 280 29 53
4965 53 255 -170 48 69 -20 135 41 -90 31 132 150 66 -105 -17 215 315 108 -117 -221 298 -8 100
4987A00P8j69J27J45k81J64j86l1MJ77l1m7J72j98j72j8J38J24Jm4J54J2k2j45
5011E2l74K86J18J1m3j3L0k32J26l20J62K52M0R1j18J15j23j87o7R1J88J19N1
5034B55j26k73Q3k7j1j27K46K24k15K1k18J39j8l3P1P3K3m9Oj53O5k48J30J08
5058e4o3L37J91l17j18J1J10l98J74K18K25J78m44k74J01k15L64K6q5L80n3j93
5080A01m23P9J94K29l4j5pQ2p2l38j44J65L68K19k42k27n9r4N7OM4K98J26r5k90
5105g2j46r5K96k02L23j43J25R6l90R6j17Q7K86m1o8K6N3k69k25J08J47K62n4
5128H3M4j38k23J17k8q7J48K92n4l43K16r1M8M3l39K22L10j02m4j40l7Mk73L82
5152A0l5J01J91k26l28L0J24n3K79l35M97j97k72J30k06O1K60L4N6j8L82l42k75
$$ plain form
4987 100 178 9 136 281 0 164 -22 -53 -49 128 97 50 222 24 -148 -166 -28 96 97 53 207 219 197 52
5011 52 -322 -36 82 93 50 37 67 -165 -39 -359 -197 55 95 186 68 183 60 -127 -194 -103 85 204 255
5034 255 129 -144 -61 -88 -99 -226 20 244 29 50 -168 -29 -47 -80 -9 64 87 38 44 -109 -44 -292 -162 -54
5058 -54 -117 220 411 94 -24 -13 97 -301 -127 91 316 494 50 -224 -123 -338 26 52 -33 347 294 101
5080 101 -322 -243 -49 180 146 131 124 206 134 -204 -348 -183 185 404 162 -65 -124 -218 -161 -155 -111 187 313 218 -72
5105 -72 -218 -313 -17 -219 104 -39 86 182 -208 -112 -229 -142 144 103 35 61 114 -155 -380 -272 -125 137 83
5128 83 127 -11 -234 -117 -145 -232 -84 208 154 -189 27 -64 -16 27 -312 -90 220 118 74 -66 -103 -99 -372 10
5152 10 -25 76 267 41 -287 -257 -133 -186 93 -242 255 58 -214 -84 -290 -229 31 65 121 103 485 143 -132
5175a32k52J00M14k43J91J05k06p3k0r0N9K20K66k2j29j44Rj85M2N4N6L50j63
5198B07j75R4l83J31J22j13K20J48K12l79k46o4K51M1j6K33J9k53j00J94k80J67
5220C0K31o7k56LL36k34n3j25K83j1j19qJ31j87J12q4J27m1p2o1Nj18J01K21q0
5245F4q4j06J5Q2l6m2K19rJ1q8l4j53n2J19J14J52j23r6L1N3N0j46J13l0N3j55
5271g8J09k05K17J5J18o4k54J56kJ10l04J48LP7Q1k24P1n5o4J02J04k18K30K85
5295C58j98k29K2m6K70k26O0K51k14P1mk03j33J11J30k0K60k60O4p5l9j27J95
5318A8pJ62J31m22K28l45m9K81j09K55MK54k28j52j56L1K39L8J61o4n7j00j05
5341Hm0J42r2J97K22j58k46j46r3K92p9j9K32J30j39k85q3K23rJ52j48jJ40l2
$$ plain form
5175 -132 -384 -284 130 -113 78 183 -23 -96 -116 -206 -147 73 339 317 188 44 53 -132 -90 -36 20 370 207
5198 207 32 126 -257 -126 -4 -117 103 251 463 84 -162 -226 25 66 50 283 302 49 -51 143 -137 30
5220 30 261 194 -62 -59 277 43 -10 -135 148 137 18 10 141 -46 66 -18 109 68 -4 -65 -60 -178 -77 144 64
5245 64 -20 -126 -111 -29 -65 -107 112 103 114 26 -8 -161 -213 -94 20 172 49 -47 -16 37 87 -59 54 24 77 -78
5271 -78 31 -174 43 58 176 112 -142 14 12 122 -182 -34 -31 46 127 -97 -26 -81 -145 -43 61 -157 73 358
5295 358 160 -69 -47 -93 177 -49 11 262 48 119 115 -88 -221 -110 20 0 260 0 64 -11 -50 -177 18
5318 18 11 173 304 -118 110 -235 -284 -3 -112 143 147 401 173 21 -135 -104 135 173 334 270 213 113 8
5341 8 -32 110 18 215 437 279 33 -113 -206 86 7 -12 220 350 211 -74 -157 66 57 209 61 60 200 168
5365A68r3j23j28R9K21j99K09n3O2q6q8k43J35M59n6j81k91J07J13j70K5N6k6
5388h3M44k31j64N8j98R8n7Q6O1L15k45l01j1J89J13n2q3K07O0j07l05M4l2K03
5412IJ88O3l03J97k12Q6%k54L12R8L3m02O4Q1k45R8L83n9Q2K8j42r7j48n3M10
5437B17j17o6K39L7n06O5l7L61M9j78M1j01L2l3j94M57j21R3j32O8l0j60J13j83
5461h6J63K6K14j84k7k05N4J2K29k15J28P4p1j71p7J34R5L5J56k81m8J49l13J91
5485a8J3P0O9j50k2j49J62r5Q6O2NK8o7M2j35l2J82m7J34k42J04L44l41l70J51
5510b16L38j28l1K15k9o0r9j67JJ62J26j21M1p4j26P5r1M0J22K4O6j5p0k58K61
5535a4q2P0k1J22M8K2k61r4O9J47Q4Lm4J46k16K4k63J24L48M8k74Q8r1j64J5j59
$$ plain form
5365 168 75 -48 -176 -77 144 -55 154 101 163 77 -11 -254 -119 340 284 103 -188 -81 32 -138 -113 -57 -83
5388 -83 361 130 -34 24 -174 -76 -133 -47 14 329 84 -217 -228 -39 74 22 -61 146 206 99 -206 -162 -194 9
5412 9 197 260 -43 154 -58 28 28 -226 86 184 217 -185 -121 -40 -285 -187 196 137 219 247 105 8 -140 -193 217
5437 217 100 34 273 310 -196 -131 -168 193 242 64 105 4 36 3 -191 266 145 238 106 174 144 -16 97 -86
5461 -86 77 103 317 133 106 -99 -45 -33 196 -19 109 183 112 -59 -136 -2 93 128 284 3 -45 104 -209 -18
5485 -18 -5 65 134 -16 -38 -187 -25 -120 -34 28 33 61 -6 36 -99 -131 51 4 138 -104 0 344 3 -367 -216
5510 -216 122 -6 -37 178 149 89 -10 -177 -176 -14 112 -9 32 -42 -168 -93 -184 -144 -22 2 68 53 -17 -275 -14
5535 -14 -96 -26 -47 75 123 145 -116 -210 -141 6 90 93 49 195 -21 3 -260 -136 212 260 -14 74 -17 -181 -166 -325
5561c25L45K51j55J51j70j87j41K9K51J6K05q8j09J7q0j3j44J35J44K19l28j15
5583i2J1j32K8J47L77l90P4Q2k54K36j76q3K38K19r7n5r6r7j65K7M0O6K82k7p0
5608I3j99m3L2N1Q1K39j93K32m75J45j39J77k21J90L3K14k42Q6k03k55K07l8K38
5631A0J17O4m7k53j51J29l0K25J51j69M8M5l4m19J31lK87k7k6o3k86Q2l6K00P0
5656A5J01J81j67l24M8l2M3K16QL0j5j15j50J22o9pL19N6k74M6j11l48K09Q1K64
5681A27n9Pk6j4k69K06j14L0L01Q4l06J50j06j16p5J95J8J20Q8j38l4l0q2o5Q0
5706b8j1N2R6l2n2q9L0M3m3J34r6Q2J8k80J02N0k2j05J22J22q4j5J5p3J90j58
5732c2j4J34M1q7k4j6l7P8JJRM5n0QN0j72J52k2k91K71k6q1k6N9j16K02j07K3
$$ plain form
5561 -325 20 271 116 267 97 -90 -231 -202 49 65 270 182 73 90 10 -3 -147 -12 132 351 23 -92
5583 -92 -81 -213 -185 -38 339 -51 23 105 -149 87 -89 -172 66 285 188 133 37 -60 -225 -198 -158 -92 190 163 93
5608 93 -106 -149 -117 -66 15 254 61 293 -182 -37 -176 1 -220 -30 3 217 -25 61 -142 -397 -190 -228 10
5631 10 127 191 144 -109 -260 -131 -161 64 215 46 94 139 105 -314 -183 -186 101 74 48 -15 -301 -219 -255 -55 15
5656 15 116 297 130 -194 -146 -178 -135 81 89 119 104 -11 -161 -39 -108 -115 204 260 -14 32 -79 -427 -218 -137 127
5681 127 68 75 49 35 -234 -28 -142 -112 189 273 -33 117 11 -105 -180 15 33 153 241 103 69 39 -43 -108 -28
5706 -28 -39 13 109 77 25 -64 -34 9 -34 100 4 86 104 -176 -74 -24 -46 -151 -29 93 9 -6 9 -64 126 -32
5732 -32 -46 88 129 42 18 2 -35 43 44 45 54 99 49 57 107 -65 87 65 -226 45 19 -62 -88 -29 -145 57 -50 -27
5760b7kj22J37j0L9L4r2J66k06M0j11L9K17l6j76J41k27L14n2kPq0J54l50O6M0
5786i9J11k20L85q5j20L0j79K01j02K53j83K7j86J76k37K70K4o4j0O8j01N8j84
5809a67P8pJ27k78J71K09L09l31j32O7l09K73l4j3K17R5k08k49rJ09k8K27p6J25
5833A66j4mj12l43J42L15J65l53J31O6k0k43K5m7J80J46r0Ol88Q1M3J70J23l1
5857A14N1K10n01J12q2q8J2K73R5j06Q6k25j58p6K47K56j10j16nK23j80q5rj11
5881a73L93j1j28j27l8Q4j60p4K79K6J62j34j14k80K50j43Kj5L18k0j67N9l02
5904c13J03J74n2L4J13j4Q9k98N1q9K11l7J60j59J50J0k84j54M08k66K40j48K12
5927A41k92J52JJ3k37K78J4O1k5k50R6J84P5j58J7N1j29nM1r1J07k48L31l4l8
$$ plain form
5760 -27 -29 -151 -14 -24 15 49 -43 123 -83 -43 -154 -115 102 66 -110 31 -196 118 66 64 71 -9 145 -205 -139 -99
5786 -99 12 -208 177 92 -28 2 -177 24 -78 175 -8 19 -167 9 -228 42 66 2 -8 60 -41 17 -167
5809 -167 -89 -96 31 -247 -76 133 442 111 -21 46 -263 10 -24 -37 180 275 67 -182 -191 -82 -110 117 41 166
5833 166 152 148 36 -307 -165 150 315 -38 93 159 139 -104 -79 -126 54 200 110 116 -272 -191 -148 22 145 114
5857 114 165 375 -126 -14 -96 -184 -172 101 196 90 176 -49 -207 -283 -36 220 110 -6 -11 212 32 -53 -62 -173
5881 -173 220 209 81 -46 -84 0 -160 -234 45 71 233 99 -15 -295 -45 -188 -186 -201 117 97 -70 -11 -313
5904 -313 -210 -36 -88 -54 59 45 134 -164 -113 -202 9 -28 132 -27 123 133 -151 -305 103 -163 77 -71 141
5927 141 -151 1 2 15 -222 56 70 131 106 -144 -48 136 211 53 70 121 -8 -13 28 -63 44 -204 127 93 55
5952E5J6R3j91q2J63j45K07q8K29o5j3l62R9L26q6k5j70J01j40M8j34J51lK67
5976B51j68j72K74m7n0j7j46J02M6j4J31j78r6K76r2j21j26J81O5j69J05p1J4
5999b2J11J0r0j24L24j66o3R9k6p7J03j03M4JK12k12o3m7J34j43J19o2r0J81o4
6024a4P9j75N9M8m1K5J13j55M4J50k08O6M9k10K1K59r8O3m5k9k17P9J29J47p3
6049F6J3n9M3j59j43J04j06L78j99K0K1P0J17k44jj6K13J3k83J76J3j13l8J05
6073iJ44j49J60j38l5J55j15m1J14j31J83L2j44n6llJ59L1J4K7j17l1j16p4K9
6098a14O8OK03q7m8j48m3L6J71n2J47n7k16N1p4J48j88K15J10m8J00k9j75j81
6122b05N9m3O3L03K8r5j5k85M6J20N8LJ55k69nJ20k7j64N0J83J66j31p1j66J24
$$ plain form
5952 55 71 164 -27 -109 54 -91 116 28 257 192 179 -183 -84 242 156 131 -39 62 -78 -30 -164 -13 -16 251
5976 251 83 -89 185 138 88 71 -75 27 73 59 190 12 -84 192 100 -21 -147 34 99 -70 35 -36 -22
5999 -22 89 99 9 -115 209 43 -20 79 53 -24 79 -24 20 21 233 21 -42 -89 45 -98 21 -41 -131 50 -14
6024 -14 65 -110 -51 -3 -44 -19 94 -61 -17 133 -75 -9 40 -170 -149 110 12 75 30 1 -216 -137 -8 139 66
6049 66 79 20 63 -96 -239 -135 -241 137 -62 -42 -21 49 166 -78 -79 -95 118 131 -152 24 37 -76 -114 -9
6073 -9 135 -14 146 8 -27 128 13 -28 86 -45 138 170 26 -30 -33 -36 123 154 168 195 78 47 -69 -143 -114
6098 -114 -46 -40 163 76 28 -120 -163 -127 44 -8 139 82 -134 -83 -157 -9 -197 18 128 80 180 151 -24 -205
6122 -205 -146 -189 -126 177 205 110 95 -190 -144 -24 34 37 192 -77 -82 38 11 -153 -103 80 246 115 44 -122 2
6147BK90l77K8O7J62m5j90L7o7q8K47Mk15J98j4r4j04O5N9r6m6K89q3k7j10P4
6173c4p4l1J07m5J51P5k9r7J50j69O8q6m0K25p9N9k17P9P6j38J26J57j46l8m1
6198IK9j08n5L11k16K92k45j3p2J28M4j36j40K48J1j8q6k8Q8k87K02j6L12k22
6222C2j28K22j50L0o7n5J58o8K46n5k45o1J25k5J59j57J16nq6Q0j89K4J10K4j24
6247h9J04j52J70j90L19k36j09K20L9j07N8k11K46j85j9O2J39M9N8j27j96P0p3
6270a60J10j2j1j05L09j64O1m4j33m2O8L5j24L01j36R1j13k14J93J55j11J50q4
6293B0j29J69o6j77l4L39j51J31j50P5m7q7J90k11Q2L24m5k22j28o8J79O2N7j49
6317c6J90J1J6j99m6j65K64j9N5O4Nk04J5q0QQ5J6R5p2K5Lj34LJ36J56k12K24
$$ plain form
6147 2 292 -85 -57 10 172 127 -63 -26 -93 -181 66 70 -145 53 39 -55 -159 -94 -35 -131 -177 112 29 2 -108 -34
6173 -34 -108 -139 -32 -77 74 149 120 23 173 4 72 -14 -54 171 92 151 -66 13 89 -49 77 234 88 50 9
6198 9 38 -70 -125 186 -30 262 17 4 -68 60 104 -32 -172 76 87 69 -17 -45 43 -244 -42 -58 254 32
6222 32 -96 126 -24 6 -61 -116 42 -26 220 165 -80 -141 -16 -41 118 -39 77 72 -14 66 -123 -99 11 35 -89
6247 -89 15 -137 33 -157 162 -74 -183 37 76 -31 27 -184 62 -123 -142 -80 59 108 166 39 -157 -87 -160
6270 -160 -50 -62 -73 -178 131 -33 28 -16 -149 -191 -123 -88 -212 89 -47 44 -69 -283 -90 65 -46 104 20
6293 20 -109 60 -6 -183 -217 122 -29 102 -48 27 -20 -107 83 -128 -46 278 233 11 -117 -185 -6 56 113 -36
6317 -36 154 165 181 -18 -64 -229 35 16 71 135 140 -64 -49 -129 -121 -36 -20 75 3 28 31 -103 -100 36 192 -20 204
6344B04N4m4k24j75J53oK40l1j91J43k00L5K1n8O7l4J01n7Orj22J21Q2j51K36
6369A61p3K6j74NJ6mO4K44j40K7r2p5k21K60K5J50r6j54K33k82M3p1j01J44J91
6394A06m7J53k0k94m3K5j2J08m5J28p4Q5j46rm3J74M3o7L7j18P6q8J33N2q9j61
6420a36r4N14k18L6j45p8M6J98j36O5Q5k02O3j25K84o6ok7j09n2M8J24m6r3R5
6445B5j61K42Q3Lk56L2K90l85K47k02L11j36j58J6J42j42k4K67j96l9J15j60J08
6468B2j08q2J62L3l8J25q3j7k37L28j37K04%p6j34N3K59j55j90K0R9j57J49L0
6492G0n6L1J17j47j48K33j28lJ66O0k84J55j46J31MJ43k73%K4J73j40j43J57J13
6516A09l4Q5l3o1j46l7J09n3KJ27O6j9Mk72P6o7K96k56J6J98Q4l14j41K91J18
$$ plain form
6344 204 258 214 -10 -185 -32 -38 202 171 -20 123 -77 -42 -21 -79 -12 -46 55 -2 4 -5 -127 -6 76 -75 161
6369 161 88 114 -60 -55 -39 -43 21 265 125 152 60 -15 -236 24 49 199 103 -51 182 -100 -57 -128 -229 -85 106
6394 106 59 212 192 -102 -145 -120 -132 -24 -69 59 -15 70 -76 -85 -128 46 89 22 59 -59 17 -71 62 114 25 -136
6420 -136 -230 284 66 102 -43 -121 -75 123 -13 52 137 -65 -2 -127 157 91 85 58 -51 -103 -55 69 23 -70 25
6445 25 -136 106 189 192 -64 -32 258 -127 120 -82 229 93 -65 -49 93 -49 -73 194 -2 -41 74 -86 22
6468 22 -86 -168 -6 27 -11 114 31 14 -223 105 -32 172 172 96 -38 15 274 119 -71 -51 48 -109 40 70
6492 70 14 45 162 15 -133 100 -28 -31 135 195 -89 66 -80 51 55 198 -75 -75 -51 122 -18 -161 -4 109
6516 109 75 160 127 66 -80 -117 -8 -61 -59 68 134 115 119 -153 -77 -144 152 -104 -88 110 194 -120 -261 30 148
6541A48j9j93J16j85J74m2J54k94J19K45k01k06K12k1L6o9J7q6J24P2r9p4p3K06
6565F1r9J10O0k9J13j17K6k26M8N7O6j73K34j28J48l09R8J11j44K91o4J28k02
6588F0n4j33J36j85K23q9J49m0j49p9K9K64k29L1J49l0k17K69p2j84J16J28L7
6611A30j33J29j8j33j02L4L6J29k4M7m4o8l4k8R3J4o5j81J80J09l0k32K09p3J55
6636A00k19J74k3Kj06jR4j04K35j33j01J96q2K8P0j41J0n8J27j71O0J53j17l5
6660d2q3P7j7P3j0M4j9q5J79r9J3J25m6j18j17J70L8j19J62k55K04q8k13J44P
6685g5R1K3Q0kP5j37j06K9j44K16Kk22L35k4N6j40n9PQ2j48m2J30J98j3j67j42
6711i7pK53k79J47J6j11k5J56p1o5J11L7j28j5J18j67L51l59J15R8L2j9J08j35
$$ plain form
6541 148 129 -64 52 -133 41 -1 153 -141 -22 223 22 -184 28 7 43 -26 -9 -95 29 101 2 -72 -145 61
6565 61 -38 72 132 103 216 99 125 -101 -53 4 70 -103 131 3 151 -158 -60 51 -93 198 134 262 60
6588 60 6 -127 9 -176 47 -42 107 67 -82 -161 -132 132 -97 -66 83 53 -164 105 33 -151 -35 93 130
6611 130 -3 126 108 -25 -127 -93 -57 72 48 95 51 -17 -51 -79 14 28 -37 -218 -38 71 41 -191 18 -55 100
6636 100 -119 55 32 34 -72 -73 21 -83 152 19 -82 114 32 60 130 -11 -1 -59 68 -103 -43 110 -7 -42
6660 -42 -125 -48 -65 8 -2 42 23 -62 117 18 31 156 110 -8 -125 45 83 -36 126 -129 75 -13 -226 -82 -75
6685 -75 16 39 119 117 192 55 -51 -22 -166 50 52 -170 165 141 197 57 -2 5 87 -61 -103 27 225 212 45 -97
6711 -97 -104 149 -130 17 33 -78 -103 53 -18 -83 28 65 -63 -78 40 -127 224 -135 -20 78 110 91 199 64
6735F4R9K3k41m9Q2L0J48k8j62j4J16Q8k34Q7m8M9M3j97P8R3q9k6K51n3j85L15
6761B40k44L07l46R9k9j68M8K14n2P6j74p0R3k6j07J80J84k48O2j29j1m3p7L15
6785I4J2k23J31k5n1j47J05M3J04M2L5k91OJ00q5j07L10L7L1P0k70J88j82Q3L
6810A3P3J76k92m7J35p5N2l3k82L12J4N7J6k01j67J79K53j37J29j12k15K05k3
6833C0j27J2K13J47l01M5J47k57M8L6j49R3J86r2J40k28J86j13l6J39J34k80K25
6856A98k62j21Q3J22M3n2K1j1Q2o2R3m18K01K38j80o4O7N4Pj82N1L3J95j04k5
6881Gk07K73j40k1NJ09k60J41J39n3o4K0M7k14K63j78K27j59M7J46j62kr4K03
6905G3M9q1R0k52R4j19K17o1N8j81R2l9L2N6j39J81l4O1p3J37k18L8q6J86k8J16
$$ plain form
6735 64 163 186 -55 -104 -22 8 156 128 -34 -48 68 156 -78 9 -39 10 53 -144 -66 27 -62 -88 163 110 -75 240
6761 240 -4 303 -43 56 27 -141 -93 121 69 145 -29 -99 -6 -32 -139 41 225 -23 39 -90 -101 -144 -221 94
6785 94 106 -117 14 -11 -62 -209 -104 -61 43 85 120 -171 -165 -65 -150 -257 53 90 121 191 -79 109 -73 10 13
6810 13 86 262 -30 -77 58 -17 35 2 -280 32 46 103 119 -82 -249 -70 183 46 175 63 -152 53 30
6833 30 -97 -85 128 275 -26 19 166 -91 -43 -7 -156 -63 123 31 171 -57 129 16 -20 119 253 -27 198
6856 198 -64 -185 -102 20 63 11 32 21 103 41 134 -284 -83 155 -25 -89 -22 32 39 -143 -92 -59 136 32 7
6881 7 -200 73 -67 -88 -83 26 -234 -93 46 -7 -71 -51 -4 -218 45 -133 94 -65 -18 128 -34 -36 -130 73
6905 73 122 41 131 -121 -27 -146 71 10 68 -113 -21 -60 -28 28 -111 70 36 97 24 161 -57 -19 -105 81 53 169
6931A69m7j56j67J05J50k00J74J33l59J75J39N6k51mJR2j54J52n6J46m7n7Q8r4
6955a2J11l61L26l0J39j42j87O7J63qk33q8K40J98j74K9j5l3J25j13J59q6q1K3
6979A7N1j07O3n5N5l9NQ7n8O3p3J32j08J03j56j09L25j65p0P9k32K35j9P7j17
7004a6p9O2j02J35J56j06l2J21p3k02N0O1P2L1j05J61j65K01j95j8o9j24K47j31
7028a20J44J2R3j95j70J89K88j83j25J64j92pJ70l20L25j32K32k31J23j25j2N5
7050a7o9j5J66j13J83j30j6m6L8j52K31j26l8Q9m2mO8O7j78J97j68lJ44j2j5l4
7076El7K97j60k74J56Q9l2j68K67j63L2J73j83J22m2j4l4j82J82j1j30L67l80
7099a20K20o7l5N2j59N5J97r8l4q2m8M2J63q1j42R0Q2L9j74K00j65R3K4j41R7
$$ plain form
6931 169 122 -34 -201 -96 54 -146 28 161 -198 -23 116 172 -79 -83 -82 10 -144 8 -48 98 51 -6 82 -12
6955 -12 99 -262 64 34 173 31 -156 -89 74 66 -167 -255 -15 183 9 38 23 -10 115 2 161 75 -6 17
6979 17 68 -39 24 -31 24 -15 -10 77 19 82 9 141 33 136 -20 -129 196 31 -39 40 -192 43 24 101 -16
7004 -16 -95 -33 -135 0 156 50 18 139 66 -136 -86 -25 47 78 -27 134 -31 170 -25 -43 -112 -236 11 -120
7028 -120 24 36 129 -66 -236 -47 241 58 -67 97 -95 -102 68 -252 73 -59 173 -58 65 -60 -72 -17
7050 -17 -86 -101 65 -48 135 5 -11 -57 -19 -171 60 -66 -104 -15 -57 -61 7 74 -104 93 -75 -78 66 54 39 5
7076 5 -32 265 105 -169 -13 76 44 -124 143 -20 12 185 2 124 82 68 34 -148 34 23 -107 260 -120
7099 -120 100 33 -2 50 -109 -54 143 45 11 -71 -119 -77 86 5 -137 -47 35 74 -100 100 -65 28 52 -89 8
7124Hj00J16K8l1m2m9Mj36L18j13L6m3p8J06n5J45j68P0ok10R5p6K25j17R8J07
7150A32l23K15p5k75J51L23N1r6q2k8l05J74J32m5J66j55L69j69l55M22j65r1
7172b9Ol3J46Q6j06l9j19J08O9O4Rk02l9j02L24j05j29M4J79l28K79Q9k16K18
7196A74l13J08j00K76q9L6j2l8r7J48%r3k5j8J4j84K22ml7j25K49j72J5O9J83
7221A87J35j66k85O8Q1k1P0nj55J57R7j64n5q7K95m4Q0k98L8m1J71n5k4L4P3m2
7247D4j15Q9K4j54J45r8P0j9M3O2j51LJ1K13l42K64j81O6Jj72J15q1K40m3j6j08
7273i0O7N5N6j57nM8Q3Rj44J76k06J44J9m3k05L5O8k5J01Pm0N5l9O9M7r3m5n2
7301a05O4l5J92m2l21K12J1J77p1n3j88J78j12Qj7K50j55R9j6l3J6p8J41K1n6
$$ plain form
7124 8 -92 24 52 21 -21 -70 -66 -202 116 3 39 -4 -82 24 -31 114 -54 16 10 -200 -105 -181 44 -73 25 132
7150 132 -191 24 -51 -326 -175 148 199 103 21 -7 -312 -138 -6 -51 115 -40 329 160 -195 227 62 -29
7172 -29 -23 -56 90 176 70 31 -88 20 89 153 162 -40 -79 -181 143 38 -91 -47 132 -196 83 172 -44 174
7196 174 -139 -31 -131 145 56 92 80 42 -55 93 93 0 -25 -43 -29 -213 9 5 -32 -157 92 -80 -65 4 187
7221 187 322 156 -129 -61 20 -1 69 64 -91 66 163 -1 -56 -143 152 108 188 -110 -72 -113 58 3 -21 13 86 44
7247 44 -71 18 42 -112 33 -65 5 -14 29 91 -60 -57 -46 167 -175 89 -92 -26 -25 -197 -82 -163 77 34 18 -90
7273 -90 -23 32 88 -69 -74 -26 57 66 -78 98 -108 36 55 12 -193 -158 -90 -115 -14 -7 -47 8 -31 38 85 -8 -53 -105
7301 -105 -41 -76 116 74 -247 -35 -24 153 82 29 -159 19 -93 -85 -102 148 -7 92 76 43 59 -19 122 143 87
7326H7Mo5j8oR3k42J85J46l4j07k8R2o0j4P6Qk7j09j50J10j36L77j56P5j10Q2
7352G3j16O0j59K53j61N0N0r5n0M0m1P6j67K71J82P8k10j30p3L8O1Rl9N4k1k3
7378A0o5L3m7kn8P9j21K47j31J60J4j04k8o4K24j85o5J29N3j14q9J76O3rj0p6
7404B0j03K00O0l18J73j17L18l39M1p1J61J14M5j63K8q1k4L2N7k0o7K6J5P5J22
7429A84j48j42J9O3L6J64j85J27N9j82N9p0j29R9M1p2k3J56N2j89J77j66J84o2
7453E2L5L2k07P8jJ64j68l9K36j05P2k31J30j35n6kK59K9r6K7l0J73k06N2j98
7478a35J45L20j76N2m35K74Q3j71o3J19qP5j47J04O4k20K6J58L29k93m6K4j63
7501h4R9j25m9J60M2j33R6J91l08J1j58P7L34l1L0k53P5M1n9K7j49J74j48K94
$$ plain form
7326 87 91 26 8 2 95 -147 38 184 150 43 15 107 47 33 109 117 90 -19 -169 -59 -195 182 26 101 -9 73
7352 73 -43 17 -142 111 -50 0 50 -45 -95 -55 -96 -20 -187 84 266 344 134 4 -69 -31 30 39 0 54 33 10
7378 10 -55 -22 -69 -71 -129 -50 -171 76 -55 105 119 15 -13 -77 147 -38 -103 26 79 -35 -124 52 115 106 96 20
7404 20 -83 117 177 -141 32 -85 233 -106 -65 -136 25 139 184 21 49 -32 -56 -24 33 13 -54 -28 -13 62 184
7429 184 36 -106 -87 -24 12 176 -9 118 177 -5 54 -16 -145 -46 -5 -77 -100 56 108 -81 96 -70 114 52
7453 52 87 119 -88 -10 -11 153 -15 -54 182 77 149 -82 48 -87 -143 -145 114 143 47 74 44 217 11 63 -135
7478 -135 10 330 154 206 -229 45 128 -43 -106 13 5 80 -67 37 101 -119 -93 65 394 101 55 79 -84
7501 -84 15 -110 -159 1 43 -90 6 197 -111 -100 -258 -181 153 122 152 -101 -26 15 -44 -17 -166 8 -140 154
7525A54k74Q7qjO1r8J6j09K21K4j77%j5J64J43k51J79k31J25J09M8l5j36o6M7
7550b3J8n7J21j78pJ61K68k96K9J80k76M3o9Q7j0M8N4j49Q4j6j75J16l8R6P3k3
7576F1Pj47J07m9R4Qm7k4N5Nj19P6J05j45J33j26R0o0Po1nP1P6j72R7k56L01l15
7604b33K83p6m5Q3j1j23J61p6R5lM7Q3l92L28m5J68k27j01J8P3K14k07J44r2j50
7629h4l6J07n0Lr3J68O7j01P6p0j43L6N2Q3J15l1Q2k71L3L5l0J15m4j67J03J69
7655A24q6j59J88N0k11J38rr9rJ98k8m3K9j26O7J35j41k12J81j9k0p9k1P3K19
7680A40j92J2J15j98l6K12po1R8j55Q7J22k20%J11M9J21r4j88J22l19M60k14j59
7704a94J68J0J52N0m1j65o7J83rn1J40l2j67q5K3K30p2j46L5P7Q2j05j12J96q7
$$ plain form
7525 154 -120 -33 -41 -42 19 -79 -63 -172 49 73 -104 -104 -119 45 188 -63 116 -115 10 119 167 132 -4 -70 -23
7550 -23 -5 -62 59 -119 -126 35 303 7 36 216 -60 -17 -86 1 -9 39 93 -56 28 12 -163 -47 -85 11 84 61
7576 61 68 -79 28 -21 73 81 34 10 65 70 -49 27 132 -13 120 -6 84 24 31 -30 -35 36 112 -60 37 -219 82 -233
7604 -233 50 -26 -71 12 1 -122 39 -37 58 55 102 185 -207 121 76 244 17 -84 -66 7 221 14 158 66 -84
7629 -84 -120 -13 -63 -60 -153 15 82 -19 57 -13 -156 -120 -68 15 130 99 181 -90 -57 -22 -52 63 19 -148 -45 124
7655 124 38 -121 67 117 -94 44 35 -64 -73 125 97 54 83 -43 24 159 18 -194 -13 -32 -52 -131 -152 -79 140
7680 140 -52 -40 75 -123 -159 53 46 -15 83 -72 15 137 -83 -83 28 77 198 104 -84 38 -281 179 -35 -194
7704 -194 -26 -16 136 186 145 -20 -87 96 87 36 176 144 -23 -108 -85 145 73 -73 -38 39 121 16 -96 100 13
7729A3j27K04j30l5J29N9r0j48N2J67m7P2j23O8k24J18J0j75L46K3lj37k09M7
7753a40K8K98j70n8J33l20M4p9M49l23P3k4P6K00%j88j30O5J72k7k19j11L92r5
7777D6J27l50K43m8N2Jq9J51k06P8k21K54n8k6qJ0r0M5L4L4P5n1Q5j24K04k96
7803a28J92j4O2r5j14J0K73j01l0j91R6R8J14j48q5r4L2J56pr1K05j93R1m3o1
7828f6O5K3O5l65K52R6j59J17J56j98J2q1J03P4n7p6J20nk02J99N7j50J27r1J80
7853A96p8J2qj86oJ30j56Q4j7R4k36p8K14n4L95n83M21l5k2%P1J9j48r5R6L8o8
7880@L7o9j62J20N1j2N3o9J07pn8l9J24j83J48j22M2l19J50K86N8j07n7m2N3O7
7906E0j00m8Q7K4j88M2L38o7k11K02k97R5J44K3M5j62J27j77J20k7O0k26J70J47
$$ plain form
7729 13 -114 90 -40 -75 54 113 23 -125 -73 94 47 119 -4 64 -160 -42 -32 -207 139 162 159 22 -187 -140
7753 -140 -112 186 16 -42 91 -229 -185 -264 185 -138 -65 -89 -13 187 187 -1 -131 -66 106 79 -140 -251 141 46
7777 46 173 -177 66 18 70 71 -18 133 -73 5 -216 38 -20 -46 -54 -44 -134 -89 -55 -21 54 3 88 -36 168 -128
7803 -128 64 50 112 17 -97 -87 186 85 55 -136 -40 58 172 24 -61 -155 -123 33 26 -65 140 -53 38 -5 -66
7828 -66 -1 22 87 -278 -26 70 -89 28 184 -14 -2 -83 20 94 37 -39 81 76 -126 73 130 -20 107 16 196
7853 196 118 130 122 -64 -70 60 -96 -12 -29 65 -171 -249 -35 -89 306 -277 144 109 87 87 158 177 29 -66 30 68 0
7880 0 37 -32 -194 -74 -23 -35 18 -51 56 49 -9 -48 76 -107 41 -81 -39 -358 -208 78 136 29 -28 -70 -17 50
7906 50 -50 -98 -11 13 -175 -133 205 138 -73 129 -168 -73 71 94 139 -23 104 -73 47 20 80 -146 24 171
7930A71j39P9k15K45k73j0K18p7k07K76j90J28j15R8j77K70l52L30j49k3m4K12
7952E6j31p1P4K10m8j19N3J81o3j25j58J91j96L05l33K32L0j60q3N2J49l5J2M8
7976G1n8r5o2J11j20J98J07j54K8j2N0Pj59J83j87J20K9P5j49k12K86n5PP1M7
8001A27j52j01N0J40j98J55j26Q3K07l17J79j13P0p5K32j60kJ5j2j07o3K42k5
8024D9J51k0k9k33rJ39j74N0j01K98j37J32j32p4q7K81Pl34O9O9K50l12J32P3
8048E8l5k7j31L68k05Nm9M3r6K22j99q3M8M01l46j6r0R6j9q8K21j28j6K28j38
8073B4n7J32j04J95k45J01J1l5O3k6j83k9J40J66l14L44l29J85j18Q7N0J70j28
8096A00m9m6j37K06ql06J91Q4k9kQ5r9P8j46J0J00n5R5r0P7rq6m3R1J7K3l6K3
$$ plain form
7930 171 32 111 -104 141 -132 -142 76 -1 -208 68 -122 6 -109 -11 -188 82 -270 60 -89 -112 -156 56
7952 56 -75 -146 -72 138 90 -29 24 205 142 17 -141 50 -146 159 -174 58 88 -72 -155 -103 46 11 23 71
7976 71 13 -82 -144 -33 -153 45 152 -2 26 14 64 71 -88 95 -92 28 57 132 -17 -229 57 2 9 80 127
8001 127 -25 -126 -76 64 -134 21 -105 -22 185 -132 47 -66 4 -71 161 1 -1 14 2 -105 -168 74 49
8024 49 200 180 151 -82 -91 48 -126 -76 -177 121 -16 116 -16 -90 -177 104 111 -223 -154 -85 165 -147 -15 58
8048 58 23 -4 -135 233 28 33 -16 27 -69 153 -46 -129 -81 320 -26 -42 -132 -36 -55 -143 78 -50 -66 162 24
8073 24 -33 99 -5 190 -55 46 57 22 85 59 -124 -153 -13 153 -161 183 -146 39 -79 8 58 228 100
8096 100 51 5 -132 74 66 -240 -49 35 6 4 89 -10 68 -78 -68 32 -23 72 -18 59 50 -36 -79 12 29 52 16 39
8124C9Nj25J03L2j95J45j85K38nr4O9q2lJ57q3R7j79l4J0OK47k83K40j36j82K17
8150A9N2P6k25n4J76j4M8r6j38J06k03R4P5j17J65J14j27Lr4J46l0o4O8q5Q2Q8
8176F5j17L3j47J91o2J51q2n5QN6j3q8J63J2k00
$$ plain form
8124 39 44 -81 22 54 -141 4 -181 57 52 -42 27 -55 -58 99 16 113 -66 -100 -90 -84 163 -120 120 -16 -198 19
8150 19 71 147 -78 -132 44 30 78 -18 -156 -50 -253 -159 -84 -201 -36 78 -49 -46 -140 6 -24 -88 -20 -105 -23 65
8176 65 -52 -19 -166 25 -37 114 32 -23 -15 41 28 -60 103 115 -85
8191h5
$$ Imaginary data points
##PAGE= N=2
##DATA TABLE= (X++(I..I)), XYDATA
0@%%%qJ6j6K4l2M0n6P2q8J12j36J68k08K44k92L47m06M78n58O52p54Q66r96J135
27F04j289J465j657J868k102K359k642K950l289L661m069M519n012N551o148O807
43C576p537Q349r256J0280j1437J2763j4301J6100j8243K0854k4113K8312l3966
56a8619M2045n4618P7097j29760M74983M14026n98549j58908N0808J61752n3523
67B06734P3755K22599K34283j49570m08930l32670Q7047K99011J90264n3793l3760
78C34970O6264j5693k86344k92075M0154L57175K58436n7070k04176p7455R318
89A33504q1404j60445O202K50674K55018k5446k53693j98230J0138Q1960J100
100A9378k2529J00237J66989R476k18117k21338L233J63062R5381k7439j1326
$$ plain form
0 0 0 0 0 -8 8 -8 16 -16 24 -32 40 -48 64 -72 96 -112 132 -160 187 -219 259 -299 353 -401 465 -531 604
27 604 -685 780 -877 991 -1111 1248 -1394 1556 -1733 1928 -2141 2378 -2634 2917 -3231 3576
43 3576 -3961 4388 -4868 5412 -6025 6738 -7563 8537 -9706 11148 -12965 15347 -18619
56 -18619 23426 -31192 45905 -83855 391128 805154 206605 47697 98505 260257 206734
67 206734 280489 503088 737371 587801 178871 -153799 -66752 232259 422523 368730 334970
78 334970 401234 385541 99197 -192878 -152724 204451 462887 405817 201641 124186 133504
89 133504 52100 -108345 -102143 148531 403549 378103 124410 -73820 -63682 18278 19378
100 19378 -3151 97086 264075 273551 55434 -165904 -162671 391 95772 68333 57007
111E7007O3173J4202j25839j59927j9905J40007J44803J3774p8827l8342K4764
122C4890k4998j12479n4459J19363J74494K8449j13116q1352J5798P958o1375
133f6827l4293Q6879J42169M7346r1902j25224l9265L8792K3605j5720K7520J07409
145A00489P6974p4743j68154q2524O5728R4985J6634r721N3843O5500n2287j64019
157g7295j07178O3537J50188P9307k4060l4952M522j8258r7388j00948L2734J70306
169D0515J38555l0851j31798p0348J5551o427n4392J0496J32300J29836k5180
180A48257j59362j29219N346Q2099M5388l329K6649P1831P904j29332j55278m996
192a94042J44620J18895r539n6525n836N399o4611r5797k028J24242J35294J8216
$$ plain form
111 57007 120180 134382 8543 -151384 -171289 -31282 113521 127295 48468 10126 34890
122 34890 9892 -102587 -157046 -37683 136811 165260 52144 -29208 -13410 -5452 -66827
133 -66827 -101120 -14241 127928 175274 83372 -41852 -81117 -42325 -18720 -34440 -6920 100489
145 100489 177463 102720 -65434 -147958 -82230 12755 29389 19668 73511 139011 86724 -77295
157 -77295 -184473 -120936 29252 108559 84499 49547 54069 35811 -61577 -162525 -129791 40515
169 40515 179070 148219 16421 -53927 -38376 -44803 -99195 -88699 43601 173437 148257
180 148257 -11105 -140324 -134978 -52879 -7491 -10820 15829 87660 95564 -33768 -189046 -194042
192 -194042 -49422 69473 59934 3409 -2427 2972 -61639 -157436 -159464 -35222 100072 118288
204A18288r5584r6520k1333J9447j39K598O8053J07260K7711j06291j38780l8633
216a53923O5923P2202K9329K5635L9059n168r0033j14414l6653O9378J09064O8750
228G9149K067l7743n0770o1332o2428j6678P0915J21845P5506k3057q0417p5145
240e8088n0405k0310L2165R0019R7531L8596m2111r1317q8088l9294K6916P5679
252b8707Q6081N9029P97o8567j02900o9872M003O1051P7205O6960L0420l5610
264G9890r4793r1453k5087M6006P6506O8773L7375j1927o2945q2086n2473Q318
276a03896O6229Q7596N6109q738o0804o7046m0176o361L0299O6523P1435K4126
288A15296m4961p8044n7677r480L5631N8366M9674J7199j7101m1920n7552m8492
$$ plain form
204 118288 22704 -73816 -95149 -75702 -75841 -73243 -5190 102070 129781 23490 -115290 -153923
216 -153923 -88000 -15798 13531 39166 78225 73057 -16976 -131390 -168043 -98665 10399 79149
228 79149 81216 43473 -7297 -68629 -131057 -147735 -76820 45025 120531 97474 17057 -58088
240 -58088 -108493 -128803 -96638 -6619 90912 129508 87397 -3920 -92008 -131302 -104386 -28707
252 -28707 57374 116403 117200 48633 -54267 -124139 -120136 -59085 18120 85080 115500 79890
264 79890 -14903 -106356 -131443 -85437 -8931 59842 97217 85290 22345 -59741 -112214 -103896
276 -103896 -37667 49929 106038 97300 36496 -30550 -70726 -77087 -46788 19735 91170 115296
288 115296 70335 -7709 -65386 -74866 -39235 19131 68805 86004 68903 26983 -30569 -79061
300g9061L000O6712P8291K4203l4319m6968l1150k2932j6440J4211N6606O6507
312G8660K1934m4997p4320l9625J7027L5599J7250J5106L9145L2631l1217q3622
324a6429n2408K8893O5761L2698n287k63J6381p003n5805o3360j432P0755P2356
337H4857O471m3065k4843O818j5313n6238k7559O0786R8591L1022n7651o7890
349d014j6276J0613q395j4381L2821P9434N1658m0568j01204o1566K5195N7983
361A1300K3429L019L2162M0549k7770j01370p5880K8922R4223O2452k754k6143
373F2139j5812k4717n3330m5767K3053R3011Q3316n255p7849o8728j5472Q640
385c6771N737K8120O8435N6955k3949r3530p8157k829N3190N6953L7257K0483
$$ plain form
300 -79061 -76061 -9349 68942 93145 58826 11858 -19292 -42224 -58664 -44453 12153 78660
312 78660 100594 55597 -18723 -58348 -41321 -5722 11528 26634 65779 98410 67193 -16429
324 -16429 -68837 -39944 25817 58515 53228 52965 69346 62343 6538 -56822 -58254 12501 84857
337 84857 91328 48263 23420 30238 14925 -41313 -68872 -8086 90505 121527 63876 -4014
349 -4014 -20290 -9677 -18072 -32453 368 79802 131460 90892 -10312 -71878 -46683 11300
361 11300 34729 37748 69910 110459 82689 -18681 -94561 -65639 28584 91036 88282 62139
373 62139 46327 21610 -31720 -77487 -54434 38577 121893 116638 38789 -29939 -45411 -36771
385 -36771 -31034 -2914 65521 122476 98527 4997 -73160 -75989 -22799 34154 71411 91894
397I1894j433m0986p3325n6156J5514Q1636P9246K0063l1283m3002m3286m6189
409d7307k0903M3765Q9747O1561j4066o2167n7848l3216j2349J6580N6267P3087
421I3151L5535l6956q3139o2806l106L5739L7038L4738M2853K2158m4635r3185
433b2615n6409L1822P3128M0397J211K455O513k9668o9695m6678L1141Q2210N1484
446I5296j7163m4367j6446L875k3014m3498J670P1678O9280j4104p3116m1474
458c1383J8513J8734k0649j6437L9696O4293P890o6411o7896J462N1075K8125
470B7012j7059q615L5530L0532l8774p8311k1912O2244O6064k043l8680n288K4109
483C4809q854n3926l2247M3394P8342K8692m2746n2480p157J7030q421k3563K1025
$$ plain form
397 91894 90461 49475 -23850 -80006 -64492 17144 96390 116453 85170 42168 -1118 -47307
409 -47307 -68210 -24445 65302 126863 112797 50630 -7218 -40434 -52783 -36203 20064 93151
421 93151 128686 91730 8591 -54215 -57321 -21582 15456 50194 93047 115205 70570 -22615
433 -22615 -79024 -47202 25926 66323 67534 69989 76502 46834 -22861 -69539 -38398 43812 95296
446 95296 78133 33766 17320 21195 -1819 -45317 -43647 28031 97311 83207 10091 -31383
458 -31383 -12870 5864 -14785 -31222 8474 72767 80657 14246 -53650 -52188 -1113 27012
470 27012 9953 1338 36868 67400 28626 -49685 -71597 -9353 56711 54668 15988 10700 34809
483 34809 25955 -27971 -60218 -16824 61518 90210 47464 -5016 -12173 4857 -3564 -27127 -6102
496f102P1029M3625m2416q1196l1605L1236L3025M033J0838L8692K4816l7165
508E8810p3829l8244L0647N9613L2301j360m232K93k4000n3840l4619L1307O9742
521E2589L7929j6638l0389j4120j7438l5219j9435L3100O2588L1144k4525m5519
533A4067k6241o621o793m979K1119M7951L0501k6070n9169l1928J4816K1747o49
546a2249K031L0914L0469j9193n8940l5177K0860L9863J2173j1040K732J9571
558B2014o36m0730m3895N414N1709L6779j4580l1817j092J6110j5339m1520q571
571f6154M8699N1101n480m7032k9048J0004J4423r459j2162K1946M5024J5111
583C6973m1881n5873q189L9240L1417l490n927K0467J6951k7739n4285j9064M0254
$$ plain form
496 -6102 64927 108552 66136 -15060 -46665 -15429 17596 21629 32467 71159 95975 58810
508 58810 -15019 -53263 -22616 36997 69298 67938 63706 63999 39999 -13841 -48460 -17153 52589
521 52589 90518 73880 43491 29371 11933 -23286 -42721 -9621 52967 84111 59586 14067
533 14067 -12174 -18795 -25588 -30567 -9448 38503 69004 42934 -16235 -48163 -33347 -11600 -12249
546 -12249 -10218 20696 51165 31972 -26968 -62145 -41285 -1422 10751 -289 2443 22014
558 22014 21378 -19352 -63247 -57833 -6124 30655 16075 -15742 -16834 -724 -16063 -57583 -66154
571 -66154 -17455 33646 28166 -18866 -47914 -37910 -23487 -32946 -45108 -23162 21862 36973
583 36973 -4908 -60781 -68970 -29730 1687 -1803 -7730 12737 29688 1949 -52336 -71400 -31146
596c1146N5296J9193j9026k1241n917p780k2937j5880K4782N6596L4836k2852
608D3924n2828k8763O356J2412M046J4742L4586K3238k0283n0089l4932O619L3306
621g666K9158J0793Q88k071j1853k7055k5134M962L5724L3470M163j7337j5761
634A2281r639q531l789R771J9034J3006k32j1182j5064j0634J825J1300R747J247
648A9140l383l453k886j986l51J551K375M209J991n594r237O19J3652J0164p132
663A9679j4301k599Q288K740o033j021J0348Q253p635j8175r894P602J5363O045
677A8660q447j0215j40K575p716j1193M183J9138Q820j4784k1826o086Q898R086
691i047K016Q72K393j133r712j5041p258J0780K2845J4118o944j6805j1540l728
$$ plain form
596 -31146 24150 43343 24317 3076 -2841 -10621 -33558 -49438 -24656 31940 66776 43924
608 43924 -8904 -37667 -31311 -18899 -14853 -111 34475 57713 37430 -12659 -47591 -40972 -7666
621 -7666 21492 32285 33173 31102 19249 -7806 -32940 -27978 7746 41216 45379 28042 12281
634 12281 2642 -5889 -9678 93 19127 32133 31901 20719 5655 -4979 -3154 8146 17893 19140
648 19140 15757 12304 9418 7432 7081 8632 11007 15216 17207 11613 2376 2995 16647 26811 19679
663 19679 5378 2779 11067 13807 7774 6753 17101 25354 17719 -456 -10350 -2748 12615 18660
677 18660 10213 -2 -142 2433 -5283 -16476 -12293 6845 15665 881 -20945 -27031 -18133 -9047
691 -9047 -7031 -6159 -3766 -4899 -14611 -29652 -36910 -26130 -3285 10833 3889 -12916 -24456 -28184
705b8184j129M683J5792J8359O650j0452j9174j6697m934J2582K3405J6781L14
718A7996r917j0237j0210j0856k211J5506K5199J5863o337k1426j7118m80J0383
731c845O672J681Q830J5947K398k1473k3388M082K5552J4079j0276j1153Q076
744A7182J3654m075j7948o520J5621J7360n651k2647p724J9277K0823p080k5201
757G071q771J4572P956j5599j4031J4888K7775J845k9538k7395J899J8978R261
770H911o222j478J2751Q812j7882l3576j0746K5296L0659K773j6138o583N080
783A657o240k1387r865J9450L0105R454j7308k1867o833M349J001k996O842J8212
797D574R885j4043k5386r440J1888J3022K240P57O676K175j2025j5259j285J3389
$$ plain form
705 -28184 -29313 -24630 -8838 9521 16171 5719 -13455 -30152 -35086 -22504 901 17682 17996
718 17996 8079 -2158 -12368 -23224 -25435 -9929 15270 31133 24796 3370 -13748 -14228 -3845
731 -3845 2827 4508 13338 29285 31683 10210 -13178 -9096 16456 30535 20259 9106 17182
744 17182 30836 26761 8813 2293 17914 35274 29623 6976 -748 18529 39352 32272 7071
757 7071 -1700 12872 20828 5229 -8802 6086 33861 35706 6168 -21227 -19328 -350 8911
770 8911 2689 1211 13962 22774 4892 -28684 -39430 -14134 16525 19298 3160 -3423 1657
783 1657 -4583 -25970 -35835 -16385 13720 23174 5866 -16001 -22834 -18485 -17484 -20480 -13638 4574
797 4574 14459 416 -24970 -34410 -22522 -9500 -7260 -6503 173 2348 -9677 -24936 -26221 -12832
811a2832J3163L851j010j183l936q487o041M791J4919J2899p52r854n002J515
825B041k344p611K754J9209J5793p779k0530p890Q101M485o902k471J4487J7292
839B8635l223k3876j9441N049J9132O622r856k169J6346J0038k0146l1113j882
852b5884K9582K2152r414j8060L598J5733m647k6551j4438K1393L3375L944k7407
865C376j9472J1131J6933r714k4582J593L2302J8460k4033l4985L74K8953J1461
878A1797k0499j6726J4118K2934o068k9743j1454K4744K7487o447k9923j1143
890c0923K0672J7484j1725j7870J0959K8091J618l1427k3181J4520K8929O486
902A3633j4285n042J1586M306j9375k2341N032L0587K0677j0420k0133l239P483
$$ plain form
811 -12832 331 4182 3172 1989 -1947 -10434 -16475 -11684 3235 16134 15382 5528 526 2041
825 2041 -303 -7914 -5160 14049 29842 22063 1533 -6357 1744 6229 -673 -3144 11343 28635
839 28635 25412 1536 -17905 -12856 6276 12898 3042 873 17219 27257 7111 -24002 -25884
852 -25884 3698 25850 16436 -1624 1974 17707 13060 -13491 -27929 -6536 26839 30783 3376
865 3376 -16096 -4965 11968 2254 -22328 -20735 11567 30027 5994 -28991 -28617 336 11797
878 11797 -8702 -25428 -11310 11624 5556 -24187 -35641 -10897 16590 10143 -19780 -30923
890 -30923 -10251 7233 -4492 -22362 -11403 16688 18306 -13121 -36302 -21782 7147 13633
902 13633 -652 -5694 5892 10198 -9177 -31518 -26486 4101 24778 14358 -5775 -9014 -1531
915a531o454j7550K023K8984K3324r921k6726r867R464L909q986n65K0582K0829
929B7515o311k6775j4930J1719J5817l097j1525O716K2965N234k4254k3009Q973
942a0962K3588L05k1297n111K4507K0042j5503l1524o763K1388J3361j4662j5423
955a8054J4656L0583J680l6549l0745J2828L3750P356k0372m290K6594J4880l0646
968A671m2865j67M3908L3393j0547k6755k079J5263o104l2582j3325L6142N0257
981D6210M120m4990l6783P735K2663k711j4206J5258L9796R983m4169n2544l299
994e2937M1748L3148k906j3218N568P528k3320m2473r145M5268N4648O967l6890
1007A3986k9932o26K042j3609l381L4638M6618O469m3983m8596r444K2206J9831
$$ plain form
915 -1531 -7985 -25535 -23512 5472 28796 18875 -7851 -17718 -8254 -4345 -13331 -13896 6686 27515
929 27515 21204 -5571 -20501 -8782 7035 3938 -7587 -871 22094 27328 3074 -19935 -10962
942 -10962 12626 12931 -8366 -13477 11030 31072 15569 -15955 -22718 -1330 12031 -2631 -18054
955 -18054 -3398 27185 28865 -7684 -38429 -25601 8149 15505 -4867 -9157 17437 32317 1671
968 1671 -41194 -41361 2547 35940 25393 -1362 -3441 11822 5718 -26864 -40189 -4047 46210
981 46210 50330 5340 -31443 -23708 -1045 -3756 -17962 -2704 37092 47075 2906 -49638 -52937
994 -52937 -11189 21959 19053 5835 11403 18931 -4389 -46862 -56007 -10739 43909 50876 13986
1007 13986 -15946 -16572 -14530 -28139 -31520 3118 49736 56205 12222 -36374 -45818 -23612 -3781
1020c781P197J1563J9761P63l7123m7674r885L5566L9366R879r390n209o223k4316
1034a9506k9329j20L6655L9106O291k1951k1973q331m655p152M924K6922K9896
1047C0777J337k9652k8399j225J4857O731J26J1143J8434j296k8264k6150N081
1060b6500K5895J3613o796p526N463M769j3514k0936L26K6067K1942q163k3436
1073h796o083J4293N764j4611j0196J7684K6293n32k6813j6942J2566J9229j571
1086A0285j5078L20K1535J3884j6751k8130l629K3267J6452j0682j4407R992K1526
1099B8584l401l0736k0063J5145K8842P236j4220o836J0501N474j9492k6294J204
1112b4056L2812K8899l744k3620j1681M644k888j6667m262K6991L5177N348k9002
$$ plain form
1020 -3781 3416 14979 34740 35503 -1620 -49294 -59179 -23613 15753 25632 16242 11033 4810 -19506
1034 -19506 -48835 -48955 -12300 26806 33097 11146 -10827 -19158 -23813 -30965 -26041 881 30777
1047 30777 32114 2462 -25937 -27162 -12305 -5574 -5448 5695 24129 22833 -5431 -31581 -26500
1060 -26500 -605 13008 6212 -1314 4149 8918 -4596 -25532 -25206 861 22803 14640 -8796
1073 -8796 -14879 -586 5178 -9433 -19629 -1945 24348 23816 -2997 -19939 -7373 11856 10285
1086 10285 -4793 -4473 17062 30946 14195 -13935 -17564 5703 22155 11473 -2934 7058 28584
1099 28584 25183 -5553 -25616 -10471 18371 25607 11387 4551 15052 20526 1034 -25260 -24056
1112 -24056 8756 37655 33911 10291 -1390 3254 366 -16301 -20563 6428 41605 46953 17951
1125A7951l0975p920R120O289K962J3084K1775O933k4326l8727j8724J4848K7258
1138d52J4282J517Q84k119j8215k9832j5413J5825L2976K2642j361j6609j7492
1151a3367j3418r296j119J4396K7371K1733k934k5957k6334q707P545J4343J7141
1164A397J6638P761r691k3960k2823n156J6069K6366J9605L379j0269j7019j8036
1177a5739j2431L358K1472K8323J5377o985k1784k2223j2827J727J6213K5116
1189A9597K1233M870j4967k7299k2960m368J5569K5969K2963J0600o698k4081
1201B0428k9759j5933Q215K5526K6496J5747q33j8754k9763k5440m640J8940L0498
1214B0728K3260L941j6002k6384k4716j3901M007K4330L2880J8049j0977l0466
$$ plain form
1125 17951 -13024 -20944 -11824 -5535 -2573 10511 32286 39219 14893 -23834 -42558 -27710 -452
1138 -452 13830 15347 16231 14112 -4103 -33935 -49348 -33523 -547 22095 20734 4125 -13367
1151 -13367 -26785 -36081 -37200 -22804 4567 26300 23366 -2591 -28925 -37632 -30087 -15744 1397
1164 1397 18035 25796 16105 -7855 -30678 -35834 -19765 6601 26206 29585 19316 2297 -15739
1177 -15739 -28170 -24812 -3340 24983 40360 33375 11591 -10632 -23459 -21732 -5519 19597
1189 19597 40830 45700 30733 3434 -19526 -23894 -8325 17644 40607 51207 44509 20428
1201 20428 -9331 -25264 -17049 8477 34973 50720 49887 31133 1370 -24070 -28710 -9770 20728
1214 20728 43988 47929 31927 5543 -19173 -33074 -29067 -4737 28143 46192 35215 4749
1226D749k7084j1802K107J2604K3125K5177Q813j8804l5163k5965M47K0481K2057
1239G42J2649N339j053j5515k9205k2699P183L2194K7414J149j4750j2547p935
1252a7034j2150j2127O120K7846K7236j42k5864k4772l532R452M869P54J2263
1265g081K1103M862k4052l0431m615K1903J9777J763k886O668O417j1931k5055
1278b3558j1098J7884K9379J1598j0734j1614J059J42j4068j5328Q928L0548K1099
1291C4237r138k3600j1439J908j575p269L772K3162K3582j774k6997k5952m183
1304b5266J1204Q618N086J3425J8227l3k7527l2299p789J8629K2884J1871N416
1317B2446L441p696k4764k7254n530K3114L1519J5824m687j4043j5816j8200j5533
$$ plain form
1226 4749 -22335 -34137 -32030 -19426 3699 28876 37689 18885 -16278 -42243 -41796 -21315 742
1239 742 13391 18730 17677 2162 -27043 -49742 -42559 -10365 17049 18198 3448 -9099 -17034
1252 -17034 -29184 -41311 -35191 -7345 19891 19749 -6115 -30887 -34419 -24967 -20098 -19344 -7081
1265 -7081 14022 18884 -5168 -35599 -40214 -18311 1466 3229 343 7011 13428 1497 -23558
1278 -23558 -34656 -16772 12607 24205 13471 1857 2916 3058 -11010 -26338 -17410 13138 34237
1291 34237 25099 1499 -9940 -8032 -9607 -16876 -13104 10058 33640 31866 4869 -21083 -25266
1304 -25266 -14062 -5444 -358 13067 31294 31261 3734 -28565 -36354 -17725 5159 17030 22446
1317 22446 25887 18191 -6573 -33827 -39357 -16243 15276 31100 26413 12370 -3446 -21646 -37179
1330c7179K473K7180L2350R722j7247k4772j6572p369j300J1727K6831K4535n44
1343B9835k6609k9409j0700Q297J4353J4130J5403J1950p001k9723k9779j445
1355d0698K5807K6637P151m033l550q115k1436k1316M808L2681L0976R22k2844
1368F990k0519n452j401m491M289K4227K8177p2l2639l2141k199J9836J3716J514
1382a65P268J6014J407k6881l2792l958K8367K8805M131j0421m123K060j0213
1395e01k3098r019K3305L4924J0346k0233k1537j989M379o976r023J1300K8320
1408B0198J5085j6250k9196j1904R499J0739l31RJ3304J5090o687k6956k0023
1421b7423P343K1912J0616l326p46O327j766j7828j8475K897K1929J8872J65j1074
$$ plain form
1330 -37179 -34706 -7526 24824 34546 17299 -7473 -24045 -31414 -32714 -20987 5844 30379 29835
1343 29835 3226 -26183 -36883 -28586 -14233 -103 15300 27250 20249 -9474 -39253 -40698
1355 -40698 -14891 11746 18897 14864 11314 3199 -18237 -39553 -34745 -2064 28912 29834 6990
1368 6990 -13529 -18981 -20382 -24873 -20584 3643 31820 31748 -891 -33032 -35231 -15395 -1679 -165
1382 -165 7103 23117 24524 -2357 -35149 -39107 -10740 18065 22196 11775 7652 9712 -501
1395 -501 -23599 -32618 -9313 25611 35957 15724 -5813 -7802 -3423 -10399 -19422 -8122 20198
1408 20198 35283 19033 -10163 -22067 -12568 -1829 -2160 -2151 11153 26243 19556 -7400 -27423
1421 -27423 -20080 1832 12448 9122 8376 14703 12937 -4891 -23366 -20469 1460 20332 20497 9423
1435I423p855k742o314r631J105J7953J9956J362j7269j7409n115K127K064N089
1449g256J3475J2791k616j9190j9269n169R075J2906J0242O970J675q181j7850
1462a2397j6503m89J6778J9038R054j743o789j1953j6368j0447P500K2128J9558
1475A7367L444j0573j4779j2752r179j279J1348K1922J7567j073j9721k1882r023
1488b8613L166P875J1362J6302J2864m662k3235k3291n493J3042J6772J1689O811
1501A4589K376o332j7804k0054m982J6223K4360J3305k851r770r013j0669j1621
1514b2243k981J5224K4754J3932p496j8979j5229n419M93N177J1504J6866J0810
1527B6413p057k2560k0585k459J3426J5515R463N982J631q384j9789j7293N03
$$ plain form
1435 9423 1568 -1174 -7488 -17119 -16014 1939 21895 23257 5988 -11421 -16536 -14409 -12345 -7256
1449 -7256 6219 19010 16394 -2796 -22065 -27234 -18159 -5253 4989 11959 13634 5453 -12397
1462 -12397 -28900 -29389 -12611 6427 15481 13738 6949 -5004 -21372 -31819 -24319 -2191 17367
1475 17367 20811 10238 -4541 -17293 -26472 -27751 -16403 5519 23086 22013 2292 -19590 -28613
1488 -28613 -25447 -17572 -6210 10092 22956 18294 -4941 -28232 -33725 -20683 -3911 7778 14589
1501 14589 16965 10633 -7171 -27225 -32207 -15984 8376 21681 18830 9060 47 -10622 -22243
1514 -22243 -25224 -10000 14754 28686 21190 2211 -13018 -18437 -17944 -12767 -1263 15603 26413
1527 26413 19356 -3204 -23789 -26248 -12822 2693 12156 18138 19769 11385 -8404 -25697 -25194
1540b5194J9204K2912J0684m943j3120j2969j0762n769M942J8830K3267Q717j3688
1553B2111k4633j6962j455Q500J3657J5981J2696m77j7746k5591j6018N378K1189
1566c370K2180J0080l199j1881j7361j8183p414J1569K5755K1751L189j4587k0694
1579b165j6125o286N831J6276K0294J3270l223j9131k3179j2285M713J5750J6806
1592A0546J1452K054r659j8926j7407m675J0785J7766J4409M018p229j4175j4430
1605a5471p451K940J2331J5217Q840k610j0952j2601p992j307P197J2844J1194
1618A2179J849p587j0265p074k928J244P299J1230Q414k150j0231j0782l793L164
1632i431M961M723O005O112l56j0784j4036l482R308J0964L719n30J829Q13q262
$$ plain form
1540 -25194 -5990 16922 27606 22663 9543 -3426 -14188 -19957 -15015 3815 27082 35799 22111
1553 22111 -2522 -19484 -20939 -12439 1218 17199 29895 29418 11672 -13919 -29937 -24559 -3370
1566 -3370 18810 28890 25691 13810 -3551 -21734 -29148 -17579 8176 29927 33116 18529 -2165
1579 -2165 -18290 -24576 -18745 -2469 17825 31095 27872 8741 -14438 -26723 -22010 -6260 10546
1592 10546 21998 24052 14393 -4533 -21940 -26615 -15830 1936 16345 20363 13134 -1041 -15471
1605 -15471 -22922 -19982 -7651 7566 16406 13796 2844 -9757 -17749 -19056 -11859 985 12179
1618 12179 14028 6441 -3824 -10898 -13826 -12582 -5283 5947 14361 12211 1980 -8802 -12595 -9431
1632 -9431 -4470 253 6258 12370 12014 1230 -12806 -16288 -6980 3984 7703 7173 9002 9815 1553
1647A553j4055m987J1350J7869P877n435q385k939k278p204n437Q541K1240J3657
1661C1367q295k0249j1085K902M910K55M731J5155J2877p552k5079j9231L560
1674a5734J8358J2638J521L83M134m276k0088k0757K256K5933K2815O94j3927
1687A3950r696l126p294j1227J919K1378K4396K368k1448k2121m918P515M502
1700c802J724J0158J6225K720k0481k6181o024J6154J6904M103j977J912l48j2741
1714a654j8972n028J6363K1640P319r784j1536m360k980o608k309J2510J9534
1727A4135O635j2830j7984o509L668M145K884Q344J1895K933j2622j8189p226
1740b0721P339J1834O512L135L168j12j0868j6422o645J0379J6255P611j519k965
$$ plain form
1647 1553 -12502 -17489 -6139 11730 19607 14172 5787 2848 570 -6634 -12071 -3530 17710 31367
1661 31367 23072 2823 -8262 -5360 -450 -195 4536 19691 32568 25016 -63 -19294 -15734
1674 -15734 2624 15262 16783 17166 21300 17024 -3064 -23821 -21565 4368 27183 27877 13950
1687 13950 4254 1128 -6166 -17393 -15474 5904 30300 32668 11220 -10901 -15819 -8304 -3802
1700 -3802 -2078 8080 24305 27025 6544 -19637 -25661 -9507 7397 11500 9523 11435 11087 -1654
1714 -1654 -20626 -25654 -9291 12349 19668 9884 -1652 -6012 -8992 -15600 -17909 -5399 14135
1727 14135 20770 7940 -10044 -16553 -12885 -8740 -5856 2488 14383 17316 4694 -13495 -20721
1740 -20721 -13382 -1548 4964 8099 11267 11155 287 -16135 -22780 -12401 3854 11465 9946 6981
1754F981l048q969j2709m530J1560J8317Q888m842r238o319m613o703k694J0095
1768g824J9326J1044p930j6384r451Q01J400l17O949J5667J1038p939k0398j3225
1782a7243K948J0347N864K440O124P327m132j8565j6380K485J7532J2611q00m905
1796E653M74n95j0751j3988M47J7258J6380N7j2041q269M35k7n480k417J0210
1811b654J5005L153j3358j4569j143P676L104k228J615Q795L967r380j4305l982
1825a8304Q495R136J173l723M20K169l621r416n678O118J1482M610m652n464p42
1840g997m84m511l213M895R969N344l463o988m205n40l41Q49M979P892M221l675
1856B732q755n790k17L263L507N046O218J962o728j0189n066L149O345M663M144
$$ plain form
1754 6981 3933 -5036 -17745 -22275 -10715 7602 16490 11648 2410 -3909 -8522 -15225 -17919 -7824
1768 -7824 11502 22546 14616 -1768 -11219 -10418 -9018 -9335 -2386 13281 24319 16380 -4018 -17243
1782 -17243 -14295 -3948 1916 4356 10480 17807 13675 -4890 -21270 -18785 -1253 11358 10558 5653
1796 5653 6127 5532 -5219 -19207 -18760 -1502 14878 14935 2894 -5375 -4940 -4967 -10447 -12864 -2654
1811 -2654 12351 15504 2146 -12423 -13566 -5890 -2786 -5014 -3399 5396 9363 -17 -14322 -18304
1825 -18304 -9809 -673 500 -3223 -2803 -634 -4255 -13671 -19349 -13231 -1749 2861 -1791 -7255 -7997
1840 -7997 -8481 -12992 -16205 -11310 -1341 4003 540 -6448 -10653 -11193 -11534 -10685 -5706 2186 6407 2732
1856 2732 -6023 -11813 -12030 -8767 -5260 -214 6004 7966 1238 -8951 -14017 -10868 -4523 140 4284
1871D284L482j217p893j0042l227O820J0361N547n63k630k703n088o871j764Q350
1886c154J2817N013o636r282l521M24j25J78N809Q858K441q445j2574m502O052
1901f647Q147K597r28j7J35n769r859l506Q710J3195L801p285q730k997j75j271
1917a0599N90P310J0344K862r110j3574n419N368Q714M918K357K411l15q162j1671
1932a3976m329Q289J2837O779j973n271m969n163m609P6O865J0397N997l532r047
1947a629o906j700J972L233N015N969K019l862o750m572K65L172M300L959K209
1962F694j006l164l154j246Q82J679K223K303J633n10k712k440j12J542N30p90
1978B352L13L107K426k389m350j700K115J715j488k84L033L636j259n949m549
$$ plain form
1871 4284 7766 6549 -1344 -11386 -14613 -7793 2568 8115 7552 4922 2219 -2869 -9740 -11504 -3154
1886 -3154 9663 14676 8040 -1242 -4763 -4339 -4464 -4286 1523 10381 12822 4377 -8197 -12699 -6647
1901 -6647 1500 4097 3169 3152 3287 -2482 -12341 -15847 -7137 6058 9859 2574 -6156 -9153 -9328 -10599
1917 -10599 -10009 -2699 7645 10507 1397 -12177 -17596 -12228 -3514 1404 3761 6172 5857 -2305 -13976
1932 -13976 -18305 -10016 2821 9600 7627 2356 -2613 -7776 -12385 -12309 -5444 4953 10950 7418 -1629
1947 -1629 -8535 -10235 -8263 -5030 -15 5954 7973 4111 -2639 -7211 -6946 -3774 526 4485 6694
1962 6694 5688 2524 -630 -1876 -994 685 2908 5211 6844 6334 3622 1182 1070 2612 3142 2352
1978 2352 2665 5772 8198 5809 1459 -241 1874 3589 2101 1817 4850 8486 7227 1278 -3271
1993c271J377N017K871q54r02J407M21m752n744O30P921O531j326n920l532J86
2009F0n53k013N68N931O272q14q802q370r81N057M625J355R08J666j553p523q672
2026a2839m33Q496R161K775l442m671m216l666k837K068P690Q536K749n788r354
2041e771n366L90L785M525N111M315n15o293q675m443K648O625O527K798j522
2056D139m567m974m279q32L162O064N470L52m085n735l708r5K969M137K929J181
2072B128r70k944m026k343J729M786M318L3l022k331r74n88k69J147K938L056
2088B668n73m155m044k40K946K289J68o88O32M78k657l985m21L797M243L61k698
2105a879k010P2j4j436m38J964M157J844k526m213j351J815J513l14R2K506K066
$$ plain form
1993 -3271 -1894 3123 5994 5140 4238 5645 6066 1314 -4430 -3800 4121 10652 9326 3406 -126 60
2009 60 -493 -2506 -1938 3993 10265 9451 649 -7721 -8702 -3645 980 2335 3243 4909 3356 -4167 -12839
2026 -12839 -13272 -4776 4385 7160 3718 -953 -5169 -8835 -11672 -9604 -1914 6622 9371 3583 -5771
2041 -5771 -11137 -10747 -6962 -2437 2674 6989 6474 181 -8494 -12937 -10289 -3664 2863 5661 4139
2056 4139 -428 -5402 -9681 -10513 -7351 -1287 4183 4535 450 -5285 -8993 -9088 -6119 -1982 947 2128
2072 2128 1158 -1786 -5812 -8155 -6426 -1640 2678 2711 -311 -2642 -3616 -4204 -4473 -3326 -388 2668
2088 2668 2095 -2060 -6104 -6344 -3398 -1109 -941 -1629 -997 -519 -3176 -7161 -7582 -3785 458 819 -1879
2105 -1879 -3889 -3817 -3831 -5267 -5705 -3741 416 2260 -266 -4479 -5830 -4015 -2502 -2816 -2724 -218 1848
2122A848j598m119k079J220K288Q94k29J07N41l36j640k413J9J762J633J74j122
2139c050L0M44l97j155k51P00O11J33J30Q09M83j95k99n14k77q06j63J526K433
2158A92J087o55k360j520k58r4o3J308L309K647j768n351l365P19K541J259N97
2175a775K395K164j601n805m966J103N432M599rj486q3j38l186m739N6O568P072
2192E601L00n222m115N73J229j831o02L791N782J050n725o430j53M477L246j315
2208F56j255J971K205l090n721j192N746N480p47m498k198K180J133j573j236
2223b139K729M606L19m633m607J121M980K342j463j281J535R74k860l548R14M816
2239C805L297j645l383j186P11L85r99K98K413J561p73l928j661J881K521L87
$$ plain form
2122 1848 250 -3869 -5948 -4728 -2440 -1546 -1775 -1668 -1127 -1463 -3103 -5516 -5497 -3735 -2102 -1928 -3050
2139 -3050 -3020 -2576 -2973 -4128 -4379 -3679 -3068 -2935 -2805 -1996 -1513 -1708 -2007 -2521 -2798 -3604 -3767 -2241 192
2158 192 1279 624 -1736 -3256 -3514 -3608 -3671 -2363 946 3593 1825 -3526 -6891 -6172 -3631 -2372 -1775
2175 -1775 620 2784 1183 -4622 -9588 -8485 -3053 1546 1537 51 -32 -170 -3356 -8095 -8039 -1471 5601
2192 5601 5901 679 -3436 -2863 -1634 -3465 -4067 -276 5506 6556 831 -5599 -5752 -1275 1971 656
2208 656 -599 1372 3577 487 -5234 -6426 -680 4800 4053 -445 -2643 -463 670 -903 -2139
2223 -2139 590 5196 5515 882 -3725 -2604 2376 4718 3255 1974 3509 4483 1623 -1925 -1011 3805
2239 3805 7102 5457 2074 888 1599 1984 985 1283 3696 5257 4484 556 -1105 776 3297 3684
2255C684j172m09K98p37k048M08L104K409r79l039j947J25R07Q35J616K483R52
2272F490k593n106k873K028M246K683J14n77o77l272n087k022M195O627L311k613
2288D874m294k522j526k001p7M025O747L079m152p479m270K049L520J553J436
2303I62L541K123m146p577l741L902O975L472j655k168m38j318l547k245K961
2318b899P117L781l409o385k853J883K343l43O12L496K660k958o555l463L341
2333c632N649K705j415j441k13r18l144k400K396O336L735j915n119k799N26L39
2349a310J4J243L781K858j522n078m240l05K630K210Q22Q04O78o14l420l963q11
2366f223K524L155J532j75o83q18k581k600o54J853K921K128Q68j483k466j965
$$ plain form
2255 3684 2512 2103 2401 1664 -384 24 3128 5537 4558 1519 -428 -303 604 1439 3055 5538 6490
2272 6490 3897 -1209 -4082 -2054 2192 4875 4989 4412 3735 463 -4624 -6646 -2451 4176 7487 4874
2288 4874 580 -1942 -3468 -5469 -5546 -1521 5226 8305 4153 -3326 -7596 -5547 -2027 -474 962
2303 962 4503 6626 2480 -5097 -8838 -4936 2039 5511 3856 1688 1250 -68 -3615 -5860 -2899
2318 -2899 4218 7999 4590 -1795 -4648 -2765 -422 -765 -153 3343 6003 3045 -3510 -6973 -3632
2333 -3632 2017 4722 3307 1866 1653 735 -2409 -4809 -2413 3923 7658 5743 624 -2175 -1649 -1310
2349 -1310 -1296 -53 3728 6586 5064 -14 -4254 -4559 -1929 281 1103 1907 2585 1971 -1449 -5412 -6223
2366 -6223 -3699 -544 988 813 130 -688 -3269 -5869 -6523 -4670 -1749 379 1247 -236 -2702 -4667
2382d667j423k31J617K871K118L16j515k575k504j820O75K875L189J290j060j834
2398b678k663k392j163J485M073L325K12k653l091k059l60J002J769L021L267
2413A095l28l757m686j193K638L200K000R59R53j131l580l750o32L858M900K339
2429B885j102k917k267j750j217N3L612N060K072k624n190l409r3J666J979K715
2445e27L076R13k585n313m011J08M127M377K425J64j108k683l840l430N35M448
2461c324N596K644j460l726l900k643j055J550L788M907K646j831n459n517j645
2476i429J951L119L623L044J482k863n581n494r84L861N433M107M47k010l504
2491b798l897l720K17M662O626L419k008m846m226j828J20K046M358M563J623
$$ plain form
2382 -4667 -6090 -6321 -4704 -1833 285 601 -914 -3489 -5993 -7813 -7138 -4263 -1074 216 -844 -2678
2398 -2678 -5341 -7733 -8896 -7411 -3338 -13 199 -2454 -5545 -7604 -7964 -6962 -5193 -2172 1095
2413 1095 767 -2990 -7676 -8869 -6231 -3031 -1031 -72 881 -250 -3830 -7580 -8212 -4354 546 2885
2429 2885 1783 -1134 -3401 -5151 -6368 -6315 -2703 2357 4429 1805 -3385 -6794 -6887 -5221 -3242 -527
2445 -527 2549 3462 877 -4436 -8447 -8339 -4212 165 2590 2754 1646 -1037 -4877 -8307 -7772 -3324
2461 -3324 2272 4916 3456 -270 -4170 -6813 -7868 -6318 -2530 2377 5023 3192 -2267 -7784 -9429
2476 -9429 -7478 -4359 -736 2308 3790 927 -4654 -10148 -11132 -7271 -1838 2269 2716 706 -2798
2491 -2798 -6695 -10415 -10198 -5536 1090 4509 2501 -2345 -6571 -8399 -8279 -6233 -1875 2688 4311
2506D311l518n646m605K59L508M440K965R73j148l900m753k755K396N522M678
2521B727Q68j934l820l483j902O79L851M888L183q16m252m790j841R46L455M213
2537A972L027M64l211m469l150M14K535M205L377R41k124m339l883o29K144L830
2553A104K995R39q46k421l446k320J48L439L982J424j639j954j482j213j065N40
2569a815K406L443J075k482k700j235Q78O51J03O13J882J402j514l368j926J676
2585i11K470L4j085j27J883l3k601k674P00L180J802j156j701p1J043p82k643
2602b672n61L118L730o0l305k330N62J300l17q34K141L430O25l578m739p57K673
2619a574L007J080Q6J191J9l199m890j386L701N876K350j338k196j958k663k869
$$ plain form
2506 4311 793 -4853 -9458 -9199 -5691 -1251 1714 2687 1539 -2361 -7114 -9869 -7473 -1951 2727
2521 2727 3595 1661 -2159 -5642 -7544 -6865 -3014 1874 5057 4241 -11 -4801 -6642 -5696 -2241 1972
2537 1972 4999 5463 2252 -2217 -5367 -4953 -2418 1787 5164 6105 3981 -358 -4241 -4870 -2726 1104
2553 1104 4099 5038 4192 1771 -1675 -3995 -3847 -408 3574 4998 3359 1405 -77 -1290 -2355 -1815
2569 -1815 591 4034 5109 2627 -73 -1308 -430 221 324 937 2819 4221 2707 -661 -2587 -911
2585 -911 1559 1593 508 381 2264 2231 -370 -3044 -2344 836 2638 1482 -219 -290 753 -29 -2672
2602 -2672 -3233 -115 3615 3555 250 -2080 -1518 -218 -535 -1369 772 4202 4827 1249 -3490 -4247 -1574
2619 -1574 1433 2513 2599 3790 3809 610 -4280 -5666 -1965 3911 6261 4923 2727 769 -1894 -4763
2635d763q4M303O263K985k337n120m217j509P06K469M416M659J721l842o155m649
2651e154K45L380M475L800K305q39n134o012l033K147N025N000K340m49l432n138
2667d74m232p93L817N884M095l93k873m098l830k339J339N024N504K334k729m669
2683A567l645j692J51K563M380M775P23m181n945l176O64L274L084K395K235j06
2699G066m068o247l184K574N583L464P21q06j639l208m611k478K761O592M868
2714G388n78l860l803k097j780n40K209O531M854q55n956n797j662J346K136K878
2730D14L835L001j083o261o659j713L896N493K938P72k35j795m871n603r96N003
2746c864O657K969j201l388l192k911k252M83M300N467L024k353n190l892q87
$$ plain form
2635 -4763 -4847 -544 5719 8704 6367 1247 -2970 -4479 -3773 -1304 3112 7771 9492 5650 -505 -5154
2651 -5154 -4909 -1529 2946 6746 9051 8212 3078 -2934 -5967 -3820 1205 6205 8545 8096 4664 -474
2667 -474 -4706 -5499 -1682 4202 8297 7904 5031 933 -2897 -5236 -3897 1127 6631 8965 6236 1567
2683 1567 -2078 -3770 -3619 -1056 3324 8099 8822 4641 -1304 -4480 -3816 -542 2542 4937 7172 7066
2699 7066 2998 -3249 -6433 -3859 1724 5188 5909 5103 3464 256 -4355 -6833 -4072 2520 7388
2714 7388 6810 2950 -853 -2950 -4730 -5270 -3061 3470 8324 7469 1513 -4284 -5946 -4600 -2464 414
2730 414 4249 7250 6167 -94 -6753 -8466 -4570 923 3861 4633 4398 2603 -2268 -7871 -8867 -3864
2746 -3864 2793 5762 4561 1173 -2019 -4930 -7182 -6699 -2399 3068 6092 3739 -1451 -5343 -6230
2761f230J170J734L052L998J188l067m983l198M34K759L070K477R01q33k684l585
2777c797k100J067L501L187J287j068j788k495k361m55K046L145K482k17j712
2792G22k327k015p53P39K674K924J252p97k732k707q22N21J671K853K142Q76k215
2809B006l945k423M42K162K068K381J339n24l034m219k174J327L635L494J583
2824D118o27k403l351l386r71K027N157M021O04k876m409l262j315P63L642M804
2840B536L323r17m895n447k465J183L910M277K754M59k343n200m841j103L335
2855e434N581L949M82k577m297l968k130J325M255N050K729j795m693m812j890
2870h225J576L503L842K970J53l028m956l472K42L679M414L064jk474l709k845
$$ plain form
2761 -6230 -5060 -3326 -274 3724 4912 1845 -3138 -6336 -5902 -3143 -73 2404 3305 2472 -212 -3797
2777 -3797 -5897 -4830 -1329 1858 3145 2077 289 -2206 -4567 -5022 -2976 169 2651 2434 722
2792 722 -1605 -3620 -4373 -3634 -960 1964 3216 2419 -313 -3020 -3842 -3321 -1650 1203 3345 4221 2006
2809 2006 -1939 -4362 -3920 -1758 310 2691 4030 3506 472 -3747 -5921 -4594 -959 2535 4118
2824 4118 3491 1088 -2263 -5649 -6620 -4593 564 4585 5189 2313 -2096 -5358 -6673 -5910 -2268 2536
2840 2536 5859 4942 47 -5400 -7865 -6682 -2772 1505 4259 4718 2375 -2825 -7666 -8769 -5434
2855 -5434 147 4096 4578 2001 -2296 -6264 -8394 -7069 -2814 2236 4965 3170 -1523 -6335 -8225
2870 -8225 -6649 -3146 696 3666 3819 791 -4165 -7637 -7395 -3716 698 3762 3761 1287 -2422 -5267
2886e267j066J473M368L879J644k363m254l066q98J282K922L122K307j84k812
2901A087m040k725M72L256L644J673o6j422k198k700j829R13L463L877J157j266
2917C296k581k093j243m88J215K525L171J293j418l439k748m89Q73J409K206K049
2933C538R80j802l453k697p04J589K823J995J010m22j677l068k706l30K652L555
2949A283K132p5j734k691k395j270Q94K904L455J445j068l109l325j324O47K648
2965a583K784K086j41k234l470k620l76K366L486K410N12k294l563k483l69J834
2981c655K937L056J279j504l683l339q73J821L595K827J282p52k613l442k192
2996e256L63L577M573K085j106l185k851j825l96J852L685L606O15k335m277l116
$$ plain form
2886 -5267 -6333 -4860 -492 3387 5031 2668 -1586 -4652 -5550 -4268 -1346 1776 4083 3899 1087
2901 1087 -2953 -5678 -5206 -1950 1694 3367 3301 1879 -319 -3019 -4848 -3935 -472 3405 4562 3296
2917 3296 715 -1378 -2621 -3109 -1894 631 3802 5095 3677 238 -2510 -2999 -2126 -717 1489 3538
2933 3538 4518 2716 -737 -3434 -4138 -2549 274 2269 3279 2857 1180 -1888 -4594 -4924 -2272 1283
2949 1283 3415 3340 1606 -1085 -3480 -4750 -3856 -952 2503 3948 2880 -229 -3554 -4878 -4231 -1583
2965 -1583 1201 3287 3146 912 -2558 -5178 -5554 -3188 298 2708 3220 926 -2637 -5120 -5489 -3655
2981 -3655 -718 2338 3617 2113 -1570 -4909 -5782 -3961 -366 2461 3743 2991 378 -3064 -5256
2996 -5256 -4893 -1316 3257 5342 4236 1051 -1800 -3625 -4021 -2169 1516 5122 5737 3402 -875 -3991
3012c991q9K031K903K679J439l27k754l879k514Q68L759L220J703o13j574k338
3028E23k588j355J532L690L082P35j968k736j968m49R3J525K573J941Q3k235k991
3045e13j453L73J714J533J294O00q52j806k323r94R42K348J831K76q48j285j388
3062e51j161%J186K242J481m23j681j476j145J78J187J294J524L67r26k004j471
3079a379m18J026J660J478N98q67j558j726r78N86J209J934J300m7j752k034j327
3096b295J93J235J840J254N98o85j758j915p23P54K019J823O09m67j268j249r99
3113a034n78Q49K088J930K03j375j731j085r8j17Q89J463J368n5j062k049j192
3130a586J84J095J234M15P22K08j349j633j266N58J973J215N01l11o40j130j184
$$ plain form
3012 -3991 -4080 -2049 854 3533 4972 4645 1891 -1988 -4502 -3634 125 3345 5048 4435 2861 523
3028 523 -2065 -3420 -1888 1802 4884 5619 3651 915 -1053 -1502 -1409 116 2689 4630 4713 2478 -513
3045 -513 -1966 -1593 121 1654 2948 3548 2696 890 -1433 -2427 -1485 863 2694 2970 2122 837 -551
3062 -551 -1712 -1712 -526 1716 3197 2774 1093 -383 -1528 -1350 -163 1131 2655 3022 2096 92 -1379
3079 -1379 -1797 -771 889 2367 2965 2098 540 -1186 -2164 -1578 -369 1565 2865 2818 1066 -968 -2295
3096 -2295 -2102 -867 973 2227 2825 2140 382 -1533 -2256 -1502 517 2340 2949 2482 1214 -35 -1034
3113 -1034 -1612 -763 1325 3255 3458 2083 352 -733 -831 -948 -59 1404 2772 2717 1655 -394 -1586
3130 -1586 -1402 -307 927 1342 2064 2272 923 -710 -1976 -1418 555 1770 2271 1960 1320 190 -994
3147i94n46N61J939J769L22j136j869j452j36L18J182J829J189m66j856k398j322
3164c066Q19J667J882J304m67j347k271j898l18J546L090K158M3j867k412k435
3180c572n83J461K471K814J194r18l079l095j594R81L068L183J667n65k431l250
3196b248k741R0K272L716K642L90k355l712k396o58J517K980L070J397p58l476
3212b70l378j282R69K849K924J834n01j958k645k324j23J783L566K250k60k069
3228A365j821j713p64O46J950K504J167q53k396k109n58O59J221J772N06K34p32
3245A078k028j581k33K013J223O64j24m86o25j003n63k9Q19J598Q27l88j028o76
3263e42m06k43k6P32J081R63j47j065j376m53J48L47Q54R00O70k59r41j675q18
$$ plain form
3147 -994 -1540 -979 960 2729 3051 1915 46 -1406 -1542 -1224 -42 1787 2976 2510 654 -1744 -3066
3164 -3066 -2247 -580 1302 2606 2139 792 -1479 -3377 -3695 -2149 941 3099 3142 1275 -1137 -3572
3180 -3572 -4155 -2694 -223 2591 3785 2867 -212 -3307 -4901 -3920 -852 2331 3998 3433 1002 -2248
3196 -2248 -4989 -4899 -2627 1089 3731 4121 1766 -1946 -4342 -5000 -3483 -503 2567 3964 3206 -270
3212 -270 -3648 -4930 -3961 -1112 1812 3646 3145 1187 -1458 -3782 -3905 -2122 1444 3694 3434 1365
3228 1365 -456 -2169 -2933 -2287 -337 2167 3334 2481 85 -2024 -2582 -1923 -702 1070 1576 1810 1078
3245 1078 -950 -2531 -2764 -751 472 1136 1012 526 -99 -1102 -1665 -1694 -875 723 1550 1162 134 -542
3263 -542 -948 -1191 -1217 -485 596 1559 1412 347 -1029 -1482 -1334 -987 -133 767 1437 1178 237 -1438 -2256
3282b256L69J280J200R08N1n82j260j555n25N79J706J953O79q19j438j637q42
3299b189K97J077J902J776J36j299k441j511Q2J188J672J587N50o82j855j958
3315a668j095Q19J901J769Q73o56j269j587j107k19J270J580J627J18j560j494
3331f98j101j46R84J248R96L91k49j277j381o31Q18J549R69Q6o34q89n98n97J85
3350i75O95J157N87l04q79j173l59M24P87M36L41J68m11j084m69k26R15Q72M47
3369I49P3n79o43l57j52J39N87J087M23m79p67q53O7J00O27M10M27K56m86p62
3389F7p45k23P84O46N51k92j56k94p39o41J1Q26R17M21m17m65p80K27j03J03N65
3410B63N69K97l00q26q14K86O16N34m6L08m22j14o39l22R0P03Q34j89o79n84k89
$$ plain form
3282 -2256 -1887 -607 593 1501 1552 970 -290 -1845 -2370 -1791 -85 1868 2547 1728 290 -1347 -2189
3299 -2189 -1892 -815 1087 2863 2999 1700 -741 -2252 -2170 -982 690 2277 2827 2145 290 -1668
3315 -1668 -2763 -1944 -43 1726 2599 1943 674 -913 -2020 -2239 -969 611 2238 2356 796 -698
3331 -698 -1799 -1945 -961 287 1283 1674 1425 148 -1233 -1864 -1046 503 1472 1558 924 35 -563 -1160 -975
3350 -975 -280 877 1464 1160 281 -892 -1251 -827 -40 396 737 905 494 -590 -1059 -1285 -370 502 949
3369 949 1022 443 -200 -557 -709 -570 17 1104 1527 1048 281 -572 -505 -405 222 632 1059 1315 829 67
3389 67 -678 -901 -117 529 1080 788 632 338 -401 -1042 -1031 -205 712 1133 716 251 -529 -302 -405 -302 263
3410 263 832 1129 829 3 -811 -525 91 625 579 887 465 351 -288 -610 -520 183 1017 828 149 -435 -724
3431g24K61O9L58M70N43m91r70q48Q5O92R74K77j22l26k99o96k92J67O04J239
3451I71K54p02n29q71l2KO88P15M62P2o09q21n85J77K59O96N24j07l20j21n51
3472d28k32j76O22N26J50k09j84k24o4j18q3Q1N06K34M8q9j51Q8Rj87o53K86M69
3495B21P41k22k76k26l15m25J10J80N47N36R7o79p23k82J05M17L65N30m0N7p03
3516A5p85j47K68N31O71J07k17n08n10l32J85M11O35L50p0o49o23m35L53N59N51
3537C60K2q0m03m97l76j3N82P23J12l34n93k95n6P9N01K63M37j20n47p47j4J11
3559h85P92N31j6k76m10m13J19k13O03O09L10p8r34l86K48L40K19L27j25J12l43
3580A31m37l21L71Q06L05j45o46l53m1N5J15M54N80R8n69m81o19K97N32O17J80
$$ plain form
3431 -724 -463 -394 -36 434 977 486 -484 -1332 -1247 -555 419 696 574 248 -51 -747 -1039 -872 -268 971
3451 971 1225 523 -6 -877 -909 -907 -219 496 958 1030 421 -400 -985 -808 -549 147 671 564 244 123 -428
3472 -428 -660 -836 -214 312 462 253 69 -155 -219 -337 -420 -339 167 401 449 360 209 297 306 119 -534 -248 221
3495 221 962 740 464 238 -77 -502 -392 -212 335 871 968 289 -434 -716 -611 -194 171 701 661 718 15
3516 15 -770 -917 -649 -118 553 660 443 -65 -575 -907 -722 -311 324 674 604 -45 -668 -1103 -750 -191 360
3537 360 382 302 -101 -598 -974 -987 -405 318 430 96 -497 -792 -848 -769 -268 -5 432 312 -235 -982 -996 -885
3559 -885 -93 438 422 146 -264 -677 -558 -771 -168 441 751 673 -261 -647 -399 -59 160 487 362 474 131
3580 131 -306 -627 -256 550 855 710 64 -289 -330 -275 -160 294 874 972 403 -78 -697 -400 132 749 929
3601I29k2l70m14m90l57K70J082P92p6n51p11n70j21K41M74Q07L51k64p96p42
3621e38l94q6O98N49K66L14k10p04p34m33Q0Q52M32N42l0m54q07k37p2J29O13
3642b24N03M46m63m61n40k40P5K60M45P88O2k20p12l94r3j28P38L09J85j29J7
3663B24m35m54o6K01O50M44k3l66q2l37j52Q3L86L28M35k19o21j36n4M84q0K93
3685E03o2J85p5l89l25RN51M17P3o57j99J66L2l11L45J91L57L3n39m85m4L18K72
3708C66k03J71K53m42k17j50p5K32N17j11q2l12J2m5r0N2k1K92J6k32J17j68R7
3731b3J9k3q3j55Q4OJ10l3j36jj03j85J00J43mK30p3J09j38m86L02j13L21j9K72
3756A21m7j45j79k82L39r0L86j40Q5j25N2j6n9j07L56l4J14l41L7J73J49J67j86
$$ plain form
3601 929 907 537 123 -367 -724 -454 628 1420 1344 793 82 -488 -609 -368 106 913 1264 1000 204 -538
3621 -538 -932 -1018 -320 229 495 809 599 -105 -839 -1272 -1192 -340 92 634 604 150 -657 -894 -966 -837 -224
3642 -224 279 725 262 -199 -739 -979 -904 -644 -199 589 651 431 -281 -675 -768 -896 -158 151 336 207 224
3663 224 -211 -665 -731 -530 120 564 541 175 93 -244 -396 -313 73 401 836 617 -4 -140 -194 290 210 503
3685 503 441 626 551 162 -163 -154 397 814 887 230 31 197 229 -82 263 454 811 844 305 -180 -224 94 366
3708 366 163 334 587 145 -72 -222 -297 -65 452 341 259 -53 -41 -86 -176 -124 -145 147 163 -69 48 -120 -23
3731 -23 -4 -27 -110 -265 -181 -175 -65 -98 -234 -235 -338 -523 -423 -280 -284 -54 -127 -18 -156 -642 -340 -453 -132 -151 121
3756 121 74 -71 -250 -532 -193 -283 103 -37 48 -77 -25 -41 -100 -207 149 115 229 -112 -75 98 247 414 228
3779B28k94k45K18j84Q2N03J07P1k90m95l29K06N71K53K24J33j30p79o84K6N05
3800c03R17N74j5n23o74m57l99J65R14P69M05l27r71p33l64L34O02Q60K94K12
3820A280p82j070l52n7O14R93N68K11q74p82n21j84M90P43Q79R9n08p36p96j34
3840i19M00P74P30K85l04p66p06l92J68Q84P09K64l17n78q36l43J17N27O37N86
3860I20l77k53o40p12K44M28L86O70K09k64n60p05k61L12M40P01L35o1n10n07
3880b05k55m10P5O80Q34L33k89n96m74l15l40J99P06Q48K72l89o54o50m76J52
3900i54N08P04O84K73k54r94r16l31M35J069O46N99o8n94j384q27L70O86J073
3919G25P66J09m14j019j000m52L19J175R80N94l63j197q02o64J85R44J141N26
$$ plain form
3779 228 -66 -311 -93 -277 -195 308 415 486 196 -299 -628 -422 149 402 626 759 629 -150 -834 -808 -303
3800 -303 614 1188 1173 650 -24 -481 -880 -715 199 968 1373 1046 75 -658 -1022 -688 -86 774 1068 1280
3820 1280 498 -572 -924 -981 -367 626 1194 1405 531 -251 -772 -956 -466 277 1156 1255 747 11 -785 -919
3840 -919 -519 255 985 1270 966 200 -506 -898 -730 154 863 1127 810 232 -604 -947 -830 -303 334 920
3860 920 543 290 -350 -1062 -818 -390 -4 666 875 611 51 -654 -915 -603 -163 538 873 812 302 -205
3880 -205 -460 -870 -795 -115 719 1052 763 167 -307 -622 -962 -763 -57 791 1063 674 20 -630 -1106 -954
3900 -954 -446 258 942 1215 961 -33 -949 -1280 -845 224 870 1469 1401 807 -577 -1404 -1034 -348 725
3919 725 1491 1600 1186 167 -833 -1285 -966 209 1189 1783 1420 223 -579 -1243 -1058 -114 1027 1553
3937A553k63o08r97q94j90P84J038J009K91o58j312o37n00O01J097P29N21l83
3955A181q35j073o51K85J087P93M12J67p56j035q18k29O77J253P42k03n30q23
3973c56p75j45K31P60R43O39k20j127q54l66N5N62O61P37L16m71r53r26l6N16
3993h09N51P13K45R8o21r03o22r6Q46J027M65l91k65o03o55k09J70O29Q87K55
4013G12m34o62p29O8J06N05K56P35M6n16p42m44K76L24L99N69n9Q7q03n13JJ57
4035f61P45K35J61j27m07m25q3m4M02N17K89k04m90m09j99K3M84N29M51k65l74
4056A48o36k39L3M19L58M66j0k75l35o31J3J39N92N48K4j61j73m91o67J16N17
4077b45M30N11r4l41m74m82k83Q2Q19N38K52k53p15l63l99J26J14O06P21J65m53
$$ plain form
3937 1553 1290 682 -315 -1209 -1399 -615 423 1432 1723 1065 -247 -884 -1384 -783 314 1043 1564 1181
3955 1181 346 -727 -1378 -1093 -6 787 1199 1366 610 -425 -1243 -1472 -795 458 1200 997 467 -356
3973 -356 -1131 -1276 -1045 -285 658 1297 1077 -50 -904 -1270 -1215 -653 8 745 1061 590 -363 -1289 -1325 -809
3993 -809 -258 455 700 798 177 -726 -1348 -1444 -598 429 894 503 238 -365 -1020 -1229 -1059 -430 457 712
4013 712 278 -384 -1113 -1045 -939 -434 -178 557 603 87 -655 -1099 -823 -499 -100 469 410 497 -306 -819 -818 -661
4035 -661 84 319 480 353 -54 -479 -562 -606 -204 313 602 398 -92 -501 -700 -677 -193 336 787 522 148
4056 148 -488 -727 -694 -275 83 549 539 264 -71 -702 -689 -550 42 590 614 453 280 -211 -878 -762 -245
4077 -245 185 696 602 261 -213 -695 -978 -896 -77 461 713 460 -255 -618 -1017 -891 -777 -171 550 715 262
4098B62r75k45k64N84K20M79O19j98k83p37q74L63N18P58K70n4n5p83n04m81L96
4119i84P83P64K21k03p57p95k1k91O16R52O80k74p39p68l79P9N80Q40P12K61p53
4140E24j074o16j44O55R12P94M83o13p95j094l87M83J085P48M57l32p25q73n80
4159a092J99O56J111N83m7p81p72o05k92M61J034R07L75n14r51q41r4K85O31O97
4179I50M49j03o45r02m75J34O34M38L80L00m9q60p03JL3P66L99J64k80m03l98
4200a70k21jJ95N17L74n6l67k58r7j38M1J33L87K21ql44j68j56j35J69K37O2K53
4223D70J71k66l47m14J78J52K66L39j04j21k40k52k91K16M07J60K10k38j23m23
4243b50k82N6M89L30M19k55j71m58k18j14N17L44M82K85o13o80m53k6L92O18L49
$$ plain form
4098 262 -713 -958 -1222 -638 -418 61 680 482 199 -538 -1412 -1049 -531 227 497 443 388 -395 -899 -1380 -984
4119 -984 -201 563 784 581 -176 -971 -992 -1283 -667 285 965 691 -48 -816 -1195 -1116 -536 304 1016 1277 524
4140 524 -550 -1166 -1310 -655 257 1051 1534 921 126 -968 -1355 -872 213 961 1418 1086 361 -512 -1092
4159 -1092 -893 -237 874 1457 1410 629 -143 -748 -1040 -579 455 1362 1737 1223 272 -569 -663 -378 253 950
4179 950 1399 1296 651 -251 -726 -592 42 480 860 1160 1111 251 -452 -451 -418 348 747 911 631 228 -170
4200 -170 -391 -392 -197 320 694 638 271 13 -84 -222 -181 -48 339 560 552 208 40 -116 -251 -82 155 217 470
4223 470 641 375 28 -386 -208 -56 210 549 445 324 84 -168 -459 -243 164 324 534 296 173 -250
4243 -250 -532 -476 13 343 762 507 336 -122 -340 -454 63 407 889 1174 561 -119 -572 -598 -206 412 761
4264G61L30l55p63n35p9L06M11P17K50o0m66p01n22n8R75P67mj48k62n70m35j98
4286f39J52P23Q08J15k54p53m76l55M53M68N40K68j15o21o85j56M37R1Q03j5j7
4307G72j69p83m55M3N39M50L34J76n12m53l20m59P35L70N58P3l97l82m93k50R2
4328e31N28O68K41j19n02q04k91K66K97N30M14K69n35o82m82j42K45O96M33M97
4348I96j97m77q77o38K68N84O72N28j2k07q91n61k42K39Q71P69J73m82o36m22
4368e42m68J22N55P56O88Kp03o89n04J3K24N85R28J90l66p41p30l37L82Q45L23
4389E33L49l36j84o82n30o4M93P56M80j62k24k84o72r4j00O90Q30J57n4p83n85
4410d66k23J70K19M31N88K57m12o53p90J94L30M90L12K13K86q40m22m38K4M34
$$ plain form
4264 761 1091 736 -27 -562 -641 -335 76 793 1043 983 517 -184 -706 -764 211 978 974 826 564 -6 -441 -639
4286 -639 -487 236 1044 1159 905 152 -324 -679 -226 242 782 1050 935 314 -371 -527 -90 1 804 789 772
4307 772 603 -180 -635 -592 -53 397 731 907 395 -58 -378 -837 -102 268 826 899 502 120 -373 -623 -531
4328 -531 -3 665 906 787 285 -519 -810 -544 -247 283 697 966 431 -251 -733 -875 -630 66 499 996
4348 996 799 322 -555 -1193 -925 -341 331 859 847 640 -251 -812 -1054 -815 56 825 998 516 -120 -542
4368 -542 -1010 -888 -333 423 1111 1113 410 -279 -783 -770 -546 39 967 1157 791 50 -680 -1017 -635 210 533
4389 533 882 546 362 -320 -850 -914 -421 335 815 653 429 145 -527 -621 -721 -31 799 956 902 119 -466
4410 -466 -689 -519 -300 131 719 976 564 -89 -879 -685 -355 135 447 660 946 106 -316 -754 -730 -296
4430b96Q27o8K59m01j80o23l67L27O32M66J38j78j90l32n17l11N55M45P09o0k88
4451E47m33o70k20O9O53N63M56m1q81m84nl50L21O83M79J22q3q66q17Q4M29N58
$$ plain form
4430 -296 531 463 722 321 141 -482 -849 -522 110 576 714 536 346 14 -503 -814 -259 186 895 835 547
4451 547 114 -556 -776 -707 -54 509 965 924 43 -441 -446 -796 -475 208 687 809 726 -140 -957 -873 -444 114
$$ [...]
8191G4
##END NTUPLES=NMR FID
##END=
