##TITLE=1H_IVM2501-1
 CDCl3, 8 sc, 
 8.2.2019
##JCAMPDX= 6.0         $$ Bruker NMR JCAMP-DX V2.0
##DATA TYPE= NMR FID
##DATA CLASS= NTUPLES
##ORIGIN= UXNMR, Bruker Analytische Messtechnik GmbH
##OWNER= root
$$ XWIN-NMR		Version 3.5
$$ Fri Feb  8 16:48:39 2019 Russian Standard Time (UT+4h)  she@DPX200
##.OBSERVE FREQUENCY= 200.1313
##.OBSERVE NUCLEUS= ^1H
##.DELAY= (6, 6)
##.ACQUISITION MODE= SIMULTANEOUS
##.ACQUISITION SCHEME= undefined
##.AVERAGES= 8
##.DIGITISER RES= 18
##SPECTROMETER/DATA SYSTEM= spect
##.PULSE SEQUENCE= zg30
##.SOLVENT NAME= CDCl3
##.SHIFT REFERENCE= (INTERNAL, CDCl3, 0, 15.7039)
##AUDIT TRAIL= $$ (NUMBER, WHEN, WHO, WHERE, WHAT)
$$ ##TITLE= Audit trail, XWIN-NMR		Version 3.5
$$ ##JCAMPDX= 5.01
$$ ##ORIGIN= Bruker BioSpin GmbH
$$ ##OWNER= she
$$ F:/spectra/data/she/nmr/H-F/1/audita.txt
$$ ##AUDIT TRAIL=  $$ (NUMBER, WHEN, WHO, WHERE, WHAT)
(   1,<2019-02-08 16:47:41.26 +0400>,<she>,<DPX200>,
      <created by zg, POWCHK disabled, PULCHK disabled
       configuration hash MD5:
       00 E9 B6 7A A2 85 ED C7 34 08 36 98 17 FE 4E 26
       data hash MD5: 16K
       F2 A0 D8 93 15 FA 34 F7 42 05 46 0E 98 CA 8A 95>)
$$ ##END=
$$ 
$$ hash MD5
$$ EB 16 FA E9 ED 92 8A 84 33 9F 51 81 F6 B2 0D 66
##$RELAX= 
##$RELAX= 
##$RELAX= 
##$RELAX= 
##$RELAX= 
##$RELAX= 
$$ Bruker specific parameters
$$ --------------------------
##$DU= <F:/spectra>
##$EXPNO= 1
##$NAME= <H-F>
##$PROCNO= 1
##$TYPE= <nmr>
##$USER= <she>
##$AMP= (0..31)
100 100 100 100 100 100 100 100 100 100 100 100 100 100 100 100 100 100 
100 100 100 100 100 100 100 100 100 100 100 100 100 100 
##$AQSEQ= 0
##$AQ_mod= 1
##$AUNM= <au_zg>
##$AUTOPOS= <>
##$BF1= 200.13
##$BF2= 200.13
##$BF3= 200.13
##$BF4= 200.13
##$BF5= 200.13
##$BF6= 200.13
##$BF7= 200.13
##$BF8= 200.13
##$BYTORDA= 1
##$CFDGTYP= 0
##$CFRGTYP= 5
##$CHEMSTR= <none>
##$CNST= (0..31)
1 1 145 1 1 1 1 1 1 1 1 1 1 1 1 1 1 1 1 1 1 1 1 1 1 1 1 1 1 1 1 1 
##$CPDPRG= <>
##$CPDPRG1= <>
##$CPDPRG2= <>
##$CPDPRG3= <>
##$CPDPRG4= <mlev>
##$CPDPRG5= <mlev>
##$CPDPRG6= <mlev>
##$CPDPRG7= <mlev>
##$CPDPRG8= <mlev>
##$CPDPRGB= <>
##$CPDPRGT= <>
##$D= (0..31)
0 1.2 0 0 0 0 0 0 0 0 0 0.03 0 0 0 0 0 0 0 0 0 0 0 0 0 0 0 0 0 0 0 0 
##$DATE= 1549630060
##$DBL= (0..7)
120 120 120 120 120 120 120 120 
##$DBP= (0..7)
150 150 150 150 150 150 150 150 
##$DBP07= 0
##$DBPNAM0= <>
##$DBPNAM1= <>
##$DBPNAM2= <>
##$DBPNAM3= <>
##$DBPNAM4= <>
##$DBPNAM5= <>
##$DBPNAM6= <>
##$DBPNAM7= <>
##$DBPOAL= (0..7)
0.5 0.5 0.5 0.5 0.5 0.5 0.5 0.5 
##$DBPOFFS= (0..7)
0 0 0 0 0 0 0 0 
##$DE= 6
##$DECBNUC= <off>
##$DECIM= 32
##$DECNUC= <off>
##$DECSTAT= 4
##$DIGMOD= 1
##$DIGTYP= 9
##$DL= (0..7)
0 120 120 120 120 120 120 120 
##$DP= (0..7)
150 150 150 150 150 150 150 150 
##$DP07= 0
##$DPNAME0= <>
##$DPNAME1= <>
##$DPNAME2= <>
##$DPNAME3= <>
##$DPNAME4= <>
##$DPNAME5= <>
##$DPNAME6= <>
##$DPNAME7= <>
##$DPOAL= (0..7)
0.5 0.5 0.5 0.5 0.5 0.5 0.5 0.5 
##$DPOFFS= (0..7)
0 0 0 0 0 0 0 0 
##$DQDMODE= 0
##$DR= 18
##$DS= 0
##$DSLIST= <SSSSSSSSSSSSSSS>
##$DSPFIRM= 0
$$ [...]
##$SUBNAM2= <"">
##$SUBNAM3= <"">
##$SUBNAM4= <"">
##$SUBNAM5= <"">
##$SUBNAM6= <"">
##$SUBNAM7= <"">
##$SUBNAM8= <"">
##$SUBNAM9= <"">
##$SW= 20.0189088683792
##$SWIBOX= (0..15)
0 0 2 0 0 0 0 0 0 0 0 0 0 0 0 0 
##$SW_h= 4006.41025641026
##$TD= 16384
##$TD0= 1
##$TE= 0
##$TE2= 300
##$TE3= 300
##$TEG= 300
##$TL= (0..7)
0 120 120 120 120 120 120 120 
##$TP= (0..7)
150 150 150 150 150 150 150 150 
##$TP07= 0
##$TPNAME0= <>
##$TPNAME1= <>
##$TPNAME2= <>
##$TPNAME3= <>
##$TPNAME4= <>
##$TPNAME5= <>
##$TPNAME6= <>
##$TPNAME7= <>
##$TPOAL= (0..7)
0.5 0.5 0.5 0.5 0.5 0.5 0.5 0.5 
##$TPOFFS= (0..7)
0 0 0 0 0 0 0 0 
##$TUNHIN= 0
##$TUNHOUT= 0
##$TUNXOUT= 0
##$USERA1= <user>
##$USERA2= <user>
##$USERA3= <user>
##$USERA4= <user>
##$USERA5= <user>
##$V9= 5
##$VALIST= <valist>
##$VCLIST= <CCCCCCCCCCCCCCC>
##$VD= 0
##$VDLIST= <DDDDDDDDDDDDDDD>
##$VPLIST= <PPPPPPPPPPPPPPP>
##$VTLIST= <TTTTTTTTTTTTTTT>
##$WBST= 1024
##$WBSW= 4
##$XGAIN= (0..3)
0 0 0 0 
##$XL= 0
##$YL= 0
##$YMAX_a= 652975
##$YMIN_a= -868709
##$ZGOPTNS= <>
##$ZL1= 120
##$ZL2= 120
##$ZL3= 120
##$ZL4= 120
##$ABSF1= 10
##$ABSF2= 0
##$ABSG= 5
##$ABSL= 3
##$ALPHA= 0
##$AQORDER= 0
##$ASSFAC= 0
##$ASSFACI= 0
##$ASSFACX= 0
##$ASSWID= 0
##$AUNMP= <proc_1d>
##$AZFE= 0.1
##$AZFW= 0.1
##$BCFW= 1
##$BC_mod= 2
##$BYTORDP= 1
##$COROFFS= 0
##$CY= 11.3945322036743
##$DATMOD= 1
##$DC= 2
##$DFILT= <>
##$DTYPP= 0
##$F1P= 18.9103706918063
##$F2P= -1.10871071338519
##$FCOR= 0.5
##$FTSIZE= 0
##$FT_mod= 4
##$GAMMA= 1
##$GB= 0.15
##$INTBC= 1
##$INTSCL= 1
##$ISEN= 128
##$LB= 0.24
##$LEV0= 0
##$LPBIN= 0
##$MAXI= 10000
##$MC2= 0
##$MEAN= 0
##$ME_mod= 0
##$MI= 1.114404
##$NCOEF= 0
##$NC_proc= 0
##$NLEV= 6
##$NOISF1= 3.799351
##$NOISF2= 2.8
##$NSP= 1
##$NTH_PI= 0
##$NZP= 0
##$OFFSET= 15.70392
##$PC= 1
##$PHC0= -8680.998
##$PHC1= 14.40019
##$PH_mod= 1
##$PKNL= yes
##$PPARMOD= 0
##$PSCAL= 0
##$PSIGN= 0
##$REVERSE= no
##$SF= 200.130013532006
##$SI= 16384
##$SIGF1= 3
##$SIGF2= 2
##$SINO= 400
##$SIOLD= 16384
##$SREGLST= <1H.CDCl3>
##$SSB= 0
##$STSI= 0
##$STSR= 0
##$SW_p= 3612.71676300578
##$SYMM= 0
##$S_DEV= 0
##$TDeff= 0
##$TDoff= 0
##$TI= <>
##$TILT= no
##$TM1= 0
##$TM2= 0
##$TOPLEV= 0
##$USERP1= <user>
##$USERP2= <user>
##$USERP3= <user>
##$USERP4= <user>
##$USERP5= <user>
##$WDW= 1
##$XDIM= 8192
##$YMAX_p= 0
##$YMIN_p= 0
$$ End of Bruker specific parameters
$$ ---------------------------------
##NTUPLES= NMR FID
##VAR_NAME=  TIME,          FID/REAL,        FID/IMAG
##SYMBOL=    X,             R,               I
##VAR_TYPE=  INDEPENDENT,   DEPENDENT,       DEPENDENT
##VAR_FORM=  AFFN,          ASDF,            ASDF
##VAR_DIM=   8192,          8192,            8192
##UNITS=     SECONDS,       ARBITRARY UNITS, ARBITRARY UNITS
##FACTOR=    0.0002496,     1,               1
##FIRST=     0,             0,               0
##LAST=      2.0444736,     0,               0
##MIN=       0,             -868709,         0
##MAX=       2.0444736,     652975,          0
$$ Real data points
##PAGE= N=1
##DATA TABLE= (X++(R..R)), XYDATA
0@%%%%%%%Qj6J6j6K4l2L2m0N6p2Q8j05J29j60J92k27K68l16L72m34N03n82O71
$$ 0 0 0 0 0 0 0 0 8 -8 8 -8 16 -16 16 -24 32 -40 48 -57 72 -88 104 -123 145 -171 201 -233 270 -312 359
30C59p70Q78r97J132j283J448j629J830k049K287k549K832l144L488l859M266
$$ 359 -411 467 -530 602 -681 767 -862 968 -1081 1206 -1343 1489 -1655 1833 -2026 2240
46B240m714N202n735O317o956P664q445R315j0284J1369j2602J4008j5629J7523
$$ 2240 -2474 2728 -3007 3310 -3646 4018 -4427 4888 -5396 5973 -6629 7379 -8250 9273
60I273j9770K2492k5867L0177l5907M3944n6115P6935j22007L90103l73229n71982
$$ 9273 -10497 11995 -13872 16305 -19602 24342 -31773 45162 -76845 313258 -59971 -631953
72f31953P08800l1878m87546L32731P62821l62822o38682J58030K75869l18729
$$ -631953 76847 44969 -442577 -109846 652975 290153 -348529 -190499 85370 -233359
82b33359L9594N15832L6658m43181k7204J16174k00500l2661L75787N5743k69740
$$ -233359 -193765 322067 358725 -84456 -111660 4514 -195986 -228647 147140 202883 -66857
93f6857L6906J74726j85280q8805K93733O8458l29252p8662J75044m8313o9164
$$ -66857 -29951 144775 -40505 -129310 164423 232881 -96371 -175033 11 -48302 -117466
104a17466K29204R5668k32957j08473O9164p2438L0091L16341Q1366k85885q0465
$$ -117466 111738 207406 -25551 -134024 -64860 -137298 -107207 209134 290500 4615 -75850
115g5850O9569k44083j11268M82531L10253l42852j69505K52039j80129m51227
$$ -75850 -6281 -250364 -361632 120899 431152 88300 -81205 170834 -9295 -460522
125d60522K80798N85069j63896l81703K10119Q3706n01639p7910N98707J46745
$$ -460522 -179724 405345 241449 -140254 69865 153571 -348068 -425978 172729 319474
135C19474l93399N7273K81120l23060l49000L66442L42919k69930j50146K55390
$$ 319474 -73925 -16652 264468 -58592 -407592 -41150 301769 31839 -118307 137083
145A37083n3563l30328J09630L28808p3821j75910J10539J7490k09712K2668K21061
$$ 137083 83520 -246808 -137178 191630 117809 -58101 52438 69928 -139784 -117116 103945
156A03945k0837j27597N2558j0928j67328M8261K29976J2530j06420M7782j5491
$$ 103945 83108 -44489 8069 -2859 -170187 -121926 108050 120580 14160 61942 46451
167D6451j87621o75K06363L9405p0935O3594k7136k28690k7624K21631M0293q2974
$$ 46451 -141170 -141845 64518 103923 32988 96582 69446 -159244 -186868 34763 75056 -7918
179g918J24007N2369k79187j30673K37078P2273j61401J22306K17371k33206k85651
$$ -7918 116089 168458 -110729 -241402 -4324 67949 -93452 28854 246225 13019 -272632
190b72632K12945K16293k00022m9116L03003k1246l65928Q197K81580p3991j77113
$$ -272632 -59687 156606 -43416 -92532 210471 189225 -176703 -168506 113074 39083 -138030
201a38030J94471J40448k56008j26200K22027M9678j73582O4371J64865j32279
$$ -138030 56441 196889 -59119 -185319 36708 86386 -87196 -22825 142040 9761
211I761j58271J28431R2911j15680R606J40183o5245j46265P5751J03978p4102
$$ 9761 -148510 -20079 72832 -42848 -33242 106941 41696 -104569 -28818 75160 1058
222A058k0177J05493l6388j35428L3032Q8023n4765j9106J07447q259j28927P284
$$ 1058 -19119 86374 49986 -85442 -52410 35613 -19152 -38258 69189 60930 -67997 -60713
234f0713Q4459m0062k6527R9123Q519j13394J1224Q2581o5571n4617J27103N3253
$$ -60713 23746 -16316 -42843 56280 64799 -48595 -37371 45210 -20361 -74978 52125 105378
246A05378j38424k5245J25462l3527j24618P7583J10800j06176p8609J23751K9314
$$ 105378 -33046 -58291 67171 33644 -90974 -13391 97409 -8767 -87376 36375 65689
257F5689j41943R728J39151m6374j16899Q6640R4716j06265n9427J11948J4170
$$ 65689 -76254 -66526 72625 26251 -90648 -4008 90708 -15557 -74984 36964 51134
268E1134j09925L3475J12304n3086q9777O1542M0797q6058p738R8152q781q1896
$$ 51134 -58791 -25316 86988 33902 -55875 5667 46464 -39594 -47332 50820 42039 -39857
280c9857K4771M0758o4945k0017R3101K3133p5254m953M1689l8755l2179O7546
$$ -39857 -15086 25672 -39273 -59290 33811 56944 -18310 -23263 18426 -20329 -52508 15038
292A5038M1376m4451j0994K1723m5076l4767P2050N3770n0070k8094K7991l4867
$$ 15038 56414 11963 969 22692 -22384 -57151 14899 68669 18599 -9495 18496 -16371
304a6371n9791M6108P7225j7410l2117J9482k6196o6423K9764Q9917M988l8400
$$ -16371 -76162 -30054 47171 29761 -2356 17126 -9070 -75493 -45729 44188 49176 10776
316A0776J2991j0473p3726n961Q6856L9404k7796P57l912p0709l7993O6027O0955
$$ 10776 23767 13294 -60432 -66393 20463 59867 32071 32828 28916 -41793 -79786 -13759 47196
329D7196j0986j1490n996n8544n1080M2601P3157J8025j290J149m7567o6646Q936
$$ 47196 36210 24720 18724 -39820 -90900 -48299 24858 42883 41593 42742 -4825 -71471 -62535
342f2535P1125M4770M338j2492m4872n9322p384M7785M8464L1155R265m3287p9018
$$ -62535 8590 53360 57698 45206 334 -58988 -66372 -18587 29877 61032 70297 27010 -52008
355e2008l3939L7520N5314L7291J4377k8400o6213m3509J6110N1708N6326L9793
$$ -52008 -85947 -48427 6887 44178 58555 30155 -36058 -79567 -63457 -11749 44577 84370
367H4370j1911o9240o5555q042M0036N5370M6323K013n6514o9095k6924K3708
$$ 84370 72459 3219 -62336 -70378 -30342 25028 71351 73364 16850 -52245 -79169 -55461
379e5461N4809O0933K3379m2625p6624m9235N538M9524O7980M3625j8555o9086
$$ -55461 -652 60281 83660 41035 -35589 -84824 -79286 -29762 38218 81843 63288 -5798
391e798o1158p290M4534O4279M8908M332n2121q1876m9663K5656P4427N9533J2312
$$ -5798 -66956 -74246 -29712 34567 83475 87807 35686 -46190 -95853 -70197 4230 63763 76075
404G6075l4226o7550n9858J839O2811O5875L1721q592n9395q6195k8691O2080
$$ 76075 41849 -25701 -85559 -83720 -20909 44966 76687 68095 8700 -77495 -106186 -44106
416d4106Q1129L6704K449k9021p6508o2593K8305Q1170M8505R677j6259p0576
$$ -44106 37023 73727 76176 47155 -29353 -91946 -63641 17529 66034 75711 59452 -11124
428a1124q9494m453Q3213O6361J6982P16l8264q8103m2106O2106Q2055L0339J277
$$ -11124 -100618 -105071 -21858 44503 61485 62201 23937 -64166 -106272 -44166 37889 68228 69505
441F9505k5397p8034o7382K8610Q6618N5982J3368k1028o9526p5005j160O3719
$$ 69505 44108 -33926 -101308 -72698 13920 69902 83270 62242 -7284 -82289 -83449 -19730
453a9730N9704L1191m249o0512q5555k7125N0103P4050N7503J2891n2244p8636
$$ -19730 39974 71165 66916 6404 -79151 -106276 -56173 17877 75380 88271 36027 -42609
465d2609l4141J8155M3277O6710N3832l4250r7062n0532J5484K5856M8716P5656
$$ -42609 -76750 -58595 -15318 51392 105224 70974 -26088 -76620 -61136 -35280 13436 89092
477H9092M963r4741p0805J1839J5102J3807P4958N6868p0243r9473K382L9653
$$ 89092 94055 -686 -71491 -59652 -44550 -30743 44215 101083 30840 -68633 -66251 -26598
489b6598O230M4807P7725k4570j11699l7752M2072J4651J7295O9829J6486r5774
$$ -26598 -20368 24439 102164 77594 -34105 -71857 -29785 -15134 2161 71990 88476 -7298
501g298p3637K2886L1674J9054O3061M1070p2742r5693k354L5783J3918M7336
$$ -7298 -80935 -58049 -26375 -7321 55740 96810 24068 -71625 -73979 -38196 -24278 23058
513B3058O9361j9139r7431m9678K2853L1324L8597N4728J0303o1842o8550k0909
$$ 23058 92419 73280 -24151 -73829 -50976 -19652 18945 73673 83976 22134 -46416 -67325
525f7325J7947M0753M6671J9470k0430m6319m8915j1914N1666N9927J243k5311
$$ -67325 -49378 -8625 38046 57516 37086 -9233 -58148 -70062 -18396 41531 42774 17463
537A7463m118k4773n2425J5513Q6254K7995m9933j7293J2521m0194l1418O9251
$$ 17463 13345 -11428 -63853 -48340 37914 65909 15976 -1317 11204 -28990 -60408 8843
549H843O7582m2132n7136R898o649m2156L2503Q4933O32o1415j1490K013m0699
$$ 8843 76425 34293 -22843 -12945 -19594 -61750 -29247 55686 56318 -5097 -16587 -14574 -55273
562e5273Q284Q9204L4764n7817k9661J0998l5043k9820O7110P1923k8894m7410
$$ -55273 -46989 42215 76979 19162 -10499 499 -34544 -64364 2746 74669 45775 -1635
574a635P122j6760n4319J9818Q5130J5346n3656j4224J5246k8646k8981M1219
$$ -1635 5487 -11273 -65592 -45774 39356 54702 1046 -13178 2068 -26578 -55559 -14340
586a4340N7656m157l7185j1005N586p291n916K0129K7437n374l3747j1282K1908
$$ -14340 43316 39159 1974 -9031 -3445 -10736 -16652 3477 30914 25540 -8207 -19489 2419
599B419N361j9226P610K8149j8219m2566J4795M3250j1353k8909K2244J5349m2508
$$ 2419 7780 -11446 -3836 24313 6094 -36472 -21677 21573 10220 -18689 3555 18904 -23604
612b3604j5943N3210K2695l6677k245L1581k5697m6260K7978M8179j7297k2060
$$ -23604 -39547 13663 36358 -319 -2564 29017 3320 -42940 -14962 33217 15920 -6140
624f140K5869k523n0529k236M7218k155k7869K7200K6735m4742l4868L9175K3881
$$ -6140 19729 17206 -33323 -35559 11659 9504 -18365 8835 35570 -9172 -44040 -4865 19016
637A9016l3898j036M7624k67m5547J002L0736j6995k9192K6655L6210j7664k7345
$$ 19016 -14882 -15918 31706 31439 -14108 -13106 17630 635 -28557 -1902 34308 16644 -10701
650a0701J1467R132k7435j8331K7298L2890n028k2237j013O065j8884j8783K7004
$$ -10701 766 9898 -17537 -35868 -8570 24320 19292 -2945 -3958 2107 -16777 -35560 -8556
663h556M3279n007l3047J589J3959k6642k1136M0059L9978k5797l2212J3493M513
$$ -8556 34723 29716 -3331 -1742 12217 -14425 -35561 4498 44476 18679 -13533 -40 4473
676D473k9608K871M1190K481l1947J153J4464k0675r213L8187J6282l6073j4875
$$ 4473 -25135 -22264 18926 21407 -10540 -9387 5077 -15598 -24811 13376 29658 -6415 -21290
689b1290K6158K28j9945K3627L2733k7635m0206J2255J7907j6768O629M4867l19
$$ -21290 4868 5096 -14849 8778 41511 13876 -26330 -14075 3832 -12936 -6307 38560 38241
702C8241n7708k4123K7528R975o779K8538L2997k7466n4092r481K4044J2735J4425
$$ 38241 -19467 -43590 -16062 -6087 -12866 15672 48669 21203 -32889 -42370 -18326 -5591 8834
715H834L0594P053m0842m2315O77K5760J9599J5641J3442j1431m0734l1473R685
$$ 8834 39428 46481 5639 -36676 -35999 -10239 9360 25001 38443 27012 -13722 -45195 -35510
728c5510L1043K0752Q217k12k1205l5561q904L0072K9834M678k938m925k4918
$$ -35510 -4467 16285 24502 24290 3085 -32476 -41380 -11308 18526 23204 20266 15341 -9577
741i577k7618J2344M2259J9285j2490j4630j5664k4298l404L5276L1693m781j9688
$$ -9577 -37195 -24851 17408 36693 24203 9573 -6091 -30389 -33793 1483 33176 28395 8707
754H707j5420k4366j7722K6952N1907J4584k5162k1801j5663k1957L924M8860
$$ 8707 -6713 -31079 -48801 -21849 30058 44642 19480 -2321 -17984 -39941 -36017 12843
766A2843M0466j2256l2239j9309k0294j3809L0464N4134J2895l2699k9931j7460
$$ 12843 53309 41053 8814 -10495 -30789 -44598 -14134 40000 52895 20196 -9735 -27195
778b7195j6482R256M6825L4214j5355l3232j9764j4264j984L4365M6041O458l1780
$$ -27195 -43677 -34421 12404 46618 31263 -1969 -21733 -35997 -37981 -3616 42425 48883 17103
791A7103l0966j5595k037K1045L7437J8425j7002l1982k6817j1645J6228L8376
$$ 17103 -13863 -29458 -31495 -10450 26987 45412 28410 -3572 -30389 -42034 -25806 12570
803A2570K8022o123l0322l1624j6768J1458L3560L0109P686j5432l1757l0610
$$ 12570 40592 34469 4147 -27477 -44245 -32787 773 30882 38568 23136 -8621 -39231
815c9231RL4346L6289J0936j0161k6396l5419j5805K4362L8413J6986m521j7401
$$ -39231 -39222 -4876 31413 42349 32188 5792 -29627 -45432 -21070 17343 34329 29808 12407
828A2407l3383k8767J2244M1311K7607J588j2193k8195l3931j605L7502L5035
$$ 12407 -20976 -49743 -37499 3812 31419 33007 20814 -7381 -41312 -42917 -5415 29620
840B9620Q115p568j9778l4880j9850K2125M0173K0106l423k0213l5087k5423J0664
$$ 29620 37735 30167 10389 -24491 -44341 -22216 17957 38063 34640 14427 -20660 -46083 -35419
853c5419L3589K4675Q621p075k8870l3905l240L0139L1725J4766k742k3823l3053
$$ -35419 -1830 22845 31466 24391 -4479 -38384 -41624 -11485 20240 35006 32264 8441 -24612
866b4612j1829J9074K7787J9499O296j6736l4914k2493R929K5825K2144J1430
$$ -24612 -36441 -17367 10420 29919 36215 19479 -15435 -37928 -27999 -2174 19970 31400
878C1400j0476l1994k5474L117K1187K2821J9617J366k7159l0970l518J6474J9298
$$ 31400 20924 -11070 -36544 -33427 -12240 10581 30198 31564 4405 -26565 -30083 -13609 5689
891E689K1756J2165k0647l7483j4367J3609J7763J6083J5506n602l0997k5541
$$ 5689 27445 39610 18963 -18520 -32887 -19278 -1515 14568 30074 24472 -6525 -32066
903c2066J601J6250K0041K0110J225k4930k5385l247J1891J6641K0256R519j5583
$$ -32066 -30465 -14215 5826 25936 27161 2231 -23154 -26401 -14510 2131 22387 31906 16323
916A6323k5517j2416K196J3320K3181J4309j3542k6463j2341J033N283J6237K0891
$$ 16323 -9194 -21610 -19414 -6094 17087 31396 17854 -8609 -20950 -19917 -14634 1603 22494
929B2494L16k2962j9076k636O095J3486K0076P856j4825j9332p584K563J0997
$$ 22494 22810 -152 -19228 -21864 -15769 -2283 17793 25649 10824 -8508 -16092 -13529 -2532
942b532J7410R148r030j5912j1353n802M902J8203J4302o069j5734r232m303r0
$$ -2532 14878 24026 14996 -916 -12269 -18071 -13169 5034 19336 13267 -2467 -11699 -16002 -16092
956a6092J3128J7546J924j2489q823m471l948O529J8649R711j0179j4281m830
$$ -16092 -2964 14582 16506 4017 -4806 -9277 -13225 -6696 11953 21664 11485 -2796 -7626
969g626l02J365Q663J0142o71r667r582o006J046J0123J0449J57o544n305l097
$$ -7626 -7928 -6563 2100 12242 11571 1904 -7678 -13684 -12638 -2515 7934 8091 1547 -3758 -6855
984f855k179N033J0564L975m759m857j343l266r23P351P620l357q672k190J713
$$ -6855 -9034 -4001 6563 10538 5779 922 -421 -3687 -4610 2741 10361 7004 -1668 -3858 -2145
999b145j624m87N308L286o111m527K565K437j611K050N489m29o434j117N191K553
$$ -2145 -3769 -4256 1052 4338 -1773 -6300 -3735 -1298 -2909 -859 4630 4201 -2233 -3350 1841 4394
1015D394j997j193J143k94j273j050m81J216J034j867l415P35L219j23k497m30
$$ 4394 2397 1204 2347 2053 780 -270 -751 465 1499 -368 -3783 -3048 171 48 -2449 -2879
1031b879o62J52L065L903p61k203K38j475l213K728P524K033l910k600m267o756
$$ -2879 -3541 -3389 -324 3579 2818 615 853 -622 -3835 -1107 6417 8450 4540 1940 -2327 -9083
1047i083K311J1102L311o048l61n78j1458n937J4548J2968n554m321N023p359
$$ -9083 -6772 4330 7641 1593 1232 654 -10804 -16741 -2193 10775 5221 900 5923 -1436
1061a436j5739P584K2506J138j2581K114K960j4872q197J7573J3693q148o282
$$ -1436 -17175 -9591 12915 14053 1472 3586 6546 -8326 -16523 1050 14743 6595 313
1074C13K435r577j0531J1127J7146k879q844J023l723j0843M326J8307O212o665
$$ 313 2748 -6829 -17360 -6233 10913 8034 -810 213 -3510 -14353 -10027 8280 14492 7827
1088G827m948o341r187L414J6099Q517m066n628q363j2146j537J3557J2766L731
$$ 7827 2879 -3462 -12649 -9235 6864 15381 11315 5687 -2676 -14822 -16359 -2802 9964 13695
1102A3695l497j2035j5681j901J2069J1156Q443O970r609k2914o323J3659P465
$$ 13695 10198 -1837 -17518 -19419 -7350 3806 12249 19219 9610 -13304 -19627 -5968 1497
1115A497L574J5241L521k7555k1610J3170J5414l682P357J6168j5109l1858K180
$$ 1497 5071 20312 23833 -3722 -25332 -12162 3252 -430 6927 23095 7986 -23872 -21692
1128b1692K1637L9j153J9281P43l2671j3210K2537J2208m929Q605R323k0532k2052
$$ -21692 -55 -16 -1169 18112 18855 -13816 -27026 -4489 7719 2790 11395 20718 186 -21866
1142b1866R898J6493P56O384Q286j6910k5294K776J6875N164O041J0303j0817
$$ -21866 -11968 4525 5281 11665 19951 3041 -22253 -19477 -2602 2562 8603 18906 8089
1155H089k5462n750J3031R740J0283J3174n566k4468j3170N610Q296J3537J7051
$$ 8089 -17373 -23123 -10092 -352 9931 23105 17539 -6929 -20099 -14489 -6193 7344 24395
1168B4395k290k2313j3009j245k596J0795K6232N720k3593j3790J356q022p45
$$ 24395 22105 -208 -13217 -14462 -17058 -6263 19969 25689 2096 -11694 -10338 -18360 -19105
1181a9105K9723J9317k1745j9356Q333k601j5747J7945L4699r179l1824P04R644
$$ -19105 10618 29935 8190 -11166 -2833 -5434 -21181 -3236 31463 22284 -9540 -8836 808
1194H08j3776J057L1864O071l0390j1274J1702o651o594K6727J8999k2730k1777
$$ 808 -12968 -11911 19953 26024 -4366 -15640 -3938 -10589 -17183 9544 28543 5813 -15964
1207a5964O070J080n873J9102K4431j1061k4187j803n55q249J3344K7883N4k2239
$$ -15964 -9894 -8814 -14687 4415 28846 17785 -6402 -8205 -8760 -17009 -3665 24218 24272 2033
1221B033r811l430r403P333K5975R244j3858j0195o012j1755K356K2125J2412
$$ 2033 -7778 -11208 -20611 -13278 12697 21941 8083 -2112 -8124 -19879 -17523 4602 17014
1234A7014m631m369q195j7056n00K2672J0490p715Q94N53k0161j2093K0779J7405
$$ 17014 12383 8014 -181 -17237 -17737 4935 15425 7710 8604 9157 -11004 -23097 -2318 15087
1248A5087j0103l619Q210j5459k1168J6349K7124p086j2573J1006k600k5702J543
$$ 15087 4984 1365 9575 -5884 -27052 -10703 16421 9335 -3238 7768 5168 -20534 -18991
1261a8991L0813O940j5090K142L099k2394q856K4795J4963j1383j701N493j8315
$$ -18991 11822 18762 3672 5814 8913 -13481 -22337 2458 17421 6038 4337 9830 -8485
1274h485j7769J7101K0493m627l398Q158j1688k2501P602K2254J717m398P748
$$ -8485 -26254 -9153 11340 6713 3315 11473 -215 -22716 -15114 7140 8857 4459 12207
1287A2207m496k0334k414J5870N852j529O583k615j8346n808J2133M367j137Q053
$$ 12207 7711 -12623 -15037 833 6685 5156 11739 9124 -9222 -15030 -2897 1470 333 8386
1301H386O05j6636o249J1370K146k984J2340N826j8341j1606J4480O805r321O980
$$ 8386 8991 -7645 -13894 -2524 -378 -3362 8978 14804 -3537 -15143 -663 6142 -3179 3801
1315C801J3345j2958j9210Q363J2076q387N31J6605n084k3306J276J5786m213
$$ 3801 17146 4188 -15022 -6659 5417 -2970 -2439 14166 9082 -14224 -12948 2838 -1375
1328a375m984J5792M395k0743o512J4365N95p908J2136J1353j5537j3005J0369
$$ -1375 -6359 9433 13828 -6915 -13427 938 1533 -6375 5761 17114 1577 -11428 -1059
1341a059M610r150N821J3410q564j5047N795O011q448J320J4197j975j3882J058
$$ -1059 3551 -5599 222 13632 5068 -9979 -4184 1827 -6621 -5301 8896 6921 -6961 -5903
1355e903P534m613q09J0437M50j0356J273O065o170k710J1194K772j2370j225
$$ -5903 1631 -2982 -3791 6646 7096 -3260 -1987 4078 -2092 -4802 6392 9164 -3206 -4431
1369d431Q028m543o441R293N983j1232l667J0159k215r916P714J0907r017q137
$$ -4431 3597 -946 -7387 1906 7889 -3343 -7010 3149 934 -8982 -1268 9639 622 -7515
1383g515R586L475j0698J849J2166m197j1024O829O691r708l780J1611j9j1614
$$ -7515 2071 5546 -5152 -3303 8863 4666 -6358 471 7162 -2546 -6326 5285 5266 -6348
1397f348K830R097o495o835R526L853j1327m99J1743j809r235M758P439p927m061
$$ -6348 -3518 5579 -916 -7751 1775 5628 -5699 -6198 5545 3736 -5499 -741 6698 -1229 -5290
1412e290R243J824q252J936O620o928o571Q587M967q035j057O648l847p550N597
$$ -5290 3953 5777 -2475 -539 6081 -847 -7418 1169 6136 -1899 -2956 3692 -155 -7705 -2108
1427b108O916n485k084P086k505r330L726R492l002m794O351Q48j0290q71R857
$$ -2108 4808 -677 -2761 4325 1820 -7510 -3784 5708 2706 -2088 4263 5111 -5179 -6050 3807
1442C807K51n624L812K960r395m441Q721L512m619J947L898p446o449P374N324
$$ 3807 4058 -1566 2246 5206 -4189 -8630 91 3603 -1016 931 4829 -2617 -9066 -1692 3632
1457C632l798J556N629n760r027M025P517j493r14N256l507r831N01P134l38j022
$$ 3632 -166 1390 7019 1259 -7768 -3743 3774 2281 1367 6623 3116 -6715 -6214 920 582 -440
1473d40N293J34j0518l238O996K743o31M112J283p995m789M825K726k15M802L566
$$ -440 4853 4987 -5531 -8769 -1773 970 339 4451 5734 -2261 -7050 -2225 501 286 5088 8654
1489H654p572p957K773M318q95L564M964m947r189N4L974L83K204O557j547r128
$$ 8654 1082 -6875 -4102 216 -679 2885 7849 2902 -6287 -6233 -2259 -1876 328 6885 5338 -3790
1505c790k753L299J118K443O806M61q129m381K458O27O30O651L126o509o554k72
$$ -3790 -6543 -3244 -2126 317 7123 7584 -545 -4926 -2468 -1841 -1211 5440 8566 2057 -4497 -4769
1521d769O24N92O571M960n004p566m53J250l86M570P359j095p289l660J23K89
$$ -4769 -4145 -3553 3018 7978 2974 -4592 -5045 -3795 -4181 389 7748 6653 -636 -4296 -4173 -3884
1537c884M239O721M67n919m625q05j114K156O650L502m306n270k651j302J303
$$ -3884 355 7076 7543 1624 -3001 -3806 -4920 -2764 3886 7388 3082 -2188 -4839 -6141 -4838
1552d838O428M780k052m310l156k128M10N627N617j28l390l540l817j263M781
$$ -4838 1590 6370 4318 8 -3148 -5276 -4866 761 6378 6250 2860 -680 -4497 -5760 -979
1567i79O034J091k977l439m009k807L212O066K559j298k210l830m515J458O986
$$ -979 5055 6146 3169 -270 -4279 -7086 -3874 2192 4751 3453 1243 -2587 -7102 -5644 1342
1582A342M597r92k396k724l858j435M638N577P67j932k713m430l025L099N906
$$ 1342 5939 4947 2551 -173 -4031 -5466 -828 4749 5516 3584 871 -3559 -6584 -3485 2421
1597B421K433j684k731k849l089J75M974M717M02k756k950k746j217L655N283
$$ 2421 4854 3170 439 -2410 -5499 -5324 -350 4367 4769 2013 -937 -3683 -4900 -1245 4038
1612D038J981k263l591l005j302N27M603M167n96l870l947j058l34K736N375K019
$$ 4038 6019 3756 165 -2840 -4142 -3615 988 5155 4559 689 -3258 -4316 -4650 -1914 3461 5480
1628E480l405m679j077N48O32L787M439p90m582l064j71N60K275L912J119l737
$$ 5480 2075 -2604 -3681 -3133 -2501 1286 5725 4935 353 -2711 -2882 -2322 -47 3865 4984 1247
1644A247l940o19R16J219K259K434r40m277k306N35K441K288J764P8k515l019
$$ 1247 -2693 -3312 -2396 -1177 1082 3516 2576 -1701 -4007 -3472 -1031 1257 3021 3099 584 -2435
1660b435p03K157K517J721M17j428l814k628J206L612J521j88J09j975l891j103
$$ -2435 -3138 -981 1536 3257 3674 2246 -1568 -4196 -2990 622 2143 1955 2064 89 -3802 -4905
1676d905L846L192p21K13R72l497l737J945N055J90j241R30l57m650r50M431J909
$$ -4905 -1059 2133 1412 1625 2597 -900 -4637 -2692 2363 2553 1312 2242 1885 -2765 -3715 716 2625
1693B625k242J3J405k901l645K983L971q72k292J293R0l001K4M006J120j584k77
$$ 2625 383 396 1801 -1100 -4745 -1762 2209 1337 -955 338 428 -2573 -2549 1457 2577 993 716
1710G16o2j835n74K255K056o74j269p43r19o75L94J740Q24m5j497j444L5O62K01
$$ 716 654 -1181 -1755 500 2556 1882 613 -130 -1049 -1724 -1330 410 1234 1189 -308 -1752 -1717 -1055 -854
1729h54J820J452j102k392L08J257m92p01K466J123k938j750K035M7j875J279
$$ -854 966 2418 1316 -1076 -768 489 -3 -704 1762 2885 -53 -1803 232 279 -1596 -317
1745c17K821k132l048K000K406l010q98L475P44l988K24L568o65k753J840K099
$$ -317 2504 372 -2676 -676 1730 -1280 -2178 1297 2041 -1947 -1723 1845 1180 -1573 267 2366
1761B366k530j888K895J328k914k66K408p47k799J132K104p02j653J291N13j312
$$ 2366 -164 -2052 843 2171 -743 -1009 1399 652 -2147 -1015 1089 387 -1266 25 538 -774
1777g74n90J533N90r81L34N16j26q29N76K52l0k1n07k33K51O21p16m59Q66o57
$$ -774 -1364 169 759 -222 112 628 502 -327 249 501 471 450 -57 -290 -39 582 -134 -593 273 -384
1797c84p16Q60J262j232q21J241J20j767M75K366J72k073N78R76j647r75K092
$$ -384 -1100 -240 1022 -210 -1031 210 330 -1437 -962 1404 1576 -497 81 1057 -590 -1565 527
1814E27J571k160m66J660j269k241J541K471r07k229J784R6k052n3K824N28k003
$$ 527 2098 -62 -528 1132 -137 -2378 -837 1634 727 -1502 282 378 -1674 -1727 1097 1625 -378
1831c78N50O46j064j349J849J717j335n59J80l51j421J175J374l32p50nl89r52
$$ -378 172 818 -246 -1595 254 1971 636 77 257 -94 -1515 -340 1034 702 -48 -53 -442 -1394
1849a394O55J053L55O3l44j066p95R14J548k83J70L51q11j526K40J328L17q8K77
$$ -1394 -739 314 669 732 388 -678 -1473 -559 989 706 876 1227 416 -1110 -870 458 775 687 964
1868I64o62j810J2J449L43m8P38J7k237p79J614J107l36M61R44j520k288J061
$$ 964 302 -1508 -1496 -47 296 248 986 1003 -1234 -2013 -399 708 372 833 1777 257 -2031 -970
1886i70J600k90K14Q58p07k175j58J419N47j87N91m1j863q55J454Q44L7O09N3
$$ -970 630 340 554 1412 705 -1470 -1628 -209 338 151 742 701 -1162 -2017 -563 281 318 927 980
1905I80j363r69P91R00L08M67J75j284j190M2J179k4O90L17m44j511m70O41P65
$$ 980 -383 -1352 -561 339 647 1114 1289 5 -1185 -1143 36 12 702 1019 575 -936 -1406 -765 0
1924@M02R41n75j300k40O6K88R71R59k92j162o99k47l1P55J378J37j123j139K38
$$ 0 402 1343 768 -532 -772 -706 -418 553 1512 1220 58 -641 -888 -919 -164 1214 1351 228 -911 -673
1944f73l74K49J307R37p82j341m7k13J86J109Q89j13j092o04j30N79K65Q39K94
$$ -673 -1047 -798 509 1446 664 -677 -724 -937 -751 358 1247 1134 42 -562 -692 -113 152 991 1285
1963A285r33q67k73J7K78J077L75m75j202p4l8K26Q91O31k86n50l90l95K6O52
$$ 1285 352 -515 -788 -771 -493 584 959 484 -718 -792 -830 -604 287 918 632 82 -308 -703 -677 -25
1983b5J074Q6q09o18p4l14O80M16K85j10o42m17n26L84Q24N46l14m57k03n11j6
$$ -25 1049 1135 326 -292 -366 -680 0 416 701 591 -51 -468 -994 -610 214 760 446 -11 -214 -725 -741
2004g41R36M59j02p8k84q26P0M40N87J22j7n50l52l90K19O81L95l51k11l13m37
$$ -741 195 654 552 474 190 -636 -566 -126 461 583 566 16 -336 -726 -507 174 569 218 7 -306 -743
2025g43L21K64M83M91m06l74k27j81L81N22j3M9l74j92m99R9M57J96n4n4m76m34
$$ -743 -422 -158 325 816 410 36 -191 -372 9 531 518 567 193 1 -498 -399 58 254 200 146 -330 -764
2047g64L19M57L16l2j54R9n89J07J51M03K39m07J97n20j37J65L26m8J90j04m13
$$ -764 -445 12 328 296 142 241 -348 -241 -90 313 552 145 342 -178 -315 -150 176 128 318 214 -199
2068a99ok03L08L87j55J25k77k34q1n8N06J55o8J06k06l09J86K18m4j42j11k8
$$ -199 -205 -408 -100 287 132 257 -20 -254 -335 -393 113 268 200 306 100 -209 -23 195 151 9 -102 -130
2090a30k59J81K1L51j54j33J93r4l71L65O2J94p0K2j60J68k30K40l7RK1n6l06
$$ -130 -389 -208 -187 164 10 -123 70 -24 -395 -30 32 226 156 178 18 186 -44 196 159 168 189 133 -173
2113a73j09K88j27L99j91j6k80J83j49L65l83k4L94k88K42q5L8PM1j21J01j87
$$ -173 -282 6 -121 278 87 71 -209 -26 -175 190 -193 -217 177 -111 131 46 84 91 132 11 112 -75
2135g5N6M8j30K55k70J18L8j26k65K50L18m4q1r0n6k75O15o9j77k20J83J50K4
$$ -75 -19 29 -101 154 -116 2 40 -86 -351 -101 217 173 92 2 -54 -329 286 217 40 -180 3 153 177
2158A77j82N5m9j39o0K17j33Q3j70K11k16L56l34k1J75K7K00k79J58k75K64oL6
$$ 177 -5 50 1 -138 -198 19 -114 -31 -201 10 -206 150 -184 -205 -30 -3 197 -82 76 -199 65 59 95
2181I5m0nK1j55J53j07K9n4j07K38j9o1j5J27K35k4l50j05L20l66K37J64J59k16
$$ 95 55 50 71 -84 69 -38 -9 -63 -170 68 49 -12 -27 100 335 311 -39 -144 176 -190 47 211 370 154
2205A54p0l54Q6K34J2j09J38l76R9J82Q4l27M19P6l30J01q4M3K55j99J78J04m59
$$ 154 84 -270 -184 50 62 -47 91 -285 -186 -4 80 -247 172 248 -82 19 -65 -22 233 34 212 316 -143
2228a43J67j31J02P6L9K81l21j82k18K53J11P7J4k62m1J08l55M02R5k6O1j49j76
$$ -143 24 -107 -5 71 110 391 70 -112 -330 -77 34 111 125 -137 -178 -70 -425 -23 72 46 107 -42 -218
2251b18m9K66J61J36k08j06j4n41K18M79J99l25M2j66q7n7lL62K1J49l9n38p0
$$ -218 -267 -1 160 296 88 -18 -32 -573 -355 124 323 -2 40 -126 -213 -270 -273 89 110 259 220 -318 -388
2274c88L11K05M4R3j83L5m78K6N28O3n4pk12m13p8K67L43J24n5l40J79k67p0M00
$$ -388 -77 128 172 265 82 117 -361 -335 193 256 202 195 -17 -430 -508 -241 102 226 171 -169 10 -257 -327 73
2298G3M90k74j81j85j37n1N13n8J91k20j94k82K81k49M41M15j79m96k69J95M73
$$ 73 563 289 108 -77 -214 -265 248 190 381 161 -33 -315 -34 -283 158 573 394 -102 -371 -176 297
2319B97k40P0J90m6m17l52K98J5N26J00No61L3k95L95K25J99%l84k77j10J47Q2
$$ 297 57 127 317 271 -146 -498 -200 -185 341 441 446 -215 -182 -477 -82 143 342 342 -42 -319 -429 -282 -200
2342b00M55P5K0m66k10L04K11p6L2J27k39m26K40K80j28K97k09j53m16K45j98
$$ -200 255 330 350 -116 -326 -22 189 113 145 272 33 -393 -153 127 -1 296 87 -66 -482 -237 -435
2363d35O30n3nm3k74j34R6M64P5J33k14k07k04j07J97P6L93j31l29j63O7k57J91
$$ -435 195 142 137 94 -180 -314 -218 246 321 454 240 33 -171 -278 -81 -5 388 257 -72 -235 -168 -425 -234
2386b34O08k32k32O0jm24J22L44M50m15l7J13k38j19L33N38l11j66m1r1k27j4
$$ -234 374 142 -90 -30 -31 -455 -333 11 461 46 9 122 -116 -235 98 636 325 159 118 27 -200 -214
2408b14M68K08o71j77L63k17M0L37K19j41l63J18k30K48J95M28k80l74J2q6k32
$$ -214 254 462 -209 -386 -23 -240 -200 137 356 215 -148 -30 -260 -12 183 611 331 -43 -31 -117 -349
2429c49K84M74l21p2q6r1k33L30K63k43J6k39J0r3K32L41K93m51M7p9l45K31J90
$$ -349 -65 409 88 16 -70 -161 -394 -64 199 -44 -28 -267 -257 -350 -118 223 516 65 112 33 -312 -81 109
2452A09j91N7JJ49k29p9K24J73j51j87O8j30pQ0L69j29r1J06M7l53k4N59j53j34
$$ 109 -82 -25 -24 125 -104 -183 41 214 63 -124 -56 -186 -193 -113 256 127 36 142 189 -164 -188 371 218 84
2476H4j36k8j74l8N58k41J79l24J82j31j84J51M2n8J63Ql48K60j5L04j98J0Q3
$$ 84 -52 -80 -254 -292 266 25 204 -120 62 -69 -253 -102 -60 -118 45 53 -295 -35 -50 254 56 66 149
2499A49j96O4K4k9Q0k86L06O4m70J99k6J50k46j55L57k98J85P7K25k41K26K46
$$ 149 -47 17 41 12 92 -194 112 176 -294 -95 -121 29 -217 -372 -15 -313 -128 -51 174 -67 159 405
2521D05m77L6L12q9p2lJ25n9j57K8k0p9l1J80j89l11N45J59k25m33N35j83r1K5
$$ 405 -72 -36 276 187 115 112 237 178 21 49 29 -50 -81 99 -90 -401 144 303 78 -355 180 -3 -94 -69
2545f9L53j95j98L57n2Ol43M45j72j60J70j10q7j50K28j0j58Q8R5q5j60L21n5
$$ -69 284 89 -109 248 196 202 -141 304 132 -28 142 32 -55 -205 23 13 -145 -57 38 -47 -207 114 59
2568E9n8N8K24n44M5M73m2p5j34J27o6k08j45L84l84J67J51k9l63K1M65q6j81
$$ 59 1 59 283 -261 -216 257 215 140 6 133 67 -141 -286 98 -286 -119 32 3 -360 -339 126 40 -141
2591a41J38J20k80J45J72K70m30L6j11r4j34L59K96r8j79k0n2k43P5O48j80m08
$$ -141 -3 117 -163 -18 154 424 -6 30 -81 -175 -309 50 346 248 69 49 -3 -246 -171 477 297 -111
2613a11L36m50k7J58K79l8m1j0q3k00jJ88K91L1m01J0p0l3J3M62k61k85J38k1
$$ -111 225 -225 -252 -94 185 147 106 96 13 -187 -188 0 291 322 -79 -69 -139 -172 -159 303 42 -243 -105 -126
2637a26l24J87J90J98L80k99l92k61L80M26j81l56R1K33l19p3L42K47L1l38j01
$$ -126 -450 -263 -73 125 505 206 -186 -447 -67 359 178 -178 -87 146 -173 -246 96 343 374 36 -65
2658f5j91j44R3L10n2J21J89n35j04K67K81j24K69J30l51k74j49L56L38k11K91
$$ -65 -256 -400 -307 3 -49 72 261 -274 -378 -111 170 46 315 445 94 -180 -329 27 365 154 445
2679D45j48o07p9M89j86Q0J07p4j53k40lM40N8n8J34k96j80K34J73j05K77J88
$$ 445 297 -310 -389 100 -86 -6 101 27 -126 -366 -369 71 129 71 205 -91 -271 -37 136 31 308 496
2701D96m18k98L9ML00o5Q2j53P8k41Q3P3K19J51l04j93k1j38M65J31R5r2l31j7
$$ 496 78 -220 -181 -177 123 58 140 -13 65 -176 -93 -20 199 350 46 -147 -168 -306 159 290 385 293 -38 -55
2725e5k34L58j61M15P3m57M1p7L6j38K08K90m13l3l5nK02l1L56j43k10p1K6O5
$$ -55 -289 69 -92 323 396 -61 -20 -97 -61 -199 9 299 -114 -147 -182 -187 15 -16 340 197 -13 -84 -58 7
2749GK38m3J78k74m39J31k41M85M0Lr4j08j8r9J72LQ8j62m2J8O4L8K72R0J55m03
$$ 7 245 202 380 106 -333 -202 -443 42 82 85 -9 -117 -135 -234 -62 -59 29 -133 -175 -157 -93 -55 217 307 462 59
2775E9K9k34o6J94N5R8j38J38j65j92K65J89k15j53O4o4m4K60K00L3o1l62L8j7
$$ 59 88 -146 -212 -18 37 135 -3 135 -30 -222 43 232 17 -136 -72 -136 -180 80 280 313 252 -110 -72 -89
2799h9k03L42L25k16j64K55j65q6k9P4K05l85K8k6Q2j37J80J15P9k16J85l4l25
$$ -89 -292 50 375 159 -5 250 85 -1 -30 44 249 -136 -108 -134 -52 -189 -9 106 185 -31 154 120 -205
2822b05M04K2j74N2l5l25R9K20M8j66J31k27r6L46R6l88q6K97j86j13K83o4Q8
$$ -205 199 221 47 99 64 -261 -162 58 106 -60 71 -156 -252 94 190 -198 -284 13 -173 -286 -3 -67 21
2845B1k7l7k4k70J92N4L17k38K24k79J99l16J10O3K5j65K15q9q7J22M8K53j93
$$ 21 -6 -43 -67 -337 -145 -91 226 -12 212 -67 132 -184 -74 -11 14 -151 64 -25 -112 10 58 311 118
2868A18k40J41l5o5j70M26j33p4k0J35n1j05j71M52m75k0K45K14n42K85Q3L49
$$ 118 -122 19 -16 -81 -251 175 42 -32 -52 83 32 -73 -244 208 -267 -287 -42 172 -370 -85 -2 347
2890C47l17j80K50jl07J55K36k77J16N7K31j86m0N9j36j84n2J64K99j54q4m7m1
$$ 347 30 -150 100 99 -208 -53 183 -94 22 79 310 124 84 143 7 -177 -229 -65 234 80 -4 -51 -92
2913i2K1n9J68K04m71K87J68k44N0j48K44j03j50L26j7k34k72M35K7k61J58p0
$$ -92 -71 -130 38 242 -229 58 226 -18 32 -116 128 25 -125 201 184 -50 -322 113 140 -121 37 -33
2935c3o6q0K48j64qJ47j30O6l1J02J52J89k45j88J20j13k33M48K03j51k87Oo2
$$ -33 -99 -179 69 -95 -103 44 -86 -20 -51 51 203 392 147 -41 79 -34 -267 181 384 233 -54 -48 -110
2958a10J45q6J38J37k83l99M32l14K91K9M52j97k11j41j56N68l14J40R5m7k88
$$ -110 35 -51 87 224 -59 -458 -26 -340 -49 -20 432 235 24 -117 -273 295 -19 121 216 169 -119
2979a19%J82J42k99R0k1M1m16K44J99n1J97l48l4K69l03J59M75k55L6j9l72K19
$$ -119 -119 63 205 -94 -4 -25 16 -400 -156 43 -8 189 -159 -193 76 -227 -68 407 152 188 169 -203 16
3002A6p1K49p4j76J00l0k79M5M6J07J18J01k59j40O9J49L54j78r0o9M9k8k31L65
$$ 16 -55 194 120 -56 44 14 -265 -220 -174 -67 51 152 -107 -247 -178 -29 325 147 57 -12 37 9 -222 143
3026A43J03l97J57j56P2k9K44k1p7q7o8j63J33J2K11j00K03k13J15n9j07K08K6
$$ 143 246 -151 6 -150 -78 -107 137 116 39 -48 -116 -279 -146 -134 77 -23 180 -33 82 23 -84 124 150
3049A50k21Q7O8l63L63k60M43k13j19l69L73K7j7N9N7K7j28q9K5Q4J29q8Q3j47
$$ 150 -71 16 84 -279 84 -176 267 54 -65 -434 -61 -34 -51 8 65 92 -36 -125 -100 -16 113 25 108 -39
3073c9j21qL81l0P5j06m6k32O1J84j69m3j82K83j36J99l14M29j71j10L4j32J61
$$ -39 -160 -168 213 183 258 152 106 -126 -65 119 -50 -93 -275 8 -128 71 -243 186 15 -95 -61 -193 -32
3096c2kJ39j18K15j76L02m85K18j17j31J24M2m6k2M6k17K71N3K8j5q0j85J1L80
$$ -32 -34 105 -13 202 26 328 -157 61 -56 -187 -63 -21 -67 -89 -43 -260 11 64 92 77 -3 -188 -177 203
3120B03k58J00J3q6K35j43p0j75M67l17J17m24J60J78k88M7L12j67p1l8M0J96
$$ 203 -55 45 58 -28 207 64 -6 -181 286 -31 86 -338 -178 0 -288 -241 71 -96 -167 -205 -165 31
3142C1q2J52J57p5l82M62k01j02R7j25J70r5Q0j6j80J31O1l54M1J54n9K4j08L01
$$ 31 -51 101 258 183 -199 263 62 -40 57 -68 102 7 87 71 -109 22 83 -271 -230 -76 -135 -111 -219 82
3166H2k81k3J86K01j52R0j03nK09k63L06j98l2Q4J35l55J67m1R3j74JJ23j41J90
$$ 82 -199 -222 -36 165 13 103 0 -5 204 -59 247 49 17 101 236 -119 48 7 100 -74 -73 50 -91 99
3190I9j36j65K44k0o5M02n65M29J31k60j78L80l85M4K81l48J91j89R1Nm18K13
$$ 99 -37 -202 42 22 -43 359 -206 223 354 94 -84 296 -89 -45 236 -112 79 -110 -19 -14 -432 -219
3212b19L22j84O1l1j71J86K03j76J2J72R0l3Om12K04J54kj70k22L07j36j94K64
$$ -219 103 -81 -20 -51 -222 -36 167 -9 3 175 265 232 238 -174 30 184 182 12 -210 97 -39 -233 31
3235C1j07Q1J11n7j07nk39K45J04J06k5k4l9J02j07jkK35m08J65m5j48K28J39
$$ 31 -76 5 116 59 -48 -53 -292 -47 57 163 138 114 75 177 70 69 67 302 -106 59 14 -134 94 233
3259B33j99l4j82j23M7K32K5J02j09j11p1R6K86P1j32j56m7J63J5l08J35K34k8
$$ 233 34 0 -182 -305 -258 -26 -1 101 -8 -119 -190 -94 192 263 131 -25 -72 91 106 -202 -67 167 139
3282A39k60M1K16J02l14Q9O9j65j91K82Q1M7k36L19l8j29L6r4K69k29O1Oj61j85
$$ 139 -121 -80 136 238 -76 13 82 -83 -274 8 89 136 -100 219 181 52 88 -6 263 34 95 101 -60 -245
3306b45n1L8n3L29J32j05r5k04K1J1K57j57K29O4m36J95K47o2j9P5K09l80k66
$$ -245 -296 -258 -311 18 150 45 -50 -254 -233 -222 35 -122 107 171 -265 -70 177 115 96 171 380 0 -266
3329b66O5N11l59n8K1K6k41K22J24ro6j35J80j0k07r3O04l3j69J31O3l95j11L98
$$ -266 -201 310 -49 -107 -86 -60 -301 -79 45 36 -30 -165 15 5 -202 -295 309 276 107 238 301 -94 -205 193
3353A93j79N3o2o5j30M1%M20k26j10j07K56m97L25K87q6j13j05K20j07r8J51L06
$$ 193 14 67 5 -60 -190 -149 -149 271 45 -65 -172 84 -413 -88 199 113 0 -105 115 8 -90 61 367
3376C67J07l70l49M35J0l62J18L43j12l59j27K24j27R3J26K02l18O8J42j14l1
$$ 367 474 104 -245 190 200 -162 -44 299 187 -172 -299 -75 -202 -109 17 219 -99 -31 111 -3 -34
3397c4lN14j50o23K87K56k87R2K44o7l50rJ26j50J54j05M22r9l15l12L35M03j74
$$ -34 -37 477 327 -296 -9 247 -40 52 296 229 -121 -130 -4 -154 0 -105 317 218 -97 -409 -74 329 155
3420A55J34Kr0l38J81LL0J81r8o2k38k49L70J52J7k4Q1j47m55K18M27j95p8K35
$$ 155 289 291 201 -137 44 47 77 258 160 98 -140 -389 -19 133 150 126 207 60 -395 -177 250 55 -23 212
3444B12M5l03j16J60L59J2k22J5j34j42k90N93m6M4M4j55k42JLL84j63%j88P1
$$ 212 257 -46 -162 -2 357 369 147 162 28 -114 -404 189 143 187 231 76 -166 -165 -162 222 59 59 -129 -58
3468e8J11k97L61R5J45k64M2q1j1m9L81o9k69j40K89k08j55J02J60k4k49M9K46
$$ -58 53 -244 117 212 357 93 135 54 43 -6 375 306 37 -103 186 -22 -177 -75 85 61 -188 -139 107
3491A07j65K10J30o3k69lJ37j09L6J91J55j70l96o3J52J55r8J47L07m71l71L32
$$ 107 -58 152 282 219 -50 -53 84 -25 11 202 357 187 -209 -272 -120 35 -63 84 391 -80 -451 -119
3513a19m6n9K86J85o4k43k7K31o6L6k17M18j27q6k66L81j45j5q0j29J97j32N1
$$ -119 -165 -224 62 247 183 -60 -87 144 78 114 -103 315 188 102 -164 217 72 57 -23 -152 45 -87 -36
3536c6j31L90l39J00Ll8rMj78M18j32J90o2k51K47J90j26k82K1L13l38j51j38
$$ -36 -167 223 -116 -16 -13 -51 -60 -56 -234 184 52 242 180 -71 176 366 240 -42 -21 292 -46 -197 -335
3559c35L92k84K32n2J53j82r1K77j10K22n6O7k39O4j32J55j57K73K7j32J3m1J4
$$ -335 57 -227 5 -47 106 -76 -167 110 0 222 166 233 -6 58 -74 81 -76 197 224 92 105 64 78
3582G8j50j40J80p1j77N7J66J52P2k78k7R8Rp6J2L68j39r7M6k21o0P3jK99j31
$$ 78 -72 -212 -32 -103 -280 -223 -57 95 167 -111 -138 -40 -31 -107 -95 273 134 37 83 -138 -198 -125 -126 173 42
3607D2l28J72j23J6R3O5j78L42k32n6J15K72J1j50J14q3j00N8j94K14P3J26n00
$$ 42 -286 -114 -237 -221 -128 -63 -241 101 -131 -187 -72 200 211 61 175 92 -8 50 -144 70 143 269 -231
3630b31K11p3j92O3J84J48j64J35j58J0J10Q6k1k71L80q4j04L1K6L4L9q3j79J30
$$ -231 -20 -93 -285 -222 -38 110 -54 81 -77 -67 43 129 108 -163 217 133 29 60 86 120 159 76 -103 27
3654B7j41r8J54K60j33m1q7n0K7r5J26K01l2m8p2k39l4K23Q7K42pk32q5O6J53
$$ 27 -114 -212 -58 202 69 28 -59 -109 -82 -177 -51 150 118 70 -2 -241 -275 -52 35 277 270 38 -47 19 172
3679A72k90L00M6j61l19K16m00K68J35J93o1n0r8o1N6RJ08J64j11k20J31R3L0
$$ 172 -118 182 228 67 -252 -36 -436 -168 -33 160 99 49 -49 -110 -54 -45 63 227 116 -104 27 120 150
3702A50r9J82j21k2j73m9L5P3O8k68J63j84J83oN7K25j56J12k38K70k60J01O2
$$ 150 51 233 112 90 -83 -132 -97 -24 44 -224 -61 -245 -62 -68 -11 214 58 170 -68 202 -58 43 105
3725A05J76n8k06k08R0j06J67J27J8k50k33J12P0r4L00J53q8j5l56K42R9k2J98
$$ 105 281 223 17 -191 -101 -207 -40 87 105 -145 -378 -266 -196 -290 10 163 75 60 -296 -54 45 23 221
3748B21k4j44J80k62k87K97J2O0J20k66m15K98J34J07K71m02l1r4M1K21m1L29
$$ 221 197 53 233 -29 -316 -19 -7 53 173 -93 -508 -210 -76 31 302 -100 -131 -225 -184 37 -4 325
3770C25N9m05K48o03K54K32J08k03n3J61l60K86k9K8J38j02l11M2j48J3L23J36
$$ 325 384 -21 227 -376 -122 110 218 15 -38 123 -237 49 20 48 186 84 -227 -185 -333 -320 3 139
3792A39j2Lp6k64J22Q5J95J27l07q3j59j04J55L72p2j0k89j64P4n8L12L22j37
$$ 139 127 130 54 -210 -88 -3 192 319 12 -71 -230 -334 -179 193 121 111 -178 -342 -268 -326 -14 308 171
3815A71J24m09K59l59L58K42N5k20j72j65J0J12o4L44j84m2j18k30K39k3J07J15
$$ 171 295 -114 145 -214 144 386 441 221 49 -116 -106 6 -58 286 102 60 -58 -288 -49 -72 35 150
3837A50j79q5j60R1J07K72K3o9N6m8l39J9L57M2R2l4m57j26N2K79j85L70O6k37
$$ 150 -29 -114 -274 -183 -76 196 219 150 206 158 -181 -162 195 237 329 295 -162 -288 -236 43 -142 228 294 57
3861E7m10j66L78L68jn0p4k57L6p4M29L8k49K5p0j95J70K09j32J20rr8j12k72
$$ 57 -353 -519 -141 227 226 176 102 -155 -119 -193 236 274 25 50 -20 -215 -45 164 32 152 143 45 -67 -339
3885c39J90J14P2K46j58k5j86k7K44qJ16k15j44N0j73Q6M03Q4k15N3l25j15K46
$$ -339 -149 -35 37 283 125 100 -86 -113 131 123 239 24 -120 -70 -243 -157 246 330 115 168 -157 -272 -26
3908b6K62k47J10l0Kl85N5L46OK39P8j31k07l19J02K17R6j25r6k09J46p2J06J01
$$ -26 236 -11 99 69 71 -314 -259 87 93 332 410 279 72 -247 -145 72 168 43 -53 -262 -116 -188 -82 19
3932A9J46j92J82l65J12l5K8K92K7m5j93k10R4n5L92J14j96k8p3n5j15N35m52
$$ 19 165 -27 155 -210 -98 -133 -105 187 214 169 -24 -234 -140 -195 197 311 115 87 14 -41 -156 379 -73
3955g3J00K8l15P3k8q6K76j92K21k46M7K48K7P9K65j76j58k96j16K42J43r8K27
$$ -73 27 55 -260 -187 -215 -301 -25 -217 4 -242 -195 53 80 159 424 248 90 -206 -322 -80 63 -35 192
3978A92j61l2k98J44J05J90j21jR6k73k0k7L14R1K9J43m74L8J23mJ02J1Pj43m82
$$ 192 31 -1 -299 -155 -50 140 19 18 114 -159 -179 -206 108 199 228 371 -103 -65 58 54 156 167 174 31 -451
4003d51K49K00L8l0J27l23j9J43RN1j48KK5L28k32J70j20LRj15K03J2k01M4L2
$$ -451 -202 -2 36 6 133 -190 -209 -66 -57 -6 -154 -152 -127 201 -31 139 19 22 31 -84 119 131 -70 -26 6
4028Fj26J58K1l32J35j20K02k06J19Q8K8n1j70K84L89k85lkj97Q1k49p2L87m5
$$ 6 -120 38 59 -273 -138 -258 -56 -262 -143 -55 -27 -78 -248 36 425 140 137 135 -62 19 -230 -302 85 40
4052D0k77L99l44O7p1J86o6r3J82K4J21j71K60j22k16q2L25l9M8l36K13J55j64
$$ 40 -237 162 -182 -115 -186 0 -66 -159 23 47 168 -3 257 135 -81 -163 162 123 171 -165 48 203 39
4075C9r2J23k30k88K45J91mQ1k00L05l34m0J71JK06P3j75j85J37J2O9K77r9j44
$$ 39 -53 70 -160 -448 -203 -12 -16 65 -135 170 -164 -204 -33 -32 174 247 72 -113 24 36 105 382 283 139
4099A39M0k22Q8k08K49r3O3m19L49j11j17J81J77j12j29N0OK4l0L67l34J06j84
$$ 139 179 -43 45 -163 86 -7 56 -363 -14 -125 -242 -61 116 4 -125 -75 -69 -45 -75 292 -42 64 -120
4122a20n8N9J06K23P5r4k02J18m59L21O9J06l17J20r5o8J36J94j77N50k75j65
$$ -120 -178 -119 -13 210 285 191 -11 107 -352 -31 38 144 -173 -53 -148 -216 -80 114 -63 487 212 47
4144D7j90J50j14J30K23r6j3k62m8OK11Q9o9j2Q8k72O1J01J06Q3L8k42k78K47
$$ 47 -143 7 -107 23 246 150 137 -125 -173 -167 44 133 64 52 140 -132 -71 30 136 219 257 15 -263 -16
4168a6J0J8K85Qj58k37O0k33RN20p2j12K6j01r9p9K47j25J04k4k26NK46rK02j46
$$ -16 -6 12 297 305 147 -90 -30 -263 -254 266 194 82 108 7 -92 -171 76 -49 55 31 -195 -190 56 47 249 103
4194A03L6k16l6j56J07K16J02L9L3m21j20K47K9R1j25Q2J13l32J97L5J50k49O28
$$ 103 139 -77 -113 -269 -162 54 156 195 228 -193 -313 -66 -37 54 -71 11 124 -208 -11 24 174 -75 553
4217E53m84j31m7r9L87m3j18Q4j61j03K70j50J77J05l47ML7M5j16R4J19l6o9n7
$$ 553 69 -62 -109 -208 179 136 18 102 -59 -162 108 -42 135 240 -107 -103 -66 -21 -137 -43 76 40 -29 -86
4241h6j67K71K29k1j33l1l14M7J73J28j16j0q2j26K90k00M8LJ92q4o8r1PO1K36
$$ -86 -253 18 247 226 93 62 -252 -205 -32 96 -20 -30 -112 -238 52 -148 -100 -97 95 11 -57 -148 -141 -80 156
4266A56J54q9j59k43K48K8l01M03L5o1l34n2J2J68Q3K35k61j55L3j83J97J03J24
$$ 156 310 221 62 -181 67 95 -206 197 232 171 -163 -215 -203 -35 48 283 22 -133 -100 -283 -86 17 141
4289A41jQk89O2j02J40R0p9K22l0l05J40pl3J40j68J11q9j74K7J87L42l27L1K41
$$ 141 140 148 -141 -79 -181 -41 49 -30 192 162 -143 -3 -10 -43 97 -71 40 -49 -223 -196 -9 333 6 37 278
4314B78k98p3J09N1K7J13j82q6M1N9K1j8o2J01j25K80l83J55r8K33q7j15m2J03
$$ 278 -20 -93 16 67 94 207 25 -61 -20 39 60 42 -20 81 -44 236 -147 8 -90 143 56 -59 -101 2
4338Bn1K24o3k45J56n7o7J28j38L16n2l4P2l04R3q3K82J96l79j55n5K24j26K20
$$ 2 -49 175 112 -133 23 -34 -101 27 -111 205 153 119 191 -113 -20 -103 179 375 -4 -159 -214 10 -116 104
4362A04j58K75k28J15p4k1m9l4L9J95K6k53J36j52k5K41J01k86j53J04M5RJ21
$$ 104 -54 221 -7 108 34 13 -36 -70 -31 164 190 -63 73 -79 -104 137 238 -48 -201 -97 -52 -43 78
4385G8pj23R9J05l65M40O9l16P9J99k59J14j5L1J17l27K16l34J97r9m0J02q7l4
$$ 78 71 -52 47 152 -213 227 296 -20 59 258 -1 113 98 129 246 -81 135 -199 -2 -101 -141 -39 -126 -160
4409a60J10J78K3k44q8K46k38J1L57j93j13r2K69q9M5O9o4o3n7J93j6J34l40j55
$$ -160 -50 128 151 -93 -181 65 -173 -162 195 2 -111 -203 66 -23 22 91 27 -36 -93 100 84 218 -122 -277
4433b77R6J35K7L3n1J71k44J18m6J61l24O9N7J00J46p0qk43J45M2j14k20J60O
$$ -277 -181 -46 -19 14 -37 134 -110 8 -38 123 -201 -132 -75 25 171 101 93 -150 -5 37 -77 -297 -137 -131
4457a31J24L00l39J67n7J47k01P4Q8m4j19L28l95J49L4l16K19j52K72M8q9k09
$$ -131 -7 293 -46 121 64 211 10 84 172 128 9 337 -58 91 125 -191 28 -124 148 196 107 -102
4479a02m3N6L06kk90Q7mNK3n6L6L4q9P9P1l46J79N4J57j22J22j91K26m22J36K93
$$ -102 -145 -89 217 215 -75 12 8 13 36 -20 16 50 -39 40 111 -235 -56 -2 155 33 155 -36 190 -232 -96 197
4505A97k11K89j26j98k0J04J39j67j5L9R7p4q8o6N6J66o0k39j12L74j46L1k7K70
$$ 197 -14 275 149 -49 -69 35 174 7 -8 31 128 54 -34 -100 -44 122 62 -177 -289 85 -61 -30 -57 213
4529B13j71p5k12J39k7N3K10j3P1j81N2q2j74L55j2L9j05k11N4J87q4J62j05m
$$ 213 42 -33 -245 -106 -133 -80 130 117 188 7 59 -23 -197 158 146 185 80 -131 -77 110 26 188 83 79
4553G9l34O4N5J37O7J98k35M7O2n2o7o3J04K11k44k49N8j6J20j47K82j36K16k81
$$ 79 -255 -191 -136 1 68 266 31 78 140 88 21 -42 62 273 29 -220 -162 -178 -58 -205 77 -59 157 -124
4577a24k11M01q8l1R6p9J58k07L3k1K63Lj61l74M90Nj57K41k93J31j44j44J93
$$ -124 -335 66 -22 -53 43 -36 122 -85 -52 -73 190 193 32 -342 148 153 -4 237 -56 75 -69 -213 -20
4600b0J16n0J85k46k22R9L4K1K47j13R5l18L03k50q4N02j77k6j35m7l5M0K7p9
$$ -20 96 46 231 -15 -237 -138 -104 -83 164 51 146 -172 131 -119 -203 299 122 96 -39 -86 -121 -81 -54 -133
4624a33J04l1J75k39n8L03q5l2J89j11k18j2J54O5J05r7j06m8J71r1N6l9K66r
$$ -133 -29 -60 115 -124 -182 121 36 4 193 82 -136 -148 6 71 176 79 -27 -75 96 5 61 22 288 279
4648B79k13k7n6J02q9lm8o4P3J77j76LJ11o4Jn7j12K23j3q5K34k17l0j19P0J38
$$ 279 66 39 -17 85 -4 -7 -55 -119 -46 131 -45 -42 69 5 6 -51 -163 60 47 -38 196 -21 -51 -170 -100 38
4674C8l5K08l38M1k07J74K52l17M58R9k71q6J24j06k35K83J52q4Q4j35k89M05
$$ 38 3 211 -127 -86 -293 -119 133 -184 274 373 102 16 140 34 -201 82 234 150 234 99 -190 215
4696B15j4n4p7p8j91K77k8p3r6J45L4j75J73j41j00J12J24l0R3j46l6o4N7j2J31
$$ 215 201 147 70 -8 -199 78 50 -23 -119 26 60 -115 58 -83 -183 -71 53 23 116 -30 -66 -130 -73 -85 46
4721D6PM7l44K0J90J43L9j81q0P4K9j36J23K06k98K2K40k38J6K35r5RQk83L48
$$ 46 53 100 -244 -224 -34 109 148 -33 -113 -39 -10 -146 -23 183 -115 -93 147 -91 -75 160 65 74 82 -201 147
4746A47j64Q8j07J54k40n3J53p1J63J69k22l28M65j38K27l80J24j20J33J31j95
$$ 147 -17 71 -36 118 -122 -175 -22 -93 70 239 17 -311 154 16 243 -137 -13 -133 0 131 -64
4767f4J55M0k46K84k23l4j6j00Q4o7K40ln9M6n0J6j33n6L41k13K60l69K65j04
$$ -64 91 131 -115 169 -54 -88 -104 -204 -120 -187 53 50 -9 37 -13 3 -130 -186 155 -58 202 -167 98 -6
4791fk59k1L39j68N1J94j60OJ04J13j08j25J4J43j25kj31J19J6j32M3J71l1J78
$$ -6 -265 -286 53 -115 -64 130 -30 -24 80 193 85 -40 -26 117 -8 -10 -141 -22 -6 -138 -95 76 45 223
4815B23j36j60K59l41jM12m49K96j70L63j43j07N0j29Q9n9j9j89K71K2n8n9KP5
$$ 223 87 -73 186 -155 -156 256 -193 103 -67 296 153 46 96 -33 56 -3 -22 -211 60 82 24 -35 -33 42
4839D2K81l85J96k09L7q8L4n5P9j7L2J77j38l2M6JJ86n83L83k7n8J07K43m7o7
$$ 42 323 -62 134 -75 -38 -126 -92 -147 -68 -85 -53 124 -14 -46 0 1 187 -396 -13 -40 -98 9 252 205 138
4864A38j94o6l8J7J34k9J27N8m51J1k1L94j98K04R5k03J13j77o7P1j5P0K2p0o1
$$ 138 -56 -122 -160 -143 -9 -38 89 147 -304 -293 -314 80 -118 86 181 -22 91 -86 -153 -82 -97 -27 -5 -75 -136
4889a36R2J6J94l9q3j82J0P9Kr1K63L64l08k78l9oJ18J61K07r5k61K13m66K04
$$ -136 -44 -28 166 127 44 -138 -128 -49 -47 -138 125 489 181 -97 -136 -142 -24 137 344 249 -12 201 -265 -61
4913f1p6J01n1OJ50k51L27k80K76N6j22k0K01n46J03L75k54J49j76M2j18K36J10
$$ -61 -137 -36 -87 -81 69 -182 145 -135 141 197 75 55 256 -290 -187 188 -66 83 -93 -51 -169 67 177
4936A77p9J36k81j85L63l82K64L4l4q9N5j18P4m2J24K55l72J37j00J14j55oP2
$$ 177 98 234 -47 -232 131 -251 13 47 13 -76 -21 -139 -65 -107 17 272 -100 37 -63 51 -104 -110 -38
4959c8K58k37Jk00M5L30q2P1j47L18m54j46L09K36l51J04J58j74j53KK13R0J05
$$ -38 220 -17 -16 -216 -171 159 77 148 1 319 -135 -281 28 264 -87 17 175 1 -152 -150 63 153 258
4982B58m94L17k44J38Q1M1m1q6K69m07j0J36K21l64K78k73J37k1R1j99K80N0p6
$$ 258 -236 81 -163 -25 56 97 56 -30 239 -168 -178 -42 179 -185 93 -180 -43 -64 27 -172 108 158 82
5005H2L8j97R9q7MJ74J61j45k70O4k05J47K48k0j77J97j79j68J90j19L95j43j65
$$ 82 120 -77 22 -65 -61 113 274 129 -141 -77 -282 -135 113 93 -84 113 -66 -234 -44 -163 232 89 -76
5028g6j35K30m2j82L50q6r0L1l16M00k7n7m5K9j06Rj42K35J35j7N9J01m06N1M
$$ -76 -211 19 -23 -205 145 59 -31 0 -316 84 57 0 -45 -16 -122 -113 -255 -20 115 98 157 258 -148 -97 -93
5053i3L23J28k30O3k72j11J07J6J84j64O1r4P5lq3J93j96K21j21j8Q3j54o1J62
$$ -93 230 358 128 191 -81 -192 -85 -69 115 -49 12 -82 -7 -10 -93 100 -96 125 4 -14 69 -85 -146 16
5077A6j6K48l73O4%%k60N84m1m1l49Q1j0K34l3K5Ok67o4K24o9K39j99L7m5j94
$$ 16 0 248 -125 -61 -61 -61 -321 263 222 181 -168 -87 -97 137 104 129 135 -132 -196 28 -41 198 -1 36 -9 -203
5103b03L54l95N21l65K45P2k99k16N04k58M5K42m18M0J9m1J12J39j14J94j74J2
$$ -203 151 -244 277 -88 157 229 -70 -286 218 -40 5 247 -171 -131 -112 -153 -41 98 -16 178 4 16
5125A6k14J51K6N7P3j49J8m3j05J57R1O6Jj80p5k22M75k49J26J69k49J06n3J59
$$ 16 -198 -47 -21 36 109 -40 -22 -65 -170 -13 78 144 145 -35 -110 -332 143 -106 20 189 -60 46 -7 152
5149A52M7k08R3k22J22J03r6J02k51K29j94K50r6P0jl5j86k1K09o0J6j38J60j38
$$ 152 199 -9 84 -138 -16 87 -9 93 -158 71 -123 127 31 101 100 65 -121 -142 67 7 23 -115 45 -93
5173i3K17p5K92k85n7P3r8M6R8N1m17K36j34o6L43L9k56r3L2M49l66n5j34K94
$$ -93 124 49 341 56 -1 72 -26 20 118 169 -248 -12 -146 -212 131 170 -86 -179 -147 302 -64 -119 -253 41
5197D1l4k97M29jj87M02j59l63K09j16p9N7J17k8J2J29j13j13oj03K23q2l7q0
$$ 41 7 -290 139 138 -49 353 194 -169 40 -76 -155 -98 19 -9 3 132 19 -94 -100 -203 20 -62 -99 -179
5221a79K71k00m3M5oJN2l9M7M2K1n9J84r6Q5o5j98n9L37l0j55Q0j74n0O7K48k19
$$ -179 92 -108 -151 -106 -112 -111 -59 -98 -51 -9 12 -47 137 41 126 61 -137 -196 141 111 -44 36 -138 -188 -121 127 -92
5248i2l7k4L36j35N3j33J9k32M50j65j48K53p8J32k35J36j67J35j52q2J35j84
$$ -92 -129 -153 183 48 101 -32 -13 -245 205 40 -108 145 67 199 -36 100 -67 68 -84 -166 -31 -215
5270b15O9RJ19J09j13QJ51j87J39j6n6m5J23k89J04K60k0l81L24r4j12K06o8Q
$$ -215 -146 -137 -18 91 -22 -14 137 -50 89 73 17 -28 95 -194 -90 170 150 -231 93 -1 -113 93 25 33
5294C3l3m2om73N53r3J42r5R9j73M4J34Q4j68R5l0j30K09j96j19J48J1O5j45j9
$$ 33 0 -42 -48 -521 32 -61 81 -14 85 -88 -44 90 174 6 101 71 -59 150 -46 -165 -17 -6 59 -86 -105
5319a05J6n2J21K60l03J40Jj21j64q1L36J82j04k88n6j52L48m6K53j27j8J84k82
$$ -105 -89 -141 -20 240 -63 77 78 -43 -207 -288 48 230 126 -162 -218 -370 -22 -68 185 58 40 224 -58
5342e8j48M22k79j70M57r1j93k22K46p9Q0K54k98K61l16M2N8K24Q6n68N80l75
$$ -58 -206 216 -63 -233 224 133 -60 -282 -36 -115 -35 219 -79 182 -134 -92 -34 190 276 -292 288 -87
5364h7J28Q5p6J56r9J13j33k34j32M91j35L4K88k18k79N4L27k94K57k28j11j00
$$ -87 41 126 50 206 107 220 87 -147 -279 212 77 111 399 181 -98 -44 283 -11 246 18 -93 -193
5386a93J86M4K79m93R1K69k48k4L5O1O9j9j4k23R5J7O1P3K52j37k60K5j69Q4K67
$$ -193 -7 37 316 -177 -86 183 -65 -89 -54 7 76 57 43 -180 -85 -68 -7 66 318 181 -79 -54 -223 -139 128
5411A28N2l1j76k06L12j01j46K86J09k46Q1j55n7J64jK83l11P5L50m46J30k43
$$ 128 180 149 -27 -233 79 -22 -168 118 227 -19 62 -93 -150 14 13 296 -15 60 410 -36 94 -149
5433a49L72j33k31M8p1R3n7K90l4L7j19p4o3mm9O4k1J07j47j32K82O5J09o7J09
$$ -149 223 90 -141 -93 -164 -71 -128 162 128 165 46 -28 -91 -95 -144 -80 -101 6 -141 -273 9 74 183 116 225
5458B25k51J3R6j00p2P5km6K4O1j23l0M1J07r8j20K39NJ18j28K93m24L13n14K75
$$ 225 -26 -13 83 -17 -89 -14 -16 -62 -38 23 -100 -130 -89 18 -80 -200 39 44 162 34 327 -97 216 -298 -23
5483b3J48j80oL88k40j58JO4j17K41k55K04q8l78L25L4J68M6P3j83M3p8n0K27
$$ -23 125 -55 -61 327 87 -71 -70 -6 -123 118 -137 67 -21 -399 -74 -40 128 174 247 64 107 29 -21 206
5507B06k89J13l7L9j90J59R7J2j31P5k2j68m2L1K93r4p6j20O6k18j10M15J71r9
$$ 206 -83 30 -7 32 -158 1 98 110 -21 54 32 -136 -178 -147 146 52 -24 -144 -78 -296 -406 9 180 81
5531H1J13l33J99m0j9N7l08K95j11oq6j11L47k41M8n5K42j65K38n1jq0J08m18
$$ 81 194 -139 60 20 1 58 -250 45 -66 -72 -158 -269 78 -163 -115 -170 72 -93 145 94 93 13 121 -297
5555b97L84l16K46R4n8K7k95R3K26l47K15J56J59l32j39J56j13Qj76N68j96j40
$$ -297 87 -229 17 111 53 80 -215 -122 104 -243 -28 128 287 -45 -184 -28 -141 -133 -309 259 63 -77
5577g7OJ69R9l08L11l21L00j04k93N2J91rj94J94j15NJ48j81K05r7l7J62j48j30
$$ -77 -71 98 197 -111 200 -121 179 75 -218 -166 25 16 -178 16 -99 -94 54 -127 78 -19 -56 106 -42 -172
5601a72J80k05K47q3K92j32k00J56n55L58L5J43O1o5n9k98K74J03N0k78L93k26
$$ -172 8 -197 50 -33 259 127 -73 83 -472 -114 -79 64 125 60 1 -297 -23 80 130 -148 245 19
5623A9O3Kk21K25o4J73j4k32q7N3n2J74R6k40L2J75l05j5J48P3J07r8k93K38O8
$$ 19 82 84 -137 88 24 197 183 -49 -136 -83 -135 39 135 -105 -73 102 -203 -218 -70 3 110 12 -281 -43 25
5648B5j62j31M59j54J35k19L03k43K29J9q9l94K50j25k4j07L66m13K08j88N7L8
$$ 25 -137 -268 191 37 172 -47 256 13 242 261 172 -222 28 -97 -121 -228 138 -275 -67 -255 -198 -160
5670a60M1m8J82nN0P8l87L40J67j37j06Q8j98P6r6M0J51N9O8l95J97j53j77L46
$$ -160 -119 -167 15 10 60 138 -249 91 258 121 15 103 -95 -19 -115 -75 76 135 203 -192 5 -148 -325 21
5694B1p6J85n4J25l03K57l8q2r7O6j12mL9p3L64M4p3j89r0j31J82J94rk47J61
$$ 21 -55 130 76 201 -102 155 117 35 -62 4 -108 -112 -73 -146 218 262 189 0 -90 -221 -39 155 146 -101 60
5719F0J35l74n7K96K5j86L3j4K3J36j10J27J30j00k2j47M3j30N96l76k18L61m33
$$ 60 195 -179 -236 60 85 -101 -68 -82 -59 77 -33 94 224 124 102 -45 -2 -132 464 88 -130 231 -202
5742b02K47j60L02N4j64j31P2O0j62N0J73j6M4rk55r2K00K28k06j13K03k48j34
$$ -202 45 -115 187 241 77 -54 18 78 -84 -34 139 123 167 158 -97 -189 11 239 33 -80 123 -125 -259
5765b59J40K22m7N5j82J12J33l24K32K97l51J1k6j15J16j06J92J73jk69Q9k52
$$ -259 -119 103 56 111 -71 41 174 -150 82 379 28 39 13 -102 14 -92 100 273 272 3 92 -160
5787a60K33J39k39K07k7k54J46k34M27L9k12k6j55K09l07J53q9R1P2j16J01K6
$$ -160 73 212 -27 180 153 -101 45 -189 238 277 65 39 -116 93 -214 -61 -150 -59 13 -103 -2 24
5809B4l5n6J52O1P9l60q5J30NL34k13K11k05k65R7L47k49J50j5JJ9q8j28L8J46
$$ 24 -11 -67 85 146 225 -135 -220 -90 -85 249 36 247 42 -223 -126 221 -28 122 107 108 127 39 -89 -51 95
5834I5Q5m1k08q6l9J7J29J67r7ln6j05K21M6K30l33ml8j14M0O9O0Knq2j90J48
$$ 95 180 139 -69 -155 -194 -177 -48 119 22 19 -37 -142 79 125 355 22 18 -20 -134 -94 -25 35 37 32 -50 -240 -92
5861i2n2M34l31PM9j03J86k04K65j2j10Lj03J10k4j16L39L0k83J5P1r7L4k1K75
$$ -92 -144 290 -41 -34 15 -88 98 -106 159 147 37 40 -63 47 23 -93 246 276 -7 8 79 -18 16 -5 270
5886B70p3p0o2pJ49k70K11k94J91j11l7l3M55k93Kl6P8M7j7L1q9j74J49o3N3l3
$$ 270 197 127 65 58 207 -63 148 -146 45 -66 -103 -136 319 26 28 -8 70 117 100 131 42 -132 17 -46 7 -26
5912b6Q3o5P0p6J91j94l5KQ1o5o1J38j0K10m43L36m2O3q2%P0j24K50l76n2K06
$$ -26 57 -8 62 -14 177 -17 -52 -50 31 -34 -95 43 33 243 -200 136 94 157 75 75 145 21 271 -105 -157 49
5938D9K5k03J40Q1Nk34K02L0j0k8j4l2R1r7lp4P6J16k77M20k22J48j91l00K24
$$ 49 74 -129 11 92 97 -137 65 95 85 57 43 11 102 5 2 -72 4 120 -157 263 41 189 -2 -302 -78
5963g8J00r8M6N2n0j22P2Q5j6n0N4j22K06Qr7jNj62J60O0j8K05m62J61N4l3L8
$$ -78 22 -76 -30 22 -28 -150 -78 7 -9 -59 -5 -127 79 87 -10 -11 -6 -168 -8 52 34 239 -223 -62 -8 -41 -3
5990cJ23j88J43o8m40L86q8K92m3j54L8m4N9j6J90j52O8k05J20n5j47L20k06M19
$$ -3 120 -68 75 7 -433 -47 -135 157 114 -40 -2 -46 13 -3 187 35 103 -102 18 -37 -184 136 -70 349
6014C49j28l82J90l42Q3L15O3j13k40J20j15m2L94j71J99j49J06j68k42L38K39
$$ 349 221 -161 29 -313 -230 85 148 35 -205 -85 -200 -242 152 -19 180 31 137 -31 -273 65 304
6035C04J1j46p1k75r1L47M6k14LL26k80j20P8K25r8J19j52P6j38J22j47N3Q5k4
$$ 304 315 169 98 -177 -268 79 125 -89 -86 240 -40 -160 -82 143 45 164 12 88 -50 72 -75 -22 63 39
6059C9q4j42M05k71lJ64N0j10j93j27J1L48j95M5K61q9k36j30J21K85N9k65J23
$$ 39 -45 -187 218 -53 -56 108 158 48 -145 -272 -261 87 -108 -63 198 109 -127 -257 -136 149 208 -57 66
6082F6k34j38M02j49J86l0j33J17k46K70r8J12J38j30j48R0j01J57q0K0J27j39
$$ 66 -168 -306 96 -53 133 103 -30 87 -159 111 13 125 263 133 -15 75 -26 131 51 71 198 59
6104E9K9pl0%J18J24l80J40k63K20n3K40n0l26K20j39p5o9L82k7M8pj12j68J71
$$ 59 88 81 51 51 169 293 -87 53 -210 10 -43 197 147 -179 41 -98 -173 -242 140 113 161 154 42 -126 45
6129D5J02l9J14q4o8p4J24k53K48j19qj31q9n6K27j7NN6J04j74q0q7L14J39l0
$$ 45 147 108 222 138 70 -4 120 -133 115 -4 -12 -143 -232 -288 -61 -78 -73 -17 87 -87 -167 -254 60 199 169
6154A69k55J1K39k71m3K34K94o8l26j45np5J75j1J86k0j98l8R2j86M76p5p3L0
$$ 169 -86 -75 164 -107 -150 84 378 310 -16 -161 -166 -241 -66 -77 109 89 -109 -147 -55 -241 235 160 87 117
6178A17j84j00N1J79L1J71m15J68k20o3L12J65k14j02k2K28j45K06p2N5j38Jk15
$$ 117 -67 -167 -116 63 94 265 -150 18 -202 -265 47 212 -2 -104 -126 102 -43 163 91 146 8 9 -206
6201b06Q7K64M0L6j26J81m30QQ7P3n3k8j16N3J23j40m6Q3K86k52J16j65J21kj75
$$ -206 -119 145 185 221 95 276 -154 -146 -59 14 -39 -67 -183 -130 -7 -147 -193 -110 176 -76 40 -125 -4 -6 -181
6226a81L14M1j96k07K36J7K7K30j76K0k04J39Q4j95q0K34j18j31J0R2n2J90J17
$$ -181 133 174 -22 -229 7 24 51 281 105 125 -79 60 144 -51 -131 103 -15 -146 -136 -44 -96 94 211
6249B11k36L23k44j25O0q3K00jk70L57k05j48M6J03o6J37O2m16L41q8j17L31M1
$$ 211 -25 298 54 -71 -11 -94 106 105 -165 192 -13 -161 -115 -12 -78 59 121 -295 46 -42 -159 172 213
6272B13k14j29JK17p2P1K3nk84J64k10M37J70n00J96j53j79K12k5p5Pj97M62j88
$$ 213 -1 -130 -129 88 16 87 110 105 -179 -15 -225 212 382 -118 78 -75 -254 -42 -67 -142 -135 -332 130 -58
6296e8MMk04M35j10o1R9q2Q2p4K2j84K46j54j94K13q8K2k7j3j2J01LQ5k16J99
$$ -58 -54 -50 -254 181 71 10 109 27 109 35 57 -127 119 -35 -229 -16 -104 -82 -109 -122 -134 -33 -30 55 -161 38
6322C8Q2j17P4m9j6oJ28M8j42J0Oq5j09N3n9J65J80j43j40pR3K47j93k65M11k68
$$ 38 120 3 77 28 12 6 134 182 40 50 56 -29 -138 -85 -144 21 201 58 -82 -89 4 251 58 -207 204 -64
6348f4j81L07k17J37M1K68k52J17m5J6q4l8K3J52J8j28K6k94J44L4N0j90N8l4
$$ -64 -245 62 -155 -18 23 291 39 156 111 127 43 5 28 180 198 70 96 -198 -54 -20 30 -160 -102 -136
6372a36J18J94l62K10l36K58J5L54m80K26P9j81J7J32K4j69j75o9L69R9k83M0
$$ -136 -18 176 -186 24 -312 -54 -39 315 -165 61 140 -41 -24 108 132 -37 -212 -281 88 187 -96 -56
6394e6O6j48K12p0k15J69J64lk01J83j58J30M8k50K05l16K94j96L63k80K52k52
$$ -56 10 -138 74 4 -211 -42 122 119 -82 101 -57 73 121 -129 76 -240 54 -142 221 -59 193 -59
6416e9j09J75k25Q3J27J88j67K28k82r1Q3M5J10j05J00J29r1r4P4k14J57J56k36
$$ -59 -168 7 -218 -135 -8 180 13 241 -41 -132 -49 -4 106 1 101 230 139 45 119 -95 62 218 -18
6439a8l5j56jL92k02r8j81k9K68n8M10p4j66m6k13K83j15L08p2j66j33r2J09k16
$$ -18 -53 -209 -210 182 -20 -118 -299 -328 -60 -118 292 218 52 6 -207 76 -39 269 197 31 -102 -194 -85 -301
6463c01K19P1ln1K8k94K13O6K42q1K38j08k58J09j18J78M9J9j21J96l93K39r1
$$ -301 -82 -11 -14 -65 -37 -331 -118 -52 190 109 347 239 -19 90 -28 150 199 218 97 293 -100 139 48
6486D8J69j38j89P3j26l9J20l6K55L46k84l08K57j3k41L3K6p2J88j54M2j13L67
$$ 48 217 79 -110 -37 -163 -202 -82 -118 137 483 199 -109 148 135 -106 -73 -47 -119 69 -85 -43 -156 211
6509B11l00Q9O3l15J28J83k07K8J33m5j10K59k57J89J21J42l39R8k40n8J38K14
$$ 211 -89 0 63 -252 -124 59 -148 -120 13 -32 -142 117 -140 49 170 312 -27 71 -169 -227 -89 125
6531A25j20Q5p1J23l13j5K47q7k6O0n2o8J08K01j83Q1j22J9j47M44k54J80M3k16
$$ 125 5 90 19 142 -171 -186 61 -26 -52 8 -44 -112 -4 197 14 95 -27 -8 -155 289 35 215 258 42
6555D2L9q3k41J40j14K01K62m10k28N47l23L92j00pJ02o3k21j76K70K40k53N1
$$ 42 81 -2 -243 -103 -217 -16 246 -164 -392 155 -168 224 124 117 219 156 -65 -241 29 269 16 67
6577F7J29m90K79l6n7N2Q4J6M1k23K41k23K31q9k4r0j2m8MN3L07l14J35j24mO1
$$ 67 196 -294 -15 -51 -108 -56 28 44 85 -138 103 -120 111 22 -2 -92 -104 -152 -148 -95 212 -102 33 -91 -95 -34
6603c4O9r1J23j51J38j0k14L09n0J57k54p5J4m0o8K79j17O7nr7j3K3p7MK17l0
$$ -34 35 -56 67 -84 54 44 -170 139 89 246 -8 -83 -69 -109 -177 102 -15 52 47 -50 -63 -40 -117 -113 104 74
6629G4k78P1J83K8o7j23R9Q0R8k09O9J56K5j63N4j48j06l0M34O9j50m4n4j52K77
$$ 74 -204 -133 50 78 11 -112 -13 67 165 -44 25 181 206 43 97 -51 -157 -187 247 316 166 122 68 -84 193
6654A93m02L12J02l14L5J57j54O5Q4j72J11q9J54J37l33K44k08K46k21L5L1J02
$$ 193 -209 103 205 -109 -74 83 -71 -6 78 -94 17 -72 82 219 -114 130 -78 168 -53 -18 13 115
6676A15j42J63k93L09p1k37P2R7Q0m8j54J60r0J45m3k37N6j92M47j2j17o8j17
$$ 115 -27 136 -157 152 81 -156 -84 13 93 45 -109 51 -39 106 63 -174 -118 -310 137 125 8 -60 -177
6699a77L04k85J93K7k32M26m19J10J0J54j75L06l6n6k0j64N9J0j84K05r2r3m3
$$ -177 127 -158 35 62 -170 256 -163 -53 -43 111 -64 242 206 150 130 -34 25 35 -149 56 -36 -129 -172
6722a72K04J47k36J12M7l2j25J45j54j12J45J01j11RJ66j61q9J39J13j58J27m77
$$ -172 32 179 -57 55 102 70 -55 90 -64 -176 -31 70 -41 -32 134 -27 -116 23 136 -22 105 -372
6744c72M31q9j70L62o2J0j43N9J59k14J7J19k54J78k59K3K25J38j63j45J24p2
$$ -372 59 -30 -200 162 100 110 -33 26 185 -29 -12 107 -147 31 -228 -205 20 158 -5 -150 -26 -98
6766i8k90L02K46k26J04q9j03J88J09l2J28j90o8q6R3o8n6L40k9L5j79J01j55
$$ -98 -388 -86 160 -66 38 -51 -154 34 143 111 239 49 -19 -105 -12 -80 -136 204 175 210 31 132 -23
6789b3K13k96NQ6K1q0jp3J69K6m8J29k51J66j78M47m19P6k0L11p2o4j51j42j5
$$ -23 190 -106 -101 -15 6 -74 -75 -148 21 47 -1 128 -123 43 -135 312 -107 -31 -51 260 188 124 -27 -169 -184
6814a84J26P4l6k3N6J30k06J46j22j69N6J04K75R0P9m11k40L45l20M35j99Rj06
$$ -184 -58 16 -20 -43 13 143 -63 83 -39 -208 -152 -48 227 317 396 -15 -255 90 -230 205 6 15 -91
6837i1J40j20k23J84J84k69J25L35l76q0R2m7k80M20J38j69J95k57j56RL87q1
$$ -91 49 -71 -294 -110 74 -195 -70 265 -111 -191 -99 -146 -426 -6 132 -37 158 -99 -255 -246 141 60
6859F0J49j98R4j90Q1R3j59J15j09q4rK4K34K8n8k03J90k53Q2O7o5J52m5k32J69
$$ 60 209 11 105 -85 -4 89 -70 45 -64 -148 -157 -133 101 129 71 -132 58 -195 -113 -46 -111 41 -4 -236 -67
6884f7r5K0J98j73O4p7L2q5O8N2J27J21m02K61K9m0J56j10p9L9M3k13Q2%K79k48
$$ -67 -162 -142 56 -117 -53 -130 -98 -183 -115 -63 64 185 -217 44 73 33 189 79 0 39 82 -131 -49 -49 230 -18
6910a8O1K74k44m2r2j48K46l3j89J99k28L22j85J78Kj13MJ62j9o7k10J91k96K04
$$ -18 43 317 73 31 -61 -209 37 4 -185 14 -214 108 -77 101 103 -10 -6 156 137 70 -140 51 -245 -41
6934d1j0j02L40m71K23J17k1j5k17kj56K61M33l51j0J07k45J48K15l19oL51k96
$$ -41 -51 -153 187 -284 -61 56 35 20 -197 -199 -355 -94 339 -12 -22 85 -160 -12 203 -116 -122 229 -67
6957f7j04K58j69M1P9k3J18l03J00K0l1R9n6J78l9k44N8K16k08P7J00j17J07j32
$$ -67 -171 87 -82 -41 38 15 133 -170 -70 -50 -81 18 -38 140 101 -143 -85 131 -77 0 100 -17 90 -42
6981d2l4L78j77k05J07N3j28q0K23k82L67j91l06J69m1o5J56j9K66j01j61l5K93
$$ -42 -76 302 125 -80 27 80 -48 -128 95 -187 180 -11 -317 -148 -189 -254 -98 -117 149 48 -113 -148 145
7004A45lk21K58k39R3j12O5K6J6Lq3j8k57M3L22O6n3j26J72M9N7j54L9J39m00
$$ 145 142 -79 179 -60 33 -79 -14 12 28 31 -52 -70 -327 -284 38 104 51 -75 97 146 203 49 88 227 -173
7029a73J86N0k42J74k1Q3j9j05n5p3J99O6k2k84L5K91k96J43r9K2K34j82r5K95
$$ -173 13 63 -179 -5 -26 57 38 -67 -122 -195 4 70 48 -236 -201 90 -206 -63 -162 -140 94 -88 -183 112
7053A12l33J00K11J08k91j41K62p6M0J19k50K20j17K44l24J24q4J66l3n7k44J92
$$ 112 -221 -121 90 198 -93 -234 28 -48 -8 111 -139 81 -36 208 -116 8 -76 90 57 0 -244 -52
7075e2j1K03o3j35L59k14j19o2K27k14q6K28j62J64nJj58L09J19m96K02J6Kj18
$$ -52 -63 140 77 -58 301 87 -32 -94 133 -81 -167 61 -101 63 58 59 -99 210 329 -167 35 51 53 -65
7099f5K4J68j49K28j36j31J90j06q6K12k07M4m6M2J80k57J20j36K99m66J37J69
$$ -65 -41 127 -22 206 70 -61 129 23 -63 149 -58 -14 -60 -18 162 -95 25 -111 188 -278 -141 28
7121B8L5j16K20j32k40K85m8Rm7K6k11Q8L66l43J08k06L27l28L6KJ76M2k3j85
$$ 28 63 -53 167 35 -205 80 32 41 -6 20 -191 -103 263 -80 28 -178 149 -179 -143 -141 35 77 54 -131
7145a31K0K55j94j21J16J72j40P2l6k42K75J60l12O8J4p7JK4j28L20p2J96k56
$$ -131 -111 144 -50 -171 -55 117 -23 49 13 -229 46 206 -106 -38 -24 -101 -100 -76 -204 116 44 240 -16
7168a6m7K19k14L13l40Q4J22k26J95j2k98J63J00l10K41Q1j98K81q3j9no9k93
$$ -16 -63 156 -58 255 -85 -1 121 -105 90 78 -220 -57 43 -267 -26 55 -143 138 55 36 31 -38 -331
7191c31L9J02K34j7j43M6Q5o6J27J80N4l59j02J6P7L03l60L24k78K3qJ1O9J03
$$ -331 -292 -190 44 27 -116 -70 15 -51 76 256 310 -49 -151 -135 -58 245 -115 209 -69 -46 -54 -43 26 129
7215A29j63J05j08o8k8L0J95k4n0R3j55J86m1k7M0k23q1K66k14K55J4j22j7j21
$$ 129 -34 71 -37 -105 -133 -103 92 68 18 111 -44 142 101 74 114 -109 -190 76 -138 117 131 9 -8 -129
7239a29J11P0j77M7K78l51K59j12k06K49l2j33K07j84J26k57M40k66K44j03k08
$$ -129 -18 52 -125 -78 200 -151 108 -4 -210 39 7 -126 81 -103 23 -234 206 -60 184 81 -127
7260a27j32J91k5N9J06j80l9J75j63j1N6KM08m75J32J55k00q1j3J42J4J44m22
$$ -127 -259 -68 -93 -34 72 -108 -147 28 -135 -146 -90 -88 320 -155 -23 132 -68 -149 -162 -20 -6 138 -284
7283b84L25P6k63J75qL3j67j4J0J76m9L8M7m11K62J18k20L49l26K10j35J60O0
$$ -284 41 117 -146 29 21 54 -113 -127 -117 59 10 48 95 -316 -54 64 -156 193 -133 77 -58 102 162
7306A62l97J96J08k09L05j95j40K31m3j70K7K18l12Q5j67K90K10N6j87k11J10
$$ 162 -235 -39 69 -140 165 -30 -170 61 18 -152 -125 93 -219 -134 -301 -11 199 255 68 -143 -33
7327c3j1J99j92k9J60j65j14J36R0j74K30j03p9J45l76L44j78M1L7j2Q3n2L1k7
$$ -33 -44 155 -37 -66 94 -71 -185 -49 41 -133 97 -6 -85 60 -316 28 -150 -109 -72 -84 -1 -53 -22 -49
7351d9n2o2J47O6n8j22J03KK54j4l54r1J87jj02Q8J77j94M5K8K09j70j05m2N5
$$ -49 -101 -163 -16 50 -8 -130 -27 -25 229 215 -139 -230 -43 -44 -146 -58 119 -75 -30 -2 207 37 -68 -110 -55
7376e5J43j44j68J60K45j28J13K6j17j0q0j40L6J39K29k08p9R6p7j3o0p8P9n4
$$ -55 88 -56 -224 -64 181 53 166 192 75 65 -15 -155 -119 20 249 41 -38 58 -19 -32 -92 -170 -91 -145
7400a45J89K4J3j05l3mN0N7k3J46L9j80l04L97k79J37Q2j91K3J90j07K47J0k09
$$ -145 44 68 81 -24 -57 -61 -11 46 23 169 208 28 -276 121 -158 -21 61 -130 -107 83 -24 223 233 24
7424B4L3Q2j91J38l2j33n4J45J52r6k53K9N14k56j57m4K05k45J66M7j21O5K2o6
$$ 24 57 139 -52 86 54 -79 -133 12 164 68 -185 -156 358 102 -55 -99 106 -139 27 74 -47 18 40 -26
7448b6LpQ6P5q9K24M9m30J44J85k83K71l10J5K54j85J17m2N7j23k67L99k74J58
$$ -26 -23 -30 56 131 42 266 315 -115 29 214 -69 202 -108 -93 161 -24 93 51 108 -15 -282 117 -157 1
7472AK5pL63k22k00K60q7k20Q7K28j24j0j39J98k32J87n7J52m8j68k21N2J62o7
$$ 1 26 19 382 160 -40 220 133 -87 0 228 104 94 -45 153 -79 108 51 203 155 -13 -234 -182 -20 -87
7496h7Q8m4L1j25J89j58m4J7L57k85R4j03K17k30J86J67l1k83J96mo1L9j34j55
$$ -87 1 -43 -12 -137 52 -106 -150 -133 224 -61 33 -70 147 -83 103 270 239 -44 152 148 87 126 -8 -163
7520a63J27R7j14pm3J42n7P4l0j42J5J8r5l9Q2K1J58j06q5R7j06K25n9j00m3K82
$$ -163 -36 61 -53 -60 -103 39 -18 56 26 -116 -101 -83 -178 -217 -135 -114 44 -62 -147 -50 -156 69 10 -90 -133 149
7546A49l27J13O9j37J90j23R0NK9M1q5l9J35rN6k26N8j34L7j23L49P1J3k16n4
$$ 149 -178 -65 4 -133 57 -66 24 29 58 99 14 -25 110 101 157 -69 -11 -145 -108 -231 118 189 202 -14 -68
7571f8K29P1j28k46J30P9j43K4L51m64L8K23j02pO7J09k96K35K7j85R9N8j58k03
$$ -68 161 232 104 -142 -12 67 -76 -52 299 -165 -127 96 -6 -13 54 163 -133 102 129 -56 43 101 -57 -260
7595b60M17j85J5O7K50l19K90j21j58J88j16m8K5j25L15m32Q0J32n1jj14L35k83
$$ -260 157 -28 -13 54 304 -15 275 154 -4 184 68 20 45 -80 235 -197 -117 15 -36 -37 -151 184 -99
7618i9K50j97K33k46n8JM7K17k82J58l5j46O9q1L06r0r7K32k10K70j31k81J39
$$ -99 151 -46 187 -59 -117 -116 -69 148 -134 24 -11 -157 -88 -169 137 47 -50 182 -28 242 111 -170 -31
7641c1RN0J43k66p4J10J25K1l7j51J84Kj12MM1m1r2R7J48k46J46L9j83j04R5J84
$$ -31 -22 28 171 -95 -169 -59 66 87 50 -101 83 85 -27 -23 18 -23 -115 -18 130 -116 30 69 -114 -218 -123 61
7667F1J24l20r6q7M35j00j23J60Jj9j85K46K49m76M0J0K93L6j17k38J27j79J32
$$ 61 185 -135 -231 -318 117 17 -106 54 55 36 -149 97 346 -130 -90 -80 213 249 132 -106 21 -158 -26
7690b6L1n5n0J83J31l13K36m60K81J70q7k5j89J57J66J70j84j35k38O9J98K5m0
$$ -26 5 -50 -100 83 214 -99 137 -323 -42 128 41 16 -173 -16 150 320 136 1 -237 -168 30 55 15
7713A5n6J7K12k17M1L1j97K5J25l16N16l78J35k07J41K20j30L7N6k70J82J4K02
$$ 15 -41 -24 188 -29 12 43 -154 -129 -4 -320 196 -182 -47 -254 -113 107 -23 14 70 -200 -18 -4 198
7736A98l93K93j07O0K3k7Q7k52Q3J29j1j96J11L5j48L47k22m1o1J04Q3j4L7mk59
$$ 198 -195 98 -9 51 74 47 134 -118 -35 94 83 -113 -2 33 -115 232 10 -31 -92 12 95 81 118 114 -145
7761a45N4m7J06q2J32j91R8J22J38k67J04J77k43r0Q6JJ73j77K93j71l0n9K2n8
$$ -145 -91 -138 -32 -114 18 -173 -75 47 185 -82 22 199 -44 -134 -48 -47 126 -51 242 71 41 -18 4 -54
7785e4q0O1K2K28k64J85k70J85J9n0nJ05p0j69K84o8r6J73J4j75n8J4k2J88k68
$$ -54 -134 -73 -51 177 -87 98 -172 13 32 -18 -23 82 12 -157 127 59 -37 136 150 -25 -83 -69 -91 97 -171
7810a71K65Q0qj11o1o5L9P9nL1r9J3m9K94l88Q0K86k62p5J50j69L94k89o4p0J54
$$ -171 94 174 166 55 -6 -71 -32 47 42 73 -26 -13 -62 232 -156 -76 210 -52 -127 23 -146 248 -41 -105 -175 -21
7836b1N4J38k72P8J19j71P2P0l18P9J41J28j72R5lL4m7m0J27l68L25l1K02o5j40
$$ -21 33 171 -101 -23 96 -75 -3 67 -251 -172 -31 97 -75 20 17 51 4 -36 91 -277 48 17 219 154 14
7861A4p1M7J33j72K03j36K12j56J32j35j70J01m9m4l9K28o0J79l82L17l14K63
$$ 14 -57 -10 123 -49 154 18 230 74 206 71 -99 2 -47 -91 -130 98 38 217 -165 152 -162 101
7883A01k06Q9K80j88p4p2j3O3L32k35j63m0J38p6K16k62J84n2J74j0k08K76j45
$$ 101 -105 -16 264 76 2 -70 -83 -20 312 77 -86 -126 12 -64 152 -110 74 22 196 186 -22 254 109
7906A09m3L4j81J29K77l24k08L54j49j99J22K7K80k61j64J19R5P0j54o3m9L79
$$ 109 66 100 -81 48 325 1 -207 147 -2 -201 -79 -52 228 -33 -197 -78 17 87 -67 -130 -179 200
7928B00j12j99K5J75L2N0k24p6j9KJ89k72K29j62J79q7Q1J1r7K34l20o8o7J67
$$ 200 88 -111 -86 89 121 171 -53 -129 -148 -146 43 -229 0 -162 17 -70 11 22 -75 159 -161 -229 -296 -129
7952a29l4J86j03J8M0O6j47J78Q0k92J82J21j16j52M6L1K69l15K38k89P1J00j8
$$ -129 -163 23 -80 -62 -22 44 -103 75 155 -137 45 166 50 -102 -56 -25 244 -71 167 -122 -51 49 31
7975C1O7q7q0J44l78L65j25P0L3l1q3J5j04J3K81j34J41r3P2k7j73jK07r5j21
$$ 31 98 11 -69 75 -303 62 -63 7 40 9 -74 -59 -163 -150 131 -3 138 45 117 90 -83 -84 123 28 -93
8000i3j81M01j21J69k19j17J65q2J30pn0j19J48K0m1l5l03J91K78j71oR9J35k19
$$ -93 -274 127 6 175 -44 -161 4 -78 52 45 -5 -124 24 44 3 -32 -335 -144 134 -37 -43 56 191 -28
8024b8K3m3K46j14P4j69j07K12n6j06J01J65N0j12j32J07j59j04K42j42R3r1M2
$$ -28 -5 -48 198 84 158 -11 -118 94 38 -68 33 198 248 136 4 111 -48 -152 90 -52 41 -50 -8
8047hP3j59P6m7n8M05k88J3J23j9m6L6j03Q4J36k48j04N05m25l4J1K6n0o3K35
$$ -8 65 -94 -18 -65 -123 282 -6 7 130 111 65 101 -2 82 218 -30 -134 371 -54 -88 -77 -51 -101 -164 71
8072G1M2k41J96m8O3l7Oqj54L32k94J59j60J35J3M5j63J88j51kk5J9Q4k32J27
$$ 71 113 -128 68 20 83 46 52 44 -110 222 -72 87 -73 62 75 120 -43 145 -6 -8 -33 -14 70 -162 -35
8097c5K8J67k56J71P4k64L21m16M40j60J31l04K6J56l0k8L0Kj03N2n2L54l36k5
$$ -35 -7 160 -96 75 149 -115 206 -210 230 70 201 -103 -77 79 49 21 51 53 -50 2 -50 304 -32 -57
8121e7Qk7N0q3Q6O0j84J41J81k91L09l63Q6K23qj2K3k46L31l33J98J25m18K19
$$ -57 -49 -76 -26 -109 -23 37 -147 -6 175 -116 193 -170 -84 139 131 119 142 -104 227 -106 92 217 -201 18
8145A8K26K3j01j49rOk76J38L86k76Q8j10r3o2J02Q7N6j70O0n8L09k88J14J28
$$ 18 244 267 166 17 8 14 -262 -124 262 -14 74 -36 -129 -191 -89 -2 54 -116 -56 -114 195 -93 21 149
8169A49l69K61j76M7p7L1l0R7Q1j37J58l60N09j93J79j35j65K03J94l98J71q4
$$ 149 -220 41 -135 -88 -165 -134 -164 -67 14 -123 35 -325 184 -9 170 35 -130 73 267 -131 40 -44
8191d4
$$ Imaginary data points
##PAGE= N=2
##DATA TABLE= (X++(I..I)), XYDATA
0@%%%%%%Qq%nJ3j6J6j7K5m0M8n6P0q6J04j20J40j64J92k25K61l01L47m00M57n19
$$ 0 0 0 0 0 0 0 8 0 0 -5 8 -8 8 -9 16 -24 24 -32 38 -48 56 -64 76 -88 104 -121 140 -161 186 -214 243 -276
32b76N88o66P54q49R54j068J192j330J480j643J821k016K229k463K717k995L301
$$ -276 312 -354 400 -449 505 -563 629 -701 779 -864 957 -1059 1170 -1293 1424 -1571 1730
49A730l635M004m411M863n368N930o569P301q136R110j0262J1647j3354J5509
$$ 1730 -1905 2099 -2312 2551 -2817 3113 -3456 3845 -4291 4819 -5443 6204 -7150 8359
63H359j8334K2218k7896L7007n3938R5573l79791n51907Q79923K56189m82728
$$ 8359 -9975 12243 -15653 21354 -32584 62989 -316802 -868709 11214 267403 -215325
74b15325K01018O54763m15748p39749K25468M86055k12118o6888M24970k3921
$$ -215325 -14307 640456 224708 -515041 -289573 196482 -15636 -82524 342446 318525
84C18525n40507o3039K65031o7358m5667L25022M6997l37013k6954K21931j12672
$$ 318525 -221982 -285021 -19990 -87348 -133015 192007 239004 -98009 -124963 96968 -15704
95a5704j22917K44735P2653l31440p7300K66216L8557j03690J49816O9308k59870
$$ -15704 -138621 106114 178767 -152673 -229973 36243 74800 -28890 120926 190234 -69636
106f9636j22041J58905L9443L334K03691O140l50296j24754J69181n4124m2638
$$ -69636 -191677 -32772 6671 10005 213696 219836 -130460 -255214 -86033 -140157 -182795
117a82795M13671K31214m38912k89017K63335r863l26465K76451N55346k25945
$$ -182795 230876 462090 23178 -265839 -2504 -12367 -338832 -62381 492965 267020
127B67020n22794J45430K11043l49825m4486N95938J30666n15921q1835L02760
$$ 267020 -255774 -110344 100699 -249126 -293612 302326 432992 -82929 -164764 137996
137A37996k10278l08708L75496L70880l17954k59864K49086L9316k87262J06039
$$ 137996 -72282 -380990 -5494 365386 47432 -212432 36654 75970 -211292 -105253
147a05253L52675q9006k63655P9610Q5579j63068J4679K28506k4169j89179K3784
$$ -105253 247422 158416 -105239 -25629 59950 -103118 -88439 140067 115898 -73281 -49497
158d9497N2323j06766M6813K17247j7219j87081l325L0593j19357K3954K23486
$$ -49497 2826 -103940 -57127 160120 142901 -44180 -47505 -16912 -136269 -112315 111171
169A11171L3359j45998n097O479j51840J4644K55929N6332j53120K3757M2385
$$ 111171 144530 -1468 -6565 -86 -151926 -137282 118647 174979 21859 45616 88001
180H8001k24311r6372K75192J24292j89975J9189J73050j98866k62636K33416
$$ 88001 -136310 -232682 42510 166802 -23173 -3984 169066 -29800 -292436 -59020
190e9020K72550j92188j30323K44020k321l49633J6801L40430k5024k19871J36913
$$ -59020 213530 21342 -108981 135039 132718 -216915 -200114 140316 115292 -104579 32334
201C2334J51362k38538j38049K45620R4351j97002M489J61406j10834j68558J34780
$$ 32334 183696 -54842 -192891 52729 147080 -49922 -45433 115973 5139 -163419 -28639
212b8639J33378j18670m0217J26255m3873j47287P6240J34848p0488o0988Q8485
$$ -28639 104739 -13931 -54148 72107 28234 -119053 -42813 92035 21547 -39441 49044
223D9044j4587j25591L9328J21390l7488n2178P8965k986j29245M656J10566k0015
$$ 49044 34457 -91134 -51806 69584 32096 -20082 58883 55897 -73348 -68692 41874 21859
235B1859n3936O8733J2004j14805k549J01540l2679o3153J02572N5559j36246
$$ 21859 -32077 36656 48660 -66145 -68694 32846 167 -62986 39586 95145 -41101
246d1101m2545J33825j274j22629N9376J20278r3591r8702J13819N2675j36508
$$ -41101 -83646 50179 48905 -73724 -14348 105930 12339 -86363 27456 80131 -56377
257e6377j0627J42096k9208j31416O5484J05344j00093p9136J10628L9245j08636
$$ -56377 -67004 75092 45884 -85532 -20048 85296 -14797 -93933 16695 55940 -52696
268e2696J3573J14103m4031j03422N7918O7883p1127k0396R5648j701r5512J3427
$$ -52696 -39123 74980 30949 -72473 -14555 53328 -17799 -38195 57453 55752 -39760 -26333
280b6333O0283m5320k7814Q1455J9291r2267k0152N6098j6172l2782N9418L9465
$$ -26333 33950 -11370 -39184 42271 61562 -30705 -50857 5241 -10931 -43713 15705 55170
292E5170n9094l0388L1859j5070k2197O7606M8822o3777m7759L3685m417l9899
$$ 55170 -3924 -34312 -2453 -17523 -39720 27886 76708 12931 -34828 -1143 -5560 -45459
304d5459M8375P4050l3965o3413Q214l107m2361L4859Q5142j1787p1160n135Q080
$$ -45459 2916 76966 43001 -20412 -12198 -15305 -57666 -22807 62335 50548 -20612 -25747 -17667
317a7667m1203J2620R3493L0168n9487k7637L759l8499j0538P9784N7668l9775
$$ -17667 -58870 -46250 47243 77411 17924 -9713 -5954 -44453 -54991 24793 82461 42686
329D2686m6496r403l1022k0094O1170P2166j1161m5437k2068l4628l5814L7689
$$ 42686 -3810 -13213 -44235 -64329 -3159 69007 57846 12409 -9659 -44287 -80101 -42412
341d2412Q2377K5833l5684l8188l4231k4558K9278O9719L9961p779l0161n2653
$$ -42412 39965 65798 30114 -8074 -42305 -66863 -37585 32134 72095 64316 34155 -18498
353a8498n4582O765O9610N6617K478k9396m8305n2586q484N2077O2680K8758r716
$$ -18498 -73080 -66315 3295 59912 62390 32994 -15311 -67897 -76381 -24304 38376 67134 57418
366E7418m8145o9572l2267L9531O9838M7196P144l5424o5241m3802J8994O0724
$$ 57418 9273 -60299 -92566 -53035 16803 63999 71143 35719 -29522 -73324 -54330 6394
378F394N5469K2828k5685p0567o6826p073N0754O5190M1265n841n7907p1957k6740
$$ 6394 61863 84691 59006 -11561 -78387 -85460 -34706 30484 71749 65908 8001 -63956 -90696
391i0696L9508P0667N0379M893m1044o7069n2875N141P1366Q0800K5894l8034
$$ -90696 -51188 19479 69858 74751 33707 -33362 -86237 -81096 -9730 71070 96964 58930
403E8930o4621n5248j6972M4100P6453M1121k1116n5057o4298m7263K2549R3243
$$ 58930 -5691 -60939 -77911 -33811 42642 83763 62647 7590 -56708 -103971 -81422 11821
415A1821P2495q574m9159m8976m9910j4073O8190R0863J9025m2863m9078n5610
$$ 11821 84316 75742 26583 -22393 -72303 -86376 -18186 72677 91702 48839 -239 -55849
427e5849m0282M4642J04930M7546l6275m8908m6824n5410K328Q9391P5945j3885
$$ -55849 -96131 -51489 53441 100987 64712 15804 -31020 -86430 -84102 5289 81234 67349
439F7349n1195m4123n0650j7389P0472R7407K4757m1592n3740n6499l0658M5042
$$ 67349 16154 -27969 -78619 -96008 -25536 71871 96628 55036 1296 -55203 -85861 -40819
451d0819Q6817M1585j9446m7255o4651n0357K2430Q4582O5476O125m2632p4234
$$ -40819 45998 87583 68137 20882 -43769 -94126 -71696 12886 78362 84487 41855 -32379
463c2379o0309R399O2981N6889L5080K274o4418q9917j1414O8304N6951L0939
$$ -32379 -92688 -83289 -20308 36581 71661 73935 9517 -80400 -91814 -23510 33441 64380
475F4380K5897l4462j03951m9462N5308N5467J3629L4176J3434q8683r1197L5300
$$ 64380 90277 55815 -48136 -97598 -42290 13177 26806 60982 74416 -14267 -105464 -70164
487g0164Q0850J5977J0484L2311m7561j07493r007Q6887M1987l69K9136j0501
$$ -70164 10686 26663 37147 69458 21897 -85596 -94603 -7716 34271 33902 63038 52537
499E2537r5825n1179O5393O6035R154J6592m23q6014q1664L5147P7084K2908J3301
$$ 52537 -43288 -94467 -29074 36961 46115 62707 62284 -23730 -105394 -70247 6837 29745 43046
512D3046K3170m7013r7567j8547O9454N7256K1138J4406k4018p3009m8037K3779
$$ 43046 66216 19203 -78364 -96911 -27457 29799 50937 65343 41325 -31684 -79721 -55942
524e5942N6102M4925K1802j4870m7486m5557j8881K1919O0052M2707k6817n2918
$$ -55942 160 45085 66887 52017 4531 -41026 -59907 -37988 22064 64771 37954 -14964
536a4964j3862m558k0319K9680P8663J0004p2632k9925K7758q601j3711O3461
$$ -14964 -28826 -33384 -53703 -24023 54640 64644 -7988 -37913 -10155 -18756 -32467 30994
548C0994N2500o1026p1310K0026K6279k0090K7601O6679k1011q4126j5716K8877
$$ 30994 83494 22468 -48842 -28816 -2537 -22627 4974 71653 50642 -33484 -49200 -20323
560b0323r771J2097P2487J2656q1866m1334L0693K025j0227O2939N6491n1592
$$ -20323 -30094 -17997 54490 67146 -14720 -56054 -25361 -23336 -33563 29376 85867 34275
572C4275o8925J0074J3162k5663K7301P6129k823p7031k4105K8299p074j7430
$$ 34275 -34650 -24576 -11414 -37077 -9776 66353 63530 -13501 -37606 -9307 -16381 -33811
584c3811M1426M6657k5900n3253q679J9389M856N25J8356J8090j3692l2135l486
$$ -33811 7615 54272 28372 -24881 -33560 -14171 -9315 -8790 9566 27656 13964 -18171 -21657
597b1657K8824J1516j8548J051K2238j5475l6769J6050M3760j3468l8520J3479
$$ -21657 7167 18683 135 1186 23424 7949 -28820 -12770 30990 17522 -20998 -7519
609g519J9825l3119j3682N1521K1024m5783j5187L1728j2018l6343L2137N2289
$$ -7519 12306 -20813 -34495 17026 38050 -7733 -22920 8808 -3210 -39553 -7416 44873
621D4873k0707l6860J8376O926l9665J915N2459K204l7904J1461K3136m0517l3157
$$ 44873 24166 -12694 5682 12608 -27057 -25142 27317 29521 -8383 3078 26214 -14303 -47460
634d7460M3229L2037l4755j1238M0536j641m8341l35L9360o528k6475K5747L4721
$$ -47460 -4231 27806 -6949 -18187 22349 20708 -27633 -27968 11392 4864 -21611 4136 38857
647C8857k3023l4364J2289J6361j8696j0936K9978K6481j8233l2055l397J0396
$$ 38857 15834 -18530 -6241 10120 -8576 -19512 10466 36947 18714 -13341 -16738 -6342
659f342q176r033K7004L3632j6896m2344m13K2550j1516j2314L8525L2873l4016
$$ -6342 -14518 -23551 3453 37085 20189 -22155 -22568 -18 -11534 -23848 14677 47550 13534
672A3534l9391J6914J8215j9567J984L7094j157m0052m032K0951j1071j0139K9888
$$ 13534 -25857 -8943 9272 -10295 -8311 28783 27626 -12426 -16458 4493 -6578 -16717 13171
685A3171J2015l9490j7534L1577J0088k0226J3222K5873k8052l8302K1093L3821
$$ 13171 25186 -14304 -31838 -261 9827 -10399 2823 28696 644 -37658 -16565 17256
697A7256r640k831K9805q280n6873j4377M4845K2410j2474R067J4089l6226n0222
$$ 17256 7616 4785 34590 26310 -30563 -44940 -95 22315 9841 18908 32997 -3229 -53451
710e3451Q909M4585J9176O6Q273j0208m3035k6834K5039M2544J7796k246o878
$$ -53451 -44542 43 19219 19285 27558 17350 -25685 -52519 -27480 15064 32860 30614 23736
723B3736k1224l3332j0698L0279L8536R983j3264j8108k2382k1569Q194L8403
$$ 23736 2512 -30820 -41518 -11239 27297 37280 24016 5908 -16474 -38043 -29849 8554
735H554K4375j2657k0608j1138j4489q863K5312M1462O445l0334k2019n084l633
$$ 8554 32929 20272 -336 -11474 -25963 -34826 -9514 31948 38393 8059 -13960 -19044 -22677
748b2677J1955L6212K0322k3534l3475j1971l897L084L2486L9022q271m6218k7179
$$ -22677 -10722 25490 45812 22278 -11197 -23168 -27065 -23981 8505 47527 39256 -6962 -34141
761c4141P58L419J8224M3515K0573l5305m4032r097P340J0849L5324M0154j0847
$$ -34141 -33383 -29964 -11740 31775 52348 17043 -26989 -36086 -28746 -17897 17427 57581 46734
774D6734n1600l0585L809J0570K1523L7916J2404l8649m3342q114J0575J5810
$$ 46734 -4866 -35451 -31642 -21072 451 38367 50771 12122 -31220 -39334 -28759 -12949
786a2949L2245K7624j7773m7133k4883Q167K0928K7698K6343k193l3616l2288
$$ -12949 19296 46920 29147 -17986 -42869 -34702 -13774 13924 40267 38074 4458 -27830
798b7830p603J4466K9561L1670N838k9617l8587j9323P514K7612L2621J2169j7262
$$ -27830 -35433 -20967 8594 40264 46102 16485 -22102 -41425 -33911 -6299 26322 38491 21229
811B1229l1121k6708q202K2622M2063K4541j2488k9823k5962j5088R420L8910
$$ 21229 -9892 -36600 -44802 -22180 19883 44424 31936 2113 -23849 -38937 -29517 9393
823I393L4582k520k7361k6072k0709m474K8542M2101J0046k4806k8912k2609j2044
$$ 9393 43975 41455 14094 -11978 -32687 -37161 -8619 33482 43528 18722 -10190 -32799 -44843
836d4843J8867M4193K4302j5539k7225k0579j6637M281L7468L7751J197k6736
$$ -44843 -25976 18217 42519 26980 -245 -20824 -37461 -33180 4288 42039 43236 16500
848A6500k8418k1670j984K9000L7307J0120j6596k3960k7210j6624J6725L9766
$$ 16500 -11918 -33588 -35572 -6572 30735 40855 24259 299 -26911 -43535 -26810 12956
860A2956K2427p872k3095k6236j8436Q943L4496K7705L000j3789k4512k5726k533
$$ 12956 35383 27511 4416 -21820 -40256 -31313 3183 30888 33888 20099 -4413 -30139 -32672
873c2672K8073L1029R375j0174k3852k8607j0321K0821K9889J4015j579j6724
$$ -32672 -4599 26430 35805 25631 1779 -26828 -37149 -16328 13561 27576 25997 9273
885I273l0535j9546J4283L0191J8358N263o867k6740k8829M158L1733K2858M571
$$ 9273 -21262 -40808 -26525 3666 22024 27287 20420 -6320 -35149 -30991 742 23600 28171
898B8171k457j6941k9583j2390J8638K6246J3093J236j5169k8964j7046J2008
$$ 28171 25714 8773 -20810 -33200 -14562 11684 24777 26013 10844 -18120 -35166 -23158
910b3158K3847J5083O898n984k3313k1349K260J9143J9082J4218J9k2562k5279
$$ -23158 689 15772 22670 16686 -6627 -27976 -25716 -6573 12509 26727 26746 4184 -21095
923b1095j254J6372J2866J0984P547j2264k7723j3733J0913J6438J1672Q323m927
$$ -21095 -22349 -5977 6889 17873 25420 13156 -14567 -28300 -17387 -949 10723 19046 14119
936A4119k1712j6966L868J5039J4246J0614j353j5851j6102j634P094J2025J5209
$$ 14119 -7593 -24559 -20691 -5652 8594 19208 17855 2004 -14098 -15732 -8638 3387 18596
949A8596N035j5402j9499m329N949O802J1025R312p989j8656q091L763M952Q549
$$ 18596 23631 8229 -11270 -15599 -9650 -2848 8177 17489 9500 -9156 -17247 -13484 -8532 17
963A7J4147K009j6542j4142K538Q722O483P368M783o634j2194o460J585O576R674
$$ 17 14164 16173 -369 -14511 -11973 -3251 3232 10600 15383 8749 -3445 -9905 -8320 -1744 7930
978G930N170o597j1497m602P80J942N893P858k1q876n548J705J883K139O994N454
$$ 7930 13100 6503 -4994 -9596 -8816 -6874 -981 6877 6856 -2020 -7568 -5863 -3980 -1841 5153 10607
994A0607n426r318K45N387O36k29L531L39o822m698L492L165k048p0L115j964
$$ 10607 5181 -4137 -3892 1495 2131 1902 5433 5772 -1050 -5748 -2256 909 -1139 -1209 1906 -58
1010e8o525m9O446K615k685j300J752R19n70N8J165J241J106k032k820J374K704
$$ -58 -6583 -6632 -186 2429 -256 -1556 196 1115 545 603 1768 3009 4115 2083 -737 637 3341
1027C341j068l970o51K26P5K124J803k480l786M79O67o26L716O358no451k750
$$ 3341 2273 -1697 -2348 -2122 -2047 77 1880 -600 -4386 -3907 -3240 -3866 -150 6208 6203 -248 -2998
1044b998l64j015M742J0569M70r970m111J169n564k146J4175J0167j0939j0736
$$ -2998 -3362 -4377 365 10934 11404 1434 -2677 -1508 -7072 -9218 4957 15124 4185 -6551
1058f551L137k632r522R633K1366k380j8326r65P074q550l321J8979J2493j3497
$$ -6551 -3414 -6046 -15568 -5935 15431 13051 -5275 -6240 834 -7716 -11037 7942 20435 6938
1072F938j1972L162k066n509J1611J5144q355j5313l00J448n530O001J6040J376
$$ 6938 -5034 -1872 -3938 -9447 2164 17308 8953 -6360 -6660 -5212 -10742 -4741 11299 12675
1086A2675j4024p758q56p50P909J5557L846j1506r499m015l195N870J6140Q785
$$ 12675 -1349 -9107 -9963 -10713 -2804 12753 16599 5093 -4406 -8421 -11616 -5746 10394 19179
1100A9179o458j1490j1685p698O311J6606R354j708m765j3083j7378K278K1655
$$ 19179 12721 1231 -10454 -18152 -11841 4765 14119 12411 7646 -5437 -22815 -20537 1118
1113A118J1115k890K814k539k4515j3262K3224K2239n484l774P324j5073k6521
$$ 1118 12233 9343 12157 9618 -14897 -28159 -4935 17304 11820 8046 15370 297 -26224
1126b6224R047K9309J749j0963P128k455k8852p304K9754J6427j2229k440M873
$$ -26224 -17177 12132 13881 2918 10046 7591 -21261 -28565 1189 17616 5387 2947 7820
1139G820j7161j6158J8376K3054k201n170J229j5014j8040J1446K4304L745n600
$$ 7820 -9341 -25499 -7123 15931 13730 8560 9789 -5225 -23265 -11819 12485 16230 10630
1152A0630m81j2422k0992K292K2770J1151j98J82j1912k2217m395J8363J5541
$$ 10630 10149 -2273 -23265 -20973 1797 12948 12750 12932 1020 -21197 -25592 -7229 8312
1165H312P330M991j0826k3845p267J1788R583R937J5961m480k9710j4137J1343
$$ 8312 15642 20633 9807 -14038 -21305 -9517 66 10003 25964 21484 -8226 -22363 -11020
1178a1020N676K176K0873R658k9315k3826J3662J0311r295J3827K6949j5301l6341
$$ -11020 -5344 -3168 17705 27363 -1952 -25778 -12116 -1805 -11100 2727 29676 14375 -21966
1191b1966L046K1960m595q16K4775R20l4465j1414K1138M230o696J8037J1147
$$ -21966 -18920 3040 -1555 -2371 22404 23324 -11141 -22555 -1417 2813 -3883 14154 25301
1204B5301k8498k3962J3825J3442k976J1593J5476j8236k7700K911J3721R92J1013
$$ 25301 -3197 -27159 -13334 108 -2868 8725 24201 5965 -21735 -18824 -5103 -4111 6902
1217F902J9833q313k8968p896R234K912R048K0211L03k4050j3926J402j4O979
$$ 6902 26735 18422 -10546 -18442 -9208 -6296 2752 22963 23266 -784 -14710 -13308 -13322 -6343
1231f343K0008O401j5634j2039l926o470O450K3642P909j5634o852K062j1258
$$ -6343 13665 20066 4432 -7607 -11533 -18003 -11553 12089 19998 4364 -2488 -426 -11684
1244a1684n060K3767J7190j5900j2701O169p369j4365J7712K6090j1919k2167
$$ -11684 -16744 7023 24213 8313 -4388 1781 -5588 -19953 -2241 23849 11930 -10237
1256a0237O428L340j8166M353L1401L707k3905m771P345j2084l668K7208J4429
$$ -10237 -3809 -469 -18635 -14282 17119 20826 -3079 -7850 -505 -12589 -16257 10951 25380
1269B5380j8885j0873N893r731j1030K0178K1636j0428j4565K924o651j5589J1510
$$ 25380 6495 -4378 1515 -8216 -19246 932 22568 12140 -2425 499 -6152 -21741 -10231
1282a0231K5102j288j4086R69j930j5191K974K1185O141q136l22k266j4200j340
$$ -10231 14871 13583 -503 466 -1464 -16655 -13681 7504 13645 5509 5187 2921 -11279 -12619
1296a2619J6704P194o178Q39j220j4675l968J4869N600o130M014L552j7198r509
$$ -12619 4085 11279 5101 5940 4720 -9955 -13923 946 6546 416 4430 7982 -9216 -18725
1310a8725J7618J1208j0048J75J0698j1075j7137J1522J7739p041n319J1476m572
$$ -18725 -1107 10101 53 228 10926 -149 -17286 -5764 11975 4934 -385 11091 6519
1323F519k1435L110K0449j794r998Q953L078j9793o190J8476M788r827O443Q976
$$ 6519 -14916 -11806 8643 6849 -3149 5804 8882 -10911 -17101 1375 6163 -3664 2779 11755
1337A1755j5077j2881J3831J0247q256J439J1064q552j5026P119J0800o238k369
$$ 11755 -3322 -16203 -2372 7875 -381 1058 12122 3570 -11456 -4337 6463 225 -2144
1350b144J1246k825j5299O66J0771k312l813Q180Q4j1033j01R195l245l560R644
$$ -2144 9102 6277 -9022 -8356 2415 103 -3710 4470 4554 -6479 -6580 2615 -630 -4190 5454
1365E454K720j2402k280J0597j111o786P241N559j0876n529J0330P16j0154M842
$$ 5454 8174 -4228 -6508 4089 2978 -3808 3433 8992 -1884 -7413 2917 3633 -6521 -1679
1379a679J0559q826j0290R202O002r693m89J2364l711j1278O032R086q022n076
$$ -1679 8880 54 -10236 -1034 4968 -4725 -5214 7150 3439 -7839 -1807 7279 -743 -5819
1393e819J1235J816j1842R29J0687n084q522Q307M967j0960k608J1698r32j0645
$$ -5819 5416 7232 -4610 -3681 7006 1922 -6600 1707 6674 -4286 -6894 4804 3872 -6773
1407f773L253Q651o300n817R354L352q936M49P344m291o125P991O229q567l416
$$ -6773 -3520 5131 -1169 -6986 2368 5720 -3216 -2767 4577 286 -5839 2152 8381 -186 -3602
1422c602O967j793p537N192P252n496m789N395j092q393L716J0505l479p331M531
$$ -3602 3365 1572 -5965 -773 6479 983 -3806 1589 497 -7896 -4180 6325 2846 -4485 46
1437D6K786q079l25J0954J031p393J071L602o829l480R678M189o602j335L131
$$ 46 2832 -5247 -5572 5382 6413 -980 91 3693 -3136 -6616 3062 7251 649 -686 2445
1452B445n717m935P592O628n279k419M131l893p655N493J0024k322m119K717j977
$$ 2445 -3272 -8207 -615 6013 734 -1685 2446 -1447 -9102 -3609 6415 4093 -26 2691 714
1467G14p722K412R685K78m451K501o11q900j969R291M286l685P7j16p210l287
$$ 714 -7008 -4596 5089 5367 916 3417 2806 -6094 -8063 1228 5514 1829 1906 1790 -5420 -8707
1483h707P206N212j986J066J672p376n927N895P176o60L3K231n614p718K547P293
$$ -8707 -1501 3711 1725 2791 4463 -2913 -8840 -2945 4231 3571 3604 5835 221 -7497 -4950 2343
1499B343R41o01K951l880q784j125O729L114O20L032k188q613k909N977L872J009
$$ 2343 3284 2683 5634 1754 -7030 -8155 -1426 1688 2308 5340 3152 -5461 -8370 -2393 1479 2488
1515B488L062P69p820n754L592M291J700L381J450o797p702J627M821J448K549
$$ 2488 5550 6319 -1501 -7255 -3663 628 2328 5709 7159 362 -7340 -5713 -892 556 3105
1530C105L334l671q621j713L949L306L193L981k398p297l483K861K817K823M515
$$ 3105 6439 2768 -5853 -7566 -3617 -311 2882 6863 4465 -2832 -6315 -3454 -637 2186 6701
1545F701M96o960n583J38K672K993M600J517n271o212j276J610K744N284K803
$$ 6701 7197 237 -5346 -5208 -2536 457 5057 6574 1303 -4909 -6185 -4575 -1831 3453 6256
1560F256k880o134k246L6K484N367M521k045n495l476q09Q65M497N455m71m901
$$ 6256 3376 -2758 -5004 -4968 -2484 2883 7404 5359 -136 -3612 -4421 -3556 941 6396 5925 1024
1576A024l755k059j105L408O858K156m731m710j486q28J760N505M493j732m372
$$ 1024 -2731 -4790 -5895 -2487 4371 6527 1796 -2914 -4400 -5228 -3468 2037 6530 4798 426
1591D26l007j673M17M679N471q0m667m000j362l43K109M936K765k986m705k601
$$ 426 -2581 -4254 -3837 842 6313 6233 1566 -2434 -3796 -4139 -2030 2906 5671 2685 -2020 -4621
1607d621m48K083M113L897m42m610l642o02J816L045L774J751l015n666j842J389
$$ -4621 -5069 -2986 1127 5024 4582 -28 -3670 -4272 -2456 589 4363 6114 3099 -2567 -4409 -3020
1623c020K131L172K953q17n468m256O24K831K082K275J880k716n229j477K583
$$ -3020 -889 2283 5236 4419 -1049 -5305 -4681 -1850 232 2507 4387 1671 -3558 -5035 -2452
1638b452K850K237K025j124m367l022J433K873J311J302O01k768m561p51K821
$$ -2452 398 2635 4660 3536 -831 -3853 -2420 453 1764 3066 3667 899 -3662 -4413 -1592
1653a592K720J144q9j976k712j723J242L620K499k16j334j998k402o98L272M033
$$ -1592 1128 2272 2183 207 -2505 -4228 -2986 634 3133 2917 1583 -415 -2817 -3515 -243 3790
1669C790M80k624j359j791k099O85M315K456k344k028K9k123k238L389N050m01
$$ 3790 4270 1646 287 -1504 -3603 -2918 1397 3853 1509 -519 -490 -2613 -4851 -1462 3588 3187
1685C187l646j00M64k647K04M639J748k733j256J065j707k237L253L745k446l202
$$ 3187 -459 -559 -95 -2742 -2538 2101 3849 1116 -140 925 -782 -3019 234 3979 1533 -1669
1701a669O80P17j937L31L426Q94l080p25M64n25j57K823J709j877j966J43J59
$$ -1669 -989 -272 -2209 -1878 1548 2442 -638 -1363 -899 -1424 -1581 1242 2951 1074 -892 -749 -590
1718e90j45J217J163O19j389k352k69L25J219Q71l1M77j416k384P66K270K57p11
$$ -590 -735 482 1645 2264 875 -1477 -1746 -1421 -202 669 638 1115 -301 -2685 -1919 351 608 -103
1736a03J329Q70k717j625K680J382k207N23K214j970k528J663K321j884j804K916
$$ -103 1226 2096 -621 -2246 434 1816 -391 132 2346 376 -2152 -489 1832 -52 -1856 1060
1752A060P77l885n27L806m0l277J306K658k289j657K591K038k439j073K448k94
$$ 1060 1837 -2048 -2575 1231 1191 -2086 -780 1878 -411 -2068 523 2561 122 -951 1497 1203
1768A203k826J077K507o76k512Q67J065j323n71J490K90j284m17J039j46l84M72
$$ 1203 -1623 -546 1961 1285 -1227 -360 705 -618 -1189 301 591 -693 -1110 -71 -217 -601 -129
1785a29M41j16L4l05j97P98J37o18o22J132j24q64Q26O10q13j196R85Q3j371J18
$$ -129 312 196 230 -75 -272 526 663 45 -577 555 431 -433 393 1003 190 -1006 -21 62 -1309 -1191
1805a191K723m85k299L87J334q89q27K374J004k192r78J943n77j961J426K730
$$ -1191 1532 1047 -1252 -865 469 -420 -1247 1127 2131 -61 -1039 904 327 -1634 -208 2522
1821B522j827k321J077J226j876m8K545k4k451L6J000m96q89J993J226j259j493
$$ 2522 695 -1626 -549 677 -1199 -1247 1298 1274 -1177 -1141 -141 -637 -1526 467 1693 434 -1059
1838a059P98K80q37J000J518o46j250N3j86m67R56R29o37n10n73o58l2J109J330
$$ -1059 -261 19 -818 182 1700 1054 -196 -143 -329 -796 160 1089 452 -58 -631 -1289 -1321 -212 1118
1857A118m56p46J07m69j122J184J593M62j175j29o82j069O07J697L87j199J21
$$ 1118 662 -84 23 -446 -1568 -384 1209 1671 496 367 -315 -1384 -777 920 1307 108 229
1874B29o0j445p13K020J448j043k18L74j573j165J801J483n6r13M77n40j598L34
$$ 229 169 -1276 -1989 31 1479 436 218 592 -981 -2146 -345 1138 1082 169 646 106 -1492 -1158
1892a158K210L99q70q3l15j503l32J686J132m82m90k28j018o62J010J478k69L39
$$ -1158 1052 1451 581 498 183 -1320 -1652 34 1166 684 194 -34 -1052 -1714 -704 774 505 844
1910H44o01r29p99R74R57O00k48o2r05j061J66J121M82L69q5r52j252m7Q63R91
$$ 844 243 -686 -1485 -511 446 1046 798 736 -169 -1230 -1064 57 539 908 823 -129 -1381 -1428 -565 426
1930D26L47L41q58r20o48O25O67N91R69m79j360p91P25K23L52O79L63j170j304
$$ 426 773 1114 256 -664 -1312 -687 -20 571 1540 1061 -299 -1090 -365 -142 210 889 1252 82 -1222
1949a222L01N00L49M64O56o21j350l35Q17M58M71L43l71p71m91J12O52N25M26
$$ -1222 -921 -421 -72 392 1048 427 -923 -1258 -441 17 488 831 460 -311 -802 -690 -38 487 913
1968I13K38r60j081J38L99K88M99L89n32j166q4J10N54O83P60m05j092l54P6M36
$$ 913 1151 191 -890 -752 -353 -65 434 823 291 -875 -959 -849 -295 388 1148 743 -349 -703 -627 -191
1988a91O37K53K03p40o82J29j82O25P87j40m16m27k62k33L10Q04J16k73n49m03
$$ -191 446 699 902 162 -520 -391 -573 52 839 699 283 -144 -406 -639 -329 475 591 318 -231 -634
2008f34N3M57L27N67j09m52n73J11k35N88M18K01p33k45k42J11J5N42N07k35l69
$$ -634 -581 -124 203 770 661 209 -364 -253 -488 100 518 719 -14 -259 -501 -390 -375 167 674 439 70
2029G0n90k09K36O66L58n7k11l72j61J1J12P57n2k68n22Q1n53O85L19J34j38k72
$$ 70 -520 -729 -493 173 531 474 263 -109 -270 -259 -147 610 558 290 -232 -151 -704 -19 300 434 296 24
2051B4m76l46N17K04J57M75k05n25j61J10O6L92K66k30o1k62m37M42J63j18L23
$$ 24 -452 -798 -281 -77 80 555 350 -175 -336 -226 -160 232 498 268 207 -55 -492 -50 113 -5 318
2072C18l25m69K41J65K62l1j43K31o6l71j66M55jJ62j45j64j67L0J32J82M5M5
$$ 318 -7 -476 -235 -70 192 161 18 249 183 -188 -354 101 100 262 117 -47 -214 -184 -52 130 175 220
2094B20Q3l20j29J27j43L23K61l51q4k96k26M20L71j91P0k3k44J11l38N17N4k7
$$ 220 303 -17 -146 -19 -162 161 422 71 -13 -309 -535 -115 256 65 135 112 -132 -21 -359 158 212 185
2116A85J4j30J10m12KL16k51K33k35o5L42o7L9pQ2Kj71J06j86R0J27k10J4j40
$$ 185 199 69 179 -233 -231 85 -166 67 -168 -233 109 42 81 74 156 158 -13 93 -93 -3 124 -86 -72 -212
2140b12l3L03l46J01J98J39k13o4M18m80L36j20j74J0J60j38J82j91J27N6J14
$$ -212 -245 58 -288 -187 11 150 -63 -127 291 -189 147 27 -147 -137 23 -115 67 -124 3 59 173
2161A73j05j69L35k58l6P7J04j46k05K92j83K28j28m0J39j53J07k14O09m81j01
$$ 173 68 -101 234 -24 -60 17 121 -25 -230 62 -121 107 -21 -61 78 -75 32 -182 427 -54 -155
2182a55R1p3K18j20J02J98k61j09J48j30J91k73L32O8m89K23j38J7L15k12L17
$$ -155 -64 -137 81 -39 63 261 0 -109 39 -91 100 -173 159 227 -262 -39 -177 -160 155 -57 260
2203B60l93l57L77J00P3M21l87l5k44k7K81M7n9J85j97j26k6m1J82m1k1p0L4j20
$$ 260 -133 -490 -113 -13 60 481 94 59 -185 -212 69 116 57 242 45 -81 -107 -148 34 -7 -28 -98 -64 -184
2227a84J35Ml2P2j4P8r7L8k67L96J87k98J10k67q9p9L91J06l3j4j9j39j79j2K47
$$ -184 -49 -45 -77 -5 -19 59 -38 0 -267 129 316 18 128 -139 -228 -307 84 190 157 143 124 -15 -194 -206 41
2252D1N17l56o3j08m30K26K50K02j52o6j62k07j75K68L72K15l72K89n46o8j57
$$ 41 558 202 139 31 -399 -173 77 279 127 61 -101 -308 -483 -215 157 372 0 289 -257 -325 -482
2273d82N19J23J99o08J27r1j60L31L91J17k65r9p0j20J60O2lm2L1k87j1o1R4K7
$$ -482 37 160 359 -249 -122 -213 -373 -42 349 466 201 102 32 -88 72 134 131 89 120 -167 -178 -239 -145 -118
2297a18K55l9k65j44J11K54O6j7J67l86j33J51q4M52r7K67l80k87j11J30M11J
$$ -118 137 98 -167 -311 -200 54 120 103 270 -116 -249 -98 -182 270 173 440 60 -227 -338 -208 203 204
2319B04j8M1n35j29Q7M53j15K10K84m15l71o6N68J15o6k40L58l61n21K12M68p4
$$ 204 186 227 -308 -437 -350 103 -12 198 482 67 -304 -370 198 313 247 7 365 4 -517 -305 163 89
2341H9K51k88m6m58QM95M6LK3nm27Q2J88L53o3j89K2N3l17j0K56K68j1j76m80
$$ 89 340 52 6 -452 -444 51 97 100 123 118 -309 -227 -39 314 251 62 84 137 -180 -190 66 334 323 147 -333
2366c33J55k56J87M62L1on66l5K06j69K56N25J47n47j80k%j84O13J66j10o97r6
$$ -333 -178 -434 -247 215 246 240 -326 -361 -155 -324 -68 457 604 57 -123 -125 -125 -309 304 470 360 -337 -433
2389d33J10J10R2L36l8k14l55M04j08J4L75K97n39m41K12K38o7K50l8J36p41K12
$$ -433 -323 -213 -121 215 177 -37 -392 12 -96 -82 293 590 51 -390 -178 60 -7 243 205 341 -400 -188
$$ [...]
8191a79
##END NTUPLES=NMR FID
##END=
