##TITLE=1H_IVDMO504
 CDCl3, 8 sc, 
 8.4.2019
##JCAMPDX= 6.0         $$ Bruker NMR JCAMP-DX V2.0
##DATA TYPE= NMR FID
##DATA CLASS= NTUPLES
##ORIGIN= UXNMR, Bruker Analytische Messtechnik GmbH
##OWNER= root
$$ XWIN-NMR		Version 3.5
$$ Mon Apr  8 13:48:53 2019 Russian Standard Time (UT+4h)  she@DPX200
##.OBSERVE FREQUENCY= 200.1315
##.OBSERVE NUCLEUS= ^1H
##.DELAY= (6, 6)
##.ACQUISITION MODE= SIMULTANEOUS
##.ACQUISITION SCHEME= undefined
##.AVERAGES= 8
##.DIGITISER RES= 18
##SPECTROMETER/DATA SYSTEM= spect
##.PULSE SEQUENCE= zg30
##.SOLVENT NAME= CDCl3
##.SHIFT REFERENCE= (INTERNAL, CDCl3, 0, 15.7039)
##AUDIT TRAIL= $$ (NUMBER, WHEN, WHO, WHERE, WHAT)
$$ ##TITLE= Audit trail, XWIN-NMR		Version 3.5
$$ ##JCAMPDX= 5.01
$$ ##ORIGIN= Bruker BioSpin GmbH
$$ ##OWNER= she
$$ F:/spectra/data/she/nmr/H-F/1/audita.txt
$$ ##AUDIT TRAIL=  $$ (NUMBER, WHEN, WHO, WHERE, WHAT)
(   1,<2019-04-08 13:46:12.09 +0400>,<she>,<DPX200>,
      <created by zg, POWCHK disabled, PULCHK disabled
       configuration hash MD5:
       00 E9 B6 7A A2 85 ED C7 34 08 36 98 17 FE 4E 26
       data hash MD5: 16K
       2C 99 C1 AA C0 BD A9 F2 50 59 2E 04 30 BF 64 FC>)
$$ ##END=
$$ 
$$ hash MD5
$$ 00 51 92 38 71 DD BB 05 37 C9 CC 48 DF F0 D8 27
##$RELAX= 
##$RELAX= 
##$RELAX= 
##$RELAX= 
##$RELAX= 
##$RELAX= 
$$ Bruker specific parameters
$$ --------------------------
##$DU= <F:/spectra>
##$EXPNO= 1
##$NAME= <H-F>
##$PROCNO= 1
##$TYPE= <nmr>
##$USER= <she>
##$AMP= (0..31)
100 100 100 100 100 100 100 100 100 100 100 100 100 100 100 100 100 100 
100 100 100 100 100 100 100 100 100 100 100 100 100 100 
##$AQSEQ= 0
##$AQ_mod= 1
##$AUNM= <au_zg>
##$AUTOPOS= <>
##$BF1= 200.13
##$BF2= 200.13
##$BF3= 200.13
##$BF4= 200.13
##$BF5= 200.13
##$BF6= 200.13
##$BF7= 200.13
##$BF8= 200.13
##$BYTORDA= 1
##$CFDGTYP= 0
##$CFRGTYP= 5
##$CHEMSTR= <none>
##$CNST= (0..31)
1 1 145 1 1 1 1 1 1 1 1 1 1 1 1 1 1 1 1 1 1 1 1 1 1 1 1 1 1 1 1 1 
##$CPDPRG= <>
##$CPDPRG1= <>
##$CPDPRG2= <>
##$CPDPRG3= <>
##$CPDPRG4= <mlev>
##$CPDPRG5= <mlev>
##$CPDPRG6= <mlev>
##$CPDPRG7= <mlev>
##$CPDPRG8= <mlev>
##$CPDPRGB= <>
##$CPDPRGT= <>
##$D= (0..31)
0 1.2 0 0 0 0 0 0 0 0 0 0.03 0 0 0 0 0 0 0 0 0 0 0 0 0 0 0 0 0 0 0 0 
##$DATE= 1554716771
##$DBL= (0..7)
120 120 120 120 120 120 120 120 
##$DBP= (0..7)
150 150 150 150 150 150 150 150 
##$DBP07= 0
##$DBPNAM0= <>
##$DBPNAM1= <>
##$DBPNAM2= <>
##$DBPNAM3= <>
##$DBPNAM4= <>
##$DBPNAM5= <>
##$DBPNAM6= <>
##$DBPNAM7= <>
##$DBPOAL= (0..7)
0.5 0.5 0.5 0.5 0.5 0.5 0.5 0.5 
##$DBPOFFS= (0..7)
0 0 0 0 0 0 0 0 
##$DE= 6
##$DECBNUC= <off>
##$DECIM= 24
##$DECNUC= <off>
##$DECSTAT= 4
##$DIGMOD= 1
##$DIGTYP= 9
##$DL= (0..7)
0 120 120 120 120 120 120 120 
##$DP= (0..7)
150 150 150 150 150 150 150 150 
##$DP07= 0
##$DPNAME0= <>
##$DPNAME1= <>
##$DPNAME2= <>
##$DPNAME3= <>
##$DPNAME4= <>
##$DPNAME5= <>
##$DPNAME6= <>
##$DPNAME7= <>
##$DPOAL= (0..7)
0.5 0.5 0.5 0.5 0.5 0.5 0.5 0.5 
##$DPOFFS= (0..7)
0 0 0 0 0 0 0 0 
##$DQDMODE= 0
##$DR= 18
##$DS= 0
##$DSLIST= <SSSSSSSSSSSSSSS>
##$DSPFIRM= 0
$$ [...]
##$SUBNAM2= <"">
##$SUBNAM3= <"">
##$SUBNAM4= <"">
##$SUBNAM5= <"">
##$SUBNAM6= <"">
##$SUBNAM7= <"">
##$SUBNAM8= <"">
##$SUBNAM9= <"">
##$SW= 24.9337058887773
##$SWIBOX= (0..15)
0 0 2 0 0 0 0 0 0 0 0 0 0 0 0 0 
##$SW_h= 4990.01996007984
##$TD= 16384
##$TD0= 1
##$TE= 0
##$TE2= 300
##$TE3= 300
##$TEG= 300
##$TL= (0..7)
0 120 120 120 120 120 120 120 
##$TP= (0..7)
150 150 150 150 150 150 150 150 
##$TP07= 0
##$TPNAME0= <>
##$TPNAME1= <>
##$TPNAME2= <>
##$TPNAME3= <>
##$TPNAME4= <>
##$TPNAME5= <>
##$TPNAME6= <>
##$TPNAME7= <>
##$TPOAL= (0..7)
0.5 0.5 0.5 0.5 0.5 0.5 0.5 0.5 
##$TPOFFS= (0..7)
0 0 0 0 0 0 0 0 
##$TUNHIN= 0
##$TUNHOUT= 0
##$TUNXOUT= 0
##$USERA1= <user>
##$USERA2= <user>
##$USERA3= <user>
##$USERA4= <user>
##$USERA5= <user>
##$V9= 5
##$VALIST= <valist>
##$VCLIST= <CCCCCCCCCCCCCCC>
##$VD= 0
##$VDLIST= <DDDDDDDDDDDDDDD>
##$VPLIST= <PPPPPPPPPPPPPPP>
##$VTLIST= <TTTTTTTTTTTTTTT>
##$WBST= 1024
##$WBSW= 4
##$XGAIN= (0..3)
0 0 0 0 
##$XL= 0
##$YL= 0
##$YMAX_a= 1064952
##$YMIN_a= -764191
##$ZGOPTNS= <>
##$ZL1= 120
##$ZL2= 120
##$ZL3= 120
##$ZL4= 120
##$ABSF1= 10
##$ABSF2= 0
##$ABSG= 5
##$ABSL= 3
##$ALPHA= 0
##$AQORDER= 0
##$ASSFAC= 0
##$ASSFACI= 0
##$ASSFACX= 0
##$ASSWID= 0
##$AUNMP= <proc_1d>
##$AZFE= 0.1
##$AZFW= 0.1
##$BCFW= 1
##$BC_mod= 2
##$BYTORDP= 1
##$COROFFS= 0
##$CY= 11.3945322036743
##$DATMOD= 1
##$DC= 2
##$DFILT= <>
##$DTYPP= 0
##$F1P= 18.9103706918063
##$F2P= -1.10871071338519
##$FCOR= 0.5
##$FTSIZE= 0
##$FT_mod= 4
##$GAMMA= 1
##$GB= 0.15
##$INTBC= 1
##$INTSCL= 1
##$ISEN= 128
##$LB= 0.24
##$LEV0= 0
##$LPBIN= 0
##$MAXI= 10000
##$MC2= 0
##$MEAN= 0
##$ME_mod= 0
##$MI= 1.114404
##$NCOEF= 0
##$NC_proc= 0
##$NLEV= 6
##$NOISF1= 3.799351
##$NOISF2= 2.8
##$NSP= 1
##$NTH_PI= 0
##$NZP= 0
##$OFFSET= 15.70392
##$PC= 1
##$PHC0= -9010.049
##$PHC1= 14.00026
##$PH_mod= 1
##$PKNL= yes
##$PPARMOD= 0
##$PSCAL= 0
##$PSIGN= 0
##$REVERSE= no
##$SF= 200.130013532006
##$SI= 16384
##$SIGF1= 3
##$SIGF2= 2
##$SINO= 400
##$SIOLD= 16384
##$SREGLST= <1H.CDCl3>
##$SSB= 0
##$STSI= 0
##$STSR= 0
##$SW_p= 3612.71676300578
##$SYMM= 0
##$S_DEV= 0
##$TDeff= 0
##$TDoff= 0
##$TI= <>
##$TILT= no
##$TM1= 0
##$TM2= 0
##$TOPLEV= 0
##$USERP1= <user>
##$USERP2= <user>
##$USERP3= <user>
##$USERP4= <user>
##$USERP5= <user>
##$WDW= 1
##$XDIM= 8192
##$YMAX_p= 0
##$YMIN_p= 0
$$ End of Bruker specific parameters
$$ ---------------------------------
##NTUPLES= NMR FID
##VAR_NAME=  TIME,          FID/REAL,        FID/IMAG
##SYMBOL=    X,             R,               I
##VAR_TYPE=  INDEPENDENT,   DEPENDENT,       DEPENDENT
##VAR_FORM=  AFFN,          ASDF,            ASDF
##VAR_DIM=   8192,          8192,            8192
##UNITS=     SECONDS,       ARBITRARY UNITS, ARBITRARY UNITS
##FACTOR=    0.0002004,     1,               1
##FIRST=     0,             0,               0
##LAST=      1.6414764,     0,               0
##MIN=       0,             -764191,         0
##MAX=       1.6414764,     1064952,         0
$$ Real data points
##PAGE= N=1
##DATA TABLE= (X++(R..R)), XYDATA
$$ [...]
2585b762k598M868M673j052k672o08j743k098L349N505r13n335j631J924L00O63
$$ -2762 -5360 -492 4181 3129 457 -151 -1894 -3992 -643 4862 3949 -1386 -3017 -1093 -793 -130
2601a30L477L15n319l105L382L418p22l92P05k520l239K122N037P4l490j120P28
$$ -130 3347 3662 -1657 -4762 -1380 2038 1316 924 1629 -891 -4130 -2008 3029 3103 -387 -1507 -779
2618g79p90JL187J514l189k938J077J962N83j9M23j290j968L90K018J173n09j191
$$ -779 -1569 -1568 1619 3133 -56 -2994 -1917 45 628 609 1032 -258 -2226 -1836 182 1355 846 -345
2636c45j092qJ179R16j81l15l56q17n66J629J402j199j674N23J260q05k67J821
$$ -345 -1437 -1445 -266 650 469 154 -202 -1019 -1585 44 1446 247 -1427 -904 356 -449 -716 1105
2654A105K4k689m48K741Q72k272l75J885n43k084J311K668j480k721J247K238
$$ 1105 1129 -1560 -2008 733 1605 -667 -1042 843 300 -1784 -473 2195 715 -2006 -759 1479
2670A479j190j547J843P96k386n77K940Q20l082q60K494N52k089Q48K379j876
$$ 1479 289 -1258 585 1381 -1005 -1582 1358 2178 -904 -1764 730 1282 -807 41 2420 544
2686E44l330J464L698j30k749K50J108j534j196L416K098k559l444O74K147L9
$$ 544 -2786 -1322 2376 2246 -503 -253 855 -679 -1875 1541 3639 1080 -2364 -1690 457 496
2702D96L21J737o61l819j583L398L266o85k129q07n82j092J291L694J307l664
$$ 496 817 2554 1893 -1926 -3509 -111 3155 2470 341 -466 -1048 -2140 -849 2845 4152 488
2718D88l587O49K751R30L85O29j407l853o47M201L270j649k974n42j99m55K174
$$ 488 -3099 -2450 301 1231 1616 2245 838 -3015 -3662 539 3809 2160 -814 -1356 -1555 -2010 164
2735A64L745q79n146k210L096K821k05l5J79l115l202K722N711L77m255k362O04
$$ 164 3909 3030 -2116 -4326 -1230 1591 1386 1351 1530 -1585 -4787 -2065 3646 4023 -232 -2594 -1990
2752a990j29R51M102J933m780n713J145M918K211l95j03k490m802m61O454N232
$$ -1990 -2119 -1168 2934 4867 87 -5626 -4481 437 2648 2253 2150 -340 -5142 -5603 851 6083
2768F083k499n274j802J27L84L508N360p70p735m624L661N196J245K88m76m238
$$ 6083 3584 -1690 -3492 -3365 -2981 527 5887 5117 -2618 -7242 -3581 1615 2860 3148 2672 -1566
2784a566n418K154Q278L299m528m398n42o63N19N392M569l959q033j080N410L061
$$ -1566 -6984 -4830 3448 6747 2219 -2179 -2721 -3384 -2865 2527 7096 3137 -4896 -5976 -566 2495
2800B495r5O79j028n782k862N931O811j490n610j649M09l57K764N146K56p343
$$ 2495 2400 3079 2051 -3731 -6593 -662 6149 4659 -951 -2600 -2191 -2548 216 5362 5618 -1725
2816a725m712L504N282J457m58j167m035m332K566P781L132m439n449j823J041
$$ -1725 -6437 -2933 2349 3806 3348 2181 -1854 -6186 -3620 4161 7293 2854 -2595 -4418 -3377
2831c377K560M963L042l918p958k830N275O316J795j789l568m867k751M583Q546
$$ -3377 -817 4146 7188 3270 -4688 -7518 -2243 4073 5868 4079 511 -4356 -7107 -2524 6022
2846F022K350o242o465q17K081K759M997K815n425q938n70P366M721r67r80j883
$$ 6022 8372 2130 -4335 -5152 -3071 -312 4685 7500 2075 -6863 -7433 -67 4654 3687 2707 824
2862H24n715k694P242Q321k551p791j775K052m21J977O359M40r167n341N731O273
$$ 824 -4891 -7585 -343 7978 5427 -2364 -4139 -2087 -2508 -531 5828 6268 -2899 -8240 -2509 3764
2878C764j104j409P07l643n768L500R798J097p645l772J730K21P07N753L316o902
$$ 3764 2660 1251 1958 -1685 -7453 -3953 5845 6942 -703 -4475 -2745 -2524 -1817 3936 7252 350
2894C50q426K113P048K694m82m16l496o181N4Q347N801k750n722l370q84J892
$$ 350 -8076 -5963 1085 3779 3297 2881 -615 -6796 -6742 1605 7406 4656 -1066 -4436 -5320 -3428
2910c428N801M781k468p280m332J835N233M748Q29l887n263k834K230N912M732
$$ -3428 2373 7154 4686 -2594 -6926 -5091 142 4890 5719 1832 -3431 -6265 -4035 1877 6609
2925F609j444o381m554J392M065L211K075r78o035m893L151P282J828l341k220
$$ 6609 5165 -1216 -5770 -4378 -313 2898 4973 3995 -2040 -6933 -3782 3500 5328 1987 -233
2940b33j320k883J244P328L267o434n960K187K979k07K277L548m087q165Q43Q489
$$ -233 -1553 -4436 -3192 4136 7403 969 -4991 -2804 175 -32 2245 5793 1706 -6459 -5616 2873
2956B873K711m133j221L22m191j973P508O587m894p758J65L148j53K307N152j746
$$ 2873 5584 1451 230 552 -3639 -5612 1896 8483 3589 -4169 -4004 -856 -1009 1298 6450 4704
2972D704r110l009O461M916q70l14p18n266l614M978P494q5m853l138j024k20
$$ 4704 -4406 -7415 -954 3962 3092 2778 2060 -3206 -6820 -1842 5652 5567 714 -2424 -3448 -3668
2988c668L004N467N42n218m545J12K935L348K267j123m604k885J032L210L152
$$ -3668 -664 4803 5345 127 -4418 -4306 -1371 1977 4244 3121 -1483 -4368 -3336 -126 3026
3003C026Q26k682m549r65L169L117O04o50j842l730q18M779M039k109l730l56
$$ 3026 3852 1170 -3379 -4344 -1175 1942 2546 1896 54 -3676 -4494 285 4324 2215 -1515 -1871
3019a871J71r79K527M655j503o497j142M250J778j092J641P36n127l455M981N279
$$ -1871 -1700 -2679 -152 4503 3000 -3497 -4639 -389 1389 297 1938 2674 -2453 -5908 -927 4352
3035D352j895l440O41m71l075K010O363K88o504k467L241Q00p49L078K154m689
$$ 4352 2457 -983 -342 -813 -3888 -1878 4485 4773 -1731 -4198 -957 -157 -906 2172 4326 -363
3051c63m993K692M878o6j446P35j481l642Q16N042J796l151j931K32o76J58L120
$$ -363 -5356 -2664 2214 2148 702 1437 -44 -3686 -2870 2172 3968 817 -1114 -882 -1558 -1400 1720
3068A720J996k926l088N49J510N72J374P72k281k564J078K185Q1J01K59j431k245
$$ 1720 3716 790 -2298 -1749 -239 333 1707 2479 198 -2366 -1288 897 978 1079 1338 -93 -2338
3085b338J219L213qk264J16K78j517K41K983Q36l322j469K288M10j147J103J808
$$ -2338 -1119 2094 2086 -178 -62 216 -1301 -1060 1923 2759 -563 -2032 256 666 -481 622 2430
3102B430k380k925K226K886j291j922J801J10k778O2L888M45l676n88K479l02
$$ 2430 50 -2875 -649 2237 946 -976 825 935 -1843 -1781 2107 2552 -1124 -1712 767 465
3118D65k009J731K264k380k726K001K332j548j173J926j81k443L94K911l49k715
$$ 465 -1544 187 2451 71 -2655 -654 1678 130 -1043 883 702 -1741 -1347 1564 1215 -1500
3134a500M89J710p54j162J468J116k212j170K147J100j654l16J126p93j282J631
$$ -1500 -1011 699 -55 -1217 251 1367 -845 -2015 132 1232 -422 -738 388 -405 -1687 -56
3150e6J804j489j785R78O94j121P49K110j202k929M85K336lq31R69M1k658o94
$$ -56 1748 259 -1526 -548 146 -975 -226 1884 682 -2247 -1762 574 571 -260 709 750 -1908 -2602
3168b602L209J569k052j091J023q53j191K313K837k114l230N27J946l43K58J953
$$ -2602 607 2176 124 -967 56 -797 -1988 325 3162 1048 -2182 -1655 291 -52 206 2159
3184B159p64l778n34L481J508j320l00O4k171j113L331L025j933k842KL81l37
$$ 2159 1395 -2383 -2917 564 2072 752 452 516 -1655 -2768 563 3588 1655 -1187 -1185 -804 -1141
3201a141J631K852j023m235j128K492J760L96N22o72l433j283K965L209m27j696
$$ -1141 490 3342 2319 -1916 -3044 -552 1208 1604 2126 1454 -1979 -3262 -297 2912 2485 789
3217G89j190j595n37K943L364j012l392j575L66Q58K201K356j232m100j581J971
$$ 789 -401 -1996 -2533 410 3774 2762 -630 -2205 -1839 -981 1220 3576 2344 -1756 -3337 -1366
3233a366K444J075N98j627l637j418L219L751j51j789j782j996m32L161L884n38
$$ -1366 1078 2153 2751 1124 -2513 -3931 -712 3039 2888 1099 -683 -2679 -3111 50 3934 3396
3249C396l947k570N45J241K483K682j120m466k587K080L136J644K20j582l869
$$ 3396 -551 -3121 -2576 -1335 1148 3830 2710 -1756 -4343 -2263 873 2517 2737 1155 -2714
3264b714k043L060M552P78k274k631j890m69L069M364J94m103l366M4J884K503
$$ -2714 -4757 -1697 2855 3633 1359 -1272 -3162 -3631 -562 3802 3996 -107 -3473 -3429 -1545 958
3280I58K725o38m548l415J750L941K110q9j666l482k352K247M834J919k399l357
$$ 958 3683 3045 -1503 -4918 -3168 773 2883 2794 1128 -2354 -4706 -2459 2375 4294 1895 -1462
3296a462j982J09K818L803Q03l468l897o49K144L416K282r56m053l147P71L754
$$ -1462 -3444 -3335 -517 3286 4089 621 -3276 -3925 -1781 1635 3917 2961 -1092 -4239 -3468 286
3312B86L050L70k482l791j722K150M372K162j713l620k664QL323M041O70l339
$$ 286 3336 3706 1224 -2567 -4289 -2139 2233 4395 2682 -938 -3602 -3594 -271 3770 4440 1101
3328A101l877j263K067L442K977p78m464l396P66L647L028J101k198m362k495
$$ 1101 -2776 -4039 -1972 1470 4447 3669 -795 -4191 -3425 222 3250 4351 2153 -2209 -4704
3343d704K494M469K121j577k994k649j121K905M729J526l657m354q26J917K626
$$ -4704 -2210 2259 4380 2803 -191 -2840 -3961 -1056 3673 5199 1542 -2812 -3638 -1721 905
3358I05K505M75l444m441L9M005L220k5j667k687k518N16M216L282j358l823k428
$$ 905 3410 3885 441 -4000 -3961 44 3264 3239 1572 -1115 -3633 -3117 1099 4381 3023 -800 -3228
3375c228N90J865K781J760j713m252k224K108L964J669r59k512k806p78K503M030
$$ -3228 -2638 -773 2008 3768 2055 -2197 -4421 -2313 1651 3320 2361 -151 -2957 -3735 -1232 2798
3391B798J374k768m003j324J684K872K579L34l249m107o95L616L865N16k143k689
$$ 2798 4172 1404 -2599 -3923 -2239 633 3212 3546 297 -3810 -4505 -889 2976 3492 1349 -1340
3407a340k188k60L502M238n5m318l127K82K080K198K082j60l705l643J121M046
$$ -1340 -3528 -3788 -286 3952 3897 -421 -3548 -3266 -1186 1012 3094 2934 -771 -4414 -3293 753
3423G53K202r00j450j911k020O75M037K513k102l455j017J157J094J744J560j330
$$ 753 2955 2055 605 -1306 -3326 -2651 1386 3899 1797 -1658 -2675 -1518 -424 1320 2880 1550
3439A550l804j266K812K888N1j515j133j337o29K046L279M7l064k486O97J710
$$ 1550 -2254 -3520 -708 2180 2231 716 -417 -1754 -2383 -337 2942 2989 -75 -2561 -1864 -154
3455a54J259J315l20k553k850Q75L610K078j315k007j032j144M03L020K991j587
$$ -154 1105 2420 2100 -453 -3303 -2428 1182 3260 1945 -62 -1094 -2238 -1835 1185 4176 2589
3471B589m012j735J785J888J021J160n15l452k656K123L983R00k000j136q36j424
$$ 2589 -1423 -3158 -1373 515 1536 2696 2181 -1271 -3927 -1804 2179 3079 1079 -57 -893 -2317
3487b317M78L576K144k723l202L58J228J74R82J937j008l726r11L071J936j173
$$ -2317 -1839 1737 3881 1158 -2044 -1686 -458 -284 698 2635 1627 -2099 -3010 61 1997 824
3503H24q96O02r10j692J470K811l24k879o80J588L30n54R94O89k014j882J687
$$ 824 -72 530 -380 -2072 -602 2209 1885 -994 -1674 -86 244 -310 684 1373 -641 -2523 -836
3520h36K524m14j685l46L88q93J48K452R14k256k573R81J796L86j14M70n25k447
$$ -836 1688 1274 -411 -757 -369 -1262 -1114 1338 2252 -4 -2577 -1596 200 586 472 942 417 -2030
3538b030o12K594K300r96j756l82k0q49J129K536L52k793j842J281J241l5L34
$$ -2030 -2642 -48 2252 1256 -500 -882 -902 -1751 -622 1914 2266 -527 -2369 -1088 153 118 452
3555D52J213j079k758M5K654J116j368p39Q92n15j551Q27K497l55k457J32J685
$$ 452 1665 586 -2172 -2127 527 1643 275 -464 428 -87 -1638 -811 1686 1331 -1126 -994 691
3572F91k65j321Q77J371j098j409J184J435j199j520R52J475q61q14J109K86j632
$$ 691 426 -895 -18 1353 255 -1154 30 1465 266 -1254 -302 1173 312 -502 607 893 -739
3589g39n53J858J312j290j273N66K11r42N62J875K18k206j269J273R06k29M09
$$ -739 -1292 566 1878 588 -685 -119 92 -850 -288 1587 1805 -401 -1670 -397 509 280 689
3606F89N82q84j820K04K143P05j193n21L04n35q55J067J878o01j985k02J626n7
$$ 689 1271 387 -1433 -1229 914 1619 426 -95 209 -326 -1181 -114 1764 1163 -822 -1024 602 545
3624E45r97L78J174q40j574Q21J875o24j950N52J474n74r37R29P78j526j446J883
$$ 545 -452 -74 1100 260 -1314 -493 1382 758 -1192 -640 834 260 -677 252 1030 -496 -1942 -59
3642e9J806j081j427L21M18j125L18K356M93k708j500J276J365l14M47Q36j371
$$ -59 1747 666 -761 -440 -22 -1147 -829 1527 2020 -688 -2188 -912 453 139 586 1422 51
3659E1k485K92K831J237j248r30k83j005l26K096K040q65k516o68Q66M16N81J459
$$ 51 -2434 -2142 689 1926 678 -252 -535 -1540 -1866 230 2270 1405 -1111 -1779 -913 -497 84 1543
3677A543j08k446j523J434K164K05q46l92p60p95N09K228Q14j680j725J17J067
$$ 1543 1435 -1011 -2534 -1100 1064 1269 423 31 -729 -1524 -1015 1213 2027 347 -1378 -1261 -194
3694a94O11M86K63j045j687j20K086J565q54j444n65n9J34J219J755l56k664j519
$$ -194 417 903 1166 121 -1566 -1686 400 1965 1111 -333 -898 -957 -823 396 2151 1795 -869 -2388
3712b388J290K057O51j51o64j771j415J185K915J209j621k293o47K65J041K182
$$ -2388 -1098 959 1610 1459 795 -976 -2391 -1206 1709 2918 1297 -996 -1643 -1378 -337 1845
3728A845J118j871k916o33J668K091O64j35j502k269o78K374K943l0k309j570
$$ 1845 2963 1092 -1824 -2457 -789 1302 1966 1831 329 -1940 -2618 -244 2699 2669 360 -1210
3744a210n83M84J514K273J37k956k084N63K014J303L33n19k083j759Q56L053J235
$$ -1210 -1793 -1309 205 2478 2615 -341 -2425 -1862 152 1455 1788 1269 -814 -2573 -1717 1336 2571
3761B571j264j788j208k30J116K424J023j744k760p36J847J645Q82q6j736k289
$$ 2571 1307 -481 -1689 -1919 -803 1621 2644 900 -1860 -2596 -749 896 1778 1692 -44 -2333
3777b333k82K271K456K51j963j985r16Q57K223J878m60k546k027K29J748K369
$$ -2333 -2615 -344 2112 2363 400 -1585 -2501 -1644 579 2457 1997 -549 -2576 -2347 -599 1770
3793A770O07j487k355j415J139K416J699l23k367k085j42J925K223P51j383k319
$$ 1770 2377 890 -1465 -2880 -1741 675 2374 2051 -316 -2401 -2543 -618 1605 2356 973 -1346
3809a346j430Q54K590J832m07k360j871k50J632K241J232j562k616r98R25K079
$$ -1346 -2776 -1922 668 2500 2093 -267 -2138 -2388 -756 1485 2717 1155 -1461 -2459 -1534 545
3825E45J558k7j773k489m18K224K341L42j395j778j285M73K134K202m40k268j934
$$ 545 2103 2076 303 -2186 -2604 -380 1961 2303 908 -870 -2155 -1682 452 2654 2214 -54 -1988
3842a988J08J435J846J034j059k488j434J316K207J201l55j368j947p47J373K768
$$ -1988 -1880 -445 1401 2435 1376 -1112 -2546 -1230 977 2178 1823 455 -1492 -2239 -866 1902
3858A902O54j413k225p33L43J833J789K42k123k218j72J840J648O91n69k060j785
$$ 1902 2556 1143 -1082 -1815 -1472 361 2150 2392 269 -1949 -2121 -281 1367 2058 1489 -571 -2356
3875b356O95K307J369l57j435j458p71J157K107J118j231k131q47M50J573J553
$$ -2356 -1661 646 2015 1658 223 -1235 -2006 -849 1258 2376 1145 -986 -1833 -1383 190 1743
3891A743J59j640j823l17J419J506N94m86j639j497L52J973J315j40j420j410
$$ 1743 1902 262 -1561 -1878 -459 1047 1641 1155 -484 -1981 -1629 344 1659 1519 99 -1311
3907a311o00J055J750J068j039j632j129K70J470J374K81j535j514l06J180J380
$$ -1311 -1911 -856 894 1962 923 -709 -1838 -1568 -98 1276 1557 22 -1492 -1798 -618 762
3923G62M76l01j371j415K25J793J219l00r81j232n00P42J631Q91r33j473m45J17
$$ 762 1238 937 -434 -1849 -1624 169 1388 1088 107 -1125 -1625 -883 748 1639 706 -767 -1212 -1095
3941a095Q54J141O79j251j744j26J328R85J39o0r04j279m3J470J230k54j107n62
$$ -1095 -241 900 1579 328 -1416 -1542 -214 771 910 850 -54 -1333 -1376 94 1324 1070 -37 -599
3959e99l92K25J289R58o33j364o20M95Q37P42Q9n27j229n79J074R11K82k58o62
$$ -599 -991 -766 523 1481 848 -516 -1136 -641 196 938 1027 500 -729 -1308 -234 677 959 701 39
3978C9r42O7J021R00j84o49m75m63P0J026O95k50j269j62K64M00M62M10k79j242
$$ 39 -903 -836 185 1085 901 252 -223 -686 -616 410 1105 855 -414 -576 -312 88 550 960 681 -561
3998e61l34R41N61n8j84p1p80l29Q63P78k21q21j01J61l29N53R35j90j385j83
$$ -561 -895 46 607 549 365 294 -486 -815 48 826 605 -216 -317 -156 -485 68 1003 813 -572 -755
4018g55P52M01k27O5K14q91m89O64J029l23o50n7K5l18K57Q11K71j151n01N50
$$ -755 -3 398 171 236 450 -441 -930 -266 763 440 -210 -267 -242 -560 -303 508 779 -372 -873 -323
4038c23K90m7J68O1l74n63J85O79K72k79l68p1j14K16M65J20l94j95l01J18O39
$$ -323 -33 -80 88 149 -225 -788 -603 76 348 69 -299 -370 -484 -268 197 317 -77 -272 -573 -455 184
4059A84R1k99k50o8J13M6L57K53m56n31J74N98J13l27JN3n36k39Q79O40p20p91
$$ 184 275 -24 -274 -342 -229 -183 174 427 -29 -560 -386 212 325 -2 -1 52 -484 -723 156 796 76 -715
4081g15M41L58l96M09O09k69j141j61J169J88l99J77L54j046o28J157J037n65
$$ -715 -274 84 -312 97 706 437 -704 -865 304 492 93 270 624 -422 -1050 107 1144 579
4099E79r25J49K57l77J27J102K57j333p76O96O88k53J12L75m05r18J48J188J45
$$ 579 -346 -197 60 -317 -190 912 1169 -164 -940 -244 444 191 303 678 273 -645 -497 691 836
4118H36o32m07K87m0l66O54N84n43j016J32O75L96j99j82p8m78k37O08Q91o7r04
$$ 836 204 -203 84 44 -322 332 916 373 -643 -511 164 560 361 179 101 -377 -614 -6 885 818 -86
4139h6p14M15O15LK32P1o69r38K55J329N41o39o61m9m16n2J120J124q22j699r1
$$ -86 -800 -385 230 233 465 536 -133 -1071 -816 513 1054 415 -246 -295 -711 -763 357 1481 659 -1040 -1131
4160a131R05J67K04O64m4j565r75J249J529k69q82J20k38r97K45J923L99j480
$$ -1131 -226 -59 145 809 765 -800 -1775 -526 1003 734 -148 -28 -266 -1263 -1018 905 1304 -176
4178a76r52N85L55k46P23Q05q11j785K36J659L66q07p6J36o01n71J252J241o33
$$ -176 -1128 -543 -188 -434 289 1094 283 -1502 -1266 393 759 -48 -124 12 -589 -1160 92 1333 700
4197G00j581r7R06J68O3M82R1j496p20J184J323j44o77o09k83l51O06J457N72
$$ 700 -881 -978 -72 96 159 641 732 -764 -1484 -300 1023 879 202 -407 -690 -1041 -435 1022 1594
4216A594j490j445K21J008N61M18J99q44j470l81J596J676l68j147o40k74j50
$$ 1594 104 -1341 -1120 -112 449 867 1066 222 -1248 -1629 -33 1643 1275 128 -512 -786 -936
4233i36Q16J676K48j870j423O82J021M31P9M75j040j692K30J973Q50q76o52k6
$$ -936 -120 1556 1804 -66 -1489 -807 214 645 724 1199 159 -1533 -1303 670 1520 644 -8 -34
4251c4n92m35J399J493r52j712k22J197L13j90M93J04j561q91J460J565l36j464
$$ -34 -626 -1061 338 1831 879 -833 -1055 142 455 265 758 862 -699 -1590 -130 1435 1099 -365
4269c65j79K04m19N59J461K19j889j236Q64J206K05j43L22r83j342K26K062J035
$$ -365 -544 -340 -759 -200 1261 1480 -409 -1645 -781 425 630 487 809 -174 -1516 -1290 772 1807
4287A807j068j366Mj69m5J235J277o48k162o91J365Q76L12J45l97j418r75J090
$$ 1807 739 -627 -623 -792 -837 398 1675 1027 -1135 -1826 -461 415 727 872 475 -943 -1918 -828
4305h28J883J68q87r41k8n21M43J463Q71j286j610N2J165L88R1L05o24j121m46
$$ -828 1055 1223 336 -605 -633 -1154 -711 752 1623 337 -1273 -1221 -56 332 423 728 104 -1017 -1463
4324a463J440J132l41r32k58Lk92O79J048m4j520q82R37R79q0n0L5p28q76N33
$$ -1463 -23 1109 768 -164 -422 -419 -711 -32 1016 972 -548 -1430 -493 486 406 356 391 -337 -1213 -680
4344f80J622K80j121q18K57K43K8Q11O09r20j488L8J233Q47k85k71j32r28n20
$$ -680 942 1222 101 -717 -460 -217 -189 622 1231 311 -1177 -1139 94 941 656 385 253 -675 -1195
4363a195J223J448m07j288m51K37R1M24J021K04j385j058M50J152K27q8j45m57
$$ -1195 28 1476 1069 -219 -670 -433 -342 82 1103 1307 -78 -1136 -686 466 693 605 460 3
4381Cr96J23J271R26q27q57m9J81M5N14O46l62j164j26N57M33K4l3k1n11m84M56
$$ 3 -993 -870 401 1327 500 -357 -406 -225 -180 334 980 618 -546 -672 -115 318 342 309 288 -223 -707 -251
4403b51R31lq83m30M83J08J55K55K04o04o83J73Q09K23m56r2k22k60j33J023N11
$$ -251 680 677 -206 -636 -153 -45 110 365 569 -35 -718 -545 264 487 31 -61 -283 -543 -676 347 858
4424H58n77q22n1O13j0o4L32K9r02m48Q04P33j58n12K8N5o22K09J012K18p63o73
$$ 858 281 -541 -592 21 11 -53 279 308 -594 -1042 -238 495 337 -175 -147 -92 -714 -505 507 725 -38 -711
4446g11M29K20l8J14L15k15p15K3P76O0k08r0K34m33m1L96K34j89m10k2K44O1
$$ -711 -282 -62 -100 14 329 114 -601 -578 198 258 50 -40 194 -239 -280 116 350 161 -249 -271 -27 34
4468C4j57K11P5l20k20L70L64j95k27k03K75k4L8K30R9l65l19L45K48k8k11K01
$$ 34 -123 88 163 -157 -377 -7 357 162 -65 -268 7 -17 21 251 350 -15 -334 11 259 231 20 221
4490B21j72k42L5N09J61l90m19J51L60m2j64L64o9o29J74L21K53k59j73J80r9
$$ 221 49 -193 -158 351 512 122 -297 -146 214 172 8 372 303 -326 -152 169 422 163 -10 170 71
4511G1k99L16M15j30o35J6L65M2r3N2K65m73j46L03L04k35k77K8J4j10J0M68J09
$$ 71 -228 88 503 373 -262 -246 119 161 68 120 385 -88 -234 69 373 138 -139 -111 -97 -207 -197 271 380
4534C80m27l60K49K26J3K5N6l30k86L30K60J80k38o9k56j52K50K33K92l75m53
$$ 380 -47 -407 -158 68 81 106 162 -168 -454 -124 136 316 78 9 -247 -399 -149 84 376 1 -452
4555d52Q9K38K45J09m6m44q0l6J18L91J04k02k42k46K16K38J76P9j84m89j4M20
$$ -452 -363 -125 120 229 183 -261 -341 -377 -259 132 236 34 -208 -454 -238 0 176 255 71 -418 -432 -12
4577a2L06p9k04k78k44J26M83K67r7n63k08L27J42K4L56o6m74m14K78O56P3j08
$$ -12 294 215 11 -267 -511 -385 98 365 268 -295 -503 -176 -34 -10 346 280 -194 -608 -330 326 399 291
4599B91k27k64l00K33O30K59m48m70K0N7K77K79J23l70m71k8M00L18J77p1m00
$$ 291 64 -200 -500 -267 363 622 174 -296 -276 -219 58 337 460 90 -381 -409 -9 309 486 415 15
4620A5l44q3O26L94j60m38l89J8J90M24L91j84o07l05J18M62K28J29k14n48k01
$$ 15 -329 -412 214 608 448 10 -379 -361 -171 253 644 460 -147 -452 -334 128 356 485 271 -277 -478
4641d78K84M82L15k98m12k04j20M21M50J09k65o04k20K18N80K43j36m52k99j91
$$ -478 -194 288 603 305 -107 -311 -431 -10 440 549 284 -320 -540 -322 258 501 365 -87 -386 -577
4661e77M69O25P0n01m36k17K77K84N06M6n50o86l7N92N65k8j25n00m62Q6M51P65
$$ -577 -108 517 587 86 -350 -567 -290 -6 500 546 -4 -690 -727 -135 430 402 277 -223 -685 -599 -148 617
4683F17n4o74n11P8L34L32M33p7o82o42K56O75L47j81q3n02l26K30P31L13l61
$$ 617 563 -111 -622 -544 -210 122 555 478 -204 -846 -590 85 432 251 168 -334 -660 -430 301 614 253
4704B53m56l67J47K77M63L12m54p03l10N07P60Q9k11l71n50k6N79N11K33o25n41
$$ 253 -203 -570 -423 -146 317 629 175 -528 -838 -331 429 518 307 -64 -614 -640 -61 450 683 58 -483
4725d83k25K00O84L67K39q34o96lP43N66j2k44m83l61r8P89P91k37r02l86L13
$$ -483 -708 -508 176 543 782 -52 -748 -751 -8 558 546 302 -181 -542 -640 149 940 703 -199 -585 -272
4746b72K53L94L78j57q21n95M61P35K80j23l12n27l27K25J038L44n94p24k08K95
$$ -272 -19 375 753 596 -225 -820 -359 376 656 533 221 -306 -633 -408 630 974 380 -344 -552 -257
4766b57L51M48K69m77q58k25Q13M85P2l49l89k45k35N94P98pp90n65J46K32M43
$$ -257 94 542 811 334 -524 -749 64 549 621 272 -117 -362 -597 -3 795 788 -2 -567 -421 -189 254
4787B54M65j8p25q31J82R08L81k19k33l82m12l2P87Q64n03r61k69L40L81K43K28
$$ 254 719 701 -24 -855 -673 235 616 397 164 -218 -630 -662 125 989 486 -475 -744 -404 -23 220 448
4808D48o1q74n36O70P66O0k99k39k52m17K70J037K62o93q71K31L57Q5K74K11k67
$$ 448 387 -487 -1023 -353 413 473 174 -65 -317 -734 -464 573 835 142 -729 -498 -141 -56 218 429 162
4829A62r60P4Q35L99j94l37j61j85k52N47P57l07p85j43L39K26K9K99J04p07o52
$$ 162 -798 -724 111 510 316 -21 -182 -367 -619 -72 685 378 -407 -550 -211 15 44 343 447 -260 -912
4850i12M41R00L9m49j9k0o01Q4R53M20o51p18J65L83K37Q2K23j78p89l09P44O05
$$ -912 -471 429 468 19 0 -20 -621 -537 416 836 185 -533 -368 15 252 334 557 379 -410 -719 25 630
4872F30j24m11j35j04k04J87O73K66q19m19L36K69j47J42L80k79o97J6P66L04
$$ 630 506 95 -40 -144 -348 -161 512 778 -41 -460 -124 145 -2 140 520 241 -456 -440 326 630
4892F30n09j53K86k31k16J43P07j56q92q4O62o0r8R1M91o09o88N88O74k87n72
$$ 630 121 -32 254 23 -193 -50 657 501 -391 -475 187 127 29 120 611 2 -686 -98 576 289 -283
4913b83J10L65m40j04O15L79o20n78N41K58k96q1M44J50q07k67P48L53n67p8K54
$$ -283 -173 192 -248 -352 263 642 22 -556 -15 243 -53 -134 310 460 -347 -614 134 487 -80 -158 96
4934I6o6l26L7O05k0p08r8M71K27m12J00N15m20m07L9N48K5n17J17N33k57o46
$$ 96 30 -296 -259 346 326 -382 -480 -9 218 -194 -94 421 1 -406 -367 181 206 -311 -194 339 82 -564
4956e64K87N87j72n37J86N17k93o62N11N73m12l30K49K89m60l15N94L10m46m46
$$ -564 -277 310 138 -399 -213 304 11 -651 -140 433 21 -309 -60 229 -231 -546 48 358 -88 -534
4976e34M23K53l81j02N25J84m88l29L37M69n44m3N41o3p67J88O42J14o73rM31
$$ -534 -111 142 -239 -341 184 368 -120 -449 -112 357 -187 -230 311 248 -519 -331 311 425 -248 -257 174
4997A74j76m41L13O86l45m80j2N96J9m11P7M02m02m02L57O55k82m85o0L36r5r3
$$ 174 -2 -443 -130 556 211 -269 -281 315 334 -77 0 402 0 -402 -45 610 328 -157 -217 119 24 -69
5019f9L33K48m71n05M27M77p4l55R2J9l30j70P04L74m83n51K38J12kP9M10p9p80
$$ -69 264 512 41 -464 -37 440 366 11 103 122 -208 -378 326 700 217 -334 -96 16 14 93 503 424 -356
5042c56m24P52N29k79k34J21o3m26q3R55J42p18l57L79n5j71O02K67m52q87K47
$$ -356 -780 -28 501 222 -12 109 46 -380 -463 492 634 -84 -441 -62 -117 -288 314 581 129 -758 -511
5063e11O71J09l28K46p0n04l46O82N42j95p20P1J52q4J83N38Jp33n05M47O51k6
$$ -511 160 269 -59 187 117 -387 -733 -51 491 296 -424 -353 -201 -285 -102 436 437 -296 -801 -354 297 271
5085B71j78j42r4m49R0Q35K72m69m89j17K60J85J91L16k63o67k63O03N11r4k09
$$ 271 93 -49 -143 -592 -502 333 605 136 -353 -470 -210 -25 166 482 219 -448 -711 -108 403 309 100
5106A00j24j91l18J41Q69L18q22n51R4L85J45K61L27o12p32J28P49K67j97j49
$$ 100 -24 -215 -533 -392 477 795 -27 -578 -484 -99 46 307 634 22 -710 -582 167 434 237 88
5126H8k9m57k10P46O62m48n49j88K33J39O9N55Rp68n54M03N74J08m3j10m42l30
$$ 88 59 -398 -608 138 800 352 -197 -385 -152 -13 56 611 620 -148 -702 -299 275 383 340 230 -212 -542
5148e42L00P25L49n61l96j39Q0P8N90K44m97o83m0L81N26k5j44l73k40j67M94
$$ -542 -242 483 832 271 -125 -264 -184 -106 484 728 231 -452 -492 -111 415 390 246 -127 -367 -534 -40
5169d0N22L40o63m18k06K10L34L20J52n11p11J87O14M07o2m61j26n17J75N39O96
$$ -40 482 822 159 -259 -465 -255 79 399 551 40 -671 -484 130 537 475 14 -112 -629 -454 85 781
5190G81k08q93j48M2L18L86K45j61p17m76M70O34J30q6k23m61l61K79Q05L17n06
$$ 781 573 -320 -468 -426 -108 278 523 362 -355 -831 -361 273 403 317 94 -367 -728 -449 356 673 167
5211A67n80q6J28K81M39K82o21o59m8O90L91L8k12l61m92J5O30N32r1m18l97k74
$$ 167 -413 -499 -371 -90 349 631 10 -649 -697 -7 384 422 210 -151 -643 -628 2 534 443 25 -372 -646
5233f46J77O61L05j71m62m86K6N53N97rl55n21k72J81N83L68K8o79m42J34L48
$$ -646 -469 192 497 326 -136 -622 -596 -43 554 545 190 -331 -603 -422 161 529 557 -122 -564 -430 -82
5254h2N42K19l97m50m86K34O81L92k66l21l91k37L13P65L08m89n87k32K50K02
$$ -82 460 679 282 -168 -654 -420 261 653 387 66 -325 -562 -249 516 824 335 -252 -484 -234 -32
5274c2O25R1m67p51J7N33L67J96k57k21n46N4N20N67j78n23l63p1K70M20L62j18
$$ -32 593 684 217 -534 -517 16 383 579 322 101 -445 -391 129 696 518 -5 -368 -439 -169 251 613 495
5296D95n74m90J29N54L17J28k85n21l95K34P86J60k31m61k50n5L97N03R6n28k49
$$ 495 -79 -569 -440 114 431 559 274 -247 -642 -408 378 538 307 -154 -404 -459 -62 441 537 9 -240
5317b40k86K27L90M01j6n59n08K32K40L92J18j40n57k73K39N10K13r2k72m56m4
$$ -240 -526 -299 91 492 476 -83 -591 -359 -119 273 391 251 -306 -579 -340 170 383 291 19 -437 -481
5338d81M04N25p1k44l49j54n5L14N18J27o91l33J68J24K46K59P9n54l48J92M11
$$ -481 -77 448 377 133 -216 -370 -425 -111 407 534 -157 -490 -322 -198 48 307 386 -168 -516 -324 87
5359H7J83mj99k78k66K10O01J52k37n14K1j0J92K26K52k50m34j1L01J8J42J46
$$ 87 270 266 67 -211 -477 -267 334 486 249 -265 -244 -254 -62 164 416 166 -268 -279 22 40 182 328
5381C28k48k78m3K71L16k2j79l29N4o6K72K03Pk21l54K51JK30Q6j75P1l91J45
$$ 328 80 -198 -241 30 346 324 145 -184 -130 -196 76 279 286 65 -289 -38 -37 193 279 104 175 -216 -71
5404g1O7K55j1j81k83J19M9K23N5L3k69o7j16M10%j45l8k7j56l9L27K38k76k20
$$ -71 -4 251 240 59 -224 -105 -56 167 222 255 -14 -81 -197 213 213 68 30 3 -153 -192 135 373 97 -123
5428a23R3j13J5J07K70o0k64j20J83K7M2oK69k61l01J89J12r3J30P9p5l47J09
$$ -123 -30 -143 -128 -21 249 189 -75 -195 -12 15 57 51 320 59 -242 -53 59 -34 96 175 100 -247 -138
5451a38J94J05j00j22LO5j98O9L15j79k12j6J16J49p2R8l8m7o0j31K35P9p6k4
$$ -138 56 161 61 -61 -58 7 -191 -122 193 14 -198 -214 -98 51 -21 77 39 -8 -68 -199 36 115 39 15
5475A5J3j44j05J17K15J00l14p8k0M1J78M7J03j77l65J06K63N8l6mn9n6k65K85
$$ 15 28 -116 -221 -104 111 211 -103 -181 -201 -160 18 65 168 -9 -374 -268 -5 53 17 13 -46 -102 -367 -82
5499h2L84m0m16j86K44L0J43J28J52n34l33M45L15l3k64L41k77n17K13N91J57
$$ -82 302 262 -154 -340 -96 -66 77 205 357 -177 -510 -65 250 217 -47 294 17 -500 -287 304 461
5520D61l11l52k2J78q8L05L21j47p11j3L22L99k20J15j32l65j39K73N52P0n98
$$ 461 150 -202 -224 -46 -134 171 492 345 -366 -379 -57 342 122 237 105 -260 -399 -126 426 496 -102
5541a02p3k2j9J74M91K0l85o06N4M83K89O1j79k25m10p2O15M80j08n01l59Q1J97
$$ -102 -175 -197 -216 -42 449 469 84 -522 -468 15 304 365 186 -39 -449 -521 94 574 466 -35 -394 -313 -116
5564a16L05L52j00o38n09L74M97K02m6j47l39n43K91P51L41l69p06n3J27K8N62
$$ -116 189 541 441 -197 -706 -332 165 367 321 174 -165 -708 -417 334 675 306 -400 -453 -326 -298 264
5585B64L11l58q81k62P49N19l7k23n6m86l33N34R12r7n05n77J06P3J72O60J73
$$ 264 575 217 -664 -926 -177 342 305 82 26 -460 -793 -259 653 556 51 -526 -420 -347 -175 485 658
5606F58q64o29J97P40J68O3nn28o32K41P32N93l16o33k92L5K65L78O54l12r25
$$ 658 -206 -835 -638 102 270 333 328 -200 -832 -591 141 734 418 -215 -507 -472 -207 171 825 513 -412
5627d12l89M82N79K29k1l27n09m37L75R08L84o43m80l23J45M16M04M41n29q72
$$ -412 -801 -319 260 489 468 141 -368 -805 -430 478 862 219 -261 -584 -439 -23 381 822 293 -579
5647e79r7O66M87Q1j45m40m40k76O84R80k26o59m45m1J64M08O21L4r10o23J99
$$ -579 -676 -10 477 558 413 -27 -467 -743 -59 921 695 36 -409 -450 -286 122 743 777 -133 -756 -557
5668e57P72M01k8j42n57o26M1J114N21m64p82j49J36M8O04N93l11j176l86N67
$$ -557 215 616 588 446 -111 -737 -696 418 939 475 -307 -456 -320 -272 332 925 614 -562 -948 -381
5688c81O90K52j94k60n73m05N69J039L2o95n45o1P5L67O01L60q48q84R2P25N64
$$ -381 309 561 367 107 -466 -871 -302 737 769 74 -471 -532 -457 -90 511 871 23 -861 -769 -44 520
5709E20J16l03m44o56R0P11P61j06q49m28J25J29M39O60j29q49o74K84P29L35
$$ 520 636 333 -111 -767 -677 34 795 689 -160 -588 -463 -334 105 765 636 -213 -887 -603 126 461
5729D61j18j72m62o51N05Q41L85l95o80l33J63L51N36L36m09r74k47N54O21K25
$$ 461 343 171 -291 -942 -437 404 789 394 -286 -619 -456 -105 431 767 358 -616 -863 -309 312 537
5749E37j80k46q64m0P06Q56l3o47m71n3n9M66O57Q6p63p08J20O77L29P4j82n12
$$ 537 357 111 -753 -793 -87 769 736 89 -382 -435 -494 -28 629 715 -48 -756 -636 41 370 444 262 -250
5771b50l46l4Q32N14k13o54l47K7L82M50M60l19p22n15M09N71J62m9k51m25l25
$$ -250 -596 -630 202 716 503 -151 -498 -471 -89 361 821 502 -220 -735 -326 245 407 358 107 -318 -643
5792f43M41O75K39l79n72j98R1L00N61J78m32o65k27M68N19J96k47l14l23k39
$$ -643 -202 473 712 333 -239 -437 -346 -46 515 693 261 -404 -631 -163 356 552 305 -9 -332 -571
5812e71N24O07k7n57k77m6J7L59N32k3n86m93KP15K07N0k36l49k98O8M46M20j33
$$ -571 -47 560 533 -24 -301 -347 -330 29 561 538 -48 -541 -539 176 383 433 197 -152 -450 -382 64 484 351
5835C51n81j01J21R7J33M86j78p94j05L41L35R7M2q6m38l07K91N69K96n18l11
$$ 351 -230 -331 -210 -113 20 506 328 -466 -571 -230 105 202 244 158 -280 -587 -296 273 569 51 -260
5856b60j76L2L69L02J99m17n31O3L35J85K42l5l30k94j10L21M46l2k03l49qK33
$$ -260 -436 -404 -35 267 466 49 -482 -419 -84 101 343 308 -22 -316 -426 -105 341 309 106 -243 -251 -18
5878a8J03J41j4l40k39J34J78L34pj17j97k18L4J59L24Rl61j83M5L19q2K53o8
$$ -18 85 226 212 -128 -367 -233 -55 279 272 155 -42 -260 -226 -67 257 266 -95 -278 -233 86 4 257 189
5901A89l68k3J04O5K66j54M1j61k57J11M86j29j22L2j34K5l6M0L20j61k33mP6
$$ 189 -179 -202 -98 -33 233 79 120 -41 -298 -187 299 170 48 80 -54 -29 -65 -25 295 134 -99 -103 -27
5924b7J36p4R4l7n6j07JJ73l0k1k0o3p3O8J27R3j79j6o2K7o9J02R5M3qj75lP0
$$ -27 109 35 129 92 36 -71 -70 103 73 52 32 -31 -104 -36 91 184 5 -11 -73 -46 -115 -13 82 125 117 -58 -61 9
5952IO0N4n7k69J66j43J03K66O7k31k00K2Q1J30k2J16j44k12M3J49L7J79o0k40
$$ 9 69 123 66 -203 -37 -180 -77 189 256 25 -175 -153 -72 58 36 152 8 -204 -161 -12 25 204 144 -96
5976i6j58j8L03J78j22k15l2k3l9K67L29j69m29J21p9Q8J40K81j99k11l52L88
$$ -96 -254 -272 31 209 87 -128 -160 -183 -222 45 374 205 -224 -103 -182 -94 46 327 128 -83 -435 -47
5998d7K89p9mq4k32k02K83L90J04l47l09j50J47J96L71j05j43l55j27K28K63L32
$$ -47 242 163 159 75 -157 -359 -76 314 418 71 -238 -388 -241 -45 326 221 78 -277 -404 -176 87 419
6020D19k16l96k57lM72K40Q9k86k80k44L85K43J96Nm72k77M0K59M62k8k86k58
$$ 419 203 -193 -450 -453 19 259 348 62 -218 -462 -77 166 362 367 -105 -382 -342 -83 379 351 65 -193
6042a93j51R3L55L95j5n85l11n3M92M01j6q3n84k68K20M88M03k09k53o03m0M16
$$ -193 -344 -251 104 499 484 -101 -412 -465 27 428 412 329 -255 -523 -303 185 588 379 126 -477 -517 -101
6064a01N03K30k94o17k31K36K02N46J52n61o87K4L81N66J57j81n16m63J21N63
$$ -101 402 632 338 -279 -510 -274 -72 474 626 65 -622 -598 -217 349 506 325 -191 -654 -533 30
6084C0N24j24l76n04j85K60O23L63j41p09m46J70N56M15J44m16n68m66M55O87
$$ 30 554 430 54 -450 -635 -375 248 611 470 -239 -685 -515 41 456 600 184 -384 -850 -395 292
6104B92L29k91m64n72j29P89O08J63m87o21j56J52N85N09l21n09m87j1M13Q18
$$ 292 621 330 -134 -706 -835 -46 562 725 238 -383 -539 -387 198 707 386 -123 -610 -621 -208 610
6124F10J55m30p47m28M49N84N48q7o41n83j34N13O79K87l85p36k89J51P15O59
$$ 610 765 335 -412 -840 -391 193 741 654 13 -570 -704 -191 488 775 390 -346 -635 -484 231 890
6144H90k77q46n33J71L62O54M74m19q75m84L20Q58L86j74l47o38l32N03Q68K57
$$ 890 613 -233 -766 -595 -233 421 895 476 -399 -883 -563 295 681 507 160 -478 -810 -307 561 818
6164H18n88n89k23J07M69O92J23o24q61q2M52P11J66q5n49p02N6Q20O52r5m82
$$ 818 230 -359 -582 -475 -6 686 809 185 -676 -758 -306 405 571 486 -63 -765 -709 111 763 668 186
6185A86n92j79J00Q27M92k63o82o01J23N11P35O2m85p83l33M89Q50L90l32p65
$$ 186 -406 -585 -485 342 834 571 -111 -712 -589 -78 657 719 234 -549 -882 -393 457 847 515 -250
6205b50m81J70L83P78K33m03j016k51M16P50L72j84m16o95p8M73P92K37o34o14
$$ -250 -731 -561 -178 600 833 430 -586 -837 -421 329 701 517 101 -594 -672 -199 593 830 196 -418
6225d18m34L51O10O08qq43n02k8O37N78L6l59m10n87J64R00O02k28q16m11mJ76
$$ -418 -852 -501 109 717 709 -134 -636 -664 -27 551 587 228 -182 -769 -605 295 897 669 -147 -558 -562 -386
6247c86O56L91k87p63m92L75O58J53J92l16o80k57M63P76J29m10n64r3K9M36L96
$$ -386 270 661 374 -389 -881 -506 152 305 497 181 -499 -756 -293 483 612 202 -362 -455 -426 10 406
6268D06K84n89o94K3M59M24J76j71n24l76n3O68N37P9n25o82J01K61L65M41j48
$$ 406 690 101 -593 -570 -111 313 489 318 -206 -582 -635 33 570 649 124 -558 -457 -196 169 610 462
6289D62n61n93J49N18N30n8l33m29k66J28P13L96k54n65k79K9K64M27J75q1p64
$$ 462 -99 -692 -543 -25 505 447 114 -315 -581 -453 260 656 402 -163 -442 -413 -149 278 453 372 -392
6310c92l01L78P08Qq6k17m87j48L91N70J69n05l35j9N2J64L68L16m78p29J57L53
$$ -392 -693 -315 393 401 315 98 -389 -537 -146 424 593 88 -247 -266 -214 -50 318 634 156 -573 -416 -63
6332f3L24J9j3k05n22RN42L90j84k81k05j47J70J53M72j16n55l02L04K83J37N8
$$ -63 261 280 267 62 -460 -451 91 481 297 16 -189 -336 -166 -13 459 343 -212 -514 -210 73 210 268
6354B68r6l87n5R0L09K29k15l06o0O2P2J72K03j59l44j10K09P0J25j2Mj51l53
$$ 268 172 -215 -270 -180 129 358 143 -163 -223 -161 -89 83 286 127 -217 -327 -118 -48 77 65 69 -82 -435
6377d35L00L64Q2l14j64M2j18J93J30K98k32m13Q3J52P3k4J31O1l76l7J35L45
$$ -435 -135 229 311 -3 -167 -125 -243 -50 80 378 146 -267 -184 -32 41 17 148 209 -167 -204 -69 276
6399B76k9l39N2P7j90p7M34P8k59j19m3J54q4N3J06J48l89j39L21Q3j50M2J38
$$ 276 247 -92 -40 37 -153 -230 204 282 23 -96 -139 15 -69 -16 90 238 -151 -290 31 114 -36 6 144
6422A44k15l4P0K34J45l02p6Rj5l6J21J86j30k95N1J96pM5J81k73k14QK67K50
$$ 144 -71 -105 -35 199 344 42 -34 -25 -40 -76 45 231 101 -194 -143 53 46 91 272 -1 -215 -207 60 310
6446C10j64rj56N5j45M7K77J56k70l87J42K49j8L9J99k32l64j21L33L32p6j76
$$ 310 146 137 -19 36 -109 -62 215 371 101 -286 -144 105 87 126 325 93 -271 -392 -59 273 197 21
6468B1o1j23j60J50N18k8m11j38QK4J23J86J56k67l69J35J76K92M1j50j12k59
$$ 21 -40 -163 -323 -173 345 317 -94 -232 -224 -200 -77 109 265 -2 -371 -236 -60 232 273 123 11 -248
6490b48n5M18L19j45m25j44K2J45K45K02j12l86l15K10M57J32J3j87l65j44K99
$$ -248 -303 115 434 289 -136 -280 -258 -113 132 334 222 -164 -479 -269 188 320 333 146 -219 -363 -64
6511f4L13K33l31m13q6J32J93L89K2l45l39j77K41L34K95k19j97m03M1K21M50
$$ -64 249 482 151 -262 -348 -216 -23 366 388 43 -296 -473 -232 102 397 178 -19 -422 -381 -160 290
6532B90K13l66m54l8J53L54K08p0m23m44K34L15L42N3j49l92k83R2N69K68pn01
$$ 290 503 137 -317 -355 -202 152 360 290 -133 -577 -343 -28 314 367 218 -174 -457 -365 204 472 465 -36
6554c6k78r8M01K26K69o5o61k87L28L14K65jk46m95j15K31O52J55l30l81l20P9
$$ -36 -314 -412 -11 215 484 419 -242 -529 -201 113 378 377 131 -364 -479 -248 404 559 229 -152 -472 -393
6576c93L80N56J8m65n05k15O03K49L91j91n53l44k4M77O23L6m69m79k89K98N20
$$ -393 -13 543 561 96 -409 -624 -21 228 619 428 -125 -469 -493 -16 607 643 174 -305 -594 -296 224
6597B24N28k55n10o43K30L56O20j17l10n01k88J46P19M65n1p97l71MM10O01J36
$$ 224 752 497 -13 -656 -426 -70 550 433 123 -378 -666 -520 199 664 613 -184 -555 -551 -141 460 596
6618E96j33o95n34K98O91L37p2l80n96k00M83N68K65m33m87k57J2O55O14j20m94
$$ 596 463 -232 -766 -468 223 560 488 108 -488 -688 -205 363 628 195 -292 -549 -537 118 732 612 118
6639A18p30j24O25M92J94k42n66n22K44N87O58j49m95o43o2L69N12N69m28o11
$$ 118 -612 -736 -111 381 575 333 -233 -755 -511 76 734 585 90 -553 -615 -246 266 835 407 -204
6659b04m66k3P30N52O8m56p18j79K89P22M47l65m99n35J57K86P74N8l21p62l31
$$ -204 -670 -693 37 589 657 201 -517 -696 -407 315 762 397 -102 -637 -480 -194 580 638 317 -445 -776
6680g76M04P81K80j58n36o29n4N18P01J75m61n61m15M14M93N42n4o68o37j4O57
$$ -776 -372 409 689 531 -5 -634 -688 -170 531 706 245 -316 -731 -317 176 718 664 -4 -641 -655 2
6701BN48K17m51n12m54K29O21O80m55n77m92O4M67M97L55m04o87k75K71N44L70
$$ 2 550 767 316 -196 -650 -421 200 880 425 -152 -644 -580 -113 384 739 335 -352 -627 -356 188 558
6722E58Jn48o17j90O75O18K44l72p05l83J87O92L93N3n39n59j03L65O35K02k91
$$ 558 559 11 -606 -796 -121 497 741 369 -336 -719 -532 160 553 606 67 -492 -595 -230 405 607 316
6743C16n86m01J7P33M42M2m70n26o1L51M39J78m6n68m86J88N21N02p9m16m72k77
$$ 316 -270 -671 -654 79 521 563 93 -433 -494 -143 296 474 428 -140 -626 -438 83 585 506 90 -382 -659
6765f59K99M56O13k39o85l64K16M86K90J41m70n27m2K29M45L25q6m50m38j07N77
$$ -659 -360 96 709 470 -215 -579 -363 123 413 554 84 -443 -485 -256 189 514 428 -22 -460 -567 10
6786A0M72Q4m67o19NK95K66L87K7n48l12q2N04L99J40k38n46l03L36R3N92j78
$$ 10 482 566 99 -520 -515 -220 46 433 460 -88 -400 -482 22 421 561 323 -223 -526 -190 -97 495 317
6808C17l54k18j10K20N14J97l91m87r6J30L97J78m3k57k17j07K15K80K83l17k58
$$ 317 -37 -255 -365 -145 369 566 175 -312 -408 -278 119 297 254 -3 -220 -327 -112 168 451 134 -124
6829a24k68R5M08P6Q3j43k55k57L33K10J71j68j74j33p0K48K10j6j43j85j71K03
$$ -124 -392 -297 111 187 270 127 -128 -385 -52 158 329 161 -13 -146 -216 32 242 226 83 -102 -273 -70
6851g0J71J80%l08k23o1M43J19p8j01j21k25O9K68J99m5j24l25J45r3J22L82j9
$$ -70 101 281 281 -27 -250 -311 132 251 173 72 -49 -274 -205 63 262 217 93 -232 -87 -180 -58 324 305
6874C05n13O4R1KQ8Q5L5j92j62K8K89k2n1q3n5R3m4N1O5j01P6p2j9p3N9K32m2
$$ 305 -208 -144 -53 -51 37 122 157 -35 -197 -169 120 98 47 -36 -91 2 -42 9 74 -27 49 -23 -42 -115 -56 176 134
6901A34j76p9mJ26RM3j4Qp9k14K59J82j05r1l1j11M8J07J51P5k47k29J22K7N2
$$ 134 -42 -121 -125 1 10 53 39 47 -32 -246 13 195 90 -1 -32 -143 -95 12 163 238 -9 -238 -116 -89 -37
6926c7J28pj22j48O0J88J36q0j03l8j35k3K74J68k0l12k50J71J63l3L30p1l47
$$ -37 91 84 -38 -186 -126 62 198 118 15 -23 -158 -181 93 261 241 -71 -321 -150 13 -20 310 239 -108
6949a08k86J59M65o9Jm7k75q2N5L98J37k20l34qP9J17K04J44q4m88k32L58M11
$$ -108 -394 -235 230 161 162 115 -160 -242 -187 211 348 128 -206 -214 -135 -18 186 330 246 -242 -474 -116 295
6972B95p4q1k70q3j5J18L92J46m41j79p4K04J55J47J03k75l88mM03K49O3k89j95
$$ 295 221 140 -130 -213 -228 -110 282 428 -13 -192 -266 -62 93 240 343 68 -320 -324 79 328 391 102 -93
6995i3k54o4N20L01j45n12m1j14J86L45J08K7m17m45L10L98K75j38l27k63j76
$$ -93 -347 -411 109 410 265 -247 -288 -402 -216 129 237 264 -153 -598 -288 110 385 247 -80 -343 -519
7016e19L31M97K87m58m15j73K03Q8M22K17l43m39k84M68M05L6k37k39k56r0L54
$$ -519 -188 309 596 138 -277 -450 -247 -159 263 480 137 -302 -586 -118 287 323 86 -153 -409 -499 -145
7037a45N39Q5m27m86KJ40M84K07rm64m70Q1M83L00P3j40l74k89K7N08L82q7n91
$$ -145 394 479 52 -434 -432 -292 192 399 390 -74 -544 -463 20 320 393 253 -121 -410 -383 125 507 420 -171
7060a71k61J82J13L29L63l76l83l28J70O45J49j14k35m53j86K59O87J69m57m09
$$ -171 -432 -250 -137 192 555 179 -204 -532 -362 283 432 318 83 -370 -556 -297 390 559 102 -307
7080c07k45K46L78K84K17m68n77k33N87N34n4m2n58k47K31K87M46M2m35l83k34
$$ -307 -552 -306 72 356 573 105 -472 -705 -118 416 362 320 -238 -485 -254 33 479 521 86 -297 -531
7101e31K94M59M01j61n78l88Q2N19M29j26l00l89l31J91O67N80m16n09l75J19
$$ -531 -237 222 623 462 -116 -504 -422 97 526 400 100 -289 -620 -429 238 818 402 -107 -482 -363
7121c63K48M65K40k75p63j53K74O44J69j53k26n21q6K60O68K17m45o03K3P9M31
$$ -363 -115 350 590 315 -448 -601 -327 317 486 333 107 -414 -500 -240 428 645 200 -403 -380 -301 130
7142A30M01m8m24n84J0M17M53P3k38m19m08K31M09O33j83n63k58j41K87M86J69
$$ 130 531 483 59 -525 -515 -98 355 428 190 -229 -637 -406 3 636 453 -110 -368 -509 -222 264 433
7163D33n7p58k15J48N74M33j04m04m08l23M16N14L43j57n95l91K30M21L31J73
$$ 433 376 -382 -597 -449 125 558 454 50 -358 -681 -265 249 592 435 -160 -551 -321 100 431 604
7183F04n30m35k67L70N67J94k41k40l85k24N02O05K16o93k87j14J12M14L15k2
$$ 604 74 -361 -628 -258 309 503 262 22 -363 -587 -85 520 736 43 -244 -358 -246 168 483 461
7203D61n51m64O8L53M97K22l92m42k49R1M12N30j05n75k46n8M83K61K84j94o15
$$ 461 -90 -554 -486 -133 364 586 194 -248 -497 -406 6 536 431 -144 -390 -448 35 296 580 386 -229
7224b29k52K30M15K61P6m08m41p9L86M28O8k42m28k36K02L68K32K35m97n64k6
$$ -229 -481 -251 164 425 501 93 -348 -427 -41 387 455 213 -215 -451 -249 119 351 586 89 -475 -501
7245e01N19L80m1p4l21m88J51M34M12p3l66m38M2J26L40K76j0n80k31J83L87K30
$$ -501 18 398 357 283 -38 -526 -375 59 471 398 32 -406 -364 -238 102 378 368 -212 -443 -260 127 357
7267C57p1j27m06j49R1N70J14j93k83k59J10L22J9O9R2m39k39J32M57J14j03j06
$$ 357 286 159 -247 -396 -305 265 379 186 -97 -356 -246 76 95 164 256 -183 -422 -290 167 281 178 72
7289G2k94m8K62K37O1j23k12k67J76J67K02P5l05l23O9J26M40m4j79k39k7n5L32
$$ 72 -222 -270 -8 229 290 167 -45 -312 -136 31 233 308 3 -320 -251 -125 315 271 92 -147 -174 -229 103
7312A03J65j04k36k08P5J62K44j2j7k69j15O2L59k6lj92p7k39J11L94P0j20k70
$$ 103 268 164 -72 -280 -205 -43 201 189 172 -97 -212 -150 209 183 180 -12 -89 -328 -217 177 247 127 -143
7335a43r4O6P9J66N3J2j92j55Q3J98J36j97j1j64P3k3J86J70k54j57J29r7P9K69
$$ -143 -237 -171 -92 74 127 139 -53 -208 -125 73 209 12 1 -163 -90 -113 73 243 -11 -168 -39 -136 -57 212
7359B12L6r0k52J06J26m2L3j28J16q8j2j11J32J39j24j2j53Q4q2R8K3J22j63K2
$$ 212 248 158 -94 12 138 96 129 1 117 29 17 -94 38 177 53 41 -112 -28 -110 -12 11 133 -30 -8
7383ho5R6M4P4j36m5j13Q4J32r7K2P7q7j25QJ77N4L1p9k00j59L82l1O3k7p0k29
$$ -8 -73 23 67 141 5 -40 -153 -69 63 -34 -12 65 -22 -147 -139 38 92 123 44 -156 -315 67 36 99 72 2 -227
7410b27J25Q6J66J7r4j20j57J3K69O0r3o5n3j35J2L32O8j43k59k5K7K71J4J25
$$ -227 -102 -16 150 167 73 -47 -204 -191 78 138 45 -20 -73 -208 -196 136 204 61 -198 -223 -196 75 89 214
7434B14k54k02K0K10J36J23m5k83k45q1N33R1J56m63j88JK04J99J38n7k54k04
$$ 214 -40 -242 -222 -12 124 247 202 -81 -326 -407 126 217 373 -90 -278 -277 -73 126 264 207 -47 -251
7456b51j9J73J66L12l10l78M7J86K73NK14n66l61K53K80K15k5j33l23p4J58K81
$$ -251 -270 -97 69 381 71 -307 -260 -74 199 204 418 -148 -509 -256 24 239 214 81 -242 -316 -158 123
7478A23L22k05k47k26m0K09L95R5k46l70j82K84J60K60n2k70l34j5K84K94J78
$$ 123 445 240 -7 -233 -273 -64 331 426 180 -190 -372 -88 72 332 280 10 -324 -339 -55 239 417
7499D17m22j74k93J56M19K27j9m35j38j04K48K57K43m2o04k51K63K44L90K0m53
$$ 417 -5 -179 -472 -316 103 330 311 -124 -262 -366 -118 139 382 340 -264 -515 -252 -8 382 402 -51
7520e1k30l48M17N25J64k33m68k12N0M46L47j1k57n49J04K4M98K85l10l19k03
$$ -51 -281 -629 -212 313 477 244 -224 -436 -386 60 407 396 139 -410 -306 -282 216 501 191 -128 -331
7541c31J5L29K94K52m32m69q5L13L07P5L8l39l04j27N95L29j30k89j68k89J70
$$ -331 -316 13 307 559 127 -342 -427 -114 193 268 306 -33 -337 -464 131 460 330 41 -127 -416 -246
7562b46J86N10r1n85j41q4L48M60J79m01n55j07J85M61L34j82l73l35lK81M41
$$ -246 -60 450 359 -226 -367 -451 -103 357 536 135 -420 -527 -342 119 453 271 -102 -437 -440 -159 282
7583B82J90l72m06r5Q8M52K05L6m29l56j46L36N10J22j87l61l35J59K91L22J26
$$ 282 472 100 -306 -401 -313 139 344 380 -49 -405 -551 -215 295 417 230 -131 -466 -307 -16 306 432
7604D32m35l26j59K13M54K76j73l60k84NM18K75k9l09k72j40K87L76J69p8m54
$$ 432 -3 -329 -488 -275 179 455 282 -78 -362 -357 61 336 307 -2 -274 -414 -127 249 418 340 -114
7625a14k69P8L70J96J48k96j97l16J77M49K58l17k68k58J85O4O02R8m70m29r4
$$ -114 -383 -305 65 261 409 113 -84 -400 -223 226 484 167 -101 -359 -174 -110 492 590 120 -309 -403
7646d03K20L44J49J00l14m48j2K91L78l9j51k85k24j12N56K78J16m41l22m7J81
$$ -403 -183 161 310 410 96 -352 -364 -73 305 266 115 -170 -394 -506 50 328 444 3 -319 -366 -185
7667a85L34K06j69l10k43kN21K17p8j99l12j63J28M28L08l92k54j77j01L56M05
$$ -185 149 355 186 -124 -367 -369 152 369 291 92 -220 -383 -255 173 481 89 -165 -342 -443 -87 318
7688C18J81l03n08L6J51L22K66l21j41k84m6K52L85O4k04m16p4J45K65K09j23
$$ 318 499 196 -312 -276 -125 197 463 142 1 -283 -329 -77 308 372 168 -248 -322 -177 88 297 174
7709A74j81l63L2K46M19N0l01k52j60J40K03L10Ok30l41m4J62L05J92j14k69l77
$$ 174 -7 -370 -338 -92 327 377 76 -176 -336 -196 7 317 323 93 -248 -292 -130 175 367 253 -16 -393
7731c93K38L25K88k47j54l44o6J77K92K72k45l55j7O9J91K31M4j35m30j33L51
$$ -393 -155 170 458 211 57 -287 -353 -176 116 388 143 -212 -229 -160 31 262 306 171 -259 -392 -41
7752d1K22qpk05j60j29K70L43J0k99k03o1J19J82J31j1j63k35NL08K04n6k61l7
$$ -41 181 173 166 -39 -199 -328 -58 285 295 -4 -207 -268 -149 33 164 153 -10 -245 -240 68 272 216 -45 -82
7776h2j10P2J57K43j55j88j88K0J79J85K19k47j59j38J45J59Q4r8q2q9m8O5P7
$$ -82 -192 -120 37 280 125 -63 -251 -231 -52 133 352 105 -54 -192 -47 112 196 98 16 -73 -121 -56 21
7799B1J08j27r2j4m4J73L9K7j29q3o0J68K15j04k5j33Pr3m0K50J15k01j16O5L
$$ 21 129 2 -90 -104 -148 25 64 91 -38 -121 -181 -13 202 98 73 -60 -53 -146 -186 64 179 -22 -138 -73 -70
7824g0J18L8N4q0j12L5M3M0j5l0Mn7j95K04J27Mj32n6OK1L9lJ76j49p9N0j3LJ62
$$ -70 48 86 140 60 -52 -17 26 66 51 21 25 -32 -227 -23 104 108 -24 -80 -74 -53 -14 -17 159 10 -69 -19 -32 -29 133
7853A33r0q6M3p3K2NJ19n1N2j21O0k5J68j07j5j29n8P4J72j9M1J1k08m2J17rO7
$$ 133 43 -43 0 -73 -51 -46 73 22 74 -47 13 -12 156 49 34 -95 -153 -79 93 74 115 126 -82 -124 -7 -16 51
7880E1J04j16j5p3k5Q3J09j05l7o7J23M5m9J65j21j27J2R2N5k2O4r2j57j05K15
$$ 51 155 39 24 -49 -74 9 118 13 -24 -91 32 77 28 193 72 -55 -43 49 104 82 146 54 -103 -208 7
7905GJ58p9Nj44o3M4O0J05j0q2n5j68J92J43M6K7k38j22K4J42K61r3j13j69l2
$$ 7 165 86 91 -53 -116 -72 -12 93 83 1 -54 -222 -30 113 159 186 -52 -174 -150 -8 253 160 47 -122 -154
7930a54P1O7K71r3j93j50n5L29O9k5L0k23k09K05K85l1Qj72k82j3J28K36J18k09
$$ -154 -83 -16 255 162 -31 -181 -236 93 162 137 167 -56 -265 -60 225 194 202 30 -252 -265 -137 99 217 8
7954Hl39K6J3L92J61n8k07l42K1J88L40p6P8l27j65J33J80K18k05k9k87L8J59
$$ 8 -331 -305 -292 100 261 203 -4 -346 -325 -137 203 127 205 -122 -287 -154 26 244 39 10 -277 -239 -80
7977h0M13J4k17l77l5j2K91J56J38j09m19M7K8L34J93j70k47l18J52K48K32j10
$$ -80 333 347 130 -247 -282 -294 -3 153 291 182 -237 -190 -162 172 365 195 -52 -370 -218 30 262 152
7999A52l1k78k65K87L39J36q6l20j23j03K12L23N0k44l04p7J43L36K19m8m14k32
$$ 152 121 -157 -422 -135 204 340 254 -66 -189 -292 -80 243 293 49 -255 -332 -189 147 366 318 -96 -328
8021c28o2M20J90K27k84l57j03J00K45L71j30k88k53n5J78M50j44P1l55k06J24
$$ -328 -390 30 220 447 163 -194 -297 -197 48 419 289 1 -252 -307 -129 321 177 248 -107 -313 -189
8042a89K32K98n9k29k70p4J38L50J16o8m04k29J05M16J90L1k78m47J08J78L42
$$ -189 43 341 282 53 -217 -291 -153 197 313 245 -159 -388 -283 133 323 354 76 -371 -263 -85 257
8063B57L3q3k73l03P3K96K76Q6l31j41j11N0L30M8J31m92j85rK99L38L0l17k21
$$ 257 290 207 -66 -369 -296 0 276 362 31 -110 -221 -171 159 207 338 -154 -339 -348 -49 289 319 2 -219
8086b19j02M5L19K85j82j72j28j16K96K25L1j85l64j11J80L21K57j74k43j90m5
$$ -219 -321 -276 43 328 146 -26 -154 -270 26 251 282 97 -267 -378 -198 123 380 206 -37 -227 -272
8107b72J63M17Q9l13l51p3O0M14J64m2k52j80k40L87L40p0j41k27r7m6K38L21
$$ -272 -109 308 397 84 -267 -340 -280 134 298 256 4 -176 -416 -29 311 241 100 -127 -224 -270 -32 289
8129B89J04k97l27L9J67J88J78j50k68l95J27L89K10O8l02k12k8J13L30N9p0k78
$$ 289 393 96 -231 -192 -25 163 341 191 -77 -472 -345 44 254 322 20 -192 -220 -107 223 282 212 -66
8151f6k62J19K54K85j4k39j89k30P2N34J6K3m72p6L9Q4M16K1j91l82L9K8K72J14
$$ -66 -328 -209 45 330 316 77 -112 -342 -270 264 280 303 -169 -245 -206 -122 294 315 124 -258 -219 -191 81 195
8175A95l1j57j26j73K71L19j07ol13l20L32K19R5R0l15k45
$$ 195 164 7 -119 -292 -21 298 191 185 -128 -448 -116 103 198 288 -27 -272
8191b72
$$ Imaginary data points
##PAGE= N=2
##DATA TABLE= (X++(I..I)), XYDATA
0@%%%%%QqpRk%qJ6qMj2J6j6J3j5K2k4K3k5K8k9L1l1L2l8L8l7M2m6M6m5M8n4N8
$$ 0 0 0 0 0 0 8 0 -7 2 0 0 -8 8 0 4 -8 8 -8 5 -10 12 -12 11 -14 14 -15 16 -15 17 -21 17 -20 22 -24 22 -23 25 -29 29
39B9n9O3p1P8q6R7j11J36j68K05k61L41m53O21q72J269j935L118n463J0983k8564
$$ 29 -30 33 -38 40 -46 51 -60 76 -92 113 -148 193 -260 361 -511 758 -1177 1941 -3522 7461 -21103
60b1103J70985R15070n65359j046301M30391M53953p19651k26518J092173L87554
$$ -21103 149882 1064952 499593 -546708 -116317 337636 -382015 -608533 483640 871194
70H71194j072467n62918O75004L29054l56180J89403N07235l92453p29572J82881
$$ 871194 -201273 -764191 -89187 239867 -116313 73090 580325 187872 -541700 -358819
80c58819N60482o4067j95120K01566m1949m25039P1759N39332L5384m03476k0009
$$ -358819 201663 137596 -57524 144042 102093 -322946 -251187 288145 323529 -79947 -99956
91i9956J78769j86458j17444L53543J56148l93224j97349L16607J84904j28271
$$ -99956 78813 -107645 -225089 128454 284602 -108622 -305971 10636 195540 67269
101F7269J5300N6814k65899k03913K63159K80088p4360r1665j3829k26501j34034
$$ 67269 82569 139383 -126516 -330429 -67270 212818 138458 46793 32964 -193537 -327571
112c27571M01249L84964k57454l66108O5972r184k57973K53253O58185r0345p55446
$$ -327571 73678 458642 201188 -164920 -98948 -108132 -366105 -112852 545333 454988 -300458
123c00458j25339M97617J6877k55114L67088L42964o27100o37897M76332O53963
$$ -300458 -425797 71820 88697 -166417 200671 543635 -83465 -721362 -245030 408933
133D08933k28500k87834L32541j163o56196m9668P87440K14791o17505j86683
$$ 408933 180433 -107401 225140 223977 -432219 -481887 305553 520344 -97161 -283844
143b83844L71203r8230l45847L61992N29237l38441n86622J81154L97866j67949
$$ -283844 87359 -10871 -356718 5274 534511 196070 -390552 -209398 188468 20519
153B0519j73572L00860P8979m33557j23308M27510J81617k66025r1951J29950
$$ 20519 -153053 147807 226786 -206771 -330079 97431 279048 13023 -78928 51022
163E1022r7516j43176K04270K13685j72525k17367O8265R5084j7631R6740J17663
$$ 51022 -46494 -189670 14600 228285 55760 -161607 -93342 1742 -15889 80851 198514
174A98514j64221k41402N6410J86944K9025J531M8990j25120k07649P9846K60458
$$ 198514 34293 -207109 -150699 36245 65270 66801 115791 -9329 -216978 -137132 123326
185A23326M0778j10096j2473p2290j98355N5629L37401Q1029k56870q8705J08179
$$ 123326 164104 54008 41535 -30755 -229110 -173481 163920 244949 -11921 -100626 7553
196G553q8533r3882K84357K36089l05297l36404J81751K25469j54090l0941L07032
$$ 7553 -80980 -174862 109495 345584 40287 -296117 -114366 111103 -42987 -73928 233104
207B33104k0711m52548o0546M37466J01158l13886R59K41865j71259l02784K41790
$$ 233104 212393 -240155 -300701 136765 237923 -75963 -75004 166861 -4398 -307182 -65392
218f5392L80621j82529l31869J38364J95385j94760r9315K91774R1551l30302
$$ -65392 315229 132700 -199169 -60805 134580 -60180 -159495 132279 223830 -106472
228a06472j18501K74817Q8309j93632J5111J74812j07065k06657J25230K13529
$$ -106472 -224973 49844 138153 -55479 -40368 134444 27379 -179278 -54048 159481
238A59481r6288j59886P8918O9193j11840n176J68362Q141j74479l1894J12007
$$ 159481 63193 -96693 -17775 51418 -60422 -65598 102764 110905 -63574 -95468 16539
249A6539N328m6349O4516L2003j14870n6972J00196N7644m3821N621K1223q4451
$$ 16539 21867 -24482 40034 72037 -42833 -99805 391 58035 14214 19835 41058 -43393
261d3393n5594J02556P6703p0111l3985N7378l9034r1570Q0115J32649p4451j26852
$$ -43393 -98987 3569 80272 10161 -23824 33554 -5480 -97050 -16935 115714 41263 -85589
273h5589O8398P6945j06494l9635J61735L9144j84023l9290J71162R276j58159
$$ -85589 -17191 59754 -46740 -86375 75360 114504 -69519 -108809 62353 71629 -86530
284h6530L9559J63876p7188j72559R2977J60135j06863j30547J31772J05514j53835
$$ -86530 -46971 116905 39717 -132842 -39865 120270 13407 -117140 14632 120146 -33689
295c3689q5800J60909N8712j61292k4146J65392l418j66133J9479J49816l6522
$$ -33689 -119489 41420 100132 -61160 -85306 80086 76668 -89465 -69986 79830 43308
306D3308j20591O5886R9502r5060r3894J02150Q4768q7032n1165P8200O540r1636
$$ 43308 -77283 -11397 88105 -6955 -100849 1301 86069 -963 -52128 26072 32612 -59024
318e9024J7325J06845j2096r3465N453N2775k5056j9068O2709K0144p7120l6722
$$ -59024 -41699 65146 53050 -40415 -34962 17813 -7243 -26311 36398 56542 -20578 -57300
330e7300N0032K5361j3819K0638J0537o0124l6138N6300M7656k1920j1885P824
$$ -57300 -7268 18093 4274 24912 35449 -24675 -60813 -4513 43143 21223 9338 17162
342A7162m4869m0468O4868P8578l4990o7270Q907J1096l4496K9348R3277j1491
$$ 17162 -27707 -68175 -3307 75271 40281 -26989 -18082 -6986 -41482 -12134 81143 69652
354F9652j17503l1376P5256K5641k0950M1073K7014r6648q2989P9177J07939k1645
$$ 69652 -47851 -79227 -3971 21670 720 41793 68807 -27841 -110830 -31653 76286 54641
366E4641n7088P949j7828o7042K9850J26898K7400j06921o4594K9346J7668O867
$$ 54641 -2447 5502 -12326 -79368 -49518 77380 104780 -2141 -66735 -37389 -19721 -12854
378a2854O4108M0110q4845j02767K3617Q9539L3839n119n710m9741p5747J0705
$$ -12854 51254 91364 6519 -96248 -72631 16908 50747 45628 39918 -9823 -85570 -74865
390g4865J04235O2211m1736o7910l3676q315K7811P4164N0342m6305r6843m0070
$$ -74865 29370 91581 49845 -18065 -51741 -60056 -32245 41919 92261 45956 -50887 -90957
402i0957M3887P2321M4758p307n7859p0670k0637N7716Q9229L5808n5056r2059
$$ -90957 -47070 25251 70009 62702 4843 -65827 -86464 -28748 60481 96289 41233 -50826
414e0826m1471L7146P2219N6143O697o1433r4504l2577P7444J04856K3318n9571
$$ -50826 -92297 -55151 17068 73211 79908 18475 -76029 -108606 -31162 73694 97012 37441
426C7441p2966m6094J444P1718R8817J7562r4810j01218p425O7414P3444M2144
$$ 37441 -35525 -81619 -80175 -8457 90360 107922 13112 -88106 -95531 -28117 45327 87471
438H7471j6895q6066q8125R102J01764Q5833m763p0405p7086l6266L9118R8148
$$ 87471 70576 -15490 -103615 -94513 7251 93084 88321 17916 -59170 -95436 -56318 41830
450D1830O7751l7288j03758o5438K1625P5516P3685K2734n8953j04950m8059O6240
$$ 41830 109581 72293 -31465 -96903 -75278 238 73923 96657 37704 -67246 -115305 -49065
462d9065J10405M3226m5641p9300o3108r602P3245J11139L0416r4818j12300j5702
$$ -49065 61340 104566 58925 -20375 -83483 -93085 -19840 91299 121715 26897 -85403 -101105
474a01105O5874P4152N0798Mq6834j14754n802J20760J03837j1505p4412o7423
$$ -101105 -35231 38921 89719 89723 2889 -111865 -117667 3093 106930 95425 21013 -46410
486d6410m6981J1381J04042J06257k5879j29935q0918K6446P1098P0003M6053
$$ -46410 -93391 -82010 22032 128289 102410 -27525 -108443 -81997 -10899 59104 105157
497A05157l6316j20126p8028N8420J18047N3381k6940o6964q1254l7496P0936
$$ 105157 68841 -51285 -129313 -70893 47154 100535 73595 6631 -74623 -112119 -41183
508d1183J23696L6766q0715r5206l3560K5291P2012Q6509J1895j01131j09562
$$ -41183 82513 119279 38564 -56642 -90202 -64911 7101 93610 105505 4374 -105188
519a05188J413R1445Q1522K2391l7679q6060p6102J9737J10867Q7350k1482r5468
$$ -105188 -103775 -12330 69192 91583 53904 -32156 -108258 -88521 22346 109696 88214 -7254
531g254p8556p856O2740R0163M7356m3661j05184p2704L0989J06973P9929j7453
$$ -7254 -85810 -93666 -30926 59237 106593 62932 -42252 -114956 -83967 23006 102935 85482
543H5482q5567p6766j9251N0319R7604O6682m5458j22522o8147M6315R0158N7542
$$ 85482 -85 -76851 -96102 -45783 51821 118503 73045 -49477 -117624 -71309 18849 76391
555G6391R403n0309j01403n7743P0845J24822L6848o2327p3226m7246j4561O0705
$$ 76391 85794 35485 -65918 -123661 -52816 72006 108854 46527 -26699 -73945 -88506 -27801
567b7801J12522L2479r8676j02344J173N6919M9388M9149J3486q4980j09740J2697
$$ -27801 84721 117200 18524 -83820 -82647 -25728 23660 72809 86295 1315 -108425 -95728
579i5728J14874O3896k5834l8794m0466n7221M508J08832Q2489n8649j06472k4140
$$ -95728 19146 83042 57208 18414 -22052 -79273 -74765 34067 116556 57907 -48565 -72705
591g2705L2994K8604M9089N3454l9876j17842m0581Q5394Q3971K009l0549l5556
$$ -72705 -39711 -11107 37982 91436 51560 -66282 -106863 -21469 62502 64511 33962 -1594
603a594n9553k7782P5014J05485K926r0146o7791k162L1153N4154O0238k612q8314
$$ -1594 -61147 -88929 -13915 91570 94496 4350 -63441 -65603 -34450 19704 79942 77330 -10984
616a0984q2049J5207Q3418O3399N098m1900o6162m8322J9762Q2179O6894j5843
$$ -10984 -93033 -77826 5592 68991 74089 32189 -33973 -82295 -62533 19646 86540 70697
628G0697p8871o1824M235N0868N5286L0109j9304p0202o2557J8486Q1977M9552
$$ 70697 -8174 -69998 -65763 -14895 40391 70500 51196 -19006 -81563 -63077 18900 68452
640F8452k2837m5310l0824k1713J0303O6071N5904l7322q3357j9385M1531K5572
$$ 68452 45615 305 -30519 -52232 -41929 24142 80046 42724 -40633 -60018 -18487 7085
652G085R560K5427p955p1222l8071O4282P0178k0762m9195k795k097k7082K4398
$$ 7085 16645 42072 34117 -37105 -75176 -10894 59284 38522 -10673 -13468 -15565 -42647 -18249
665a8249P6585N005q7114m4070M9160L8504j0085J1538K0576n0928p0119L2823
$$ -18249 58336 63341 -23773 -67843 -18683 19821 9736 21274 41850 -9078 -79197 -46374
677d6374R3384J4823n5057k1207K431k9444k729P5704N1553o0465p8527Q606M1652
$$ -46374 47010 61833 6776 -14431 -12000 -41444 -44173 31531 83084 22619 -55908 -47302 -5650
690e650N061J4244M1227j6814q3333k9789O5641N3434j5471j9574J896k7788l8964
$$ -5650 -589 13655 54882 38068 -45265 -75054 -9413 44021 28550 8976 10872 -16916 -55880
703e5880K8955P2366J0451n5336k9856J4534L623n141K9149L2015k6772n2970
$$ -55880 -26925 45441 55892 556 -29300 -14766 -11143 -16284 12865 44880 18108 -34862
715c4862J90M2465J3459j8214n79J1525j7155k4975J7534L6909n647l4959j536
$$ -34862 -34672 7793 21252 3038 2459 13984 -3171 -28146 -10612 26297 20650 -14309 -15845
728a5845K7144K23k2123N986K2014j3108k8115J6167L7205j0611l9308J628K9451
$$ -15845 11299 11522 -10601 -4615 17399 4291 -23824 -7657 29548 18937 -20371 -18743 10708
741A0708l308j7742J8859K0718l1724l5613K5178M0138j1576k4234J4823Q127
$$ 10708 7400 -10342 8517 29235 -2489 -38102 -12924 27214 15638 -8596 6227 14354
753A4354l4929j2731M6367K7195l5808k6681K2557P295k8576N851M5276O67m7958
$$ 14354 -20575 -33306 13061 40256 4448 -22233 324 7619 -20957 -15106 30170 30837 -17121
766a7121r433L4594Q63k7602J5226L5874j8617m2952J0813L4933j1233k3920K3523
$$ -17121 -26554 8040 8903 -18699 -3473 32401 13784 -29168 -18355 16578 5345 -18575 4948
779D948K6513k9539l5292J9685L0132j2360j3394K2365Q861l6037k2066K9624
$$ 4948 31461 1922 -33370 -13685 16447 4087 -9307 13058 21919 -14118 -36184 -6560
791f560K9439j0490j4284P117m555k5283p07L6853K2313k1078k7331j782O462
$$ -6560 22879 12389 -1895 5222 667 -24616 -25323 11530 33843 12765 -14566 -16348 -9886
804i886n66J0896K3452R44l3318k4387J5116K7017M398o168J750p737k4184l601
$$ -9886 -10452 444 23896 24840 -8478 -32865 -17749 9268 13666 7498 9248 1511 -22673 -26274
818b6274L3044K3909j9601k5625M654R136q654M150K5697j48l5794j2577L0749
$$ -26274 6770 30679 11078 -14547 -9893 -757 -9411 -5261 20436 20288 -15506 -28083 2666
831B666J7203j8346p226J3910q982k3112J6845L8016r602m2081k322K8387J000
$$ 2666 19869 1523 -5703 8207 -775 -23887 -7042 30974 21372 -20709 -23031 5356 6356
844F356j0811J9516J2140l9056l2382L3237M3505r998k4421M070n358k9295R172
$$ 6356 -4455 15061 27201 -11855 -44237 -11000 32505 22507 -1914 2156 -3202 -32497 -23325
857b3325N5910J7269m7486l4324J3433J1907l33K5654K7318l0710n6097j194M4346
$$ -23325 32585 49854 2368 -31956 -18523 -6616 -6949 18705 46023 15313 -40784 -41978 2368
870B368K2354l976o72j3094l7479j2470M1399M1872p159l0982j8207q152J570
$$ 2368 24722 20746 20074 6980 -30499 -42969 -1570 40302 33143 2161 -16046 -24198 -22628
883b2628K6259L1573m243l5681k5097M311K1346K3327J0824j5274k9895j4050
$$ -22628 3631 35204 30961 -4720 -29817 -25506 -4160 19167 29991 14717 -15178 -29228
895b9228J2558K3756J8406j037k5533k7746L100K7964J9128n72r856k0354k3237
$$ -29228 -16670 7086 25492 24455 -1078 -28824 -25724 2240 21368 20796 10940 -9414 -32651
908c2651P177M0719K2723k2753k9801o240J589P199K9749K4475k6556m9178n203
$$ -32651 -25474 15245 37968 15215 -14586 -20826 -19237 -12038 17711 42186 15630 -33548 -38751
921c8751L2521J9611N492P822j6090m5796j2745M7249M0178j2734k5540r551j7242
$$ -38751 -6230 13381 18873 26695 10605 -35191 -47936 -687 39491 26757 1217 -8334 -25576
934b5576j1981L5631M9727r714n2767k0546J6363J1026J3128K8926m55n0220l4029
$$ -25576 -37557 -1926 47801 38087 -14680 -35226 -18863 -7837 5291 34217 33762 -16458 -50487
947e0487K8100M0553O885o525p197k7917k5843K2890M8120R571k9579k2993q619
$$ -50487 -22387 18166 25051 18526 11329 -16588 -42431 -19541 28579 38150 8571 -14422 -23041
960b3041k785K0613L8366O093l8839l2065M933J8654J8071K0320p54l8307l3024
$$ -23041 -25826 -5213 33153 39246 407 -31658 -26725 -8071 10000 30320 29566 -8741 -41765
973d1765J5977L7789J5444l823j1625k7117k4750J7692M5304J6312k3696k5477
$$ -41765 -25788 12001 27445 23622 11997 -15120 -39870 -22178 23126 39438 15742 -9735
985i735j2528m665J7968L7930J2036l3978l4460J68J6410J6782K1473N743l3477
$$ -9735 -22263 -26928 -8960 28970 41006 7028 -27432 -27264 -10854 5928 27401 33144 -333
998c33l7097R191L7064J6047n319p171j9441k7026O902M4208K3283k3345k9143
$$ -333 -37430 -28239 8825 24872 19553 12382 -7059 -34085 -27183 17025 40308 16963 -12180
1011a2180p270P07Q684K8547J9343k4083l9975o511K3478K0968J1947J650k2191
$$ -12180 -19450 -18743 -10059 18488 37831 13748 -26227 -32738 -9260 11708 23655 25305 3114
1024C114l2636k707L1213K6161J03j4837k1511k0099O122L4921K4220j2057k6576
$$ 3114 -29522 -32229 -1016 25145 25248 10411 -11100 -31199 -25077 9844 34064 22007 -4569
1037d569j5758m527J0622K9217K0410j8924l6087j0351J6168J7572J4348P736
$$ -4569 -20327 -24854 -14232 14985 35395 16471 -19616 -29967 -13799 3773 18121 25857
1049B5857j6632l3483r312K6397K6171K362j0580j5067j8822k438K6748K6348
$$ 25857 9225 -24258 -33570 -7173 18998 21360 10780 -4287 -23109 -25547 1201 27549
1061B7549n873k4773j4409k158O601K0768K0122j0330l1598j2673J4756J6656
$$ 27549 21676 -3097 -17506 -19664 -13063 7705 27827 17497 -14101 -26774 -12018 4638
1073D638R165N667r818k7816j2664K2478K7667J657j3771j1494j1669n969J7771
$$ 4638 13803 19470 9652 -18164 -30828 -8350 19317 20974 7203 -4291 -15960 -21929 -4158
1086d158K7852J505k5640j9114J779J0089J3213J4673o08k2860j9874N544K0277
$$ -4158 23694 25199 -441 -19555 -17776 -7687 5526 20199 19591 -3269 -23143 -17599 2678
1099B678J3481J016r855j8016j0742J0420K0701J0023o293j4218j4049l089J4892
$$ 2678 16159 17175 7320 -10696 -21438 -11018 9683 19706 13413 -805 -14854 -17943 -3051
1112c051J9431K368j4807j3610l970L906J3081J5186j357j9717j4601N128J2790
$$ -3051 16380 18748 3941 -9669 -13639 -9733 3348 18534 17177 -2540 -17141 -12013 777
1125G77Q530M638l813j6322j2601R030J9288O356p559q458q233n760P847J8299
$$ 777 9307 13945 10132 -6190 -18791 -9761 9527 15883 8324 -134 -8367 -14127 -6280 12019
1139A2019O067j3687j3967j107M748O658J0449L498j3217j5635J357J3064P713
$$ 12019 18086 4399 -9568 -10675 -5927 731 11180 14678 1461 -14174 -12817 247 7960
1152G960O95j925q014j1136J214J4915R360n648r327m600k001K516J0077Q270
$$ 7960 8655 6730 -1284 -12420 -11206 3709 13069 7421 -1906 -6506 -8507 -5991 4086 12356
1166A2356n965j2653m191N394O102M407J951m962j0014l168P544Q884J454m114
$$ 12356 6391 -6262 -10453 -5059 1043 5450 7401 2439 -7575 -10743 -3199 5685 7139 3025
1180C025n362m570k48O330P116J09o359o086j358M170O028L058k408n633l532
$$ 3025 -2337 -6907 -7155 -825 6291 6400 41 -6045 -7403 -3233 2795 5853 3445 -2188 -5720
1195e720M96M261M756J440m253n651j215L968M127J183j149k425l370j311L568
$$ -5720 -5224 -963 3793 5233 980 -4671 -5886 -1918 2209 3392 2243 -182 -3552 -4863 -1295
1210a295M988O1m063k700O90J565Q71J903Q84k497l845O74L780J608j840r34L91
$$ -1295 3693 3754 -309 -3009 -2319 -754 117 2020 2904 407 -3438 -2764 1016 2624 784 -150 241
1227B41j000q67K144K264j307k789N28J639l32m21J215J52j925j0J952J20j919
$$ 241 -759 -1626 518 2782 1475 -1314 -786 853 521 100 1315 1467 -458 -468 1484 1604 -315
1244c15L47J453r81j188J783J267k696j398L089K077l011j973K407P29k507N72
$$ -315 32 1485 504 -684 1099 2366 -330 -1728 1361 3438 427 -1546 861 1590 -917 -345
1260c45L535n50m667o27L698J413j274K3P0k510j590K678L318k79j984k321j860
$$ -345 3190 2640 -2027 -2654 1044 2457 1183 1206 1276 -1234 -2824 -146 3172 2893 909 -1412 -3272
1277c272J159M160K206k562k595p35j423K30N319M257m774p296Q27M497J75K29
$$ -3272 -2113 2047 4253 1691 -904 -1639 -3062 -2832 2487 6744 1970 -5326 -4499 -2 173 402
1293D02M432q92r501l442Q677O215l646l011J611l308n324M666J0229q12r166
$$ 402 4834 3942 -5559 -9001 -324 5891 2245 -766 845 -2463 -7787 -3121 7108 6296 -2870
1308b870k348L297n51N98O342K065q991o206N311N626q18J74J734n226p079M499
$$ -2870 -5218 -1921 -2472 -1874 4468 6533 -2458 -8664 -3353 2273 1455 1629 3363 -1863 -8942 -4443
1324d443J0051M4o549j300O30l554J286R090L229r151p327L459M826N50K602K523
$$ -4443 5608 5652 -897 -2197 -1567 -5121 -3835 5255 8484 -667 -7994 -4535 291 841 3443 5966
1340E966n882q735J439R389M750k248l677m257l626K172P562N032k304o141o021
$$ 5966 84 -8651 -7212 2177 6927 4679 1002 -3255 -6881 -4709 2853 7885 5581 -560 -6581
1355f581r39O452Q463M49o428m535j551r49M336R921J871j1031q802M696O361
$$ -6581 -7520 -1068 7395 7844 1416 -3119 -4670 -5619 -1283 8638 10509 -522 -9324 -4628 1733
1370A733K79K288M114o644j2162K025J3559L951o828k385O45n884k238J1115R019
$$ 1733 2012 4300 8414 1770 -10392 -8367 5192 9143 2315 -70 575 -5309 -7547 3568 12587
1385A2587p865j0979J734M198j316L568P587m227j3239j043J0847L902l195R69
$$ 12587 4722 -6257 -4523 -325 -1641 1927 9514 5287 -7952 -8995 1852 5754 2559 3528
1399C528j83r486m428J1945J0042o510q593J283K87l994N272J1857k098j4699
$$ 3528 3345 -6141 -10569 1376 11418 4908 -3685 -2402 -2115 -6109 -837 11020 8922 -5777
1413e777m761Q305M746m96L073P83r511p833O339J0871J940m348m208m774k572
$$ -5777 -10538 -2233 2513 2017 5090 5873 -3638 -11471 -5132 5739 7679 3331 -877 -5651 -8223
1428h223N537Q548J753n268n769m128J24Q004Q317k730q939l298J109N95M744
$$ -8223 -2686 5862 7615 2347 -3422 -7550 -7426 578 8895 6165 -2774 -6072 -4963 -4368 376
1443C76Q393j101j2568o045P656O261j050J359J897q072r110O531J2886j44q012
$$ 376 8769 7668 -4900 -10945 -3289 2972 1922 3281 5178 -2894 -12004 -5473 7413 7269 -743
1458g43j109L39n270J455J1996L427j1610o662N225K706j493N397N803r365j1733
$$ -743 -1852 -1513 -6783 -5328 6668 10095 -1515 -8177 -2952 -246 -1739 3658 9461 96 -11637
1473a1637N524J1852p81n127K811r51j0031m43J4598O377j0748p360L977L82l190
$$ -11637 -6113 5739 4958 -169 2642 1691 -8340 -8783 5815 12192 1444 -5916 -1939 -1557 -4747
1488d747O990R467o497j3552P0R140K647p27L279k086j0084l357R116P776j527
$$ -4747 2243 11710 5213 -8339 -8269 871 3518 2791 6070 3984 -6100 -9457 -341 7435 5908
1503E908l433k750m981j398P879P062k207o082k930j964M66P239O568m364q628
$$ 5908 2475 -275 -5256 -6654 1225 8287 6080 -2 -2932 -4896 -4430 2809 9377 5013 -3615
1518c615j214L021Q39L282N605l092j0625k079Q216M073j966Q94n8p684m088Q814
$$ -3615 -4829 -1808 -969 2313 7918 4826 -5799 -7878 338 4411 2445 3339 3281 -4403 -8491 323
1534C23Q058m619o015J426q41m437M868J0509k691j2056j473P440J07k272O282
$$ 323 8381 3762 -2253 -827 -1668 -6105 -1237 9272 6581 -5475 -6948 492 599 -1673 4609
1549D609K731j1168p871R569R418m675m004L673k435q912L201J3382R77j0961
$$ 4609 7340 -3828 -11699 -2130 7288 2613 -1391 2282 -153 -9065 -5864 7518 8495 -2466
1563b466l034M367j346j795P976N099q924q759M043O288q37P21L552m265q667
$$ -2466 -5500 -1133 -2479 -4274 3702 8801 -123 -8882 -4839 1449 612 1333 4885 620 -8047
1578h047J573R109K242l855r03q25m811j71Q229M420n459m627O71l97q1N156M112
$$ -8047 -6474 2635 4877 1022 119 -706 -5517 -5688 2541 6961 1502 -3125 -2454 -2851 -2932 2224 6336
1595F336m965o435R64L652L86K214K705l990o802J639O341R99k056J301j296o196
$$ 6336 1371 -5064 -4100 -448 -62 2152 4857 867 -5935 -4296 2045 3044 988 2289 993 -5203
1611e203R4Q521L085n976k740K705j781k963N837O405n613q253K912N594k334
$$ -5203 -5109 3412 6497 521 -2219 486 -1295 -4258 1579 7984 2371 -5882 -2970 2624 290
1626B90r82N749m44r325j654R011K928n432m19L285m044n048O234P456m276o717
$$ 290 -692 5057 4613 -4712 -6366 2645 5573 141 -278 3007 -1037 -6085 149 7605 3329 -3388
1642c388K321K673l811N22P186q2q473j876O291J100l188K406K682n494m557N027
$$ -3388 -1067 1606 -2205 -1683 5503 5421 -3052 -4928 1363 2463 -725 1681 4363 -1131 -5688 -661
1658f61N191k946k585K446r65m510K438N986j023n332K76K712k296r54M832J329
$$ -661 4530 1584 -1001 1445 480 -4030 -1592 4394 3371 -1961 -1685 1027 -1269 -2223 2609 3938
1674C938n765j990M182J059k873J467L011l480m107L708L806k852k212L073J26
$$ 3938 -1827 -3817 365 1424 -1449 18 3029 -451 -4558 -850 2956 104 -2108 965 1091
1689A091m649J104N429r61n059J132L775k723k675M498K427n051k576N131J618
$$ 1091 -3558 -2454 2975 2014 -3045 -1913 1862 -861 -3536 962 3389 -1662 -4238 893 2511
1704B511m977M1N083j550n317K311N539l042m755L699L708m428k836N231J960
$$ 2511 -2466 -2425 2658 1108 -4209 -1898 3641 599 -4156 -457 3251 -1177 -4013 1218 3178
1719C178n631r62N802J90n590Q24M835j790m019K985L725m067l389M135K635l758
$$ 3178 -2453 -3415 2387 2577 -3013 -2189 2646 856 -3163 -178 3547 -520 -3909 226 2861 -897
1735h97p66L830o57m734J319N319j068m392J395K622l002j386M707J862n020k140
$$ -897 -1663 2167 1510 -3224 -1905 3414 2346 -2046 -651 1971 -1031 -2417 2290 4152 -868 -3008
1751c008L506J092k382J405L085k887m585K290M432r24j885J406n21l814L83N030
$$ -3008 498 1590 -792 613 3698 811 -3774 -1484 2948 2024 139 1545 1024 -2790 -2407 2623
1767B623J420l478j448P44j170r2M095J985m246l362J735J351j85K033K381l732
$$ 2623 4043 565 -883 -139 -1309 -1401 2694 4679 433 -2929 -1194 157 -28 2005 4386 654
1783F54n391J983N020L07j637R54j218m763K01O539K661m207k991P43r51n44M493
$$ 654 -4737 -2754 2266 2573 936 1890 672 -4091 -3890 2649 5310 1103 -1888 -1145 -2096 -2640 1853
1800A853M147m240o056L95L364J083J227K158k670o308l22N844L130j352j074
$$ 1853 6000 1760 -4296 -3901 -537 546 1773 3931 1261 -5047 -5369 475 3605 2253 1179
1815A179j773m039o76O369M642k960m756j176m9J16M281M779k680p405j987L824
$$ 1179 -594 -4633 -5309 1060 5702 2742 -2014 -3190 -3239 -3123 1158 5937 3257 -4148 -6135 -2311
1831b311L270J481J263j977o156k395N036N716M96k664l424l303m40N183N644
$$ -2311 959 2440 3703 1726 -4430 -6825 -1789 3927 4423 1759 -1665 -4968 -5408 -225 5419
1846E419o12m987l977r53K089N206M038k269o645l392K232L799L882K031l494
$$ 5419 4807 -180 -4157 -5110 -3021 2185 6223 3954 -2691 -6083 -3851 -52 3830 5861 2367
1861B367o993k551N274N753J239j488l619n163j295O091P351n65n960m372q38
$$ 2367 -4626 -7177 -1903 3850 5089 3601 -18 -5181 -6476 -385 6966 6401 441 -3931 -4769
1876d769J559M845N638j154p775n311K367N517L823J440k584o697m558L837P972
$$ -4769 -3210 1635 7273 6119 -1656 -6967 -4600 917 4740 6180 3596 -3101 -7659 -3822 4150
1891D150L274k980m952m222j306M337P639K438n560p120k096K897N571M698j98
$$ 4150 7424 4444 -508 -4730 -6036 -1699 5940 8378 2818 -4302 -6398 -3501 2070 6768 6570
1906F570o177o688m62N934O409J767l814o464m023K018O552N515o17o268o361
$$ 6570 393 -6295 -6757 -823 5586 7353 3539 -2925 -6948 -4930 1622 7137 6520 252 -6109
1921f109q03N313O364K209l247o390m677J465P406O109j421o996n050m41L687
$$ -6109 -6912 -1599 4765 6974 3727 -2663 -7340 -5875 1531 7640 6219 -777 -5827 -6268 -2581
1936b581N872M475k855q748n114L793P441L711p01m331o260l423M862R104L305
$$ -2581 3291 7766 4911 -3837 -8951 -5158 2283 5994 5293 962 -5298 -8721 -3859 5245 8550
1951H550n416p180k980J624M826O307K081o214q988j523O527O724J960k337n330
$$ 8550 3134 -4046 -7026 -5402 -576 5731 7812 1598 -7390 -8913 -2386 4338 6298 3961 -1369
1966a369n971m20P160P935j07o858o171j032L140N829N047q41q075o973K036P632
$$ -1369 -7340 -7760 -600 7335 7228 370 -5801 -6833 -3693 2136 7183 6342 -1733 -8706 -6670 962
1982I62M832k07l475n403m518K253Q993N633m307p873l037J586L340N356M140
$$ 962 5794 5587 2112 -3291 -7809 -5556 3437 9070 4763 -3110 -6147 -4561 -1221 4135 8275
1997H275l972r868l669O965P157J003j971l016n815l315O345J0083N89q083n666
$$ 8275 4303 -5565 -9234 -2269 4888 5891 3920 904 -4911 -8226 -1881 8202 8791 708 -4958
2012d958K90J824L237O370J642q249q686J949Q218M031n60j830m368n883P04Q948
$$ -4958 -4668 -2844 393 6763 8405 156 -8530 -6581 1637 5668 5108 3278 -1090 -6973 -6269 2679
2028B679O409l366p381l400Q00K339N365M414k731q553m526M354O559K763j214
$$ 2679 9088 5722 -1659 -5059 -4259 -1920 3445 7859 5128 -3425 -7951 -3597 2962 5725 4511
2043D511l324m885l084L544P930L354n091o763j726K444L413L751K033l748p872
$$ 4511 1187 -3698 -6782 -3238 4692 8046 2955 -3808 -5534 -3090 323 4074 6107 2359 -5513
2058e513k084O512O185m41l182k372l238k013M917P973j42q243m528K964K431
$$ -5513 -7597 -1085 5100 4659 1477 -895 -4133 -6146 -1229 6744 6602 -1641 -6169 -3205 -774
2073g74R59L631J881o690p574L174R076J447m355j066m83m544n84Q332N984n946
$$ -774 185 3816 5697 -993 -8567 -5393 3683 5130 775 -291 -774 -5318 -5902 2430 8414 2468
2089B468q083R42L861o0J486M783j497r211k809P244N672k241k154L23l029l860
$$ 2468 -5615 -4673 -812 -872 614 5397 3900 -5311 -8120 -876 4796 2555 401 724 -2305 -6165
2105f165L669Q201J20p025l320K405J184k7L591K513m680o139J318N993J906j995
$$ -6165 -2496 5705 5825 -1200 -4520 -2115 -931 -958 2633 5146 466 -5673 -4355 1638 3544 1549
2121A549r09n64k840j093M524M445k092n245o38K457O25rK480Q43m638l706L382
$$ 1549 640 76 -2764 -3857 667 5112 3020 -2225 -2863 -406 219 210 2690 3533 -1105 -4811 -1429
2138a429N209q12l425K95J171k715q95M827L275m842m722K750L814j896j470L460
$$ -1429 3780 2968 -457 -162 1009 -1706 -2601 2226 5501 659 -4063 -1313 2501 605 -865 2595
2154B595O45n760j859O076L370m763k616L632L51m506Q99O239j93o849p74N607
$$ 2595 3240 -2520 -4379 1697 5067 304 -2312 1320 1671 -2835 -1936 4303 4110 -2739 -3513 2094
2170B094L10m436J384M802k766n680K436N742j581n055J803M040k924l795L456
$$ 2094 2404 -2032 -648 4154 1388 -4292 -1856 3886 2305 -2750 -947 3093 169 -3626 -170
2185a70L968l632l588L478L218l760k840L704K502l687k000L922J275m450j351
$$ -170 3798 166 -3422 56 3274 -486 -3326 378 2880 -807 -2807 1115 2390 -2060 -3411
2200c411M511J904m058j601L225O12l682N31M577p0n057r69L794J003k296M57
$$ -3411 1100 3004 -1054 -2655 570 1182 -2500 -1969 2608 2538 -2519 -3488 306 1309 -987 -530
2216e30K662k027l981J300N022K87l928p17K084j062j825K746L858k555n316P40
$$ -530 2132 105 -3876 -2576 2446 2733 -1195 -1912 172 -890 -2715 31 3889 1334 -3982 -3242
2232c242M279M21k081J252J294l437l198M096N105j975m796J11K394j374m06M369
$$ -3242 1037 1458 -623 629 1923 -1514 -4712 -616 4489 2514 -2282 -2171 223 -1151 -1557 2812
2248B812J946n842m687L889M894p96k108J536j006n080L00P462L255n641m385
$$ 2812 4758 -1084 -5771 -1882 3012 2216 108 1644 638 -4442 -4142 3320 6575 934 -3451
2263c451J970R15j327K987N449k958q578j004O648L189j820L07O1n109l831N588
$$ -3451 -1481 -566 -1893 1094 6543 3585 -4993 -5997 651 3840 2020 2327 2388 -2721 -6552 -964
2279i64P664j173o065j966N90q30K177N959J011o926n542K505M864J715N05k58
$$ -964 6700 5527 -538 -2504 -1914 -2744 -567 5392 6403 -523 -6065 -3560 1304 3019 3524 3266
2295C266m030m876J381O652L717k478m559k613j51K233M403K839k647o001l314
$$ 3266 -764 -5640 -4259 2393 6110 3632 -927 -3540 -3691 -1458 2945 5784 3137 -2864 -6178
2310f178L026N509K720j509l618l661j765K836O655L198m704p241j281L681L405
$$ -6178 -3152 2357 5077 3568 -50 -3711 -5476 -2640 4015 7213 2509 -4732 -6013 -2332 1073
2325A073K645J828l454q332k206P564P213j277m338k399k873k237N707R155o31
$$ 1073 3718 5546 2092 -6240 -8446 -882 6331 5054 716 -1683 -4556 -6793 -1086 8069 7438
2340G438r720m917K876L038K117M761J179r067q358N019R474J749l028j135l600
$$ 7438 -2282 -7199 -4323 -1285 832 5593 6772 -2295 -10653 -5634 3840 5589 2561 1426 -2174
2355b174o066K069J1091M786p603o992k07J238J782O419M515o578r976k92P216
$$ -2174 -8240 -6171 4920 9706 2103 -4889 -5096 -3858 -2076 4343 8858 2280 -7696 -7988 -772
2370g72M568Q88M3m556p518n12Q788O848j899n728l865k486J667P399N874l303
$$ -772 3796 4684 4727 171 -7347 -7859 929 7777 5878 150 -3715 -6201 -4534 2865 8739 5436
2386E436q052m146J566M960N785K208n150p841k297M673O287L618r86o607o897
$$ 5436 -2616 -6762 -5196 -236 5549 7757 2607 -5234 -7531 -2858 3429 7047 6061 -546 -7443
2401g443O58P700N690o6l702n746m958K520R445N247m455p165k967j40K858P691
$$ -7443 -6785 915 6605 6539 2837 -2909 -7867 -5347 4098 9345 4890 -2275 -5242 -5382 -2524 5167
2417E167N075o368j0404j524O061M976K269J444m432r527k189R359Q041j688m820
$$ 5167 10242 3874 -6530 -8054 -1993 2983 5252 6696 2264 -7263 -9452 -93 7948 6260 1440
2432A440l229m204r80P710Q868k491r759l983J973K659M549N522k355j0054n117
$$ 1440 -1789 -5993 -6973 737 9605 7114 -2645 -6628 -4655 -1996 2553 8075 5720 -4334 -9451
2447i451N576P080K080m15l080o922m031O416R389O27n732m688k750j61N802Q030
$$ -9451 -3875 3205 5285 4870 1790 -5132 -9163 -2747 6642 7269 1537 -3151 -5901 -6062 -260 7770
2463G770k87q581o089J138M136M871M020k004q575n268L749P112L499m0l830p060
$$ 7770 7483 -1098 -7187 -6049 -1913 2958 6978 4974 -3601 -8869 -5120 1992 5491 5451 1621 -5439
2479e439l581O096Q345J196m288m405l623j199N717Q546J13q496n081R12K675
$$ -5439 -9020 -2924 5421 6617 2329 -2076 -5699 -6898 -1181 7365 7478 -1018 -6099 -5187 -2512
2494b512L684N320k34q739o290M036P224J933l03j288n608n553L959R600K170
$$ -2512 1172 6492 6258 -2481 -8771 -4735 2489 4422 4119 2831 -2777 -8330 -4371 5229 7399
2509G399n430m160j660j152L021P729K295p177o784J045L595K753L588J326o626
$$ 7399 1969 -2191 -3851 -5003 -1982 5747 8042 865 -5919 -4874 -1279 1474 5062 6388 -238
2524b38p235K255P349L067j407j476l689m983J591Q485M028m412n470j457q5K042
$$ -238 -7473 -5218 2131 5198 3791 2315 -1374 -6357 -4766 3719 7747 3335 -2135 -3592 -3677 -1635
2540a635N546L304m790o854q41L732L418K563L68m296n698L71N295L788j63j947
$$ -1635 3911 7215 2425 -4429 -5270 -1538 1880 4443 4811 515 -5183 -4812 483 4271 4108 2161
2556B161l779l631J542O385K735k817l499j693j240J614N637K842m884n486M34
$$ 2161 -1618 -5249 -3707 2678 5413 2596 -903 -2596 -3836 -2222 3415 6257 1373 -4113 -3679
2571c679K736J206K137K124l348o218m9N969K640j620q60j213l651p60N830M066
$$ -3679 -943 263 2400 4524 1176 -5042 -5091 878 3518 1898 1038 -175 -3826 -4586 1244 5310
2587E310l134m293j46J92k69L151M000k328o202o56L987J239j5J554p19m689j880
$$ 5310 2176 -2117 -2263 -2071 -2340 811 4811 2483 -3719 -4375 -388 851 836 2390 1671 -3018 -4898
2604d898M619L727j745k198P1j210j803K700M432r09m846p57K112L65M6K127N72
$$ -4898 -279 3448 1703 -495 -424 -1634 -3437 -737 3695 2786 -2060 -2817 -705 -340 -294 1833 2405
2621B405l644k344K172K888j32j005l05r11j059R51K141N83j175j514n00N57J396
$$ 2405 -1239 -3583 -1411 1477 1345 340 35 -876 -1935 -984 1157 1740 565 -949 -1449 -892 504
2638E04Q88q86q11m6j58K4J345J037j535j936R90J650o67o34J336p3k174k78K732
$$ 504 1392 506 -305 -351 -509 -485 860 1897 362 -1574 -584 1066 399 -235 1101 1028 -1146 -1424 1308
2657A308Q26k601p28K010K3j892J023K399j458k814J442K379j121j953J410J209
$$ 1308 2134 -467 -1195 815 838 -1054 -31 2368 910 -1904 -462 1917 796 -1157 253 1462
2673A462k029p67K890O49l232q02K891P50k342Q7K210j522k730J730L597q64l334
$$ 1462 -567 -1334 1556 2205 -1027 -1829 1062 1812 -530 -443 1767 245 -2485 -755 2842 1978 -1356
2690a356Q7J765r21o15K683J466l318l183J741L086J5r84N65p40l053k67L988
$$ -1356 -1269 496 -425 -1040 1643 3109 -209 -3392 -1651 1435 1450 466 1031 291 -2762 -3029 959
2707I59K790k170l022n19P76p8J558K543l08m141k689K377L521M24j049o93j304
$$ 959 3749 1579 -1443 -1962 -1186 -1264 294 2837 2529 -1612 -4301 -1924 1597 2021 972 279 -1025
2724a025k406Q07M421K157k991l634J17J652L46J597K094j982m779o77M424K867
$$ -1025 -3431 -2624 1797 3954 963 -2671 -2554 -902 -556 1041 3135 1153 -3626 -4303 121 2988
2740B988j443j690l39j937j231L394M880j279n573j913K531J795O83K111J94n041
$$ 2988 1545 -145 -484 -2421 -3652 -258 4622 3343 -2230 -4143 -1612 183 866 2977 3171 -1870
2756a870m113L262O137Q57k932j924j446k408J604O515L187n105o176RL061K003
$$ -1870 -5983 -2721 3416 4273 1341 -583 -2029 -4437 -2833 3682 6869 1764 -4412 -4403 -1342 661
2772F61K129K626k935p401k122O476N754p01k952j748k890k400M088P678N89p014
$$ 661 2790 5416 2481 -4920 -7042 -566 5188 4487 1535 -213 -3103 -5503 -1415 6263 6852 -162
2788a62m740J662K454J451L374J725n220p167J518P436K599k464j636j238l517
$$ -162 -4902 -3240 -786 665 4039 5764 544 -6623 -5105 2331 4930 2466 830 -408 -3925
2803c925l86O320N452m059o946o57L011J583J689K724j893o945k644N886N937
$$ -3925 -4311 2009 7461 3402 -3544 -4201 -1190 393 2082 4806 2913 -4032 -6676 -790 5147
2818E147p43l349k345k261j263M271O622K01o826n308J182L941L295K336k55n666
$$ 5147 4404 1055 -1290 -3551 -4814 -543 6079 6280 -546 -5854 -4672 -731 2564 4900 4645 -1021
2834a021o269R97P648N365j718m977l662j874J023N821O189j373q454n322K617
$$ -1021 -7290 -6293 1355 6720 5002 25 -3637 -5511 -4488 1333 7522 6149 -2305 -7627 -5010
2849e010N132L191J501n88o352o523K776R195L590m180m002j319k443K47P577
$$ -5010 122 3313 4814 4226 -2126 -8649 -5873 3322 6912 2732 -1270 -2589 -5032 -4785 2792
2864B792N794n486q912j66N117J620P27L111j366q622k953Q068O670l034m395
$$ 2792 8586 3100 -5812 -5978 -861 759 1486 4597 3231 -5391 -8344 -276 6394 3360 -1035
2879a035L6j365k923M321Q286j447r342l242M870K767K76K966O58p291o310N158
$$ -1035 -999 -2364 -5287 -966 7320 5873 -3469 -6711 -1841 926 1202 4168 4826 -2465 -8775 -3617
2895c617Q747Q92m110k490k139l031K764Q141L192o168o970q85K841L826M221
$$ -3617 5130 6022 1912 -578 -2717 -5748 -2984 5157 8349 2181 -4789 -5674 -2833 993 5214
2910E214J139n119o824j200N197O009K028k763n229l947O93M923N129J331m394
$$ 5214 6353 1234 -5590 -6790 -1593 4416 6444 3681 -1548 -5495 -4802 121 5250 6581 2187
2925B187o490k024M409N413J326j146k945m939j865N237P060n43n797k884N31
$$ 2187 -4303 -6327 -1918 3495 4821 3675 730 -4209 -6074 -837 6223 5680 -117 -3001 -2470
2940b470j43K192N787P28p647n244M361N182o89l02J474l927o059K828R061J101
$$ -2470 -2613 -421 5366 6094 -1553 -6797 -2436 2746 2057 1755 3229 -698 -6757 -3929 5132 6233
2956F233o556k672J773j390l64O473M265o880p901K403N855P58k36K402k915p750
$$ 6233 -323 -2995 -1222 -2612 -2976 3497 7762 882 -7019 -4616 1239 1997 1761 4163 1248 -6502
2972f502k71Q459M645l630l314q06k594j012N899O100k754p009k243J921K134
$$ -6502 -6773 1686 6331 2701 -613 -1419 -4013 -5025 874 6974 4220 -2789 -5032 -3111 -977
2987i77K712L110j582o243l127L076M466K168k73k771m275r29L265L839J262j520
$$ -977 1735 4845 3263 -2980 -6107 -3031 1435 3603 3330 559 -3716 -4645 -1380 2459 3721 2201
3003B201l423l235R15M582K568j318k492j572j738J033M741K601l657m526Q49
$$ 2201 -1222 -4457 -3542 1040 3608 2290 -202 -1774 -3512 -2479 2262 4863 1206 -3320 -2471
3018b471J950K61J662K682k588n966O5N697K078k285n78M18l461j866N454M762
$$ -2471 -521 -260 1402 4084 1496 -4470 -4405 1292 3370 1085 507 925 -2536 -4402 1052 5814
3034E814l540m983Q40J577j589J958M957j201p047j526M922K140j517J110J005
$$ 5814 2274 -2709 -1869 -292 -1881 77 5034 3833 -3214 -4740 182 2322 805 1915 2920
3049B920m421l590L839N567j105l478l9l68k059J500M865N12m466k322J499P71
$$ 2920 -1501 -5091 -1252 4315 3210 -268 -307 -675 -2734 -1234 3631 4143 -323 -2645 -1146 -375
3065c75L88K191P07l310k779J741K642J84lp9k103j805J657K914k13j300l84q49
$$ -375 13 2204 2911 -399 -3178 -1437 1205 1389 1386 1307 -796 -2601 -944 1970 1757 457 73 -776
3083g76j292J639K962p89k666m09J223m52n0K451J04l422j192K868J041j510K27
$$ -776 -2068 -429 2533 1744 -922 -1331 -108 -560 -610 1841 1945 -1477 -2669 199 1240 -270 -43
3100d3J410k100k352K489L195j730k660J445Q74k028r8L495J37l722o98L032L16
$$ -43 1367 -733 -3085 -596 2599 869 -1791 -346 528 -1500 -1598 1897 2034 -1688 -2386 646 962
3117I62k199J101K028k189k523K146K653j707j839J724N63k263K81K886k96l006
$$ 962 -1237 -136 1892 -297 -2820 -674 1979 272 -1567 157 720 -1543 -1262 1624 1328 -1678
3133a678J34K535m71j549J127J002j956r74K366R47j682r45J347k50j218J779
$$ -1678 -1544 991 520 -1029 98 1100 -856 -1830 536 1483 -199 -1144 203 -47 -1265 514
3149E14J322j749j971J315J500q67L2J439j083k409N45K874qj551L86l6j687m6
$$ 514 1836 87 -1884 -569 931 64 96 1535 452 -1957 -1412 1462 1454 -97 289 253 -1434 -1480
3167a480L146J105k767j686J429L89p23J615J917k343l368J253K988j81p89Q88
$$ -1480 1666 2771 4 -1682 -253 136 -587 1028 2945 602 -2766 -1513 1475 1294 505 1393
3183A393p67k987K31L746J390k354j411N91r47l59K892K306k745l416P09J774
$$ 1393 626 -2361 -2130 1616 3006 652 -759 -168 -1115 -1474 1418 3724 979 -2437 -1728 46
3199D6L41P28J485j574l869j92L834J688j022o76j056k207j47L718K379j723k794
$$ 46 387 1115 2600 1026 -2843 -3035 799 2487 1465 789 -267 -2474 -2621 1097 3476 1753 -1041
3216a041q02R7N35K668K241k391l855n53K156J688J074P52k271l664j73L397K561
$$ -1041 -1843 -1746 -1211 1457 3698 1307 -2548 -3101 -945 743 1817 2569 298 -3366 -3539 -142 2419
3233B419j82j154j927k599J92M161K968j873l300j069k56J030L179K420k346m451
$$ 2419 2237 1083 -844 -3443 -3251 910 3878 2005 -1295 -2364 -2620 -1590 1589 4009 1663 -2788
3249b788j294K572K283J439P25k261m198q56L810L622j93j742k176k527J16M002
$$ -2788 -4082 -1510 773 2212 2937 676 -3522 -4378 -568 3054 2861 1119 -1057 -3584 -3468 534
3265E34L744j096m139k098P3J408L396K403j743m813k187K436L139J813M59k183
$$ 534 4278 3182 -957 -3055 -2982 -1574 1822 4225 2482 -2331 -4518 -2082 1057 2870 3329 1146
3281A146m258j600L659M335N07k384k636j948ML288M173j55m101l462J36K314
$$ 1146 -3112 -4712 -1053 3282 3789 1405 -1231 -3179 -3175 113 4286 4131 30 -3432 -3296 -982
3297i82K965K185j288m324k736J340L877K511J69k743l784j231K690M292J412
$$ -982 1983 4168 2880 -1444 -4180 -2840 1037 3548 3717 974 -2810 -4041 -1351 2941 4353
3312D353j930l590k451M99L604L633j8l562l513p63K126L959K236j735m401k743
$$ 4353 2423 -1167 -3618 -3119 485 4118 4100 538 -2975 -3738 -1612 2347 4583 2848 -1553 -4296
3328d296J221L688K912N50k989m231j353K791M318J623j602l333l453K4L949M354
$$ -4296 -3075 613 3525 4075 1086 -3145 -4498 -1707 2611 4234 2632 -701 -4154 -4130 -181 4173
3344D173J04l900l176r58J311L647L219q08m888l505J585L523K361O27j579l713
$$ 4173 4277 377 -2799 -3757 -2446 1201 4420 3612 -1276 -4781 -3196 327 2688 3315 1736 -1977
3360a977k762J961M803K146k125l074j909l44K137L881J574l200m366p73K524
$$ -1977 -4739 -2778 2025 4171 2046 -1028 -2937 -3281 -1144 2737 4311 1111 -3255 -4028 -1504
3375a504K888J538l86k746l574k20L748L701j67k850k927j011J314L191K778o14
$$ -1504 1384 2922 2536 -210 -3784 -4004 -256 3445 3278 428 -2499 -3510 -2196 995 3773 3159
3391C159m163l076P60L186K863N47j708l603k438J560M491K711j626l565k083
$$ 3159 -1004 -4080 -3320 -134 2729 3276 1568 -2035 -4473 -2913 1578 4289 2663 -902 -2985
3406b985j54J780L504K419k249m611k185K441L378J515o7j661l477j870K710M516
$$ -2985 -3139 -1359 2145 4564 2315 -2296 -4481 -2040 1338 2853 2786 1125 -2352 -4222 -1512 3004
3422C004J040k914k511p90m1J649L493R70l394l547N39K577J531M87J9j997k952
$$ 3004 4044 1130 -1381 -2171 -2212 -563 2930 3900 506 -3041 -2502 75 1606 2093 2112 115 -2837
3439b837N5L839K320j417k604q18J81L66K041K065j191l599j501K028K471P91
$$ -2837 -2782 1057 3377 1960 -644 -1462 -1281 -915 1126 3191 2000 -1599 -3100 -1072 1399 2190
3455B190l77j196k145j499K032L693P23k635k555l45O09J370K324J178k609l908
$$ 2190 1813 617 -1528 -3027 -995 2698 3421 786 -1769 -2114 -1505 -135 2189 3367 758 -3150
3471c150k23L149K301K0o39j381k627j001L101L884n44l282j548K46P5J272K858
$$ -3150 -3373 -224 2077 2097 1458 77 -2550 -3551 -450 3434 2890 -392 -1940 -1694 -1619 -347 2511
3488B511M84l523k945J328K796K99j29O06j306k853L2L656J718k247j522O45j40
$$ 2511 2995 -528 -3473 -2145 651 950 821 1427 121 -2732 -2700 956 2674 427 -1095 -450 -590
3505e90r46J455K480j119l147l30K390Q00j187L75O17j904j184K095K387j053
$$ -590 -1536 -81 2399 1280 -1867 -2197 193 993 -194 181 798 -1106 -2290 -195 2192 1139
3521A139k423J11R98l54L23J653K11k646j801J717K487q8j088j77m82j512M04
$$ 1139 -1284 -1173 -175 -529 -206 1447 1658 -988 -2789 -1072 1415 1327 239 62 -420 -1932 -1528
3538a528K726J682j944k446J46Q54J45Q93J563m39l019j222K130J834l87o39M64
$$ -1528 1198 2880 936 -1510 -1364 -510 -365 528 2091 1652 -1367 -2589 -459 1375 988 349 813
3555H13q09k020N51L011Q13k266j025J012J47j187Q92K115o65k581K30K017k44
$$ 813 4 -2016 -1465 1546 2359 93 -932 80 227 -960 -68 2047 1382 -1199 -969 1048 804
3572H04j385N63J314q70j528J060J602j239j592J199J332p63j064R03M13j484
$$ 804 -581 -18 1296 426 -1102 -42 1560 321 -1271 -72 1260 497 -567 336 749 -735
3588g35m23K030J018j611j612Q93P78n96L08J549p24k071p28J851J161o26l88
$$ -735 -1158 872 1890 279 -1333 -440 338 -258 50 1599 875 -1196 -1924 -73 1088 462 74
3605G4L74p40j317O34K181M69j886p73P13J10o41R59J328p70k163P0J715M29j297
$$ 74 448 -292 -1609 -975 1206 1675 -211 -984 -271 -161 -802 157 1485 715 -1448 -1378 337 766 -531
3624e31L57Q48o91j477Q71J884q23j980P34J709m60j289O75Q32j306r09J802J499
$$ -531 -174 674 -17 -1494 -623 1261 438 -1542 -808 901 441 -848 -173 659 -647 -1556 246 1745
3642A745j562j731O70J162o39p8J802q2k437j227J980J781o96m91K67j149j654
$$ 1745 183 -1548 -878 284 -355 -433 1369 1287 -1150 -2377 -397 1384 688 197 464 -685 -2339
3659b339J240K793M60k019j461L75ML17J823J337j877k561n4J862R51J44J71n51
$$ -2339 -1099 1694 2154 135 -1326 -951 -947 -630 1193 2530 653 -1908 -1962 -100 851 995 1166 615
3677F15j971o76K050K060l29j836o98J53j76P23J806rj987j519J019J547L51j41
$$ 615 -1356 -2032 18 2078 1749 -87 -785 -632 -808 -85 1721 1712 -275 -1794 -775 772 1123 982
3695I82m21q14j205O70K154Q78j604j747n5Q62N68R43P17j191k452n13K336J949
$$ 982 561 -253 -1458 -788 1366 2244 640 -1107 -1162 -300 268 1211 1928 737 -1715 -2228 108 2057
3713B057l04j377q63q58l73J711K479n6k557k028L39J530J177J288k49k277k418
$$ 2057 1753 376 -487 -1345 -1718 -7 2472 2416 -141 -2169 -1830 -300 877 2165 1916 -361 -2779
3730b779O38K677J800o68j324j380j387P62K648K022j313k942j054P46J240J580
$$ -2779 -2141 536 2336 1668 344 -1036 -2423 -1661 987 3009 1696 -1246 -2300 -1554 -314 1266
3746A266R37j012k934j311J893K592M43r04j252j488n58J743K609K30k249j944
$$ 1266 2203 1191 -1743 -3054 -1161 1431 1874 970 -282 -1770 -2328 -585 2024 2254 5 -1939
3762a939j15J114J464J308k6k427k071N00K506J699l53j478j603r94Q40K558J713
$$ -1939 -2054 -940 524 1832 1806 -621 -2692 -2192 314 2013 1660 182 -1421 -2415 -1575 983 2696
3779B696j208k443j417M81J742K083M83j703k617r20J672K480J141p56k242j820
$$ 2696 1488 -955 -2372 -1891 -149 1934 2417 714 -1903 -2823 -1151 1329 2470 1714 -528 -2348
3795b348K3K109K520L74j969k450r08J383K389J466p53k182j802k25K196K399
$$ -2348 -2325 -216 2304 2678 709 -1741 -2649 -1266 1123 2589 1836 -346 -2148 -2373 -177 2222
3811B222N00j930k253r73J266K081J474j37k433k074N4K344J844K15j018k250
$$ 2222 2722 792 -1461 -2434 -1168 913 2387 2250 -183 -2257 -2203 141 1985 2200 1182 -1068
3827a068j300R46K618J535r00k252j396J54J367K036R57j502k789q34J555J936
$$ -1068 -2368 -1422 1196 2731 1831 -421 -1817 -1663 -296 1740 2697 1195 -1594 -2428 -873 1063
3843A063J106k63j827k124k97K209K242J11j523j766j030O03J953K101n87k456
$$ 1063 2169 1906 79 -2045 -2342 -133 2109 2220 697 -1069 -2099 -1496 457 2558 1971 -485
3859d85j685L95J382J894P40r36k487j444J358K125J063l43j451k012l97J655
$$ -485 -2170 -1775 -393 1501 2241 1305 -1182 -2626 -1268 857 1920 1577 126 -1886 -2283 -628
3875f28K312M58j665j743o51N23J520J826k70j953j860K44J512J494P75r66k007
$$ -628 1684 2142 477 -1266 -1917 -1394 126 1952 1682 -271 -2131 -1887 -375 1119 1894 928 -1079
3892a079j159O93K057J252n71j362j331m32J230J848P62j235j540q50N34J356
$$ -1079 -2238 -1545 512 1764 1193 -169 -1500 -1932 -702 1146 1908 673 -867 -1717 -1183 173
3908A73J297J44j661j497k17J244J452O74p57j614j193P22J662J047m04j013j236
$$ 173 1470 1614 -47 -1544 -1761 -517 935 1609 852 -762 -1955 -1233 429 1476 1072 59 -1177
3925a177l15Q03J808N93j047j352p48M56J111J404Q7j629j283J63R06J040N67
$$ -1177 -1492 -689 1119 1712 665 -687 -1435 -979 132 1536 1623 -6 -1289 -1126 -220 820 1387
3942A387k05j540j110M57J628Q76n27q25o21p04N79J581P91r48j535k76M90N82
$$ 1387 1182 -358 -1468 -1011 617 1493 966 141 -480 -1184 -605 976 1767 819 -716 -992 -502 80
3960H0R77L80j058j373l3J094Q00K42k22q75q81K2J219P49k09q28o76k44M93R93
$$ 80 1057 1437 379 -994 -1027 67 867 1109 887 12 -869 -847 372 1121 912 84 -592 -836 -343 650
3980F50M19n51r26l11K24M06Q15J48p38r95k3P03N68O7J8n02q30j3J154N83m90
$$ 650 1069 518 -408 -719 -495 -89 726 874 136 -859 -882 -179 389 456 474 -28 -858 -871 283 866 376
4001C76n78j49m06k2J163N41o79r40JM91J7K80N24m00j152o5Q56P23m11m19J45
$$ 376 -202 -351 -757 -779 384 925 246 -694 -693 -202 -185 95 619 219 -933 -998 -142 581 170 -249 -104
4022a04m35m08Q92Q80m07r78P0K31O6J00P05k64r42l61Q11N90j89j94j04l33j65
$$ -104 -539 -947 -55 825 418 -560 -490 -259 -193 -93 612 348 -594 -955 -144 446 257 63 -41 -374 -539
4043e39K47R08m9o13l88P1K28J65M65j46k08m60K5K32M42L9l10m60J30J38R0K25
$$ -539 -292 616 567 -46 -434 -363 -135 30 495 349 141 -319 -294 -62 380 419 109 -351 -221 -83 7 232
4065B32K47n04m56L29P36k1n40J1N9j93k30Q81L68p80q16N29M85j54MN37m20j020
$$ 232 479 -25 -481 -152 584 563 23 34 93 -100 -330 551 919 139 -677 -148 337 183 187 724 304 -716
4087g16K6J283K31o72k03K26n42l45R12J034p98j097K56N54j11qP19n4j114p53
$$ -716 -690 593 824 152 -51 175 -367 -712 200 1234 436 -661 -405 149 38 30 749 695 -419 -1172
4107a172J145Q57l70m70K43k55q07M02J184J12r02n43L58K93l1J46L30n69p32
$$ -1172 -27 830 460 -10 233 -22 -829 -427 757 869 -33 -576 -218 75 44 190 520 -49 -781
4126g81K36Q99L79o58l04j03J03r0L82O87n10r16l60P51P55j50kl89m65n67P28
$$ -781 -545 354 733 75 -229 -332 -229 -319 63 750 240 -676 -1036 -285 470 320 318 -71 -536 -1103 -375
4147c75J321k6r84p03O7K20J27Q35O00j031j500K28J345M52l80L18l52j260m88
$$ -375 946 920 -64 -767 -700 -480 -353 482 1082 51 -1449 -1221 124 576 196 514 162 -1098 -1586
4166a586J656J450p22j278j10K33l70N28J391J22j815q84R68Q29k89K05N24r82
$$ -1586 70 1520 798 -480 -590 -357 -727 -199 1192 1314 -501 -1385 -417 412 123 328 852 -130
4184a30j219N13J722J73j190k89N07l29l20R96R71j021j597M47J178K57k05n3
$$ -130 -1349 -836 886 1059 -131 -420 87 -242 -562 434 1405 384 -1213 -766 412 669 464 411
4202D11j72r91k29J341J228p16j158n40N56J08O24Q41j38j699r69Q76J470L28
$$ 411 239 -752 -981 360 1588 872 -286 -826 -270 -162 462 1303 1165 -534 -1503 -627 843 1171
4220A171m27l00o98j180M60K007R04j114j391m62M10M24Q38Q93m77k013q49J357
$$ 1171 744 444 -254 -1434 -974 1033 1937 823 -568 -1030 -620 -196 642 1535 1058 -955 -1804 -447
4238d47J358N6k93k69r72r82Q30J982L87j576j070N08L9k1J025R05j090j888J56
$$ -447 911 967 674 405 -567 -1549 -719 1263 1650 74 -996 -488 -449 -470 555 1460 370 -1518 -1362
4257a362J735M60n94j58L2r83m89J558J277r87j414O2M75J13M09Q89l49j694r12
$$ -1362 373 833 239 81 113 -870 -1359 199 1476 489 -925 -863 -388 -275 134 1023 674 -1020 -1932
4276a932J638J274k54n36l12n67p94P81K136K28j894j231M54P34L14R25N09j338
$$ -1932 -294 980 726 190 -122 -689 -1483 -702 1434 1662 -232 -1463 -1009 -275 39 964 1473 135
4294A35j975J73J853J010l87n44m04r40l51J443J640l61j719o64L16L99N08J062
$$ 135 -1840 -1667 186 1196 809 265 -139 -1079 -1430 13 1653 1292 -427 -1091 -775 -376 132 1194
4312A194Oj521j160N46J533K99l54l75k46r50J70J509Q53r59j211K9N32J16M19
$$ 1194 1200 -321 -1481 -935 598 897 543 168 -78 -1028 -858 651 1504 545 -666 -637 -105 11 430
4331D30N75m05j374l01J108J159m26p02N3k77n98P59J240P0j636q36Q36O28N4
$$ 430 1005 600 -774 -1075 33 1192 766 64 117 -160 -758 1 1241 1311 -325 -1161 -325 303 357
4350C57L51K12r51j337M02J798L24o99n79j51m90Q5J205J012q94j460l78J118
$$ 357 708 920 -31 -1368 -966 832 1156 457 -122 -273 -763 -678 527 1539 645 -815 -1193 -75
4368g5J64K10N52j80j181r20J171J169q4o95j67k56n30L20J182M52j138q39K61
$$ -75 89 299 851 671 -510 -1430 -259 910 826 131 -36 -292 -822 -502 680 1132 -6 -845 -584
$$ [...]
8191a64
##END NTUPLES=NMR FID
##END=
