##TITLE=1H_IVDM0104S
 CDCl3, 8 sc, 
 2.4.2019
##JCAMPDX= 6.0         $$ Bruker NMR JCAMP-DX V2.0
##DATA TYPE= NMR FID
##DATA CLASS= NTUPLES
##ORIGIN= UXNMR, Bruker Analytische Messtechnik GmbH
##OWNER= root
$$ XWIN-NMR		Version 3.5
$$ Tue Apr  2 14:25:09 2019 Russian Standard Time (UT+4h)  she@DPX200
##.OBSERVE FREQUENCY= 200.1316
##.OBSERVE NUCLEUS= ^1H
##.DELAY= (6, 6)
##.ACQUISITION MODE= SIMULTANEOUS
##.ACQUISITION SCHEME= undefined
##.AVERAGES= 8
##.DIGITISER RES= 18
##SPECTROMETER/DATA SYSTEM= spect
##.PULSE SEQUENCE= zg30
##.SOLVENT NAME= CDCl3
##.SHIFT REFERENCE= (INTERNAL, CDCl3, 0, 15.7039)
##AUDIT TRAIL= $$ (NUMBER, WHEN, WHO, WHERE, WHAT)
$$ ##TITLE= Audit trail, XWIN-NMR		Version 3.5
$$ ##JCAMPDX= 5.01
$$ ##ORIGIN= Bruker BioSpin GmbH
$$ ##OWNER= she
$$ F:/spectra/data/she/nmr/H-F/1/audita.txt
$$ ##AUDIT TRAIL=  $$ (NUMBER, WHEN, WHO, WHERE, WHAT)
(   1,<2019-04-02 14:24:02.73 +0400>,<she>,<DPX200>,
      <created by zg, POWCHK disabled, PULCHK disabled
       configuration hash MD5:
       00 E9 B6 7A A2 85 ED C7 34 08 36 98 17 FE 4E 26
       data hash MD5: 16K
       B7 BE B1 12 7F 4D A0 6A D4 53 30 72 F4 AF 32 29>)
$$ ##END=
$$ 
$$ hash MD5
$$ AE 3A C6 D5 BA 5C 35 9F 85 B8 73 6B CC 57 A2 21
##$RELAX= 
##$RELAX= 
##$RELAX= 
##$RELAX= 
##$RELAX= 
##$RELAX= 
$$ Bruker specific parameters
$$ --------------------------
##$DU= <F:/spectra>
##$EXPNO= 1
##$NAME= <H-F>
##$PROCNO= 1
##$TYPE= <nmr>
##$USER= <she>
##$AMP= (0..31)
100 100 100 100 100 100 100 100 100 100 100 100 100 100 100 100 100 100 
100 100 100 100 100 100 100 100 100 100 100 100 100 100 
##$AQSEQ= 0
##$AQ_mod= 1
##$AUNM= <au_zg>
##$AUTOPOS= <>
##$BF1= 200.13
##$BF2= 200.13
##$BF3= 200.13
##$BF4= 200.13
##$BF5= 200.13
##$BF6= 200.13
##$BF7= 200.13
##$BF8= 200.13
##$BYTORDA= 1
##$CFDGTYP= 0
##$CFRGTYP= 5
##$CHEMSTR= <none>
##$CNST= (0..31)
1 1 145 1 1 1 1 1 1 1 1 1 1 1 1 1 1 1 1 1 1 1 1 1 1 1 1 1 1 1 1 1 
##$CPDPRG= <>
##$CPDPRG1= <>
##$CPDPRG2= <>
##$CPDPRG3= <>
##$CPDPRG4= <mlev>
##$CPDPRG5= <mlev>
##$CPDPRG6= <mlev>
##$CPDPRG7= <mlev>
##$CPDPRG8= <mlev>
##$CPDPRGB= <>
##$CPDPRGT= <>
##$D= (0..31)
0 1.2 0 0 0 0 0 0 0 0 0 0.03 0 0 0 0 0 0 0 0 0 0 0 0 0 0 0 0 0 0 0 0 
##$DATE= 1554200642
##$DBL= (0..7)
120 120 120 120 120 120 120 120 
##$DBP= (0..7)
150 150 150 150 150 150 150 150 
##$DBP07= 0
##$DBPNAM0= <>
##$DBPNAM1= <>
##$DBPNAM2= <>
##$DBPNAM3= <>
##$DBPNAM4= <>
##$DBPNAM5= <>
##$DBPNAM6= <>
##$DBPNAM7= <>
##$DBPOAL= (0..7)
0.5 0.5 0.5 0.5 0.5 0.5 0.5 0.5 
##$DBPOFFS= (0..7)
0 0 0 0 0 0 0 0 
##$DE= 6
##$DECBNUC= <off>
##$DECIM= 24
##$DECNUC= <off>
##$DECSTAT= 4
##$DIGMOD= 1
##$DIGTYP= 9
##$DL= (0..7)
0 120 120 120 120 120 120 120 
##$DP= (0..7)
150 150 150 150 150 150 150 150 
##$DP07= 0
##$DPNAME0= <>
##$DPNAME1= <>
##$DPNAME2= <>
##$DPNAME3= <>
##$DPNAME4= <>
##$DPNAME5= <>
##$DPNAME6= <>
##$DPNAME7= <>
##$DPOAL= (0..7)
0.5 0.5 0.5 0.5 0.5 0.5 0.5 0.5 
##$DPOFFS= (0..7)
0 0 0 0 0 0 0 0 
##$DQDMODE= 0
##$DR= 18
##$DS= 0
##$DSLIST= <SSSSSSSSSSSSSSS>
##$DSPFIRM= 0
$$ [...]
##$SUBNAM2= <"">
##$SUBNAM3= <"">
##$SUBNAM4= <"">
##$SUBNAM5= <"">
##$SUBNAM6= <"">
##$SUBNAM7= <"">
##$SUBNAM8= <"">
##$SUBNAM9= <"">
##$SW= 24.9336934301222
##$SWIBOX= (0..15)
0 0 2 0 0 0 0 0 0 0 0 0 0 0 0 0 
##$SW_h= 4990.01996007984
##$TD= 16384
##$TD0= 1
##$TE= 0
##$TE2= 300
##$TE3= 300
##$TEG= 300
##$TL= (0..7)
0 120 120 120 120 120 120 120 
##$TP= (0..7)
150 150 150 150 150 150 150 150 
##$TP07= 0
##$TPNAME0= <>
##$TPNAME1= <>
##$TPNAME2= <>
##$TPNAME3= <>
##$TPNAME4= <>
##$TPNAME5= <>
##$TPNAME6= <>
##$TPNAME7= <>
##$TPOAL= (0..7)
0.5 0.5 0.5 0.5 0.5 0.5 0.5 0.5 
##$TPOFFS= (0..7)
0 0 0 0 0 0 0 0 
##$TUNHIN= 0
##$TUNHOUT= 0
##$TUNXOUT= 0
##$USERA1= <user>
##$USERA2= <user>
##$USERA3= <user>
##$USERA4= <user>
##$USERA5= <user>
##$V9= 5
##$VALIST= <valist>
##$VCLIST= <CCCCCCCCCCCCCCC>
##$VD= 0
##$VDLIST= <DDDDDDDDDDDDDDD>
##$VPLIST= <PPPPPPPPPPPPPPP>
##$VTLIST= <TTTTTTTTTTTTTTT>
##$WBST= 1024
##$WBSW= 4
##$XGAIN= (0..3)
0 0 0 0 
##$XL= 0
##$YL= 0
##$YMAX_a= 570882
##$YMIN_a= -827656
##$ZGOPTNS= <>
##$ZL1= 120
##$ZL2= 120
##$ZL3= 120
##$ZL4= 120
##$ABSF1= 10
##$ABSF2= 0
##$ABSG= 5
##$ABSL= 3
##$ALPHA= 0
##$AQORDER= 0
##$ASSFAC= 0
##$ASSFACI= 0
##$ASSFACX= 0
##$ASSWID= 0
##$AUNMP= <proc_1d>
##$AZFE= 0.1
##$AZFW= 0.1
##$BCFW= 1
##$BC_mod= 2
##$BYTORDP= 1
##$COROFFS= 0
##$CY= 11.3945322036743
##$DATMOD= 1
##$DC= 2
##$DFILT= <>
##$DTYPP= 0
##$F1P= 18.9103706918063
##$F2P= -1.10871071338519
##$FCOR= 0.5
##$FTSIZE= 0
##$FT_mod= 4
##$GAMMA= 1
##$GB= 0.15
##$INTBC= 1
##$INTSCL= 1
##$ISEN= 128
##$LB= 0.24
##$LEV0= 0
##$LPBIN= 0
##$MAXI= 10000
##$MC2= 0
##$MEAN= 0
##$ME_mod= 0
##$MI= 1.114404
##$NCOEF= 0
##$NC_proc= 0
##$NLEV= 6
##$NOISF1= 3.799351
##$NOISF2= 2.8
##$NSP= 1
##$NTH_PI= 0
##$NZP= 0
##$OFFSET= 15.70392
##$PC= 1
##$PHC0= -9212.151
##$PHC1= 14.40025
##$PH_mod= 1
##$PKNL= yes
##$PPARMOD= 0
##$PSCAL= 0
##$PSIGN= 0
##$REVERSE= no
##$SF= 200.130013532006
##$SI= 16384
##$SIGF1= 3
##$SIGF2= 2
##$SINO= 400
##$SIOLD= 16384
##$SREGLST= <1H.CDCl3>
##$SSB= 0
##$STSI= 0
##$STSR= 0
##$SW_p= 3612.71676300578
##$SYMM= 0
##$S_DEV= 0
##$TDeff= 0
##$TDoff= 0
##$TI= <>
##$TILT= no
##$TM1= 0
##$TM2= 0
##$TOPLEV= 0
##$USERP1= <user>
##$USERP2= <user>
##$USERP3= <user>
##$USERP4= <user>
##$USERP5= <user>
##$WDW= 1
##$XDIM= 8192
##$YMAX_p= 0
##$YMIN_p= 0
$$ End of Bruker specific parameters
$$ ---------------------------------
##NTUPLES= NMR FID
##VAR_NAME=  TIME,          FID/REAL,        FID/IMAG
##SYMBOL=    X,             R,               I
##VAR_TYPE=  INDEPENDENT,   DEPENDENT,       DEPENDENT
##VAR_FORM=  AFFN,          ASDF,            ASDF
##VAR_DIM=   8192,          8192,            8192
##UNITS=     SECONDS,       ARBITRARY UNITS, ARBITRARY UNITS
##FACTOR=    0.0002004,     1,               1
##FIRST=     0,             0,               0
##LAST=      1.6414764,     0,               0
##MIN=       0,             -827656,         0
##MAX=       1.6414764,     570882,          0
$$ Real data points
##PAGE= N=1
##DATA TABLE= (X++(R..R)), XYDATA
0@%%%qJ6j6J6k4M0n6P3q9J12j52J90k22K64l18L82m52N25o10P14q29R53j092J250
27F67j425J618j831K064k325K612k925L268l643M057m514N014n556O156o822P552
43C967q359R258j0260J1388j2668J4125j5807J7774k0109K2937k6443L0921l6877
56b0153M5243n7931P9689j26897L94655l48280o81790P75133J41787m08616K63079
67E5919M83355o52636n00230O14026M73371m67571j70588K48237j80771k24263
77c21151M67394K67463m37247k61613K39191L6224m7770K28211K1877l62955j6088
88a86464L07125l0006j83418J20885L7421j90443R7992K61096j68707k81293J27702
99h8110J80587o8329J8778P1189j86353j28583K25315J49441j37243q2074j8535
$$ y = [0, 0, 0, 0, -8, 8, -8, 8, -16, 24, -32, 41, -48, 64, -88, 102, -120, 144, -174, 208, -244, 281, -329, 385, -444, 509, -583, 667, -758, 860, -971, 1093, -1232, 1380, -1545, 1723, -1920, 2137, -2377, 2637, -2919, 3237, -3585, 3967, -4392, 4866, -5394, 5994, -6674, 7451, -8356, 9418, -10691, 12246, -14197, 16724, -20153, 25090, -32841, 46848, -80049, 314606, -33674, -715464, 59669, 201456, -207160, 55919, 539274, -113362, -613592, 434, 473805, 6234, -164354, 83883, -96888, -321151, 146243, 413706, -23541, -285154, -45963, -9739, -57509, 170702, 192579, -170376, -186464, 120661, 90655, -92763, 28122, 65543, -124900, -26908, 234188, 65481, -215812, -88110, 92477, 24148, 42926, 114115, -72238, -200821, 24494, 173935, 36692, -45382, -63917]
110f3917r4560J20976K94801q6695l43053o437J48495l6853J34860K66881k57525
121G6973m64500J92824M23577j22188j61603J99706j21710l87381K68513N32489
131D36700k43990m75947J74680J99131k27971J10921M04026k55694n21602K25062
141a74684M23017j87282j66854K46431q0965l61030K03944M12664k15741l38932
151b39432J84668J58761j79373M8697K25542j76057k63133J85878K20605j29192
161C6964q5533R2598o2133q6560J59015R0560j78727q2352J17233L3036j2677
172B1424P3673n4420j84200L2503J93916J1428r0334K121m4806q1943J14560J53157
184A47079r7472j48954L0703M3694J0725J14644K8142k06641r5458J68289Q2043
$$ y = [-63917, -158477, -37501, 257300, 170605, -172448, -178885, -30390, -67243, 67617, 334498, 76973, -387527, -194703, 228874, 106686, -54917, 144789, 23079, -364302, -95789, 436700, 192710, -283237, -108557, 90574, -137397, -26476, 377550, 121856, -399746, -174684, 248333, 61051, -105803, 140628, 59663, -301367, -97423, 315241, 99500, -239432, -54764, 103997, -75376, -26679, 198863, 22806, -240327, -54449, 166156, 36964, -48569, 44029, -18104, -104664, 54351, 144911, -33816, -116168, 1065, 34101, 21424, 95097, 40677, -143523, -111020, 82896, 94324, 3990, 6111, -38695, -120638, -6078, 147079, 49607, -99347, -68644, -24950, -14225, 100419, 128561, -78080, -173538, -5249, 76794]
195G6794n7606N1743j430k08175j4290K76956M1422k26810J045J18213j23171
206f5309l4178K61046Q763l29485j1368K80532l2719j64851J44349O7035k68291
217a44476l1290L11770J0814k59920M3100J62913j29245p2220K10027J2305k44052
228a30274K2234K14899m9075j27614R7969L4909j51628K4764J74169m8412j41601
239g9660O2222P1874p8335N081R4077o5511j04367Q4793Q7783p0629l5638M7726
251A9416l8624m6641Q6365N0895q5765l6789N1546o493j4230O0068l373q9956
263e3581O518P7858j2588k6991M0858k3421p3103N1879Q3606n6991n1028O3353
275B6369p181p9831N9081R1025q8833p7814R9164L3248j05367K1219J04242p1510
$$ y = [76794, 19188, 70931, 69501, -138674, -152964, 123992, 165414, -61396, -60351, 57862, -65309, -99487, 161559, 170322, -159163, -170531, 110001, 77282, -87569, 56780, 123815, -144476, -175766, 136004, 146818, -113102, -70002, 92911, -36334, -108554, 101473, 113778, -130274, -108040, 106859, 57784, -69830, 28139, 63048, -88580, -63816, 110353, 61941, -79660, -17438, 54436, -23899, -18818, 75259, 9748, -94619, -9826, 77957, 7328, -28310, 19416, -19208, -65849, 20516, 71411, -14354, -51143, 403, -6090, -20320, 39748, 36375, -53581, -47063, 30795, 18207, -8784, 32074, 8653, -64450, -12571, 71035, 14044, -36984, 26369, 19188, -60643, -1562, 89463, 630, -77184, 21980, 55228, -50139, -28920, 75322, 3812]
287C812r3983J02127O1764j17007j3451J19413l8546j11141P9160Q6379j03136
298b4609m2785J17328l887j17613M4827J03009o9511o5684Q6195J8395r5055K5781
310b3609R5548n3013p7466O2863L9850o7462M847O9084m2263o9053N6187N3166
322D8679n1764k1725L8334k2161l3995N3471L6215n7702k9155L6926N183j1846
334i540L0625J573n3993k484N3006O841k1504N364j6585l2860L7366N8803k9590
347B7022n3232J2116J3398j2254L3011L2716n8343n4476M7664M7688k2848q587
359C875P036m7105k1141P9564M6479o7672m7887K7661P585k117N2281J2502q4338
372c3277l7140P2312M4020k7675r845p323m6798P935Q9260K3339q0472m4498K8879
$$ y = [3812, -90171, 11956, 73720, -43287, -56738, 62675, 24129, -87012, -7852, 78527, -24609, -67394, 49934, 46047, -71566, -26739, 76270, 6759, -58925, 27270, 45665, -49390, -23609, 71939, 18926, -58540, 4323, 44173, -23289, -18442, 50642, 8379, -60674, -4487, 48679, -3085, -24810, 13524, -8637, -42632, 10839, 47054, -10648, -39803, -2877, 2306, -9540, 21085, 22658, -31335, -33819, 19187, 26028, 4524, 9888, -6697, -39557, -2191, 56612, 27022, -26210, -14094, -696, -12950, 20061, 52777, -5566, -60042, -12378, 35310, 12462, 3875, 10911, -36194, -57335, 22229, 68708, 1036, -46851, -19190, -11605, -13722, 38559, 51061, -33277, -70417, 1895, 45915, 18240, 8395, 1072, -45726, -37791, 51469, 74808, -5664, -50162, -21283]
385b1283K0072J6903L7563j9540q2474j6242P4469M3670k6332l2749k4892j8486
397d9321L5265O7996l32p4506m4650K6837M9840L3506k428m8574n2018J0870O4789
410A7274M2735k1575n7610l6235K2200O1621L6382k7911o3521l4947L0137O8684
422C7234L4398m0172o8720k4301L5189N7476L1435l1166p3184l1857N1955P0596
434D8883Q536m9640n5518j7661M2815P3649J9858o4959p0092K407N8268N3414
446D9960J1003m5893p0329j2331P1746O9942j6097p1166m5287J2947N6017N6332
458F6844l149p4928o7275K3498Q2994M4915l0242o4416m5008J3067P1276N9043
470G6619l0908r0465l7710N0719P0146K5362k9953o7855m9029L9629R6742L2293
$$ y = [-21283, -1211, 15692, 53255, 33715, -48759, -65001, 9468, 53138, 26806, -5943, -30835, -49321, -14056, 53940, 53608, -20898, -65548, -38711, 11129, 44635, 42207, -6367, -58385, -47515, 17274, 60009, 38434, -19176, -55411, -33211, 28410, 64792, 36881, -26640, -61587, -31450, 37234, 71632, 31460, -37260, -61561, -26372, 31104, 62539, 31373, -41811, -73668, -21713, 48883, 57419, 7779, -47739, -65400, -22585, 51064, 70922, 5963, -64129, -61722, -3454, 49960, 60963, 15070, -55259, -67590, 4156, 74098, 58001, -13165, -58452, -45505, 10512, 66844, 63695, -11233, -78508, -55010, 27984, 72899, 42657, -21759, -66767, -53700, 17576, 76619, 45711, -44754, -82464, -31745, 38401, 63763, 33810, -34045, -83074, -43445, 53297, 85590]
482H5590o5591p0816j0094L7035O2318M3129m3956r8740k0619Q4275O8206j3097
494E7640m8687n2299k9987M9344R7961J1592r5193o7828K4256N3727M4784J9948
506F5258n3454r2432N67J02411N7971m3721o1118l1494k17N7897P9141j2810j01718
519c3719n1149N0493O9498K8874j7095o4701n9759L2477R5404L4339n8904p0827
531d5069k0333L6636P0801L8715m9816q7700k3985N9850P4479J7474n5064p6246
543f0258j6643O1859P2218J0576n8697p4824j1867P4578P6975j0088p0911n1897
555e8979k153N0463P9690J7204q9693q1136L3031P8714K8588p883l5564p2246
567e9964j8076R6134P7480n5467q3667n691J9802K2258O1013J8281r7916p4094
$$ y = [85590, 19999, -50817, -60911, -23876, 38442, 81571, 37615, -61125, -81744, 2531, 70737, 57640, 8953, -43346, -73333, -23989, 73972, 85564, -9629, -77457, -53201, 526, 45310, 65258, 11804, -80628, -80061, 22350, 80321, 36600, -24518, -56012, -56229, 1668, 80809, 67999, -33719, -84868, -34375, 35123, 63997, 46902, -17799, -77558, -45081, 50323, 84662, 25758, -45069, -65402, -28766, 42035, 80750, 30934, -56766, -80751, -20901, 53578, 71052, 15988, -60258, -76901, -15042, 57176, 67752, 9055, -65769, -77636, -3058, 73917, 63829, -7082, -58979, -61132, -10669, 69021, 86225, -3468, -84604, -51573, 27141, 55729, 47846, 12282, -59964, -78040, 18094, 95574, 40107, -43560, -49251, -29449, -7191, 53822, 72103, -25813, -99907]
579i9907O8678Q5491j3140l5201j5084m0497o190R0274N4971p9819p8009K8605
591c9828M6295J5753K8712r498q9347l5779R1250P1840l9593n4077j5440j3985
603d3697K4447Q0874J5303r6000o2785M6114N9495J8628J502l8661p4523m539
615g3842R2741O0464m2142o7738k5216J4428M7456N2167o307o9608n1259K5275
627d3581O9647M0312k8521o1854k7418K3869M2855L5206j845o0243n5383L6586
639c0370P5318K166m7081j4563n924j5336L8899O0881l6968q6241J1791O8220
651B0792J512k1446J6046k1743n3642L7167Q3328k5022p8324R935M0431j2108
663c074J0814M1262m0781p4807L7186Q2817j3737m7447M885j0818k8892N0867
$$ y = [-99907, -31229, 54262, 41122, 5921, -9163, -49660, -55850, 34424, 89395, 9576, -68433, -39828, 6467, 22220, 50932, 41434, -47913, -83692, 7558, 79398, 39805, -14272, -29712, -43697, -19250, 61624, 76927, -19073, -81858, -35744, 23751, 42379, 43881, 5220, -69303, -73842, 18899, 79363, 37221, -30517, -55733, -41305, 6151, 58318, 52011, -17597, -68856, -43581, 26066, 66378, 37857, -23997, -51415, -27546, 15309, 50515, 48670, -11573, -66956, -30370, 44948, 47114, 33, -14530, -20454, -35790, 3109, 63990, 27022, -59219, -47428, 20792, 22304, 858, 16904, -4839, -58481, -21314, 62014, 36992, -41332, -31397, 9034, -3074, 7740, 49002, 8221, -66586, -29400, 53417, 39680, -7767, -2882, -13700, -42592, 8275]
675H275O6361n0578q1013K2649M8067q226J0344K7260n4485o7747N3399Q5019
687E9325k2971n5535N135j659k4158M1159O3228l6603p9369Q634N5656P418r131
700A1129J1301j8650m4179J1404O0835J4766m4160k8021J3053J4194K119J1145
712A4936P169k5297k9148J8286L8768o596l2698L603J7278j4431o901K9564J560
725A6093m0566K022M4236o871l9533J4656L0390k3492j3876L5785p75m6694J0831
738a7794N0385j3203l7450J8642J3379l3700Q370N1301j6384n7735J4657M0920
750B1388k0658j3723L7819p666n7263J1552N8702j1343l9392K0175J3045m0362
762b7726K132N6080l190n2235O150L4298j9261j6234L8503J2304m5197j1999L6882
$$ y = [8275, 74636, 24058, -56955, -34306, 13761, 5535, 15879, 43139, -11346, -79093, -25694, 59325, 36354, -19181, -14046, -15705, -39863, 1296, 64524, 27921, -51448, -42814, 12842, 20260, 11129, 22430, 3780, -40399, -28995, 31840, 46606, 2446, -25575, -12522, 1672, 3791, 14936, 22105, -3192, -32340, -14054, 24714, 18118, -14580, -10977, 6301, -8130, -15031, 14533, 16093, -24473, -22451, 21785, 14914, -24619, -9963, 20427, -3065, -16941, 18844, 18069, -28625, -17794, 32591, 19388, -18062, 580, 13959, -19741, -11371, 39930, 23546, -34189, -19532, 21388, 730, -12993, 24826, 17160, -40103, -28551, 30151, 18808, -20584, -409, 12636, -27726, -25594, 30486, 27296, -24939, -18789, 15509, -3752, -19986, 18517, 30821, -14376, -26375, 10507]
775A0507M200k2893J3176J9722k5838k6173K3369K5851j1779j3974P455l042j9898
788a9317N600L3294P030l4025k0578J8716J4245p318Q272J4948k6500l5484K5551
801a5566M6959j0875l2290O683M555k1803J5213M6690j3381n4819M117L9286n131
814I638j2478K3448n216m5060O396N0401l006l7515O221J4812k1681K311L6893
827B5164j1272m4374J3202L8539j6450k2609K2680K903l2828J4261M4448k0567
839A3097m8288J8551L8667j4292j3447K1814j0986l9612K0028N6521r941n1021
851a8909l428K2895k501P082K8704j4799n4958n622N2354K6168k1919k1722j0550
864a7205j1765J3232M2942J3226m3874l9841J4099L6308J6364k199j4848k9803
$$ y = [10507, 14707, -8186, 4990, 24712, -1126, -27299, -3930, 21921, 10142, -3832, 3623, 581, -19317, -13717, 19577, 26607, -7418, -27996, -9280, 4965, -2353, 5919, 20867, -5633, -41117, -15566, 31393, 20518, -11772, -5089, -534, -22337, -7124, 39566, 26185, -28634, -24517, 14769, 9638, -2840, 20608, 15392, -29668, -23272, 27129, 24123, -13392, -7171, 7641, -14040, -11729, 25164, 13892, -30482, -17280, 21259, 4809, -17800, 4880, 7783, -25045, -10784, 33664, 13097, -35191, -16640, 22027, 7735, -5712, 16102, 5116, -34496, -14468, 42053, 32112, -18909, -22337, 558, -1943, 5139, 33843, 19044, -35914, -41536, 10818, 36986, 15067, -6655, -17205, -28970, -15738, 27204, 40430, -3444, -43285, -29186, 7122, 23486, 21287, 6439, -23364]
876b3364j5033L2648M5368m525m3959k1827J4628K0687J6656Q452k2139l8467
888c0875J157M2970K2406k1192k4267q295m83J7586L0770m146m4596j9160L0833
901g292K6413m001r193j3348k2589P145M5277J5936l9874l1465J3841K0735J1735
914A3320J4657j0190m6501j3935M9941L8039k2867l2376p464m186J1664M3069
926C3171J4039n2794m4207K5758M3007P743p194j5660l6971j1609N0245M5020
938E0548k6809m9660q766J7428J9782K6381M445m3989l8472K4459M9768J1541
950C6656k2388k6309j9188P678M1555K7992k6408m4971q178K6046K9410J2154
962C4049j7207l8322j7411K8161M0315O509l0647l4958o639K8334L6244M453l1401
$$ y = [-23364, -38397, -5749, 39619, 35094, -8865, -30692, -16064, 4623, 21279, 29731, 7592, -30875, -29718, 13252, 35658, 14466, -9801, -18096, -18579, -993, 29777, 25631, -18965, -38125, -7292, 19121, 15120, 5927, -7421, -30010, -22865, 22412, 38348, -1526, -32991, -19150, 1585, 13320, 27977, 17787, -28714, -42649, 7292, 45331, 22464, -9912, -17376, -21562, -9898, 33171, 47210, -5584, -49791, -24033, 18974, 26717, 19523, 3863, -33108, -44717, 5528, 50548, 23739, -25921, -34687, -17259, 2523, 28904, 33349, -10640, -49112, -24653, 25115, 36656, 14268, -12041, -31229, -23551, 18004, 45996, 19588, -25383, -33561, -7515, 21895, 34049, 16842, -21480, -38891, -10730, 29585, 36094, 5447, -29511, -36150, -7816, 28428, 32881, 1480]
975A480l4297k871L1134L5876J968l6672l2648N965L3537K7929L77l1692l6941
988c6855M031M5111K9163j7044l4039j8702M579L0161L4327q898m8884k4546K7235
1001a4361L3938R497j0359k8615l0068J2589N0837J8984l6030l5778n84J7466
1013a2484K5736K1814j7822m8014j2410M0061L5152m251k2990k5736j3889K4407
1025a0426M6172O398m2864l3569Q611K8734K5539N619k8709l9671N17M0330K8834
1038C5515q953l0535k7464p63L4553L4308r582m0680k2798J2859L0145K2703n467
1051B3841l4789k6137J4552L6907J8546j4965l1601j8915J5046L6328J6638k0670
1063A4781l1509j1781J6639L1939J5847k3177l6684m906K6325K3808M020j5725
$$ y = [1480, -32817, -35688, -4554, 31322, 33290, -3382, -36030, -30065, 3472, 31401, 31778, 86, -36855, -32824, 12287, 41450, 24406, -9633, -28335, -23756, 6405, 40732, 31834, -17050, -41596, -14361, 19577, 29074, 18715, -9900, -39968, -27379, 23458, 42442, 6412, -29366, -29950, -12484, 13252, 35066, 17244, -30770, -43180, -3119, 32033, 27782, 4792, -20944, -34833, -10426, 35746, 42144, -720, -34289, -25678, 3056, 28595, 34214, 5505, -34166, -33649, 6681, 35515, 26562, -3973, -31437, -32200, 2353, 36661, 27079, -13601, -36399, -23540, 6605, 29308, 23841, -10948, -37085, -22533, 14374, 32920, 17955, -13646, -32561, -17515, 18813, 35451, 14781, -16728, -28509, -11870, 20069, 35916, 12739, -23945, -28851, -2526, 21282, 25302, 9577]
1075I577l0369j4404K8321L8051m106l4228j9451M222J6645K5513J0451l0205
1087A7l5785Q659L7251J6059j0025j7921k0344m382K9796L1813j0501l6472j5144
1100b6979J3912K2796J6892m897k9192k1320J4162K9139J0954j2191k3084j6938
1112b6746R954L1473J3081k0738k6009m909J3498K1014J2870j4188k9668p186
1124b7554K3436K2218J43j4080j8396p600J6497K6136L248k2865j9767K462J8434
1137B312J7704O8j9791j8270L056J8400J4596j317j8343j8997M333K3168J2023
1150A8942j0975j5446p948R42J4948J8437n859k6524q760J7261J4294L71k813
1163F870r525j4086M529K4449Q876j7633j5110K059Q204R395Q189p496j8935m320
$$ y = [9577, -20792, -35196, -6875, 31176, 27070, -7158, -26609, -22387, -5742, 19771, 30222, 17, -35768, -27109, 10142, 26201, 16176, -1745, -22089, -26471, 3325, 35138, 24637, -11835, -26979, -13067, 9729, 26621, 21724, -7468, -28788, -14626, 14513, 25467, 13276, -9808, -26746, -16792, 14681, 27762, 7024, -18985, -23894, -10396, 10618, 23488, 9300, -20368, -27554, -4118, 18100, 18243, 4163, -14233, -21833, -5336, 20800, 24048, 1183, -18584, -16122, 2312, 20016, 20084, 293, -17977, -14921, 3479, 18075, 16758, -1585, -20582, -16249, 6919, 18942, 7967, -7479, -15427, -14485, 463, 18900, 13041, -13483, -22243, -4982, 9312, 9683, 6870, -2655, -16741, -12212, 12237, 21113, 3480, -11630, -9571, -1367, 8028, 16217, 8721, -10214, -14534]
1177a4534J5440J2056k354q260r899n289R139J4944j05j3904q878J927O800R385
1191F468L379j1359j2941M645J3532L482m506k618n284m155Q512J3010l310j3983
1205e128k071Q502L220n11K313l545r049J174J1761K525r433m035L617J14o57
1220a203L981M01p300l582O962M210l720l314O40L34M51K996O60l843r82K895
1236d14J627k67M12m75j613J469K598m72k247J12Q03k28O55L71k160j055K179
1253A295J250l041k525J682K038k86j498j165q01O30J398K028N65m421m748L990
1269c609R126l72p227j775K530j135M030Q871l718j5275j46J4502L523o468P83
1284C640j633j2250K589K0699K151k0657o788J0491J087m76J1156k148k2444l561
$$ y = [-14534, 906, 12962, 10608, 2348, -7551, -12840, -3701, 11243, 11138, -2766, -11644, -9717, -2917, 6468, 9847, -1512, -14453, -9808, 3724, 7206, 2700, 82, -5202, -9357, -845, 12165, 8855, -5128, -7199, 1303, 4523, 4012, 6325, 2780, -6269, -5095, 6666, 9191, -242, -4277, -660, -546, -1203, 2778, 3179, -4121, -7703, -741, 3469, -251, -3565, -2925, -2591, -2140, 856, 1516, -2327, -3309, -414, 1213, 946, 1358, 883, -730, 739, 3337, 2865, 618, 730, 1533, 1305, 1960, 2331, 171, -884, 1295, 2545, -496, -3021, -1339, 699, 413, -1085, -2250, -3051, -2421, -1023, 1005, 1570, -2851, -7599, -3609, 5517, 5145, -2082, -3857, -1327, -2462, 1568, 10439, 6721, -8554, -8700, 5802, 9325, 2857, 3640, 2007, -10243, -7654, 13045, 15196, -5461, -12249, -1758, -671, -1147, 10009, 7861, -14583, -18144]
1298a8144K2489P661j2103k434Q20j0487K790K2836K179k3147o367J3626L428
1311C147n43R098n279k0250K506K3530K352j4890j820J219p270P035J9111p201
1325A0745k5214k86J8740M002n260J062p911j2996R132K2192o36j9318q836M929
1339i655Q268J0463M988j2700j7542R38J8243J4773l087j7479j3570N611J6622
1352E873J0001j151j2168j9142k349K5631J8924j4557k1426k369L314N940J9996
1365A6517O029l0603k2689K0852K3684m396n553j591j8825q126L1784K2242k4572
1378D753k3246R107P094M02J7863N479l2785j6758L0239J9890j5183o431K916
1391C340j6609k689L3716J0878l5103j6866K0550Q306m161J2019l084l2295l996
$$ y = [-18144, 4345, 12006, -97, -2531, -1711, -12198, -9408, 13428, 15607, -7540, -13907, -281, 3147, 2604, 11702, 6423, -13827, -11321, 12209, 14561, -329, -2149, -930, -8200, -1165, 17946, 10745, -14469, -14755, 3985, 7987, 2727, 3789, -4122, -17118, -7986, 14206, 13570, -5748, -14584, -9655, -1387, 9076, 14064, 1364, -16178, -15240, 3003, 17776, 14689, -2790, -16360, -10749, 5873, 15874, 14723, 2555, -16587, -18936, 6695, 25619, 11062, -10364, -12733, -9419, -3479, 16517, 22546, -8057, -30746, -9894, 13790, 9394, 3841, 2250, -16575, -24701, 7083, 29325, 4753, -18493, -9386, -2292, -1890, 15973, 21452, -11333, -28091, 2148, 22038, 6855, 424, 3340, -13269, -15958, 17758, 28636, -6467, -23333, -2783, 5523, 1362, 13381, 10297, -21998, -25994]
1404b5994L7314J2694k3876j1096K952n881Q352K8430k285l6056j1884K3198J6635
1417A2503K101k356j6654j9357J0434K9859R024j5865j9539j0922R275K6629J1718
1430B6850j9040k1598m528O972J9517J9481j4104l6061m717K7041J2888j826m85
1443A0390j6747k4719J5679M0044k062l0668n318O864m702J5172K6273j9649l9380
1456b8823J1230L3515l335j0307Q349j3405k3520K3943L5753k0018l3182J0367
1468i433J2504q891J3319J8065l0381l1449K9262L2629j7851j5411Q486j2345
1480a1496j2702L3416K6143l3848l1309J8188J7271k909J1851M231l3877j7905
1492c2946L4658K7339j4842j5910m752j0691N989L2038Q063l0014k0201P809J2054
$$ y = [-25994, 11320, 24014, 138, -10958, -8006, -13887, -5535, 22895, 20610, -15446, -27330, -4132, 12503, 14604, 12248, -4406, -23763, -13329, 16530, 25554, 9689, -9850, -20772, -11497, 15132, 26850, 7810, -13788, -18316, -11344, 8173, 27654, 13550, -22511, -27228, -187, 12701, 10875, 10390, -6357, -31076, -15397, 24647, 22585, -8083, -13401, -6537, -11239, 3933, 30206, 10557, -28823, -17593, 15922, 12587, 2280, 10629, -2776, -26296, -2353, 33400, 13382, -19800, -9433, 3071, -5820, 7499, 25564, -4817, -36266, -7004, 25625, 7774, -7637, 849, -11496, -24198, 9218, 35361, 1513, -29796, -11608, 5663, 2754, 14605, 18836, -15041, -32946, 1712, 29051, 14209, -1701, -6453, -17144, -11155, 20883, 28946, -1068, -21269, -13460, -1406]
1505a406J3202J0701j7273k8547K665K4326J0224k131p236k0719r343K6096K2670
1518B3229j4241j7647L64l144K582K6369O753l3573j5923K4944J2547q793O111
1531I578L29k7685k164L7822P991l1684o689J4561p813k03K7689m259m0985m50
1545b3962L5757J599j7292P695k830k5846J1506L9811q164l6258L638J6513q592
1558f425P171K5016j8139l8143J4647L6034o161j5232P649r193k0648K1348L3078
1571C1002j6664l0639N770J0865l906J1684J3190k3333k4028J7071K1831m341
1583H502n749k009j4680l291K3934J1164j6737j0293K596j877P251J8285o470
1596A0626k4598R43J8183L52k347P733j0065j9003J4270K3865j0933j7622P640
$$ y = [-1406, 11796, 22497, 5224, -23323, -20658, 3668, 13892, 11761, 4525, -16194, -25537, 559, 23229, 8988, -8659, -8295, -11439, -8857, 17512, 24265, -9308, -25231, -287, 12260, 3467, 9578, 9907, -17778, -19942, 17880, 25871, -5813, -12502, 2059, -5754, -5957, 21732, 17473, -23512, -23962, 11795, 13394, -3898, 3797, 967, -24879, -13373, 26438, 18274, -17984, -14346, 2167, -6425, 746, 25762, 7623, -30520, -15873, 20161, 14000, -1232, 6417, -2776, -23424, -2076, 31002, 14338, -16301, -10531, 334, -3572, 8112, 21302, -2031, -26059, -8988, 12843, 8502, 2753, 744, -13936, -17227, 6707, 17871, 1134, -9159, -6563, -8440, -1189, 17096, 10626, -13972, -13029, 5154, 5506, 3159, 10892, 827, -18176, -3906, 19959, 9026, -8596, -956]
1609i56K435j0532J2089J6505j9218k0970J6718J4915j0942q55Q192j5725j1083
1622a9427K4250J3848k1795r475J3467l767o587K0088O828k8253q332K5409N319
1635A1573j3911O730M673k1070k227K8969L376k4779p90J2763r445k129K0410
1648A4143j575k6376O31K0468k132q692P814k229j6168O460J8683n639j3235N350
1662b497K459p398Q013J0723j1716j0321J1230N456q420M566O751j2864n710J7192
1676G464L738j5852J146J1016q520o483J5133J807j8251R01J5753n582r831J0400
1690B839K840j6022L178J7036o875j3929R669P293j2496Q87J5030p098j3839J1298
1704a89R927j2963k131J3883n409j2817J1652J0570j5240n111J5983j563j4900
$$ y = [-956, 1479, -9053, 3036, 19541, 323, -20647, -3929, 10986, 44, -811, 7381, -8344, -19427, 4823, 18671, -3124, -12599, 868, -2899, -9486, 10602, 17430, -10823, -19155, 6254, 11573, -2338, 4392, 9065, -12005, -14232, 14737, 18113, -6666, -7456, 5307, -4138, -6267, 14143, 12568, -13808, -13177, 7291, 5159, -3533, 4281, 2052, -14116, -7656, 11027, 5388, -7847, -2497, -38, -7436, 577, 11300, -416, -10737, 493, 5949, -2471, 2095, 8846, -4018, -9728, 7464, 11202, -4650, -3504, 7512, -1008, -7491, 7642, 9449, -8802, -7901, 7852, 2270, -7561, 2839, 5679, -10343, -7165, 9871, 2996, -10933, -1264, 6029, -6467, -5580, 9450, 2352, -11487, -189, 9738, -3225, -5356, 8527, 3118, -9699, 1953, 12523, -2717, -7828, 8155, 6592, -8308]
1717h308P582J1440j3413o282J5288N05j5676M397J2533r170p659J2162R80j3693
1731i314M336J2965p480r211R806K638r774N010J0416j0223q619J2155M771j0246
1745b770K516Q677j0330p185J5023N226j4653j434J0194n707o107J3004K950j7730
1759h326j534J5675j725r889O851L288j3926N09J7910j642j5025K639P320n844
1773c719J616J1801n702j4892O358J2243m370l894O033n458j0233J1027J2967
1786A3777r686j0738N723J480m340Q663O400j4683r644J2064P956o565nJ902j0763
1801h459k493J6010O064j3224n987N415p03K155J0391k462j5774o08J2800L425
1815F550l104J332n792r534Q153J5114l938j2080k04J045j408R031Q287j2986
$$ y = [-8308, -726, 10714, -2699, -8981, 6307, 6812, -8864, -4467, 8066, -1104, -8763, 3399, 4379, -9314, -4978, 7987, 507, -8704, 1102, 3740, -6034, -1024, 9392, -831, -9450, 2705, 7476, -2770, -254, 8423, -1907, -9092, 5931, 11157, -3496, -4930, 5264, -443, -6550, 6454, 9404, -8326, -9860, 5815, 4090, -5799, 1052, 4340, -9586, -9077, 8833, 7191, -7834, -5195, 2125, -3719, -2103, 9698, 3996, -10896, -4538, 7705, 3335, -559, 5474, 16, -10217, 810, 13777, 4091, -6647, -924, 556, -3784, 4879, 11279, -3404, -13048, -984, 6972, 407, 402, 2304, -8459, -10952, 5058, 11122, -2102, -8089, -2674, -3377, -1222, 9169, 6707, -9067, -9675, 3125, 6550, 3446, 4778, -1014, -10548, -2395, 12719, 8781, -3299, -3503, -2458, -3866, 5165, 13452, 466]
1829D66j4564Q328J1671k396j199O00j0326o431J4669J2111r787j0963J915J210
1843d696J902J1052K502j6154q600J1963R501j794q88l739j0425J736J6491M873
1857A3724j2088p262O74J199O982R626o892j6400n84J2394N002j406j933q858
1871e822p912R473J5230k431j2714m379J560L755R781M896j1711j2795N415J2215
1885D561L898j586n340r867j417J4025R392o888j0391l258J106P510J0160k430
1899I475j5158o707Q758R003K318k666q748r264N514J4301L206r085q107k067
1913i227L542J0248P086q024j3493o17J0047Q051J228n334j0110l687J0448J1202
1927A1360j645r300p190j237P399J1358M29j2968r312M430Q918N605l06q535j0986
$$ y = [466, -14098, -5770, 5901, 3505, 2306, 2906, -7420, -13851, 818, 12929, 3142, -7821, -5906, -4696, -2794, 8258, 10760, -5394, -13994, -2031, 7470, 5676, 4788, 1049, -9376, -7640, 8851, 13724, 1636, -5626, -4952, -3753, 3229, 12855, 5963, -10437, -11021, 1373, 6375, 4969, 3036, -5822, -13734, -4261, 10969, 8538, -4176, -8555, -6995, -3240, 6541, 11437, -274, -13069, -7654, 4561, 8459, 6873, 1533, -8334, -9751, 4274, 13666, 6778, -3613, -6871, -5765, 1745, 11905, 9475, -5683, -12390, -3632, 5371, 7689, 5023, -3725, -12989, -7475, 6826, 10032, 947, -7160, -9227, -5685, 4563, 11649, 3625, -9868, -10485, -438, 7613, 8841, 3507, -6603, -10290, 158, 11360, 9715, 415, -6775, -8012, -613, 10745, 11174, -1794, -11106, -6676, 2242, 7847, 7541, -994, -11980]
1942a1980J838J3525O844n994q755n111J308R452R941m038j3674m826P892Q474
1956D896L550k075r226p719N722J3408K909q702p726j715L743Q495N735o965j2465
1971h135j721R717P732m82o074q072l024P223J1063M2j0498p792K295P659O137
1986F070R73p066r675P3J1916Q635m381r710m528K694P064P446j54j0942q608
2001a0193N241J0965L285m318o641o222J122J0302P469o763j1231j550N657N196
2015B319L530j392r235o513O949J0604M04o918m758r48K659P606M469p016q936
2030g176J323P948M486p44m396n611j224O436P424j740q058n399K626O508L999
2045F402j963o354n657J217Q305O157m808r115k204M606M493L416L24p158q005
$$ y = [-11980, -10142, 3383, 10227, 4233, -4522, -9633, -8325, 1127, 11068, 7030, -6644, -11470, -3578, 4896, 8446, 6371, -2855, -10574, -4852, 8556, 11465, 2763, -4963, -6678, -2935, 5560, 11295, 4330, -8135, -9856, -139, 7593, 7111, 1037, -7035, -10059, -2836, 8227, 8269, -2229, -10021, -7726, -67, 6070, 7043, -23, -9698, -9625, 2291, 10926, 6545, -3165, -7693, -4999, 2065, 9511, 9357, -1585, -10193, -4952, 6013, 9298, 4980, -1661, -7883, -6761, 3541, 11010, 4247, -6984, -8534, -2877, 2319, 5849, 4457, -4778, -11291, -4342, 6262, 6666, -252, -5010, -5958, -3299, 4307, 8776, 1760, -7176, -5853, 2095, 6581, 5837, 1441, -4170, -5394, 1042, 8466, 6726, -1332, -6731, -4105, 2403, 6402, 4439, -1915, -7572, -6355, 1950, 8107, 3299, -5816, -8020, -3414, 1079, 4495, 4819, -2339, -10344]
2060a0344M954J1948J240p441l349l55p21N945Q585m661j2084j4Q766J965j597
2075B837J947m538q969M684J2654j863j0622j20L674l114K356P817m168j1606
2089i031K333J0545r26m995K196m82o252L946J0307l162r696J422O103q60k85
2104A163L937l813p123L885Q018q94n571q78K70r77L574L866l410o326j77M037
2120d19L085J9k855l627o25L293K478J173j522n094j762N699M281k649k379O51
2136b53k340j50O790K425p547l231O163Q69l821L932K819q249l262R336K585q494
2152b428k34O391m872m896Q515L223j0266j955R990j173q490M581O572p748l678
2167f468J0069J186r868J568Q737l697n964O392K986p837r0Q846j828p691K863
$$ y = [-10344, -5390, 6558, 7798, 357, -2992, -3347, -4068, 1877, 10462, 5801, -6283, -6297, 2469, 4434, 2837, 4784, 246, -8723, -4039, 8615, 6752, -3870, -3990, -316, -3430, -1074, 6743, 2575, -9031, -6698, 3847, 2921, -2074, 122, -360, -6612, -2666, 7641, 4479, -5217, -3795, 2308, 1448, 1163, 5100, 1287, -5836, -1951, 6067, 5173, -398, -1276, -1006, -1983, 1591, 5457, 2047, -4279, -4456, -419, 2666, 2685, -170, -3797, -4422, -1129, 1349, 2522, 1000, -4094, -5856, -157, 4124, 1475, -904, -253, -2593, -2743, 4047, 6472, -1075, -4306, 1857, 2726, -1095, 2837, 5656, -2593, -5855, 3481, 6066, -2428, -2662, 3729, -1143, -6039, 2476, 5699, -4567, -6522, 3468, 2295, -6195, -1614, 4958, -2790, -6468, 3601, 4787, -5081, -3513, 5224, 1527, -4437, 1955, 4941, -2896, -2986, 5860, 4032, -3659, -796]
2182g96N058m428j774N526p55o791J854M995k154k926K471l16l353J810L679k229
2198a29k759J529R82r71R05R21j637J12J509j59m69J642j009j274K351J780l719
2215c95r33L950o72l098K618J713n422p29O756j12o906J164M549m478k215P681
2231C471O66j0032k77Q816j046n245M287K244q280k66J0923K41r101J324M876
2246B601l726q13P876n62j0070M65Q254n08l876K906o61o848K247Q540j780p164
2262c119P94K434k428J587M792l348o796K671N196q33j476R03k691k350N232L915
2278D483l769k864J164L74R65L776n79n361j336M257J738O7J14l775l974M196
2294e24O014k544m854N05o71j575N446M444p027o959M769N104k024P35J873o899
$$ y = [-796, 4262, -166, -1940, 3586, 2831, -3960, -2106, 2889, 735, -2191, 280, -36, -3389, -1579, 2100, -129, -2888, -1359, -377, -1348, -443, 478, -1159, -1047, 462, 303, -166, 1476, 467, -807, 1544, 3324, -395, -1328, 2622, 1950, -1148, 1470, 3183, -2239, -2968, 3788, 3676, -3230, -2066, 2483, -1995, -4210, 3471, 4137, -5895, -6172, 2644, 1598, -3647, 640, 2884, -5396, -5662, 5261, 5502, -3599, -2275, 2601, -1125, -1938, 5938, 5376, -4694, -4229, 4025, 3517, -359, 2547, 1886, -4962, -2715, 5825, 4045, -3119, -2325, 109, -2319, -732, 4060, 712, -6084, -3413, 1783, 950, -526, 377, -2314, -4664, 568, 4483, 714, -2150, -986, -612, 353, 4129, 3550, -1811, -3147, 1110, 2848, 2915, 3029, -746, -4720, -524, 5490, 2946, -1908, -1403, -2074, -3649, 1797, 6241, -786, -7745, -2976, 2128, 104, 839, 2712, -4187]
2310d187m373R427O855o572m630K748p45j719P675M095r672o299P363M737k512
2325B191O66K59p245k193R802M377p521m025K017j016R85O463l71r298k284P142
2341e1K685k096Q28k287n712K905Q679J77p344j366K193O26K686M079l664p221
2357d883J215O612J698j461j764m056j913N574N587l194n443j451L98K853M677
2372D449o29o907l334L596L757J781j4m147n568K309Q348J593m999k798l68j17
2388c048M408N524l131q074m41N565K837O11o24m981m258M342P189r20n330k629
2404b960n15J575N006K400n868n832K013M478J767O26k350n594q69O812M548l292
2420A945l884j184J14L047M982j89o702l065M149L796Q36k8l596m794J628O885
$$ y = [-4187, -8560, 867, 7722, 1150, -3480, -732, -1477, -3196, 4479, 8574, -1098, -7397, -34, 4703, 2191, 2857, 3116, -4129, -6322, 3480, 7857, 336, -3689, -1672, -2688, -1703, 4760, 4389, -4909, -7193, -51, 2634, 538, 1366, -921, -6633, -3728, 4951, 5128, -2216, -3582, -1389, -763, 1923, 6002, 2338, -4883, -3668, 2944, 4642, 3181, 1417, -2639, -4552, 1022, 6609, 3415, -2028, -3479, -3081, -228, 4449, 3820, -3087, -6421, -2825, 932, 2713, 2699, -1448, -7016, -4707, 3641, 5234, 235, -2563, -2931, -3048, 1360, 6884, 3753, -4321, -4762, 803, 3640, 4251, 3627, -1354, -5612, -1270, 5919, 4999, -331, -2960, -3475, -1900, 3106, 5506, -362, -6194, -4181, 297, 2064, 2690, 340, -5254, -6123, 689, 5237, 1945, -1939, -3123, -3009, 38, 5020, 4831, -1871, -4936, -787, 3009, 3845, 3817, 221, -4573, -2945, 3940]
2436C940J963m416m013q50J164L967L075l011o111o77L609L200J123j955m722
2451c714k199M457N404o87l933k416l85K354M762J414m724m481J624M234K289
2466C999j4k945m138l71N219L487k160m124k304O87L380L372j461m879k335J731
2482b856L712K124j457l899k667K356M332J694k478l263j422J728M382K128l147
2497A267m068L96K415K863J039j766l714j807L712L806o43l104k592n41K579L035
2513B877J6l665k948R81K626J668K70k665l229K47M208K448j696k754j614R47
2529b283L048K742j365l277j542K018K852J157j076k800j651J592L286R78k237
2544A442k783j153J930K484Q30k581k322p17J781K460M40k169k628k76K565K032
$$ y = [3940, 5903, 1487, -2526, -3376, -2212, 1755, 4830, 1819, -4292, -4969, -1360, 1840, 2963, 1008, -3714, -5913, -1456, 3948, 3261, -672, -3088, -3473, -1119, 3643, 5057, 333, -4148, -2524, 1710, 3999, 3985, 1040, -3098, -3469, 1750, 5237, 3077, -1047, -3351, -2664, 716, 4088, 2627, -2252, -4587, -2856, 856, 2980, 1523, -2376, -5043, -2687, 1645, 3339, 861, -2402, -3824, -2096, 2286, 4414, 1267, -2801, -2405, 10, 2873, 3912, 2146, -1568, -3375, 337, 4143, 3500, 396, -2196, -2737, -158, 2877, 2893, -772, -3720, -2739, -113, 1555, 1825, -840, -4069, -3822, 386, 2834, 1138, -1616, -3230, -2283, 765, 3507, 2142, -1135, -2677, -659, 2193, 3350, 2274, -526, -2177, -585, 2701, 3679, 1442, -1341, -2494, -564, 1920, 2750, 169, -2153, -2870, -1089, 1371, 1811, -358, -2986, -3262, -697, 1335]
2560A335J75j987j995J4K262K314r6k232j516P41K115J537n92j710j507N15K152
2577A525J121o95j834j614O75K031Q04j315k149p30J089J576N50j280j486n84
2593b316J163J410O60j299j691M25J296J042N27r17j556J00J758J363m80j115
2609C70n62N0Q12J279J15j663j539P54J531l1r75k81r96n2R64J042j074j396j9
2628a671J222n6J39L83r53n49O37J317J36q39m20N95L82M77K95l60q86M17R83
2647A249Q4o16j20k55m4K97M84o94o26o56M96R78n28j006qJ11K14kM03n71n74
2668a384L82R85K72q73P5J39K7N52J255p87j081O02J023j26k55J71m01r51O61
2687B86J339o33j435N4O60m36k74Q73n54j467L48J831m10j655K42Q03q67N14J462
$$ y = [1335, 1510, -477, -2472, -2458, -196, 2118, 2022, -210, -1726, -985, 1130, 2667, 2075, 365, -1142, -627, 1525, 2646, 1951, 117, -1497, -822, 1209, 2013, 698, -1451, -2181, -1092, 484, 1034, -246, -1732, -2316, -1153, 257, 917, -382, -2073, -1648, -352, 690, 1217, 300, -1256, -1156, 602, 1965, 1485, 370, -192, -142, 670, 1949, 2064, 401, -1138, -384, 1147, 1116, 141, -140, -1136, -1188, -224, 818, -256, -1652, -1671, -449, -505, -366, 17, -936, -1485, -848, 469, 605, -234, -654, -59, 323, 800, 1095, 735, -151, 266, 1249, 1333, 717, 597, 342, 298, 595, 1079, 385, -241, -897, -401, 577, 49, -957, -965, -854, -640, -642, -239, -810, -1384, -1002, -17, 255, -618, -543, -404, -377, 175, 1430, 643, -438, 164, 1187, 1061, 806, 977, 576, -375, 286, 1625, 992, -443, -389, 271, -165, -439, 434, -120, -1587, -1239, 592, 182, -1473, -1231, -428, -1295, -781, 681]
2706F81q28j733N89K484k68j235N07K05p17M66K239l05k692j22J798M37p93L52
2724A065n52j726J45K183N34j777j235J44O10K54Q47k27k017o78J737J535o60
2741A82q78k14l07M64J637Q99j170k003O87J889L68m45o28n70l78J295J493n10
2759A811k283m84J187L08K26N9j010j936N51K378M67k334o30O15l61P83J629j51
2777H25l219l90L229J197j364k08o4j365J40L589Q34l274j344J706J003j23R40
2794B112k31l109r52L351J598k465j549N72m21m01K545J170l749j985J924K518
2810I28p99n05m8j239o57K324K330j544k408M03J341Q71N28L95j777j743J333
2827b67K637o9k005o08M2J05J089R30j128k452m67K381Q31r12r26k66q16O21K136
$$ y = [681, -147, -1880, -1291, 1193, 925, -310, 197, 402, -315, 151, 2390, 2085, -607, -729, 1069, 1506, 713, 1065, 513, -1213, -1068, 1115, 1649, -128, -1363, -1219, -609, -355, 492, 265, -1752, -2430, -693, 842, 182, -696, -910, -1217, -753, 884, 1783, 613, -1390, -703, 1186, 1554, 1109, 481, -89, -467, 828, 2321, 1811, -472, -956, 231, 539, 765, 824, -186, -2122, -1571, 807, 1274, -1060, -1690, -1075, -1436, -653, 976, 825, -2394, -2784, 445, 1642, 278, 70, 6, -1359, -1219, 2370, 3204, -70, -1414, 292, 1295, 1172, 2112, 1881, -1228, -2180, 1171, 2769, 304, -1245, -673, -1094, -1495, 1050, 2220, -1529, -3514, -1590, 928, 129, -376, -424, -1663, -2320, 4, 2334, 790, -1618, -1215, 126, 997, 1525, 1920, 143, -1600, -267, 2370, 2301, 296, -312, -270, -165, 924, 1854, 726, -1726, -2193, 188, 1019, 107, -819, -1085, -1901, -1280, 856]
2846H56O57k836j457J858J554l98L00J35k246l29L064K115k592j648J007O71m73
2863B38J836J047l471k490K893K730j722j256M88j456j302K798K569k831l435
2878c364J466J890n32M08J090j965k380K462K995q61k296L60L63n29J746J635
2894B488j307k736N91K698R9n55l81r58o93J172J777n64k109o12N11Q02M67n54
2912A36q98j245M10J745R20j117j856P3J197O40O66R6j457j402J599K357l76j566
2930g8j53J66j35J033K143j534l132N88K842k33j396O91n00k392R19L302q04l296
2948a969K59J770q25n45K399n41l728P86L632J18k393N84Q85j506J17K913K2l189
2966a211r6K442J54r16J059k41k282M56K642j98k172k39O78l48R7J478o52k185
$$ y = [856, 1513, -1323, -2780, -922, 632, 234, 534, 669, -1577, -1906, 1158, 3273, 681, -967, 40, 711, 238, 2074, 3121, -350, -2840, 53, 2783, 1061, -195, 293, -1163, -2465, 333, 2902, 71, -3364, -1898, -8, -540, -132, 958, -1007, -3387, -925, 2070, 1209, -1087, -727, -364, -893, 853, 2488, 1181, -1555, -964, 1734, 1833, 1278, 897, -61, -754, 418, 2195, 1631, -478, -1090, -579, 223, 690, 136, -762, -2007, -1597, 148, 1068, -49, -1905, -1832, -635, 5, 671, 767, -690, -2092, -493, 1864, 1488, -78, -231, -65, -200, 833, 2976, 1442, -1690, -1102, 1740, 1507, 111, 802, 302, -2090, -1171, 2131, 1327, -1969, -1710, 60, -765, -1310, 1089, 548, -3180, -2394, 1238, 1356, -1037, -453, 432, -1074, -957, 1956, 1978, -1211, -1307, 1135, 1289, 373, 1432, 1191, -1091, -635, 2007, 1809, -363, -602, 76, -272, -175, 1303, 651, -1534]
2984a534j61J468N36p76J54m91q50P21J616k24j277j50L12P38P01K85o69r49M06
3003a44Q40R66m14q39o52N75O47ml16k58j059J58J165M33j241j253P68M86q58
3022a000J128N21j998j111K064J300j293n83P69m14p84K029R35j596j162J594
3038C99P38q16M05P23j600n71J731Q43j526q10J146n94m68R52J44j601m90J257
3056a38J86o83K49R7j115oJ652M1j457K93Q93k90k27J184p9j351J78J601J51q80
3076B99L30K3p19O11R71m05j099r5N40k43K69o9p68o74N83M36q4m49N2m94l2J035
3098A8j35o31m0N66k91L66Q56l69j308Q01R63j21o87P76M5r23M88J445q49j202
3118b32N18M42m47n7N14o86j367J238P19q01n23K58l27m51R24N70r63o02Q56L03
$$ y = [-1534, -1695, -227, 309, -467, -313, -804, -1654, -933, 683, 459, -818, -968, -656, 82, 783, 1068, 399, -550, -144, 696, 1662, 1248, 409, -243, 332, 979, 975, 659, 401, -658, -500, 665, 1098, -143, -1396, -628, -142, -1000, 128, 649, -1349, -2460, -396, 904, -389, -972, -203, -617, -1401, 628, 1563, -33, -1195, 399, 1137, 321, 726, 1449, -151, -722, 1009, 1852, 326, -484, 662, 68, -400, 552, 696, -905, -1395, -138, 48, -635, -386, -289, -1404, -1410, 242, 283, -1174, -881, 12, -278, -505, 679, 600, -751, -573, 1028, 1179, 299, 629, 652, -67, 544, 1515, 1110, 11, -84, 456, 213, 482, 413, -355, -1029, -446, -10, -94, -543, -491, -985, -1017, 18, -117, -748, -788, -222, -513, -147, 709, 340, -968, -167, 796, 675, -12, 764, 809, -114, 374, 1819, 970, -232, 286, 728, 281, 224, 738, 52, -1315, -77, 642, -159, -682, -424, -751, -1202, -278, 292, -671, -1273, -417, -114]
3138a14l50N59M76j112k41J743L52j168L5O25m50j68J072O6j433j58J096j99n39
3157I2L72Q3j278R8J270k89j313J46K89j94L30L78l90r20O53N08p8kM79p67k48
3178g81J230N69p44j59M55p1n84J236L47j551m76J327J53p70K78q0r85QJ184L4
3198F20j357l85Q35l68k7P18l14j201K79J142r7j29M20o99l82J167Q94r28m04
3217b16O36J32m74Q35Q27j586m92J283K91q00j08L72q99o41J202O47j515p80J032
3236b54o0n93Q39K00j321k88J477L9n70M9M35p21J37J692l08j001J4O98k19N17
3256G62N73p24j182Q04P29l46k95N53p19p91R56O10j068p40M13J55l03K20L99
3275Fq75n49R11M95l34k14L66p92L18J367P7r83j31Q44j95j70R84j05j116J3J385
$$ y = [-114, -464, 95, 571, -541, -782, 961, 1313, 145, 180, 805, 355, 187, 1259, 1325, -108, -266, 830, 631, 92, 464, 547, -731, -633, 637, 348, -965, -819, -530, -724, -394, -16, -406, -1326, -673, -165, -243, -245, 234, -533, -781, 449, 1018, 274, 115, 570, 499, -85, 1151, 1498, -53, -529, 798, 951, 181, 459, 379, -606, -598, 586, 620, -737, -1122, -287, -655, -682, 36, -278, -1479, -1200, -58, -155, -284, 136, -563, -945, 222, 1116, 188, -216, 420, 552, 78, 913, 1740, 154, -338, 945, 1236, 436, 328, 700, -199, -840, 362, 1009, -506, -1286, -254, -314, -907, -68, 132, -1189, -1477, 0, 39, -531, -482, -47, -768, -631, 1061, 753, -248, -234, 464, 245, 762, 1335, 611, -571, 233, 962, 616, 321, 874, 155, -636, 320, 930, -138, -878, -465, -310, -613, -393, 6, -869, -1418, -507, -12, -346, -560, -194, -986, -668, 699, 776, -207, -338, 506, 311, 141, 1125, 1020, -96, -83, 1302]
3296A302p33m95O19O7j106L65R16m93j530O62N43o60j8R43q32j256Q15J102n78
3315c67n31O21mp41Q43Q08m89n49L95N03j90K84K90o81j16M19N32m68l21L16n54
3336@k84P03N8n78j77K6k04J20M39o69n19L68O16m58R8K72k68l58O44O01p12j17
3358c99Q74j28n15Q31N01q61l77J033J41q21K75N31q69m59R19J88j259m8Q28m45
3378f0q54O94N47j150o06J397O8q14K8P68m17n29O30O61p17l8O63Q8l28K68N23
3399H22o09j80P72P4o59J17K43l25j33K83p0j63l86O7o6k7j48k0r4J9r6J6K20
3422c43q9r0L44o5j08J18N82j41m76N32M44n28k17P10K35q59J88R09n30q55P66
3443E27K35q38k91Q71O2j321K00J029q45o82O92N02r54k00R25l4o14p8J119n43
$$ y = [1302, 569, 74, 693, 760, -346, 19, 935, 442, -1088, -426, 117, -543, -561, 382, -450, -1706, -891, 211, -367, -898, -277, -281, -1022, -179, 629, 140, -409, -14, 489, 299, 583, 873, 192, 76, 495, 1027, 559, 238, 554, 0, -284, 419, 477, -101, -278, -252, -456, -336, 103, -566, -1085, -717, -101, -559, -461, -189, -457, -815, -171, 430, -282, -399, 475, 347, -168, 663, 1164, 303, -74, 959, 1100, 279, 554, 1085, 216, -243, 676, 864, -395, -443, 385, -60, -914, -220, 327, -823, -1429, -32, 36, -778, -750, 18, -399, -928, -298, 363, -354, -392, 271, 359, 31, 299, 822, 213, 33, 805, 879, 220, 337, 580, 255, 122, 405, 335, 172, -214, -147, -213, -240, -388, -408, -502, -483, -579, -563, -343, -432, -522, -178, -243, -351, -233, 349, 208, -268, 264, 708, 180, -37, 673, 908, 49, 237, 1146, 616, -239, 527, 762, -76, -367, 504, 566, -755, -555, 474, -371, -1053, -361, 141, -813, -1013, -88, -122, -736, -814, 305, -238]
3463b38o84J061N57r94p4J070j96p08N19M57j43o79P38K76n66n09N66M3q02L82
3483G6L41m63n58L95J62m81k57N31j78m84K41Q57m17p98O57L37p5k08P03J00p83
3504c02K18J074l52m96K95L73k96l10P20J1j023k53P91J05q76K47K54o53k72N39
3524b06L87r73l5M59n1k37K44O70n84o17Q18N50l95l88L66M28n20J86P76l68o15
3545a05M02M88m12k06N51j38p74K55O67l12j051K80N43n65l24O89k26p61j16J090
3565b5j12p02J19O12l54r5Q10J54q32K2J154j34n45M48M19q57o7R95L30j182l62
3586b04O67L5p50N41N00j168n07P44O04q19m06N22l83l80O24O51p91o04N94L10
3606b20o1K30L53l75m64N56Q12j97n20R9M53k67O5N94j98j174L09N95Q7n74j87
$$ y = [-238, -922, 139, 696, -298, -372, 698, 502, -206, 313, 770, 627, -52, 686, 962, 396, -113, 453, 496, -306, 76, 417, -46, -604, -209, -47, -528, -785, -254, -432, -916, -675, 182, -235, -1033, -376, -39, -114, -322, 381, 481, -302, -84, 990, 638, 142, 437, 810, 514, 204, 924, 935, -88, -341, 450, 555, -321, -74, 180, -473, -745, -206, 181, -792, -827, -368, -419, -656, -412, 258, -326, -943, -125, 425, 30, -358, 8, 436, -84, 102, 878, 510, -105, 297, 785, 373, 167, 718, 580, -194, 61, 728, 416, -635, -355, 188, -377, -701, -12, -238, -999, -1115, -25, -137, -839, -720, -108, -462, -557, 253, 407, -425, -403, 751, 617, 72, 520, 939, 82, 15, 1010, 1340, 158, -204, 463, 498, -252, 289, 789, -379, -886, -142, 462, -357, -763, -241, -624, -1004, -380, 271, -520, -1124, -530, -220, -281, -51, 302, -73, -537, 19, 831, 634, 114, 213, 666, 399, 464, 1058, 860, -314, -5, 590, 677, 103, -84]
3627h4K44p44J44N54qp78k98N06K07m54L13L90q48k5J079J11l99n09P28Q4r0M61
3649E84R5m71n90P84P82n74l81K68m57m74J025N11q57r79M23L61j00p0K05o36
3669e51r01R56P81m81m06O1J82k30M54M51j22r21L58Q16K3k05J36p4j91K92N37
3690I65k50m33r0jL56K2o5n49m09M5N96K42p14o19K78O1m9L97J26p80R9L64N51
3713A43r9l68j01L05l01O25Q10o15o53K42P74k64J28R2l58n95L65Q80l88r54K19
3734a13K42n97K61N56n19r30L84Q29m76j82J97j00n29O19N28J8n04q4M39P3j58
3755d6M96L7n51L75M28k0l71N9K2k25K53M00j02q29Q4j35K02j40K5m45K5r1K36
3778c13K18k1o78qK92L46p4K0p5j69L00L84L29j75l65K19K17o6M12L1p41LL93
$$ y = [-84, 160, -584, -440, 114, 106, -672, -970, -464, -257, -711, -398, -8, -856, -881, 198, 309, -90, -599, 129, 213, 123, 584, 679, 208, -382, 402, 1184, 610, 229, 497, 40, -434, 591, 1102, 245, -734, -311, 50, -50, -120, 85, -551, -1452, -496, 285, -196, -602, -541, -359, -589, -135, 316, 194, -727, -369, 447, 470, 265, 401, 327, 136, 428, 965, 715, 282, 192, 191, 547, 569, 504, -45, -454, -409, 187, 429, -285, -904, -626, -565, -614, -217, -91, -871, -772, -408, 143, 44, -324, -425, -120, -421, 204, 1014, 399, -254, -12, 762, 498, 626, 718, 360, -235, 130, 1010, 622, -332, -113, 129, -468, -207, 349, -170, -1100, -716, 113, -363, -545, -348, -448, -977, -358, 170, 188, -316, -400, 39, 112, -46, 450, 487, -64, 311, 739, 719, 348, 407, 429, 204, 457, 857, 755, -74, 10, -125, 77, -63, -38, -483, -458, -549, -313, -95, -116, -794, -802, -510, -164, -238, -218, -293, -462, -162, 222, 551, 376, 11, 230, 447, 381, 793, 824, 83, 86, 479]
3801D79K73l82k98K39m91K5L25J55n84n19M74nk55J36J89m56j68N56K86k42Q0
3822a83K15m34P1O80K80m10l16O17j85jQ1L19l34k93K13N48m35j92j67k60P7M17
3844C08jo59j87J96J9j91M21k24m99k0O45j53J7J0p5L3O03K76k02j66k95N45p1
3867C30L81j29k98l00J28K88J82k15j86l47p7L23O9l00j92k14q1K37O28l66n47
3888f86KJ05L03J41M7k37l05M30N33L9k73L8j2j04M03M37l17m92J53L66j2k6p1
3911D62m44l58K87L86j42m05k55J28o3K19K74m28n90K55N02K0J73r4m27lN17M81
3933D95k24k82n5J50R6N21k6m79k30L37J72J40j25l60m02J73K82K5n4o14j12J96
3955c76N51q4m15k62rlL53K72j21m09K6L19L99m9P1k27k65K73M94J63m26Qo6j2
$$ y = [479, 752, 370, 72, 311, -180, -155, 170, 325, -259, -778, -304, -309, -564, -428, -239, -695, -863, -307, -21, -263, -183, 32, -402, -331, 349, 629, 219, -97, 520, 335, 334, 415, 734, 400, 107, 320, 868, 433, 241, 74, -186, -109, 308, 307, -352, -539, -343, -324, -515, -94, -318, -817, -837, -192, -345, -328, -318, -393, -360, 243, 519, 317, 151, -144, 401, 330, 711, 582, 284, -16, 112, 400, 582, 367, 181, -166, -243, 80, 149, -151, -343, -557, -638, -401, 227, -139, -686, -684, -579, -276, -135, -88, -325, -630, -200, 333, 372, 99, 137, 125, 21, 424, 861, 544, 52, 205, 571, 559, 533, 462, 18, -340, -53, 333, 191, -214, -469, -341, -404, -185, 89, -339, -929, -674, -172, -152, 21, -73, -500, -503, 14, 495, 271, -11, -66, 84, 180, 701, 675, 196, -34, 303, 475, 615, 490, 130, -272, -99, 183, 208, 154, -460, -572, -376, 175, 91, -324, -586, -595, -598, -245, 27, -94, -503, -477, -158, 241, 192, 263, 36, -229, 44, 538, 701, 275, 283, 217, 205]
3979B05M50J56k94n76j62N64p5j70k22j73k00K67L34j85m40q4j60K79L37J14j75
4000b10l57L5N92L22l13K70l20J28O5K99L5k60j14P1J39K25k0k51l43J66jK56
4022D14j39l83l87J94K59k60L1k93m8j94M11Q9j12k1K12K8K7K28J55k50k4N17
4044D54p4Q9l31L81k14j72K22M86m94l98J73k0j6J61km54j22K69m7J60o68K67
4066c50j36m9J49L31k44k93L74Q0j1L13n6j18k0k3O38k0l61j85K77N4L0K93q3
4089E90o87K12J09R4p0k67j70k03j7M40j12l15k86L6J76K53P4Pl12p6K21K74K86
4112B57j35k41J61N7N66q9j61k70l0L05Qk5K4j73l00L7M30r6o00J10n1j77K19
4135a74J55j31m66o0O42k14j78J91Nk44J83O61j52m68j10N73J75O9j04L7m83J95
$$ y = [205, 655, 811, 517, -59, -221, 343, 268, 98, -124, -297, -497, -230, 104, -81, -521, -605, -765, -486, -149, -35, -210, -567, -532, 60, 382, 69, 339, 19, 147, 212, 511, 546, 286, 172, 243, 382, 607, 587, 336, -7, 159, 158, 414, 275, -108, -495, -301, -42, -302, -271, -564, -612, -806, -395, -306, -418, -439, -227, -199, -172, 56, 211, -39, -63, 454, 380, 469, 138, 519, 305, 133, 355, 841, 347, -51, 122, 102, 86, 247, 245, -209, -331, -62, -109, 51, -617, -350, -486, -535, -386, -55, -299, -592, -218, -138, -149, 164, 108, -10, -30, -53, 585, 565, 204, 19, 296, 350, 380, 673, 590, -97, 115, 224, 318, 248, -19, -189, -392, -409, 31, -81, -396, -682, -646, -470, -217, -143, -136, -448, -524, -303, -29, 257, 122, -119, 42, 99, 665, 576, 415, 145, 115, 420, 428, 403, 427, 254, -46, -9, 421, 325, -275, -165, -216, -393, -174, -19, -150, -616, -676, -34, -248, -426, -235, -230, -474, -291, 370, 218, -250, -360, 213, 388, 457, 353, 390, -93, 102]
4157A02M96J44m04k78M4m7K08J57j71l61o38M28N52l08l18r6k94J91M69J68j00
4178e6o77O1M39L2J13J60k02r4J23P90k5l44r8m1L0K64L82m30o41n2O24K27l58
4201B27j31l36l0j14M14R9o13k39M23J39j18R8k53j87J5O65L00k98m22LN53K03
4223C98J44J84n01m64M37N14r0k54j07l41l9N89L54o92n27k8L88J38N3k06l39
4244c89m20O4Q08m9m49m8K09L4q4P52j87p15J68M97L87k88oj77r4K24M04K22n12
4267C51k61J1K05P9k5p7n51Q0K89J80k12o61K42o9JL98j9m72l60M28O09k24j3
4290g1j07j47K26M19N01m84m18J33J72K20K30N0n50j95J99K48J42m65j48j53j84
4311c82L75J39l08m19j82M44K94j80k85J13l97L03N06K13m89l64N17L61j01J91
$$ y = [102, 598, 742, 338, 60, 104, 57, 265, 422, 251, -110, -748, -320, 232, -76, -394, -490, -784, -593, -124, 44, -56, -733, -672, -233, -201, -88, 72, -130, -224, -101, 689, 664, 320, 222, 181, 211, 475, 857, 427, -214, -266, 358, 585, 227, 96, -240, -270, -384, 30, 129, -484, -723, -300, -161, -279, -181, -434, -621, -606, 59, 359, 61, -361, -358, 195, 398, 542, 726, 225, -239, 198, 712, 622, 368, 261, -80, -119, 470, 824, 132, -395, -423, -35, 103, 156, -50, -389, -809, -745, 63, 14, -435, -483, -274, -240, -324, 428, 241, -474, -306, 191, 578, 290, 284, 107, 13, 237, 641, 863, 351, 90, 101, 306, 385, 360, 283, -268, -188, 101, 281, 69, -592, -350, -419, -418, -20, -39, -511, -871, -443, 166, -58, -71, -178, -325, -99, 320, 821, 337, -81, 52, 224, 444, 674, 724, 174, -21, 178, 426, 568, 103, -45, -198, -382, -7, 132, -176, -595, -777, -333, -39, -219, -504, -391, -788, -485, 21, 234, -255, -619, -102, 259, 158, 349]
4331C49P7l90l16O16M22k49m42J05j48K38J53M8l82o17J97M44o7m7k52k73k4J63
4353c95O25n10l59j9K06K06L20nl02l75N83L83j41K0k1j11m5K61L62k56m30QM50
4376D55L6j49j26k70j19K2M78j02n29Jk19K23K27O3o9n13k5L25J46Q5k19p1kJ38
4400b14M90O8Q0m10N1O0M28J03j76l67lJ69K98R5n63l59K33k9N3J30l00m01n0
4423f14N59rq4p7l81K43J28K23j17l36j8M62J72n8K16j10l49l8O69K06m88J4k38
4446b5L78J3J46p6l88k34K83J36j87k80o0l9J0J06J43j09l21k46M34M60j45j71
4468a72j07l2K03L91l9m3j78K27J61q7K48m42k7p9N33j75J3j96l33p7J93K24j93
4491A3j41k79K09K5k08J32J57m14l4N11Mj06j15LJ61j17M31j05Pm6J20K38o1j03
$$ y = [349, 426, 36, -280, 336, 758, 509, 67, 172, 24, 262, 415, 463, 81, -536, -339, 105, 38, -9, -261, -534, -558, -395, 230, -280, -639, -658, -452, -246, 74, 69, -233, -608, -25, 358, 217, 237, 216, 105, 60, 321, 683, 427, -3, 5, 455, 491, 342, 216, -54, -173, -151, 327, 225, -304, -303, -522, -299, -72, -9, -78, -591, -616, -291, -145, -60, -279, -350, -352, -214, 276, 344, 424, 14, 65, 125, 553, 656, 480, 113, 110, 279, 577, 672, 109, -250, -17, -46, 7, 137, -163, -564, -614, -55, -64, -148, -225, -606, -363, -235, -12, -129, -465, -483, -21, 151, 93, 309, 199, -150, -188, 481, 687, 199, 213, -25, 353, 366, 512, 436, 48, -186, 97, 233, 46, -234, -294, -333, -323, -217, -74, -183, -504, -750, -316, 144, -1, -172, -279, -311, -108, 283, 244, 201, 23, 250, 411, 324, 572, 130, 103, 24, 557, 382, 395, 199, -134, -211, -18, 206, 13, -128, -407, -198, -173, -381, -249, -92, -506, -540, -29, -25, -131, -246, -243, -82, -199, 232, 127, 134, 88, 208, 446, 385, 282]
4515B82J75l54P1OJ69j06l47J89m0j22O3O0m02j4K42j67L38j98k05M1n0J84J31
4538e4j70N6k27J3N27n0j8K5P0p6J26J05J00k48K30m7o4J34K7l88M8j88K11j25
4562A7n8L9j75k69J25J03j7k74K05J73p9M8n6r5%j22L61J34J60o4k64R9K55J44
4586C90O1k82J91j90k9K04Q4l23k50K9L74k43J51L9m46j93J07L60j84l02p9K99
4608b32j7P8R5k74k8J23L38J41n1j25J5O9K47J6J63k03k35K05M4J61l84k43R3
4631dQ4mJ31k46k21k45K51j1K58j39k03j79L4L67m7j4l39J99K26L43j4o0l07J54
4655A4J75J39J06k2j76k99L73K44Nl13l38J54J34R4Mk08n88J42J67O39l46n02
4677d02j16p8K33M14J56n93j40q8O65Q2J88m33j68J98M74K53k14m07N5J22K80
$$ y = [282, 457, 103, 174, 180, 349, 243, -104, 85, 45, -77, -14, 46, -356, -370, -128, -295, 43, -155, -360, -319, -369, -185, -54, -224, -168, -395, -382, 145, 95, 77, 102, 172, 96, 222, 327, 427, 179, 409, 362, 298, 432, 459, 71, 119, -69, 142, 17, -41, -2, -177, -446, -321, -218, -235, -509, -304, -131, -210, -162, -218, -313, -313, -435, -74, 60, 220, 156, -108, -9, 246, 390, 451, 169, 360, 170, 141, 345, 429, 106, -144, -115, 259, 16, 167, 206, -240, -433, -326, 34, -150, -452, -531, -232, -249, -171, -76, -350, -378, -255, 83, 224, 173, 48, 63, 132, 379, 395, 558, 355, 120, 325, 369, 530, 146, -97, -4, 80, 76, 207, -39, -260, -505, -254, -265, -7, -146, -349, -528, -494, -127, -174, -188, -527, -328, -102, 241, 227, 167, -140, 14, 189, 328, 434, 412, 236, -63, 310, 554, 559, 246, -92, 62, 196, 290, 294, 86, -502, -360, -193, 446, 100, -402, -518, -596, -363, 51, 207, -386, -526, -614, 51, 133, 321, -112, -280, -82, 392, 645, 431, 24, 79, 201, 481]
4698D81J87k78n07J23k75M73J7j5m95j34Q7L96L0j79l70k25M22L66j28o50J48
4719e26Q9J61M99K09l20l00J29K71K18N4j4o27J22N83L36l49l35l72K10oL79r6
4741C15m07m26N0N49K54m66k42l25JO69L14l15n78J03K56K54J28J10l82k92L49
4762h1L56L60k12l93j99L41L18J52l73m36O1K12K48o2n21o5M6O7K10Q6l57k74
4784e16K6K94J18L8l13m79K54N29M67k47m82J38J47J76L66Jk76l07j95P33L20
4805G92l15j84n26K98J10N49n21l19m36K94J86K71j87m33k51K19O15m3n73o5J62
4826c57P8L08K53k48l13k18N25K96q3Lj57j31K26L58rk36n05R5K08M51j38k46
4848A60k13j59k7N01j71k66k89r8L70Q1J47j67m45J21N61L8r1j30k41L53l00O61
$$ y = [481, 668, 390, -117, 6, -269, 204, 221, 206, -289, -423, -336, 60, 90, -89, -459, -684, -262, 104, -24, -674, -526, -437, -276, 223, 432, 112, -188, -59, 212, 430, 484, 470, -157, -35, 548, 884, 535, 200, -172, 38, 32, 411, 315, -92, -518, -468, 81, 335, -131, -373, -698, -697, -28, 286, -29, -607, -504, -248, 6, 134, 244, -138, -430, -81, 275, 635, 423, 30, -169, 172, 490, 642, 269, -167, -106, 106, 354, 292, -229, -294, -248, -181, 29, 115, -242, -516, -490, -196, -78, -40, -353, -832, -578, -49, 418, 171, -311, -173, -26, 150, 516, 517, 241, -66, -261, 472, 792, 477, 293, -233, 65, 175, 724, 203, -116, -552, -258, -72, 199, 12, -421, -672, -453, 162, 119, -454, -519, -357, -279, 29, 282, 34, -279, -497, 28, 324, 241, 244, 87, -44, 182, 540, 531, 295, -210, -115, 93, 544, 406, 160, -53, -212, -239, 262, 91, -175, -464, -562, -192, -111, 36, -131, -576, -455, 106, 144, 53, -77, -318, 35, -265, 396]
4870C96M7l17j53N5J50L88j6m48j24JL58L57m64k59j04J14J8J27O8n28k32J58
4892d08M22j22p6k36j35K17L17J23k31o2j31J54M41pM8l50K2K10J85J44l66qk7
4915A24m6L63l3k35n18K08K49p2q2Rj65k21J45L86j42m38J1J34K62j7p4N2k39
4938c39J81K19K80j94j21j72N3K52K83o3l09o9K11L71l35j61L9Q9l90J57K87k06
4960F3l40NP6J01j63L20l09m17J55M48N9j71j0J26p7J92L16k60r9K2K12j2J52
4983C89L0j94j78J88K8K14m31j54K68j29r3K61j63Om44L13P6k51j04LJ29j40K65
5006a11R9p0j89K74k6K8%J72j53k61N19l4J33k95P5J49j97J08k3N9m1k80N4m4
5030e4j72M98l23j80k97M79J20m63O6L3m2k4K10M2L9k63P9L30J4K03n6j98l5L18
$$ y = [396, 443, 126, -27, 28, 178, 566, 550, 102, -22, -21, 337, 694, 230, -29, -133, -19, -1, 126, 194, -334, -566, -408, 14, -108, -184, -420, -555, -338, -21, 102, -129, -191, -322, -168, 273, 266, 314, -36, -14, 196, 381, 525, 159, 151, 124, 78, 441, 408, 173, -345, -137, 112, 40, -42, -33, -198, -419, -274, 112, -30, -468, -457, -323, -61, -78, -152, -100, -339, -158, 61, 341, 147, 26, -146, -93, 159, 442, 379, 70, 1, 212, 583, 248, 87, 126, 215, -175, -18, 269, 63, -277, -272, -196, -95, -258, 62, -247, -664, -509, -61, -2, -173, -183, -57, -134, 58, 374, 114, 15, 37, 249, 237, 389, 419, 225, 47, 235, 263, 477, 46, -108, 160, 31, -62, 199, 36, 42, -402, -89, -13, -264, -368, -365, -236, -376, -111, -12, -82, -271, 3, -23, 5, 5, 177, 24, -237, 282, 248, 381, 86, 161, 310, 113, 221, 198, 257, 216, -64, -10, -54, -226, 272, -51, -231, -528, -49, 71, -392, -326, -293, -335, -359, -149, -107, -68, -331, -252, 78, 92, 295, 239, 41, 6, 324]
5054C24n9qj9J98j55J7p4r9P3l61J21J60P1k35J02l93L5J01Q4Nl11J04K25K70
5078A76m40M71j56k05j26L29K35N9l44N4L8M5K48p1k94j2J50K42m6o9k18j96N1
5101g9L88j5m49k90K3M55k53J82p9m60J77J70M04j5k12j54k21J80M67J04k54l06
5123b37O4K13M19Q3k45l07M8o3O12j53l14j48j64R9J38L44n91k00j27N00K06k96
5145a19m17M1Q6L45J48r6k81k63L98K85L26j62m16k11K18P01n8j48n55J44L43
5166C09K40k51n9l10l18K86N25P7n89l59jQ5N66j63k96l00J2K94N24j75k26k24
5188c53k48N11N33N6m45k44j34M15O26j92n59k37JO31M61m39m14l58K19J58M03
5209C91j98l37n82L13L93M70k71n04k73J99N40K39m24l21r5O9O31J61k45l05k65
$$ y = [324, 265, 257, 238, 436, 281, 298, 224, 125, 198, -163, -42, 118, 189, -46, 56, -337, -302, -201, -117, -112, -423, -319, -94, 176, -264, 207, 51, -154, -280, 49, 284, 343, -1, 53, 91, 136, 384, 313, 19, 7, 157, 399, 353, 284, 66, -130, -79, 309, 294, -155, -445, -422, 33, -220, -38, -117, -577, -400, -230, 174, 159, -53, -207, -428, -248, 219, 323, 69, -237, -173, 40, 459, 542, 297, -10, 38, -25, 587, 434, 120, -28, -192, -93, 45, 389, -202, -402, -529, -29, 177, -119, -536, -495, -409, -64, 84, -12, -293, -556, -158, 127, 453, 291, -125, -336, -118, 583, 525, 377, -178, -34, 309, 549, 298, 239, -71, -389, -103, 422, 499, -90, -449, -450, -365, 201, 38, -258, -558, -546, -252, 272, 97, -129, -353, -601, -90, 443, 499, 54, -190, -324, 91, 717, 525, -34, -271, -270, 361, 822, 383, -31, -389, -170, -12, 391, 193, -144, -726, -413, -20, 450, 179, -325, -598, -399, 141, 380, -44, -365, -460, -391, 240, 401, 156, -149, -414]
5230d14M87N08J33l20r30K8P68K16J40n51l42o2N16K32nm91m07m8M69L60M7n89
5252b55o26M51L62J96Jk27o24K05M75O08k61k77j67j48O62L89k01o09k92J76O54
5273D92J10l06k25m14J85O27J93l34p53k41M67M90J08n65m22j09K80P04Q2m28
5293e9m28r4L03P84j3n21l67j6O17M55j31m11l30J08N16L56j48m91k86j26M25
5314A43L81k15m37n07L22L93L06l11m68j97L54L05J08j8o03k91L47N48L8p6l68
5335b46j55K89M36L18m09n12K05L24J44K59l62n55o8N54K92K8o12j64K5R0K98
5356A79q1l29k79R6K15L69j75k69l10M2N70J29j7k95k14J3M95L30J40n36m98M26
5378AL33L87l59l68j31J40L92j07L4m30j48j79M47J73j00m31o6m3M18O9k10j48
$$ y = [-414, 73, 581, 714, 394, -536, -508, 260, 476, 616, 65, -277, -339, 177, 409, 404, -87, -494, -542, -73, 287, 334, -255, -881, -430, -68, 128, 129, -98, -722, -517, -42, 566, 305, 28, -139, -287, 375, 764, 563, -46, -338, -162, 492, 602, 296, 71, -343, -158, 469, 662, 328, -425, -666, -199, 291, 399, -166, -588, -697, -417, 287, 369, -59, -487, -581, -278, 506, 493, -28, -395, -411, 206, 661, 530, 119, -211, -103, 413, 769, 621, 130, -156, -282, 143, 524, 309, -128, -635, -313, 80, 386, 75, -393, -590, -236, 69, 177, 159, -444, -735, -388, 160, 198, 122, -246, -401, -112, 324, 642, 233, -279, -74, 250, 394, 653, 291, -264, -332, 222, 514, 542, -70, -234, -209, -119, 179, 98, -231, -510, -414, -199, 170, -5, -274, -584, -542, 28, 157, 140, -155, -369, -356, 139, 469, 609, 73, -425, 1, 334, 721, 362, -6, -137, 3, 395, 288, 322, -108, -256, -435, 12, 185, 85, -346, -412, -455, -37, 32, -178, -326]
5400c26l85O40K55q0q7q3j33mO09lj77j31l02L74L52j34J7l53j05K60Q5o9l9k43
5424f2k67K20J75J78m58j86k2K65Q8L6k63lj3kL60J4o8k97j07L59L33j26j13L8
5448G9R0J72k12J90j99p6N5J87Q5m18Mk1p9L59j87k8j79j26L76p9r8Lj35%J59
5473g8nJ56J8l46P5JK71Q9N0j84OR0K45j14k45J84j14J15J18j15k34K01k23J03
5497F4j28l5J17k09j5k0J44k5q8n2J23k15J21K07P0p6k07J30J72j30J77l2L8l6
5521I5J27J66j53J44k62j64K00%q5J33m53m0L78L1K9j13l54J27n1M5K24j66j30
5544b72Q2P9j21L82j33o7j26K10J52K30l77m0l3K8L13J55k51k80k17O17P9j44
5566B66l01k33R1O4K62k0k93j10j36L9M37K8k50l49O8K85L69m4k36L4j64L66K56
$$ y = [-326, -711, -71, 184, 104, 17, -66, -199, -203, 406, 403, 226, 95, -207, 167, 519, 385, 402, 49, -56, 204, 289, 220, 181, -62, -329, -109, 66, 244, -214, -400, -422, -157, -69, -33, -296, -299, -312, -314, 46, 60, -8, -305, -412, -53, 280, 154, 41, 79, 169, 341, 129, 319, 120, 44, 99, 286, 371, -47, -43, -64, -143, 216, 29, 1, -178, -304, 72, -7, -105, -102, -237, -237, -78, -83, 73, 91, -255, -180, -179, 92, 181, 231, 47, 53, 143, 388, 274, 29, 213, 99, 214, 332, 217, -17, 184, -39, 64, -64, -99, 18, -191, -206, -226, -82, -107, -195, -247, -124, -339, -218, -11, 59, -17, -224, -94, 78, -52, 125, 93, 131, 95, 222, 388, 235, 379, 117, -47, 153, 153, 68, 201, -252, -292, 86, 117, 146, 33, -321, -194, -245, -200, 24, -142, -272, -190, -111, -232, 150, 17, -50, -176, 34, 186, 416, 39, -1, -34, -6, 307, 462, 211, -69, -286, 331, 410, 266, -35, -268, -177, -113, 149, 129, -164, -274, -410, -371, 66, 94, -156, -505, -437, -152, 217, 173, -63, -29, -193, 173, 429]
5589D29j74j42k73M02O5L47n33K7j85k3K44K19Om26k32P1J80K56j38l91l62L37
5611b96L21R6j74m34N6r5Q90q6n14j69J25L64L60J00k63l99l39O20K86P8k43n20
5633b36p4M48J87J79k68o82K62M77M9Lm56l70k13N53L31k0n75l50L40M45K65j44
5655A51l04l69L08M87K36j03n08j95K17M07N31l47o64j00J47O38K76o07m72j75
5675d46M45L36L04n66o33r5M52L92K5p3o46k85M90P92j83m50m75J15N66N01J22
5696F88o59o12K27N89L46N6m74n36O4N31M58k21n10m19K93M84L11m14m32m25K38
5717d17P25Q5l64n47j56M59L01L37k18p90k34P55N29J64l11o04k24N46N78M41
5737A055p93n50m9L96L71J56n17m62j75N87N78k47m83o72K18N82N18M0p49m58
$$ y = [429, 255, 113, -160, 242, 307, 654, 121, 148, -37, -60, 184, 403, 409, -17, -249, -178, 2, 258, 120, -271, -633, -296, 25, 121, -53, -487, -431, -526, 364, 278, -236, -405, -280, 84, 444, 544, 281, -118, -457, 163, 449, 527, 284, -236, -310, 138, 325, 504, 236, -446, -184, 293, 342, 345, -111, -481, -694, -141, 190, 170, -405, -755, -415, 30, 295, 151, -153, -522, -214, 273, 509, 406, -102, -297, -80, 327, 858, 511, -153, -253, -106, 532, 808, 201, -271, -446, -1, 335, 639, 73, -560, -655, -203, 189, 214, 141, -505, -790, -300, 492, 309, -141, -616, -501, 65, 566, 688, 29, -583, -356, 233, 579, 635, 161, -375, -311, 220, 678, 457, -53, -472, -179, 305, 616, 202, -230, -655, -417, 308, 393, 29, -518, -674, -215, 86, 423, 205, -585, -819, -64, 465, 629, 318, -286, -510, 36, 614, 1055, 262, -288, -337, 59, 430, 586, 69, -393, -568, 19, 597, 350, -133, -805, -587, -5, 513, 553, -196, -654]
5757f54R7P51K80o6n14n86J13O23O95k47q38m22N44Q80p0j05n34m51L38P60O7
5778F61k85m96k87L24M15K86k58r39j26O48L84j16q7p80KM83L66J02m20m40jN64
5800@M13o7l05n48J5P35L97o1o05k37P8O37J70n8m69n74K30P05P9k55n61j77l3
5823d91M45N74l50o21j16K23N40J72k48m99l41M97M32J85l50l36k15O23K67K45
5843F36l92n13L6K80K11K96l19k53l08K12O53r0m31m76J08L96J91k04l98k33K1
5864e77N14J65O1n04j13J23M25L89l23k45l61K04L08L64q9m89K6K29J87O4Q6m35
5886Ik96L59J09K07k18k25l65L58K13K26m11l53k3M4L50Q2m2m23J35M5M07J7l03
5909i8o9j17J00M76J35l69l23K44K37R1O6k67o1L2%J36R1j73k47m3K07R3Qn45
$$ y = [-654, -557, 194, 474, 408, -106, -692, -579, 44, 739, 492, -346, -768, -224, 656, 586, 481, -53, -504, -166, 594, 661, 376, -120, -407, -83, 332, 618, 360, -579, -705, -57, 327, 211, 124, -656, -654, -171, 195, 297, -123, -563, -564, 0, 413, 346, 41, -507, -492, 243, 640, 579, -26, -263, -185, 452, 622, 564, 95, -479, -249, 456, 535, 280, -281, -458, -491, -46, 528, 178, -443, -559, -336, 204, 376, 128, -371, -712, -215, 217, 402, 52, -284, -499, 124, 391, 636, 244, -269, -233, 47, 258, 554, 235, -18, -326, -114, 539, 449, 18, -458, -350, 46, 237, 33, -365, -598, -577, -63, 102, 163, -341, -454, -331, 94, 483, 160, -85, -446, -242, 66, 430, 341, -148, -122, 107, 294, 358, 444, 9, -287, 72, 181, 388, 170, -55, -420, -62, 151, 377, -34, -387, -410, -366, -16, 66, 24, -399, -264, -219, 188, 205, -98, -167, -284, -184, 292, 427, 58, -265, -21, 216, 307, 373, 106, 45, 77, 77, 213, 304, 131, -116, -159, 48, 141, 149, -396]
5933c96J51J85m7K00r8k80K48l46L69P8O2l67J22J21J38R4k41j07K50j0K01R5
5955D22m44J67m7k2r5K43J9j47j43q4L31j07k7j98k9n4J15N1j42K21l50O2R2M3
5979a23J64k38Q2R9J00j26J40PM8j56Q5jJ14K1J04l48L6K4J88j21j8k8k51LJ52
6004d3J16r0m01J51K91Rk3k05k34K01K16J84k05j58Q0N6o8L17J05l55k8P0K98
6027B84R5O0n38j24QO26o0k15l39L3j35L51K14j05l32j55L0K48K54k61l11k18
6049e90M40M38o1k49k58j92M04N99j36j74m28P9M75J38q3m32k45J3M38K04Q5n55
6071i0k33j76L72O41m48m90k30J73M89J02Q6k15o30L55L90K09j7m00k91J62L79
6092A38M22k38o06j35K41M69N08l86o33j22K31N98K71n05p54q4L69N21P9l39n37
$$ y = [-396, -245, -60, -107, 93, -5, -285, -37, -383, -14, 64, 126, -241, -119, 2, 140, 234, -7, -114, 136, 126, 327, 422, -22, 145, 98, 76, -19, 224, 243, 96, -47, -131, 200, 93, 66, -132, -161, -215, -100, -49, -191, 30, -320, -258, -166, -123, 41, -197, -115, -16, 84, -42, 98, 105, 153, -3, 82, 81, 195, 216, 320, -28, 8, 32, 220, 99, 81, 53, -198, -195, -43, 73, -17, -418, -267, 24, 33, 10, -195, -429, -228, -12, 172, -33, -191, -111, -55, -123, 194, 299, -56, -84, -14, 284, 379, 439, -99, -223, -215, 411, 351, 136, -203, -170, -305, 46, 260, 155, -177, -332, -302, -54, 200, -61, -372, -590, -150, 288, 227, -22, -280, -472, -68, 531, 395, 221, -207, -128, 347, 485, 402, -30, -275, -262, 176, 380, 465, -90, -323, -499, -127, 514, 66, -424, -654, -481, 8, 110, 196, -19, -649, -294, 96, 305, 288, -112, -403, -241, 138, 560, 322, -284, -419, -178, 291, 799, 413, -220, -342, -111, 487, 758, 253, -501, -585, -216, 305, 384, 45, -492]
6113d92K7J90Q00p0o04m01k3L69O28R9o34k83j56M45O00j63l65l24J03K58P18
6134G22n0m50q30L98O13K79l93m56l34J61O65J16j45p85L6Q7M86L20k56n70l70
6155g56L47Q53L8l96n63k0L43O70N13j038l01j53N82M22K5m33o59J75M95O59n3
6176G50o28o93J13N86M05j05o38l71jM05Q08q3q27m89J71M74N31J85q27n54K43
6197e45Q31J83j11n97l01N9Q38N40m41p08m81N41N06M63k68q89k51L12P71K64
6217G16o63o19j0M63N96M4m83q96L32K12N71K40m09n63m44Q82P99j86o27n99K74
6238c70N55L73J82p28n07J29N82N84j40o73l77L1O48L10j27n61n71J86O70L92
6258E88l60n61n82N05O62J31j18p12j90L24N32L92k38o40j61M68P91r9o65k11
$$ y = [-492, -465, -275, 525, 455, -149, -550, -573, -204, 424, 523, -111, -394, -550, -105, 495, 332, -33, -357, -254, 4, 722, 672, 222, -608, -210, 403, 682, 289, -167, -501, -340, 325, 441, 296, -489, -453, -366, 120, 440, 184, -386, -756, -409, 444, 482, 86, -477, -497, -154, 516, 1029, -9, -310, -463, 119, 541, 566, 133, -526, -351, 144, 803, 750, 122, -571, -458, 128, 533, 428, -210, -581, -582, -177, 631, 548, -279, -768, -597, -123, 408, 593, -234, -788, -545, 286, 469, 358, -239, -540, -481, 357, 897, 456, -252, -733, -192, 314, 777, 509, -380, -631, -319, 452, 716, 53, -566, -576, -113, 483, 527, 44, -852, -520, -308, 263, 503, 94, -469, -913, -31, 768, 582, -45, -644, -370, 185, 558, 740, 12, -495, -366, 216, 800, 660, -13, -390, -359, 289, 599, 472, -89, -660, -474, 196, 588, 228, -333, -915, -410, 252, 383, 265, -447, -637, -313, 219, 611, 373, -267, -428, 40, 831, 732, 67, -144]
6278a44j97L91N80J4k75r04j59P34O68m07m74m40n5N62O60k46n56l43PN70L61
6299C47j2l94q01L77N46N62j31p07l68M41K90L48m7n73m12K88O84R2j07l69l88
6320c34K50N83J01k93o43l8L34L33O5n37k25j30M31L93l5k13n33J21L31L53Jn31
6342b16k53K19L43M80j87m10j95R8L89L79j9o24k71J28L23J51l81m1j48k49O23
6363A39P4j92k99l01J4O38pJ26m16k05J65M07J87k65k78P9J94J58O2j23l28J18
6385e3m3K03K66k3k50l89M25K15p7k96j33o0J85K12n8k03k41M3K19M8J17k13k3
6408a29r1J15K75Pk32k42L0M13J18j83p3nK5K3R7l1p2L2m9j1j7K25k91j34M1K25
6434F6k79J17p5K53l69pLK40M4r6J1K3Q3p6qJ60N6j48J31J14k1M7j75L4J8N3r8
$$ y = [-144, -341, 50, 630, 644, 369, -535, -694, 40, 708, 301, -173, -613, -668, -106, 554, 308, -248, -591, -584, -14, 347, 335, -59, -860, -483, 63, 625, 494, -213, -581, -140, 150, 498, 451, -122, -534, -246, 438, 530, 423, 54, -334, -84, 499, 600, 307, -336, -374, -40, 293, 358, -179, -404, -534, -103, 290, 255, 42, -491, -370, -39, 314, 315, -216, -469, -250, 93, 573, 386, -24, -219, -121, 268, 647, 628, 4, -267, -139, 184, 335, -46, -87, -235, -484, 139, 213, 21, -278, -579, -565, 73, 66, 192, -224, -429, -264, 143, 330, 65, -213, -134, 60, 218, 280, 157, -171, -53, -96, 107, 373, 350, 100, -289, 136, 351, 274, -22, -155, -215, -30, 182, 124, -79, -320, -277, -58, -10, 107, -106, -129, -220, -105, 170, 177, -55, -297, -267, 146, 264, 81, 8, 3, 28, 51, 148, 117, 45, 77, 28, 17, 0, 225, -66, -200, -159, 66, -213, -96, -171, 82, -287, -294, -291, -51, -7, -103, -92, -69, 14, -62, -70, 90, 146, -2, 129, 243, 222, 269, 94, 128, 146, 199, 101]
6461A01J83J1l02j1J00j0l9N0l41K49k31L27k7l53n7L10J23N9m45M2Q6J03K99
6484B27q4j22m8m0J88R8k6j62l11Q7K72M12j14j74n96J17M27N0j24k25j9r9L10
6507D4R0o8j85m72J87M05Q9N4k61l52L31K52K29j22k06l08J88N86J15m55k82j79
6529c20K47M46Q6l57k06r8K30L80j84j43l72q1J42M58K90q77k08J88K04M56r2
6550A89m01k82j3M91M07j63j71o76L62L47M88j82l06n48Q6O21N83l34p49j96J20
6571c27N43K25j55o19k17Q8M87M80m30m72l46L77P61ll33n91k50N61N65J14m38
6592B0l47l96N14P26K58n41n74j80M04Q71k54k49p46k1N88O82m30o9q15L5M96
6613b8N51n2o23o66M46M05M27O6j067p3J50N53M29k96o01m25N29N64M52m43p41
$$ y = [101, 284, 295, -7, -18, 82, 72, 33, 83, -258, -9, -240, 87, 60, -293, -350, -40, 83, 142, -303, -261, -175, -72, 227, 143, 21, -27, -67, 121, 219, 193, 31, -280, -193, 79, 491, 377, 203, -393, -276, 151, 201, 77, -148, -167, -266, 44, 134, 66, -119, -591, -404, 1, 90, 144, -117, -469, -138, 114, 343, 221, 15, -293, -105, 481, 596, 141, -141, -320, -73, 373, 459, 102, -104, -202, 28, 408, 224, 81, -291, -372, -230, 228, 518, -359, -567, -379, -175, 281, 189, -212, -494, -507, -16, 391, 228, 57, -619, -257, 90, 578, 396, 90, -458, -372, 249, 832, 498, -251, -447, -327, 216, 441, 286, -333, -550, -462, 25, 505, 75, -397, -743, -366, 395, 392, 59, -532, -782, -221, 344, 458, 20, -327, -723, -209, 517, 775, 234, -340, -520, -116, 755, 501, 252, -494, -515, 73, 755, 325, 256, -559, -524, -28, 523, 471, -152, -818, -372, 33, 460, 526, -541, -614, -464, 89, 518, 222, -379, -804, -275, 289, 741, 298, -443]
6634d43j35M37O58L53l79q26k97M80Q30J25p29n88l55P93N89K7m42o27p0N27O58
6655E86p9p33o11L16O39M10m9o83m49rN68O36jo03n26J54O95M16j14q57m11M23
6677b82P51L87l02q57m78N56N19L73m98o47k01L56Q09J39n11o54k49M42Q06J14
6697E73m22p17l4L64O83O0m81n08j15N55O65K31q79n04K49L53O95j56o29n76K39
6718c54M21N12k25o12m57J46P45L99k31o78l95K26N20M67p5o33p54N69P37L89
6738G17m38n87l23L02O62N46n46o57k14L93P88K78o42p49j75N16P93q2m21q06
6758f45k35P16N77R8p46l96pM50O66J0o46l99N1O20L69J26o94l94J20N41M87k53
6780D16m83m09K61M23M75k51o13k63J15P18P0j68p65j83M82L72J80k62n60k36
$$ y = [-443, -578, -141, 517, 870, 491, -335, -632, -152, 678, 803, 74, -514, -869, -76, 513, 540, 98, -529, -599, -72, 586, 507, -226, -837, -521, 118, 528, 479, -204, -653, -662, -94, 542, 541, -62, -588, -434, 261, 677, 563, -294, -705, -282, 469, 856, 554, -303, -781, -225, 294, 667, 169, -478, -679, -323, 486, 625, 114, -540, -789, -347, 459, 573, 151, -566, -600, -236, 447, 507, 26, -482, -597, -42, 623, 854, -25, -529, -280, 73, 768, 612, -17, -593, -354, 67, 579, 354, -258, -715, -569, 176, 575, 344, -334, -729, -503, 17, 484, 409, -224, -978, -409, 328, 717, 279, -308, -631, -329, 333, 879, 333, -324, -538, -145, 643, 921, 279, -470, -645, -129, 664, 582, 161, -645, -880, -164, 413, 511, -235, -631, -638, -188, 478, 488, -158, -557, -506, 114, 483, 609, -85, -479, -359, 182, 669, 416, -67, -476, -215, 208, 683, 432, -181, -444, -329, 389, 459, 291, -474, -657, -175, 197, 377, 115, -445, -681]
6800f81L81L67M20m53m05o7M17M03J03j72o00Q0Q8N19J43m97k54R1K30M73j28
6821D58o05k38Q2L66J97N2k86m53l7N43J79j41m45m67N13K97K28o0k31k75j05
6842d28N47J14k90q9k21K40K98J91l01k04j7Q9L98J61l29k72j31K22K55o0l02
6863a29L2j80J48K85O5k21k66m2J79P2O6j00n8J93j07K51j28o3l42K90K40J62
6885C47j15k15r8K1K36j9o1p7j43L54k68K58j68J7l72K61J49M3j92k25J25J61
6907A9k57J70m1J3J3o0j20J31J90j61R2mJ03O5k44J75Opj0J5m6k0K59j71r9l9
6933b8R1j03L6M7o6k71K83M0K3j92Nr0O9J51k8k39k4l6M66m7M7k95L2O7K04J12
6959B54j4k86j24J84K91q2l64J83k36J95K13m6k48K1j30K39J49ml12k09R4O9M02
$$ y = [-681, -300, 67, 487, 34, -371, -438, -21, 382, 485, 313, -287, -207, -119, 400, 543, 46, -208, -117, 113, 586, 458, -147, -385, -303, 63, 260, 312, 26, -427, -464, 79, 258, 117, -328, -795, -282, 15, 243, 183, -48, -323, -428, 119, 233, -57, -146, -367, -127, 171, 362, 61, -143, -160, -71, 327, 488, 159, -113, -244, -22, 233, 173, -129, -97, -277, -129, 156, 221, 0, -266, -308, -129, -57, 9, -91, -149, 44, -63, 188, 60, -3, -345, -55, 185, 347, 232, 17, -81, -60, 176, 157, 96, 19, -124, 230, -38, 220, 52, 69, -303, -42, 107, 150, -42, -267, -142, 19, -238, -68, -109, -96, -83, -143, -263, -132, 58, -103, -11, -15, 88, 153, -91, 84, 90, 83, 73, 88, 42, 22, 281, 110, 11, -28, 63, -40, -4, 43, -23, -294, -11, 29, 52, -140, -135, -225, -156, -5, -33, -272, -296, -332, 134, 87, 134, -161, -129, -62, 142, 254, 240, -46, -170, 14, 305, 223, -141, 42, -194, 1, 214, 168, -80, -59, -189, 50, 199, 195, -117, -326, -232, -163, 239]
6982B39J2m05m49K26K18M04L8l27m16P4N93K62p2m34k24P4M49J67K7o37k5r3O05
7005C06K74j45l95k86j26O62Q5k67o99J42K24L01J70j07n09k05L68N59Kk59m27
7026c32mL28N48J46n61m65m6P33K31j28m06k53j90N10J93o5l19l27oM65N36k25
7048C63o28k97j2O41M91j47r37N5r2Q02L79k68o91k32L75M91M06m22o71O0J65
7069a69O29L10n49o51p7N82L06K36l25p93l41O48P16k0n68n01r6P35M41N5n99
7090c1o58J31O69M11j10m37m21o2O03O15j65o61m23Q4N55M60j09o55l41L25P14
7111D94K32l64o13m53L80P20J26l11o52m27P94N62L01o83o17o1L99M99L69o88
7131Gp46K38M56Q07j01m70p61k8O46O09K4o56l92j03N66M98Q9q83l41j78P33N85
$$ y = [239, 251, -154, -603, -377, -159, 245, 283, -44, -460, -386, 207, 469, 397, -37, -261, -187, 262, 429, 456, -181, -206, -299, 306, 580, 435, 40, -246, -372, 290, 375, 108, -591, -449, -225, 76, 246, 139, -370, -575, -207, 352, 354, 95, -332, -336, -8, 540, 686, 125, -340, -386, 347, 578, 450, 44, -209, -399, 111, 304, 239, -80, -407, -413, 52, 588, 363, -265, -562, -574, 67, 558, 411, -526, -471, -563, 239, 618, 350, -341, -573, -198, 293, 699, 277, -394, -334, -169, 460, 770, 221, -430, -507, 75, 381, 617, 292, -501, -842, -194, 522, 502, -66, -567, -663, 72, 513, 568, -31, -689, -558, 111, 522, 412, -25, -446, -508, 95, 710, 545, -116, -539, -455, 100, 560, 451, -204, -545, -220, 494, 726, 362, -251, -704, -324, 396, 522, 211, -441, -868, -74, 488, 789, 106, -511, -572, -173, 326, 695, 7, -739, -501, -45, 762, 661, 191, -570, -598, 48, 657, 681, 25, -367, -470, 96, 594, 683, -200, -541, -719, 14, 599]
7153E99j73o34m11J87M81P51m43p85l46L94P26L20m70m91l74K42Q17M42m83q33
7173d84pL78N76L81m66q29j89O04O28L1m18p59k6M25R40k98m14p69j8Q96L61L4
7195E77o56n25N3P20N49n5o11o05L8P07M33j73n41n57K41O91M77l34o24j69Q1
7216b83N78M11m03m58n29N32M02K93m74n49r0K35N93K48l09q66N1M90L72J34l42
7237C6m67J1M02N14q2m18l89L9K80M88R7p44j47J30L88L32j10m86k44J28K99M31
7259D88k27o15l84J68P60J48k34k48n23L21N25L66k05p91p1M28K53K08k25n19
7279c77l11P35L67R0m59k91K9J58L58j2p7n75p9M72K47J47p10j47QL58L26K4m13
7302a32k50J50L85Q6r2l62j67J72L82J04j96j27k89J73M64K3l7k81j38RL24J14
$$ y = [599, 426, -208, -619, -432, 49, 800, 357, -428, -774, -380, 346, 666, 196, -295, -669, -427, 390, 832, 349, -484, -491, -113, 463, 844, 378, -451, -640, -36, 592, 623, 205, -554, -580, -155, 785, 487, 73, -696, -714, 182, 543, 577, -79, -604, -551, 169, 718, 663, 52, -553, -515, 192, 625, 452, -89, -646, -405, 286, 763, 429, -195, -364, -283, 295, 706, 303, -155, -684, -152, 250, 543, 69, -480, -570, -335, 258, 506, 197, -669, -618, -128, 244, 378, 36, -431, -420, -18, 496, 414, -4, -393, -354, -74, 414, 511, -233, -380, -250, 138, 470, 360, -126, -370, -242, 57, 488, 261, -354, -738, -570, 190, 338, 104, -144, -667, -346, 179, 545, 340, -451, -522, -94, 159, 367, 142, -377, -688, 47, 414, 504, 45, -246, -217, -59, 299, 287, 210, -365, -444, 28, 275, 422, -288, -435, -427, -69, 257, 281, -132, -382, -232, 153, 239, 147, -215, -382, -210, 172, 276, 80, -47, -336, -163, 301, 324, 287, 6, -132, -123, 201, 315]
7324C15k30l3j36q7L09J80k11j59k40J34M00k27j31m3j84J49K38Nj34l36K25P8
7346a18K12M3q9K0l17K42J96J41k63j23Q0J24n9Q5j76k1J16j43M8K66j54k12Q8
7369a4l3J0K4j30j3J32l7J22j58j35M1J30P0j38K89j64k18K75q3n5K50j36L8r4
7393b7M49l78km9J47j67M9L9j00M9K1j93j28K27K45qk51k4L7M4j26l0K16J05m91
7418c46K77L3J48J90k16k18l0J57J56l4o3j43K29o8LJ50l46j03J48J64nr5j45
7441a57j44J95J99P3k18j68l35N19J40J88l57j89j12M68K22P3n04J6N2J9L54P2
7463D06k82l96N9K22N17k65k66l88J16M44l4R1l02k83r0M87L94k77l59j08L2K05
7485g7M69r3l34n20N27J84K65l44j55j95L22J90J35k91k81j80J59O11l6k81k96
$$ y = [315, 85, 52, -84, -171, 138, 318, 107, -52, -292, -158, 242, 15, -116, -159, -343, -194, 44, 49, -85, -421, -196, -118, 94, 137, 48, 68, -249, -7, 189, 330, 67, -56, 24, 148, 89, 174, -2, -23, 93, -50, -2, 264, 110, -102, -14, -47, -37, -13, -143, -156, -24, -61, 61, -97, -232, -191, -61, 9, -129, 160, -4, -222, 53, -30, -85, 165, 29, 67, -27, 422, 44, 42, -7, 140, -27, 22, 61, -39, 10, 31, -162, -290, -63, 182, 174, -77, -101, -64, -20, -146, -176, 40, 145, -346, -69, -36, 112, 302, 86, -132, -162, -5, 151, 117, 54, -89, 140, 72, 75, 225, -121, -224, -76, 88, 83, -12, -157, -301, -106, 93, 166, -52, -220, -555, -36, 104, 292, -65, -254, -366, 102, 324, 397, -107, -91, -39, -20, 334, 406, 124, -272, -213, 9, 526, 261, -5, -393, -277, 167, 133, 224, -78, -361, -451, 36, 430, 153, -206, -314, -282, -77, 392, 299, -35, -555, -28, 156, 421, 77, -78, -273, 49, 239, 374, 83, -198, -378, -219, 392, 356, 75, -221]
7506b21o2M41J23O0j53n18j16L98L97n4j77m48o0K88N76k39k67m00m0M58N46m02
7528A30k61m29L44M68L11k08o65o6Q1N17K93l70l18l03M06L56K29j30n48n31K84
7549d10Q89r5k13n03p4K15M69J12l76n99RM29L66K79n43m46M6L74P24k39m58m04
7571d48J54M99L49m9o91k72P0O32K15p9n53k04K9M72K59k63k22p17M34L97N84
7592E96m57n71j33K65M67L07j14q87q4L54P36K15n61l72l02K39Q77J19m58n85
7612c49k36O47L97l7k65n68l04Q12N79k37n71k79k54P22M20j45n68m24M09L79
7632A28K33j43n05k35n2P26M85k89n07l99J79Q52J50k49n42m35K56Q35O7k00o75
7653c20l25K49M86N56l13q36J43K26M04K92l36o60k01M67N70j4l04n98O5K95O27
$$ y = [-221, -283, 158, 281, 341, 188, -330, -446, -48, 349, 295, 118, -330, -390, -102, 474, 235, -32, -432, -472, -14, 532, 130, -131, -560, -216, 252, 563, 355, -310, -376, -295, 222, 515, 145, -173, -476, -70, 286, 515, 385, -163, -694, -410, 479, 384, 171, -332, -406, -191, 278, 390, 14, -585, -576, -147, 219, 498, -45, -491, -445, -71, 653, 414, -44, -448, -294, 205, 554, 505, -186, -458, -388, 244, 459, 380, -173, -377, -348, 124, 383, 120, -102, -819, -385, 12, 596, 139, -432, -565, -300, 167, 474, 360, -527, -611, -257, 479, 694, 133, -239, -541, -302, 575, 694, 236, -349, -585, 62, 459, 422, 157, -411, -715, 97, 676, 439, -132, -411, -665, 57, 477, 332, -236, -660, -251, 128, 361, 218, -287, -522, -574, 152, 637, 348, -159, -558, -379, 473, 623, 374, -168, -603, -347, 488, 555, 355, -320, -645, -396, 90, 646, 333, -503, -360, -134, 270, 562, 226, -434, -635, -168, 402, 388, 84, -514, -449, -154, 473]
7674D73r1n23m58J14O42M52o3p17q8l3M06N18k08o82l63M7R71K0j58l43n57J72
7696d69O83K35k77o76p7L97M11K61j36p02k92M81N70K22o55k86q7L85K63K96l46
7717B01m18k42M39N08j39l06n38L2N98L87j57o60j16P8M98L72k97l94k03P0J55
7738a32L91J26n19k41m5N49K74k07m62M1O2K67L79k49l98j62K05M71M7j87m81
7759b71r2K67M05m2q7l99k07J08M54K04n44Mj95M24N7K58l35k10j85M04K58j34
7781A42j41j78n6K11N69l19l06k04L46J94J01j10l95R5p0K46Q8j32k01n3R1j22
7803b04M14j99o0m18M42N0Q4j77k0j76J63J84K87k63k79M8Q1K79j21j62j10L9
7825a18M40j56Kk41l6K40j43M7K3k17J43j6J11P4l0k00k07K96Qk5k15l4L08l47
$$ y = [473, 382, -141, -599, -485, 157, 609, 546, -171, -259, -292, 114, 632, 424, -258, -621, -574, 397, 417, 259, -84, -641, -469, 214, 449, 172, -504, -581, -184, 227, 488, 352, -350, -642, -161, 409, 631, -24, -310, -397, -12, 251, 547, 201, -217, -459, -20, 488, 349, 43, -495, -463, 135, 522, 365, -295, -411, -333, 165, 537, 240, -154, -357, -287, -132, 259, 385, -134, -375, -420, 129, 403, 196, -266, -225, -163, 104, 483, 234, -164, -326, -121, 350, 397, 210, -271, -363, -96, 309, 267, 180, -219, -426, -318, 136, 340, -204, -200, -395, 29, 86, 344, 9, -201, -386, 18, 276, 142, 1, -177, -233, -22, 547, 228, -78, -282, 64, 258, 359, 249, -146, -51, -121, 125, 213, 81, -120, -173, -82, -204, 210, 11, -49, -467, -25, 25, 109, -68, -88, -264, -101, 83, 370, 107, -172, -124, -43, 236, 115, -47, -157, -118, 322, 166, 168, -73, -109, 131, -12, 35, 58, -159, -16, -32, 79, 153, 123, -77, -284, 12, 20, -5, -220, -254, 54, -293]
7849b93K66N1N1k46Q6R0mK37n64K48J80K41k93j4j03J26J0J57l1l71L1K15j50
7872h0nJ47j49k17N49l63J29r2J6R8Q3k4q3q2r9K48J31j73L7p9NK1J80K43l53
7897H8k94K00K07o4R1j73k89K45j11K63J49l26r4R1o0K58j59j80l40L71q7L52
7919A38k1l54mjM38r8J22k27k35J46K78q1k4n0j06k0L04K61l40o23K05M91J1r7
7943A13j4j35k62K64J33Q1j00k90M1L21O6k5l40k34L05L07k5k6k04j33n7L77K27
7966C90k14k87nJ27O6L83k49m60j48J99L25J43k61k68k96M52L04j2K1m72j03M31
7988F6J32J54m39l89L05K52Q6K54m38m18J80L93L32k53j45m04J45K94N61k15n91
8009a38j91K60K74K05o7n82q1%M70J86j03j29l90J36J97K99k42n33p7L50M76j4
$$ y = [-293, -27, 24, 75, -171, -85, 5, 1, 238, -326, -78, 102, 343, 50, 36, -67, 59, 69, 226, 195, -176, -145, 70, -80, -85, 62, -87, -304, 245, -118, 11, -81, -65, 33, 116, 92, 9, -73, -172, 76, 207, 34, 71, -8, -3, 18, 198, 441, 88, -206, -6, 201, 137, 228, 55, -234, 11, -100, 163, 312, -14, -108, -17, -77, 181, 22, -158, -498, -127, -214, 138, 117, -237, -241, -242, 196, 98, 220, -7, -242, -96, 182, 101, 77, 27, -79, -99, 205, 466, 126, -497, -292, 199, 210, 113, 99, -36, -298, -34, 99, 180, 80, -210, -169, 152, 218, 193, -147, -381, -76, 231, 206, 180, -24, -157, -214, 163, 390, 176, -111, -116, 11, 77, 460, 211, -249, -397, -198, 127, 270, 9, -259, -555, -103, 201, 189, 210, -262, -365, 66, 198, 352, -87, -476, -171, 81, 167, 421, -17, -435, -255, 138, 470, 217, 72, -332, -187, 107, 668, 453, -138, -329, -69, 205, 410, 343, -239, -320, -320, 150, 336, 233, 104, -286, -150, 47, 346, 104, -429, -506, -156, 320, 306]
8031C06k15l14k25M33K58R0j94k52r2K35L17J10k78o81K13L56M34j69l06n39K22
8052b91L83K12j05m13j89n7N75K13j39n16l72L27L49M43r5o50r6J65N79J5j84
8073A54m51j28J82M08K04k65l48k3J56K16M01j52m59l42M92K11Q6j12m18k05L38
8094e5K07K82m95l11j98M07O03j73k70m52P9N00J74o2m67m5l2N15J74j20l67k72
8116c78J08L77K44j5l15l81J52K59L98l19o73J00J97M75J94l51l61o7J99L34K43
8137D20l70k74k44L40M18J5k14l97L7L89K16J71n53k81Q9J56K50O5l23m16O0N97
8159A51N31m13m57j03j45M96L13k2o35k05J85N18K38l45j35k98J64K92J59j39
8179A50l13j50J76L15R8%m57j19K21K47J25k45
$$ y = [306, 91, -223, -448, -15, 243, 333, 139, -113, -205, 30, 347, 457, 179, -502, -289, 67, 501, 332, 26, -513, -291, 92, 304, 199, -214, -403, -460, 115, 328, 189, -327, -699, -372, -23, 420, 325, -325, -421, -256, 323, 338, 154, -297, -425, -243, 165, 369, 104, -244, -267, -111, 105, 506, 354, -105, -447, 45, 256, 342, 230, -188, -393, -55, 152, 434, -61, -372, -570, -163, 440, 267, -3, -455, -376, 124, 298, 236, -231, -276, -308, 207, 381, 261, -106, -378, -270, 107, 351, 336, 21, -360, -208, 51, 449, 130, -543, -443, -246, 229, 423, 72, -289, -356, -157, 177, 420, 50, -224, -468, -128, 290, 305, 91, -306, -269, 120, 336, 507, -46, -327, -238, -82, 168, 233, -90, -506, -446, 151, 682, 269, -188, -291, -436, 60, 373, 351, -284, -489, -304, 214, 452, 107, -28, -326, -162, 130, 289, 150, -163, -313, -137, 178, 276, 276, -181, -300, -79, 168, 293, 48]
8191D8
$$ Imaginary data points
##PAGE= N=2
##DATA TABLE= (X++(I..I)), XYDATA
0@%%%Qj6QqJ6k4L2l2M0n6O4p2Q8j04J25j49J73k02K38k78L14l58M12m69N33o02
29c19O78p62Q55r58J070j192J327j476J638j813K007k225K463k723L016l344L712
46A954m129M604n153N799o566P491q642J0112j2060J4776j8815K5436l8089P0288
60D7006k88218n86444Q66478M00587n32849M1730M38722n09593m86857O59779
70E0341N20541n60233l38031L42012K032k19036L57108K39677m84441k89262L51829
81b7463J68390j24079J02063K2024l22570k1459L50463J799k50908P6245J10175
92H4680j57331L2586K26342j48261k82461J57656K47640r3801q6414N9202j14755
103g4917r9041K24085J47285j94114j29503O1772N317Q4864K02532j20468l47841
$$ y = [0, 0, 0, 0, 8, -8, 0, -8, 8, -16, 16, -16, 24, -32, 32, -40, 48, -56, 69, -80, 93, -109, 129, -149, 165, -193, 219, -250, 283, -319, 359, -403, 452, -506, 564, -628, 699, -777, 861, -952, 1055, -1170, 1293, -1430, 1586, -1758, 1954, -2175, 2429, -2724, 3075, -3491, 4000, -4642, 5470, -6590, 8186, -10629, 14807, -23282, 47006, -241212, -827656, 38822, 439409, -93440, -51710, 387012, -122581, -609438, 50341, 570882, 10649, -327382, 14630, 16662, -202374, 154734, 394411, -90030, -379292, -27463, 140927, 16848, 118911, 140935, -181635, -203094, 147369, 149168, -101740, -25495, 84680, -72651, -40065, 186277, 38016, -244445, -86789, 160851, 67050, -19364, 39838, -74917, -173958, 50127, 197412, 3298, -126205, -64433, -59116, 25748, 228280, 107812, -240029]
114b40029L5686K73186J2459J15J38520k24975l86418K39764M78766j44909l09364
125a27199J40363R694k88082K17698M75639k73448n36022K02300L56373j80610
135c294l3585L09113k10650m83932K53249N00485j96910l04107K04507L1758l03892
146b37258J60096M01325k19445l91299K01219K59002j75117n0763J98437j26863
156A9334k50312J94312K55025j59469j60815J05769P525q7295J18923Q7704j79466
167d8765r0008J56496O4264o6171J3595l1389j35490N2303K05315p143j52426
178c9419j4973J9848l7260R1697J23953j15112j62943O6698J08530j442L6429
189G6006m93j75429o4913K03373J04818j13665k6131J6847j35735KK57727L1715
$$ y = [-240029, -204343, 68843, 81302, 81417, 219937, -5038, -391456, -151692, 327074, 182165, -127199, 13164, 22858, -265224, -47526, 428113, 154665, -381357, -179057, 177316, -3294, -36879, 272234, 61584, -422348, -169099, 331386, 134476, -169631, 34876, 66634, -237258, -77162, 324163, 104718, -286581, -85362, 173640, -1477, -52240, 146197, 19334, -230978, -36666, 218359, 58890, -101925, 3844, 11369, -75926, 42997, 130701, -48765, -138773, 17723, 81987, 15816, 29411, -1978, -137468, -85165, 120150, 113007, -39419, -54392, -34544, -71804, 19893, 143846, 28734, -134209, -67511, 41019, 39577, 76006, 75513, -99916, -164829, 38544, 143362, 29697, 3566, 20413, -115322, -115320, 142407, 174122]
201A74122k64865l2058J73746n5079p0179J95074J4218l09100j1360L18121j469
212A31171k25879Q2102J09158k10992m2394L03590K3778k95067J1010K13747q3688
223A6536j13919J73740L8263k33849P560K38165l4205j75780P0281P8683j26719
234f1244o4J68434l9424j64637N4614J08798p0599l3041Q5917l9278j01412Q0108
246a1828J00430q0914o6190N7778j476m4118O8355N0189r1417m7229P1532J8535
258B3647l1016L4900K998p9194O313Q9997p543n4858K4151l57n8057M0645Q2828
271G4454n6331p2678N8422K2649p1244L4839Q6866p7133q8889R5104N8283j02988
283c8646o553J06014m7910j00887Q9566Q1033j11042l8673J19959j2610j16556
$$ y = [174122, -90743, -122801, 50945, -4134, -74313, 120761, 134979, -174121, -185481, 132640, 131171, -94708, -12606, 96552, -114440, -156834, 146756, 170534, -124533, -113523, 100224, 16536, -97383, 76357, 114620, -119229, -111669, 126496, 92291, -83489, -13208, 65475, -61244, -61308, 107126, 67702, -96935, -42321, 66477, -4122, -37163, 48754, 9476, -91936, -11828, 88602, 7688, -58502, -724, -2200, -46318, 22037, 72226, -19191, -66420, 5112, 23647, -7369, 27531, 30529, -48665, -42352, 47645, 40102, -14756, 9395, 9038, -49019, -8374, 74454, 18123, -54555, 3867, 26516, -44728, -9889, 76977, -156, -89045, 6059, 64342, -38646, -45199, 60815, 12905, -87982, 1584, 82617, -28425, -67098, 52861, 40251, -76305]
294g6305O1476J01697r2518o5901J11938J9522j19279K6188J12796n9386q6680
305f6452P8597M2032r1820M842R6548m2439q9611N8714O0308o5820j7761O8042
317C5180k6068p0074N2290O3054n5629l9258M5218J5l4482M1374L5398n8726l4276
330d5984M9703J9974k3364J3023N128m4694o97N7355N342l9953l467J412j8061
343b4283L0187M7367l6921o1190J9210L6294r490J0699K0446n0280m5630N6426
355g165N5816l5712l1805J2294j9243j0391O8797L4954p8795n1874M9000L2845
367A8721j0467K3562L559p3335k5014Q4158M4876n1573l1845O553j7932J2435
379a6302P2436N437r2692l8613N7080L8128k297O743k4964o5131L951Q5314L3369
$$ y = [-76305, -14829, 86868, -5650, -71551, 40387, 59909, -59370, -33182, 79614, 20228, -66452, 12145, 54177, -37643, -32801, 63747, 21308, -68303, -9589, 50719, -15101, -32862, 35180, 9112, -60962, -8672, 54382, -1247, -40505, 4713, 4728, -29754, 11620, 47018, -11708, -45984, 3719, 23693, 329, 13352, 18480, -26214, -26911, 30444, 35786, -4167, -7634, -6222, -24283, 5904, 53271, 16350, -44840, -25630, 10664, 1174, 11873, 32319, -17961, -63591, -7165, 48651, 12939, -18866, -6572, -25815, -36206, 32591, 67545, -11250, -63124, -14124, 18721, 8254, 31816, 35375, -37960, -62974, 21184, 66060, 14487, -17358, -10805, -28737, -16302, 56134, 61571, -31121, -69734, -12654, 25474, 23177, 29920, 4956, -60175, -56224, 29090, 62459]
392F2459n3675m3795j836J0497L6717M6681k1909p8019k3945N6462N4901O153
404E0691l0408m8428k7295L5039O5946J7820m8626n6790r097M5276N5455P323
416E6906n1993n7225l905N3668N8414J548o2580n9114P930N9222M8129k428n1477
429b905n8805M77P0546N7678k3004o7645l7094J9178N7800N1885j4044p8121n0718
442g4772L7824P3417L0912k6969n8481m6069K0094P9471M5216m9112p9542j8225
454f6236M7184N8677K3985l5613p5573l4999N5962Q4232J3148o3434o4070r295
466f6032M5860O7182K5169n8267q2555l609P9001O2595j2816n8059n4098q888
478f4517O2910Q1436m624r0684n9564K9122O2640M3143J336o2034p8659J3648
$$ y = [62459, 8784, -35011, -36847, -26350, 10367, 57048, 35139, -42880, -66825, -10363, 44538, 50691, 20283, -28145, -55440, -20401, 45545, 63365, 14739, -42051, -51148, -5872, 49583, 56906, 4913, -52312, -56217, -2549, 55865, 57413, -5167, -64281, -56351, 2871, 51000, 48572, -2905, -61710, -61233, 9313, 66991, 43987, -23658, -60752, -41574, 16226, 68111, 54067, -24054, -74772, -36948, 36469, 67381, 40412, -18069, -64138, -44044, 35427, 80643, 31531, -48011, -66236, -19052, 39625, 63610, 27997, -47576, -82575, -26613, 57619, 70767, 7333, -56737, -66032, -20172, 47010, 72179, 13912, -68643, -72252, 6749, 69344, 56528, -1531, -55629, -64517, -1607, 79829, 75205, -15479, -75043, -45921, 16719, 59862, 61198, -836, -79495, -65847]
490f5847J00657M9999n2541o8889k5240J3111O0276O9827k3099j07021m5452O4698
502b9521P0997J5346k1070n7854o0603L2307J07491L2717p8615o8568L807L7050
514a6516N4085M2940m2362j00093k1727Q3934O8733r715n0499n5732k2893N5698
526a4147Q5764M99q6521o0519K0281O2272N3042o97o9863p0804J4990Q3721N6573
539G4591k3216p3750n3671K2394P9480N1243k8944p4917m8014K7669Q4701N0377
551H7943m7100q4196k5802L9414O0896M5948k1936r4896n4858O6309Q9805J312
563F2839m9406m1558l5624J3499R3089N1224q2450q9955K2741N8253K2272K3117
575D8041p607q7648m8068R0652Q8013m0315o6553o015k575J0107P2431L0440r2536
$$ y = [-65847, 34810, 84809, 32268, -36621, -61861, -48750, 11526, 81353, 58254, -48767, -94219, -29521, 41476, 56822, 35752, -22102, -82705, -50398, 57093, 89810, 11195, -57373, -53566, -16516, 37569, 80509, 38147, -61946, -83673, 261, 68994, 59279, 8780, -46952, -69845, -14147, 71617, 72116, -14405, -74924, -54643, 7629, 60671, 59974, -9889, -80693, -65703, 18018, 74591, 51375, -22375, -76046, -53652, 25828, 77071, 48127, -26790, -74804, -47135, 37566, 87943, 40843, -43353, -69155, -29741, 31155, 77103, 55167, -39729, -94587, -28278, 61527, 62839, 13433, -28125, -63749, -50250, 42839, 94063, 11613, -78342, -55601, 2652, 24924, 48041, 40434, -47214, -95282, -4630, 83383, 43068, -23485, -29500, -32075, -21968, 50463, 80903, -11633]
588a1633p2433N6709O9611j916j1391k0320o4466j0877R8228N8433p0229p1179
600e1463Q454K3638K6943N1302r559r7277m2065P6924O9846j1448l4506l6444
612b5655m1028K3216R3604L5429p3569p2366O538M7081M4871K1963l2838o9286
624d2040k4225N3842O8034R179n5274n9124j929M8754M2316O467k7808n4767k8526
637f5101N2709P1785j6412o6814j3810K0727M194K6524L8385m2109p8057K5536
649d2443Q2974j606m6197L564k233l3731L4140P1553l3068q5370J6593O2468p656
662A8988j4324K4066k9998n9726M3212Q3332k6235p0555N272J8620j3586L5037
674A4103M7814n6066p9136L7886O9969j2074j9429J3439l6818m6987N9781Q1843
$$ y = [-11633, -84066, -27357, 42254, 40338, 28947, 8627, -55839, -66716, 31512, 89945, 19716, -51463, -43009, -19371, 7572, 58874, 49315, -47962, -90027, -13103, 56743, 45295, 10789, -25655, -66683, -43467, 50137, 85566, 11997, -60369, -53831, -6750, 38121, 60084, 27246, -42040, -66265, -12423, 55611, 64790, 9516, -49608, -51537, -2783, 39533, 46000, 18192, -36575, -65101, -12392, 59393, 42981, -23833, -37643, -16916, -12722, 13802, 52187, 10078, -67979, -42443, 40531, 38925, -7272, -3708, -5941, -39672, -5532, 66021, 32953, -52417, -35824, 26644, 18988, 4664, 28730, -1268, -60994, -17782, 65550, 39315, -31240, -25968, -7348, -20934, 14103, 61917, 5851, -73285, -35399, 34570, 22496, 3067, 16506, -20312, -67299, -7518, 74325]
686G4325l8906p6042J0366K8152r393K6165M4322m4171p6059K3662P2359L220
698C8000l3011j978r039k8419J9294N6039Q92n6564k4789K8201K3960k658j783
711H145p26k0799j8223K3583L6212j1826l7506L558K5504p497j1255K2440M219
724A5829l5588N72M3564l951m2562J0727L5882j8651k2139K8948O227m1710O420
737a6432N0085j2653m6149J4464K5973k5622j446M2839j4415n7653J5607N1699
749B6297j6137k7495K7781J298m8548J1559O1144j0895n0761J4358K5966k9305
761a4738k960N0384l310n6761L941M4270j1113k4292K9587J2965m4401j2536M2332
774A3368R229k9613L719J9493k1499k3015K6494K7293j7913k1839P762M328j1951
$$ y = [74325, 35419, -40623, -30257, -2105, -11498, 14667, 58989, 14818, -61241, -37579, 34780, 38000, 4989, 3011, -6028, -34447, -15153, 40886, 41778, -14786, -39575, -11374, 12586, 9928, 8145, 7419, -13380, -31603, -8020, 28192, 16366, -21140, -17582, 7922, 425, -10830, 11610, 15829, -19759, -19187, 24377, 20426, -22136, -11409, 24473, 5822, -16317, 12631, 18858, -22852, -16432, 33653, 21000, -25149, -10685, 15288, -10334, -11780, 31059, 16644, -41009, -25402, 26297, 10160, -17335, 10446, 11744, -36804, -25245, 35899, 25004, -25757, -11399, 14567, -14738, -17698, 32686, 29376, -27385, -23444, 20826, 9713, -14579, 15008, 27973, -16428, -28964, 13368, 22597, -7016, -3297, 16196, -5303, -28318, -1824, 25469, 7556, -14283, -6521, -2193, -14144]
787a4144O616K7563k04l6128j5103K7710K0607j1042l853Q843j8912k4616K8913
800c750M4198j8136m2478O527J8947j2091P615L4413j6459n4359Q272M9317k258
813A9758k6306J2199J385l5431P038N0102m528m6263K959K6485j3176m677K9715
826A9260p852m1921J3136M3179j4370l0960J9181J3170k6923O629L9111j8632
838A3008m7661K0775M5517j5927k7220J6094J03l0185J7985M9598j7193n7078
850c2184J814L8190L309o418J3605j4857m4066O636N7758J7956l9257k8073L899
863b1688P050J6700K9953j785m7880k8628L1650M3136L609k1344j9884j6227K173
876b3165L5981L2380k0701m9379j0946L1290K5054K999q680k3615k5752J3286
$$ y = [-14144, -7528, 20035, 19831, -16297, -31400, -3690, 16917, 5875, 2022, 10865, -8047, -32663, -3750, 40448, 22312, -20166, -13639, 5308, -6783, 832, 35245, 18786, -35573, -27301, 22016, 19758, -6548, 5651, 7036, -28395, -21357, 28745, 24217, -22046, -19087, 7398, -5778, -10455, 19260, 11408, -30513, -17377, 25802, 11432, -19528, -347, 12823, -14100, -7471, 31640, 13008, -34653, -13878, 31639, 15712, -11508, 4586, 4689, -25496, -7511, 42087, 24894, -32184, -30370, 7820, 11129, 4711, 18316, 3459, -40607, -33971, 23787, 41743, 2486, -25587, -21688, -14638, 2062, 32015, 30230, -17650, -46278, -14628, 28508, 32117, 10773, -9111, -25338, -23165, 12816, 45196, 24495, -24884, -35830, -4540, 20514, 23513, 14833, -8782, -34534, -21248]
888b1248M4825J1911l4972k6858N203J4102J6145J6660j3494m0717p531M0530
900D556K5981j7287k0644o825n826J3344L6765M046m5999k5960K8634K9871R53
913B1609m431j4883l3255k05N2434K8157l9342l9925N591J6256J3880K5047j513
926B9420n2888l1485M2413M8681p763k8297j6172j6261N175M8925L0340m2063
938A0025n2199Q016L7460J9207O145j1109l9844k2373L8585M8858o151m0107k3097
951b6584Q95K0771L4651J0217l8669m0973R255L9685K2013p846k7721k9085P68
964c2623L7320L2266j2090l9908k3832J3466L6710K4558j3526l8307k1772J6294
976b1444L8012K2104j6590m0737j9649K4160L8117J3234j9605l4429k0545K0555
$$ y = [-21248, 23577, 35488, 516, -26342, -21139, -7037, 9108, 25768, 12274, -28443, -35974, 4556, 30537, 13250, -7394, -14219, -20045, -6701, 30064, 34110, -11889, -37849, -9215, 20656, 21609, 17178, 2295, -30960, -31165, 21269, 49426, 10084, -29841, -24250, -7994, 5886, 30933, 29420, -23468, -54953, -12540, 36141, 28378, 81, -16091, -32352, -27177, 21748, 52088, 10025, -42174, -34158, 3302, 22509, 28654, 17545, -22299, -44672, -6087, 42771, 36620, -3487, -26584, -25689, -4918, 29733, 39950, 1281, -39692, -30437, 9248, 31261, 23415, -4306, -33391, -32623, 4697, 36963, 24873, -15035, -38867, -25401, 11309, 35867, 22341, -15966, -37738, -21444, 16568, 38672, 22082, -18655, -38304, -14144, 23973, 37207, 17602, -16827, -37372, -16817]
988a6817M5562J4416l4784l6827k006K2309K8427J5739k2969m6575q734M1540
1000g19L3505q621k6061k2670j0395K4705M5078L054m7686l1009J8718L1033J7087
1013B6019J679k5775l8118L844M9156K7038k3934l3427j3818N960K9654L2923
1025D1201j0898m9949k2955K7729L5693J0872j4181l2236k5360J7044M4699J6575
1037C8234k7755l4493j1288J7912L5609J9495k4445m1985p728L0066L0841O365
1049C0828k0382l2911j0825K7964L5858K558k9607k8326k666K6615L1439O84l2435
1062a206k7869M503K7881K4415j213l1023k9689R312L5246J7218j2635k3424j9729
1075b8213J927L3267K8930j7922l9748r837K1507K2290J2879m924l1445k4984
$$ y = [-16817, 28745, 43161, 8377, -28450, -30456, -8147, 20280, 36019, 13050, -33525, -42259, -719, 32786, 24165, -1896, -24566, -34961, -10256, 34822, 37876, -9810, -40819, -22101, 8932, 26019, 27698, 1923, -36195, -32351, 16805, 43843, 19909, -13518, -27336, -21376, 8278, 41201, 30303, -19646, -42601, -14872, 20821, 31693, 17512, -14724, -40084, -23040, 21659, 38234, 10479, -24014, -35302, -17390, 18219, 37714, 13269, -28716, -36444, -6378, 24463, 30828, 10446, -22465, -33290, -5326, 30532, 33090, 3483, -24843, -27509, -894, 30545, 31229, -1206, -29075, -24572, 3309, 27724, 26511, -4512, -34201, -24889, 10357, 27575, 14940, -8484, -28213, -26286, 6981, 35911, 17989, -21759, -31596, -10089, 12201, 25080, 20156, -11289, -36273]
1087c6273K1858M0651N366k5600k0905o308Q907K8966J9290k3119l8264l297K7736
1100i92K1958K248j6601k6842r213K4169K8640j727k3455j9967k586J9298K7109
1113B2039J792k8721k2297Q442K2884J5690l14k0278k3478M097K9930J6997j2116
1126A4667k1138j1097M232K0319J8581p851k7753j3429J4043K1513Q881j0971
1138I997k1543j0672J2597K0952O433j1241j9189r946J2729K3700M975j8850j5958
1151a6016J265J0134J3769R657j2033k4561j530K4263J3665q357j0282o566n395
1164a1987Q620K1069J946k3099j3635R943J3098M883n80j0297j5186J589J9099
1177E463R095r871j1715m896K001J0657J1620n209j5815n309Q994R521M446k042
$$ y = [-36273, -14415, 26236, 31602, 6002, -14903, -21211, -12304, 16662, 35952, 12833, -25431, -28728, -992, 20966, 23214, 6613, -20229, -29442, -5273, 23367, 21640, -1815, -21782, -24368, -5070, 22039, 23831, -4890, -27187, -18745, 4139, 19829, 19515, -763, -24241, -20144, 9786, 26783, 14667, -6471, -17568, -13336, 6983, 25564, 17713, -10040, -23469, -9426, 12087, 20968, 9997, -11546, -22218, -9621, 11331, 17764, 6523, -12666, -22612, -9883, 13817, 18792, -58, -16016, -14751, -4617, 9152, 18809, 6776, -17785, -19315, 4948, 18613, 10256, -26, -6592, -11987, -3367, 17702, 19648, -3451, -17086, -7143, 5955, 10838, 10258, -39, -15225, -13636, 5463, 14558, 4687, -7028, -11924, -9923, 734, 12354, 7145, -8670, -13979, -4985, 4536, 8982, 6940]
1191F940j1380q869Q840J5061J57r520m349o51q2Q094R124o758j4823K35J1792
1206C811L052m455r63k962n655K565J1123K21j1394l631O280K497j669J728M82
1221A030o169j816P954M339n135m047K296J931M97K030J0l754n65L806J387j662
1237B132r78k41r08P75K462j229l095P1J611m26o88P2j220j057K197J000k790
1254b312j987K495K567q96j652n60N21J572J337J007m96l366k331M986P530k127
1270F288r152j160N432Q46J101M437m450j3069J740J5941K531j1413k846J677
1284b097o433L258J7133o99k2455n263J6427N198m716M747j870j7964J21K4393
1298I780O565j7748o151O044l365K261J7943q77k4379m875J9314O012o568J762
$$ y = [6940, -4440, -13309, -4469, 10592, 10749, 1229, -3120, -3771, -3853, 4241, 13365, 6607, -8216, -7981, 3811, 6863, 2408, 1445, -1517, -7172, -4607, 6516, 6737, -4657, -8288, -2008, 489, -1180, 548, 1030, -5139, -6955, 999, 5338, 203, -3844, -1548, 383, 880, 2910, 2920, -834, -1399, 2407, 3794, 2132, 1154, 913, 5, 780, 3242, 2013, -1082, -1011, 600, 174, -514, -442, -1662, -2719, -522, 478, -2312, -4299, -1804, 763, -133, -1785, -2345, -1824, -252, 1085, 2092, 1596, -1770, -4101, 885, 8415, 6288, -2864, -4024, 1408, 2254, 3355, 7792, 3342, -9727, -7987, 7954, 10485, -928, -3774, -2097, -8530, -5272, 11861, 11162, -11293, -16556, -129, 5069, 353, 5100, 3230, -14734, -14613, 9780, 16345, -1403, -7554, -1510, -4875, -2614, 15329, 14452, -9927, -14802, 4512, 10524, 3956, 5718]
1312E718l625j5251M413K2939Pk0240l569P987k198L549J3353q244k3449L388
1326a5222K3664K889j2129k763k239o318J0044J9030n563k2235m635J3595J0104
1339H222M030k543j3650j1937Q218J9924P540j2161j8342o215J3011J7096K683
1352A5876j0633j3711r945O264K4712J1562k2234k3021N554J4006O690R083j432
1365A2771k7823j5171K7922K6011j2091j6315n74o735j768K8009J5887k9787k4985
1378b4649J6656J7167k435N327Q05k7548j0893L3339J9757k3526j5026P749n329
1391h606j399K6587O188l6833j5245K8892J4463j1371Q95j134k3292Q75L7344
1404A7364R435l2344j4034J3975M402M842J7880p245l4614m867L2008J6578j0676
$$ y = [5718, 2093, -13158, -8745, 14194, 14201, -6039, -9608, -1621, -3819, -270, 13083, 4839, -18610, -15222, 8442, 11331, -798, -3561, -5800, -12118, -2074, 16956, 11393, -10842, -15477, -1882, 8222, 12252, 9709, -3941, -15878, -7660, 12264, 19804, 7643, -10699, -16914, -3903, 13193, 15876, 5243, -8468, -18413, -12149, 12563, 24125, 1891, -21130, -15576, -1570, 5120, 14203, 12771, -15052, -30223, -2301, 23710, 11619, -4696, -5270, -12005, -13773, 14236, 30123, 336, -24649, -7993, 9174, 6739, 12066, 12871, -14677, -25570, 7769, 27526, 4000, -11026, -3277, -8606, -10005, 16582, 22770, -14063, -29308, -416, 14047, 2676, 3571, 2437, -20855, -19980, 17364, 26799, -5545, -19579, -5604, -1202, 3640, 21520, 14275, -20339, -25206, 6802, 23380, 12704]
1417A2704j1633j1592r024J6101K7311j541k5935j6861K701J6783K1213J005k6286
1430e054j9204P722J7014J4126O093j9356l0356N013L4984J1440j5236r063r255
1443a1132j1915J9428L4730r155l8151l416J9770K381O031J5341k0017l4891J6178
1456a4818L9102o297k3387L709k656j5242K0397L0734k3771l6968J5079K4464
1468A0346q486P49J2495k3933k5451L2400L3989k3708k6134J1980K422q781K5131
1481A3019J9506l6470l0368K7031K7161r102l342J105k4783j0581L7143K4366
1493C4685k5980k4806L228L456P877K3271j41l4537j6059K0299J8798L999j483
$$ y = [12704, 1071, -10521, -19545, -3444, 23867, 22326, -3609, -20470, -17769, -986, 20227, 21232, -5054, -24258, -16536, 478, 14604, 20697, 1341, -29015, -24002, 10982, 22422, 7186, -1877, -11132, -23047, -3619, 31111, 21956, -16195, -19611, 159, 2540, 8571, 23912, 3895, -30996, -14818, 24284, 17987, -5400, -1691, -4347, -19589, 808, 31542, 7771, -29197, -14118, 10346, 1860, 2609, 15104, -8829, -34280, -1880, 32109, 8401, -17733, -5753, -3331, -12112, 13019, 32525, -3945, -34313, -7282, 19879, 10777, 7435, 8540, -16243, -26824, 10319, 34685, 8705, -16101, -12873, -9417, -1540, 21731, 21590, -12947, -29006, -8707, 10091, 14090, 12607]
$$ [...]
8191b33
##END NTUPLES=NMR FID
##END=
