##TITLE=1H_IVBn1904
 CDCl3
 8 sc, 
 20.4.2023
##JCAMPDX= 6.0         $$ Bruker NMR JCAMP-DX V2.0
##DATA TYPE= NMR FID
##DATA CLASS= NTUPLES
##ORIGIN= UXNMR, Bruker Analytische Messtechnik GmbH
##OWNER= root
$$ XWIN-NMR		Version 3.5
$$ Thu Apr 20 13:53:47 2023 Russian Standard Time (UT+4h)  she@DPX200
##.OBSERVE FREQUENCY= 200.1316
##.OBSERVE NUCLEUS= ^1H
##.DELAY= (6, 6)
##.ACQUISITION MODE= SIMULTANEOUS
##.ACQUISITION SCHEME= undefined
##.AVERAGES= 8
##.DIGITISER RES= 18
##SPECTROMETER/DATA SYSTEM= spect
##.PULSE SEQUENCE= zg30
##.SOLVENT NAME= CDCl3
##.SHIFT REFERENCE= (INTERNAL, CDCl3, 0, 15.7039)
##AUDIT TRAIL= $$ (NUMBER, WHEN, WHO, WHERE, WHAT)
$$ ##TITLE= Audit trail, XWIN-NMR		Version 3.5
$$ ##JCAMPDX= 5.01
$$ ##ORIGIN= Bruker BioSpin GmbH
$$ ##OWNER= she
$$ F:/spectra/data/she/nmr/H-F/1/audita.txt
$$ ##AUDIT TRAIL=  $$ (NUMBER, WHEN, WHO, WHERE, WHAT)
(   1,<2023-04-20 13:52:50.75 +0400>,<she>,<DPX200>,
      <created by zg, POWCHK disabled, PULCHK disabled
       configuration hash MD5:
       00 E9 B6 7A A2 85 ED C7 34 08 36 98 17 FE 4E 26
       data hash MD5: 16K
       FC BA D0 D4 D1 13 33 62 BD F4 57 8B 1D 17 28 1D>)
$$ ##END=
$$ 
$$ hash MD5
$$ 36 57 3B 61 3B 06 5F 25 98 17 F2 F4 D7 05 0B AB
##$RELAX= 
##$RELAX= 
##$RELAX= 
##$RELAX= 
##$RELAX= 
##$RELAX= 
$$ Bruker specific parameters
$$ --------------------------
##$DU= <F:/spectra>
##$EXPNO= 1
##$NAME= <H-F>
##$PROCNO= 1
##$TYPE= <nmr>
##$USER= <she>
##$AMP= (0..31)
100 100 100 100 100 100 100 100 100 100 100 100 100 100 100 100 100 100 
100 100 100 100 100 100 100 100 100 100 100 100 100 100 
##$AQSEQ= 0
##$AQ_mod= 1
##$AUNM= <au_zg>
##$AUTOPOS= <>
##$BF1= 200.13
##$BF2= 200.13
##$BF3= 200.13
##$BF4= 200.13
##$BF5= 200.13
##$BF6= 200.13
##$BF7= 200.13
##$BF8= 200.13
##$BYTORDA= 1
##$CFDGTYP= 0
##$CFRGTYP= 5
##$CHEMSTR= <none>
##$CNST= (0..31)
1 1 145 1 1 1 1 1 1 1 1 1 1 1 1 1 1 1 1 1 1 1 1 1 1 1 1 1 1 1 1 1 
##$CPDPRG= <>
##$CPDPRG1= <>
##$CPDPRG2= <>
##$CPDPRG3= <>
##$CPDPRG4= <mlev>
##$CPDPRG5= <mlev>
##$CPDPRG6= <mlev>
##$CPDPRG7= <mlev>
##$CPDPRG8= <mlev>
##$CPDPRGB= <>
##$CPDPRGT= <>
##$D= (0..31)
0 1.2 0 0 0 0 0 0 0 0.06 0 0.03 0 0 0 0 0.0002 0 0 0 0 0 0 0 0 0 0 0 0 
0 0 0 
##$DATE= 1681984370
##$DBL= (0..7)
120 120 120 120 120 120 120 120 
##$DBP= (0..7)
150 150 150 150 150 150 150 150 
##$DBP07= 0
##$DBPNAM0= <>
##$DBPNAM1= <>
##$DBPNAM2= <>
##$DBPNAM3= <>
##$DBPNAM4= <>
##$DBPNAM5= <>
##$DBPNAM6= <>
##$DBPNAM7= <>
##$DBPOAL= (0..7)
0.5 0.5 0.5 0.5 0.5 0.5 0.5 0.5 
##$DBPOFFS= (0..7)
0 0 0 0 0 0 0 0 
##$DE= 6
##$DECBNUC= <off>
##$DECIM= 32
##$DECNUC= <off>
##$DECSTAT= 4
##$DIGMOD= 1
##$DIGTYP= 9
##$DL= (0..7)
0 120 120 120 120 120 120 120 
##$DP= (0..7)
150 150 150 150 150 150 150 150 
##$DP07= 0
##$DPNAME0= <>
##$DPNAME1= <>
##$DPNAME2= <>
##$DPNAME3= <>
##$DPNAME4= <>
##$DPNAME5= <>
##$DPNAME6= <>
##$DPNAME7= <>
##$DPOAL= (0..7)
0.5 0.5 0.5 0.5 0.5 0.5 0.5 0.5 
##$DPOFFS= (0..7)
0 0 0 0 0 0 0 0 
##$DQDMODE= 0
##$DR= 18
##$DS= 0
##$DSLIST= <SSSSSSSSSSSSSSS>
$$ [...]
##$SUBNAM2= <"">
##$SUBNAM3= <"">
##$SUBNAM4= <"">
##$SUBNAM5= <"">
##$SUBNAM6= <"">
##$SUBNAM7= <"">
##$SUBNAM8= <"">
##$SUBNAM9= <"">
##$SW= 18.0517057926174
##$SWIBOX= (0..15)
0 0 2 0 0 0 0 0 0 0 0 0 0 0 0 0 
##$SW_h= 3612.71676300578
##$TD= 16384
##$TD0= 1
##$TE= 0
##$TE2= 300
##$TE3= 300
##$TEG= 300
##$TL= (0..7)
0 120 120 120 120 120 120 120 
##$TP= (0..7)
150 150 150 150 150 150 150 150 
##$TP07= 0
##$TPNAME0= <>
##$TPNAME1= <>
##$TPNAME2= <>
##$TPNAME3= <>
##$TPNAME4= <>
##$TPNAME5= <>
##$TPNAME6= <>
##$TPNAME7= <>
##$TPOAL= (0..7)
0.5 0.5 0.5 0.5 0.5 0.5 0.5 0.5 
##$TPOFFS= (0..7)
0 0 0 0 0 0 0 0 
##$TUNHIN= 0
##$TUNHOUT= 0
##$TUNXOUT= 0
##$USERA1= <user>
##$USERA2= <user>
##$USERA3= <user>
##$USERA4= <user>
##$USERA5= <user>
##$V9= 5
##$VALIST= <valist>
##$VCLIST= <CCCCCCCCCCCCCCC>
##$VD= 0
##$VDLIST= <DDDDDDDDDDDDDDD>
##$VPLIST= <PPPPPPPPPPPPPPP>
##$VTLIST= <TTTTTTTTTTTTTTT>
##$WBST= 1024
##$WBSW= 4
##$XGAIN= (0..3)
0 0 0 0 
##$XL= 0
##$YL= 0
##$YMAX_a= 101405
##$YMIN_a= -126774
##$ZGOPTNS= <>
##$ZL1= 120
##$ZL2= 120
##$ZL3= 120
##$ZL4= 120
##$ABSF1= 10
##$ABSF2= 0
##$ABSG= 5
##$ABSL= 3
##$ALPHA= 0
##$AQORDER= 0
##$ASSFAC= 0
##$ASSFACI= 0
##$ASSFACX= 0
##$ASSWID= 0
##$AUNMP= <proc_1d>
##$AZFE= 0.1
##$AZFW= 0.1
##$BCFW= 1
##$BC_mod= 2
##$BYTORDP= 1
##$COROFFS= 0
##$CY= 11.3945322036743
##$DATMOD= 1
##$DC= 2
##$DFILT= <>
##$DTYPP= 0
##$F1P= 15.7292609196834
##$F2P= 12.9074282941183
##$FCOR= 0.5
##$FTSIZE= 0
##$FT_mod= 4
##$GAMMA= 1
##$GB= 0.15
##$INTBC= 1
##$INTSCL= 1
##$ISEN= 128
##$LB= 0.24
##$LEV0= 0
##$LPBIN= 0
##$MAXI= 10000
##$MC2= 0
##$MEAN= 0
##$ME_mod= 0
##$MI= 1.114404
##$NCOEF= 0
##$NC_proc= 0
##$NLEV= 6
##$NOISF1= 3.799351
##$NOISF2= 2.8
##$NSP= 1
##$NTH_PI= 0
##$NZP= 0
##$OFFSET= 15.70392
##$PC= 1
##$PHC0= -19828.15
##$PHC1= 9.40081
##$PH_mod= 1
##$PKNL= yes
##$PPARMOD= 0
##$PSCAL= 0
##$PSIGN= 0
##$REVERSE= no
##$SF= 200.130013532006
##$SI= 16384
##$SIGF1= 3
##$SIGF2= 2
##$SINO= 400
##$SIOLD= 16384
##$SREGLST= <1H.CDCl3>
##$SSB= 0
##$STSI= 0
##$STSR= 0
##$SW_p= 3612.71676300578
##$SYMM= 0
##$S_DEV= 0
##$TDeff= 0
##$TDoff= 0
##$TI= <>
##$TILT= no
##$TM1= 0
##$TM2= 0
##$TOPLEV= 0
##$USERP1= <user>
##$USERP2= <user>
##$USERP3= <user>
##$USERP4= <user>
##$USERP5= <user>
##$WDW= 1
##$XDIM= 8192
##$YMAX_p= 0
##$YMIN_p= 0
$$ End of Bruker specific parameters
$$ ---------------------------------
##NTUPLES= NMR FID
##VAR_NAME=  TIME,          FID/REAL,        FID/IMAG
##SYMBOL=    X,             R,               I
##VAR_TYPE=  INDEPENDENT,   DEPENDENT,       DEPENDENT
##VAR_FORM=  AFFN,          ASDF,            ASDF
##VAR_DIM=   8192,          8192,            8192
##UNITS=     SECONDS,       ARBITRARY UNITS, ARBITRARY UNITS
##FACTOR=    0.0002768,     1,               1
##FIRST=     0,             0,               0
##LAST=      2.2672688,     0,               0
##MIN=       0,             -126774,         0
##MAX=       2.2672688,     101405,          0
$$ Real data points
##PAGE= N=1
##DATA TABLE= (X++(R..R)), XYDATA
0@%%%%%%%%%%%%%%qJ6j6J6j6K4l2L2m0M8n6O5p3Q8j04J20j36J53j74J98k26K56
36A35k86L20l58L99m45M95n49O09o73P44q22R08j002J103j213J335j472J624j795
55i43J985k198K446k732L063l459L939m535N301o324P770r987J3860k2603Q1895
70F7478M538o0788N4094n0632q855N6260k8343r3341J9435O990m5394L2832M7712
83A986p0997k7996M9671j1106p074P8863L762o0847K6867M0543k3527M1356N9904
96A01405m9739l9182M4882o257k0816N3890k096q2041k229K4413m1691M787M2572
109B7898n4993n5997L4385k584l0578N0501J7076o6923M811M7226j9918J8649
121c0447O6363k6609m2874M6408J8618k0750N0727K5740o3454p087M0532k6285
$$ y = [0, 0, 0, 0, 0, 0, 0, 0, 0, 0, 0, 0, 0, 0, 0, -8, 8, -8, 8, -8, 16, -16, 16, -24, 24, -32, 33, -40, 48, -56, 64, -72, 81, -93, 105, -121, 135, -151, 169, -189, 210, -235, 260, -289, 320, -353, 391, -431, 477, -525, 578, -635, 700, -772, 852, -943, 1042, -1156, 1290, -1442, 1621, -1838, 2101, -2434, 2867, -3457, 4313, -5674, 8186, -14417, 67478, 72016, 11228, 65322, 14690, 5835, 62095, 33752, -59589, -40154, -33164, -78558, -45726, 1986, -69011, -97007, -47336, -58442, -65516, 13347, 17109, -43738, -16871, 23672, 145, 41501, 101405, 51666, 12484, 57366, 51109, 30293, 84183, 82087, 46, -2183, 22230, -19461, -14674, 27898, -27095, -83092, -48707, -51291, -81869, -31368, -14292, -81215, -76404, -29178, -49096, -30447, 35916, 9307, -33567, 12841, 31459, 10709, 61436, 87176, 23722, 16635, 57167, 30882]
133C0882n287M6094l4433o0436K2946N391l8184K5413J9909o2132j9335L6557
145c2615j7042o776N1055j1600m9143K8663K8574j8603L4116M0650m1705j5865
157a0291M6154k135j0465M7882m848n6271J4765K3530l3322J0681L0412n0439
169E653l7061L0571j1063k5996L6952k032n9121P668K9353k4515J3954M3120l1981
182b4498k8370M1758Q950j3247M4032J5102m5315Q124L5486j7651N750L8451k8512
195D0060l9749K5208K971k6987K3663Q397n4384j2996K5643j9561o344L4214k1471
208b1336m3333K4150J6891j8522K8383K5580l9167o420M0669l293j371M3332p871
221C7692m0878K3056K1590k2289J8808K2869m5455k2161K9205j1750j6365K9583
$$ y = [30882, 25595, 71689, 37256, -23180, -234, 5157, -33027, -7614, 12295, -49837, -69172, -32615, -49657, -56433, -5378, -16978, -66121, -37458, -8884, -27487, 6629, 47279, 5574, -10291, 35863, 33728, 23263, 71145, 66297, 10026, 24791, 48321, 14999, 25680, 56092, 5653, -31408, -837, -11900, -37896, -944, -2976, -62097, -54429, -25076, -49591, -35637, 7483, -24498, -52868, -11110, -2160, -15407, 28625, 43727, -1588, 6536, 42022, 24371, 30121, 68572, 40060, 311, 25519, 28490, 1503, 25166, 33563, -20821, -33817, -8174, -27735, -34079, 135, -21336, -64669, -40519, -23628, -42150, -13767, 11813, -27354, -33774, 6895, 3602, 2231, 45563, 37692, -3186, 19870, 41460, 19171, 37979, 60848, 15393, -6768, 22437, 10687, -5678, 23905]
233B3905j4036n1354J0230J8940k3790J2383K5394l7421k1039L5135K791q601
245b7463L6461L033l8287J4697L1844j1731J2620L1042k8637k5599L0450N157
257C3587j6749K4131l39m7908j888K4587j8685k915K2775l0225l5649K5272Q969
270a5037j8756K2584R064m0886R46L5722o820J994L3424j6272k9151L0324J8622
283B5758j4913K1498J3943l9588o083L2089r985q660K3737j9747l9594J6792J4249
296I496k1932Q815J1804l9024j4437L0822k736j0419K5469p175l4096J9066K7232
309B885j2115J1589K2518k6961j3482L5261N875j2232K3531k503l7332J0119K5158
322C2311j7894p69J7268l1377k5150K6508J858k0446J6663j840l8653O471K7796
$$ y = [23905, 9869, -41485, -31255, -12315, -36105, -23722, 1672, -35749, -56788, -21653, -18862, -27463, 8998, 12031, -26256, -11559, 20285, 8554, 21174, 52216, 23579, -2020, 28430, 33587, 16838, 40969, 40630, -7278, -9166, 15421, -3264, -6179, 16596, -13629, -49278, -24006, -15037, -33793, -11209, -2145, -43031, -42085, -6363, -13183, -11189, 22235, 5963, -23188, 7136, 25758, 10845, 32343, 46286, 6698, 615, 32704, 22719, 14059, 37796, 18049, -21545, -4753, 9496, -12436, -3621, 8183, -30841, -45278, -14456, -17192, -27611, -2142, -9317, -43413, -24347, 2885, -9230, 2359, 24877, -2084, -15566, 19695, 25570, 13338, 36869, 34366, -2966, 7153, 32311, 14417, 13648, 30916, -461, -25611, 897, 2755, -17691, -1028, -2868, -41521, -35050, -7254]
335g254j4010N05K3578k0974k0114L2020J2978j3227K1056Q821l1115O250L1569
348C0083r044l014K1435j8724k7081K2111J0819k0582Q405M925l6098p195K5885
361A925r745j1683J7931j4330k9099K0025J8217j5464J0358J5741k6145m337L3956
374G350J479q018K3983m607k7098J8433K2027j6071M837J4480k9218j4411K6266
387A9432l267j7940J4874q283l4534R269J9820j7708K83J5534k4230j4862K8957
400a2655O531j2179J8967L313k6580J2207K8987q253R59J9405j7592j7292K5953
413B1771Q539j6599J0682J531l2038k20K3352j2797r750J3817j9340k4855K0930
426a4977J0769j7587R300P145k7346J656K9864l646n148K0339q979j9883K4345
$$ y = [-7254, -21264, -20759, 2819, -18155, -38269, -6249, 6729, -6498, 14558, 23379, -7736, -1486, 30083, 21039, 18025, 39460, 20736, -6345, 15766, 26585, 6003, 14408, 19333, -16765, -23960, 1925, -7820, -19503, -1572, -15902, -45001, -24976, -6759, -22223, -11865, 3876, -22269, -26606, 7350, 8829, 811, 24794, 20187, -6911, 11522, 33549, 17478, 22315, 36795, 7577, -6834, 19432, 16165, -1775, 13099, 4816, -29718, -20449, -629, -18337, -18054, -2520, -26750, -41612, -12655, -6124, -18303, 664, 3977, -22603, -10396, 18591, 10338, 11297, 30702, 13110, -4182, 21771, 30310, 13711, 24393, 25924, -6114, -6334, 17018, 4221, -5529, 8288, -11052, -35907, -14977, -4208, -21795, -12495, -5350, -32696, -31040, -1176, -4822, -9970, 10369, 1390, -18493, 5852]
439E852J8201j3681R154R985k5946l284K7072m936j2173J3147j2293k7586J4045
452b443J4826j8063j78P332k6003r604K6332L23j2931J3563l454k3043J6002K4614
466G273j0247J769J5433j7247q509K9550O888j3764J2306m65k5629R151K2236
479B8745j4145p030J0825k1297j7495K2687M218j9317O552o29k6283O543K4843
492a783r913o116J4964j2675j2904K6652J3288j3389R660P341k0488N998K7362
505B7997o082q940J2519j2031j8632J9138J0899j9030k65L706k4857l548K2944
518C818o974j4697J0063p983j9548J8345J7006j4724K112J2320j6707o62K9003
531A1372J725j1382J4056j298j8396J6452J9163j4839l058R222j9070r364K2443
$$ y = [5852, 24053, 10372, 19526, 29511, 3565, 281, 27353, 22417, 10244, 23391, 11098, -16488, -2443, 12383, -5680, -5858, 1474, -24529, -34133, -7801, -7478, -20409, -6846, -10300, -33343, -17341, 7273, -2974, -1205, 14228, -3019, -11528, 18022, 24910, 11146, 23452, 22987, -2642, 6509, 28745, 14600, 7570, 18395, -2902, -20397, 2290, 6508, -12809, -6257, -6886, -33169, -26626, -1783, -11696, -17812, -2848, -15523, -28427, -1775, 11513, -1876, 7784, 15125, -5363, 635, 27997, 21915, 12975, 25494, 13463, -5169, 13969, 24868, 5838, 5573, 9279, -15578, -19126, 3818, -3156, -17853, -7790, -15773, -35321, -16976, 30, -14694, -12582, -262, -16969, -17631, 11372, 13097, 1715, 15771, 14473, -3923, 12529, 31692, 16853, 13795, 23017, 3947, -5417, 17026]
544A7026j542j9085N797m131k2667Q777J7823j4750o035J0577j3732q789K4428
557f303O855j3522R449N458j6433J0393K4844p734n788J3143r594j1951K1295
570B0112Q156j8091K459L365k1628N73K0098j1002j3996R156j0249j7321J7449
583a0919J0816j7332K423Q376j7072K242K5573k730r726J3944l095j3652J9691
596H539J5946j3979P03Q954j6161k714K1978l623j5696O930n264j9009J1025J3009
610A0638j6310n323P169j5088o497K1446J334j4368Q012J819j5029J2277K0788
623A0868r469m279J2715r280o308K2821O037j5708N487L035j7420O129J8595j2422
637A0801j0850Q092j1666j2698J7687N010j8178J561L693j7065M661K1020p401
$$ y = [17026, 15484, -3601, 2196, -1935, -24602, -15825, 1998, -12752, -18787, -8210, -21942, -30731, -6303, 552, -12970, -3521, 1937, -14496, -4103, 20741, 13007, 7219, 20362, 10768, -1183, 20112, 28268, 10177, 12636, 16001, -5627, -5054, 15044, 4042, -9954, -798, -11047, -28368, -10919, -103, -17435, -15012, -6636, -23708, -21466, 4107, 1377, -8349, 5595, 2500, -11152, 8539, 24485, 10506, 11209, 20163, 4002, 1288, 23266, 19643, 3947, 10877, 5613, -13396, -2371, 10638, -5672, -10995, -3826, -18914, -25411, -3965, -2631, -16999, -8987, -7168, -22197, -9920, 10868, 1399, -2880, 9835, 555, -5753, 17068, 23105, 7397, 12884, 15919, -1501, 4628, 23223, 10801, -49, 8043, -3623, -16321, 1366, 6376, -11802, -10241, -6548, -23613, -18952, 2068, -5333]
650e333r567J0870m842r244K0441J1689j3940K596Q222j2806L792K1519n341j2472
664E584Q261m752j3521J4048R881j7464m233N619j5124l208J8923m321j5608O524
678i391j401j3315J3906J5134j3359l050J1095r144j221K3218J298j3846Q246
691H170K475j2680J1796J5872j3957p385Q480j0928o989J7833m65j8301K380O81
705c018j4667P246J4889j2235q829Q889o351n534J8956N671j4170M447P072r971
719g605P361J8989p720r357R811l627q254J5487O558j7231j400N715j3361N19
733d115J6298r010j4772P080l098j1452J3570R074j5993j489R161r377J422K0097
747G396l212j2309R663J829r010J3774J2236j4009l170R029q918k221J6713l724
$$ y = [-5333, -14900, -4030, -8872, -18116, 2325, 14014, 74, 2670, 10892, -1914, 1878, 23397, 18056, 5584, 13845, 9093, -4428, 9620, 19501, 2037, -2196, 3423, -11701, -14909, 4014, -307, -15915, -9391, -10792, -24107, -10201, 4933, -8426, -11476, -381, -9525, -10746, 12472, 13770, -76, 8170, 10645, -2035, 9761, 25633, 11676, 4291, 12771, 1843, -5146, 12687, 12222, -6079, -3699, -3018, -17685, -10439, 4450, -7785, -16614, -7725, -14076, -19610, -654, 5017, -9153, -4706, 2366, -7605, -244, 18745, 11025, 1668, 11479, 7852, -402, 15085, 21643, 4412, 3012, 8727, -4634, -4115, 12183, 3173, -11599, -4519, -7617, -19069, -5499, 3575, -12418, -13907, -4746, -14123, -12701, 7396, 4184, -8125, 1538, 3367, -5643, 8131, 20367, 6358, 3188, 12217, 3299, 1078, 17791, 14067]
761A4067j5669M541J76j2127Q097J0595j4447p220P936p504m360J6003O52j4208
775a3468M845N148r471Q479J5462r665o569J0825l497m969J6725L732j5397K351
789D531N843j0939M121J4329j1259j1320P758m590q811J3076L706j6584j21O233
803d027j0208L178J5322p015j0669R204j8o799J4050Q492j3160K7Q631o721J349
818A636J5682m763j2123N969Q37r209R377Q057j5109n461O993p881l162J3835
832D678l528j4587M767L150r282Q939J1205j2050m725J0547l834k073J6530Q57
846A0594j3673N528N739q309P356J2251j2091p737Q393m889n356J2473k16j6294
860f231J247M253r454L718J1311j0572r223Q347j436m992J3166M206j2985J864
$$ y = [14067, -1602, 2939, 3115, -9012, -915, 9680, -4767, -11987, -4051, -11555, -15915, 88, 740, -13468, -8623, -3475, -12946, -4467, 10995, 1330, -5239, 5586, 2089, -2880, 13845, 17577, 2180, 4531, 10374, -565, 3556, 17885, 6626, -4694, 3064, -1526, -10337, 2739, 6445, -10139, -10260, -4027, -14235, -11057, 4265, -2750, -13419, -4215, -4233, -11032, 3018, 11510, -1650, -1623, 7008, 287, 1636, 17318, 12555, 432, 6401, 7238, -1971, 7406, 15463, 354, -5107, 1886, -5995, -9157, 4678, 1150, -13437, -8670, -5520, -14802, -5863, 5342, -6708, -11433, -886, -4720, -6793, 9737, 10594, -3079, 2449, 8188, -121, 7235, 19486, 7395, -342, 8051, 3162, -2194, 10279, 10063, -6231, -4984, -731, -10185, -6467, 4844, -5728, -14951, -6604, -8040, -13032, 134, 4340, -8645, -6781]
874f781Q277n379M287J3566o367r706Q427Q61o048J0501N135j4807k528P200p575
889i37p23J1751p453j3674O115R89q166R120O330j4017k881R848m583o0J4152
904E811l027j1624P671M873o160R296Q910j2253m124R387l974k397J1499l226
918A0662j3959L343L773q059M301P547j2172p366Q132k721l864J0854j2j3128
932a2669L651P205n374M788J0985q607o791J0079O60m069J1155K483j3745J837
946A588P433o638J405R765r383j0514P707m80p064Q477J919j4391k27P620o019
961h802Q46J0845o375r434Q449L120m719R068N659j1018q55R781l412l20J0872
976A3705m112j1219N932L614o933M944N009j2475m878P629l832l595Q958l454
$$ y = [-6781, 1496, -3883, 404, 13970, 7603, -2103, 6324, 7185, 1137, 11638, 16773, 1966, -562, 6638, -937, -1660, 10091, 2638, -11036, -4921, -3932, -12098, -2978, 3352, -10665, -13546, -3698, -8281, -8341, 5811, 2784, -8840, -1169, 3704, -2456, 6840, 15750, 3497, -627, 8760, 4786, 2389, 13888, 10662, -3297, 46, 3819, -4240, 61, 7608, -4564, -11930, -3798, -6519, -10383, 471, 459, -12669, -9018, -1813, -7187, -2399, 8586, -21, -6812, 3267, 3927, -142, 11013, 13496, -249, 1588, 9021, 2383, 3788, 13553, 4170, -6344, 1363, 883, -6181, 2296, 4215, -10176, -10403, -2783, -8802, -7956, 2889, -3486, -12920, -4471, -1351, -6070, 2998, 8657, -2361, -3216, 6565, 3153, 2833, 13705, 9593, -1626, 4306, 7920, 987, 5931, 10940, -1535, -6413, 1216, -2616, -6211, 2747, -707]
990g07j2518M609N272o040M718Q086j0167m174J0575l20k414J0959q3j1308M838
1005A326P513n939L789Q256r967p078Q401j337n698Q083j145j3577J406N973o613
1020f607J299P603q484p960Q572J274m299Q456L034j0713J856R042k670J226R669
1035A1298n530q193P983K906n154O024K972j2275k207P801m344k741P252n878
1049h6j1093N698L286o347N163M280j0957j840R907j901j168R764k689r128O852
1064b59O206m771N257N776r778l236Q563j549l252O994l192j1472L329M996o274
1079b662J584M772r638n969Q473k22l904O861k09j0056L447Q362l472J844P680
1094F891o663n330R186K313m366O631J296j1038J502P975m865q50O173p624q449
$$ y = [-707, -13225, -8616, -3344, -9384, -4666, 3420, -6747, -10921, -346, -666, -3080, 7879, 7796, -3512, 1326, 8839, 2900, 6689, 14945, 4978, -2100, 6301, 4964, -734, 7349, 6204, -7373, -5967, 6, -6607, -5308, 2295, -6189, -14149, -5577, -4303, -8602, -146, 2888, -7825, -5969, 3073, 403, 1629, 11298, 5768, -2425, 5558, 8464, 3310, 9334, 12306, 31, -2176, 5625, 1281, -1460, 5792, -86, -11179, -5481, -2195, -8542, -3379, 901, -10056, -11896, -1989, -3890, -5058, 4706, 2017, -7111, -259, 5947, 1176, 6433, 12209, 2431, -805, 7758, 6209, 2957, 9951, 6759, -4713, -1384, 3612, -2662, -1078, 3694, -5944, -11913, -3440, -3662, -7566, -705, -914, -10970, -7523, 839, -2633, -789, 6891, 228, -5102, 4084, 6397, 2031, 8662, 9958, -1080, 422, 8397, 3532, 2682, 8855, 1231, -7218]
1109g218P144J559o264M873J207j0931M1Q222l460r06P577m919p351P700M919
1124B193m309N060M014r017k67R330j646k203O699l513r109N424M665n906J674
1139C089L257r604l809P943j514m229N234k167r671M488O369m557J738N385o927
1154d975l261R515J304l553O646K65q907M109P330m252K22N572p452n712P398
1169D249O37n449L996n96j0065J343O691m443j222N353o033n809P701L108m338
1184d877M676K320p776J412Q951j981j243O373l836o374O519M062n211K492K305
1199G812r344j485P678k874l805M746l921q410N316M302n325J901L558p724j451
1214i026Q943j96k850N915j132p032N498O413m180J688M204p198k602P710j41
$$ y = [-7218, -74, 1485, -4779, 94, 1301, -9630, -9589, -1367, -4827, -5733, 1844, -3075, -10426, -2726, 2193, -2116, 2944, 6958, -2059, -2326, 7004, 5358, 3155, 9854, 6341, -2768, 2656, 7321, 1415, 3089, 6346, -3258, -7067, 876, -638, -4867, 367, -1800, -11471, -6983, -614, -5171, -3433, 1952, -4975, -8236, 1279, 2583, -970, 5676, 5941, -2966, 1143, 8473, 4221, 4443, 10015, 2563, -3149, 4249, 4886, -563, 3433, 2837, -7228, -5885, 806, -3637, -4859, 494, -5539, -11348, -3647, -539, -4877, -201, 2119, -5657, -4245, 4706, 2725, 1482, 7855, 4019, -2355, 4164, 8226, 3015, 5507, 7812, -1532, -3017, 4661, 1787, -2018, 2728, -1193, -9603, -4287, 15, -5310, -3409, 149, -7575, -9026, -83, -279, -3129, 2786, 1654, -5378, 120, 6533, 2353, 4041, 8245, 1047, -1555, 6155, 6014]
1229F014m332L849j671q710K874N626m957q12L512o437m337P402J231m302L714
1244a336P63p359K639P854k668r27N450m159m564P849K980m618L390R87p826R75
1260e70P441l316k837M092m698o455O280K778n861J914J432p560K03P608j899
1275a448k744M547k742n269O433M814m074J963K878o279K9P777q72l249M111k292
1291C583o631M583M971n256l24K650o632k453P037p02m771L332j403o466L871
1306d611N976m014o94M329m609k661Q331J448m066L705M28o251L505O706l720
1321C802j308L277m640l955O686J212n822J905K12o946J290O236l433k690L403
1336g71l600m039O480L178m523J890K111n230J399P687j340k787L997j891m333
$$ y = [6014, 1682, 5531, 3860, -4850, -1976, 3650, -1307, -2119, 1393, -5044, -9381, -1979, -748, -5050, -1336, -573, -7932, -5293, 2561, -107, -1034, 4416, 257, -4307, 3542, 6522, 1904, 5294, 6281, -1545, -570, 6871, 3555, 718, 4810, 112, -6343, -63, 2715, -3146, -1232, 200, -7360, -7157, 451, -1448, -4192, 355, -2387, -7656, -1223, 3591, -483, 1480, 4358, -1921, -1892, 5885, 5013, 1764, 5875, 3583, -3048, 1535, 6506, 1250, 926, 3576, -3056, -5509, 1528, 826, -3945, -613, -2016, -8482, -4611, 1365, -2649, -3343, 986, -3623, -6284, 2047, 3495, -571, 3134, 3562, -2689, 816, 7522, 3802, 2494, 5771, 1131, -2824, 3862, 5074, -748, 1157, 1369, -5577, -4287, 1949, -1484, -4174, -771, -4371, -8410, -1930, 1248, -3275, -1385, 726, -4504, -3105, 4582, 3242, 455, 4452, 2561, -1772]
1351a772N604L901n602P14K177o226j093P086k434m548L104k241n892M536M297
1366A611n264j8K798m910r01P750k38l794L592L8m671M922N196l980n54L450m368
1383F59j854O903O6m895K104o15o032K743M797m267k191K689m244k549O213J236
1399G63m988K120Q84m906K784O043k554j702L804k387k885O508K574m880J466
1414B644J573n532J387O190l082l557L057k616m577N046K607n607L39J674n135
1429e589N23O573j889l654L263j154l811N424M094m069J20K848l670k23O627o20
1445D793m019K603o76m353L529M088m713j636K523m464j549N708n49m853J680
1460a888P6m775L574M835l841j590L460k670j461O685J080m326K166J263m177
$$ y = [-1772, 3832, 7733, 2131, 2845, 5022, -1204, -2297, 4789, 2355, -2193, 911, -1330, -7222, -2686, 1611, -3653, -3671, -873, -5783, -6684, 1066, 828, -2966, 626, 664, -4007, 915, 6111, 2131, 1577, 5027, 659, -1195, 5708, 5774, 879, 2983, 2368, -3664, -921, 3876, -391, -2582, 107, -4137, -6686, -473, 763, -4225, -2105, -1221, -6127, -3343, 2700, 146, -1556, 2248, -139, -3024, 3484, 6058, 1178, 2644, 4217, -1315, 72, 6262, 3180, -377, 2680, 64, -4513, 533, 3140, -2467, -2128, -454, -5589, -5066, 1507, -382, -4036, -773, -1927, -5738, -314, 3780, -289, -169, 2679, -991, -1214, 5413, 4793, 774, 3377, 2701, -1652, 1877, 5965, 1252, -384, 2139, -2325, -3874, 1834, 1285, -3568, -1888, -1812, -6587, -3013, 1822, -2019, -3609, -149, -2819, -4280, 2405, 3485, -841, 1325, 2588, -1589]
1475a589K972N447l342k527K823k734k649N331R25n328L79O37m324J112N054l167
1491i80l264K656j733k873N131K572m366P14K176k995J102O296j519l080L018
1506B855o51k994M421L032m684o70K086m053m19N227j935m952J902p01l954L670
1522a820L231m690j057K848k780k38O039l86l890K437J048l068L589M435l789
1537A909j343K885k020j350M893L6n058Q15Q30l800J711L780l967k874K473k008
1553c088j958M956O60m640J126J912l072K173N076k487k479L215o32j784M769
1568C747J748m641L41K183l377P67M701k888l758K077j082k904L797J656n075
1583b708l59J882k962N04M874j746l347K432N79k390L958K935l928n64K943k096
$$ y = [-1589, 1383, 6830, 3488, 961, 3784, 1050, -1599, 3732, 4657, -671, -292, 345, -3979, -2867, 2187, -980, -4244, -1588, -3321, -6194, -1063, 1509, -2857, -2143, 33, -2962, -1860, 4436, 2917, -163, 2855, 2204, -790, 3631, 6663, 1979, 1309, 3395, -658, -1077, 4150, 2215, -2737, -835, -1536, -5490, -1820, 1411, -3279, -4336, -1488, -4268, -4506, 1533, 1147, -2743, -306, 742, -2326, 1263, 5698, 1909, 566, 3451, 1431, 81, 4974, 5010, -48, 767, 1597, -2203, -492, 3288, -679, -3553, -1080, -3088, -5046, -90, 570, -4070, -2944, -1032, -4104, -1931, 3145, 658, -1821, 1394, 762, -1022, 3747, 5495, 854, 1195, 3378, 1, 768, 5469, 2581, -1177, 900, -182, -3086, 711, 2367, -2708, -3067, -1185, -4147, -3643, 1231, -515, -3862, -1430, -851, -3241, 717, 3652, -276, -840, 2103, 7]
1599Gj55M989o78m176J721N99l134K684K643m123k140K300k054j322M249o28m763
1616c981J577J007k977K307L917l422k170L328j018r01M903N92l916J203K081
1631B530k840J941L872l058k798K657j171k209M015L10m722r4J731k836P59L621
1647A708k742l291K190N6j864L858J790m144L7K734j344N72M359j318l202K373
1663A772M84k010K846K126m629r74K450k117p15L836j767m270J613M64k601K396
1679a096K248m028j124K862j315k86M264l12l682K079J614k066K569K673l078
1694A322j553K794r88j253L720m81m269N58J300k602J244K452l211k494K339o84
1710a806j539L328N87l830L07K570j647J271L483k208k496K830L97j599L206J357
$$ y = [7, -148, 4841, 4163, -13, 1708, 2307, -827, 1857, 4500, 377, -1763, 537, -1517, -2839, 1410, 782, -3981, -2404, -1397, -4374, -2067, 1850, -1572, -3742, -414, -1432, -2333, 2570, 3162, -754, 449, 2530, -310, 1631, 5503, 2445, -353, 2304, 1133, -1076, 2939, 3249, -1473, -1567, 164, -2672, -1913, 1708, -1034, -4325, -2135, -2079, -3943, -85, 1705, -2439, -2402, 332, -1012, -440, 3919, 2601, -601, 1772, 2256, 246, 3092, 5218, 589, -385, 2065, -52, -767, 3069, 1302, -2968, -1355, -891, -3492, -1096, 1152, -2876, -4000, -1138, -2453, -2739, 1525, 1213, -2469, -390, 1224, -842, 1727, 4400, 1322, -231, 2563, 1575, 322, 4042, 3561, -708, -150, 1150, -1452, -208, 2244, -967, -3461, -1122, -1806, -3345, -17, 570, -3260, -2953, -383, -2030, -759, 2724, 516, -1980, 850, 1247, -352, 2854, 4211]
1726D211m115j51K428j816J28L216k423l298K167p9k098K207J220l978o57K572
1742d66j812j39L741j516l141J842J289j710K609K080k987j022K816o90n66L195
1758C523q44l391J124J408j915J411J949l479k067K547o71j395K862n36l722R08
1774b288J871j925J209K619k676k007K979K68j383L243M08l534Q12K512j749P94
1790A153K727k544k453K411N2j752K376K35l795jJ994j397k46K488k235k573K163
1807a397M53j405K151J279k980qK535o84k51L173j091k894J959J542j896J771
1823B257J350l374j178K743j165q33K543j375l558J232J268j988J261J579k915
1838b153j449K839k27r12K828k95k863J319K161j373J273K178k607j439K414Q9
$$ y = [4211, 96, -55, 2373, 557, 685, 3901, 1478, -1820, 347, 268, -1830, 377, 1597, -2381, -3038, -466, -2278, -2417, 1324, -192, -3333, -1491, -202, -1912, 697, 2777, -210, -1232, 1584, 894, 328, 3523, 2679, -712, 412, 1820, -95, 1316, 3265, -214, -2281, 266, -405, -1800, 1062, 526, -3196, -2288, -417, -2342, -1133, 1486, -1190, -3197, -218, 50, -1333, 1910, 2318, -1216, -404, 2108, 359, 1153, 3880, 1336, -1117, 1294, 1346, -406, 1970, 2205, -1590, -1591, 403, -994, -1240, 1248, -987, -3560, -1397, -944, -2349, -198, 1081, -1899, -1907, 628, -56, -307, 2866, 1775, -1119, 840, 2382, 486, 2257, 3607, 233, -945, 1798, 633, -200, 2343, 968, -2590, -1358, -90, -2078, -817, 762, -2153, -3602, -763, -990, -1902, 926, 631, -2232, -913, 1248, -125, 1148, 3326, 719, -720, 1694, 1783]
1854A783j413K125m1l670O13K021j751J08J846k335k334K061K27j295J743P43
1870D31l273M95K517j103J76K505j505k160K369J137j355J802Q57l215Q4K422
1886B184j391l05K170j762k769J664J038j967J307Q11l195m24K343p61l15J968
1902E96q08k756J855J649j508J330J477k396q90K733o1r43K449n40l143J365J618
1919B027j629M08J374k553j647K328J27j769J752j73k832O41J989j309N4K057
1935H45j923j739K694N28j105J675L72k419Q52K242j174J5J812j532k262K307
1951A188O32j728J027L38l060J14J960j100n57J821j250k464J852J096j318J121
1967c28R22k324k92K686j45o75J974o64k083J594J713j690O67J264k343j136K231
$$ y = [1783, 370, 2495, 2454, -1216, -603, 1418, -333, -225, 1621, -714, -3048, -987, -760, -2055, -312, 431, -2842, -2347, 170, -933, -757, 1748, 243, -1917, 452, 1589, 234, 2036, 2893, -322, -238, 2184, 793, 488, 2658, 896, -1873, -209, 829, -1138, 169, 980, -2215, -2639, -296, -1057, -1372, 596, -212, -2968, -1113, 536, -972, 358, 1835, -561, -1451, 1282, 1221, 278, 2727, 2187, -956, 409, 2027, 398, 806, 2180, -373, -2020, 308, 435, -1334, 418, 245, -2587, -1946, 43, -1266, -1212, 845, -1078, -2817, -123, 405, -700, 975, 1347, -1072, -220, 2022, 848, 863, 2675, 1143, -1119, 1188, 1820, 92, 1119, 1457, -1603, -1489, 471, -629, -1186, 635, -615, -3079, -1227, -131, -1449, -328, 594, -1730, -2022, 664, 519, -156, 1818, 1154, -929, 665, 2378, 688, 1355, 2619, 276, -860, 1371]
1984A371m82j063J330q79k536R84J475j536K82J434k351r64K352J10q30J768r6
2001C69k129J153K051j036K31J792j809j403K425N20j601J136J89k822L47J952
2017A365j228m57J041j575j832J900N30j460J031Q20k310n2K293m07n75K004q00
2034B88j669J915J094j147Q85R81k487n2J954m36r51J148q93k168J348J263j688
2051f15L53P86k345m57K296n68j029J544n16j889J420J628j059M03J221j321q55
2068a003K423L65j409J292j1k259Q36J821j624j06J020j726j096J786L26j678
2084a043Q48o1k122N96K018j168j01J428j096j471K172R28j370J184N17j961N45
2101a57K022p23n80J338j240j581J569J063j508K74L71k093j67J933p09j166J180
$$ y = [1371, 889, -174, 1156, 277, -2259, -1275, 200, -1336, -1054, 380, -1971, -2935, -583, -473, -1303, 465, 369, -1760, -607, 1444, 408, 639, 2431, 622, -781, 1644, 2164, 563, 1699, 1888, -934, -587, 1365, 137, -320, 721, -854, -2686, -786, -256, -1716, -685, 135, -2175, -2227, 66, -341, -916, 1088, 288, -1381, 534, 1628, 481, 1366, 2347, -140, -192, 1762, 1326, 375, 1523, 630, -1538, -190, 1073, -615, -262, 524, -1821, -2278, 18, -550, -1579, -35, -551, -2440, -1020, 608, -451, -48, 1173, -148, -1003, 1420, 1785, 376, 1668, 1657, -602, 234, 2055, 431, 325, 1345, -381, -1477, 309, 635, -1043, -195, -256, -2378, -1782, 236, -932, -1033, 395, -701, -2172, 0, 928, -442, 742, 1259, -702, -157, 1865, 1142, 562, 1900, 660, -921, 648, 1711, 203, 477, 848, -1245, -1412, 521, -188, -1354, -174]
2118a74n25j762J426J195j218L50J129j596o7K021J12j026J177J1j723J117J650
2135B097j340J01Q56j905n69K082j16j584Q10m06j955R26J429j306k89J011j050
2152a208r19J894K49j003J034L38j598Q85J720p78l84J243r22q19J586M29j184
2169E63M10J70j770L44J520j262p03R74q36j482J411P28j368M10O95j538K12K013
2187D91l92o02J141j70j545J745J064j316L15P60j532j27J720m58j085P98j81
2204F26j910R23J278j447l29R32j361o20J919m6r50O86l6j300J139J577j067j27
2222a13Q59q40m18J707L74j385P02L00j693O80J232q34n82O21j048r70J648L81
2240F21j596O01L42j567M58J450o39n74J028n43q54J481R90j426N33M92j010K51
$$ y = [-174, -699, -2461, -1035, 160, -1058, -708, 421, -1175, -1242, 779, 891, -135, 1042, 1053, -670, 447, 2097, 757, 858, 1714, -191, -760, 1322, 1206, -378, 432, 26, -1929, -1003, 426, -880, -1169, -158, -1208, -2127, -233, 16, -987, 47, 385, -1213, -328, 1392, 614, 230, 1473, 551, -268, 1318, 1747, 563, 973, 1143, -627, -283, 1237, -25, -728, 246, -590, -2072, -661, 67, -1301, -891, -196, -1734, -1522, 491, 99, -503, 638, 468, -1077, 668, 1732, 416, 731, 1491, -41, -168, 1552, 1094, 9, 807, 626, -1284, -361, 917, -530, -859, 73, -1288, -1908, 11, -35, -985, -299, -335, -1635, -496, 1081, 14, -113, 746, -94, -512, 1195, 1569, 184, 886, 1186, -507, 173, 1405, 571, -11, 610, -438, -1408, 240, 621, -975, -374, -32, -1599, -1141, 309, -330, -904, 124, -419, -1273, 208, 1198, -228, 305, 797, -213, 38]
2258C8J693q10q82J096n95j308J183R39j437o3P44j350j96J491m54j048O54r0
2276c95j118R94J039j331J76Q27j009j68J724J21j056P87K40j192P23J332j032
2293F62m42Q56q66q67J742J03j546J65K95j387M13J400j025o29R05o58n77J439
2311a7J14q75N90L89r23Q01J181o68o66R65n03n80J271M54j505K21N54j029r6
2330c22J251o50r27N57k44j112J222M09j147kO29q38J26J756m16r91R48l9n91
2349c81Q92R03r85j93Q59r26n02J597m04j115N85k5j022O55O52j130k21P00o46
2368g07n01J247Oj091P61P0q86P80J080o25m94P55k54n50J227L90j114J40M82
2387G16q18L09J185q94q09P86m39q94J137L19j357LO21p93O2J286n07r90R80j53
$$ y = [38, 1731, 921, 39, 1135, 540, -768, 415, 1354, -83, -146, 598, -752, -948, 543, 89, -959, -305, -395, -1513, -519, 520, -811, -635, 192, -817, -985, 739, 860, -196, 591, 831, -361, 362, 1694, 662, 220, 1076, 210, -657, 1085, 1188, -358, -193, 102, -1285, -872, 528, -497, -1126, -221, -879, -1456, -17, 97, -778, -188, 201, -722, 79, 1260, 592, -74, 891, 388, -192, 1079, 1533, 28, 249, 803, -226, -322, 929, 279, -648, -91, -335, -1447, -225, 184, -963, -965, -336, -1174, -1048, 708, 292, -699, 249, 210, -381, 511, 1414, 429, 236, 1095, 169, -333, 1264, 860, -255, 330, 305, -717, -62, 590, -540, -761, -61, -707, -1208, 39, 45, -1046, -285, -215, -1101, -321, 759, 134, -360, 395, 141, -409, 818, 1208, 94, 234, 716, -102, 207, 1392, 498, -311, 475, 36, -858, 279, 598, -759, -756, -135, -928, -866, 420, -87, -1077, -97, -250]
2407b50o37J039O90j189J40Q74q67oJ616o66r65Q20Or23N67Q46r88m57Q73q87
2427c64k72J327n69j043L05L79r93R80P83r64m81Q55l86r4J208J28j102M35L14
2446D46o74O35Q89q33o92R32m43n20J109k97j110M00L07r90K12J085r02p59O91
2465e14o2n59J155J71o86j1P20n25J06J287n81q13R00j43m75Q59L39r19j9L94
2485F24o62j50P30j90j251P53p7p07N63P24j110j42O92l77j62J184k43q10P87
2504A76K52o91O83P69p81n27R61m31k19R09l52r43K74L37q65J82Q20q94o41P89
2524a92j89m00P10J34j106N08M84m29J50R98p89k38N98J67o79J092K37r80j29
2543e3O81o18J48R21o56q36P24j78q23Q58K79j155j86Q37n59m8R92m95n60N49
$$ y = [-250, -887, 152, 842, -347, -207, 667, -200, -206, 1410, 744, -221, 599, 605, -318, 249, 1095, 107, -350, 523, -364, -636, 691, 122, -921, -616, -237, -1230, -250, 533, -431, -912, -57, -443, -537, 671, 799, -303, 132, 446, -228, 407, 1296, 463, -229, 703, 260, -260, 849, 552, -558, -158, 149, -841, -629, 456, -446, -1205, -514, -576, -1135, 20, 191, -495, -506, 214, -311, -205, 1082, 501, -312, 588, 445, -30, 829, 1168, 249, 230, 624, -38, -188, 542, 352, -899, -146, -223, -930, -367, 357, -753, -895, -203, -580, -742, 442, 199, -611, 176, 428, -263, 420, 1189, 408, -119, 842, 411, 192, 1101, 749, -194, 80, 417, -448, -266, 554, -340, -981, -192, -381, -781, -71, 63, -1043, -535, -51, -480, -330, 668, -121, -359, 239, 406, -273, 819, 1056, 76, -53, 628, 10, 158, 1079, 423, -413, 311, 133, -690, 168, 447, -708, -894, -57, -616, -664, 328, -167, -727, -178]
2563a78L28n95M77P02q63P7N05j77k55R25l16p19M19M10p71M04M28q48l16M62
2583I9m62j36P79l26q09L93L10o50L53O72o76m07P77j37n7O35J23o00J91N70n84
2604E8K61R11j059l78O07O6m43L82L59j427L39M59o35K20N55p75n06O34L0l78
2624g20O77J63q18L49M25j44J38O45l19p88P16L21n33M41M12r38j48N57l14k67
2644a45O41k85q23M04M2l86J30N27p67j59N95k26j20P02P2j098Q66O15o64M75
2664C96N44p61m19R95j91k84N06k10r38K43M70n57M0L76m21n22N34L3m18N92k4
2685a6o82K53N42k57K71N28n40l54M76J34l66O28J16o09k31Q53n97q4O53n27n20
2706c29M69L67j111M50M37q74P2N76m59j24M85o2o36N76J79l69J90Q15p28j81
$$ y = [-178, 150, -445, 32, 734, -129, -52, 453, 276, 21, 946, 630, -89, 330, 740, -31, 373, 801, -47, -363, 99, -363, -499, 280, -46, -855, -462, -152, -802, -449, 223, -453, -860, -83, -220, -277, 358, 481, -119, 72, 642, 58, 319, 1230, 171, -207, 400, 466, 23, 405, 764, -663, -324, 135, -500, -280, 275, -500, -1006, -372, -342, -720, -43, 120, -698, -349, 76, -68, 70, 715, 396, -392, 324, 645, 112, 553, 965, 27, -121, 436, 122, -145, 496, 211, -612, -208, -166, -552, -422, 105, -662, -821, -226, -452, -572, 130, 202, -896, -30, 585, -79, 396, 940, 179, -240, 755, 564, 280, 786, 576, -362, -119, 351, -206, -166, 210, -211, -733, -199, -166, -584, 8, -16, -698, -445, 97, -160, 111, 639, 99, -255, 221, 355, -11, 617, 733, 124, -107, 746, 149, 65, 718, 191, -329, 140, 507, -604, -154, 283, -591, -519, 57, -402, -526, -41, -103, -739, -163, 16, -353, -163, 652, -76, -257]
2726b57O91p2l27O48k72o98O05M08p26K54J91m39m92N00R8m53L03o9o00K06N88
2747H7m48QO51n05m26P40l0k99L59N05j039M56L73l77q6P16m62o22P03P4n07M22
2769B93K28q98J07L43j92k95N99m58m32K22N54p65M60M63p90n5J002n14j2N49
2789D09l18k96J64N02m81N66K52p61m6O43j06o49N32j68q42M16K30m91K09L75
2809A40n16m64O07j2k37M79J65o98O18K62j95j00N78l16o14P75J63p81N14K57
2829F25p74K73K89l27l42N90n79j09R9L21n66L30l8l68p9P29j71k29O11k73m62
2850d50M92K79k21K95J31n62j69P02l68Q7jJ18p43K41K71n49L71K50o28k42O93
2871cj25k57M52K5p18M67K51m71J89O41n48l46M74Q9j48L35J82p43L48M56l44
$$ y = [-257, 434, 362, 35, 683, 411, -287, 318, 726, 0, 254, 445, 6, -486, 14, 112, -341, -38, -107, -707, -501, 87, -361, -353, 298, -207, -633, 107, 77, -222, 137, 642, -397, 59, 432, 55, -31, 685, 223, -399, 304, 378, -129, 293, 521, -377, -270, 73, -119, -414, 185, -273, -705, -483, 71, -694, -234, 229, -561, -616, 386, -128, -140, 409, 91, -205, -41, 461, -20, 546, 798, 37, -9, 634, 528, -121, 411, 243, -599, -183, 47, -444, -235, 140, -376, -840, -233, -245, -482, -3, 162, -536, 82, 344, 149, 49, 627, 311, -303, 472, 635, -146, 368, 625, -149, 124, 413, 86, -256, 334, -245, -354, -255, 66, -500, -170, -208, -576, -655, 74, -97, -326, 285, 12, -450, 42, 321, 100, 395, 526, -36, -205, 497, 129, 216, 215, 333, -410, -169, 102, -447, -76, 174, -454, -696, -3, -128, -385, 67, 92, -626, -159, 92, -379, -190, 451, -97, -443, 31, 120, -28, 307, 489, -254, 94, 550, 206]
2892B06j21L91l78n04M72J52l62P2J56n62Q8K64o9k55N41l51k91L16K43o4J76
2913A20J70l79N5K46n7k04M81k05m44L85J88j66j6L53n31k60N77k53k30K19l28
2934b79l13K74K50k17o1O10o04J2M99q3m7J70J98o37K93L68k49j7K15l38r0M65
2956D19k8m73J97j13l65R3M32k65j23K87m18k04M44K19m76L62J45n42J89M44j26
2977I8j06L96o6k18P1K77n91L22L43n32J5L70k77l09J90j05m50M52R2m27L65L02
2999B12r06K89L52k9j64M58R0o21L08L45k43J32K04k50j36J45J36l22K62j74m88
3020d00J41N76m56J79n2m10k19N09O8k41J88J74l95J64K68j82j0N18l00m56N36
3041B00J46k39J09N7k56j6P71n99j36L83k69l85K00K12k92j33K71k60o0N21m48
$$ y = [206, 85, 476, 98, -406, 66, 218, -144, -72, 84, -478, -390, -126, -195, -450, 91, -260, -551, -235, 8, -56, 120, 290, -89, -34, 212, 155, -49, 432, 227, -217, 168, 356, 190, 174, 527, -4, -264, 313, 60, -170, 49, -279, -592, -318, -68, -285, -346, 264, -340, -328, 171, 88, 41, 211, 409, -228, 65, 433, 184, 167, 382, 44, -46, 419, 391, -82, 115, 2, -363, -270, 162, -103, -226, 61, -357, -561, -117, 102, -374, -12, 133, -409, -220, 224, 98, -8, 388, 322, 104, 175, 452, -139, 183, 526, -6, 9, 379, 102, -207, -17, -122, -572, -120, -28, -455, -90, 212, -694, -405, -53, -82, -246, 212, 302, -319, -11, 334, 91, 223, 427, 177, 41, 186, 322, 0, 262, 88, -400, -259, 317, -139, 40, -12, -422, -641, -132, -64, -305, -117, 57, -338, -174, 94, -88, -98, 420, 120, -336, 200, 346, 107, 216, 273, 17, 1, 772, 173, 37, 420, 151, -234, -34, 178, -114, -247, 24, -236, -296, 225, -223]
3062b23p8K66J23n34J93L90l27J5L23j92o5L63J26k71o3L81o05L10L08l42l3J96
3084B61k24l58L60M0j56J22k84j35K29K49m31PK41j48k90O59n3k56K80M3l61K06
3106AM93l49o0L27j61n26N22J35n09Q1mj77j50L40r5k45O16m50l06J87L85j51
3128i6l6J72m39J60L71p6j05L96l44L8K44L02m79o8L19l32j31L03k7l15N1K05
3150A13m20L03j9l58J52O8k40J70K72J67n38K67J63k83J91K95l57n9L99j74l04
3171a92O94j12m33R9L09j98j99L25l25k54M51j86n24M82J84j59r2N1l14L81L6
3192B4k14J5L40j74l02K82M10l57K19rk24L0L87l1m65K64r3l22L08K7j71l7P6
3215a7j50k27K83J52m78L03J99m51K38M70m43l6M50m35j25N38o2k77L10P0n93
$$ y = [-223, -301, -35, 88, -446, -253, 137, -190, -175, 148, -44, -109, 254, 380, 109, 46, 427, -178, 132, 440, 98, 65, 261, 37, -321, 39, 79, -77, 45, -239, -374, -145, 104, -327, -320, -79, -227, -517, 142, 89, -167, 113, 156, -205, 1, 494, 145, 85, 412, 251, -275, 247, 382, -127, -46, -50, -227, -377, -37, -132, -377, 239, -211, -517, -330, 55, -96, -132, 40, -399, -239, 132, 56, -49, 347, 3, 41, 285, 587, 108, 40, 359, 27, -104, 199, 172, -143, -92, 113, -307, -4, -23, -381, -229, -161, -401, -231, 41, 208, -330, -63, 100, -183, 8, 303, -54, -113, 286, 112, -192, 502, 390, -43, 56, 365, 167, -32, 293, -32, -286, 165, -21, -545, -63, 121, -38, -130, -79, -393, -12, 24, -190, -175, 165, -9, -311, -29, 381, 24, 243, 234, 10, 40, 427, 396, -69, 195, 102, -220, 88, 115, -56, -93, -17, -167, -394, -111, 41, -437, -134, 65, -386, -148, 322, -121, -157, 293, -142, -267, 271, 209, -68, 242, 312, -281]
3236b81K32M29m24n0L20j59l20M91j15m06J81n5qR7J87k01k72K99L9k49L74J18
3258B27l30L2L12m32K08M18j56m31K66J77l46J89J63l19p7L68l85j50O11l65k12
3279b32J91k07k04L25J26n9k20K42j62n0M15o5l92M89o7k93M2M62k87J05K00l16
3301D3j68L46J40n14K8L28l42kJ48k84l9K56j11l71M43K23k62j26J49q7J75L06
3323B79j43j84L54k07p6j02N24m39j89M50n10J87M20l47l15L43j91k57M17K20
3343B34n60K76j22k21J99L44k55k15M84j68j09K92L3k89j81N50j75m5L08j03m40
3364a63K55K79n98K88L04m44P9K83l56l06M07P8k75k1L95o21K45L93l56j07L72
3385A31k45J00K50k96K23j27J53k58J34J66j06k37K82j44k37K02K53n23K22O7
$$ y = [-281, -49, 380, -44, -94, 226, 67, -253, 238, 123, -283, -102, -157, -165, -68, 119, -82, -354, -55, -16, -265, 109, 227, -103, -71, 241, -191, 17, 435, 279, -152, 114, 291, -55, 134, 297, -22, -99, 269, -116, -266, 345, -20, -232, -41, -248, -452, -127, -1, -60, -280, -38, -200, -250, 165, 100, -292, 197, 130, -163, -121, 341, 54, 159, 359, 43, -125, 221, 361, -153, -125, 203, -139, -141, 7, -277, -316, -60, -171, -542, -99, 124, -138, -264, -115, -202, -27, 279, 136, -48, 306, 99, 23, -79, 445, 6, -183, 267, -243, -56, 364, 17, -298, 45, -146, -403, 14, 234, -326, -50, -172, -393, -194, 150, -105, -320, 164, -4, -113, 179, 212, -77, -258, 292, 117, 72, 380, 277, -163, 92, 371, -227, 61, 365, -79, 0, 283, -73, -379, 28, 106, -169, -190, 205, -416, -171, 222, -134, -241, 131, -114, -14, 236, -60, 163, 36, 189, -69, 65, 231, 125, -112, 170, 26, -211, -9, 244, -279, -57, 10]
3405A0m18K87J97j44k70L59l7l90L77J63k97J1K79k71KK60J97o41N88J23l66K9
3427D8L05k96j04K54l92qL51j18k99J51J64k88o3L21k05L9jJ09j98L94Kk99J22
3450a1K13r6j62M72j41j26K57l12l22L99j03j97j39M59l36KJ43L2l27J49Q4m42
3472e04L53L9rj32M21m16R7M52k16j29K33J77n36L77M1r3l09L57l5j77L47k51
3494H7m33N01j2m69K76J84m23O8K41k4k6j1J2k51J77Q1r3K7K06p5K7J14Pk22J62
3519A31j2j49R6J52l39N5K92l21j27L95j48l36R6K15k81J37M37n02J64J81Jl46
3541b09L70j18j91K56R8j61J0K77k44j51M30l02k11L21J0k99N8K11l58N2J43j90
3563a98j67M75l4o06M09J71k51K89R0m59K29O3k6j95M40L5m21K91J79m02J10K67
$$ y = [10, -408, -121, 76, -68, -338, 21, -16, -406, -29, 134, -163, -152, 127, -144, -142, 118, 315, -326, 262, 385, 19, 48, 353, 57, -47, 207, -185, -193, 158, 40, -259, -108, 56, -232, -295, 26, -179, -140, -141, -32, -230, 164, 166, -133, -11, 202, 106, -56, 416, 275, 149, 406, 94, -228, 171, 68, -129, -268, 191, -145, -143, 0, 32, -295, -146, -62, -504, -151, -112, -121, -253, 168, -248, -151, 301, 85, -44, 189, 366, -170, 207, 248, 155, -154, 203, 168, -9, 338, 87, -346, 155, 143, -326, -50, 134, -289, -221, 20, -4, -30, -41, -29, -280, -103, -22, -115, -88, 118, 43, 70, 184, 191, -31, 131, 119, -30, 66, 218, -121, -66, 226, -95, -222, 173, 25, -311, -215, 0, -281, -144, 293, -209, -45, 136, 137, -209, 161, 43, -148, 108, 206, 45, 55, 332, 88, -63, 367, 65, -146, 175, 185, -114, -56, 155, -203, -151, -8, -198, -365, 110, 76, -530, -121, 50, -201, 88, 178, -281, -52, 11, -15, -210, 230, 265, -156, 135, 314, -88, 22, 289]
3585B89k23j18J68N5l59L61O9m71J07L91p34K92J44k55n6L06r3J03L57l31j79
3606a77K9K57k10P3L90k44j1K03j59l20M21P1l55j8Q1j25j75L20k2n14M29J11
3628E5k70J11L6o7L6K20r3r1K96j31k02L57j37l48N31m8r4j31J75j13l80N15o2
3651A65k55j61M69l27j38K67l09K1M27j96O4K29m12n2K13M2k40J21L67l04j28
3672a37L85p7k78K59o1m14L05J70p5k9J26k21l58M63M5m73L90j31j17N2K02j27
3694a01r6L30m4l16M70j12j74R3K10l58j35N73k71k37L66m8j24K4N3j03L1J78
3716B09n18O1K18l4k29L00K8k12R3J79j57J25J43j96k33L46J51n93N06N7j99Q8
3738A33J86j64l0K12j60l53M21k68R1O1O6m44J18J66r7k5J27j88j57K38j26j80
$$ y = [289, 66, -52, 116, 171, -188, 173, 242, -229, -122, 269, -465, -173, -29, -284, -340, -34, -127, -24, 333, 2, -177, -148, 109, -101, -28, 362, 118, 107, 310, 151, -169, 252, 323, -32, -50, 31, -94, -269, 51, 29, -485, -56, 55, -215, -104, -68, -135, -99, 121, 28, -63, 233, 102, -100, 257, 120, -228, 303, 255, 161, 30, 205, 92, -288, 227, 165, -90, -251, 218, -109, -247, 20, -289, -268, 159, -37, 27, 256, -156, -208, 5, 47, -193, -72, 295, -9, -137, 248, 171, -107, 152, 91, -323, -18, 152, 77, 48, 174, -47, -405, 58, 103, -370, 20, -111, -228, -176, 26, -101, -197, 133, 89, -227, 243, 131, -43, 50, 260, -98, -233, 340, 69, -168, 198, 150, 26, 50, 103, 0, 31, 209, -309, -248, -30, -64, -293, 7, 35, -177, -84, 95, -62, 63, 206, 10, -223, 123, 274, -319, 187, 244, 45, 133, 319, 155, 125, 337, 177, -176, 245, -23, 68, 129, 195, -249, -131, 35, -62, -87, 40, -148, -305, -67, -193, -373]
3760c73L19J99k09QJ93j75N7K61q9l21M07j58j82K05J43l38J51n3q1J8K55k40
3782ck68J89J04k53K06P2k46J36N1Q1k78L14P5l41Q8K48k14J6L59k88m51M60M6
3805A03k72K17K68m26K21m5j57M4J47j52l25K28L12l30K21O9k22l6K79q7r2P7
3827D2M1k89L39J66l81Q3L02m50J9L93l75L4J61P1m45L78J05m55K18J89k86j10
3849b50L52j11k83M14j35l74K74L44m48K19M01m31j96M58l39n8L75k35p3J29P9
3870A12k39J0L46k69J59R1j70l27J93J62l44J48J21j66O6K39j48k41J69J97k56
3891a47R4J32k21J06L39qk83K45k20j85K95j09k8m6Q4j64r8L18r8j54K55k39j57
3914b89L17j42NR0J38n2j24K75q6k58L31K6k92J88K90m29j49L76m08p7L32j23
$$ y = [-373, -54, 145, -64, -56, 137, -38, 19, 280, 191, -130, 277, 119, -63, 142, 285, -53, 98, 45, -36, -18, 237, -3, -271, -82, 22, -231, -25, 47, -199, -63, -12, 69, -209, 105, 180, -161, -73, 175, -39, -23, 336, 48, -403, 57, 103, -169, 48, 316, -110, 111, 66, -91, -47, 100, -52, -377, -149, 163, -167, 54, 123, -99, -135, 144, 57, -35, 42, 83, -206, 133, 299, -82, 1, 303, -147, -128, 265, -110, -76, 85, 156, -289, 89, 194, -261, -43, 146, -140, -250, 102, -9, -292, 122, -13, -387, -113, 231, -217, 2, 403, -28, -224, 234, -105, -163, 212, -23, -96, 33, 112, -127, -117, 229, -40, 119, 210, 40, -287, -94, 68, -276, -128, -7, -173, -107, 132, -16, -257, -88, 109, -147, -53, 79, -142, -36, 303, 295, 12, 257, 37, -148, 147, 38, 10, -36, 48, -116, -214, 104, 6, -148, 107, -132, -289, 28, -114, -109, -19, 119, 67, -57, 218, 132, -126, 205, 231, -61, 127, 417, -12, -161, 215, -193, -270, 62, -61]
3936f1j12J59J18l39J70J93l13O4K85k52l0p8L09k72J63J37j47j2M8Nj37M87j68
3959B17l33J61J8k98K28L09l62l6K26j12m32N21k79m2K78j11k09L59P4l30kM04
3981B49k70rJ98%k54J86K47m28j3M40k60j81K23J57m15J49J87l66P3K21l37K22
4003A9J10k57j78M25j09k93N18k12k58J07K81l36J53K91k00j49K71k07P4J7Q8
4024A55j71J68K06l85j64M37p8m42K81J27j77J76kl85L41n6j91j64M08j8l59K24
4046f9K20j70J5L00k28j86K93p6q2J99j16k0J9J52l13J77Q5l63%K42n1m71L86
4069e7J46m30L34J08k18J1L32j70k72N68k92j21L74l4m21J10M07l01RJ19rk23
4091c0J10K6r3j13K00k23j53J89j12l6L26j51k86L08R6p5j50M88l45n0K46j61
$$ y = [-61, -173, -14, 104, -235, -65, 128, -185, -121, 164, -88, -118, -196, 113, -159, 4, 141, -6, -18, 30, 35, -102, 385, 217, -116, 45, 63, -235, -7, 302, -60, -96, 130, 18, -414, 107, -172, -214, 64, -47, -256, 103, 177, -153, -155, 249, -21, -30, 168, 168, -86, 100, 347, -81, -94, 346, 86, -95, 128, 285, -130, 19, 206, -160, -87, 134, -203, 19, 129, -128, -306, 119, 10, -283, 235, 23, -235, -128, 153, -183, -30, 261, 61, -88, 183, -24, 50, 67, 155, -16, 152, 358, -27, -191, 246, 168, -274, 7, 134, -43, 133, 131, -254, 87, 31, -160, -324, 84, 66, -293, -69, 151, -19, -4, 296, 68, -118, 175, 99, 17, 216, 100, 80, 99, 251, -62, 115, 200, -163, -163, 79, 28, -443, -57, 89, -341, -7, 101, -117, -106, 226, 56, -216, 352, 60, -61, 313, 279, -142, -32, 375, 74, 83, 202, 193, -30, 80, 106, 13, -100, 100, -123, -276, -87, -199, -235, 91, -60, -346, -38, 58, -17, -167, 321, -24, -74, 172, 11]
4113A1j20O41k31l17K20j14JP7m4l49mK83n6j9O1k8l00M44j8l20K70J62l28j77
4137b55J08L2p2L86p5m50L84J28j06pJ70k80N9o0pl23L70J84l62K85J30l60oK05
4161G8J5l06L87k75k82J87K90l39L06J41k14J63q9o4j08K70N6j94k1J49k55Q3
4183b2L13m20m1K05K64l30J51n3k38J17L88n11J56J61r7k07J77Nl08K57K91l41
4205h3o0K22l2k31L51k1j27J20m9j54K16%j56j38L01j73p8L7j81r2K21L17m40
4228b30J48J97m3j76J74j10L0J83K3k51J29r7j9J38R1K1j78Q5n5j38R9J11m05
4251b73K88M4k00k22L58j6j35K55j5k23J83ok08L72j25j37r6L52k26k04K88M8
4273A02j14K08M7l60J85m8N4l15M19M6l17L18j7l96N9M7L09m81K09pj34K65L6
$$ y = [11, -109, 532, 301, -16, 204, 90, 91, 168, 124, -225, -229, 54, -2, -21, 40, 12, -288, 156, 138, -182, 88, 250, -78, -255, -147, -115, -187, 199, 124, -326, 58, 186, 80, 73, 243, -37, 22, -38, -45, -368, 2, 186, -176, 109, 239, -121, -127, 78, 93, -213, 174, -101, -383, -196, 94, -245, 61, 202, -12, 151, 62, -2, -110, 160, 216, 22, 1, 150, -105, -22, 291, -129, -170, 35, 299, -31, 120, 67, -171, -54, 334, -177, -21, 140, 43, -164, 13, 18, -290, -33, 258, -83, -143, 79, 47, -184, 167, 146, 19, 139, 90, -64, 152, 152, -4, -142, 159, -14, -92, -55, -236, -328, -107, 210, -230, -82, 115, 72, -104, 70, -40, -10, 173, 196, -55, 74, -23, -42, 96, 187, 208, 30, 115, 60, -78, 21, 132, -273, 15, 59, -141, -363, -5, -21, -156, 99, 84, -139, 44, 38, -170, 202, 77, -60, -156, 196, -30, -234, 54, 102, -12, 196, 243, -117, 68, 20, 74, -241, 178, 224, -93, 225, 208, -188, -129, -82, 227, -254, -45, -52, -186, 79, 115]
4296A15j87J56O8j52n9J65k08J3M10j34k44L08k16k62K69J07l21ML13l49p3J68
4318a09ol59N99O0m54L40N3k99K62M0j53N0K7j32m4L84j77l5J23J2j80J49L2j5
4342A68r4r5k7k08L51k1p4j51K75j72l61N75j5k69J05K28n59M40L4j33j15L52
4364B34m03K73J6l7k39M38r2m81M31J98l81r0K42j28J29k3q2l34J48J61j00pK77
4387A50j78MM8Q0j32jK08l31K60L9k00J39Q0k5k31L61k41j60K95o2l55K52k30
4410b30J04j23J39M7j98K41qj54J81K81m18J91m4k0KK29j16l12M19j16l45L12
4432F2K05l74J06K28q2k45J02l4q6J35j38j10P1K13m4nK40l76n0K16j60J61j37
4455a02K94j51J32K17k06l21J31Q3p6R4Q9j92NJ06j03k60N02l03l59N01o5j11
$$ y = [115, -72, 84, 152, 0, -59, 106, -102, -89, 321, 187, -57, 251, 35, -227, 42, 149, -172, -168, 145, -204, -277, -109, -115, -474, 125, 185, -269, 71, 124, -175, 87, 127, -26, 24, 51, -81, -125, 259, 82, 47, 170, 182, 2, 151, 183, 168, 74, -21, -48, -256, 95, 74, 0, -151, 124, -48, -409, 166, 151, -118, -13, 215, -344, 96, 130, -3, -118, 234, -169, 104, 120, 83, -156, 282, 190, -291, 140, 338, -43, -133, 109, -19, 110, 87, 5, -329, -181, -20, -120, -127, 150, -28, -24, 24, 104, -28, -29, 179, -152, 108, 147, -53, 86, 166, 141, -90, 271, 30, -130, 165, 103, -252, 0, -230, -126, -249, -110, -63, -261, -20, -28, -182, -1, 280, -138, 53, 9, -11, -9, 220, 104, -208, 211, 95, -250, 62, 267, -107, -1, 227, 145, -100, 2, -32, -118, 17, -121, -231, -160, 53, 9, 4, 244, -132, -182, 34, -126, 35, -102, 192, 41, 173, 390, 184, -137, -6, 77, 1, 95, 184, -8, -3, 103, 0, -260, 242, -61, -420, 81, 16, -95]
4477i5P2K07m13K0K17n4m7J91j93j87N37j14l53M25q0q4j59L29l02Q2R4p8n9j7
4501f1L7j52O5M4j50L4L44l82M9P4J87j52J04J81n56Q6N63m13Q4K27k18J09P4
4524A78j35j44J02K09k69m06N25j28k82K11J34l01K90K5k67R1L79l63n4M00k71
4545g6q4P8J00p0J01J61j77j70L41k02q9M06k33j77J37q2oJ08Rj25j83L36k04
4568a01j95M02k15j23J70K02m44K80K84j90j2J9Nn0J60p5k08K14o8L2J5K04l21
4591a5M0O9K9l19L39M0l89L7M25m17J85J31l20O9J23O0k29L01M8k87K82j0j72
4614B0k83L73m0l02M45m4q0j14M01n99K40K50k08j36J93p8k32K93jk90J33pJ0
4637e6j40L56l21j30L04j67p4L03j16J14L2J65m17J57%Rm3J40k8j55J52ol22M57
$$ y = [-95, -23, 184, -229, -209, 8, -46, -93, 98, -95, -282, 255, 141, -212, 213, 133, 49, -110, 219, -83, -1, 93, 15, -44, -61, -24, -176, -111, -67, -217, -183, 161, -221, -172, -98, 89, -63, 41, 222, -334, -248, 315, -98, -14, 213, -5, 104, 178, 43, -101, 1, 210, -59, -465, 60, -68, -350, -139, -5, -306, -16, 9, -258, -167, 212, -151, -205, 195, -76, -160, -82, 18, -52, 49, 210, 33, -137, 204, 2, -87, 319, 86, -91, 46, -36, -42, 66, 75, -50, -233, 103, -101, -296, 106, -109, -232, -62, 140, -304, -24, 260, 70, 58, 77, 82, 32, 192, 117, -91, 123, 55, 87, 102, 306, -15, 25, 94, 123, -196, 143, 183, -206, -169, 256, -161, 24, 155, -165, -96, 27, 87, -142, 159, 207, -80, 202, 192, 20, -263, 110, 70, -232, 213, 169, 89, -25, 376, -223, 17, 267, 59, -77, 116, 38, -194, 99, 98, -192, -59, -66, -56, -196, 160, -161, -291, 13, -154, -228, 75, -41, 73, 105, 270, -147, 10, 10, 19, -24, 116, 88, -67, 85, 79, -243, 214]
4661B14k18j55l2J25J76m73M81q4j89J34J64n17K54K56k52j6J18P7j21J93p5q4
4683b4O4L2j79J44J74k32j09J26J05l29L89o2k43k12L74j88J09J78l89K18j5J12
4705D3q6J73j57K3Q7J34l64J39R4j61J23q5J14k27Q5J66j61q4K76j19l95M89k9
4728G8l00L81k15J1J9m6k32J20K59L4j46J50Ol26M22j5j52M8Pk06k7K82k34o9
4752a51K16j05l45K58K92l36R7J11n8j70K38lJj07J03l6j44L23q1k64K49j65n2
4775a29K53K3l22K03j47P3j31J87L5r9J57Kl83J95J48j00k8J44l46O3M03k4j38
4798C9J80j30j68K57m5l64K37N6J7j91L36n2j55J90k94j78J42L24l72L26j4j17
4820B4j62Q1J60l29L41j76m7Rl4j26K02K55l74q1N66l26k05K79J58m12K77P3k56
$$ y = [214, -4, -159, -191, -66, 110, -363, 118, 34, -155, -21, 143, -374, -120, 136, -116, -132, -14, 63, -58, 135, 60, -24, 40, 72, -107, 37, 211, -21, -130, -4, 101, -228, 161, 99, -144, -356, 18, -170, -61, 117, -272, -54, -69, 43, -43, 130, -27, -4, 83, 217, -147, -8, 86, -75, 48, -37, 77, -150, -65, 101, -60, -144, 132, 13, -382, 107, 78, -222, 159, -56, -45, -26, -72, -304, -184, 75, 109, -37, 113, 119, -207, 215, 200, 48, 96, 103, -103, -130, 152, -82, -151, 65, -40, -385, -127, 165, -171, -74, 37, -21, -191, 47, 44, 45, -62, 41, 5, -139, 184, 103, -161, 88, -77, -129, 124, 147, -175, 28, -119, -46, -177, 10, 45, -54, 103, 105, -278, -83, 65, -35, -63, 81, -265, -202, 201, 177, 39, 219, 89, -79, 178, 133, -231, 6, 62, 79, -112, 224, 172, 17, 207, -87, -265, -123, 201, -171, 155, 141, 24, -138, -57, 103, -226, 115, -61, -108, -99, -133, -259, -57, 198, -176, -257, 309, -17, -222, 57, 215, -197, 80, 153, -103]
4843a03R9O9O8l28K09K4k97l1M35l44J94J7j70J85Q6k48m1K23L1r3J53k0p2r3
4867d7J31J20l08J63J07p6l1N3k98L36K2j68j00K86k68j68R9K86l76K14J1j49
4889a61K96j56J0j19J83J4q6K1K08k17M5K3k0k0L27l74n2J94j42j44J41O8k28
4912a89R5J22k52J60J88Ll60L19J67k96L5K97m53P8J88Kk27L78l70j93N52k59
4934a5j5qJ80j62o3K78k28k2M9R0k46L02N1m11N5K00R5j72o5N0rM34j54l30K80
4959A64j6K7p0J51k68j33K58J6l08K39Q3l66M30r5j61m7M37m28j62K84J58l87
4981a94J81q9n6K50p8k0Q8M9k86j23M85k20M8J13J48k63k55L59n2k12L17k68l3
5004a11K78l9n8r0O9j23J23K59k97r4K85j45n8J11P8j76M5L4j26j3J74j1j64J78
$$ y = [-103, -4, 65, 133, -195, 14, 38, -259, -290, 145, -199, -5, 12, -158, 27, 113, -135, -176, 47, 78, -15, 138, 118, 46, -47, 84, 204, -104, 59, 166, 90, 59, 112, -186, 150, 172, 4, -96, 190, -78, -246, -147, 139, -237, -23, -12, -161, 135, -21, -11, -130, 53, 67, -19, 2, 210, -7, 38, 61, 41, 21, 348, -26, -78, 116, -26, -170, -29, 39, -189, -94, 28, -224, -64, 124, 127, -233, 86, 253, -43, -8, 289, -164, -86, 102, 104, -123, 255, -115, -308, 244, -15, -30, -38, 142, -20, -83, 195, -33, -55, -6, 84, -162, 140, 191, -220, -165, 35, 130, -42, -107, -57, -66, 368, 214, -116, 164, 148, 175, 105, 256, -12, -145, 113, 129, -179, 60, 143, -223, 207, 112, -49, -96, 341, -87, -249, 35, 193, -194, -13, -102, -158, 92, 14, -6, 82, 131, -155, -278, 207, -13, 35, 148, 296, 33, -222, 137, 85, -127, 190, -78, -111, 167, 128, 70, -20, 49, -74, 49, 308, 11, -83, 202, 57, -1, 110, 188, 12, 57, 91, -35, -48, 126, 115, -49, 129]
5028A29m9j9L4L6r4j25J67j36J2n8j48Q0p1K54k24K31M1m3L5j16L0p2K78N1k98
5053g5K44j42jN2K10j00j18J13j0k46J11J5K8k09J4k00J37N06m50K3k24K40j20
5076b02L09j6k35L6J93P0n6K3j15RlK8k61L38M5j02n4k0N0r1J73k22j28K76J01
5101A46j66m2J53j52j5K73r4q6k3k4j28J69O0j51K65l4j20j4j51K28r7J23kj57
5125c9J66j34j29K91k3k13N9K25l27O2n7J58j01j7K04j86k7L45j90j76J15j34
5147a28K4J45K27k33j42N47m91lL16l35J27J34j81p4J60K0j94J68Jl07J37R6p5
5170f1J42%j13j15K65J2j46nj03qQ6J97P7m30L14J36n7j27k3r7N2L7k7j60K16
5195F2k2p0P4P1l59K08J91k84o6K34j02k37M28j52p5K56q6j26J7J24J32l09K31
$$ y = [129, 80, 61, 95, 131, 37, -88, 79, -57, -45, -103, -251, -171, -242, 12, -212, 19, 60, 17, 52, -64, -34, -106, 172, 223, -75, 169, 27, 26, 78, 288, 188, 70, 183, 173, -73, 38, 53, 81, -128, -114, -314, -177, 329, -121, -98, -322, -82, -202, 107, 91, -144, -108, 85, 155, 99, 122, 7, 16, 13, 41, -220, 118, 163, 61, 7, -13, 37, -54, 119, -103, -231, 45, 146, -20, -62, 91, -61, -76, 197, 103, 17, -6, -30, -158, 11, 71, -80, 185, 151, 31, 17, -134, 94, -3, 120, 118, -39, 127, -7, -136, 155, 132, -81, -22, 203, -124, -62, -119, 39, -62, -79, 125, -61, -88, 257, 67, -109, 6, -128, -104, 41, 268, 35, -107, 440, -51, -54, 262, -73, 54, 188, 7, -67, 93, 113, -81, 87, 88, -219, -82, 14, -61, 81, 81, -32, -147, 118, 130, -16, -21, -124, -132, -46, 151, 228, -202, 112, 248, 191, 64, 41, -56, -4, 33, 6, -154, 62, 40, -30, 44, 115, -244, -36, 155, -129, -195, 39, -63, -300, 128, -24, -99, 157, 71, -55, -38, 86, 218, -91, 140]
5218A40k09m7K40j8k39J87ok51K51P6pk94J97J1l24L72n2j83L08L7k01N9q3lJ18
5243G9P4N1j92J05Jr8m1Q6j47j26J29m7K8J44N5o6j81M32k51j57K90j11p3J08
5267I2O5o4k23K99k38J05K5J8k6Q7j59r3K46r0j27j29K86k09p4K06q5K49j81k9
5291d9N3J78n7j38j02K04j90P2K93k19j07P4p8j41K17K4j39K62k5j48M0K34k7
5314B31k47q4J72k11Q5K33j35j02J58k25p1K61k50J38J52k6j12k15K98K7j34K06
5336A49o1j70J91oj71P0Rj24R8Q1n9j17J89q8q4L58k60k09L2K04r2J30P0p9oJ51
5362B06j18j59J71o6M8L6r5j17o5J70p2M1L92l34k72K96P5l41O2K12l4j68K50
5385A18k85R6n2J53j9J20L1n5j00Q9J42l34J76J04m25K09J04k23J77l3P5Ll2k
$$ y = [140, -69, -116, 124, 106, -133, 54, 48, -203, 48, 124, 117, -177, 20, 31, -293, 79, 27, -156, 152, 189, -12, 47, -36, -39, 79, 153, 204, 12, 117, 118, 20, -21, 65, -82, -208, -79, -126, -98, 46, 101, 35, -146, 286, 35, -122, 168, 57, -16, 92, 157, 93, -130, 169, -69, 36, 61, 79, 53, 140, -19, -112, 134, 44, -83, -212, 74, -135, -209, -3, -88, 161, -20, -49, 4, 182, 125, -13, -115, 89, -101, -29, 264, 45, -62, 12, -66, -207, 10, 34, -105, 157, 132, -16, 24, 258, 231, -16, -100, 72, -139, -54, 179, 44, -58, 100, -125, -196, 65, -185, -47, 105, 79, -33, -248, 50, 77, -57, 149, 88, -82, 109, 103, -68, 2, 11, -113, -15, 66, 7, -110, 79, -9, -93, 265, 5, -204, -172, 32, -60, 70, 140, 61, 55, 206, 88, -71, 100, 34, 82, 118, 23, -94, -159, 11, -61, -20, 372, 38, -234, 62, 137, -204, -142, 70, 36, -132, 118, -167, -71, -123, 30, 11, 131, 162, 107, 7, 96, 238, -96, 80, 184, -241, -32, 72, -151, 26, -7, 68, 71, 39, 37]
5409C7L3N1j09j44K09p4m1k8k6K6n3L3lJ58R2j5r2M7K3j16K07K0k31j06Q1j03
5435a24J8J89j67M6J88j51j37J54J64j53Q0R7j81m4mn7n7J28j03J02j94J39P2
5458EOM6q1n6J52m9NN8k0n9j92L29n5o7J89j52p4N8j50J53p1o5j8k13L97N9l35
5485b00O2J40O2j20K93k09r5R8j37k2J57L82m97J43K02m36K30o0m6k58K92J15
5507I6j38OJ67k70M6J39N5J29j25j53MJ99j57Q5Pj87K11oJ48k51J71n1m4o8m2
5532b9K3kN9K39k92j52M8N1q5N9K28j86K07q0j36j22J17p2J72p8j48J26P3j65
5556a45J03l6J23p1q9K90j08j69L87k17j10J52j57P2n0J95j81o3P1k7j05K58k5
5579I8k71L42q3l48K70l6J83j47J73j51n5N1k95J75J50j69n3J15k7J90k21J16
$$ y = [37, 70, 121, 12, -132, 77, 3, -38, -66, -92, -66, -119, -86, -89, 69, 161, 146, 54, 101, 124, 8, 215, 235, 4, -102, -21, -124, -106, 83, -84, -38, 150, -1, -138, 16, 180, 27, 107, 204, 23, -21, -25, -82, -139, -11, -114, -12, -206, -67, 5, 11, 57, -24, -80, 72, 23, 28, 86, 66, 7, -185, 144, 89, 22, 211, 59, -15, 43, -107, 46, -25, -90, -108, -321, 76, 135, -200, -138, 2, 64, -56, 237, 28, -67, 31, -106, -128, 29, 411, -86, 57, 259, -177, 53, -7, -53, -311, -19, 96, -42, -36, 131, -139, -93, 46, 101, 230, 105, -48, -44, 155, -2, 83, 90, -97, 114, 108, 256, 5, 176, 125, 81, 13, -29, -6, -8, 51, 290, -2, -154, -106, -55, -140, -81, 147, -39, 168, 88, -48, -170, -53, -125, 47, -31, -179, -53, 20, -145, -42, -78, 45, -26, -115, 175, 67, -102, 285, 68, -42, 110, -47, 25, -25, 170, -11, -74, -3, -30, -135, 123, 98, -173, 169, 86, -262, 8, -28, 155, 8, 181, 30, -25, 26, -269, -94, 56, -113, -166, -51, -78, 112, -109, 7]
5601Gj03rK58k74R5J43j70k5J59Q7j41j47J05m0M8l0r8j3O4J20j32k0L80j90j9
5626E5n0J09k77J32R0O4m4M7j44n4O5k0k7K77k87m9L11j40o3J14j76K49o7j57
5650d2P0Q5O8j49k3j06R1L1L7J19j25l20L55q5j06J13K47l54J71mr4j71K54j85
5674a23M8J37Q5k01j37K8K62l18K71M9q6J96J9j59J5l53K4K90j8j06J40l4j12
5697h3j07K75j42l6L06j70Q7j56L42l15J18M7n5N0l30J64j54J15L7q9K37j46j03
5720a08K08k08J6K10m9k26K1nJ66P5q1L08k23k33L42J7or4l6j02j30K18J4k02
5744a08K69k24J74L2k01J24p5N8j49J3L45l10j2n5K42j34j17K55j48O1j18K06
5766A28l69L66k85J16P4K9k90J99O5k3m0J91k97L13k49L46k94J82m5J6r5K19l86
$$ y = [7, -96, -105, 153, -121, -26, 117, -53, -78, 81, 168, 27, -120, -15, -55, -7, -37, -135, -148, -84, 36, -96, -116, 264, 74, 55, 5, 114, -163, -31, 59, 123, 79, 126, -18, -72, -7, -27, -54, 223, -64, -113, 198, 58, -5, 109, -67, 182, 115, -42, 28, 113, 181, 32, 9, -97, -6, 25, 62, 181, 56, -264, 91, 6, -100, 13, 260, -94, 77, 73, -21, -192, 62, -123, -75, 62, 147, -54, -191, -163, 99, -219, 52, 101, 15, 211, 230, 71, 86, -267, -243, 47, 29, -77, 63, 29, -83, -190, 85, -57, -93, 213, 43, 130, -26, 316, 1, 119, 166, 111, 161, -169, -5, -159, -44, -7, -96, 141, -5, -108, 100, -108, -92, 118, 69, -157, -136, -141, 25, 100, 19, 327, 104, -129, 213, 230, 224, 130, 94, -8, -138, 80, 94, -108, 161, -63, 111, 143, -58, 66, -9, 49, -100, -87, 258, -52, -64, -119, 123, -11, -128, 127, -21, 40, -78, 128, -241, 125, -160, -44, 30, 59, -231, -32, 33, 10, -30, 161, -136, 177, -72, 274, -20, 162, 117, 133, 38, 257, -129]
5789a29K38Rk14N1J13j45J06j20J1l9R6k1m6O0J66k27O7O3J14M9j13J04k81K16
5813A28J14k12o6m3P4o4P0p6N3N1O1k36J8J03N3q8L2K5j58k0K90j32o3J55p6o6
5839g3L02k25J78j97N2j58RK86pj28Nj10j41L59k97m8J31q2p2J42O1j78J70k1
5863d2r6P1p4J21L24k68Jj00J92rj12l0K15k31J28j03K11m20L63l1k15J13j50
5886a42O0j07L11j78Q2j34P7j13J52J36j92j45K35l8q2J38n6j00J28o4k0J82M7
5909A77j29rj6j88N2K23L7j02J62l03qJ5K08o0L1r8Op7r2K35r9m7J20Rk88K43
5935Bk38L16P0N4l72L20N3k61O0L5m5j64L30k28J26J68r6jj6j7j55k9qN7P0n3
5961b2J4J85j03j81J59K8N1p0j6m4J43j27L7j91L51l50K09or8L8n7J16lj46N2
$$ y = [-129, 109, 118, -96, -45, 68, -77, 29, -91, -80, -119, -23, -44, -90, -30, 136, -91, -24, 39, 153, 202, 89, 193, -88, 128, 242, 30, -36, -79, -5, -69, 1, -75, -22, 29, 90, -146, -128, -25, 28, -60, -28, -3, -161, -181, 109, -23, -86, 69, -7, -73, 229, 4, 182, -15, 37, -121, -112, 174, 167, 39, 44, -66, -207, 152, -145, -193, -62, -144, -216, -74, -13, -191, -21, -42, -138, -67, -141, -20, 304, 36, 37, -63, 129, 120, 8, -22, 193, -38, 90, -13, 198, -222, 141, 110, -105, 8, -142, -82, -189, 122, -56, 26, -108, -31, -144, 8, 144, -48, -193, 42, 4, -78, 60, 4, -96, 32, -32, -52, 130, 177, 48, 39, 23, -165, -113, 110, 147, 45, 207, -96, -104, -89, 119, 59, 90, -8, -2, -79, -171, 64, -35, -82, 38, 47, -241, 2, -236, 80, 150, 204, -168, 152, 205, -56, 4, 39, -6, -170, 160, -68, 58, 226, 130, 129, 113, 96, -59, -88, -96, -39, 31, -22, -8, 177, 74, -107, 52, 80, 131, 61, 45, 1, 144, 17, 54, -137, 214, -136, 73, 67, -31, 7, -50, 66, 63, -83, -31]
5986c1L35j80j95J8L04k08j06M4P3j95K95k55N8Q0k72L07k13P7K24j00l9p9k58
6009c16K71m3KK28n2q8m2r9J15p2P7R8k59L39j99R1j11J53l2N1J26j69J7k19R3
6034d0j5K5nO3l0q2R1OJ00k82O8pO2J34m0M3Mq5K6k7o7J39N9k98J36L9L7r2O5
6063B7j10J98j09j44R5Q5o7R2j3j16J78L6qj34J03j41N2k58L84k56K37j31M1j33
6087i2J77l6q3J5J02j16O3J5j21mM04l53J70Rj66R8k12J3J51R0k21K18k0r4R0
6112I7J0j12J30J2l82K34n2k17J44K13k13J27N4O0k15L31l18J25qQ5R0l18K9P7
6136a7J39j42Q0n6J86m7l86K56P5j72J74l1j40J5J49L9m38K78M21m26R6K6j6p7
6160a4m8J88j7M1j70J29P7j24l3p0J07L7M8j03k02o6J24R8J3k1J29j82K2N8J8
$$ y = [-31, 304, 124, -71, -53, 251, 43, -63, -19, 54, -141, 154, -101, -43, 37, -235, 72, -141, -64, 160, 60, 21, -58, -316, -45, -88, -86, 142, 90, 2, -40, -139, -24, -96, -19, 79, -180, 159, -40, 51, -60, 93, 61, 112, 238, 69, 86, -133, -40, -55, -30, -35, 28, -2, -84, 7, 13, 113, -169, -101, -108, -46, 88, 48, 91, 95, 10, 36, 9, -58, 81, 140, -158, -22, 17, 54, -38, 27, -83, 115, 6, -138, -43, 42, -25, 67, 54, -62, 116, 152, 144, 10, 113, -28, 24, -234, 150, -106, 131, 0, 41, -92, 85, 49, -34, -19, 83, -33, 30, 45, -76, -80, 324, -29, 141, 150, -16, 82, -130, -117, 34, 124, -97, 121, 101, 7, 97, 107, -5, 125, 137, -245, -11, -63, -280, -136, 77, -136, -9, 45, 105, -110, 221, -97, 28, 20, 105, 195, -123, -94, -17, 122, -20, 60, 4, 190, 143, -243, 13, 88, -84, 90, 59, -81, -66, 83, 122, -316, -38, 383, -43, 53, 79, 63, -14, -62, 126, 109, 150, -20, 109, 186, 62, 29, -41, 66, 103, 151, 48, -154, -220, -96, 2, 15, -6, 123, -59, -37, 21, 39]
6185C9L2j93Q2P0j29O3l1Q4J14k37N2k11K81n7K0K7Q2r8J08K8j72nJ4K38k48J20
6211G3j46K59m00K35r8M0k25J88J01k4M8n4J76k73R5p3J34L7M0l45K33p4J70m5
6235G2j15j0j92M32L9j43k29J04k5l6K44J7k52L12l74K00%jj83J75K0k52J02J76
6259H1l12K38K68m27J53R5N0j69j63K46j41J06j0Jk11K33M2J04k75J57k05K09
6281G0j11k4J41P5j58N7k4r0j2J85j1j64J09K61l17P4j48K23k24O7N0j43P9n5
6305i0L2l5O6mQ9r0m9o3K35k7o1J28P3j93Q0Nk20K9O9J10m8o5r5N2J1K08k07j3
6333g3J63j23nP1J10n1j19m0K72M0j52N8j96J03l9k6%j36Q7K58j92O1R8k65N4
6358d2J03K2k7q7J8r0K6K53j80kQ3j9J21k97r1K52O1n9N9o4J01N2j91J28k16k8
$$ y = [39, 71, -122, -40, 30, -99, -36, -67, 17, 131, -106, -54, -265, 16, -41, -21, 6, 88, -10, 98, 126, -46, -51, -37, 201, -47, 73, -73, 186, -214, 21, -77, -37, -262, -74, 27, 3, 51, -3, 173, -100, -5, -78, 56, 93, 133, -212, 21, -53, 117, 72, -43, -53, -245, 187, 226, 83, -146, -42, -67, -103, 141, 158, -94, 218, -156, 44, 44, 43, -140, 35, 55, -197, -95, 81, -231, 7, 275, -152, 1, 96, 146, -23, -186, 60, -81, 25, 15, 16, -195, 38, 80, 184, -91, 66, -139, 70, -41, -65, 76, 151, -7, 50, 26, -64, -76, 109, 98, -66, 43, 304, -13, 61, -87, 136, -88, -21, 29, -114, -35, -90, -58, -93, -27, -31, 58, -32, -81, -144, 91, 64, 3, 131, 204, 11, 91, 96, -124, -95, -26, 84, 36, -29, -124, -72, -61, 147, -60, -73, 90, -33, -38, 33, 143, 92, -27, -67, 205, 245, 93, 151, -45, 58, 19, -7, -7, -143, -56, 202, 10, 71, 169, -96, -42, 61, 83, 56, -31, -13, -103, -77, 176, -4, -6, 77, 58, 179, -118, -209, 43, 104, 45, 104, 40, 141, 193, 2, 130, -86, -114]
6384a14j6K00j21J44j57M2m9J54J05O0m07J3M18l29J29lj38R9j6K8l10L12j52
6407a08k0J84n6k6J33O7j32L1j80J82j6K15k65J10n4M6j85J87k02m2J47j03J26
6430C9o3q8J28P7K22j50k92j5K17J01j81J77r4M7q4j21K28o5O5k76l9K56k62J56
6454a7l7JJ67j55R1k0j56K82j77p6N3j28oJ64J11j86K08j59K6J36L1j7k08J15
6478D3j5p7l8M9J73j16R8n4M8J4Pj83p6N7j0J21p7J0k0K19l37K06j23Q5m3R9P5
6505A35J4j23p3N5J24J7j25J15j65J85k00R3K7j23k5J74j9q4k1K61l64K4J89j26
6529c5K25m4j90o5K73l4l07L76j44L1l4p4O1r8J1JK32j38q5J29j10K35k58J8O9
6554D5k9p1J2K02l28K56k8k06K07j9j08J31j37N6J47k75J59Q3L5k55K6k2K17j78
$$ y = [-114, -130, 70, -51, 93, -64, -22, -71, 83, 188, 248, -159, -146, 272, -57, 72, 69, -69, 30, 14, 42, -268, 44, -108, -128, 56, 0, -26, 107, 174, 42, 73, -107, 75, 59, 274, 9, 119, 65, 111, -74, 113, -89, -131, 16, -87, 39, -24, -112, 16, 93, 315, 165, -127, -142, 75, 176, -5, 172, 78, 125, 41, -80, 148, 83, 148, -128, -167, 89, -173, -17, -54, -53, 114, -41, 50, 30, -126, 156, -21, -97, -44, -172, -178, -14, 97, -89, 119, -40, -14, 122, 153, 136, -72, 43, 28, -49, -87, -38, 135, 19, 117, 63, 111, 125, 132, -51, -127, -70, -80, 41, -36, -26, -46, 173, -164, 42, -81, 4, -39, 60, 135, 149, 26, -47, 8, 132, 149, 24, 139, -26, 159, -41, 52, 79, -44, -69, 105, 86, 2, -19, 242, -122, -98, 91, -35, 190, 146, -44, -109, 164, 130, -177, 199, 55, 86, 52, -22, 39, -59, -48, -47, 185, 47, -38, 91, -19, 216, -42, -24, 45, 16, -55, -43, 159, -169, 87, 59, -147, 60, 41, -67, 64, -73, -17, 130, -145, 14, 97, 132, -123, -97, -119, 98, -80]
6578h0J83r2r7R7k84J49q2J83j8j11J36J19j02k16K22j0Q8N8j35j66K36N5j47
6601a4l4J39k38L2J86j09o0J11o3m0J68L0j47J19L2j80OK16k97K16q4O0O3j58
6625d6K66l61N9K28p5o9J01l0p6j5q3J40j86K14J78o8j44j10O2N8K9j81J12%l0
6650b7J16j99Q9N9j40O5J44J01j33J59j86J09j38q4Lq0J75J33l59M38k43j52j16
6673b66J04J83JM3M5k10L5J3L4M3l10L24N6r4Q7j20K7n6J96l01J09K84k65R4J
6698E7j58K8J17j73k0K40j81QJ34M4k86K24j64J01J3K56j03k95K38j04m4l5p2
6721a75J77O3q4l1qJ93l04K3K25LO0j73k7J27j57K86q7q7jk3jj37K0K69j2r5j9
6748B5j9o3O7j48N7J59k7J0J8k2j50K55k93K44j14lj58J10N5J6km0J74j60J45
$$ y = [-80, 103, 11, -86, 11, -273, -124, -206, -23, -41, -152, -16, 103, 1, -215, 7, -3, 85, 143, 8, -158, 78, 133, -14, -48, 91, -147, -115, 71, -38, -98, 13, -50, -90, 78, 108, -39, 80, 112, -68, -62, 154, -143, 73, -11, 49, 112, -46, 220, -141, -82, 146, 71, 2, 103, 73, -3, -18, -101, 39, -147, 67, 245, 177, 33, -77, -15, 43, 72, -109, 3, 3, -27, 89, -110, -21, 38, -102, -37, 107, 208, 75, 234, 48, 157, 19, -65, -62, -142, 33, 166, -193, 245, 2, -150, -266, -162, 21, 22, 65, 110, -100, -65, -52, -18, 25, -285, 39, 95, 1, 88, -32, -5, -61, 135, -166, -57, 227, -38, 56, 57, -101, -73, 44, -129, -149, 91, -90, -82, 52, 96, -190, 34, -130, -29, -16, 240, 137, -158, 80, -24, -68, -103, -175, 2, 65, -19, -50, -58, 135, -169, -146, 79, 82, 142, -31, -58, 69, -88, 198, 111, 24, 23, 0, -1, -138, -118, 151, 139, 44, 25, 6, -57, 10, -138, -81, 78, 51, 61, 79, 57, -93, 162, -131, 113, -1, -4, -162, -52, 3, 19, 17, -23, 151, -9, 136]
6773A36Rk67J97j47J25k00K71k70J59J35j63J72J00j11j43K6k4J6O8r7l7n7O6
6796c6m5j88K07K4m1J14k18J12q0J04N2m9J38j6Q5l8J25j61N7k4j86O0L10m19
6820a13J89q8l8Q4j09j00J74J79k22K6J08M5j78k5J33N9o9k3rK3rj20J75q6r8
6845i2J60j55J40j40j68R6J43m1N8M1k3m4J04k9j14r3K0J20J31j42q1j25R7J02
6869c5j05K66j81Om0J16Q7j31n8J61k33J60k2j59J21K5J24k04P0NN1Q8j86M1j1
6894d4P1n4L6m5M4q0Q3j03J78k13K52k34J55J44j45o0J41l13L25k81j24K95J89
6917B17k43M06l51J47j53k54K60j49Q6K08o4k04J36J11k80P0n1K4Q3K35k40L2
6939B6J0n9L1m2Mj12R5j11N9n0J81nm6j2o3l0K58k45J41L6o8J93k47kK30k22Q5
$$ y = [136, 145, -122, 75, -72, 53, -147, 124, -146, 13, 148, -15, 157, 257, 146, 3, 29, 5, 21, 89, -8, -45, -102, -36, -81, -269, -62, -38, -79, 35, -183, -71, -151, -47, 5, -44, 94, 78, 163, 125, 250, 89, 146, 122, -64, -4, 306, -113, 76, -12, -50, 34, -75, -175, -1, 178, -44, -18, 90, 135, -43, -68, 65, 124, 55, 32, 23, 46, 37, -83, 92, 6, -92, 68, -87, 53, -87, -255, -159, -16, -57, 1, 42, 19, -25, 79, 50, -64, -157, -137, -17, 114, -28, -109, -234, -137, -35, -140, 126, -55, -49, -89, 27, 114, -17, -75, 86, -147, 13, -9, -168, -47, -22, 102, -102, -32, -27, 24, 112, -74, -33, -44, 27, -27, 9, -36, 8, -72, 11, -92, 86, -127, 125, -109, 46, 190, 45, -15, 126, -187, 138, -143, -267, 28, 217, -26, 380, 29, 176, 23, -231, 29, -120, -34, 174, 110, -94, 42, 153, -127, -57, -108, -84, -1, 234, -6, 26, 36, -23, 8, -34, -30, -142, -47, -158, -99, -149, 32, 27, -19, -31, -94, -124, 134, -111, 30, 66, -2, 191, -56, -58, 172, -50, 35]
6966C5k7k6O8j73J88j03q6J46R8K1k15O1j06K1lJ44J64j49O7j34O4M9k5j48r1
6991a60J36j77K48J62q1j16j7J5o2O2j1j50J70P5j47J08mj17K78O2k27J83n1k49
7015g0J0M4nL2LL8J27l0j31n5M8j83K37j40pJ9R5j7r1J48j29J58j64k13K47J58
7041A29l25J10N0j08K10k25J02N0J43k26L6O6j13j9J2K82k00p7K26j34P4k18J24
7064c1p8K2J28O1p5K7m3Qk9kj48J36Q6R5k60K08m38K46j00K74l1q4r7J45q5Q9
7090B4Pj07K74j68L3j86L01j35j97J93r4j9M7J40m0k23J52Q0r3p4J33qR0n8j50
7115g8p7L19j4k71j8J21Q6l4k56K50k00J70k3Q6p6K4J32j37P7p4n5P3R2r9%k4
7141fjR2k72J1J79m8J53j32o2J67J7r2j32K62qp2K81k26j61O1k58J79K30j50O0
$$ y = [35, 8, -18, 50, -123, 65, -38, -124, 22, 120, 141, -74, -13, -119, -98, -101, 43, 207, 58, 125, -9, 55, 104, 79, -69, -160, -24, -201, 47, 209, 128, 12, -5, 10, -52, 10, -1, -151, 19, 94, -53, 55, 51, -66, 212, 274, 47, 230, 179, -70, -60, -16, -21, 11, 14, 52, 179, 149, 18, -37, 11, -172, 65, -75, -82, -63, 32, 15, -76, 72, -57, 101, -63, -276, -29, 129, -196, -86, -36, -144, 66, -159, -57, -7, 136, -90, -54, 12, -101, -120, -108, 174, -26, -103, 123, -11, 63, -155, -31, -109, -87, 41, 102, 27, 54, 11, 19, -10, -12, -160, -24, 62, 157, -103, 105, -333, -87, -187, 87, 56, -28, -125, 20, -65, 24, 31, -76, 198, 30, 63, -123, 178, 43, -154, 39, -55, -74, -27, 113, 73, -150, 2, 82, -11, -85, 48, 40, 130, 72, -78, -155, 164, 150, -121, -139, -18, 68, 34, -222, 28, -172, -2, -25, 61, -15, 9, 141, 4, 81, 7, -48, 25, 117, 18, 18, -6, -7, 85, -187, -176, 3, -45, 108, -24, -86, 81, 98, 6, -126, 136, 128, 56, 337, 111, -50, 11, -247, -68, 162, 12, 72]
7166G2n9J60k72J78J01j56M4j44K9L9nr3J65n3m7J57l23J00J01j6KJ09j18m1J39
7191F9j00l5p4K65P1n4l1j67r1O4K0J50j69n2L48l17Q6q1J96Q8k5J34k46j50J37
7216C6k12L40k68K07Lj15J55j77P7PL0k45J06J72j93J04M2l14J65K5j9J49k0o7
7240a2r6K0J5J57j36r8k0J69J8p9O6M0j66J31p5J53k41L09j58j67J41P0l25K74
7264a0R7k07p3L34j21l7J4J57k5k01l1K59j10J7j91mJ22m4K55k9k45k13K92j8
7288a2Q5k45L57l80L88l82J83K7l7k77M04j47L0P9k19L06l02J70J8q1J68j48p5
7311i0K4J02J22k22J40j89RJ4J96%r1p7Q5o4l5P7j10J33o6J5l7j0R9j0Q6J6j03
7338A4R7l4mn8j62O2p4K53k7j91J63O2K1m7K0l5J62k04J64q7PP7j45J28k6j30
$$ y = [72, 13, 173, -99, 79, 180, 24, 68, -76, -47, -8, -13, -106, 59, 6, -41, 116, -207, -107, -6, -22, -20, 89, -29, -70, 69, -31, -66, -140, 125, 196, 142, 111, -56, -147, -83, -63, 87, -82, -134, 214, -103, -17, -98, 98, 186, 161, 295, 49, -101, 36, -176, 164, -104, 103, 106, -9, 146, -31, 46, 53, 83, -162, -56, 116, -77, 27, 69, -245, -80, -55, -74, 75, 55, -12, -108, -88, -73, 84, -52, -150, -170, -1, 17, -62, 4, 44, -122, 9, -66, 87, -154, 155, -3, -170, -29, 41, -284, -10, 87, -120, -193, 141, 20, -17, -3, 154, 129, -72, -103, 156, 46, 63, -128, -132, -10, -54, 201, 172, -73, -286, 6, -12, 73, -172, 185, -195, 193, -189, -6, 21, -16, -293, 111, -36, -6, 73, -146, 160, -142, 28, 46, -35, 133, -15, -90, -66, 36, 158, -64, 76, -113, -104, -90, 106, 106, 15, -62, 23, -41, -76, 1, -109, 24, -42, -27, -64, -74, 25, 15, 101, 117, 14, 111, 77, 73, 15, -147, -85, -159, 94, 67, -124, 39, 101, 122, 75, 95, 60, 222, 18, 182, 95, 102, 179, 34, 162, 136, 6]
7364Fk8J54k58L07k61M5J60j92q9J28O8%k8j78N0%R4%J40r8J9K9kr8P3JRr4o9
7393a12J34r2j43L50j95O0r3K24q2J02j03j55K21j62J46j09O2p0R2j67K05k10
7415i7j01L63L0k68J59rr1Q3q2J31jj42LJNL7M9p4k07K07J9%J50k12pJ25K3j73
7443g9J05O5J19k57K17p6l4J6j65L7J44P8j76K7p5O6n1L8P4J9j13j2P8P6k6r3
7469Bm7K25j38n6j90J23K32j72M9N2L8j09j35J61k44K45M2q5nq5Q4%J9m2J10N2
7495A26j9o3j29R9k03K51O1j85J17o8J39j73mK18j7j75J8L7o6M1PL5j00J77l2
7520I2j47J46N9k6j12J49j16J74j42n0q8o7N1P2O0j55L7r4K34K23l40K16o5j48
7544c7O4j28q7L60l5k84L43k24J57j06n0J09j91o7L08l06lK51j57Q6Qj07Q9j14
$$ y = [6, -22, 132, -126, 181, -80, -35, 125, -67, -156, -28, 40, 40, 12, -166, -116, -116, -22, -22, 118, 20, 39, 68, 66, -32, 41, 42, 51, -43, -112, 22, -70, -213, 137, -58, 2, -91, 133, 51, 153, 50, -105, 116, -46, 100, -9, 53, -17, 75, -92, 113, -97, -198, 165, 195, -73, 86, 77, -14, 69, -13, 118, 117, -25, -22, -21, -16, 21, 70, -4, -211, -4, 15, 15, 165, -47, -54, 71, 94, -79, 26, 91, 210, -47, 170, 94, 60, 76, -89, -52, 92, 170, -6, 21, -54, 12, -39, -1, 73, 92, -21, -33, 45, 121, 95, 2, -45, 180, 42, -14, -204, -81, 151, -21, 28, 80, 118, 9, -126, 35, -209, 36, 78, -7, -12, -97, -13, -13, 6, -36, 74, 126, 107, 44, -85, 14, -189, 62, 123, -62, 55, -13, 126, -47, -51, 167, 150, -25, -7, 30, -36, 5, 12, 47, -53, 124, 92, -55, 91, 150, 124, 12, 161, 45, 219, 77, 27, -61, -128, -77, -5, 55, -100, -63, -157, 77, 300, -40, 176, 111, -37, 27, -101, -188, 172, 137, -147, 196, -28, 129, 23, -27, 82, -109, -176, 132, -174, -177, 74, -83, 3, 11, -96, -7, -121]
7568a21J34k2n4Q5ok53J29J99j15J12J2j99O1J09n3J0j64J9p1J91j04J82k9K26
7592B78l67P9J74j27j05J78n9j64K86J8p0l07K84j26k7J53j39K3k16J07L10J6
7614A99j50nj03P4q8J12k06L39L1j36L1k18R1J08k56K05M3j43J18j21o2k0J67
7637A0P9k01K44m7k66K48m5M5m6J40l72K58k58K68j31j8nQ9J58j50M3p6M2J8m
7662B3J17j11k75L18L6j03j06J50j59J27Q8o8l43L10N2j1k1k38K03mN8N8J31l50
7686a18qO3L5R2j19l0Q7j38P1L08k82O4LRm5J22j26j07K29j80L1l2p2Q9N3Ml2
7713b9J52k55K23l3l2j52L75j78j5j93M8J71k8j99J41nj47J05p7J11m6K29k1O9
7737B14j52M9j00k54M43k27Q8l5j00L0l6J78q9P8p8j45K26p1R1l7k21K15o9N7
$$ y = [-121, 13, -9, -63, 22, 16, -237, -108, 91, -24, 88, 100, -99, -38, 71, 18, 28, -136, -117, -188, 3, -101, 81, 52, 278, -89, -10, 164, 37, -68, 110, 51, -113, 173, 191, 121, -186, 98, -28, -55, 98, -41, -18, -234, -127, 183, 199, 49, 44, -59, 15, -73, 39, -167, 172, 203, 67, 98, -120, -29, 79, -177, 28, 71, -72, 46, -75, -137, -157, 10, 89, -112, 132, 85, -181, 67, 22, 67, 21, 161, -211, 47, -211, 57, -74, -92, -97, -8, 150, 0, 43, -33, 9, 27, 23, 140, 29, -246, 72, 108, 5, -101, 49, -110, 17, 105, 37, -306, 4, 56, 45, 24, -214, -11, -15, 43, 101, 232, -118, -126, -63, -28, 64, -55, -85, 2, -136, -65, 243, -39, 25, 28, 37, -8, 114, -12, -119, 110, -70, -39, -71, -143, -54, -1, 3, -29, 123, -132, 91, 58, 26, -126, 249, 71, 56, -137, -89, 82, 54, -145, -4, -9, -156, -51, -128, -17, -63, 166, 145, 214, 62, 111, 11, -243, 200, -27, 61, 26, -74, -44, -80, 98, 9, 87, 9, -136, 90, 19, 110, 73, -148, 67, -2, 55]
7761E5j43K2J03J30j51o7k0M9J34Pj62p8J26J72j92l4J56j92J7j4J63K8n5o5n2
7786f3J1O0j06J26J9O4J91j70o0k34J07J11J08j56J0N4j55J52J6n3l1K25l30K48
7810A44k9j18j03J01n8J65m7J54j84j39l6K14j78K14p7Om3K07j07l65K71P2J1
7833G5j62O3ko0Jk8P4J83Q9j38k56K40j43J62m8o9r4N9R0J08k04J77j66K30p8
7858A03k42J62K47k33k18K62k12K76Mk44J32k39j27K98J41l04J98J32N5k31N0
7879A0q1R1n0J29j16m7n8O7J16Or1k35K00o0J65L7q3j42L34j78M4m4J4n6K8r3
7905i3j17K98q5k1q2L11j22q5j58J13J43j74J22j10O6j10j67K69M5k65K25q1Q5
7928Gj24J90j35L3j86L09k07j0R6J10k31J30j01J95j14J18j76J27m9R0L0r8j10
$$ y = [55, -88, -66, 37, 167, 16, -51, -71, -22, 112, 119, -43, -121, 5, 177, -15, -49, 107, -85, -68, -82, 81, 109, 54, -11, -63, -52, 8, -98, 28, 47, 111, 302, 132, 72, -162, -55, 56, 164, 8, 18, 72, -83, 69, 85, 32, 1, 226, -104, 144, 115, -3, -106, -5, -63, 102, 55, 209, 25, -114, -150, 64, -114, 100, 23, 29, -14, 193, 86, -279, -8, 64, 75, -87, -24, -26, -86, -85, -113, -39, 144, 233, 95, -161, 79, -64, 98, 50, -19, -113, -54, 36, 144, -60, 117, -49, 181, 103, -139, 23, 270, 37, -181, 81, -131, 145, 149, -95, 37, -202, -329, -31, 110, -194, 4, 136, 191, -40, 10, -71, 20, -30, 99, -17, -64, -122, -55, 61, 67, -24, -259, -59, -119, 46, 83, 0, -142, 192, 14, 58, 14, 28, -28, 0, -93, -210, 88, 3, -18, -100, 211, 89, 4, -154, -41, 102, -72, 50, -60, 6, -104, -271, -2, 43, -222, 3, -78, 7, -117, 73, -62, -29, -215, 94, -113, -123, -27, 83, -148, -18, -119, 76, -38, 80, -96, 31, -18, 72, 102, 4, -106]
7951a06k9L3Q0l1L0J14j77K7J9O1j2k03K36L4M5k10J2J15j1L4q9n8M6J18k4J41
7977A95j28K53k59Q2k34J02j31K52j72K28l00K09r7oJ70r5L2j83K38j63q8J08
7999A3R8K8L8j68J18j20o6Q8r7J40j2J16j51j09K11j01K0r2q4KJ44J66r1o1q1
8024e1j20K2J49J28j96J59o0o9m8N2j6M2j48K93k4o6j47j2Q0M1L5k9j76J65m5
8049d1Mr7Q9r9Q7J68j18J8r7P0mJ36j11L9r0j55k6N45l09j65J97M3r1rQ2K3l9
8076E0k17K95p3m2l7P9P9k35J61r7L4NM00m51p3r0J70M1m8N2q0J70k11J46n9K6
8102eQ8P8j35o1J2p6j27K17K37j51p9m7J6K64l0j89n9K58l51L12k68Q9m1K53j75
8127C0l9l3O8P7m18N01m88L82J15j66Q5j52J26k38R8R3o1J17j92O2k0m5J31l9
$$ y = [-106, -135, -102, -22, -53, -23, 91, -86, -59, -40, 21, 9, -194, 42, 76, 121, -89, -77, 38, 27, 61, -28, -86, -40, 78, 54, 195, 67, 320, 61, 143, -91, 11, -120, 132, -40, 188, -112, 97, 0, -6, 164, 69, 101, -82, 156, -7, -95, 13, 111, 139, 177, 9, 127, 7, -59, 29, -68, 72, 60, 176, 25, -84, 127, 26, 46, -46, -130, -128, 16, 182, 91, 30, -51, -171, -149, 0, 128, -68, 91, 31, -38, -86, -34, -50, -8, -156, 137, 113, 47, -100, -112, -32, 9, 44, 15, -161, 4, -41, -37, -134, -45, -144, -57, 111, -7, 11, -86, -16, -20, 116, 5, 44, -46, -201, -227, 318, 9, -156, 41, 84, -7, -16, 66, 89, 50, -167, 128, 55, 13, -24, 55, 134, -101, 60, -37, -3, 2, 402, -49, -122, -212, -42, -1, -49, 3, -77, 93, -118, 28, -31, -5, 83, 161, 26, -35, -23, -99, -226, -9, 228, 77, -2, -49, -33, 231, 201, 12, -47, 211, -140, 172, -96, -7, -48, 205, 30, -9, -42, 26, 103, -315, 186, -302, 80, 195, 29, 114, -38, 88, -150, -52, 41, -20, 97, -95, -33, -53, -98, 33, -6]
8151fK4j57J62j20q0L11j47M8j15K37j41K25j92mO2k64kJ03K13k93J09P9J00k38
8175h6K68R2k75r5P8J89j77J92k00n9M5N2l1l3M4n3
$$ y = [-6, 18, -139, 23, -97, -177, 134, -13, 35, -80, 157, 16, 241, 49, 45, 107, -157, -159, -56, 157, -136, -27, 52, 152, -86, 182, 274, -1, -96, -18, 171, -6, 186, -14, -73, -28, 24, -7, -40, 4, -49]
8191d9
$$ Imaginary data points
##PAGE= N=2
##DATA TABLE= (X++(I..I)), XYDATA
0@%%%%%%%%%%%%%%%%%%Oj4J6j6J6j6J6k4L2l2L7m5M8n6O5p3Q2r0J02j16J31j46
40g7J62j79J97k17K41k68K95l23L57l95M34m77N26n81O41p10P89q80R86j110J262
61F73j448J684j995K424l050M054n935J0585m1421p1684O6759j0858k9781M9300
75c0693j1356q4725K9478N7745k3544K2336N8504m9278l1281P4132K1262j9504
87A3076N6027Q825p2411J3645N6395k6110o03L7782n7608o2580M2512J0668m1266
100b1648K3620q7q2276p142N3423k1056j0024M5007l2020m9821N3643L7559k4510
113c5332L7032L2508n6254J242O9609m239q157M9141k4404n9362L8111L2388l7262
126C5021J2331J6926p0445k5708M8882j5731k9551L1495k2971o2426K7576L5067
$$ y = [0, 0, 0, 0, 0, 0, 0, 0, 0, 0, 0, 0, 0, 0, 0, 0, 0, 0, 0, 6, -8, 8, -8, 8, -8, 8, -16, 16, -16, 21, -24, 24, -32, 33, -40, 42, -48, 54, -62, 69, -77, 85, -94, 103, -114, 127, -141, 154, -169, 188, -207, 227, -250, 276, -305, 336, -374, 415, -465, 521, -589, 673, -775, 909, -1086, 1338, -1712, 2342, -3593, 6992, -34429, -106113, -39354, -50212, -79993, -30693, -42049, -126774, -97296, -39551, -63095, -40759, 17745, -31533, -62814, 11318, 32580, 13076, 69103, 77928, 5517, 19162, 75557, 49447, 48844, 86626, 29018, -33562, 8950, 19618, -21648, 1972, 1885, -80391, -87533, -34110, -55166, -65190, -20183, -52203, -102024, -48381, -10822, -35332, 1700, 34208, -22046, -20804, 48805, 44566, 36409, 85550, 61146, 1784, 39895, 72283, 35021, 47352, 64278, -6167, -31875, 17007, 1276, -28275, 3220, -19751, -82177, -54601, -19534]
138a9534l0581J2739L2182m4956j6257N8890R898j4918M2537K275m8716K6862
150A0421M7680k0012N599L1346m2615l2708M4416N224l3821K0397m742o3411L793
163b8433L7461k9708j0985K8477l7189l8667M3254J5953k7086K8493J4803m8056
175e1683J0215N3991r206j666M0899k1661l4492M2958K4088k5954J8885J2688
187E9062n1153p039M0338j6698j9755K3428k5701m7860K3685J9292l0026Q022
199b4405J5175m4023j1638M4537O48j3119L2028n146l7568L0023L8918j5930J0734
212B0234K6606l4279j4987M5042M069k1786K2407p626m9097J3103L0007k7657
224F036o211J7755m0473k8796L7342L631k5153K0539n54m3806J5204M1373j3585
$$ y = [-19534, -50115, -37376, -5194, -50150, -66407, -7517, 2381, -12537, 30000, 32275, -16441, 10421, 58101, 38089, 43688, 75034, 32419, -289, 44127, 49351, 15530, 35927, 31185, -32226, -28433, 9028, -20680, -31665, -3188, -40377, -79044, -35790, -19837, -46923, -18430, -3627, -51683, -41468, 12523, 3317, 1651, 42550, 20889, -13603, 29355, 53443, 27489, 46374, 59062, 7909, 870, 41208, 24510, 4755, 28183, 2482, -45378, -21693, -2401, -32427, -24405, -9230, -53253, -64891, -20354, -19706, -32825, -797, -5943, -43511, -13488, 25430, 9500, 20234, 46840, 12561, -2426, 42616, 46685, 24899, 47306, 39680, -9417, 3686, 33693, 6036, -175, 17580, -22893, -51689, -14347, -10716, -35869, -15330, -15884, -59690, -44486, -3113, -16698]
237a6698J046K9137k3466k0305M3948J8171j8351K0638P050l9492P217L8049j3635
250C3309j1978J8639k6581l4714K7916J3479k8334N360L508m2840l748L8058q475
263a6401j4813K1713j4806k9943L3359K8935j8794J0591J7554l1106m17M5443
275C1315J65j5721K2215j0461l3878K4788K5458k5238j616J0836l7059j4293L5394
288A1905m121k4881J3810r727l6243J8714K9400j9630k476J7825k4437j1019M1130
301B50J0549j8066J7573L600k8766J7712L5862j3556p515J7648k1566k0052L2908
314B6581R316k7355N789N61l6250L928L0993j6684j6735J5127j9410k3548L1155
327a6532J5943k3759Q511J0932k7788P322M0210o758j1464K2064r633k0520L1130
$$ y = [-16698, -15652, 13485, -9981, -30286, 13662, 31833, 13482, 34120, 41170, 1678, 8895, 46944, 33309, 21331, 39970, 13389, -21325, 6591, 20070, -8264, -2904, 604, -42236, -45984, -7926, -16401, -31214, -9501, -24307, -54250, -20891, 8044, -10750, -159, 17395, -13711, -14128, 31315, 31480, 15759, 37974, 27513, -6365, 18423, 43881, 18643, 17027, 27863, -9196, -23489, 11905, 7784, -17097, -3287, -13014, -49257, -30543, -1143, -20773, -23249, -5424, -29861, -40880, 250, 10799, -7267, 10306, 13906, -14860, 2852, 38714, 25158, 17643, 35291, 13725, -6327, 26581, 35897, 8542, 14331, 14892, -21358, -17430, 13563, -3121, -19856, -4729, -24139, -47687, -16532, -589, -24348, -15837, -4905, -32693, -25371, 14839, 8081, -3383, 18681, 9048, -11472, 19658]
340A9658K0274k2523L899J0218k9374k543L2556r491k1868J1963j2629k9296J9490
353i666J8649k4942l766J0895k5460o078L4653N12j8099J5718M67k2590K2306
366g401K9796j5364j582J7999j7640q775L4466M707k2521J0433o45k9279J0886
379E080K4548k1112j2828J1589k1627j7937K7855M687k5074P898L792k6480J1032
392b8577L1557j1775q347J9273j0493j2880L2662J4924j9081Q385Q904k3235N895
405G212L0293j0641j6444J2083j2901k1924K1092J1921k5504k884O099k5735k026
418b9359K8902p250j8193J3198m997j9208K4146K2122j7522R07J5075j6966K95
431h850L4143N9j7380J3232k347k1173J8312K0518k1744p491R455k1530r338K6526
$$ y = [19658, 39932, 17409, 21308, 31526, 2152, -391, 32165, 22674, 806, 12769, 140, -29156, -9666, 8983, -15959, -19725, -8830, -34290, -40368, -5715, -5203, -23302, -7584, -7117, -29707, -7401, 22395, 7031, 5449, 23448, 5808, -2967, 31499, 36206, 13685, 24118, 23473, -5806, 5080, 29628, 8516, -4312, 7277, -14350, -32287, -4432, 255, -24819, -16921, -13129, -39609, -28577, 2980, -8795, -17142, 2131, -8362, -21242, 11420, 26344, 7263, 15648, 24552, 1317, 7212, 37505, 26864, 10420, 22503, 9602, -12322, 8770, 20691, -4813, -7697, -1598, -27333, -29359, -457, -7707, -25900, -12702, -17699, -36907, -12761, 9361, -8161, -7254, 7821, -9145, -8850, 25293, 25352, 7972, 21204, 18857, -2316, 15996, 36514, 14770, 7279, 16734, -4796, -14134, 12392]
445A2392k943k4048O398k816k2939J3604K3149j6921q025J3380j2750o765L1470
458C186Q221j8686Q991O775j7135J3431K8446j2696j1860J3182j0761j2888K4774
471B2980P118k5283j08L758k2956L537K3811j4364j8470J0461r032j5324K3927
484i945J2374k1757J678J0967j5362O604L0673o011j4288J4595j591j2463K3677
497A9151J5430k1015k606R647j7083j141K4707q627k2202O393m664j8872J5207
510e675J4103k2316q180J0453j3666k688K7016o21j9166J0111N299j2817J7295
523h52K2945j5106o510J5428q373m918K5804J823k2279M743L365j8431Q110J8212
537B3961j9253j5213R621j1152j1216K0976K837k3305K666P384j4581R044K3970
$$ y = [12392, 9449, -14599, -8201, -11017, -33956, -20352, 2797, -14124, -22149, -8769, -21519, -28284, 3186, 11407, -7279, 1712, 8487, -8648, 4783, 33229, 20533, 8673, 21855, 11094, -1794, 22980, 30098, 4815, 4707, 8465, -14491, -10954, 12857, -1507, -19977, -9516, -18548, -33872, -9945, 2429, -19328, -17650, -6683, -22045, -15441, 15232, 9221, -5067, 9528, 7937, -4526, 19151, 34581, 13566, 10960, 20607, 3524, 2383, 27090, 18463, -3739, 2654, -2010, -20882, -5675, 8428, -13888, -22068, -11615, -25281, -27969, -953, -1574, -20740, -10629, -5330, -18147, -852, 22093, 6987, 477, 15905, 7532, 2614, 28418, 30241, 7962, 12705, 16070, -2361, 5749, 23961, 4708, -10505, -884, -12036, -23252, -2276, 561, -22744, -20078, -12694, -27275, -18231, 5739]
550E739j0808j1492J5148j737o995K3769J0483j8510K371J0604j3093L793K2334
563C1606j0430j8263Q770m393j5033J4911Q737k3590o443R020j4291k158K2055
576D98o674j8842J0595K721j2048J7093J7190j6752k543J5355p731p50K4915p45
590B2282j8542Q700L908j4544J2116J5029j9786j0458R664j1098p616J8910k309
603F256k2769L417L944j4125R024J7525j4595r776J3085l681m817K2078O129j7421
617e726M636J0155j0228P607K0716j1066j3559J1097l167j0194J6648N292k2645
630d34l062P888j3805M53J8073j1765j7588R438p78j1014J6468J0066j8562j507
644a6129J2893p841L004K2509m807j5200J1063L481q994J5189J1670j8680n669
$$ y = [5739, -5069, -16561, -1413, -3150, -10145, 13624, 24107, 5597, 7968, 18572, 5479, 9272, 31606, 21176, 2913, 11683, 7290, -7743, 7168, 15905, -7685, -14128, -5108, -19399, -21557, 498, -6176, -25018, -14423, -11702, -23750, -6657, 10533, -6219, -8762, 6593, -1138, -1888, 23027, 22282, 3740, 12440, 16348, 1804, 13920, 28949, 9163, -1295, 8369, -2729, -10345, 8565, 6256, -16513, -13096, -9152, -23277, -14253, 3272, -11323, -21099, -8014, -11695, -16512, 5566, 11695, -5726, -1090, 9065, -1163, 6444, 27160, 16094, 2535, 13632, 10465, 271, 16919, 22211, -434, -3496, 4392, -9413, -8960, 9113, -2652, -20240, -10802, -11580, -22594, -6126, 3940, -14622, -16129, -3236, -11077, -8073, 14436, 9629, -5571, 5492, 8973, -21, 15168, 26838, 8158, 2489]
657B489J0357q883k506J7464o660k0846N021K396j2684R263J1227j8127q873J1365
671h997n525l380J9360J49j7892O872R144q316J0690J7281j3625r317J4095j983
685H556n489J8216Q63k0738K282P630j1971L883J3855j5809j4906R926l066q639
699a5407J4766K286k0051J029J0315q092M912J7265r115j1972J2662L439n676
712c639J5510P461j7256o56J1854o658N32J5231r009j6845P628K014j0753R112
726D526O245j9506o100J0833o858k756J5431n296j6989Q729P111q013J0822J2119
740A0298j4970m618J4750k210k301J6824k182j7063O700P611r849O373J0513j6297
754C579r932J0548m051o924J2852k264j8932K810P998q527M402J2222j1869r392
$$ y = [2489, 12846, 3963, 1457, 18921, 12261, -8585, -3564, -1168, -13852, -4589, 6638, -11489, -20362, -8997, -14522, -17902, 1458, 1607, -16285, -9413, -269, -8585, 2105, 19386, 5761, -3556, 10539, 8556, 3067, 21283, 22146, 1408, 3690, 11320, -651, 3232, 17087, 1278, -13628, -3702, -6768, -15407, -641, 1645, -18406, -17377, -7062, -15154, -10242, 7023, -2092, -14064, -1402, 2037, -3639, 11871, 19332, 2076, 1420, 13274, 6616, 7148, 22379, 13370, -3475, 4153, 6167, -4586, 4526, 10771, -8735, -14835, -4002, -10860, -13616, 1815, -3481, -20470, -11741, -4630, -12643, -1821, 10298, -4672, -9290, 5460, 3250, 949, 17773, 15591, -1472, 5228, 12839, 2990, 9363, 19876, 3579, -6353, 4195, 144, -6780, 6072, 3808, -15124, -12314, -4316, -12843, -8441, 3781, -8088, -17480]
768a7480J2297J249m922J4361L709j5652L148J1753o103L147J3653r962j1968
781b770J0421J732q311J0196L346j8685k159J0208q088j657J2578r291j4940R460
795g960L515q449R877P043j5990j688J3270l744l00J4983m424j3218R018O733
809H666p033Q440Q233j5056n081J1308l882m141J1473m805j6692M411O054q778
823f883M078P855j3871p940J1270o79n054J2410j49j4969N172J0903n705M559
837I97J1996j0550q227J2816J689n739J1057J160j6842J806R932p900N50R621
851A2366j2225j2243R789R72q010Q795J770j6177O76J1092m883P63J1892p261
865b684j0421J1034N681n380R222N557j3532q54J2025l172j986J0060o386j3838
$$ y = [-17480, -5183, -3934, -8856, 5505, 9214, -6438, -3290, 8463, 2360, 5507, 19160, 9198, -2770, 7651, 9383, 1072, 11268, 14614, -4071, -6230, 3978, -4110, -5767, 6811, -2480, -17420, -7960, -4445, -12894, -3017, 4026, -11964, -13652, -382, -4126, -4426, 10557, 6133, -7085, 1933, 8666, 1633, 10073, 18306, 3250, -1831, 9477, 5595, 1454, 12927, 8122, -8570, -4159, 1895, -6883, -2805, 5050, -8821, -16761, -5491, -6170, -11224, 1186, 1037, -13932, -8760, 2143, -3562, 997, 12993, 2443, -5784, 7032, 8721, 2982, 14039, 15199, -1643, 163, 10095, 2195, 2745, 12366, 141, -12102, -2313, -1341, -9351, -556, 1214, -14963, -14287, -3195, -8078, -7315, 4577, -2684, -13105, -2071, 3610, -1770, 7452, 13009, -523, -1377, 10648, 7476, 5490, 15550, 9164, -4674]
879d674P076M895q298M343M292j5060n288J1016k975m241R570l944j3708P333
893i663Q710o228N124Q675j1712m145J3883O51l926J0700j301j3869N883R005
907A1787o995K254O987j2636q058J0650o37p033P289j776j4788K795R120n969
921g010M59Q291r325p880J1656L864n194Q067K817j2144K553J2132l496n74Q820
936A3036o894r979R946M130p689N081K244j4723j238J0773n297l752P922p224
950c664j1681Q806N716p597M808M957j2196r52J3018j531k788R949l253j0414
964f822R018P560o059L572N786j1566l478J0915j660n687O538l602j2632M651
978c466P206p542J99N200j0449n780J1149R58n695P253K61j1127N002J0928m291
$$ y = [-4674, 2402, 7297, -1001, 3342, 7634, -7426, -12714, -1698, -4673, -8914, 656, -3288, -16996, -9663, -953, -7181, -2057, 6618, -5094, -9239, 4644, 5295, 1369, 12069, 10768, -3101, 2782, 11787, 4792, 7046, 14033, 1397, -6661, 3989, 3352, -3681, 3608, 1832, -12956, -10161, -1041, -7010, -6551, 1740, -7585, -15465, -3809, 55, -5139, 2928, 5745, -6399, -3846, 8286, 4790, 4216, 13036, 6142, -3837, 6109, 10239, 2550, 7631, 9875, -4848, -6086, 4687, -610, -4362, 3560, -3664, -15345, -6539, -823, -8420, -3612, 1345, -10851, -11803, 1215, -316, -3104, 6845, 3592, -6822, 2196, 9756, 3697, 7269, 13055, 1489, -1989, 8926, 7266, 1579, 8117, 4515, -8117, -3466, 3740, -3802, -3603, 1597, -8852, -14632, -3483, -2525, -8220, -967, -706, -11833, -6831, 4097, -194]
993a94P41Q344p329o040J1635K974o504O281Q80j2631K130R484o005k783O171
1008G154q837q959Q851K617q177M450J845j1893J052J0913l559j627Q223m903
1022b850p274J0141O333n563M643M167r996j43J1353k290m100O097m661j0440
1036d583O411N579p678N08K951j1026l314J0235j549n533N973k270r779O818Q730
1051A473n350J674O308p984k245J2198J019m739O551o57j0239N142Q314o241j070
1066D154M566r075n708R263L04p268L606r45j0755L057Q917m602k079N752n684
1081f497n172J0352M504n735M464K468q677K953J0551k715l155N911m714p299
1095b761Q538M124p766J101K162j0316p41R766l887n633N067m205q206P981N756
$$ y = [-194, 547, 8891, 1562, -4478, 7157, 10131, 3627, 9908, 10788, -1843, 287, 9771, 3766, 983, 7154, -1683, -10642, -1791, 826, -7351, -2901, -1056, -12949, -11897, -984, -4543, -6170, 2053, -2850, -10124, 17, 6350, 787, 5430, 9597, -399, -542, 10811, 8521, 4421, 10518, 5857, -4583, 1828, 7407, -271, 237, 3188, -7838, -11152, -917, -2466, -7999, -2026, -4296, -14075, -7257, 1473, -3877, -2203, 4105, -3879, -6124, 6074, 7093, 2354, 8905, 8248, -1991, 3151, 11465, 5224, 4154, 8720, -355, -6063, 3200, 3504, -3764, -158, -1103, -11858, -8801, 116, -4486, -6565, -813, -6497, -11669, -1317, 3187, -2548, 1916, 4384, -4293, -1340, 9211, 6496, 3341, 9252, 4538, -2761, 5777, 9901, 2135, 3236, 5398, -4918, -5659, 4107, 220, -5413, -346, -4551, -12757, -4776, 980]
1110I80o718J567M204q045m6J1539r70m012O202j700p256P417P129o333N07M014
1126H479p972k345R441r80o614L464k185q984M353O674o288j888L949o347m050
1141a1293R935J474o045L933J579p641M217R904l863j903N815m534m493R571K962
1156I618o784K471J597q801J571Q284m921m469M088n289n970P490K779p323J299
1171d360K431p807J443R505k513l678N469k028m963Q163N586n616J098L925o587
1186F8l6R262j901n431L545k073p435N259N302p381j476L202p265k353Q855n23
1202c81o264L711j51o712N603P245m862o29N247m718j891R534J241n507L281P61
1218E508o914L956P052n816k761L780n600m140P498J030p184J263J008p106K361
$$ y = [980, -5738, -4171, 33, -8012, -8058, 3481, 2511, -1501, 4701, 3001, -4255, 3162, 10291, 3958, 4465, 8479, 507, -1838, 7603, 6623, 9, 3473, 1288, -7696, -3343, 3331, -2957, -4845, -896, -7243, -11293, -1358, 116, -5929, -1996, -417, -8058, -3841, 6063, 2200, 297, 6112, 1578, -2915, 6656, 9618, 2834, 5305, 6902, -1899, -328, 7956, 3035, -1434, 2654, -2635, -8605, -1115, 1664, -5659, -4360, -1929, -9736, -8293, 1212, -1301, -4979, 490, -1538, -6501, 1662, 7248, 1632, 2730, 6655, 68, 32, 9294, 7393, 1962, 5507, 3434, -4001, 1258, 6560, -821, -2297, 905, -6360, -8713, 142, -381, -6645, -2934, -3085, -9797, -4194, 3051, -1811, -2440, 2807, -1911, -3802, 5732, 6973, 1466, 4747, 5508, -1406, 2550, 9602, 3786, 1025, 4805, -795, -4935, 2563, 3593, -3591, -2328, -1320, -8426, -6065]
1233f065P677m168l209M279k766l722Q293L765n694J786K968n722K236Q560k759
1248E459m340M099k130n200O201L650o742n88K392o692l71P668k353o089L502
1263a534j870n486O239M921n940l87L660m698J76Q816o16n073L810J70m827N513
1279B874N846n670j631L343m259k094P669n37o708J613r0n904L578N688n482l105
1295d869L506l511k568P662J403o359K107K161m928L743P557l748l235M261j929
1310A253l018P346K259o654R12K037n532J470O687m109m975L022k461m322N969
1325a16K533o673l02K437m330J212P285k270m372L725L2l378O348M288n592n59
1341B68M048l854m0P185j599n672K329j72m829L983M118o568k394L113l993j471
$$ y = [-6065, 1612, -2556, -5765, -1486, -4252, -7974, 319, 4084, -1610, 176, 3144, -2578, -342, 8218, 5459, 1119, 5218, 3088, -2112, 4089, 7739, 997, 409, 2801, -3891, -4262, 3406, 1053, -5036, -1534, -3404, -8890, -2651, 2270, -3670, -4057, -397, -5095, -4919, 3897, 3281, -1792, 2018, 2188, -2639, 2874, 8720, 3050, 1419, 4762, 503, -1591, 6078, 5541, -1167, 446, 356, -5548, -1970, 3718, -1764, -4869, -1363, -4874, -7442, 220, 1623, -4736, -2629, -468, -5396, -1653, 5904, 2156, -1079, 3182, 1253, -1765, 5581, 7840, 1186, 2098, 4135, -1397, 73, 6760, 2651, -2324, 698, -1763, -6085, -116, 2417, -4256, -4558, -2121, -6451, -5239, 2046, -224, -4596, -871, -839, -4217, 2131, 6419, 827, 268, 4316, 462, 422, 7607, 6008, 336, 2665, 2493, -2336, 1647, 5765, -803, -3197, -84, -4077, -5548]
1357e548O521p91o183K535J377m531M167N895m855k140M793k200j301P506O29
1372E874n892K137K028m655K982N365m931l567L102k474k946N695J86o610N50
1387c156J973m418J671N727l642l992L902q12k593O153K604n465Q40L381l294
1402a121J521O593k642m533L332l40l900M996K639o334j251K820l736n52N882
1417C374k568n854K840J54l704M304L692n804j053M093k597k20O758n79n281K799
1433C54J652l302M117M269n007k281L588k367j331N483n66o457J290J398m085
1448c245K109M269m728l316L268j355k180N480Q71n680J184L090k961K492N425
1463D723l455l487M031M2k189N371J368o061J69L038l512Q98M618l841m917K919
$$ y = [-5548, 973, 182, -6001, -3466, -2089, -6620, -2453, 3442, -1413, -3553, 1240, -960, -2261, 5245, 5874, -18, 2119, 4147, -508, 2474, 7839, 2908, -659, 2443, -31, -2977, 2718, 2904, -3706, -3156, -1183, -5601, -3930, 1797, -1845, -5837, -1935, -2747, -5340, 813, 3417, -2048, -1208, 2173, -1121, 400, 6993, 4351, -182, 3150, 2810, -1090, 3906, 6545, 211, -1040, 1780, -1956, -2508, 3374, 806, -5048, -2208, -2054, -5758, -1454, 2238, -3566, -4619, -526, -3123, -3343, 3415, 2836, -2445, 354, 2006, -1296, 2821, 7090, 2083, -198, 3390, 1023, -308, 5175, 4609, -1848, -558, 840, -3245, -1136, 3133, -1595, -4911, -1643, -2998, -5178, 302, 1173, -4507, -3323, -233, -3194, -702, 4723, 1268, -2219, 1812, 1854, -335, 5036, 6404, 343, 512, 3550, 38, 936, 5554, 1713, -3204, -285]
1479b85l51l132M224J223n919o41K894k100M25N506k336m230L558J080k318M223
1495A821L121m540q04L664j742k14N135j791n448J891J582l448K334K688n311
1510a062k784L369j919j454M742j226n536K076K359k795K700M097m028k242M557
1525H54n25r25N071J05n092J477K922k955J492L913m484l469L034p75k357L480
1541A766n0n410N6K757k807P52M113l296l366L567O50j932M167J696m724N16L864
1558B319j799O98M571k738l863L011P64k662K867J598n638j059L396k397o42L684
1574B110k493m838K592J301k561K625K537m539j058M194j155j23M233r05m135
1589b215K494K294k023K103K726m145k003L548q31j823L499q55n105P81K297k724
$$ y = [-285, -636, -3768, 456, 1679, -4240, -4881, -1987, -4087, -3662, 1844, -492, -4722, -1164, -84, -2402, 1821, 4942, 402, -402, 3262, 1520, 1306, 6441, 4650, -798, 1093, 2675, -773, 1561, 4249, -1062, -3846, -477, -2396, -3850, 892, -334, -5870, -3794, -1435, -4230, -1530, 2567, -1461, -3703, 854, 329, -596, 4475, 4580, -512, 965, 3887, 932, 2424, 6337, 1853, -1616, 1418, 643, -1714, 1766, 1716, -3694, -3638, -881, -3688, -2936, 1177, -2119, -5485, -1918, -1268, -3200, 967, 2663, -2061, -1545, 2319, 520, 1218, 5789, 3051, -812, 2199, 2963, 301, 3168, 4766, -872, -1931, 1465, -932, -1574, 2110, -383, -5221, -2629, -1328, -3889, -1264, 1273, -3266, -4324, -130, -1285, -1408, 2825, 1920, -2215, 279, 2573, 550, 2653, 5379, 1234, -769, 2779, 1948, 125, 3624, 2769, -2336, -1555, 742, -1982]
1605a982Q77K815l820k926L327P0j658L590L72m647J065L553j933J323L809k974
1621H61k935L881O12j774L303P31m990n0L409k161l11L000l081l902K539P97k517
1638b588K515Q58m686m80L404j177l07L755j647l572K967K018j784K409K157l675
1654A67j146L862o97q29L065j469m367K041J510k339P24J769l922k247L549q67
1670a196j749L179o25m473J702L004k153J353K891l237j571L840M42j230L273
1685C450j21m306J614K792j896J36K579l411k878L023J08k251K123j5m380j4K873
1702e74j550j09K861k125l078L079J564j508K249J492m045J50L927p72o24K980
1718C917j605l562K612J634k347J139J363m326q26L194j234j346K498j630m019
$$ y = [-1982, -1105, 1710, -2110, -5036, -1709, -1639, -3297, 293, 665, -3982, -2917, 636, -1297, 26, 3835, 861, -2074, 1807, 2419, 645, 3948, 4679, -311, -361, 3048, 887, 576, 3576, 495, -3407, -868, -71, -2588, -73, 785, -3901, -4381, -977, -2154, -2461, 1294, -353, -3925, -958, 1060, -724, 1685, 3842, 167, -979, 2883, 2186, 1357, 4422, 2953, -1414, 627, 2137, -202, 522, 2291, -1631, -3878, -329, -1196, -2945, 234, -391, -4864, -3162, -158, -2311, -958, 1933, -1304, -2875, 965, 1407, 177, 3450, 3329, -977, 637, 3429, 1533, 1669, 4248, 837, -2041, 982, 1090, -1161, 962, 947, -3433, -3447, -574, -2124, -2233, 628, -1497, -4575, -1496, 68, -1440, 809, 2301, -1744, -1594, 2333, 1561, 937, 3917, 2312, -1250, 1362, 2996, 649, 1788, 3151, -1175, -2001, 1193, -41, -1387, 1111, -519, -4538]
1733d538K470K111k428J421J968l503q89L740l07r82K976o07l165J967K291j725
1749H00N82K127k897j894L149j5j604K122q99l909Q62K579j707l09J892k575k422
1766d118L211P59k051K154N01l551R15L495j234k94K842k212k366L266J143j921
1782E39J768P23l831K17L198j716p84K182k298k983K590J177k369J068R18l459
1798c060l34L366p27j010K339r61k583K460K217j821R76J563k714p74L360k6j506
1815G65J859n80l355J506K190k121j15J472l149j660L292j19j915J680j92l254
1831c696J430K625j425k8K206k008j540L368P60j570J898L67l262J153K704j478
1847A504m92J616k089k180K517P26k315Q83K54l027N3K814j115r42J742j240k120
$$ y = [-4538, -2068, 43, -2385, -964, 1004, -2499, -3388, 352, 45, -937, 2039, 1432, -1733, 234, 2525, 800, 1382, 3509, 612, -1282, 1867, 1852, 248, 2370, 1471, -2438, -1576, 1003, -704, -1013, 879, -1696, -4118, -907, -148, -2199, -45, 456, -3095, -2180, 1315, 81, -213, 2629, 417, -1949, 1317, 2460, 539, 2307, 3030, -801, -584, 2614, 898, 114, 2296, -2, -2985, -395, 782, -1587, -519, 399, -3060, -3394, -28, -755, -1765, 574, -387, -2970, -510, 1707, -114, 862, 2425, -289, -1063, 2297, 2271, 765, 2624, 2044, -1311, 195, 2385, 264, 149, 1621, -1528, -3188, 104, -15, -1930, -250, -442, -3696, -2266, 359, -1066, -1094, 1112, -896, -2436, 932, 1692, 122, 2020, 2387, -875, 278, 2982, 1504, 1012, 2628, 539, -1641, 876, 1602, -713, 170, 424, -2603, -2550, 264, -851, -1793, -51, -1291, -3411]
1864c411K390J725j545R05J280k518k4L332l04j392K132r74k675J927J946k232
1880E62L15J232l208p63L096n72j828J648q54k927J748J934j858J87J496k207
1896a999q44L311K28j515J831K5k657J634K592j847K74J299k044j123K662M53
1912B280k146P39J28k892Q12K104j180r50J325j545j685K398R23j697Q69O89k575
1929b403P00K904o81r62J947j232j692K703J428k100P61O92k370j27K667p76j606
1946a47J430j211k392K058J336k084K17P44k297l32K938m29j288J089nj994J891
1963d76K223j651J33J371j657q55L064K33j820R61j62k407J259J922j675q56J131
1980G38j729r95K144L09k195Q07K68k311J126K456j243n57J506r19j053K665Q31
$$ y = [-3411, -1021, 704, -841, 64, 1344, -1174, -1198, 2134, 1830, 438, 2570, 1596, -1079, 848, 2794, 562, 877, 2109, -1099, -1862, 1234, 662, -1166, 482, -372, -3299, -1551, 383, -1475, -1288, 208, -1999, -2843, 468, 696, -819, 1012, 1037, -1620, 14, 2606, 759, 1033, 2332, 288, -835, 1827, 2280, 134, 873, 1001, -1891, -1079, 1025, -155, -1105, 220, -1325, -3010, -612, 311, -1386, -517, 172, -2403, -1703, 1201, 520, -442, 1505, 273, -1419, 1284, 2712, 612, 1373, 2065, -305, -432, 2235, 1459, -147, 1283, 72, -2320, -262, 1074, -1010, -793, -49, -2346, -2678, 260, -169, -1457, -368, -373, -2367, -476, 1747, 96, 229, 1600, -57, -912, 2152, 2385, 565, 1526, 1364, -1043, 216, 2138, 463, -393, 738, -991, -1986, 158, 467, -1728, -921, -653, -2964, -1838, 618, -625, -1182, 324, -595, -1648, 1017, 1848]
1997A848j767J035O63k288Q28K321j029j090J233j224j599J781P54j941J22M24
2013G1k197J19K314r29j171J125n41j561K136J647j852K68J359j564q5K893k82
2030A750j584J484j09k107J570J607j917l74J080j889j004K450k68k012Q66j46
2046f03k028J363J814j497l88J198j303o55K599L55j269P98M15j650R55K158j049
2063A213j011J283r30j131K168L80k054M46N09k279N00J946j205j132Q18o67j164
2080b310J635J240j985L40J075j348L07K277o55r28J135l25j140J677J377j704
2096F68j40Q61j406k19K117r22j567R05m10j512J305J281j778o01J237j546j54
2113a881K124j26j577R18N28j460J297J730j453k23J097q09m44K019K18j830P25
$$ y = [1848, 81, 1116, 1779, -509, 319, 2640, 1611, 521, 1754, 530, -1069, 712, 1466, -475, -353, 71, -2126, -2007, 307, -622, -1793, -668, -1209, -2770, -634, 1013, -839, -571, 788, -776, -861, 2032, 1750, 166, 1650, 1541, -566, 1004, 2611, 694, 320, 1400, -489, -1493, 957, 689, -1323, -457, -603, -2631, -1268, 546, -951, -1339, -141, -1444, -2099, 500, 855, -414, 384, 799, -851, 104, 2262, 1213, 202, 1485, 555, -576, 1592, 1972, -82, 364, 873, -1406, -906, 1040, -165, -1297, -479, -1146, -2310, -675, 565, -1420, -1080, -5, -1353, -1046, 1231, 576, -352, 783, 458, -682, 995, 2372, 668, 528, 1389, -17, -236, 1881, 959, -608, 297, -113, -1625, -320, 961, -817, -1418, -181, -1727, -1881, 243, 117, -1460, -542, -14, -1474, -177, 1553, 100, -123, 974, 165, -279, 1740, 1958, 128, 853]
2130H53J97j612Q00J445j478q35R05j161r41J935L20k016N38O29j410M99J978
2147F46j044p69J286l88p37J972P16j742P22O94j242J73K104j071j358R14l42
2164E34j288J393M88j933k9O27j164j29J985p65j324Q07K07j043J168J467j613
2181f12J16J057q18L5J679j3j594J007K03j377R41J533j723p64Q86r19m70J617
2199G84k82j651L80J41j027N82J575j383l93J007n41l29J960J58j561P50N07r63
2217b86O84J593j154q67R02l85j022J649J30j446o9P02j436L73J413r94r42R55
2235b00k28j133J333P09j550J50J008q25m2J750l67j220J032J11r90J323P41j278
2253C24k41P96p46k83J301m23j419M52L78j238J010R75j606n35Q13n06l16J349
$$ y = [853, 1050, -562, 238, 1683, 205, -630, 275, -886, -1827, 108, 428, -1588, -1050, -421, -1831, -1332, 646, -398, -1167, 119, -269, -1006, 966, 1682, -60, 662, 1356, 114, 287, 2391, 1320, -38, 876, 534, -754, 639, 1127, -806, -835, -208, -1372, -1501, 484, -281, -1605, -798, -591, -1634, -466, 1001, -612, -496, 561, -257, -222, 1457, 1444, -150, 857, 1060, -317, 624, 2157, 434, -330, 556, -363, -833, 784, 502, -1149, -769, -628, -1655, -1073, 502, -881, -1274, -267, -808, -1137, 823, 981, -580, 170, 677, -286, 398, 1991, 837, -30, 872, 487, -535, 1114, 1244, -202, -271, 431, -1005, -632, 781, -213, -1155, -200, -428, -1561, -228, 481, -1069, -919, 89, -736, -778, 972, 605, -615, 417, 528, -462, 861, 1602, 324, 83, 879, 133, -150, 1151, 728, -691, -239, 139, -1099, -89, 886, -720, -1255, -442, -948, -1264, 85]
2271H5J35j546O28O98p78J069J085j018p97J297n46l27J398K37j713N26K90q68
2289a45L38R86j024r73P48l12q21J375J31j598M49Q10j141M57J328q40r70J244
2307D2j68n19J464L67j151k5R85p78Q9J359o08j387Q76j43r12R44N95j625o3P35
2327G7q23k26J127l24j275O76N54p51O21J110j274k36J255n67p1J291R5j336M86
2346D09M40p56P03O90j302n43R34n33n62J007j16j542N59M66o90K40J016j009
2364e89o54J125q0l49J069K99j514N73P51m82J78J098q14q84Q79j5o90P76L40
2383A017j351K2O94n92j88R48o48j005O25J08o80Q81O66j297L0R91n47l07J321
2402F88j71j017P86L84o70O69N57r88l79J017m32l59Q61l63j144M38L56r84M62
$$ y = [85, 220, -1326, -698, 0, -778, 291, 1376, 358, -439, 858, 312, -15, 1383, 1620, -93, 433, 723, -145, 193, 1179, 155, -818, -70, -382, -1203, 172, 303, -1295, -846, -36, -1177, -720, 608, -232, -1202, 42, -126, -645, 819, 1186, 35, 10, 995, 217, 306, 1665, 1057, -330, 546, 403, -509, 435, 1030, -595, -658, 77, -746, -972, 155, -169, -1444, -768, -214, -965, -344, 766, -508, -744, 511, -56, -127, 1164, 1259, -77, 409, 849, 93, 796, 1486, 184, -359, 575, 42, -520, 487, 371, -1171, -612, -146, -836, -596, 420, -589, -1243, -118, -198, -547, 522, 821, -693, -120, 631, 149, 327, 1425, 611, -273, 606, 591, -99, 677, 1017, -334, -312, 382, -210, -398, 550, -98, -1103, -478, -370, -1050, -169, 497, -800, -770, 221, -326, -633, 688, 517, -500, 286, 670, 0, 669, 1226, 238, -141, 876, 444, 85, 946, 583, -561, -123, 233, -751, -289]
2421b89P92j121m13O83j24m20R15N1j015M49M81m19K26R88o17n00Q79l8m98Q70
2441H80J91j117J36O34o43J30O06o64j127Q55j36m75Q61J73j260J44P42o34J91
2460e13Q34m67p42Q02N01r65J000K99q39Q7Q24m49o8Q32n77q79M86M68j024P07
2480C17M14j262m09Q96m12n81R60j98q60M33M02m69M78P21o94k86J072j96m97
2499a71J030j12q61L02Q62p01K18N91p46p93Q18k32o80P24R0j431K55P83n04P5
2519d83O40q02m59P01L41k04L21M60r16K29O12j02j61Q94p01m50M49M70p75N74
2539F38R7j201M2R29o64m25R62n22j103O57O41p58M53N36q48j08Q94k38k55Q35
$$ y = [-289, 503, -618, -1031, -348, -472, -892, 23, 74, -941, -492, -11, -430, -204, 784, 167, -333, 546, 508, 10, 880, 1071, -46, 90, 724, 81, 211, 817, 153, -974, -119, -255, -730, 131, 304, -956, -812, -70, -704, -513, 321, -146, -888, -86, 415, -550, 450, 749, -90, -3, 821, 372, 304, 1136, 559, -320, 166, 634, -390, 317, 731, -531, -940, -44, -456, -1037, -77, -275, -1135, -702, -300, -769, -291, 430, -264, -550, 522, 326, -171, 859, 747, -114, 188, 1050, 349, 567, 1158, 412, -381, 437, 205, -475, 249, 339, -1092, -837, -54, -558, -483, 157, -645, -1104, -403, -62, -266, 55, 515, -401, -172, 440, 338, 177, 1071, 370, -80, 369, 839, 64, 638, 735, -466, -424, 505, -159, -584, 378, -144, -1247, -590, 51, -707, -254, 282, -566, -674, 220, -18, -273, 562]
$$ [...]
8191b11
##END NTUPLES=NMR FID
##END=
