##TITLE=1H_IVA0503-K
 CDCl3
 8 sc, 
 7.3.2024
##JCAMPDX= 6.0         $$ Bruker NMR JCAMP-DX V2.0
##DATA TYPE= NMR FID
##DATA CLASS= NTUPLES
##ORIGIN= UXNMR, Bruker Analytische Messtechnik GmbH
##OWNER= root
$$ XWIN-NMR		Version 3.5
$$ Thu Mar  7 13:48:12 2024 Russian Standard Time (UT+4h)  she@DPX200
##.OBSERVE FREQUENCY= 200.1313
##.OBSERVE NUCLEUS= ^1H
##.DELAY= (6, 6)
##.ACQUISITION MODE= SIMULTANEOUS
##.ACQUISITION SCHEME= undefined
##.AVERAGES= 8
##.DIGITISER RES= 18
##SPECTROMETER/DATA SYSTEM= spect
##.PULSE SEQUENCE= zg30
##.SOLVENT NAME= CDCl3
##.SHIFT REFERENCE= (INTERNAL, CDCl3, 0, 15.7039)
##AUDIT TRAIL= $$ (NUMBER, WHEN, WHO, WHERE, WHAT)
$$ ##TITLE= Audit trail, XWIN-NMR		Version 3.5
$$ ##JCAMPDX= 5.01
$$ ##ORIGIN= Bruker BioSpin GmbH
$$ ##OWNER= she
$$ F:/spectra/data/she/nmr/H-F/1/audita.txt
$$ ##AUDIT TRAIL=  $$ (NUMBER, WHEN, WHO, WHERE, WHAT)
(   1,<2024-03-07 13:46:36.96 +0400>,<she>,<DPX200>,
      <created by zg, POWCHK disabled, PULCHK disabled
       configuration hash MD5:
       00 E9 B6 7A A2 85 ED C7 34 08 36 98 17 FE 4E 26
       data hash MD5: 16K
       F5 8E DB 32 B2 10 1C 71 76 28 0D 24 ED 01 8C 7F>)
$$ ##END=
$$ 
$$ hash MD5
$$ 2E 7E 5F 21 D8 5F 15 8C 3F 9B BA 69 86 BF 9A D2
##$RELAX= 
##$RELAX= 
##$RELAX= 
##$RELAX= 
##$RELAX= 
##$RELAX= 
$$ Bruker specific parameters
$$ --------------------------
##$DU= <F:/spectra>
##$EXPNO= 1
##$NAME= <H-F>
##$PROCNO= 1
##$TYPE= <nmr>
##$USER= <she>
##$AMP= (0..31)
100 100 100 100 100 100 100 100 100 100 100 100 100 100 100 100 100 100 
100 100 100 100 100 100 100 100 100 100 100 100 100 100 
##$AQSEQ= 0
##$AQ_mod= 1
##$AUNM= <au_zg>
##$AUTOPOS= <>
##$BF1= 200.13
##$BF2= 200.13
##$BF3= 200.13
##$BF4= 200.13
##$BF5= 200.13
##$BF6= 200.13
##$BF7= 200.13
##$BF8= 200.13
##$BYTORDA= 1
##$CFDGTYP= 0
##$CFRGTYP= 5
##$CHEMSTR= <none>
##$CNST= (0..31)
1 1 145 1 1 1 1 1 1 1 1 1 1 1 1 1 1 1 1 1 1 1 1 1 1 1 1 1 1 1 1 1 
##$CPDPRG= <>
##$CPDPRG1= <>
##$CPDPRG2= <>
##$CPDPRG3= <>
##$CPDPRG4= <mlev>
##$CPDPRG5= <mlev>
##$CPDPRG6= <mlev>
##$CPDPRG7= <mlev>
##$CPDPRG8= <mlev>
##$CPDPRGB= <>
##$CPDPRGT= <>
##$D= (0..31)
0 1.2 0 0 0 0 0 0 0 0.06 0 0.03 0 0 0 0 0.0002 0 0 0 0 0 0 0 0 0 0 0 0 
0 0 0 
##$DATE= 1709804796
##$DBL= (0..7)
120 120 120 120 120 120 120 120 
##$DBP= (0..7)
150 150 150 150 150 150 150 150 
##$DBP07= 0
##$DBPNAM0= <>
##$DBPNAM1= <>
##$DBPNAM2= <>
##$DBPNAM3= <>
##$DBPNAM4= <>
##$DBPNAM5= <>
##$DBPNAM6= <>
##$DBPNAM7= <>
##$DBPOAL= (0..7)
0.5 0.5 0.5 0.5 0.5 0.5 0.5 0.5 
##$DBPOFFS= (0..7)
0 0 0 0 0 0 0 0 
##$DE= 6
##$DECBNUC= <off>
##$DECIM= 32
##$DECNUC= <off>
##$DECSTAT= 4
##$DIGMOD= 1
##$DIGTYP= 9
##$DL= (0..7)
0 120 120 120 120 120 120 120 
##$DP= (0..7)
150 150 150 150 150 150 150 150 
##$DP07= 0
##$DPNAME0= <>
##$DPNAME1= <>
##$DPNAME2= <>
##$DPNAME3= <>
##$DPNAME4= <>
##$DPNAME5= <>
##$DPNAME6= <>
##$DPNAME7= <>
##$DPOAL= (0..7)
0.5 0.5 0.5 0.5 0.5 0.5 0.5 0.5 
##$DPOFFS= (0..7)
0 0 0 0 0 0 0 0 
##$DQDMODE= 0
##$DR= 18
##$DS= 0
##$DSLIST= <SSSSSSSSSSSSSSS>
$$ [...]
##$SUBNAM2= <"">
##$SUBNAM3= <"">
##$SUBNAM4= <"">
##$SUBNAM5= <"">
##$SUBNAM6= <"">
##$SUBNAM7= <"">
##$SUBNAM8= <"">
##$SUBNAM9= <"">
##$SW= 18.0517328524113
##$SWIBOX= (0..15)
0 0 2 0 0 0 0 0 0 0 0 0 0 0 0 0 
##$SW_h= 3612.71676300578
##$TD= 16384
##$TD0= 1
##$TE= 0
##$TE2= 300
##$TE3= 300
##$TEG= 300
##$TL= (0..7)
0 120 120 120 120 120 120 120 
##$TP= (0..7)
150 150 150 150 150 150 150 150 
##$TP07= 0
##$TPNAME0= <>
##$TPNAME1= <>
##$TPNAME2= <>
##$TPNAME3= <>
##$TPNAME4= <>
##$TPNAME5= <>
##$TPNAME6= <>
##$TPNAME7= <>
##$TPOAL= (0..7)
0.5 0.5 0.5 0.5 0.5 0.5 0.5 0.5 
##$TPOFFS= (0..7)
0 0 0 0 0 0 0 0 
##$TUNHIN= 0
##$TUNHOUT= 0
##$TUNXOUT= 0
##$USERA1= <user>
##$USERA2= <user>
##$USERA3= <user>
##$USERA4= <user>
##$USERA5= <user>
##$V9= 5
##$VALIST= <valist>
##$VCLIST= <CCCCCCCCCCCCCCC>
##$VD= 0
##$VDLIST= <DDDDDDDDDDDDDDD>
##$VPLIST= <PPPPPPPPPPPPPPP>
##$VTLIST= <TTTTTTTTTTTTTTT>
##$WBST= 1024
##$WBSW= 4
##$XGAIN= (0..3)
0 0 0 0 
##$XL= 0
##$YL= 0
##$YMAX_a= 369768
##$YMIN_a= -396709
##$ZGOPTNS= <>
##$ZL1= 120
##$ZL2= 120
##$ZL3= 120
##$ZL4= 120
##$ABSF1= 10
##$ABSF2= 0
##$ABSG= 5
##$ABSL= 3
##$ALPHA= 0
##$AQORDER= 0
##$ASSFAC= 0
##$ASSFACI= 0
##$ASSFACX= 0
##$ASSWID= 0
##$AUNMP= <proc_1d>
##$AZFE= 0.1
##$AZFW= 0.1
##$BCFW= 1
##$BC_mod= 2
##$BYTORDP= 1
##$COROFFS= 0
##$CY= 11.3945322036743
##$DATMOD= 1
##$DC= 2
##$DFILT= <>
##$DTYPP= 0
##$F1P= 15.7292609196834
##$F2P= 12.9074282941183
##$FCOR= 0.5
##$FTSIZE= 0
##$FT_mod= 4
##$GAMMA= 1
##$GB= 0.15
##$INTBC= 1
##$INTSCL= 1
##$ISEN= 128
##$LB= 0.24
##$LEV0= 0
##$LPBIN= 0
##$MAXI= 10000
##$MC2= 0
##$MEAN= 0
##$ME_mod= 0
##$MI= 1.114404
##$NCOEF= 0
##$NC_proc= 0
##$NLEV= 6
##$NOISF1= 3.799351
##$NOISF2= 2.8
##$NSP= 1
##$NTH_PI= 0
##$NZP= 0
##$OFFSET= 15.70392
##$PC= 1
##$PHC0= -25104.59
##$PHC1= 16.98731
##$PH_mod= 1
##$PKNL= yes
##$PPARMOD= 0
##$PSCAL= 0
##$PSIGN= 0
##$REVERSE= no
##$SF= 200.130013532006
##$SI= 16384
##$SIGF1= 3
##$SIGF2= 2
##$SINO= 400
##$SIOLD= 16384
##$SREGLST= <1H.CDCl3>
##$SSB= 0
##$STSI= 0
##$STSR= 0
##$SW_p= 3612.71676300578
##$SYMM= 0
##$S_DEV= 0
##$TDeff= 0
##$TDoff= 0
##$TI= <>
##$TILT= no
##$TM1= 0
##$TM2= 0
##$TOPLEV= 0
##$USERP1= <user>
##$USERP2= <user>
##$USERP3= <user>
##$USERP4= <user>
##$USERP5= <user>
##$WDW= 1
##$XDIM= 8192
##$YMAX_p= 0
##$YMIN_p= 0
$$ End of Bruker specific parameters
$$ ---------------------------------
##NTUPLES= NMR FID
##VAR_NAME=  TIME,          FID/REAL,        FID/IMAG
##SYMBOL=    X,             R,               I
##VAR_TYPE=  INDEPENDENT,   DEPENDENT,       DEPENDENT
##VAR_FORM=  AFFN,          ASDF,            ASDF
##VAR_DIM=   8192,          8192,            8192
##UNITS=     SECONDS,       ARBITRARY UNITS, ARBITRARY UNITS
##FACTOR=    0.0002768,     1,               1
##FIRST=     0,             0,               0
##LAST=      2.2672688,     0,               0
##MIN=       0,             -396709,         0
##MAX=       2.2672688,     369768,          0
$$ Real data points
##PAGE= N=1
##DATA TABLE= (X++(R..R)), XYDATA
$$ [...]
1907a909P308m757l435O379j668n764L261J374l347K415J568l250K863L167m780
1922e75j071M172l177l409M567L92m081L440L127l961N96L575l775l017L608K56
1938F67l302J024K490k13K79M34o37K47o68k184O54J528k034l76L416K48j637
1955f4J756L56k873l9J786j947k034K397J995j526q2K573j04k660k74J541j083
1972b82k294P71K254j56m71J560M64j343l34L86q19j584J4J687K43r36J734J793
1990B687k141j479K563l10m342M69L799j724j911L834J188l028R97J847k597j563
2006a711J033l12m04J026M06P06Q78j238J73J768k829k918L770O62m697K571M854
2023C738m040j557N808j517n503K834J907m542P25L612j998n35L318q78j257J511
$$ y = [-1909, 5399, 642, -2793, 3586, 1918, -3846, -585, 789, -2558, -143, 1425, -1825, 1038, 4205, -575, -1646, 2526, -651, -4060, 507, 899, -3182, 258, 3385, -576, 20, 3595, -180, -3197, 411, 667, -2635, -1611, 879, 666, 945, 1379, 742, 989, 321, -1863, -1209, 319, -1715, -2091, 1325, 1573, -64, 1692, 2048, -825, -864, 922, -1025, -3059, -662, 1333, -193, -275, 2298, 2194, -466, -740, 801, -282, -2576, -1805, 449, 293, -178, 1382, 1846, 503, 169, 555, -264, -1848, -1834, -147, 96, -840, 894, 2687, 546, -933, 1630, 1320, -3022, -2553, 1246, -478, -2389, 1445, 2633, -395, 602, 2449, -148, -1711, -678, -990, -1394, -368, 38, 744, 1622, 384, 557, 2325, -504, -3422, 348, 1010, -3687, -1116, 3738, -302, -1859, 3949, 2432, -3071, -237, 1670, -2872, -2147, 1465, -533, -1068, 2250, 1372, 115, 1626]
2039A626k248j425L202j975k982N166J103n457L761M816o914j993P118l316o083
2054e601O262K083o781L286N696n262j312M823l192k697L900j998k656M938m62
2069A027l723N420J264p417L223N291q341j484R041m549o028R746J412r552M830
2084A60O053q883q59P487n021l932P437r43m789O004L21o403M961K350q747K940
2100a864O590q387p95J0682n318p020J0676O28j1534N865O591j0839j37J0698
2114E836o013n155R756j280p580O723J443q722M424M465q379K293P928p716k144
2129d121J0608m921q011R986N64j1794O989P570j1670N82J1908p548o000J1132
2143E274k219r775P717L215r642M135O427q311J001Q554p497l431R997m689p773
$$ y = [1626, -622, -2047, 1155, -820, -3802, 1364, 2467, -2990, 771, 5587, -1327, -3320, 3798, 482, -5601, 661, 2744, -4037, -751, 4945, -317, -1629, 3194, 2, -2695, 1205, -793, -3449, 1489, 1027, -2696, 2724, 3988, -3429, -206, 5085, -3256, -4740, 4301, -248, -6276, 3470, 4882, -4670, 160, 6213, -2670, -3529, 3958, -1063, -4995, 2442, 1499, -3290, 2714, 3035, -3368, 1593, 3943, -4804, -1864, 4726, -3661, -4456, 6226, 908, -6112, 4564, 5192, -6342, -477, 6114, -4725, -4862, 5836, -177, -5332, 4424, 3144, -4436, 2287, 3730, -4992, -568, 3897, -4482, -2189, 5739, -1977, -4121, 6487, 1566, -6445, 3541, 4105, -7689, -700, 6870, -4800, -4218, 7690, 142, -5858, 5274, 3055, -6720, 997, 4212, -5430, -1295, 5132, -3179, -2178, 6376, -1121, -4552, 5445, 756, -7017]
2158g017J0252P67j1237P334P420j1650N39J1327q304o302J1500j766j0049Q158
2172I72M136r945L951O988q770k99Q480o657m016R571l371p422R300J697j0233
2187e618N734O526j0605K39J0167p711n337J1123j954q930Q453L194j0168M082
2201h05O591q720m86Q308n914l772Q967k436o877P867J177q925N203M937r483
2216d368J456Q600p294l349R965l193p556Q384J792r578M201N885q119K16P798
2231D840n626l157Q107k864n893P192J28p793N462L942q299K118P156p053k002
2246c742Q747m047o401Q184N70q464N230M623q087J462O755o197j846P186l970
2261Cm389P422j156o879O354K769q158L059O172p597j005Q126m833m608Q013j230
$$ y = [-7017, 3235, 4002, -7235, 99, 7519, -4131, -3592, 7735, -569, -6871, 4629, 2863, -7186, 972, 5108, -4837, -886, 6102, -2668, -2967, 5513, -1144, -5160, 4411, 1040, -6382, 2918, 4615, -5618, 116, 6642, -3963, -3724, 6443, -1268, -6605, 4518, 2564, -6366, 2087, 5281, -4887, -805, 5786, -2934, -3420, 4888, -1026, -4798, 4169, 1733, -5144, 2723, 3900, -5025, 178, 5115, -4368, -2912, 5688, -1606, -4955, 5010, 1817, -5739, 2645, 4437, -5141, -940, 4945, -3174, -2958, 4840, -786, -3943, 4164, 1300, -4593, 2599, 2727, -5066, 396, 4338, -3961, -1843, 5313, -1740, -3742, 5005, 958, -5443, 2741, 3311, -5153, 77, 4700, -3387, -1925, 4830, -1367, -3213, 3973, 3, -4386, 3036, 1880, -4999, 1355, 4124, -4034, -975, 5197, -2400, -3405, 4721, -112, -4720, 3293, 2063]
2277B063o970O419K505q062L204N592p290l42P463n214l855Q148j837o724O805
2292A905K078q449L763N623p682j67P564n359l403Q032k370o502P100J536q440
2307d771M297N505q308K23Q196n746l895Q411k087o708O951J385q076M337M971
2322D685p933Q11P530o147l218Q594k860o830P644J343q685M711N519q422N54
2337b704P892n975l415Q273k677o473P183J349q253M569N215q240M81P997n963
2352g41l783Q414k324o681P029J650q119M254N258p784K01P546n595l761Q061
2367C625k001o620O723J876p985M032N319p695j51P581n157l926P525j487o043
2382d384N932J873p138L364M783p064k2P039n019l716P479j280o191N729K161
$$ y = [2063, -4907, 1512, 4017, -4045, -841, 4751, -2539, -2881, 4582, -632, -4487, 3661, 1824, -4900, 1905, 3983, -4466, -703, 4920, -2762, -2929, 4635, -724, -4127, 3905, 1535, -4967, 2133, 3669, -4771, -474, 5031, -3277, -3054, 5142, -604, -4499, 3912, 1825, -4883, 2068, 3453, -4623, -286, 4685, -3248, -2437, 5093, -1054, -4272, 4322, 1462, -5368, 2276, 3619, -5066, -355, 5164, -3258, -2704, 5188, -787, -4202, 4071, 1394, -5079, 2104, 3453, -4800, -231, 4984, -3256, -2775, 5222, -741, -4524, 3890, 1566, -5115, 1914, 3564, -4555, -301, 4957, -2827, -2626, 4920, -675, -4436, 3625, 1624, -4996, 1727, 3603, -4382, -350, 4969, -2726, -2877, 4704, -453, -4379, 3146, 1659, -4384, 1548, 3421, -3717, -353, 4430, -2634, -2656, 4383, -636, -4352, 3127, 1847, -4344, 1385, 3546]
2397C546o976K654M946o324p12O457l703l686O363n31n601M571K154o160K248
2412g54M244n611m71O076l596l383O117n08n525M050K527n898J387M503m542j179
2428b563N489k395l349M801p0m535K901J869m477J345L334l590m87M368k311k643
2444b313M213l36m356K887K053m257Q73L712k962j174L810j302k847K742M43l108
2460a922J461J775k410L69K351j877n28K421j497j760K556l14k623J973J501k527
2476a051M88K538j891j185K163m76k243J451R37j784N73J561r43l35J041o68n78
2493d02O76o67m06R97p7p95J190N45j326J55J135j180j087J361O7j220P77J197
2511I40p30m43R57m8j033o9M64l06n49O17N70j89q3M06J02m68m64J26Rl65j29
$$ y = [3546, -3430, -776, 4170, -2154, -2866, 3591, -112, -3798, 2565, 2034, -3567, 1004, 3158, -3002, -754, 3490, -2121, -2592, 3484, -112, -3495, 2622, 2114, -3411, 639, 3166, -2732, -1345, 3158, -1384, -2563, 2926, 531, -2818, 1983, 1913, -2622, 279, 2148, -2329, -984, 2350, -1240, -1727, 2641, 330, -2313, 1900, 1564, -2792, 95, 2148, -2109, -1236, 2476, -486, -1660, 2150, 848, -1999, 743, 1186, -1922, -461, 1314, -1096, -727, 1624, -253, -781, 1640, 143, -1617, 939, 625, -1998, -25, 1476, -1051, -563, 1975, 84, -1101, 1062, 586, -1657, -206, 731, -1053, -480, 1081, 138, -197, 844, 176, -402, 274, -393, -799, 198, 121, -674, 516, 1061, -265, -110, 1025, -155, -1242, 119, 186, -1034, -257, 940, 210, -233, 724, 676, -357, -426, 38, -268, -817, -200, 370, 181, 98, 504, 606, 138, -326, -200, -191, -556, -685]
2532f85O54M57m17n7J063l70j331O33O04j432k53J731l50j079J345Q40j522j52
2550c21J014q66r28Q94J65n41O57L11j72O35l97q44P66k45j515R61J201j620N5
2569g90K461r39j879K000M03k696N06J843j726m83K204l17j025J356r1j251P00
2586B76j96j376J174M30j648J369J701k191q9K696j987k356K996O5l366J984K472
2603A954k810L1L032j653j768K186n19k234J755M55j945J780J244k438J198J957
2619B225l177l39L170k501k237M129Q5l795K989K538m278Q7L722l023k248L793
2635A140p00k921L251Q89l113J964J619l460P46K434l407n01M105k285k420M977
2651B318k31m815L484K506n744N38M763l839k090N338j009l841M075J033m597
$$ y = [-685, -31, 426, 9, -48, 1015, 645, -686, -53, 551, -881, -1134, 597, 247, -832, 513, 1353, -169, -321, 693, -173, -1101, -207, -42, -583, 74, 385, 213, 848, 451, -393, 373, 128, -1387, -426, 775, -845, -790, 1671, 732, -1147, 853, 1256, -1440, -934, 909, -817, -1300, 904, 587, -438, 918, 827, -424, 276, 80, -1296, -122, 308, -1340, 29, 1730, -461, -550, 2146, 159, -2197, 799, 864, -2502, -518, 1954, -856, -825, 2207, 554, -1214, 972, 453, -1781, -26, 429, -1516, 264, 1508, -930, 268, 2225, -952, -1291, 1879, -622, -2859, 1270, 1355, -2440, 549, 3087, -1191, -1104, 2618, -405, -2653, 1140, 440, -2481, 770, 1659, -1454, 510, 2129, -1331, -585, 1849, -1558, -2059, 2046, -239, -2659, 2318, 2087, -2728, 756, 3262, -2482, -1944, 2819, -1020, -3110, 2228, 1219, -2622, 1453, 2486, -2111]
2666b111J972K425m359M54L895l423r68N052k297l297N030k45n622L511K938n960
2682c005Q76N708m176k320O033j335n100M513J377n854K307L795m848J91N055
2697C217l427j935N039j929m188M733K79n555L496L614n937R16N973m605k915
2712c224O399j747n576M921J838o031K640M404n003l68N233l485k845N090j491
2727G55m360M621J105n386L359L706n907M54N688m686k990O239j377n360N040
2742I01K239n906K225M319n037q72N103l266l028N275q22m361M435J449n251K544
2758e3L438n314j20N147l782k705N835r54m864M573J871n651J942L915n068o00
2774b390N136l016k703N125o64m171L696J510m872J795L086m367J42M382l242
$$ y = [-2111, -139, 2286, -2073, -1619, 2276, -1147, -2115, 2937, 640, -2657, 2373, 2128, -3494, 17, 2955, -3005, -2129, 3579, -597, -2917, 3116, 1781, -3319, 1194, 2571, -3283, -976, 2819, -2029, -1838, 3217, -210, -2145, 2894, 965, -3223, 1510, 1789, -3766, -270, 3344, -2593, -1677, 4296, -309, -3224, 3175, 1428, -4148, 773, 2611, -3420, -780, 3624, -1379, -1747, 3486, 1, -2844, 2246, 755, -3605, 1016, 2121, -3265, 94, 3800, -2107, -1653, 4035, -651, -3641, 2598, 1221, -4139, 901, 3140, -2766, -541, 3778, -1259, -2131, 2972, -294, -3322, 1953, 1131, -3230, 1205, 2654, -2597, -53, 3385, -1929, -2049, 3098, -684, -3389, 2446, 1492, -3372, 1201, 3072, -2579, -637, 3278, -1790, -2390, 2746, -270, -2973, 2152, 1488, -2683, 1013, 2523, -2349, -554, 2532, -1835, -1693, 2689, -553]
2789e53j937N158j405m253M240J175n328K069L607m436l51M700k580k447M387
2804B046o83l915L167J184m109J889K519l712N65L743l289j384M430j847l569
2819b965M000R50m664K068L183l810o7L772k600j773L685j265k968L435L93l685
2835b311K432K170l787O82L207l103j164L822j760k761L740M12l778K421K052
2850B274l826P22L172l203r14L763j897k440L694J01l571K416J771l605P80K729
2866A966l001n45L604k050k086L879n88l522L034J475m077J120L004l248o40L816
2882B141j967k326L607r7l471K403J461l597J221K633l105j47L450k375j733L730
2898A828q12l571L021J502l953J211L075l238n48L656k075k162L558n46l143K732
$$ y = [-553, -2490, 2668, 1263, -2990, 1250, 2425, -2903, -834, 2773, -1663, -2014, 2686, 106, -2341, 2046, 1363, -2552, 615, 1799, -2310, -421, 2098, -1614, -1049, 2694, -595, -1979, 2451, 604, -2965, 1035, 1985, -2679, -611, 2572, -1238, -1305, 2467, -133, -1906, 1779, 514, -2454, 981, 1374, -2311, 121, 2291, -1496, -814, 2393, -710, -1874, 1948, 188, -2573, 1167, 1579, -2199, 222, 2274, -1552, -830, 2342, -861, -1775, 1988, 91, -2349, 1345, 1446, -2125, 291, 2062, -1543, -763, 1966, -1035, -1580, 2024, -26, -2112, 1767, 1179, -2343, 691, 2166, -1911, -791, 2213, -1035, -1675, 2141, 174, -2152, 1455, 1358, -2113, 290, 1751, -1846, -625, 2008, -1097, -1244, 2206, -169, -1902, 1828, 1016, -2555, 466, 1968, -1985, -774, 2301, -937, -1485, 2171, 96, -2066, 1492, 946, -2197, 535]
2914E35J219l582J298K705l050l74L332k212j914L540m93l286K813J296l685J319
2930e39K853l173o90L464j855k028L221l51l041K553J374l356R84K657k915n74
2946a416L220j708k037L040j94k735K280J177l121R63K429k640o25L044j601j894
2962a818K850O1k777J957J343k939P90K327k494p30K823j119j865K373J87k384
2978a415J519J230k330M07J929j929n27K527j107j804K278K24k243J301J093k191
2994a038L33J932j538p77K113n75j615J702M46j948P33J151j532J95J376j279
3010c21m46J629n11j225J243K63j501O95R67j273o2J261q06n48J369l66j219J017
3028A66M52j161K30P91o96r6Q00l48m91N98j35o23N36L03p85K70N79n16Q1N23
$$ y = [535, 1754, -1828, -530, 2175, -875, -1249, 2083, -129, -2043, 1497, 1004, -2282, 531, 1827, -1858, -539, 2314, -859, -1549, 1915, 60, -1968, 1253, 902, -2139, 414, 1788, -1568, -584, 2073, -842, -1416, 1804, 96, -1941, 1099, 905, -1830, 450, 1627, -1494, -531, 1898, -742, -1367, 1677, 76, -1818, 1032, 1093, -1684, 273, 1616, -1323, -533, 1794, -700, -1430, 1393, 274, -1591, 782, 969, -1415, 104, 1334, -996, -589, 1340, -589, -1116, 1411, 304, -1500, 778, 1002, -1241, 60, 1153, -1038, -705, 1227, -311, -1088, 1025, 450, -1165, 537, 983, -965, -232, 919, -613, -418, 958, -321, -767, 862, 351, -874, 369, 632, -869, -174, 793, -480, -542, 719, -87, -635, 734, 368, -851, 166, 618, -543, -313, 478, -218, -314, 486, 138, -353, 245, 110, -513, 23, 326, -459, -189, 390, -126, -45, 478]
3048D78n23k38N56r4o12K97L59m17m8N98j61m22K50J19k41l3M7j07O2K31J28k11
3070A8k6J94m7j61N6j17q7R4oM8K82j62k79K82K85m82l28M60l2l55L94K53m53
3093a69J22O35n97l32O37k64n59N20K91m71R5L61k75R8K41n59j54O22l80m65R35
3114C32o2p41P17M16r33J03O12p47k92J045l13q54Q93M97r03K24M96q19R1N25
3134B87o05q9Q39n60l24J138k26j044Q08L24j225L80R24j122k23J471m26r83J174
3153E18M4j293O60N93j105J72Q73p20JJ136q51n97J266l48j334J167L60j617Q28
3172b47J285j455j29J626r86j024J620k28j681J076Q61j461N90J180j304j33J435
3189A025j084q58J639o88j315J702M51j921J089J278j880l7J887j576j178K208
$$ y = [478, -45, -283, 273, 179, -433, -136, 223, -194, -242, 356, 195, -227, 23, 142, -99, -132, -85, -192, -130, 101, 229, 18, -8, 186, 139, -22, 34, -83, -170, -76, -82, -34, 248, 86, -193, 89, 374, -108, -436, 24, -8, -363, 31, 284, -169, -47, 588, -9, -341, 296, 32, -527, -7, 284, -187, -92, 269, -6, 92, 333, -226, -380, 242, -138, -603, 332, 270, -471, 246, 662, -271, -168, 444, -303, -595, 450, 137, -717, 176, 673, -230, -6, 490, -329, -238, 287, -318, -407, 432, -128, -452, 686, 460, -584, 224, 548, -677, -297, 627, -495, -718, 753, 327, -656, 518, 562, -731, -71, 522, -583, -411, 462, -258, -257, 879, 28, -569, 697, 349, -985, 182, 542, -1075, -247, 1038, -417, -546, 1080, 94, -930, 690, 462, -1219, -143, 718, -743, -153, 1027, -277, -410, 1025, -59, -917, 722, 34, -1281, 421, 872, -1049, 40, 1318, -562, -599, 1288, -288, -1466, 742]
3205G42k34j778J637P98k053Q04J507j957k80J768j329p75K087o50j662K101M94
3222A220k342J096J512k445r5K527j742j298K678l59k162K115Q22k787P77J883
3238A400k219k96K301j335j157K496m24k100K026N01k758J294J854k742m1K827
3254A627j631j372K865o46k602K208J021l129R03K339k470l87L038j471j689K509
3270A113l02k462K071P24k907J323K201k606r1K878j895j694K980n03k966K326
3286A90J271l180J147K663k625q47L142j326k005K372j38k452K008J131k714J116
3302b47K123k651k97K975j935j988K994r5k814K289J295l035Q95K565k557q90
3318a373K770j240j995K685J19k556J838J302k681Q70K023k504o85K884j432j748
$$ y = [742, 508, -1270, 367, 1165, -888, -84, 1423, -534, -814, 954, -375, -1150, 937, 287, -1375, 726, 1220, -1122, -26, 1486, -959, -1054, 1473, -269, -1567, 1111, 752, -1410, 705, 1527, -1260, -483, 1400, -819, -1115, 1186, -149, -1306, 1190, 766, -1334, 692, 1193, -1565, -271, 1583, -1159, -1200, 1627, -4, -1376, 1489, 843, -1759, 449, 1470, -1659, -756, 1583, -887, -1274, 1764, 293, -1396, 1113, 811, -1651, 420, 1144, -1763, -440, 1761, -845, -936, 1942, 47, -1647, 1333, 830, -2136, 190, 1461, -1719, -572, 2091, -534, -1381, 1761, 435, -1570, 802, 664, -1788, 220, 1351, -1363, -247, 1876, -775, -1072, 1903, -32, -2020, 974, 879, -1935, 354, 1649, -1386, -491, 2074, -483, -1373, 1397, 157, -1838, 847, 966, -1590, 248, 1550, -1131, -261, 1762, -742, -1427, 1457, 25, -1723]
3334a723K627l7k382K045J176k947O58K288k462q27L083j180k188K748M35k642
3350a328J471J237k471M76J935k039m58K435j217j269K371j98k450J849R53k701
3366a404P66K243k362n99K837r68j872K105J83k197J284J042k110N08J686j690
3382e48j57K074j263j298K172l11k036J525P75k176Q50J838j875m38K133j071
3398A94j418J913q3j991J422R39j844N63J470j527l10J868j150j168J701j71j582
3415a174J471N79j773P27J358j691p3J701j349j048K098l34j730J487O69j684
3431g66O07J280j544k67J475r31p30J544m95j181J486K93j634Q76R67j751J35
3448f36J757j343q01J852l40j410J434L47j720N95J226j486p4J359r93n26J566
$$ y = [-1723, 904, 867, -1515, 530, 1706, -1241, -583, 1705, -757, -1584, 1499, 319, -1869, 879, 1314, -1328, 143, 1380, -1091, -615, 1320, -719, -1177, 1258, 41, -1228, 1143, 945, -1505, 344, 1297, -1404, -638, 1605, -757, -1356, 1481, 513, -1359, 746, 929, -1268, 16, 1058, -1052, -544, 1142, -548, -705, 1369, 106, -1192, 980, 669, -1367, 158, 933, -1243, -393, 1445, -430, -868, 1265, 194, -1224, 689, 606, -1385, 37, 976, -868, -305, 1165, -362, -672, 1196, 46, -1122, 579, 408, -1174, 297, 876, -897, -170, 1188, -503, -576, 1125, -224, -1272, 826, 492, -1238, 249, 918, -766, -159, 1121, -423, -690, 785, -146, -876, 668, 173, -1008, 478, 771, -863, 13, 980, -771, -636, 1121, -222, -1023, 829, 489, -921, 513, 860, -860, -265, 961, -525, -599, 760, -233, -759, 807]
3465H07n14j181J318Q5j479R27R04j641K35J507j127n54J518n46j229J369K92
3482F91j632P65R30j326J22J391j004o38J344m55r81J161R2j270Q31Q34j373K10
3500c08J159j025n14J437n52j151J214K16j294Q30P82j307N3J260p68p15J187
3517E04l35r69J087K71j197N92P08j067J02J037r38l94J092l36q18R02K31j088
3535f16N57Q17j113q9J030o47n31J022j95q50P55K58p26K85M71p84rQ13m92m51
3555d95P67j16o40P15K25q68K56O02p02r2Q24n06m24P78j8n80K94K97n87R1M98
3576C19m20k22N37j35l30M46l5m00K15K76l94N6K74l15j22N36j38m09K83J00l08
3597a86J20K06l34J8L16o4j81J75J8j73J13J14j32j39J15J8n5Q7J9j45J10J35
$$ y = [807, 293, -888, 430, 515, -964, -37, 867, -774, -539, 968, -159, -713, 805, 259, -970, 399, 691, -941, -176, 754, -572, -450, 941, -63, -701, 643, 188, -793, 368, 460, -810, 21, 855, -518, -308, 851, -174, -688, 749, 197, -954, 260, 476, -818, 12, 794, -513, -460, 800, 32, -683, 504, 169, -800, 287, 558, -639, -47, 661, -406, -304, 733, -205, -599, 493, 157, -661, 241, 472, -616, -59, 758, -355, -444, 586, -61, -592, 430, 235, -615, 140, 398, -328, -43, 428, -356, -365, 448, -44, -495, 272, 156, -484, 231, 456, -412, -156, 446, -256, -348, 476, -30, -454, 324, 306, -274, 20, 317, -270, -179, 319, -101, -323, 214, 79, -251, 195, 160, -240, -25, 251, -143, -87, 187, -128, -250, 286, 148, -261, 22, 122, -186, -66, 140, -194, -176, 140, 76, -105, 70, 88, -85, 28, 142, 10, -129, -14, 4, -51, 36, 55, -90, 20, 155]
3619A55j61n2P0l8o6Q5J06j30m5K25j26r8J96o9k90K36J13j68K0J89j76q7K97
3642A86r6l22J88Q1j83J32J50k73OL78k24j33K80j54k67M07Lm27J86M19m06j00
3664a69M80l06l47N44j7m99L61J60m64K23L82m60m9M76l18k61M04m0m69M42J90
3685B63n68K73M29n87o0O45m28l66O04j7n51M72K55o24J97M00m76j15N70l71l12
3706c67O16o8n66N53O5n64K82M86p77M1O86m39l34P30j30o65O25K03p53K63M48
3727C35o48JP29m76k76O95j95n60O19L5p09L98M62p64J01Q08o53k98R33l25p86
3748e74P45J27q60M87N80q02M0Q46o36l48Q50l16p61Q55M2q32N75N02q99K82P41
3769F44q74k44J014n14o94R64J35j048O30P03j088J07Q46p25l89J021m39o98R69
$$ y = [155, -6, -58, 12, -26, -92, -7, 99, -31, -76, 149, 23, -75, 121, 52, -238, -2, 111, -57, -37, 152, -24, -111, 186, 90, -232, -44, 37, -146, -14, 136, -137, -131, 247, 23, -110, 170, 16, -251, 156, 159, -268, -82, 337, -69, -169, 311, 5, -342, 202, 185, -314, 47, 207, -257, -34, 348, -112, -161, 315, -3, -264, 140, 100, -369, 73, 263, -305, -32, 397, -190, -250, 395, -33, -399, 205, 188, -363, 109, 364, -260, -63, 337, -139, -254, 316, -55, -367, 249, 181, -385, 168, 233, -331, -49, 437, -340, -299, 387, -52, -386, 344, 214, -451, 174, 377, -376, -113, 335, -313, -312, 417, -59, -335, 360, 165, -395, 224, 259, -450, -52, 410, -354, -253, 555, -98, -396, 537, 212, -574, 171, 298, -562, -75, 505, -297, -257, 589, -47, -395, 455, 139, -622, 233, 275, -557, 18, 520, -379, -97, 644, -230, -474, 540, 26, -668, 296, 431, -617, 13, 716, -372, -265, 581, -144, -533, 488, 49, -649, 320]
3788C20M8r42P71M17j095L07Q57j000k57J211o74p45J249J13j291P62P24j333
3806e58J57J102j020l66J349n39q08J115O9j162P47N58j249K67J025j012k48J370
3824G97p47p99J383j33j341R24O48j477L07J320j069n00J423m47j009J147J45
3841E72j399P34P57j316K73J197j127k29J397o90r78J324k0j462R74Q70j526K04
3859d45J471j110o44J460m29j216J163K46j282P21Q55j332K76J183j067m91J358
3876G17n75j061J332R5j378Q37R76j495J85J305j071o70J488n26j135J257L23
3893F04j395P83R91j386n9J228q42o85J268l55r91J148K38j237P70P04j372J70
3911d18J304j123o25J466l29j174J245L93j428N63R14j228j21J220p43o32J229
$$ y = [320, 368, -574, 197, 614, -481, -174, 683, -317, -574, 637, -37, -782, 467, 580, -711, 51, 775, -558, -401, 701, -319, -685, 664, 125, -683, 432, 501, -661, 86, 644, -605, -338, 687, -325, -573, 797, 50, -749, 634, 501, -840, 84, 732, -745, -438, 882, -187, -687, 736, 289, -720, 427, 572, -827, -93, 664, -652, -379, 818, -309, -538, 859, 169, -809, 515, 495, -967, 7, 877, -649, -445, 1026, -84, -728, 732, 303, -913, 250, 496, -786, -65, 790, -542, -266, 917, -150, -641, 717, 142, -919, 413, 508, -870, -33, 943, -552, -367, 938, -133, -803, 685, 159, -976, 281, 604, -791, -8, 983, -403, -462, 766, -76, -761, 507, 152, -839, 309, 547, -690, 80, 784, -588, -418, 886, -237, -862, 604, 275, -899, 346, 739, -689, -126, 788, -440, -561, 659, -84, -716, 513]
3928E13l35q52J008J91j165O11O18j126O4J138q45m90J343l18j093J038L53j323
3946f70M78Q19j092JJ097o52n31J042j11j016Q42K53j047M46O85r21N9R92p33
3965e9l68R66k95q72Q40J56r68M63P60r37o2J006n83n96R75j88r00P97K57q85
3985d93L91N97p48Q4P19o39l39Q28l38o34Q11J22q83N24O16q94PQ49o67m53Q71
4006C31k38o08O33K47p16L14M59o30l6O45n62k36O93k96m47P45L2p90M96M43p84
4027c05MP24n55k63P79k47n50O31J94p68L19N20p11j9N58l61k32O10k05m64N76
4048B35No46M64K53o25J23N48m84j85O82k57m99N70M3n70K74L16m48l0N20l15
4069b6k19N33k16m07M30Q9n07K78L59n35J47M49m19j88N03k40l82M53J01m92K48
$$ y = [513, 178, -674, 334, 525, -640, -29, 589, -537, -473, 665, -180, -670, 673, 355, -738, 300, 653, -670, -192, 627, -465, -464, 633, -19, -550, 492, 381, -635, 207, 460, -587, -141, 544, -377, -318, 674, -59, -427, 539, 244, -628, 212, 368, -600, -137, 623, -314, -376, 630, 47, -549, 426, 238, -662, 135, 392, -493, -102, 495, -253, -169, 550, -89, -428, 400, 62, -572, 239, 361, -522, 2, 618, -276, -269, 580, -87, -540, 331, 93, -515, 118, 365, -351, -37, 422, -208, -244, 401, -161, -397, 296, 0, -447, 298, 330, -460, 36, 479, -305, -301, 423, -132, -395, 384, 137, -413, 218, 412, -356, -37, 483, -228, -247, 311, -50, -282, 328, 123, -341, 235, 240, -406, 58, 311, -314, -191, 357, -127, -312, 370, 113, -386, 184, 227, -343, -69, 247, -201, -231, 289, -26, -245, 288, 72, -335, 95, 184, -323, -45, 314, -221, -74, 375, -44, -232, 271, 31, -351, 102, 203, -289, -41]
4090d1L30m04n9M90l30k24M65j44l77L22J00l75K53K77m03L9L66k83j59L22p1
4111I4l65L58Q8l80J34K77k62l2K67j58k15K49Mk61K21J10j89K5J85k11m1J60
4133E8j00q5J77Mk37K37Q5k63J22Q5q9j74K54m0j78J36R6j22jJ29j35n7J52%j42
4158h8R8J8m6L4J07j23j6O1m8m3O6L5j31M0J49j53m4J64k8j03OJ43j65k1J57q7
4184a8q2K15l0k18J66J00k22N9J25j75p2K96j03j43K10k1k28J74J26k91K9K87
4206A84k17p8K91j40j74K76o7k82K06K19l79JL56k03j84L64k3l15K49O0l43J45
4228e4K03l16oL79k04k02L93j16l16K83J56m26J72K79l53k4M01k78j99M01o9l60
4250b56L49N1l52J69K98l58QM29l67k52M83o5m17L47J27m26J67K89m06m9M83k48
$$ y = [-41, 289, -115, -174, 316, -14, -238, 227, 83, -294, 28, 128, -247, 6, 283, -120, -81, 285, 2, -157, 165, 94, -271, 87, 175, -205, -71, 206, -56, -88, 179, 21, -194, 55, 59, -202, 19, 129, -60, -35, 150, -61, -102, 58, -42, -127, 50, 54, -183, 54, 139, -124, -2, 83, -6, -180, 74, 34, -144, -8, 88, -34, -35, 94, -41, -98, 54, 54, -88, 10, 28, -18, 16, 123, 0, -16, 45, -3, -46, 20, 55, -76, -36, 113, -40, -84, 80, 52, -51, -45, 98, -67, -88, 69, -18, -100, 115, 85, -133, 33, 133, -89, -30, 95, -80, -152, 144, 41, -102, 108, 87, -141, 33, 159, -132, -103, 184, -33, -111, 180, 40, -134, 142, 75, -207, -1, 218, -161, -160, 196, -7, -191, 173, 150, -165, 84, 144, -199, -54, 149, -167, -173, 206, 2, -200, 193, 77, -239, 44, 200, -226, -54, 225, -128, -152, 249, -29, -228, 173, 104, -256, 93, 144, -208, -39, 259, -99, -91, 338, -29, -281, 202, 137, -280, 67, 194, -232, -65, 224, -182, -231, 252, 4]
4272Dl02M70r2l84M04J22m33K24K80m53%M61l62j79N02j62m58M72J30n29K52L17
4294B84m45n8M87l23k83N77j10m23L85J78n51K17L16m54M7M64l97j66M48j12l95
4315c14M46J04n37L25K92m99K7N49m34k56O44k58m33N07J3m79K48L32n41J33M69
4336C38m38j67O06k92m46O46j5o34M42K82n96J47N03m86k22O87k60n36N73J36
4356B68o05K94L77n82J02N45n65q7N83l09m74P15o1n71M19L57p14K16N27n47k01
4377c13P17l43n20P04L4o91N05M30q33J13N86n28k03O55k61m24N80K0o66N17L73
4398D52q30K13O42p23j63Q20l55n18P40R5p92L92M38o96Q1O26m88l40P73k99m97
4419d29P04J2p81N37L51q24K43P10p42j54Q54m01n32O78J18q42N08M56q77J67
$$ y = [4, -298, 172, 80, -304, 100, 222, -211, 13, 293, -160, -160, 301, -61, -240, 262, 100, -358, 114, 244, -285, -33, 284, -161, -219, 268, -55, -338, 239, 129, -294, 91, 269, -282, -65, 251, -203, -156, 308, -89, -255, 193, 81, -314, 132, 236, -301, 24, 316, -183, -156, 393, -41, -297, 347, 89, -344, 163, 176, -303, -55, 277, -264, -131, 338, -100, -267, 339, 47, -399, 247, 232, -402, 40, 322, -274, -127, 376, -110, -332, 355, 95, -441, 132, 268, -337, -43, 334, -248, -146, 399, -166, -253, 330, 21, -453, 262, 201, -370, 49, 406, -308, -92, 435, -112, -313, 404, 61, -459, 245, 279, -412, 93, 523, -310, -197, 389, -139, -342, 313, 52, -372, 208, 228, -438, 79, 452, -378, -165, 477, -246, -409, 411, 56, -462, 278, 373, -419, -27, 411, -285, -204, 422, -66, -406, 367, 68, -429, 275, 287, -494, 43, 394, -430, -187, 523, -219, -373, 481, 80, -452, 226, 344, -498, 10, 466, -411, -244]
4439b44P55o49k48P74k71o01P16K5p93N41M22p78J51P03o00k20P38l09n77P40
4459B75Lq41O10M29q71J98P39o47k96P77k66n99O51J22o58L46N00o98k0P06n70
4480a10k78O97k38n33O50Q5o99M24M53q00P6P85o20l61P86j86n51N91J34o38L99
4501F6M46p33lN92m39k90N91j76m95N84J33n95L33L74o80L6O58m87k97O89j72
4522A35n03O02J27o92K50M16n68p0O63l88k92N92j42m64M93R8n52K61L53n18j6
4543b15N11m47j21O13k40m73N59J22o33K24M07n36K9N36l43k21M93r7m71L55O2
4564A14l55K00K73m48J06M88m22j41M34j51l78M18J9m88L32K78m84N4M70l37k48
4585b66M73j83k69K81J82m25K02K47m17O8L40l39q4L38j82k34L54k0k92K44K30
$$ y = [-244, 511, -138, -386, 388, 117, -484, 232, 257, -536, 5, 427, -351, -200, 503, -97, -317, 421, 112, -465, 275, 278, -563, 47, 476, -395, -197, 542, -105, -401, 376, 110, -489, 162, 284, -374, -28, 472, -226, -246, 460, -110, -388, 309, 71, -462, 188, 273, -426, -2, 451, -349, -273, 512, -108, -469, 317, 131, -420, 171, 305, -333, 66, 512, -221, -224, 368, -71, -361, 230, 54, -441, 143, 276, -319, 14, 388, -292, -256, 402, -85, -382, 307, 135, -368, 234, 361, -331, -81, 335, -233, -303, 360, -28, -320, 272, 130, -334, 159, 257, -295, -34, 319, -199, -215, 296, -151, -272, 341, 101, -372, 187, 309, -324, -100, 307, -229, -200, 336, -7, -228, 265, 168, -303, 52, 114, -241, -41, 232, -216, -110, 378, -44, -185, 249, 98, -280, 138, 157, -331, 1, 279, -205, -151, 319, -18, -266, 207, 24, -245, 36, 218, -207, -5, 242, -175, -107, 233, -106, -190, 148, -34, -268, 86, 66, -226, 18, 248]
4606B48l75K5L06k58k08M13p0l33L39J28m09J90J68k64K1K30j67j78K84r0p7K51
4628A74k0l11J54K21l43O5K99l71j0L16n0k42K19pl08K00J58k22l1K19p5j76K70
4651A29r9p8J53o5j48J66L0k03Q2J77j91PJ61l6k13J99K9k37R0J08k11J11K05
4674A66j26r8R8M7r9k4J01j80J29O7j15j2J48r5p8J28m7j10J32pj05Q3O1r1l0
4699e7J55m0j15PJ28j10k9R6j9k3j9K6n3O4r0J7L5R7o9o6Q2K3m7L8J8p9K3N0o5
4728b2l7R5o0q1Q1J18j42pJ26j41k2J33l1j33J88N0j36M8O3j21j1J20j16k2J70
4753A10j20j14J52K8j42N3J68j95q6K12r1o7J67L8k28J27J01j52j2J49j38j33
4775a73J95J1j56K03jk82K03J63l09O3J83j55n1L09j75j71K13Oj68J30J06l18
$$ y = [248, -127, -102, 204, -54, -262, 151, 81, -252, 87, 215, -194, -4, 164, -100, -79, 151, -16, -194, 90, 0, -77, 174, 154, -157, -3, 218, -125, -60, 239, -132, -142, 174, 124, -118, 101, 94, -214, -14, 144, -78, -109, 110, 35, -141, 129, 30, -48, 105, 40, -108, 58, 88, -115, -33, 144, -47, -40, 121, 85, -128, 71, 100, -137, -47, 61, -150, -39, 166, 40, -58, 40, 87, -12, -36, 65, -115, 14, 81, -34, -46, 102, 7, -71, 57, 10, -100, 32, 25, -80, 3, 64, -27, -57, 98, 58, -57, -50, 78, -32, -61, 35, 16, -7, -26, 0, -53, 11, -79, -62, -27, 70, 1, -65, 17, 40, -7, 31, 49, -30, -7, 43, -22, -59, 36, -24, -105, -24, 94, -48, -55, 71, -70, -92, 41, 10, -123, 65, 115, -21, 27, 90, -31, -42, 78, -38, -60, 110, -10, -124, 28, 56, -86, -33, 135, -60, -146, 66, -25, -92, 75, 113, -115, 12, 113, -39, -51, 98, -40, -173, 22, 33, -123, 80, 79, -203, 0, 163, -146, -83, 100, -55, -106, 203, 28, -143, 70, 76, -92, 38, 144, -174]
4797a74P9K03j58k1K15j06j96K84Lk95J51J70k81R3J90j88j31L51j01l09L13L2
4819A24l38K37K06l74N5K85k21r4L26j63k48K42R4k91J52J77k83L4L26k83j13
4840a50L34j37k45K98Nl69K68J49l07J09K49k94q8L14r4k92L68L6l86K60J55l97
4862b14J08L21k94j22L87j80k12L19Ol01J96J81l78J15L00k97p1K96j30k45L84
4883A69J1l89K30J13k79J27J84k56o9M11k33k35K89Q6m37K98J95l69O7L10k90
4904f7o8L36k18k19L44N6l80K51K00m20R9L28l50q0M44j81k85L41J6m08K96J57
4926A92l45P9L29l56m3M16l06k31L85N6l94K19K50m24J45K52k92l8L78k40k58
4947b26M43q1m13L19K18m72J49L73m57j02N11k41k56L83Pm67L22K27m32J41L24
$$ y = [-174, -95, 108, -50, -71, 144, 38, -158, 126, 129, -166, -15, 155, -126, -33, 157, -31, -162, 189, 88, -221, 92, 124, -214, 23, 229, -145, -90, 195, -26, -120, 206, 43, -205, 37, 131, -160, -8, 169, -114, -80, 246, -37, -150, 184, 47, -198, 100, 105, -264, 4, 153, -154, -45, 204, -90, -178, 136, 42, -250, 118, 154, -232, 28, 183, -214, -106, 215, -79, -201, 186, 6, -206, 113, 119, -182, 14, 195, -183, -68, 232, -65, -136, 160, 30, -215, 169, 180, -209, 21, 134, -145, -18, 166, -90, -159, 252, 19, -216, 73, 159, -278, 20, 215, -154, -87, 223, -67, -135, 201, -17, -236, 108, 164, -216, 35, 235, -185, -86, 242, -108, -188, 256, 75, -210, 131, 147, -261, 35, 192, -153, -74, 255, -101, -144, 272, -34, -265, 120, 176, -218, 1, 251, -173, -28, 224, -68, -106, 272, 32, -226, 217, 136, -277, 42, 260, -212, -63, 310, -147, -249, 262, 21, -235, 148, 155, -312, 10, 237, -195, -54, 270]
4968B70l81q7M54k23k92M58o0m30L37J78m69J92L16l68o8M20k50k17M17l9m15
4989b57L03K11l92Q0K78l19q7M48k69k32M21l6m22K98K08m56Q9L72l50j04M38
5010B22k35k67M93k0m58L30J85m54J33L38l89q9M46k40k64M49l8m41L41K06m66
5031b18J54L36m35oN03k91k78L99l4m36L58J60m40J63L08l04j21M26j91l56M43
5052A40j7l64L05J88m39J15L26l78j02M80k82k73M24k1l64K65J81l31R5L03l70
5073a19m2M01j78l36L98P0m30L17J43m17J49K11k73jK93k25j61L11Ql73L88M0
5095A74l68J30L09m51%L47j29k80M00Nk97J31K61l88M9K96l01n0L47j71j93K92
5117A13l1k26K14J7k15J06J97k58k5K78j91j16L15n6l60K43J51l50J02K12j82
$$ y = [270, -111, -198, 256, 33, -259, 199, 139, -291, 46, 224, -245, -53, 263, -105, -173, 247, -3, -220, 197, 158, -257, 46, 257, -135, -55, 223, -96, -183, 265, -4, -236, 185, 149, -273, 25, 233, -223, -134, 238, -112, -216, 222, -13, -280, 213, 193, -265, 65, 250, -204, -71, 267, -122, -211, 235, -5, -269, 180, 142, -299, 42, 248, -218, -64, 272, -163, -169, 334, 43, -235, 164, 130, -306, 52, 212, -228, -65, 243, -61, -182, 244, 53, -303, 140, 123, -241, 64, 252, -187, -72, 254, -124, -226, 254, -28, -301, 123, 102, -262, 3, 184, -147, -52, 251, -119, -161, 240, 62, -274, 124, 194, -236, 81, 224, -193, -44, 167, -106, -107, 186, -39, -200, 111, 119, -254, 134, 174, -194, -64, 245, -206, -206, 141, 12, -268, 132, 137, -160, -29, 232, -156, -107, 189, -112, -162, 185, 14, -179, 113, 82, -144, 70, 87, -128, -22, 175, -83, -108, 170, -21, -137, 178, 122, -238, 5, 156, -194, -92, 120, -62]
5138f2j00L09j03j50J73kk39K02P2k23L6J90j48k5K23j70j21K37m9k45K28J10
5160A43k56K0K49j46j17K08j02j27K12K4k67J29Q4r8N0P9j68M1J13j36m0J48m1
5183Bj26J93Oj86R7J57j72k7J45p8j47J38J21k21M7N4m6k2J09o9p0J02l1OJ11
5208I3p0j03J25Q8j63N5Q4k00J09P7n0m9J1L0j00N8L8o8p4J23j1l9M3j0K0L4o
5235D5r2N9Pl4M1pp0K8Q3J6q4L3Mr3P9M1o1k6N6j5k9J1J11m3j25j4P1m2J12l2
5265C0j00Q3j4M6m1l2PQ1m4p0k6J38l2l7O3K8j18j2O1k0p7Q4K8k3M5N0r6j3lL5
5295B1j6J0J8n7O5K2k4mL7r5KJ10j13k8J00L9j55P3P1r4j4J04q8o5K00j23m0J37
5323I3l4j41J10L9j18Q0K5q4NJ23j23m1J20Jj36J27Nj11O2O6j28j6J71o5j36J68
$$ y = [-62, -162, 147, 44, -106, 67, 65, -174, 28, 100, -123, -87, 103, -45, -70, 153, -17, -138, 99, 50, -195, 33, 143, -113, -93, 156, 10, -107, 101, -1, -128, 84, 108, -159, -30, 54, -44, 6, 85, -83, -42, 71, -65, -105, 43, 2, -124, 69, 75, -111, -14, 143, -29, -56, 89, 11, -136, 2, 123, -98, -51, 3, -43, -65, 44, -25, -95, 7, -24, -18, 93, 23, -80, 45, 133, -30, 25, 109, -91, 18, 95, 45, -4, 7, 37, -63, -5, 33, -35, -109, 14, 3, -36, 7, -3, 17, 51, 45, -47, 12, 19, -15, 26, 19, -51, -23, 60, 76, -8, 25, 29, -64, 15, 56, -5, -31, 25, 10, -19, -8, 103, 60, -65, -79, -8, -50, 62, 30, -70, 13, -1, 45, 4, -28, -21, 60, 16, -54, -80, 58, 26, -11, 52, 80, -38, -50, 11, -9, -86, -2, 26, 3, 48, 98, 2, -11, -14, 21, 5, 15, 33, -24, 41, 63, 39, 35, 72, -23, -21, 89, -24, -52, 48, 87, -68, 5, 76, -18, -32, 72, -16, -81, 119, -4, -44, 93, 59, -82, 28, 67, -51, 29, 54, -30, -25, 98, -25, -66, 54, 55, -81, 46, 51, -60, 2, 68, -60, -76, 95, 30, -106, 62]
5349F2Nj77R3Q6j17p4K13j08j24K34o8j43K00j0k25J68O7j44L2Q8o2l6J99j23
5373C6j86K65rj71M1K15k94J04J31j31p9J83q2j45J78K7k08R2J98k53L1J64j14
5396gj00K55j26j88K13M6j91P1J43j43%K13k36m3K64q2k77K46J7j94J35J06k20
5419i8L7K09j77n2J73j10j66K45P9k76J70J08k30M2K15k41p4L54k48j30K96m7
5441G9k59J68K33l60R1J86k51JK39l9k52K48L1k76J09K65l12M9K20k20q7L06j44
5464B5j79K22N0k51J05J25j93N5K09k77r3L61r4k38K73n0k67K36J44l06O2K37
5486A56k28k6K64j09k51L09m3k18J61K08m04J07K91l02q7L04j26j73K85K1k30
5507i1J09J02k15j8K93k24n4K71j66j77K52k2k24K37O1k37K1K54k26j09L44j63
$$ y = [62, 67, -110, -17, 69, -48, -122, 91, -17, -141, 93, 25, -118, 82, 72, -153, 15, 82, -62, -30, 58, -4, -40, 159, 36, -150, 115, 106, -65, -24, 191, -103, 1, 132, 1, -78, 105, 23, -122, 56, 83, -125, -33, 165, -88, -57, 107, -7, -107, 148, 22, -166, 47, 93, -98, -27, 116, -27, -27, 186, -50, -93, 171, 89, -188, 58, 75, -119, 16, 122, -98, -61, 148, -29, -81, 92, -18, -184, 61, 140, -136, 34, 142, -88, -46, 169, -72, -146, 208, -40, -170, 126, 79, -180, -12, 221, -139, -48, 138, -113, -112, 127, 88, -164, 84, 115, -161, -52, 213, -99, -50, 170, -50, -137, 169, 25, -154, 68, 118, -133, -28, 97, -96, -41, 168, -109, -202, 159, 65, -173, 100, 50, -217, 19, 163, -143, -81, 156, -72, -98, 166, 57, -194, 115, 72, -146, 15, 223, -181, -74, 217, -85, -172, 132, 6, -167, 118, 139, -91, 18, 120, -95, -113, 180, -44, -98, 173, 7, -170, 82, 60, -164, 73, 134, -103, -82, 172, -54, -163, 181, 18]
5529A8j93K49J4k51J95J49k62K7J74k05n9K73j37k30L71j0l43K44J46l14J01J99
5551A56k41m0L03j50k14K75j9k22J87J23l37R9J88j55o7K70j69j62K84K1l14K43
5573E9P2k80J17K29k02j06K39j13k21L20k6k91K43J75l12O6J53j92k3K07o9j94
5595a49K45Lk86J93J37k49J4K02j27j56L01j44r5K16Ok68J59J22k41P3J85j94
5617e3q4L22j74j34J97K3k48J74J06k86Q5K44k48j5K67j64j86K96q2j32Q8Q4k00
5640a20J20J32j96r0K50j17j36K92j08j56J78J33k54N0J60j83q3K34r5j47J69
5661C3L7j74J21J09j91jK12k08PJ32p3r5K09m3j77J27Q9k15P6J29j43j03K50r6
5685A2j30J69jj11K8R7j63M9J35j00p9K16j05l7J39q0j27J40M0j67P0J20j37o2
$$ y = [18, -175, 74, 88, -163, 32, 181, -81, -54, 120, -85, -144, 129, -8, -238, 133, 123, -220, 24, 170, -144, -43, 156, -85, -125, 178, 28, -186, 89, 70, -152, 35, 158, -179, -80, 108, -47, -114, 156, -13, -175, 109, 130, -184, 59, 131, -149, -32, 197, -5, -111, 128, 15, -206, 114, 88, -203, 40, 215, -97, -31, 122, -70, -93, 114, 45, -149, 96, 99, -187, 6, 143, -106, -92, 110, -17, -173, 128, -16, -111, 105, 111, -157, 2, 124, -117, -44, 141, -53, -137, 185, 11, -123, 74, 97, -151, 23, 129, -157, -72, 172, -76, -91, 176, 12, -174, 122, 40, -92, -4, 80, -120, 0, 132, -64, -154, 96, -21, -157, 135, 27, -129, 49, 182, -72, -22, 138, -45, -128, 106, 11, -136, 33, 70, -104, 17, 126, -65, -66, 146, -62, -55, 77, 4, -91, 118, 75, -102, 25, 114, -101, -25, 104, -39, -142, 108, 12, -118, 51, 50, -61, -33, 64, -99, -50, 85, -15, -94, 122, 17, -20, 119, 39, -88, 52, 92, -75, -5, 115, -22, -84]
5709h4J72j04k8O1P8j44QP1j16M1P7l0m7J29p1l4L9n6l4J07J0p9K2R6j12L2O4
5736F8m2j01Q8K6j18N1J42j28J9L3Rq0N1M0q9N3OoJ1k8lJ3om7n5J37m1JJ0O3j36
5767e9R9Mo6j1J15p7j6K1j4m0M3K8n5K0K1K7m6N4r5L2J9p7O2Q3p8K3J2m6j7lN0
5798A3k8m1N3N2l0p1J6J6MK5n9QM2%j0N1l7K8Ro9N5pK1n7J9N3m0l6KK6l4J1Lj8
5832c0JJ8J3ok0K8M0n4J9J7l6K2p8R3l2L8l5J6L9p7J4j8J2j1K3M9p8K9J15j56
5862d5J0R7p0l7L0P3p6K6L9q1J0N6n8qN0m4l4J31q9JN3oj20J04K4p0K1N0n8m0
5892f1R8p9p6J62Nj20P8O7j04k0J09j4m6j0N5j18O2J03j58M5J22j46k2J55r7p7
5918h7J29kr7P7J12j74L3N3q2m3J61k8q3O5j0p2R6M5j84O4J06j60oJ80q0j12J23
$$ y = [-84, 88, -16, -44, 17, 95, -49, -41, 30, -86, -45, 32, 2, -45, 84, 13, -21, 18, -38, -72, 35, 45, -34, -12, 84, -28, 4, 68, 26, -75, 13, 39, -79, -28, 114, -14, 5, 38, 47, -33, 18, 58, -31, 22, 28, 22, 33, 5, 2, 15, 9, -38, -93, 44, 3, 4, 14, 77, -59, 40, 44, -22, -33, 82, 5, -11, 10, -4, -44, -1, 27, -28, -8, 13, 40, -6, 48, -47, -15, 4, -73, -11, 72, -6, 17, 29, -17, -34, -37, 13, -15, -56, -3, 49, 19, -52, -36, -20, -16, 9, -50, -42, 0, 0, -10, 41, 4, 32, 41, -28, 27, 20, 41, -16, 3, 56, 16, -20, -18, 8, -26, -15, -12, -30, -29, -11, 2, -4, -24, 4, 44, -10, 9, 26, -10, 12, -66, 27, -5, 33, -2, 14, 53, -24, -10, -28, -16, -27, -4, 45, -33, -4, 111, -45, -35, 62, -8, -45, -15, 58, -18, 8, 47, -34, -24, 32, -26, -34, 16, -28, -62, 69, -20, -19, 34, 28, -92, 12, 36, -34, -13, 37, -21, -61, 37, -42, -118, 44, 49, -71, 7, 74, -30, -50, 59, 45, -1, -11, 44, -74, -12, 91, -67, -22, 100, -46, -68, 87, -10, -87, 42, 40, -57, 20, 132, -42, -9, 44, -38, -81, 80, 52, -31, 34, 24, -48, 48, 93, -91, -27, 79, -81, -87, 93, 13, -99, 24]
5945B4P7k10J36K2n6j3P6o9p4J81j11p5J47Jj61J61pj23L7J48q7p1J56r1j10J91
5971I9j7k51J98M7j22N6J05j54j9J16p0q4J17L7j60J05O1r9J6Q4j33j3J68j12
5995b5j02J89Rj57P9P3q5KQ2j32JJ63n4j38J61J3k03K24k1j64L0J46j30j19K83
6020A25p1j79J74L5j97J23Q1j93R0J11j52K2Q8j02p8J98K2k03J55Q5k67R2J64
6043A23j77K2J47r6j49K06n9r3M7J17j91P7J29j43q6K38p8j20J57l4j32J16J33
6066A54k23M8J15j08q2K39j50q3J56J6j78J15Q5j43L5J18j27p0K28r2j17J48n9
6089B5j50J40O6j72O1J79k50N2K20j45j57J86K3k01J63J16k09M7J13j74j9J82
6111I6j12p8J77k0q2J6Q6j27MJ51j11n6J66n5j71K20mj54P2J12j89j1J54j28j2
$$ y = [24, 101, -109, 27, 49, -7, -20, 56, -13, -87, 94, -17, -92, 55, 56, -105, 56, 49, -74, -37, 111, 24, -47, 109, 18, -92, 99, 82, -169, 29, 76, -46, 10, 115, -39, -58, 58, -12, -96, 21, 58, -102, 3, 64, -35, -19, 65, -68, -81, 87, -25, -127, 62, 71, -86, -7, 66, -19, -17, 65, -67, -66, 97, 43, -95, 66, 79, -124, 100, 79, -85, -55, 91, -39, -158, 125, 54, -125, 49, 84, -113, 10, 91, -102, -12, 99, -53, -31, 57, -45, -123, 75, 97, -106, 49, 134, -133, -41, 123, -54, -32, 115, 19, -130, 76, 17, -76, -29, 88, -103, -26, 103, -40, -126, 112, 34, -86, 71, 37, -95, 21, 154, -69, -21, 94, -14, -96, 143, -7, -90, 66, 82, -96, 19, 104, -39, -4, 114, -13, -83, 145, 53, -64, 84, 25, -125, 15, 81, -91, -30, 149, -101, -49, 171, 26, -131, 55, 78, -123, 40, 156, -53, -6, 107, -67, -86, 96, -16, -94, 83, 63, -19, -3, 83, -44, -40, 111, 0, -56, 110, 55, -116, 104, 100, -54, 18, 130, -59, -70, 84, -44, -56]
6136e6J75j58r2J80j0j42J51%j62Q3J34j20l2J52r2j14J78o6j17J26M9j17mJ24
6160G0j08J7M8J5j37J71Jj40P5K4j34J15J5j3l3R3n4j00J08Jj28J34K5j27O6P1
6186G5q1n1J05o3l2Q1J8j62J48m1r3J02J33j53p5J66p3j17J12L1j05P8O8r2j1
6211c2J04j39K3P7m5rO2j7r4Q1pm2k6J22j07QJ47j83K3Q9l1m5O2Q4j52J1Q8j8
6239C4o0L1j7n1J16jj13O5M0j22N5L9j9J4rq9M8Q9K0r4K2Q7q2mP1r8n3J11no9
6269d4K2L3l7P1l4%k1J6o2J6O1o8RP0m0r7P7P3m8K2L0J5j05P1k3J1k4k2QoO9m2
6301ALK8l6L1no6O0pl0qM1k4o5N8O0m2l6M3Ql0J4K5oj9kJ5nj6N2p0kQM6l9qj0
6337c3MK8k4OO5q1J6L8k9M4Rn6N6k2l7j8L0L3Mk4lrn4M1l1P1K2j00M4PJ4K6n2
$$ y = [-56, 119, -39, -131, 49, 39, -103, 48, 48, -114, -31, 103, -17, -49, 103, 11, -103, 75, 9, -108, 18, 67, -50, -54, 70, -38, -21, 27, 42, -95, 76, 77, -63, 12, 36, -98, 17, 32, 19, -14, 79, 25, -75, 33, 34, -94, 40, 65, -62, 4, 75, -6, -57, 48, -15, -47, 34, 52, -110, 38, -3, -96, 6, 139, -14, -89, 77, 4, -113, -1, 30, -75, 3, 71, -21, -32, 72, -67, -44, 33, -12, -21, 41, 24, -70, 11, 4, -38, -64, 58, -49, -41, 106, -77, -54, 35, 4, -41, 21, 105, -47, -36, 52, 34, -26, 5, -12, -63, 53, 52, -61, 4, 44, -78, -23, 16, -3, 11, 2, -87, -39, 50, 70, -24, -2, 85, 3, -1, 70, -28, -81, 30, 25, -44, -22, 11, -26, 45, 11, 11, -10, 6, -56, -40, 21, -47, -38, 32, -8, -105, -28, 45, -3, 19, 49, 64, -41, 30, 7, 18, -6, -28, -20, -26, 43, 1, 4, 32, -4, 27, 22, -44, 16, 9, -21, -29, 12, -12, -77, -19, 41, -1, -37, 6, 14, -16, -2, 23, 17, -2, -4, 11, 6, -10, 42, -28, -30, -22, 24, -15, -23, -33, -29, -1, -25, -19, 46, -35, -19, 19, -10, 34, 43, -13, 43, 21, -16, -34, -4, 29, 33, 9, 6, -3, -57, -16, -47, 24, 46, -54, -10, -3, 11, 37, -15]
6370a5l6K3J1K8n7P1jk1J3k4J2Ml3Q3l8m5Mk8N7l5K1L0j4jn5J01m3K0L0q8L5l5
6402b6Nj2J9K9kl1l6N7J7N2p1k4O7j00M2J6j7K3M4l4j3rJ5j5%k0J8L1K7n1l6J17
6434H2r1n4P3L4j6m2K1%pL9lJ5Pm6k5M6k5n8O4M3p2L3oJ3n0J14n4k4M4j0p1N2
6466B6%o3M2J8ln3Q0o9m9J07o4%M7k5m7M1M1K3r4Q0l6q6J31Lr9N7j4rJ3M2m6l1
6498c7J07j19J3J03p0l3O4M8j13K8N0l9J6J8q0k5J30pj53O3L9o9J42o2l4K1O5
6525F6r5O4k4j5n5J07pp9l4J22j01P7K7q0K3k6M8o2M6N5j05K8J01j54M8P7k0j43
6553a11K15n0j22J01J5j04N3O9j34P6M9j17k1J12Qj26J25M3j45O3O2r0qJ35j71
6578g3N2J04k5j31N8OrK0N4r2k3J28m5m7R6l6j54J39N8j50N1Q9j32jJ29r3m6J31
$$ y = [-15, -51, -28, -17, 11, -46, 25, 24, 3, 16, -8, 4, 8, -25, 58, 20, -25, -21, -49, 8, -27, -6, 24, 10, 9, -46, 55, 12, 32, 62, -26, 9, -26, -21, -33, -14, 15, 13, -18, -54, 3, 20, 72, 1, -23, 44, -56, -14, 2, -15, 8, 52, 18, 5, -4, 11, -4, -4, -24, -6, 25, 52, 1, -35, 82, -9, -63, 10, 44, 28, -14, 7, 7, 0, 39, 36, 51, 58, 12, -13, 33, 8, -50, 14, 57, -15, 18, 12, 25, -25, 89, 35, 11, 55, 45, -26, 26, 26, -37, 5, 23, 20, -33, 47, -22, -71, 36, -28, -28, 19, -6, -53, -12, 29, 52, -42, 38, 2, -84, 47, 50, -49, 8, -6, -15, -2, 40, -6, -37, 70, -49, -36, 67, -3, -36, 28, 76, -37, -9, 41, 2, 18, 36, -44, -69, 61, 54, -99, -36, 3, -66, 76, 14, -20, 1, 66, -29, 35, 11, -4, -59, 48, 41, -38, -72, 50, -51, 26, 53, -27, -4, -30, 18, -44, 2, 57, -48, -20, 81, -73, -25, 52, 32, -111, 104, 54, -68, 33, 48, -56, -3, 66, -68, 8, 57, -60, -81, 31, 39, -87, 38, 81, -64, -1, 61, -29, -37, 98, -73, -21, 83, 58, -73, -15, -9, -18, 2, 56, -36, -59, 69, 24, -23, 73, 37, -117, 22, 80, -70, -19, 70, -62, -63, 66, -27, -73, 58]
6606E8n9n4J39l5j36N3N9q4P3Q7j31l5J43l7j30R4O3j26L4Q2o0o3R2m1o2J36j3
6633D7p1N6Lr4P1R0j72J0J52j26QJ13j02n5J10oo9j9R4q4j1P2n8PM6M1j27Q7L6
6662D9j19J40N0j74K3O3j7J3N6m0j09P9O9j51P9M4q8L2Q0p6o1Q9l8o6J03K0j48
6689i8J09N2q3n1J01k6n9L6O3j32J01K4r9Q5L3j00M7L2n4J7J9ll7R3Rj28Q8J6
6717E5m4k1P7j20j3J28l6r5J58l5j31N9M7l4j7P5m6j8R4q0n4Q0L4j09O5J7r3P8
6745B1N1j9q6J29j03k4O4L0j50J19k0n4M7j2J0p5J12qo6N4J0p8k8J35j03kQ0p9
6773d5QQ4l4j00Q2N2j30J17m0m0NQ5p0J6Q5k3p2N4Nm8LN7p7J9N3m1l6Q2n5j9R4
6804G1o8j4K2J6n9M9J6Mp1N7l4k5M4J9j7kN1k5r3J16r1P0o6L1l5K0qk1J10ql2
$$ y = [58, -1, -55, 84, 49, -87, -34, 25, -59, 14, 101, -30, -65, 78, 41, -89, 5, 68, -58, -24, 58, -2, -65, 27, -14, -76, 60, 47, -24, 32, 35, -59, 12, 102, -70, -60, 92, -34, -26, 87, -15, -70, 40, 34, -35, -54, 40, -44, -55, 17, -41, -34, 12, 53, -74, 13, 49, -70, 70, 120, -54, -31, 32, 15, 28, 84, 44, -65, 14, 83, -68, 11, 55, -33, -1, 79, 3, -58, 31, -7, -73, 30, 50, -98, 11, 63, -20, -71, 30, 4, -55, -19, 44, -88, 13, 37, -62, 23, 56, -44, 3, 35, -19, -2, 17, 14, -23, 70, 79, -49, 39, 55, 11, -10, 67, -53, -66, 62, 26, -69, 89, 54, -77, -18, 29, -5, -22, 53, 7, -11, 83, 3, -51, 29, 63, -46, 19, 36, -57, 21, 72, 53, -33, 96, -7, -31, 33, 63, -87, 32, 12, -42, 5, -7, 3, -72, 40, 32, -34, 20, 30, -48, -76, 59, -44, -46, 34, -45, -37, 47, 13, -87, -5, 47, -83, 34, -6, -46, -41, 44, -26, -10, 75, 52, -20, 34, 39, -9, -6, 51, -26, -7, 46, 5, -31, 51, -4, -23, 71, 3, -11, 11, 27, -32, 17, 33, 37, -34, 23, -11, -36, 8, 27, 10, 8, 59, 34, -59, 57, -34, 36, -30, 1, -34, -14, -22, -43, 67, 59, 27]
6835B7l7N0q4J2PN1l0NJ3p6lN5K2o2L4PJ0k1Pl4J01o7k8N3Ol3PL0Lj7rK1k3K5
6869B2Lj2k5k2J05r7K6Ml2K7j9K0M7k1m2M6m2PJj6pR0j0n7J0j3N0m4J9qo5M5L2
6902B2k2Kj8K3K1J4n2QlK6J7l2j6M6l5K1m5P7j8n1N7q3N4M2p1M1No5L8m6M1k5
6934b7O0jk4J9NMnk7j3k2O6ll3%N3l4j5N5n6MJK1k7M2l0K1k6n1P3o1R4k7n7M3
6968B2k5qKM6l5L4l3%l5R1n6p2Q9m1K9k8J7Pk4Q4p0J4k3M1m3K5L3k0Oj8J8Nrl0
7002gj3K6j5J7K1J9j04N4MOo8R1k7j7Ljjj3j6RO4j6Jl2P0q7J1O5p4j9O8Kj2k1
7036a2K3l5M0J3k7k3N5k3opK4p4J14l3k7N7K8p5ok1j5nO2o0L8K0N0j31N3pl0K8
7068a2QJ0l5M7l1N0k2j1k7J7Q0j27J4M2o3P9M1q0L9O6n7j4j2N8q0K8Kj01P4J1
$$ y = [27, -10, 40, -44, -32, -25, 26, -4, 1, 14, -62, -65, -10, 12, -50, -16, -9, 1, -20, -13, -47, 54, -13, -41, 12, 18, -15, -8, 22, 25, 8, -1, 20, -3, 22, 25, 13, -12, -34, 71, -26, 0, 4, -28, -1, -20, 0, 47, 26, -16, 30, -12, -5, -4, -20, -27, 63, 53, -4, 6, -7, 43, -1, 18, 10, -55, -10, 22, 0, 2, -16, 7, 28, 42, -10, -2, -5, 21, 38, 6, -10, 36, 1, 22, -23, 54, 36, -15, 42, -41, 13, 55, -16, 25, 30, -35, 3, -43, -2, -27, 33, 32, 8, 27, 32, 36, 31, 4, -9, -31, 35, 32, -1, -1, 52, 18, 3, 58, 2, 6, 7, 28, 1, 43, 13, 34, 8, -43, 30, -31, 63, 36, -21, 22, -3, -11, -9, 37, 2, 36, 3, 3, -32, 59, 3, -69, 20, -21, 8, -20, -3, 4, -20, 64, -6, 8, -15, 26, -17, 8, 41, 21, 27, 9, 27, 32, 23, -7, -20, 6, -9, 8, 29, 48, -56, -2, 2, 8, -60, 31, 4, -13, -10, -11, -12, -25, -41, -32, 32, 16, 17, -15, 55, -32, -21, 44, -30, -49, 19, 21, 9, -12, 11, -24, 16, 29, 2, -21, 34, 11, 5, -2, 22, -52, 62, 29, 2, 59, 87, 12, 6, -15, -30, -35, 27, -33, 5, 25, 75, -56, -3, -10, -40, -12, -4, 6, -29, 18, -13, 37, 15, 4, -23, -6, 74, -53, -39, 3, -60, 19, 60, -20, 19, 85, 28, 14, 2, 60, -20, 8, 10, -91, -17, -6]
7098foJ8j6k6QQ2nj09K1M6lk2N7p3K2M8m8m7J02k8k5j6R5j31N5Q2o8m1R8o4qK7
7130A9Nm8K6L7o6K2O2p6k9Q7k9m0O5Jr8Q8L4p9KO5r4M1O3l5o3J5K6l1M2L1q4N6
7162A5M6j7p3Q6k1j02J01J5m9LN7n6p2J34l1k4LL5p4ML8r3P0R0j28pQ3l4n5P4
7192A8Mo1K8J2n7M2O9j05O3O3r5rJ03j03o5J03k5m4P4J6l6k5L6J3m9R6l1j18J63
7221H0m9n4M1N0j26K4L0J2m7M8L7p4M7J2j23J10Kl9%RM5q4L9K6nL8k2p6J02k7
7251B6n1P8L6r4l7J05%j13Q7J1kn2R1q1PnL7o4L7j0PLL9q0QN9k5r6J40l9n5O4
7283C1p9M6L4J3m1J8j2l0Rk0kk1J1N6j4K3jn7J2N5n2L7L1j0n0O4m1pl7k2O7mk
7316Em7mR5q1J1qN4n0oM8n2M9L0q0L7O6k4K4K3p0m2J5O8p5l1J00m3mQn9N2M0n9
$$ y = [-6, -12, 6, -10, -36, -28, 54, 49, -60, -39, 7, 4, -18, 39, -34, -12, 36, -12, -59, 43, 15, -10, -26, 69, -62, -7, 75, 7, -34, 64, 0, -8, 19, 24, -24, 2, 39, -27, -5, 57, -19, -48, 39, 10, -30, 35, 36, -62, 26, 60, -19, -17, 48, -46, -5, 58, 23, -40, -25, 1, -30, 12, 43, -41, 15, 61, 44, -29, 57, 36, -66, 35, 50, 1, 4, 61, 5, -67, 67, 36, 12, 15, 50, -24, -20, 18, -75, -5, 85, -43, -50, 33, -1, -56, 18, 22, -39, -11, 1, -56, -14, 55, -50, 13, 76, -19, -28, 75, -28, -93, 10, -15, -59, 15, 31, -5, -30, 6, 19, -30, 66, 35, -83, 80, 31, -23, 18, 68, -58, -34, -4, 8, -39, 9, 46, -28, 19, 31, -92, 18, 20, -19, -19, -10, 35, -49, -10, 16, 11, 49, 27, -49, 53, 26, -25, 53, 89, -5, -42, 63, 63, -50, 37, 48, 46, -6, 85, 4, 11, 6, 43, -21, 16, 6, 13, 16, 55, -25, -17, 42, 17, -79, 61, 22, -33, 31, -48, -2, 32, 45, 4, 22, 10, -20, -11, -31, -33, -54, -43, 13, -1, 22, 21, -36, -24, 31, -21, 16, 47, 37, -13, 51, 10, 3, -34, -56, 11, 7, 5, -42, -46, 49, -32, -21, -29, 25, -25, -31, 17, -35, 14, 44, -36, 1, 67, 43, 67, 90, 20, -22, -7, 61, -14, -45, 55, 12, 8, 16, -43, 9, 49, -10]
7349a0OO8k0j7n8J2M0mO9j22RO5p2JJ0K6JOL3j1Mr1O8q1N1L8n9N3j5m4J01J4o5
7382FkJj2j3L2Mn4K5K8m6L3Mj3j3L1Qql2K6L3qm3L3n3N2K3n3L4Rl6J8qjj3L2l0
7418fK1Qm0k4J00j5l4k8L8JrK8p4j3K3K1M2k0m1k0P7l9Qm1O0J3n0N8q2R0r0N0
7450A2J9o4N8lMNm0J4K6Ln7L0J7k1k5N4qk9L6j05M8j6O7o1L3qL2j00J22k8r0J04
7482B9K0m6K2l1K7l2J5%m3K3k2M0J8j6l5J7N2o9PK0n%O2m7l2L0K7m9L7K0m9j9
7514b9O9j7o2j8K6K7K8Kk3l4P3o6j5Q4k7j4K1%m6N6j4j7l0M1j4m7O9k9p6J00l3
7545a5%P7l0kk2K9jm7K1kK5m5K2K4J5l6r2P7K9p8j9L7N7n8P2K6q6O2j6p8O7j8
7577eK1l4L9J9o4N2O5j19R8p4j2qNK5Kj0J9k8Jqj1L2N1m9rK5J4nn8J0K6k0mM1
$$ y = [-10, -4, 64, 44, 27, -31, -19, 21, 17, 86, -36, -27, 38, -34, -33, -23, 3, 4, 10, 43, 32, 36, -55, 13, -68, -17, 21, -38, 15, 0, -44, 57, 71, 6, 4, 5, -7, -20, 12, 16, -38, -13, 15, -31, 2, 6, -7, -20, 11, 19, 11, -21, 5, 38, 30, -13, 20, -33, 19, 42, -11, 23, 32, -4, 14, 6, 5, -8, 24, -6, 15, 23, -17, -41, 59, 44, 10, -18, 20, 21, 12, 40, -34, -47, -24, -3, 39, 19, -22, -42, 35, -4, 4, -37, 23, 36, -14, 44, -38, 52, -38, 12, 31, -33, 25, 22, 26, 31, -9, 5, 31, 34, -23, 7, 24, 3, -22, 32, 24, -5, 31, -74, -26, -42, 25, -36, -3, -11, 21, -79, 43, 15, -75, 29, 49, 3, 25, -6, 21, -11, 4, 4, -39, -16, -38, 2, 20, 4, -31, -14, 38, -31, -24, -4, -9, -9, 53, 6, -26, 4, 31, -18, 19, 39, -10, -29, 40, 23, -39, -57, -31, -4, 24, 26, 3, -31, 42, -24, -39, 45, 18, 4, 25, 25, -21, 35, 21, 4, -26, 15, 1, -46, 23, -6, -82, 18, -15, -15, 62, 32, 30, 8, 37, 36, -11, 10, 8, 33, -12, 10, 34, 49, 13, -79, -2, 27, -51, -70, -33, 24, -34, 38, 64, -22, 40, 24, -54, 13, -5, 16, -18, 21, 40, -24, 28, 93, -26, 72, -2, -14, -22, -17, 8, 10, 0, 19, -9, -8, -16, -27, 5, 56, 7, -2, 23, 37, 32, -26, -16, 10, -10, -14, 27]
7611B7k7Q0j10PO9r6L0N6l8N7Mk1o4J12r0K1J5o9Q7l6MJ5k0k0K1o4L9Qnl9J09
7642F2o0O2k3n9L9jlj0K3N1j04N7l1n0M4N7p1LN0n2j6M9J9n1M6L5o8K9P2q4LJ8
7674C6j08O8O5n2m1P3l4L1l7K8k1o8J07l3l4P7l1j4J2j7o3O0L8p2J1N2l0m7J33
7703H9n9j4k8M7j13Q9O6o0q6J28j03PM7P8q9j3L6Kp7J24m0n0L8Om3K4J6k4K3Q
7733B9n8J8K8L8o5P3p8k9J03l7o1K3N4q4M1N2o9j7P6%n0K1L5p4QQ5o6ML1j7j9
7764eN3k1j1L6k1o2N2Kn0K3L4j2j3J7K2k0J2Ko5L1R9r7j1L6l7k4M3rk9J4M6r3
7796e8K8Q5j11L8M8p8N6M0l9m8J2N3l2mP6j07L3J48j32QJ2J5j10M5J0oJ6O2o1
7825aqM2p6K1L3N4j32O7L0k8oO7q1K6O3p2n3L1N6k1k2%L5m1N7M3p0J9k1Jl3M3
$$ y = [27, 0, 80, -30, -23, 46, -50, -20, 36, -2, 55, 59, 38, -26, 86, -4, 17, 32, -37, 50, 14, 18, 33, 13, -7, 14, -50, -11, -3, -8, -47, 62, 2, 64, 41, -18, 21, 20, 17, 7, 30, 81, -23, 34, 3, -47, -3, 54, -17, -14, 36, -16, -32, 17, 36, -15, 31, 66, -2, 27, 99, 15, 18, 36, -72, -4, 61, 9, -32, 41, 7, 38, 1, 29, 8, -60, 47, 14, -20, 57, 26, 12, 24, 7, -56, 4, 42, -30, -19, 33, 3, -44, 89, 30, 16, -12, 35, -78, 11, 77, 17, -69, 59, -44, -37, 10, 88, -1, -14, 22, 24, -53, 71, 31, -19, 19, 25, -18, 6, 22, -2, 21, 29, -29, -11, 17, 55, -10, 63, -15, -44, 59, 22, -39, -16, 38, -46, -5, 47, -22, -39, 37, 37, -13, 8, 43, -31, -23, 62, -4, 0, 31, 14, -5, 48, 27, 16, 52, 31, -31, 21, 23, -27, -4, 30, 18, 5, 22, 44, 24, 36, 38, -27, 4, 103, 6, -5, 31, -6, -30, 13, 4, -25, -11, 35, -58, -30, 55, -56, -18, 30, -48, 8, 48, 9, -39, -27, 26, -6, -10, 66, -41, -8, 140, 8, 16, 28, 43, -67, -22, -12, -18, -2, 60, -1, -9, 33, -43, -22, 11, 65, -67, 0, 30, 2, -4, 63, -18, 8, 71, -1, -54, -23, 33, 12, -10, -10, 25, -16, 41, 84, 14, 33, 12, 13, -20, 23]
7857B3p1J3L5lj2N8l4k5L1J7n1mL9p9M4Q5r5N9Rj5j3Rj9j3J3L4o1J0J2l2M8l4
7889b2J6k2M8m9k4L0RM4pJ8p9N4K2n2j4K4J0j8j7L1PK0j0rM5k9m2m8R4l6m6L8
7921a4P7p2K4l2lK2N0r2L9Rm8L2K3K4l4P6k0o1mL9m4qJ4mj7J5N7r2j6Q3m7K7K4
7954B7m2O5l4n4P3n2O0o0P0%q1O4l5Jk4M6m4%P1m5o0O4l2ok7P0J6k6KQk6J6Mq
7988Am9N5o2O7J9j3q3J10jm8QL1nl3MK7Ok4L5j09O7j3K4j1N3p9OPN0m6KK8l4m3
8022e3N9j0l1O4p6K4QJ3jJ1L8nJrk2J6rJ9m7k5%R2n3J5k3pN3k7n0K6j1p7Q4M1
8056B8K7q3P9m1n4R7p5pJ1J1l8nM4m3k9Q9kp5O7M2j01J9J01p1kP0m7J9l3k9j2
8087d3Q2n3jOL1o1M1K7j0l2N6o2l4R0mk4n1M2nj5Q3n6kK3Lo6Q9n9j3l0O9Jl9N7
$$ y = [23, -48, -35, 0, -3, -15, 43, 9, -16, 15, 32, -19, -23, 16, -63, -19, 66, -29, 30, 39, 24, 11, 20, 1, -12, 1, 35, -26, -16, -4, -36, 12, -22, -6, -28, 20, -29, -53, -23, -14, 30, 23, 41, -38, 16, 38, -14, -28, -4, 6, -12, -29, 2, 9, 29, 19, 10, 55, 26, -16, -64, 30, -6, -52, -14, 63, -9, 15, -17, -20, 2, 52, -40, -1, 8, -40, -8, 15, 39, 5, 81, 61, 0, -4, 35, -9, -17, -3, -7, -24, -9, 48, -44, -60, 23, -24, 3, 27, -15, 50, 16, -38, 35, -17, 43, -17, 53, 53, -28, 36, 1, 2, -22, 24, -20, -20, 51, 6, -54, 10, -22, -28, -55, 15, 31, 5, 7, 15, -11, 5, 9, 1, -48, 7, -55, 12, 31, 18, -65, 45, 44, -4, 4, 35, 30, -3, 1, 28, 34, 10, 45, -64, 3, -10, 14, 3, 56, -23, -17, -10, 40, -6, -4, 24, -10, -53, 6, -4, -35, 29, -47, -23, -15, -2, -3, 8, 46, 41, 42, 33, 11, 27, 18, 37, -10, -35, -35, 57, 4, 19, -4, -11, 42, 15, -35, -9, -20, -97, -13, 28, 55, -28, 51, 10, -44, 53, -22, -29, -18, -7, -45, -50, -6, -49, -78, 11, 9, -66, 1, 43, -58, -39, 62, -9, -11, 59, 12, 31, -2, -31, -43, 39, -14, -15, -9, 22, -39, 2, 29, 19, -13, 43, -19, -53, 37, 33, 9, -42, 0, -5, -20, 63, 7, 5, 28, 31, -35, 54, -5, -18, -48, 21, 22, -17, 40]
8121D0l6J8l8Pl1L4qnJ1N8j3k6qK7l1J3j0m5K8L9k9RM6j0m6M2pm2L2qj7M0j2l3
8155a1M0j3J1l6N6r5N2pK8p1L4J9l8N6k5L6l1L7l5l0P4j4k2l8L0j4PL3l5j5M9
8186C2m1RN0M6j36
$$ y = [40, 4, 22, -16, -9, -40, -6, -14, -19, -8, 50, 37, 11, 3, 30, -1, 12, 2, -43, -15, 24, -5, 4, 50, 40, -6, 36, 29, -13, 19, 11, -6, 34, 22, -11, 29, 16, 27, -9, 47, -48, 4, -3, 25, -46, -12, 7, -31, 25, 0, 36, 5, 42, 7, -23, 51, 37, 15, -23, 7, -7, 0, 33, -2, -17, 32, -9, 0, 50, 96, -40]
8191d0
$$ Imaginary data points
##PAGE= N=2
##DATA TABLE= (X++(I..I)), XYDATA
0@%%%%%%%%%%qJ6j6K4l2L5m3N6p2Q8j04J20j44J74k01K34k72L14l64M20m80N45
32B90o21P03p92Q96j008J129j263J408j567J741j933K144k373K622k893L191l519
49a845L876m268M702n182N717o314O984p746Q620r633J0821j2237J3963j6118
63h660J8898k2638K7957l6162N0550q2749K73809q5586n32128N66218P8892n19530
75b71129J59179L31484l61771K1771L14083k15276q8544L22782j97254k03053
85a87728L23753o3062l34697L04332J23803l81946J87739L28359m06755p3749
95a79951M57076k24755l56428L94319P3858m13050K01463K78590l28833L706L16250
106B22245k32881j51398L12603j08551k66182K62061P9221k66315J49460J58526
$$ y = [0, 0, 0, 0, 0, 0, 0, 0, 0, 0, 0, -8, 8, -8, 16, -16, 19, -24, 32, -40, 48, -56, 64, -80, 94, -107, 127, -145, 169, -195, 225, -255, 290, -331, 372, -420, 476, -532, 597, -666, 742, -825, 916, -1017, 1127, -1246, 1376, -1517, 1674, -1845, 2031, -2237, 2465, -2717, 3000, -3314, 3670, -4076, 4544, -5089, 5732, -6505, 7458, -8660, 10238, -12400, 15557, -20605, 29945, -52804, 221005, 135419, -396709, 169509, 248401, -271129, -111950, 219534, -142237, -120466, 193617, -21659, -110203, 212579, 15325, -187728, 136025, 72963, -261734, 42598, 166401, -215545, -27806, 300553, -106202, -179951, 277125, 52370, -304058, 90261, 164119, -248931, -47468, 231122, -97711, -94005, 222245, -10636, -162034, 150569, 42018, -224164, 37897, 117118, -149197, 263, 158789]
116A58789k40224O1923J95905k60160m5916K96212j94089k10905L62049K5501
126A49085l60934K13546K48144l39278l9404L11168j83768j95977K67805P323
136G7710k20053J55737J02301j75901O6462R8624j69044K8393J26312j77644j1343
147i8446K27174j35860j44547K66947J3948k69390J38412J59545k50420k2378
157a15015K30597j22677j25627K03037L464j57126J18593N7813j58114M1644Q5283
168F1872j21422J2565J05637r8678p613J45319q3624q8800J51608k4876j64236
179a12248J17099P9894j78561L3587J67284j15541o7038J62572l7550j33197J02326
190A8627L8587j25578L6921P3335p5682J5190P5288o4361r738P6128o5921m3410
$$ y = [158789, -81435, -19512, 176393, -83767, -129683, 166529, -27560, -238465, 123584, 149085, -211849, 1697, 249841, -89437, -128841, 182327, -1441, -197418, 70387, 77710, -142343, 13394, 115695, -60206, 6256, 104880, -64164, -35771, 90541, -87103, -98446, 128728, -7132, -151679, 115268, 129216, -140174, -1762, 157783, -92637, -115015, 115582, -7095, -132722, 70315, 73779, -83347, 35246, 93059, -65055, -23411, 61872, -59550, -46985, 58652, -40026, -47639, 97680, 14056, -74744, 76864, 51988, -112248, 4851, 84745, -93816, -60229, 107055, -8486, -75524, 87048, 49498, -83699, 18627, 57214, -68364, -31443, 41892, -33790, -18600, 56688, -7673, -17411, 58717, -7204, -50614]
202e0614R4936m1310q8589J08084L4109j19614N7480R5524j13614k7469J17983
213F6906n5088q9701Q8828K0178q0339M8673M5682o5367J8457M7124o1618k856
225a9121N2366n7942j8376P9434l3348m9289Q3519j57q4966O0992M6125j04724
237d5487L297R2821n9594m7278Q9237m999o6570N5331K2724o5712K3048K9566
249B6384n9131J3694N1945m9665j0601O4517k9201l5534O0000j3965o4824N2927
261F546K7226p6792K2727O7419n9125k2714P6441k0686n6412M6450R283n1320
273c0957K8891K4133m9195J5995M5674m1469j1658M9923k7577l4806M7339l770
285A2523m6165L7563J9463n0365K2762M4689n0057j7226N4476j7791m0769L6961
$$ y = [-50614, 44322, 3012, -85577, 22507, 56616, -62998, -5518, 90006, -23608, -51077, 66906, 11818, -77883, 10945, 31123, -49216, -543, 45139, -20228, -1771, 45353, -16265, -19121, 33245, -24697, -43073, 36361, 3013, -46276, 37243, 37086, -47880, 13112, 59237, -45487, -42190, 50631, -8963, -56241, 32996, 27997, -38573, 16758, 39482, -26230, -3182, 26384, -32747, -19053, 32892, -16773, -27374, 37143, 7942, -27592, 32408, 18443, -46381, 6546, 33772, -43020, -20293, 47126, -11999, -34713, 41728, 21042, -35370, 11080, 20363, -30957, -2066, 22067, -27128, -11133, 34541, -6928, -18586, 31337, 3760, -31046, 16293, 12523, -33642, 3921, 23384, -26981, -4219, 40470, -9587, -26813, 27663, 9872, -30897, 6064]
297F064Q769l8339K2336K3013l4075P255K8477l1975q542L7391j7846k7688L0971
310E811O120k6510J8004J3085k8121O894K4222k4185j1646K7766p647k1918K1358
323C233J0393k0897L512J1912j0091O97P713j2040k731J4674l250j0499R050N417
337G093j0267M60Q782m464o267L508J552k086K204K258m519k832Q394L302j2367
352e249n04J2945o697r424J3409K258j4581O474R496j1537J283J0349j4126l224
366i128K1341r015j8528K0851N042k4304J3655J6076k6872J556K6466k0639j1665
379a5164L1620j0866k8368L0752J1667l7846J2043K7397l1805l246L5922k4094
391a988k0813M0158p301l5778L4717J2880m6705J7800L6328m0952p944M5009k5481
$$ y = [6064, 14833, -23506, -1170, 21843, -12232, -4977, 23500, -8475, -17017, 20374, 2528, -25160, 5811, 11931, -14579, 3425, 16510, -11611, -4717, 19505, -4680, -16326, 11440, 3793, -18125, 3233, 13626, -7271, -3759, 8153, -1938, -1241, 6472, -5568, -8299, 6375, 3125, -7374, 1676, 7093, -3174, -2714, 6068, 1604, -4663, -1155, 397, -1689, 515, 2773, -1746, -4578, 3816, 7118, -5249, -5753, 7192, 495, -8929, 4480, 6738, -7843, -1369, 8127, -3410, -2127, 8222, -5904, -9128, 12213, 3198, -15330, 5521, 10563, -13741, -86, 15990, -10882, -9326, 17140, -3499, -15164, 16456, 5590, -22778, 7974, 19641, -18205, -6162, 21235, -10570, -13816, 22106, -1988, -22801, 17357, 10056, -25722, 8995, 21875, -24830, -7030, 29298, -11654, -19598, 25411, -70]
404g0k6667M7593o129m5797L7814J9375n2296J8724M0131m9271p004N5174l0564
417A013l2446N4414p119n1701M4842K3301o2573J7555N0124n1655j3272O2021
429C4504k9396m1463N6682J011n4824L7938K3746n6906J8663M5375n1102q409
441b4181N8930l4277l5642O2235p641o1075M8456K7881o7651K0705N4971n9151
453a6440j4645P0562l1499m9087O0017M768o0677L6941L1751n6043J3114M4601
465C3363m7035m924N4156m1243l0576O5947j5447n8361N7490K1212p1645L0256
477f807N4198o7523j1141P2310l9586m7312O8966J610o4995M2170L3782n6271
489b0599J2710L7921m6823Q98M6531m4149j7499O4196k5994m8196O5223R285p3316
$$ y = [-70, -26737, 20856, 14727, -31070, 6744, 26119, -26177, -7453, 32678, -16593, -23597, 31577, 1013, -31433, 22981, 15862, -35839, 9003, 32304, -30269, -12714, 37410, -14245, -27517, 34504, 5108, -36355, 20327, 21338, -33486, 4452, 28198, -28708, -10045, 35330, -15772, -24181, 34749, 472, -35170, 27065, 19424, -41651, 6805, 34686, -32965, -12260, 42711, -16440, -31085, 39477, 7978, -41109, 18908, 23676, -37001, -60, 31691, -24352, -11238, 33363, -13672, -18596, 35560, -5683, -36259, 29688, 14241, -44120, 13370, 34582, -37063, -6807, 47391, -20132, -31273, 41037, 1451, -45861, 23105, 24715, -40280, 1890, 35672, -20599, -7889, 30032, -16791, -15893, 30638, -13511, -31010, 33186, 7192, -41004, 24219, 33504, -39812]
502c9812L7470M4837p1857K591O9088n2395l3227Q0118j4051o5807N6328K4691
514C7974o9248K0193M2729n2182K51M8426l9375r843N8564l4977l7884O6989j1641
527A9976o9085N7790K7697q3874L2609P3251p8736k1270R8572l8411p7452P7772
539A8839K2235q7714K8722N5678n4586R69M8230m2198l132N2955n1770k8033P8181
552C8376l0580p0126Q3879K6087r9705M3117P9542r3472k2705J02849m9989p6562
564f9289R2006J4911r0563N0386N3506p5608J2571N9471o6410j1998P2457n3748
576a2308m1178R1963j6628p8772P9626L2422r9891L6676O7919r7446o416J03479
588E9446p0574n9931J22656q758j13336Q4310O2074j21823P105R8610p3345m2982
$$ y = [-39812, -2342, 42495, -29362, -26771, 42317, -10078, -43305, 36813, 22762, -43045, 13283, 37974, -31274, -11081, 31648, -20534, -20283, 28143, -11232, -21075, 37489, 2512, -35372, 31617, 19976, -49109, 8681, 36378, -47496, -14887, 58364, -20372, -41642, 56930, 18519, -58933, 18839, 41074, -46640, -17918, 37760, -16826, -15857, 32373, -9825, -12957, 39998, -11772, -39805, 38376, 7796, -62330, 21549, 47636, -52069, -8952, 70590, -22882, -45587, 57262, 7273, -69289, 22717, 37628, -52935, -2549, 50957, -24651, -12080, 47391, -19019, -31017, 41440, -12308, -53486, 38477, 21849, -56923, 22703, 55125, -44766, -8090, 59829, -37617, -44033, 59446, -11128, -71059, 51597, 42839, -70497, 13813, 75887, -45936, -38831, 59779, -13566, -56548]
600e6548R1885k3824n4842P5659l528o9739O4266J5120r5526N0100O3292j07779
612e1464O444J21802p7567p1639J32932m780j34913P6621P6878j24686k913J11815
624E8530o1899m7744R4448j9109o3285O9812m160p9025O2471K6906r7978M4054
636a6979Q3056r6217j2713J18395o2004q2606J11319P57j21966P1594P0390j13255
648e0229J3954J10451p7111m8541J07357k9185r0106P7888K1652r3720M5619O0535
660D8564p8550J1767P6585o6909k5199Q4244m9850o4246R3270k017r7199P5719
672F179O2512j09480J2734J05908q0492o2382J04705j4165r4582O9755M4769q1875
684c6414K5387O2551o1992p382N8346n2139k6906O8926l2961n0342Q1027O261
$$ y = [-56548, 35337, 11513, -43329, 32330, 28802, -40937, 23329, 38449, -57077, -6977, 56315, -51464, -45020, 76782, -785, -72424, 60508, 55728, -79185, -2564, 74314, -50372, -53285, 58530, -3369, -51113, 43335, 24226, -39059, 30753, 26593, -52432, 10039, 36945, -61033, -16979, 66077, -30140, -42853, 75542, 13538, -69068, 42251, 43008, -78958, -7364, 63026, -50229, -36275, 74176, -2935, -51476, 55881, 26696, -63410, 14478, 36130, -57590, -11971, 48564, -29986, -18219, 58366, -8543, -33742, 50502, 652, -63594, 29676, 27659, -69540, 6179, 68691, -40789, -28055, 77853, -2639, -65021, 39684, 25519, -69063, 692, 45461, -36414, -11027, 51524, -10468, -17850, 40496, -11643, -38549, 30377, -2584, -52926, 28101, 34362]
696C4362q1690N8594N1882r7034K150Q7068o7527n1096R4598p293p7487O4739
708A1266M0474p6947J4888N3923n7766j6751N4899l2754k7066N8999j1195m1318
720b9348N4229P498o3722L3009L3839o8764M255O4005m6434k8354P5060r542o1165
733c5434M9682K6294o9140Q438M8267m3274j5920N0803j4146k3602L9948n347
745A6569l3660K9442K057m3736K2462K4278m1644R942M5902l2675j7201M9897
757C1633j6386m6234L7281J3334n1190J5348L9979l1133p727L8727j3000k1016
769a0384K3088p375k4157J9429K065k3938K1008J7108k6200R340K5604k7608j0829
782a2849K8543j7701k4383L0650N432k9161J9620K3434k5633l478K2174j5866
$$ y = [34362, -47328, 11266, 63148, -33886, -31736, 55332, -12195, -63291, 31307, 24014, -53473, 11266, 51740, -25207, -10319, 43604, -14162, -30913, 23986, -8768, -35834, 23165, 11970, -29348, 24881, 32379, -31343, 1666, 35505, -33259, -29004, 35001, -11433, -39787, 35273, 25731, -35434, 14248, 40542, -28598, -20160, 28107, -15167, -31087, 19716, 5570, -18032, 21916, 16569, -17091, 12351, 14408, -29328, -6866, 17412, -24232, -14290, 31612, -1063, -18264, 31633, 15247, -30987, 6294, 19628, -31562, -16214, 23765, -7368, -15095, 23632, 10632, -10384, 12704, 5329, -18828, 601, 2666, -21272, -264, 16844, -9356, -16, 25588, -2020, -12849, 15694, -2007, -26390, 4260, 9692, -19469, 151, 23585, -2048, -5526, 16648, 782]
794G82j4842J5937n367j0959J8123J067j2606J7967N455k2294P012J1761k2810
807a0774k687K0331j1967q445K4356p14j8093J5643P311k3363J494J3400j4659
820h167l566J5835m945k607J4686n654r639J2996l652j8425R601Q666j6109L735
834g245J7693q963n182J5278n635j3413J0068O4j4780P130R277q986L062J0581
848H949o373j969P121q505o431R554l926j0315J2124P383j2038L852J2068r275
862B219o869Q082l561p865N785K368m114M754M305l277O67J643m449j371Q48m227
878e062J022N782l106j492Q568K37p814K139L930n881m419L831K987k467o70N228
894B813K473m327j193L881l076o009L841K950o110J664Q429l701m266P044l14
$$ y = [782, -14060, 1877, -3490, -14449, 3674, 4741, -7865, 10102, 15557, -6737, 275, 12036, -10774, -13461, 6870, -5097, -13542, 10814, 10100, -7993, 7650, 14961, -8402, -6908, 6492, -8167, -11733, 4102, -843, -3450, 11236, 5582, -4057, 8939, 5287, -13138, -3537, 5129, -10980, -7245, 10448, 1485, -3697, 11581, 5946, -7467, 2601, 2665, -12115, -4985, 4292, -4694, -1632, 8949, 2576, 607, 7728, -777, -7208, 2346, -1580, -11895, 229, 7612, -4426, -574, 11494, 2219, -4650, 3432, -129, -7994, -2209, 159, -3955, 799, 5104, 1827, 2494, 4137, -312, -1683, -835, -5062, -4040, 1742, -1364, -2856, 5712, 5949, -1865, 274, 4204, -1677, -6096, -2265, 722, -1745, -2415, 2813, 5286, 959, -234, 3647, 571, -5438, -1597, 1353, -4757, -3093, 5336, 1635, -2631, 4413, 4099]
909D099p334K041J702l665J967P50k282O058J663q629M119Q075j2109m822J4722
924F355n041j3178J4608O432j7175O539J4210j6161m824J7476q187j3016J5261
937C299K568j4342R481P600j3876M979R740j5981Q32J6637j5469q351K4246o086
951E277k0734K1259Q529k7176Q647K0767k3678o242K7429j1978j8690K5399K578
964A1387k5768J5302J3696k4767M136J9411k0089l607K4127j4871j3670K7775
976A3062m965k6637K3695J1712l3500R771K7277k8358p739L4381j5572k3261L2142
989A2008Q72l3099K1133J7548l2875N410K7929k4448q892L1036j4374k0305L0512
1002A2455k183l1258K4965J4905l6488R923L0453l0351r256L6306j5978k4682
$$ y = [4099, -3235, -1194, 508, -3157, -1190, -440, -2722, 3336, 4999, -3630, 489, 8564, -3545, -8367, 6355, 1314, -11864, 2744, 9176, -7999, -1460, 12750, -3411, -8235, 9241, 1054, -11962, 3299, 5867, -8475, 1006, 8606, -5270, -291, 9449, -6532, -5700, 10937, -4532, -12883, 11363, 5277, -15457, 5802, 14331, -12845, -4198, 16569, -7109, -13351, 14078, 2100, -16590, 8809, 11387, -14381, 921, 14617, -10150, -6014, 13397, -6692, -10299, 13828, -1043, -14713, 13062, 8097, -18540, 5155, 16867, -16633, -6862, 20415, -7943, -15682, 18699, 3127, -20134, 12008, 12880, -20219, 914, 18462, -14413, -9003, 18926, -5522, -14414, 16622, 2248, -18057, 12455, 10272, -20986, 3979, 18884, -17604, -7681, 22772, -7579, -16835, 19471, 3493, -21189]
1014b1189L2741R33l3766K2990J7951l5586P060L0957k8341j0627L5225j4758
1026C590k4135L1956N43l2514K3206J6240l4934Q525K9275k8975r094L4728j5811
1039B600k3163L2553q50l2117K4876J5061l6189J0655K9152l1140p783L5855j7273
1052B237k2870L2710r87l1085K4066J3613l4548J1252K6972l0891n892L4772j8380
1065I69k1158L2867k183k9523K3585J1188l1376J2392K1685k9547l75L0877k2338
1078b937j5311L4931q874l0029L0255R705l7819J5177K6915l2900m058L4235j8132
1091A158j8521K9516m349k3607K2686L264k7212J9426J3957l3313J0334L0579
1103B3918l2344j0369M0996j6251l1165L5077O218l7820J9847K2614l4046L672
$$ y = [-21189, 11552, 12485, -21281, 1709, 19660, -15926, -8866, 22091, -6250, -16877, 18348, 3590, -20545, 11411, 11954, -20560, 2646, 18886, -16048, -7523, 21752, -7223, -16317, 18411, 2600, -20563, 11990, 11140, -20977, 3899, 18960, -17229, -6574, 22578, -8562, -16345, 19510, 2237, -20633, 12077, 11090, -19995, 4071, 17684, -16864, -5612, 21360, -9531, -15423, 19349, 969, -20189, 12678, 10495, -19028, 4557, 15745, -15631, -3239, 18446, -11101, -11476, 19401, -2937, -18248, 16683, 7809, -22220, 8035, 17740, -20079, -4902, 22013, -10887, -14945, 19290, 1158, -17363, 12153, 7804, -15803, 6883, 10147, -17065, 2361, 16318, -16995, -6661, 23918, -8426, -18795, 22201, 5950, -25215, 9862, 16080, -21740, -1893, 20721, -13325, -9653]
1115i653L1323k6062j1702L4038j4755k4423L2118L31l2489K4905J5311l6199
1127a7257J2269K9015l4249o528L8565k1697k4696L9358k246l7419L0497J8099
1139B3711m3366J1938L5629l8069j2301M4858j7704l1537L7475N596l5646K1891
1151B475J6224l4032J1696K3873l5488J171L9386l0878k1162N0839q846m6520
1163c1262L9300K1010n3985J2230M2790m0941j4600M9379j7153l2665M0107L596
1175A7806m0140K4885J7481m0095J2767L0013l7945q07M5178l0013k5946N0470
1187B3654p175m8806L6766K2120n2715J2525M4059l9896j3212N0938k0771l6023
1199b8536M4345L428m8401K6589K6411m2986P293L7886l2546r731M1664k2768
$$ y = [-9653, 21670, -4392, -16094, 17944, 3189, -21234, 10884, 11215, -21274, 3631, 18942, -17257, -4988, 24027, -10222, -16750, 21815, 118, -24578, 14780, 12534, -24885, 5612, 23711, -19655, -7717, 27912, -10157, -22458, 22400, 4696, -26841, 10634, 16230, -19416, 2475, 18699, -15333, -3637, 20236, -15252, -14081, 25305, -5573, -26735, 24104, 15258, -31262, 8038, 29048, -24937, -12707, 30083, -10858, -25458, 23921, 6768, -25897, 14210, 17806, -22334, 2551, 20032, -20063, -7296, 22717, -15228, -16035, 29143, -870, -26816, 23654, 16479, -32327, 4439, 26559, -26156, -13631, 30428, -9468, -22680, 28258, 7487, -28536, 15809, 19237, -29164, -2575, 23836, -19150, -11857, 26029, -6517, -16248, 25416, 2648]
1211B648k7774M2384n443m4089L6079K2053n0446J4535M4412m2637j4885N2206
1223B9043k2621m0140M5684P652m9162K5793L1882m1925J462L9335k9037j7082
1235a9116L7398j6340k7896L7814O12l8963L0950K2565m4909R179L9032l8288
1247g962j7351M6625j5928l6562M0688J1964m4112K0642L1478l9481n486L6828
1259B1343k3509k0388L4443o902k6224L0575O940l2861J9740J9200l6987K952
1271a1678L2591k8786j5208L9979r640k9834L4163R875l9795J5018K6276l4663
1283a1702o085L3343j7017j7767L0924j089k3960K0755P242k7847J0949J6189
1295A3935k7385R47K7552j7981j1257L0224o643k4445K2524O890l0548R023K0497
$$ y = [2648, -25126, 17258, 11815, -32274, 3805, 25858, -24588, -10053, 34359, -8278, -23163, 29043, 6422, -33718, 11966, 19618, -29544, -3751, 28131, -13794, -12332, 27003, -2034, -19116, 18282, 1942, -25954, 11860, 12472, -26491, 4459, 27024, -17885, -8706, 30326, -7962, -25313, 21312, 5384, -31178, 9510, 21474, -22638, -1996, 29482, -9999, -15485, 21343, -2166, -22554, 11889, 4987, -21237, 9338, 16278, -16583, 3157, 22357, -14630, -11678, 20913, -7873, -23081, 16898, 7258, -22576, 11587, 21462, -18333, -3315, 22961, -11702, -17787, 15556, -1461, -19228, 11696, 10607, -13353, 7402, 14644, -13203, -2254, 13935, -13450, -12503, 15049, -2932, -14189, 16035, 9392, -15053, 7471, 14361, -16187, -7164, 13333]
1308A3333k3227l284K7470j0534j5101K2023k09k0968J2076O163k0313O887J4325
1321H641j5544J215J8894j1866q487J8707o348j8745J4256N710j9222P953J5899
1334A1063j4402j763J7748q564j1112J2437k973j3481R766N109j1275O285R573
1347H411r291P87R506j0266o170J0950m928r921J1978M110j1221O757J0041j0095
1361F48l259P459n820n517O448j317m390P275K646n016M429K388p997L28L829
1376B134o856q44P347l519k231R769N50q354L226M013p400k831M297j386j617
1391c702L705J473P20K144k559k177K534k581m581K863J213k827M203M485m229
1406F84n60N201k918o407K513K093m769m26N463J855j795j67J891R14l191l348
$$ y = [13333, -9894, -13178, 14292, 3758, -11343, 10680, 10471, -10497, 1579, 7742, -12571, -5684, 8641, -6903, -5688, 13206, 1340, -7147, 11560, 5212, -13533, 723, 6433, -12789, -4836, 11063, -3339, -5102, 12646, 4082, -7030, 5407, 2434, -11047, -1281, 3828, -7447, -1162, 8411, -880, -93, 9413, -853, -7023, 3927, -1001, -10922, 1056, 5166, -6055, 702, 10743, 648, -2611, 4848, -972, -6489, -41, -1358, -5748, 1527, 4173, -843, 3586, 5974, -2023, -1695, 2134, -4722, -5566, 1781, -1738, -3969, 5800, 6350, -2004, 1222, 5235, -2165, -4996, -699, -2085, -3702, 3, 1476, 2196, 4340, 1781, -396, 2138, -443, -5024, -2161, -948, -3775, 428, 4913, 684, 124, 5325, 2407, -4000, -1487, 606, -4163, -4589, 874, 2729, 934, 767, 2658, 3572, 381, -2967]
1422b967J533L29k903J969M303j339q90L740m8m265r0J484l607k237L781K838
1438A631j863r46L854K735m303l751L855k33o718K009O586l383k486O642J099
1453D728n235J628J858n564j378M048j079j752K517J273J380Q75l556K67L377
1468C387n931l777Q520j12r082O514Q709q752k538R729m947q810Q075K149r789
1483f655L979P303n799K58O080m418k360M317m550j956O706m720n046J1764J042
1498E945j2375P774Q683j5167j273J5122r621j0782J5729J875j4001R165Q582
1511I656j3712M85J1276r222n003J0263m786n463J1953k331r922J1667K206j5490
1525h423Q255J0080j8207l30J9433j1015j1427J9881n2j9375J2461J0814j9716
$$ y = [-2967, -1434, -1105, -4008, -2039, 2264, 925, 35, 3775, 3727, -538, -628, 856, -2751, -4988, -1207, 1631, -232, -1178, 2676, 5411, 1108, -2643, 1212, 979, -5739, -3730, 2856, -527, -3013, 3629, 4728, -507, 1121, 2979, -2585, -3963, 85, -994, -2746, -229, 1044, 2424, 3299, -257, 10, 3387, -2544, -6321, 2199, 2087, -6995, -481, 8228, -524, -3062, 6667, 1720, -7090, 985, 3134, -6655, -2676, 4627, -1172, -914, 5166, 748, -1612, 2705, -1845, -3801, 2905, -1815, -6861, 4903, 5945, -6430, 1344, 10027, -5140, -6413, 8709, -912, -11694, 4035, 5910, -8091, 1074, 9656, -4056, -3571, 7705, -1517, -6520, 3743, -1043, -6506, 5447, 3116, -6806, 4861, 7067, -8423, -168, 9912, -8295, -8625, 10808, -207, -11634, 8247, 8195, -11180, 1281, 12095, -7621]
1538g621N15J6501j2009o124J6553n377j0867J4338o5j4189J0811M615j7154P340
1552b733J3559j7293j425K0485j2017j2864K2106j238k3186J4545J2773k2302
1564i590K648J9772j5354p623K0729o354j5211J6068J466j7901J1785R291j8738
1577i012M682J6215j6093l460K0107j1931j3805K1634p49k1960J5338J1915k3045
1590a0164L915K1243j7005r773K1882o036j6894J7408L638j9766J0700J2117j7994
1603f729K303J5694j4963m845J9094r559j3346J9411j18k0003J4958J1435k2983
1616i651K931K0453j6081q929K0904o598j5465J7684L008j8600J0731R925j8236
1629g924L817J5758j5578n416J9026q124j2500J7893l77j8316J3363R322j9600
$$ y = [-7621, -7106, 9395, -2614, -8738, 7815, 2438, -8429, 5909, 5844, -8345, 2466, 7081, -10073, -2733, 10826, -6467, -7892, 12593, 576, -12288, 9818, 8580, -14606, -61, 12712, -9590, -6942, 12830, -2524, -10147, 10582, 4228, -10983, 5085, 6551, -11350, 435, 9726, -9012, -4330, 11885, -4208, -7668, 12439, 508, -13297, 8337, 7588, -14372, 966, 12881, -10164, -6249, 14994, -2011, -11784, 10098, 4062, -12832, 4576, 8214, -11552, -852, 11265, -6729, -4426, 11268, -3695, -8540, 10554, 995, -12351, 7060, 6942, -13061, 1897, 13332, -9651, -6720, 13733, -2348, -11277, 9627, 3029, -12436, 5248, 8256, -10344, 387, 10312, -7924, -4107, 11651, -3927, -9343, 9683, 1559, -10941, 6952, 6575, -11741, 1622, 10944, -8656]
1642h656M263J5570j5704m156J9032q819j2409J7283j55j6889J2757P929j9141
1655i095M593J5839j4759m724J7318q213j0611J6171j486j4962J2385N164j6842
1668i222P686J2626j7052j599J8402j0423j0439J7328k584j5673J3751N711j7385
1681h873P069J1642j5836M59J6255j2101q193J7367m512j3779J5024K927j7912
1694a0463R812J1806j7454N98J6366j2831o982J7671n886j3080J5279J332j6269
1707a0101J1806Q692j9323L913J7311j5479o865J9700o916j4629J7337K790j8465
1720a0229J0410R984j7899L459J5597j5283n381J8945p665j2680J7514l30j8062
1733a1620J3593R079k0736N022J7349j7694n154K2177r332j5586J9372J828j9683
$$ y = [-8656, -4393, 11177, -4527, -8683, 10349, 1530, -10879, 6404, 6249, -10640, 2117, 10046, -9095, -4502, 11337, -3422, -8146, 9172, 959, -9652, 6519, 5033, -9929, 2456, 7620, -9222, -1536, 11090, -5962, -7561, 10841, 418, -10021, 7307, 4723, -10950, 2801, 8512, -8873, -1804, 9838, -5998, -5539, 10716, -1385, -9578, 7789, 3277, -10502, 4522, 7449, -10463, -651, 11155, -6299, -5701, 10665, -2166, -9148, 8523, 2637, -10443, 4836, 6168, -10101, 1705, 10397, -8926, -5013, 12298, -3181, -10046, 9654, 2738, -11891, 5446, 8236, -10229, 181, 10165, -7734, -4275, 11322, -3961, -9342, 9603, 1938, -10742, 6772, 6442, -11620, 1973, 11052, -9684, -4662, 12687, -5007, -10161, 12016, 2684, -12902, 6470, 8298, -11385]
1746a1385J2165R988k0096M009J7384j5812n485K0024r040j3440J9303l53j9826
1759a2564J3801R399k0772O022J7633j8418n241K2527r476j5849J9595J291k1111
1772a3163J3097J2050k0806K983J8463j5510o441K0426q524j5169J8316J521j9082
1785a1839J2532J0190j9948M616J8016j6893o477K0826r071j5456J9803J825k1095
1798a2971J2660J2880k0056K026J8319j5342q111J9857o188j5157J6362L143j7673
1811a0251J0898J0936j8512J952J6276j4512o533J8879p433j4281J7942L451j8919
1824a0107R914J2035j8152l43J7178j1764r325J6885k784j2977J3673L676j6019
1837h110P690J0196j5528j07J4246j0762o711J6245l387j2566J2946L609j5730
$$ y = [-11385, 780, 10768, -9328, -5319, 12065, -3747, -9232, 10792, 1752, -11688, 7615, 7262, -12564, 1237, 10636, -10136, -4114, 13519, -4899, -10140, 12387, 2911, -12938, 6657, 7948, -13163, -66, 11984, -8822, -5839, 12624, -2886, -9327, 11099, 2575, -12594, 5722, 7243, -11839, 693, 10883, -9065, -4449, 13567, -3326, -9803, 11023, 1952, -13504, 6299, 8124, -12971, -311, 12569, -7487, -5461, 12858, -2484, -10595, 9262, 3074, -12083, 4279, 7422, -10251, 647, 11583, -6929, -4977, 11299, -3213, -9746, 9133, 1700, -12581, 5361, 8812, -10107, -193, 11842, -6310, -6653, 10525, -1239, -10564, 6321, 3537, -9440, 4233, 7909, -8110, -420, 9776, -5752, -5859, 8387, -2375, -9086, 7159, 3772, -8794, 4152, 7761, -7969]
1850g969P036J0358j5351j519J5362p799q042J3553j152j1111R409L456j2549
1863f318M651P654j1522M05J2565p582o431J2336j298j0502Q282K725j1896M585
1877b346Q472r984r64J1557n324o724R681J08r654M525L625p388K781N624o870
1892b881N60Q597n343m856P830j780p914N661L201p373K648O253n721q37P432
1907E477m058o184N925J111o393K360L520l312J418L419l271J0L013m077k099
1922c141M753j527m355M250K809l963J674L324m367j414M253k438l958L557J838
1937A295k987J236L090r95j415L06l62k71m04j880O04K631o64q73K656J06k625
1954e52J017Q99k980p30K261l97j367K514K019k217r01K347j12l259q19J892J6
$$ y = [-7969, -933, 9425, -5926, -7445, 7917, 118, -7924, 5629, 4477, -6634, 2775, 6231, -6318, -1667, 5987, -5535, -5130, 7435, -147, -6578, 5758, 4460, -6042, 2240, 4965, -6931, -2346, 6126, -3858, -4822, 6735, 1411, -5313, 4368, 4476, -5178, -653, 2972, -4416, -1635, 3989, -2881, -2321, 6276, 933, -3923, 3907, 2127, -5787, -126, 3075, -4298, -1650, 4603, -1118, -1955, 5477, 1419, -4765, 1160, 2271, -4122, -1762, 1758, -1554, -136, 3283, 12, 22, 3035, -1042, -3141, 1612, 85, -4270, -20, 2789, -1174, 500, 3824, -543, -1957, 2296, -142, -4100, -543, 1295, -1692, -456, 2634, 1639, 224, 530, 168, -103, -507, -2387, -1783, 848, 184, -689, 1967, 2073, -552, 465, 1364, -1616, -2346, -85, -482, -1849, 665, 2684, 467, -434, 1913, 1801, -1458, -2277, -385, -369]
1971c69j390J181K242m65j182J242M05k056j058N03N1m41O37J608R4r94J112J582
1989B702k477k449K000Q25l246M83M189j115k601L424J691l972p01K148j836j446
2005b381J972L90o53J194Q67Q5O4j552j001J565j265k556L117J973m025J539N343
2022D676l548l926M800k8n754K169L623l949l46M991j049k359K491n71k503J443
2038A60p07k113K837J34k809M111K320n907J135N402n456l883O960r29o716N613
2054A52M731o812M67O421m562l551N205j650m420M093Q73l252L826J142m784L196
2070A075K965p012L93O485o045l270R548j425q141P517M165j0064J705P754p783
2085b133l597Q984k010n996O704J592o405M029K776p174K078M661p208M79Q273
$$ y = [-369, -1759, -578, 1664, 1199, 17, 1259, 1664, -392, -1450, -947, -896, -1337, -700, 908, 1002, 8, 1120, 2702, 225, -2224, -224, 601, -2645, -2162, 2027, 912, -1689, 1735, 3426, -546, -1247, 901, -935, -2381, -409, -19, -672, 522, 1389, 1474, 1538, -14, -1015, 550, -715, -3271, -154, 1819, -2206, -667, 4676, 1128, -2798, 2002, 1974, -3780, -1611, 2012, -1937, -2283, 2708, 1659, -700, 1791, 1220, -1283, 160, -547, -2660, 177, 311, -2498, 1613, 3933, -1974, -839, 4563, -893, -4776, 2184, 1255, -5461, 152, 4883, -1929, -1462, 4959, 397, -3154, 2051, 401, -4019, 74, 947, -2305, 1521, 2663, -2121, 1075, 4040, -2972, -2579, 3906, -2139, -5409, 4139, 2714, -5427, 2090, 6255, -3809, -2104, 5650, -2133, -5730, 3254, 1244, -4752, 1952, 3544, -2861, 1168, 3944, -3230, -1152, 3509, -3699, -3220, 5053]
2100E053n959m010J0357j940r503P986L650j1833K818R796q821l639J1528k933
2114B550q015Q503J733r675M203M900q260J636P061o916r93R183n186n654R344
2129D414j586r933P978M576j1777L440J0595r596l494J2460m717r662J0094J919
2143D711j1219N201O784r141R33Q836o843l171R015m478o515R188p73r593Q101
2158A036M977j1252L422R789j0153l620J2303m884r558J0351K506j1165N556P460
2172F768r842j9R121o856m045R085l657o618R035N01r118O681M964j0364K158
2187b206Q927q955l502J1028m065q075R967J695j0653N757O508j0082L17Q779
2201E440o924l560R272k916o481Q007Q64q436N505M119r214K121P619p804j919
$$ y = [5053, -906, -4916, 5441, 3501, -6002, 1984, 5634, -6199, -3381, 6415, -2406, -6045, 5483, 2550, -5465, 3038, 4771, -4904, -701, 4199, -4061, -2425, 4636, -2280, -3273, 5910, 724, -4930, 4414, 2828, -7105, 873, 5449, -6328, -2888, 7707, -1889, -5383, 7077, 2360, -7302, 2792, 4711, -6508, -1307, 5477, -3664, -2731, 6105, -738, -3909, 5106, 628, -5887, 3301, 2528, -7065, 1036, 6013, -5239, -1817, 7972, -2181, -5801, 6502, 1618, -7940, 2411, 4917, -6248, -692, 6768, -3074, -3093, 6028, -828, -4873, 4212, 555, -6063, 2972, 3473, -5645, 1036, 6000, -4364, -2206, 6721, -2234, -5736, 5292, 1227, -6848, 3119, 4814, -5839, -82, 6426, -3656, -3339, 5440, -1484, -5044, 4228, 1312, -5169, 2838, 3702, -4734, 771, 4890, -4324, -2203, 5416, -2388, -4307]
2216d307R534m586o258R366Qr543O052M982r480J401Q181o697k919Q623k968n883
2232d494P231K1p539N467L297q099K675O360p230q28Q231n032n001Q425j004q032
2248e552O497L606q909K652P173p134j714P808m186m515P230j293o342O188J859
2263C368p580M047N060p810J67P696n659l879Q255k058o685O966J914q145M054
2278b89N041p724N11P187n808l150P965k523n960P031J064p997M728M738q196
2293c382Q26P470o073k988Q263k899n959P181P26p713M937M145q284J503P473
2308E226o648k966Q842l137o470P615R20q211M912M378q013J548P026o664k138
2323c780Q388l725n878P843J58q250N629M394q704J832P492o851k646Q648l525
$$ y = [-4307, 5227, 641, -5617, 3749, 3757, -5786, 266, 5248, -4232, -2831, 5350, -1347, -4266, 4357, 1389, -4494, 2737, 2758, -4781, 686, 3983, -4116, -1441, 4919, -2311, -3139, 5092, 60, -4941, 3484, 2480, -5552, 945, 4551, -4358, -1706, 5467, -1667, -3381, 4427, 241, -4274, 2956, 1663, -4679, 1509, 3368, -4212, -165, 4895, -2915, -2748, 4948, -711, -4590, 3665, 1607, -5078, 1888, 3802, -4343, -289, 4752, -2972, -2461, 4726, -1082, -4232, 3733, 1210, -4750, 2281, 3345, -4652, 76, 4814, -3382, -2556, 4914, -1159, -4147, 4116, 1217, -4742, 2439, 3165, -4548, 389, 4534, -3750, -2247, 5226, -1422, -4388, 4454, 1317, -5153, 2462, 3382, -4829, 83, 4461, -3552, -2004, 5022, -1642, -3780, 4608, 883, -4995, 2848, 3006, -5244, 385, 4779, -3925, -2093, 5399, -1452, -4098, 4550, 1025]
2338A025o041P555M10p767N228M121q219J897P157o859k672Q648l370o362P674
2353B425O99q063N117M487q069J410P117o500k654Q224l156o095P249R96p791
2368d604M765M536p977J163P112o232k897Q003k689o066O821J296p222L981M259
2383D249p002Q82O222n669k527P598k626n773O715J351p459L868M474o913K17
2398b393O267m755k956O858j547n445N499J682o395K703M084n870P4N686m165
2413f73k573O237j620m981N140J408o132K418M117n265n37N535l106k995N418
2428B391n71m779L697J794n033J595L376l971k81M288k585k034M262r65l873L404
2444G15J237m577J717L398l704m67M260k028k672L638j36l582K125J624l120O14
$$ y = [1025, -5016, 2539, 2949, -4818, 410, 4531, -3688, -1791, 5366, -1493, -4165, 4483, 1113, -5249, 2425, 3124, -4939, 178, 4665, -3404, -1994, 5123, -1377, -4031, 4193, 1037, -5058, 2191, 3187, -4604, 161, 4697, -3280, -2117, 4995, -1237, -4134, 3869, 1180, -4886, 1935, 3231, -3991, -10, 4249, -2753, -1871, 4351, -1318, -3845, 3753, 1127, -4646, 2069, 3420, -4039, -171, 4303, -2610, -2393, 3874, -881, -3837, 3021, 1474, -3971, 1528, 3210, -3185, -482, 3602, -2268, -2194, 3492, -673, -3246, 2991, 1371, -3610, 1530, 2938, -3194, -776, 3341, -1924, -2461, 3074, -32, -3027, 2391, 1820, -2959, 738, 2532, -2501, -906, 2470, -1501, -1782, 2506, -79, -2113, 2149, 1184, -2689, 715, 1952, -2625, -908, 2490, -1214, -1681, 2579, 551, -2121, 1517, 1381, -2201, -76, 1548, -1572, -958]
2460i58K704k032o24K535j289j613K267n74k314K096Q98k697J313K229k384m51
2476h94K619j310k106K078M04k371J077J812j745j51J827q56r89J015l76r41Q01
2493a06J4n76J029K68q71O49P18j345m48J274q05j099J344O19j269M94J304p82
2511D12q11O37J25j084r4Q33o4m26O39O35m17l31K15m4n12l64K87K59k05Q6N97
2532C73M26n67l73O46k66j217M09J050j015l34J757R4j411Q08Q78j602o45J307
2550C18m46j055J061O78o42M14L66n27J51j93r42N83L18j167O52J709j235o08
2568e65K074n59k397J393J127k550O8K550j099j132K234pj687R02L13j526L71
2585d90N13j059P91J188j333L73J899j902j169K546j071k785K618J297l199J126
$$ y = [-958, 1746, -286, -910, 1625, 336, -1277, 990, 416, -1898, 198, 1096, -1601, -288, 1941, -443, -894, 1725, 415, -1691, 387, 791, -1580, -503, 1309, -436, -587, 1240, 384, -605, 410, 34, -907, -106, -92, -668, 361, 629, -242, 407, 1125, -220, -668, 606, -199, -1298, 46, 665, -604, -110, 1194, 412, -399, 238, 363, -721, -815, 18, -46, -472, 167, 802, 385, 54, 269, 225, -287, -651, -364, -105, -310, -224, 373, 799, 232, -141, 505, 239, -978, -569, 481, -534, -868, 889, 983, -428, 380, 1258, -344, -989, 318, -128, -1183, -122, 556, -86, 328, 694, 167, 318, 125, -817, -234, 84, -1083, -431, 1278, 43, -565, 1509, 950, -1447, -54, 1073, -1477, -1409, 1141, 42, -1090, 1144, 1137, -550, 352, 665, -861, -490, 23, -1036, -245, 943, -390, -17, 1882, -20, -1189, 1357, 286, -2499, 119, 1416, -1783, -657]
2601f57L147k475j287L043j024k661K014N31k342J395J613k021Q28J816k363j64
2617f07K229k448j328L413j022k834L600J362m107J482L402l994j452M157j702
2632A51l115L776P90l479K326K011l455N00K473l094o26L187k150j587M192q10
2648A090l413L803J274n302J768L843m923j082N608k194l610N052N85m892K666
2663B73K472m769M34L779l400r95M526j978k514M533o64m567L751J616n726J915
2679a314M652n023r94O335k672m283N406M47o039K998L354n513O18N232l682j805
2695b283N256j919l829M460r3m990L535K378n440J858M947m899j502O311k966
2710H24m812N685O09o363L588M095n825M30N677m089k530N421j841m369M583P46
$$ y = [-657, 2490, 15, -1272, 1771, 747, -1914, 100, 631, -1711, -316, 1297, -724, 104, 1920, -443, -607, 1622, -826, -2154, 1259, 237, -2597, 1003, 2365, -1742, -260, 3142, -852, -2304, 1853, 151, -2964, 812, 1602, -1877, 449, 2460, -995, -495, 1978, -1116, -1742, 1445, -705, -2292, 1900, 1090, -2323, 1480, 2754, -2548, -780, 3063, -1860, -2942, 2666, 472, -3138, 1914, 2499, -2393, 273, 2745, -2024, -1590, 2189, -1211, -2206, 2320, 342, -2172, 2361, 1697, -2870, 881, 2497, -3229, -1314, 3338, -1685, -2679, 3656, 984, -3299, 2107, 2554, -3485, -487, 2867, -2646, -2028, 3204, -478, -2283, 2973, 1054, -2775, 1685, 1592, -3398, 137, 2515, -2925, -1067, 3880, -1019, -2521, 3790, 824, -3988, 1697, 2306, -4057, -469, 3626, -2199, -1769, 3908, -181, -2711, 2710, 869, -3500, 1083, 1829]
2726A829n069L395L041n363J230M764m924j778N987k739m626N888R39o214L585
2741e5L997n779L0N402m060k858N473j297m317M704J155n046K865L068n220M87
2757a451M579m262j950N601j829m202N227J006n631K879L567n602LN092l719k376
2773c068N392j229m082M426J035m989K209L049m658J44M278l272j536M747j713
2788G33l400M589J44n079L059K801n114M96M754l501j986N030j342l848L694Q86
2804A916m387K079K639l949M84L635k933j065L956k084k790M159l23m363L120
2819I4K483m588P27M179l185j809M127j368l109L445J49l516K654J828l785J100
2835e74L094l320p72L710k153k341L692k45l530L031J613m037J208L119l454p44
$$ y = [1829, -3240, 155, 3196, -2167, -937, 3827, -1097, -2875, 3112, 373, -4253, 1635, 2574, -3640, -55, 3942, -1837, -1807, 3595, -465, -3323, 2150, 853, -3464, 1240, 2395, -2651, 214, 3282, -1938, -1451, 3128, -1134, -3084, 2517, 688, -3514, 1713, 2719, -2912, -33, 3534, -2068, -2065, 3027, -692, -3068, 2324, 1095, -2987, 1439, 2474, -2515, -306, 2743, -1915, -1771, 2507, -765, -2301, 2446, 733, -2667, 1922, 2066, -3013, 46, 2847, -2267, -1771, 2983, -518, -2504, 2526, 1184, -2664, 1030, 1916, -2471, -392, 2247, -1702, -1218, 2417, -516, -1581, 2375, 291, -2499, 1660, 1337, -3026, 94, 2577, -2011, -1284, 2895, -290, -2099, 2028, 660, -2449, 996, 1145, -2371, 283, 2111, -1674, -574, 2520, -800, -1572, 2138, -15, -2356, 1336, 1091, -2439, 592, 2205, -1832, -624, 2495, -959, -1703]
2851a703L676k137k092L817m99l318K954J366l844J276K716l288m93L487k073
2866a55j763L504p82l012L231Q35m034J751K724l673j80L744k269k000L776n93
2882A104l313K957J038l781J435K709l344j04L284k260j408L558j302k866L258
2897I65O68l928K022K583l688m4L753k325j992L628q76k945K937Q03l603J744
2913b98K385l288N9L319k417j579L445q91k910K966P49l526J844K457l563j7L444
2930B179k447j711L471p59k929K840R29l349J493K338l130j54L259k125j810L207
2946A302m97k756K603Q93l195J368K194k885r4K811k000j532L103m98k620K276
2962D73J044k915J054K172k614m11K801j620j623K796l79k393J987J058k539N74
$$ y = [-1703, 1973, -164, -2256, 1561, 1062, -2256, 698, 2064, -1780, -504, 2212, -1076, -1569, 1918, -155, -1918, 1586, 804, -2208, 1023, 1858, -2176, -425, 2299, -1374, -1554, 2190, -79, -2079, 1697, 1104, -2209, 748, 1786, -1995, -560, 2149, -1195, -1299, 1985, -275, -1683, 1875, 573, -2293, 965, 1633, -2295, -273, 2310, -1378, -1422, 2331, 6, -1986, 1642, 766, -2179, 758, 1561, -2042, -298, 2087, -1201, -1142, 2177, -240, -1819, 1626, 735, -2175, 791, 1540, -1986, -142, 2315, -1248, -1265, 2179, -268, -1979, 1492, 733, -2196, 644, 1573, -1776, -283, 2055, -1075, -1229, 2030, -95, -1905, 1302, 805, -1951, 652, 1545, -1650, -282, 1912, -973, -1067, 1744, -256, -1788, 1315, 817, -1803, 473, 1517, -1398, -344, 1828, -786, -1197, 1604, -16, -1639, 1157, 778, -1615, 372, 1430, -1109, -535]
2978e35J869k055l20K348j323j447K384j43k192J776R44k448O11J850j765n40
2994i86K081j003j258J995k9k042J248J108j919K45J541j299m44J644o63j036
3010h17J453j02j515J092Q10j561J27J299r75m22J357n08j077J218J46j317O65
3027a27P72j166M1J119n19n34P37j42n33M93J12p40L85M95n86J2O31m62k86O34
3047C36k39m52M24P0n41L44N19m90k57N63P4m99N9J70k86nK81J2j45J25N2j09
3069Fl0P9j12j86J01J47M1l3m7J9K68K6m38N3K50k83j59L97J27m97K81M30l65
3092G5k02M75m13m25O40P7o76L61M44l58l8L81l34k75M00l25j65N34j64n30Q24
3113C06L48j020K93O53q39k03Q56m86o24J033J88r89O46N58j016L2P13n66l69
$$ y = [-535, 1334, -721, -1041, 1307, -16, -1463, 921, 778, -1414, 362, 1306, -1142, -531, 1319, -446, -986, 1095, 92, -1166, 829, 800, -1242, 6, 1114, -805, -560, 981, -318, -762, 882, 219, -817, 636, 534, -981, 111, 921, -640, -513, 786, -189, -611, 746, 238, -839, 379, 525, -792, -127, 645, -521, -480, 639, 120, -414, 323, 181, -352, 141, 253, -487, -102, 393, -193, -181, 450, -12, -298, 336, 97, -355, 69, 139, -402, -58, 461, -29, -286, 277, 351, -148, -89, 81, -205, -210, 71, 83, -62, 63, 115, 6, -24, 55, -57, -243, -142, 5, 46, 13, -34, -15, 253, 279, -159, -106, 144, -139, -298, 99, 226, -271, 10, 440, 75, -127, 348, -65, -490, 150, 227, -449, -88, 356, -2, -40, 341, 7, -268, 132, -193, -358, 176, 12, -518, 306, 654, -366, -73, 580, -259, -462, 394, -92, -716, 317, 505, -484, 162, 720, -296, -264, 449, -117, -486]
3132d86O92l39k14R54l52o73Q03J14j101M87O58j196K6J345o71o05J294k09j263
3151g36R42N11j480K61J007q46r7J114o55m46J080m14r20R97J8j316Q26J012j403
3170e45J91J480j173o73J688o64j575J394N44j621P55J157j294j11J518r65q73
3187g67J340n75j087J531J42j641J244R64j797L54J634j763q05K135p30j672J915
3204D22M98k074J161J570k170j36J853j394q61J907o24j450J935K84j906J311
3220C26R39k340L75K061j944q42K591q11j845K420M57k725J197J688k548o6K332
3237A265j573j119K553m53j860J961K04k276J332J340k692K88K664k020r19K940
3253A635r72k290K444N20l027J344J863k716R3K962j834j531K779l69k492K084
$$ y = [-486, 206, -133, -347, 607, 255, -418, 385, 499, -602, -115, 543, -653, -627, 718, 47, -558, 736, 527, -736, 206, 717, -763, -502, 505, -341, -438, 676, 21, -425, 655, 241, -679, 318, 336, -980, -154, 858, -545, -354, 1126, -47, -720, 968, 304, -1271, 123, 667, -954, -199, 958, -336, -447, 1071, 106, -767, 573, -2, -1089, 442, 584, -1057, 187, 1151, -646, -292, 1342, -421, -1226, 909, 179, -1493, 422, 920, -1154, 7, 1577, -593, -729, 1124, -270, -1131, 776, 152, -1298, 637, 921, -985, 326, 1265, -1075, -700, 1361, -583, -1425, 1166, 355, -1490, 930, 1387, -1338, -141, 1547, -1001, -1067, 1265, -308, -1427, 1126, 673, -1187, 774, 978, -1298, 34, 1374, -1318, -1030, 1634, -386, -1305, 1635, 663, -1627, 817, 1337, -1690, -346, 1517, -1199, -1106, 1856, 22, -1509, 1270, 901, -1591, 493]
3269D93O43k794J346J736k455K76K630k124j161L005r55k596K478O37l029J575
3285b95K262k957j24L188j908j873K878l74k769K207J019k635J104J921k426J21
3301f61K641k236j467L009p39k603K608Q96l060J383K299k903k74K867j860j794
3317a894K967l35k584K155J206k685R87J949k609k32K646j761j577K832m22k327
3333a684K305R20k789J015J870k562j79K673j790j655L096j85k621K019J198k754
3349a123N58K093k215n48K347j198j170K395m24k070J885P00k576J035J681k441
3365a071n8K740j603j458K619k96k332J758R48k401M93J794j630k56K023j267
3381Cj029K148n51j877J694M65k245J182J580k138M0K174j439j093K030m14j983
$$ y = [493, 1136, -1658, -312, 1424, -1031, -755, 1875, -249, -1410, 1595, 640, -1956, 522, 1159, -1870, -295, 1967, -990, -1114, 2074, 166, -1707, 1171, 797, -1972, 235, 1254, -1381, -277, 1644, -782, -661, 1980, -256, -1723, 1286, 547, -2056, 552, 1448, -1612, -229, 2070, -833, -1107, 1760, -100, -1894, 1073, 738, -1846, 309, 1515, -1170, -183, 1766, -843, -1075, 1571, -190, -1767, 1065, 643, -1684, 621, 1541, -1248, -233, 1637, -925, -1104, 1569, -221, -1876, 1220, 1035, -1586, 433, 1631, -1123, -565, 1528, -687, -1235, 1112, -86, -1256, 1139, 715, -1355, 530, 1230, -1346, -311, 1370, -1071, -1129, 1611, 8, -1450, 1169, 873, -1459, 299, 1247, -1154, -661, 1133, -497, -753, 1270, 3, -1026, 1122, 571, -1306, 388, 853, -1392, -210, 1370, -768, -728, 1446, 7, -1086, 944, 530, -1453]
3398a453J631Q18k038P37J512j755p1J877j220j063J798m37j552J576L68j739
3414a011R76J182j687J09J583j465p43J960o19j564J696M52j908J040J260j810
3430e49q2J604j093p72J558m17j212J395L23j526Q84P90j689L25J461j425n18
3447i43J853o96j219J653J27j792R63J052j641O7J447j044o19J647m65j209J344
3464E25K5j353Q92O24j560L82J359j251l34J617p55j124J469Q5j555R26P74j450
3482g04L41J366j196n36J523n46j027J223l5j255Q64O68j299L91J100j169l29
3499f20J458o38j081J325k0j255R07O49j334L22J228j094n03J312o02q40J117
3516C31J70j147N57P64j080J98R98j030l79J260n29q14J076k2j030Q38N24j100
$$ y = [-1453, 178, 996, -1042, -305, 1207, -548, -619, 1258, 38, -1025, 773, 336, -1216, 360, 728, -1011, -35, 1147, -540, -431, 1152, -313, -1056, 904, 285, -1279, 417, 869, -1039, 1, 1261, -549, -631, 973, -120, -892, 666, 249, -963, 432, 755, -771, 113, 903, -786, -461, 1000, -425, -943, 910, 214, -1005, 648, 775, -1017, -54, 998, -643, -576, 871, -173, -792, 855, 390, -819, 525, 550, -803, 89, 713, -847, -465, 894, -357, -691, 926, 171, -953, 516, 601, -954, -28, 746, -704, -363, 1003, -193, -729, 794, 248, -779, 444, 409, -846, 18, 686, -613, -222, 878, -291, -620, 838, 200, -881, 444, 424, -831, 76, 725, -609, -287, 941, -153, -656, 656, 54, -786, 331, 501, -646, -89, 675, -405, -207, 791, -239, -618, 642, 113, -701, 375, 353, -677, 161, 685, -415]
3534d15J25R45q56l98J102k81r39R01L11r28M15N55r25J42P56o46l11Q11k19o11
3554d66P53J10q16L58M90p29Q2O67o49k29Q53k24o39N79J91o43J91N02n82j06
3574c07N38j79l00M58p5m76M12J29l91J09K60l62L7M16k34k33L40K3l27K09J83
3595B30l84O2K35j39j47L46j15k28J45R1j65j14J66j0p1J38lj35J43J5j01L0M9
3618C8j75K9K06l7j66L6J24m0lR3j09j91K24R5k65J51J13k11J8K95j62j71J43
3641C5K2j86P2J89k84N9L45k15k29L46j40k76L72Rl72K30K56l55Q1L62l88j53
3663b20M36j28l93L93J28n23L08L58m66l5M55l68k04N06j92l84M33J57n53L25
3683C3L32n52M8N43n12k70O32k13m87N66J64o08K80M70n79p4N16l47k99O42j12
$$ y = [-415, -290, 655, -201, -599, 503, 222, -717, 184, 495, -433, -18, 537, -388, -246, 510, -136, -447, 364, 145, -466, 287, 397, -419, -61, 429, -300, -218, 449, -200, -429, 424, 200, -439, 140, 331, -312, -121, 381, -201, -307, 231, 52, -248, 210, 135, -341, 71, 200, -191, -82, 178, -184, -147, 269, 35, -198, 142, 165, -162, 47, 230, -154, -92, 143, 4, -143, 203, 88, -140, 5, 96, -69, -183, -17, -27, -98, 40, 37, -98, 45, 60, -41, -11, 38, -137, -108, 98, 61, -105, -69, 55, 15, 12, 105, -4, -195, 29, 124, -141, 10, 123, -88, -70, 225, 63, -108, 35, 57, -129, -57, 132, -152, -93, 252, 37, -192, 154, 14, -262, 110, 119, -253, -23, 233, -122, -41, 321, -67, -220, 216, 88, -305, 88, 216, -307, 1, 359, -107, -142, 313, -55, -259, 247, 55, -329, 104, 261, -292, 33, 365, -187, -139, 404, -108, -378, 254, 41, -446, 120, 284, -324, -44, 426, -153, -227, 289, -58, -357, 285, 173]
3704A73m58M63J49o22L35L53o54N3N41m96j19O88l56m76O84J24p17K75M77p15
3724b98K7P07n38k69P60k27m76N60L1p44M91K72o47J45O57o27j68Q73m81n76Q32
3745C04j5p93N25M51r03J69Q41o70k13P52l63o47Q14K4q15N41M28q25K85O94q16
3766b32j42R39n57o09R89j07r66Q46N01j169L12Q80q64k67R76m57p29R52m9q54
3786f07Q27L69j046L65P80j003j01J022p32n51J211j92j054R49M86j335M11R82
3804G81j143k83J253n97p11J237j62j010Q63M37j259L09R42j016k31J266o57p54
3822g35J336k18j136J013L64j485N98J130j321j62J431p03r04J341K1j391Q82
3839F1O41j344L14J130j082l09J392p33q03J327k78j229J101M80j517N38J270
$$ y = [173, -285, 178, 327, -295, 40, 393, -261, -208, 333, -163, -282, 406, 50, -426, 258, 382, -335, -60, 417, -298, -271, 436, -102, -371, 389, 162, -314, 246, 277, -467, 24, 296, -351, -206, 451, -176, -344, 529, 48, -528, 304, 289, -504, 21, 472, -431, -262, 579, -91, -304, 448, 85, -562, 252, 276, -539, 2, 430, -395, -110, 584, -232, -374, 565, 8, -601, 388, 281, -685, 161, 662, -507, -195, 685, -179, -446, 530, 73, -656, 296, 247, -607, 220, 589, -457, -92, 688, -315, -416, 606, -126, -677, 534, 342, -712, 237, 723, -612, -201, 781, -362, -645, 608, 11, -700, 537, 375, -635, 228, 665, -594, -285, 657, -359, -590, 676, 19, -735, 601, 383, -753, 260, 624, -861, -263, 867, -454, -616, 815, 112, -792, 549, 570, -821, 61, 702, -642, -328, 802, -280, -589, 803, 70, -733, 594, 316, -913, 188, 668, -849, -311, 959]
3856I59j290k87J563p32j168J412N7j441R30P20j375L41J195j145l45J396o93
3873I7r73J341m1j321J000O86j388L15J285j244m31J506p29j059J397O0j407R86
3891H0Q04j386J85J236j091n23J264m20j083J230K38j215P34P50j326K48J084
3908H09j137l87J436o83r63J393J28j417Q70R02j461N5J221q99n85J288l06q77
3926f13R44K10j126O52N72j210K31J042j011k95J239m35r42J163J78j345P26O82
3944F62j192Q2J130q78m38J267l57q26R28R0j033M02P10j027J53R09p41k46J005
3963F00m26p69R87n2j013O38N69j060K15J013o97m84J015k90q45Q03K12r88M12
3982a60P70r19N1P75n98k99Q02l81n48P58Oq46O50M78r16K02P84p28l99R56l67
$$ y = [959, -331, -618, 945, 213, -955, 457, 514, -927, 3, 723, -652, -311, 884, -261, -606, 790, 97, -876, 465, 424, -897, 103, 789, -599, -284, 1001, -243, -674, 832, 103, -956, 441, 501, -906, 80, 884, -502, -317, 919, -172, -695, 569, 149, -934, 296, 534, -681, 53, 803, -523, -275, 809, -328, -715, 721, 38, -925, 468, 596, -821, 49, 951, -510, -455, 766, -133, -718, 570, 264, -613, 331, 541, -585, 67, 639, -571, -340, 702, -309, -604, 635, 200, -742, 421, 599, -746, -20, 662, -530, -448, 682, -196, -634, 633, 276, -550, 378, 468, -565, -163, 547, -480, -327, 582, -159, -405, 600, 174, -595, 392, 340, -673, -35, 534, -526, -311, 702, 5, -479, 536, 246, -599, 204, 416, -572, -160, 610, -309, -258, 517, -81, -380, 422, 41, -507, 251, 257, -589, 61, 539, -377, -175, 609, -119, -518, 438, 71]
4003G1o31P57J47q34N21N09q08Q1O73o04l22P22k80m25O89l9o95O10L48q60K06
4024a64N93o82j28P29k95n07P36L6p61M82L90p75R4O39n37k21O32j93m25O32o1
4045B14n54M26K13o53K06N36o01j14P03k87l60N50N9p57M50L20o65J67N24n15
4065a38j38N97k49l75M02P3n25L38K21m80J68M69m70j11N52k27m22N29n1n09L55
4086IK22m28Q0M69l55k04M85j43m18L63O1m07K51K24l45j8L70k43j10L26q6l24
4108b21L10N0l21R9K78l10J1K91k02j68L40j35k49K46J56k55N6J98k25k2K06r3
4130D0j42J91m4j44J81j3j65J54J04k17o3J48k2j65J31R9k19Q5J57j23o1J69r9
4153a8o4J01%j47J06J35j21k8O8k8n1L7J2m5L3P3r6M5J53j61n8J24j6j45N7R9
$$ y = [71, -560, 197, 344, -490, 31, 540, -268, -187, 486, -118, -440, 282, 2, -423, 266, 227, -468, 142, 490, -370, -164, 429, -253, -381, 348, 53, -454, 282, 318, -443, 39, 429, -346, -252, 387, -150, -371, 261, 68, -357, 275, 214, -340, 86, 299, -354, -148, 388, -213, -327, 376, 89, -271, 279, 338, -419, 31, 351, -314, -147, 377, -138, -276, 321, 72, -303, 99, 172, -353, -15, 206, -274, -106, 363, -107, -218, 334, 107, -315, 214, 163, -346, 9, 231, -197, -117, 352, -3, -207, 278, 135, -283, 80, 141, -266, -15, 209, -136, -154, 216, -27, -137, 189, 103, -221, 89, 139, -182, -83, 195, -115, -104, 187, -15, -183, 157, 22, -227, 19, 175, -80, -24, 174, -51, -73, 133, 40, -102, 89, 45, -99, 82, 69, -96, 58, 162, -55, -118, 30, 8, -157, -26, 73, -146, -61, 96, -27, -88, 81, -18, -82, 19, 19, -128, -22, 113, -8, -36, 32, 4, -47, -10, 2, -43, -10, 63, -33, 12, 165, 4, -54, 70, 54, -91, -34, 65]
4179F5r7m4J68j31l1J31nj98Q9J97k27MJ92j05q5J88n9j68J43P1k01M9J59k15
4203a10n3K78q8j76K43K8k90J87J59k91K3K74k04j22K94q8k04J99Q4l42J68J91
4225A60k99P1K52l12l4L38j48k92L69P2l91J71K50l63j3M19k41k27M33j45l09
4246b39K72J68m33K12K36l64N1L41l20j51M36j39l76L99Q4m50K96K90m64Q8L51
4267B88l80j64M57j48l83L94J52m63J83K79l73JM26l47j45M83j77l83M61O8n11
4288b82K86L03n04Q5L83l51j75N31j96m22M86R3n39K95L01n21MM93l73j48N30
4309B79k43l29M71J8m98L44K33n71J61M89n14j04N84k42l95N52k7n42K91M13n53
4330a83L3N01m79j65N94k35l46N24r1n21M03K19n34J60N58o25p1O44l09m68N61
$$ y = [65, -32, -76, 92, -39, -70, 61, 56, -142, -53, 144, -83, -79, 113, 8, -77, 111, 52, -116, 27, 98, -103, -54, 105, -110, -163, 115, 27, -149, 94, 122, -168, 19, 178, -113, -90, 184, -20, -142, 152, 64, -140, 59, 143, -199, -31, 160, -139, -68, 184, -128, -162, 176, 28, -264, 105, 177, -214, -43, 207, -156, -169, 250, 9, -218, 215, 70, -239, 33, 201, -232, -20, 216, -148, -97, 244, -76, -227, 209, 70, -306, 93, 177, -273, 23, 313, -151, -63, 288, -92, -256, 201, 53, -330, 64, 216, -247, -64, 215, -158, -157, 269, -78, -223, 260, 83, -300, 161, 229, -282, 4, 307, -197, -112, 271, -80, -255, 276, 80, -342, 144, 237, -302, -7, 294, -227, -223, 270, -103, -251, 279, 36, -293, 178, 196, -302, 42, 275, -296, -135, 354, -160, -264, 320, 78, -317, 235, 208, -334, -43, 370, -183, -150, 351, -128, -293, 301, 66, -280, 244, 153, -368, 35, 254, -280, -120, 438, -187, -258, 386, 77, -391, 170]
4351A70Q2o56M50K87n85J18N21m75j53N64l63l17O10n7o14N08K45o56K80M73n35
4372a03j37O57l83m48P33j46o43N67K96p83K53N77o49j33O99l56m12P12p9o88
4392d66N84K38p27K48N76o89q9Q31n65m02P78q8p26O44K71q79K90O45p47j09P84
4413D02l46m64O74jo87N32K31p68L41N86p90k6P89m31m75P78o4p88O17L04q58
4434d44K49O74p29r2Q50m19n53Q01q6p58N72L06p65J83P08o56j72P88l78n17O98
4455B60m7o92N43L44p77K73O59p73j46Q80m40o09P29N0o97M71L78p29J68O32n94
4476a17k21P24l33n27O45J7o38M97L24p14K31O62p42k03P82l40n38O47J61p39
4496d22M20M41p00M4O16n41j92P12l11n09O77K8n78L52L74o75R8N53o08j33P09
$$ y = [170, 252, -404, 46, 333, -252, -134, 387, -88, -241, 323, -40, -357, 253, 196, -418, 90, 335, -321, -41, 432, -103, -240, 417, 34, -414, 319, 173, -470, 97, 393, -390, -137, 440, -209, -342, 357, 1, -411, 301, 222, -466, 118, 356, -371, -123, 453, -236, -325, 506, -59, -461, 317, 229, -497, 147, 418, -461, -171, 474, -273, -382, 402, 56, -408, 266, 265, -422, 110, 341, -427, -86, 500, -290, -316, 473, 42, -433, 345, 281, -507, 110, 414, -444, -195, 479, -250, -342, 508, 89, -464, 337, 251, -507, 65, 371, -394, -211, 497, -159, -331, 457, 79, -438, 260, 213, -479, 64, 408, -369, -96, 563, -210, -356, 524, 84, -525, 204, 254, -443, 28, 406, -323, -155, 477, -117, -338, 386, 53, -474, 171, 188, -450, 47, 371, -343, -112, 550, -192, -395, 387, 47, -491, 156, 317, -422, -2, 439, -261, -217, 399, -142, -334, 378, 67, -442, 235, 263, -315, 37, 411, -264, -166, 387, -221, -354, 355]
4517C55l03l93N94J3n48L26L21o45Q3N68n20k06O69j92l98M53J14o34L47L04n89
$$ y = [355, 52, -341, 253, 266, -282, 44, 365, -280, -197, 371, -149, -355, 314, 122, -276, 177, 291, -343, 4, 308, -281]
$$ [...]
8191e4
##END NTUPLES=NMR FID
##END=
