##TITLE=1H_IVA0503-3
 CDCl3
 8 sc, 
 7.3.2024
##JCAMPDX= 6.0         $$ Bruker NMR JCAMP-DX V2.0
##DATA TYPE= NMR FID
##DATA CLASS= NTUPLES
##ORIGIN= UXNMR, Bruker Analytische Messtechnik GmbH
##OWNER= root
$$ XWIN-NMR		Version 3.5
$$ Thu Mar  7 13:56:41 2024 Russian Standard Time (UT+4h)  she@DPX200
##.OBSERVE FREQUENCY= 200.1313
##.OBSERVE NUCLEUS= ^1H
##.DELAY= (6, 6)
##.ACQUISITION MODE= SIMULTANEOUS
##.ACQUISITION SCHEME= undefined
##.AVERAGES= 8
##.DIGITISER RES= 18
##SPECTROMETER/DATA SYSTEM= spect
##.PULSE SEQUENCE= zg30
##.SOLVENT NAME= CDCl3
##.SHIFT REFERENCE= (INTERNAL, CDCl3, 0, 15.7039)
##AUDIT TRAIL= $$ (NUMBER, WHEN, WHO, WHERE, WHAT)
$$ ##TITLE= Audit trail, XWIN-NMR		Version 3.5
$$ ##JCAMPDX= 5.01
$$ ##ORIGIN= Bruker BioSpin GmbH
$$ ##OWNER= she
$$ F:/spectra/data/she/nmr/H-F/1/audita.txt
$$ ##AUDIT TRAIL=  $$ (NUMBER, WHEN, WHO, WHERE, WHAT)
(   1,<2024-03-07 13:55:18.00 +0400>,<she>,<DPX200>,
      <created by zg, POWCHK disabled, PULCHK disabled
       configuration hash MD5:
       00 E9 B6 7A A2 85 ED C7 34 08 36 98 17 FE 4E 26
       data hash MD5: 16K
       99 16 2C FE FE F1 6C B8 2C FB FE 5F ED A8 76 69>)
$$ ##END=
$$ 
$$ hash MD5
$$ 19 08 CE 22 0B F2 B1 DE B7 77 68 69 D8 75 03 8F
##$RELAX= 
##$RELAX= 
##$RELAX= 
##$RELAX= 
##$RELAX= 
##$RELAX= 
$$ Bruker specific parameters
$$ --------------------------
##$DU= <F:/spectra>
##$EXPNO= 1
##$NAME= <H-F>
##$PROCNO= 1
##$TYPE= <nmr>
##$USER= <she>
##$AMP= (0..31)
100 100 100 100 100 100 100 100 100 100 100 100 100 100 100 100 100 100 
100 100 100 100 100 100 100 100 100 100 100 100 100 100 
##$AQSEQ= 0
##$AQ_mod= 1
##$AUNM= <au_zg>
##$AUTOPOS= <>
##$BF1= 200.13
##$BF2= 200.13
##$BF3= 200.13
##$BF4= 200.13
##$BF5= 200.13
##$BF6= 200.13
##$BF7= 200.13
##$BF8= 200.13
##$BYTORDA= 1
##$CFDGTYP= 0
##$CFRGTYP= 5
##$CHEMSTR= <none>
##$CNST= (0..31)
1 1 145 1 1 1 1 1 1 1 1 1 1 1 1 1 1 1 1 1 1 1 1 1 1 1 1 1 1 1 1 1 
##$CPDPRG= <>
##$CPDPRG1= <>
##$CPDPRG2= <>
##$CPDPRG3= <>
##$CPDPRG4= <mlev>
##$CPDPRG5= <mlev>
##$CPDPRG6= <mlev>
##$CPDPRG7= <mlev>
##$CPDPRG8= <mlev>
##$CPDPRGB= <>
##$CPDPRGT= <>
##$D= (0..31)
0 1.2 0 0 0 0 0 0 0 0.06 0 0.03 0 0 0 0 0.0002 0 0 0 0 0 0 0 0 0 0 0 0 
0 0 0 
##$DATE= 1709805317
##$DBL= (0..7)
120 120 120 120 120 120 120 120 
##$DBP= (0..7)
150 150 150 150 150 150 150 150 
##$DBP07= 0
##$DBPNAM0= <>
##$DBPNAM1= <>
##$DBPNAM2= <>
##$DBPNAM3= <>
##$DBPNAM4= <>
##$DBPNAM5= <>
##$DBPNAM6= <>
##$DBPNAM7= <>
##$DBPOAL= (0..7)
0.5 0.5 0.5 0.5 0.5 0.5 0.5 0.5 
##$DBPOFFS= (0..7)
0 0 0 0 0 0 0 0 
##$DE= 6
##$DECBNUC= <off>
##$DECIM= 32
##$DECNUC= <off>
##$DECSTAT= 4
##$DIGMOD= 1
##$DIGTYP= 9
##$DL= (0..7)
0 120 120 120 120 120 120 120 
##$DP= (0..7)
150 150 150 150 150 150 150 150 
##$DP07= 0
##$DPNAME0= <>
##$DPNAME1= <>
##$DPNAME2= <>
##$DPNAME3= <>
##$DPNAME4= <>
##$DPNAME5= <>
##$DPNAME6= <>
##$DPNAME7= <>
##$DPOAL= (0..7)
0.5 0.5 0.5 0.5 0.5 0.5 0.5 0.5 
##$DPOFFS= (0..7)
0 0 0 0 0 0 0 0 
##$DQDMODE= 0
##$DR= 18
##$DS= 0
##$DSLIST= <SSSSSSSSSSSSSSS>
$$ [...]
##$SUBNAM2= <"">
##$SUBNAM3= <"">
##$SUBNAM4= <"">
##$SUBNAM5= <"">
##$SUBNAM6= <"">
##$SUBNAM7= <"">
##$SUBNAM8= <"">
##$SUBNAM9= <"">
##$SW= 18.0517328524113
##$SWIBOX= (0..15)
0 0 2 0 0 0 0 0 0 0 0 0 0 0 0 0 
##$SW_h= 3612.71676300578
##$TD= 16384
##$TD0= 1
##$TE= 0
##$TE2= 300
##$TE3= 300
##$TEG= 300
##$TL= (0..7)
0 120 120 120 120 120 120 120 
##$TP= (0..7)
150 150 150 150 150 150 150 150 
##$TP07= 0
##$TPNAME0= <>
##$TPNAME1= <>
##$TPNAME2= <>
##$TPNAME3= <>
##$TPNAME4= <>
##$TPNAME5= <>
##$TPNAME6= <>
##$TPNAME7= <>
##$TPOAL= (0..7)
0.5 0.5 0.5 0.5 0.5 0.5 0.5 0.5 
##$TPOFFS= (0..7)
0 0 0 0 0 0 0 0 
##$TUNHIN= 0
##$TUNHOUT= 0
##$TUNXOUT= 0
##$USERA1= <user>
##$USERA2= <user>
##$USERA3= <user>
##$USERA4= <user>
##$USERA5= <user>
##$V9= 5
##$VALIST= <valist>
##$VCLIST= <CCCCCCCCCCCCCCC>
##$VD= 0
##$VDLIST= <DDDDDDDDDDDDDDD>
##$VPLIST= <PPPPPPPPPPPPPPP>
##$VTLIST= <TTTTTTTTTTTTTTT>
##$WBST= 1024
##$WBSW= 4
##$XGAIN= (0..3)
0 0 0 0 
##$XL= 0
##$YL= 0
##$YMAX_a= 201191
##$YMIN_a= -223638
##$ZGOPTNS= <>
##$ZL1= 120
##$ZL2= 120
##$ZL3= 120
##$ZL4= 120
##$ABSF1= 10
##$ABSF2= 0
##$ABSG= 5
##$ABSL= 3
##$ALPHA= 0
##$AQORDER= 0
##$ASSFAC= 0
##$ASSFACI= 0
##$ASSFACX= 0
##$ASSWID= 0
##$AUNMP= <proc_1d>
##$AZFE= 0.1
##$AZFW= 0.1
##$BCFW= 1
##$BC_mod= 2
##$BYTORDP= 1
##$COROFFS= 0
##$CY= 11.3945322036743
##$DATMOD= 1
##$DC= 2
##$DFILT= <>
##$DTYPP= 0
##$F1P= 15.7292609196834
##$F2P= 12.9074282941183
##$FCOR= 0.5
##$FTSIZE= 0
##$FT_mod= 4
##$GAMMA= 1
##$GB= 0.15
##$INTBC= 1
##$INTSCL= 1
##$ISEN= 128
##$LB= 0.24
##$LEV0= 0
##$LPBIN= 0
##$MAXI= 10000
##$MC2= 0
##$MEAN= 0
##$ME_mod= 0
##$MI= 1.114404
##$NCOEF= 0
##$NC_proc= 0
##$NLEV= 6
##$NOISF1= 3.799351
##$NOISF2= 2.8
##$NSP= 1
##$NTH_PI= 0
##$NZP= 0
##$OFFSET= 15.70392
##$PC= 1
##$PHC0= -25100.97
##$PHC1= 11.18731
##$PH_mod= 1
##$PKNL= yes
##$PPARMOD= 0
##$PSCAL= 0
##$PSIGN= 0
##$REVERSE= no
##$SF= 200.130013532006
##$SI= 16384
##$SIGF1= 3
##$SIGF2= 2
##$SINO= 400
##$SIOLD= 16384
##$SREGLST= <1H.CDCl3>
##$SSB= 0
##$STSI= 0
##$STSR= 0
##$SW_p= 3612.71676300578
##$SYMM= 0
##$S_DEV= 0
##$TDeff= 0
##$TDoff= 0
##$TI= <>
##$TILT= no
##$TM1= 0
##$TM2= 0
##$TOPLEV= 0
##$USERP1= <user>
##$USERP2= <user>
##$USERP3= <user>
##$USERP4= <user>
##$USERP5= <user>
##$WDW= 1
##$XDIM= 8192
##$YMAX_p= 0
##$YMIN_p= 0
$$ End of Bruker specific parameters
$$ ---------------------------------
##NTUPLES= NMR FID
##VAR_NAME=  TIME,          FID/REAL,        FID/IMAG
##SYMBOL=    X,             R,               I
##VAR_TYPE=  INDEPENDENT,   DEPENDENT,       DEPENDENT
##VAR_FORM=  AFFN,          ASDF,            ASDF
##VAR_DIM=   8192,          8192,            8192
##UNITS=     SECONDS,       ARBITRARY UNITS, ARBITRARY UNITS
##FACTOR=    0.0002768,     1,               1
##FIRST=     0,             0,               0
##LAST=      2.2672688,     0,               0
##MIN=       0,             -223638,         0
##MAX=       2.2672688,     201191,          0
$$ Real data points
##PAGE= N=1
##DATA TABLE= (X++(R..R)), XYDATA
$$ plain form
0 0 0 0 0 0 0 0 0 0 0 0 0 0 0 0 0 0 0 -6 8 -8 8 -8 10 -16 17 -18 24 -26 33 -36 42 -47 55 -63 72 -81 89 -100
38 -100 114 -128 141 -158 175 -195 216 -239 263 -291 322 -355 390 -428 472 -521 574 -633 699 -776
58 -776 860 -957 1076 -1211 1373 -1573 1820 -2134 2537 -3017 3259 -603 170237 -9086 -164276
73 -164276 96226 77956 -98383 13208 37898 -95327 68545 121887 -159274 -93832 201191
84 201191 19343 -169132 58441 87990 -99704 10491 76817 -78786 640 96322 -100724
95 -100724 -63280 172090 1940 -184623 55954 127498 -84035 -29694 69107 -63483 -13647
106 -13647 108608 -58141 -86501 120006 16406 -143537 61993 119792 -106665 -57495 94683
117 94683 -19228 -33953 75858 -48505 -88022 113411 49135 -134295 20001 105280 -82136
$$ packed form
0@%%%%%%%%%%%%%%%%%oJ4j6J6j6J8k6L3l5M2n0N9o9P8q9J02j18J35j53J70j89
38a00K14k42K69k99L33l70M11m55N02n54O13o77P45q18R00r93J095j207J332j475
58g76J636j817K033k287K584k946L393l954M671n554O276l862J70840j79323j55190
73a64276K60502j8270j76339J11591K4690j33225J63872N3342k81161O5442K95023
84B01191j81848j88475K27573K9549j87694J10195O6326j55603P9426R5682j97046
95a00724L7444K35370j70150j86563K40577P1544k11533N4341R8801j32590M9836
106a3647J22255j66749k8360K06507j03600j59943K05530N7799k26457M9170J52178
117I4683j13911j4725J09811j24363l9517K01433o4276j83430J54296Q5279j87416
$$ plain form
128 -82136 -43065 104134 -21304 -70897 63158 -1595 -67309 80960 37608 -128955 10393
139 10393 122340 -55470 -66950 74850 -10237 -60129 68941 14901 -83291 42410 51392
150 51392 -87449 7127 102469 -59006 -77699 80646 24218 -61472 35143 11969 -72175
161 -72175 43622 67538 -82238 -25726 87679 -31961 -62298 73881 19222 -77771 23566
172 23566 40756 -48824 21103 49022 -76567 -23538 99769 -14507 -79690 47672 28797
183 28797 -59892 25137 42721 -57336 -3405 53825 -43792 -21833 77167 -20805 -80908 52402
195 52402 52448 -57365 -3686 35695 -39742 2685 57511 -39415 -41014 60471 196 -60445
207 -60445 42090 40548 -64552 -10665 53844 -18517 -15387 34608 -31761 -30571 65037 9112
$$ packed form
128h2136L9071J47199j25438m9593J34055o4753o5714J48269m3352j66563J39348
139A0393J11947j77810j1480J41800q5087m9892J29070n4040r8192J25701Q982
150E1392j38841R4576R5342j61475j8693J58345n6428q5690R6615k3174q4144
161g2175J15797K3916j49776N6512J13405j19640l0337J36179n4659r6993J01337
172B3566J7190q9580O9927K7919j25589N3029J23307j14276o5183J27362j8875
183B8797q8689Q5029J7584j00057N3931N7230r7617K1959R9000r7972o0103J33310
195E2402M6j09813N3679L9381p5437M2427N4826r6926j599J01485o0275o0641
207f0445J02535j542j05100N3887O4509p2361L130M9995o6369J190R5608n5925
$$ plain form
219 9112 -68555 20813 44802 -43592 -7163 48397 -24492 -30450 36406 -4710 -26093 41137
231 41137 96 -62651 26751 57110 -42005 -28051 39139 -9136 -20389 35583 -4674 -37291
243 -37291 28009 15921 -40991 17698 40451 -44872 -26864 50796 5239 -33163 14037 438
255 438 -23107 29558 16865 -43938 1567 38524 -23557 -19047 39134 -2292 -38422 16448 20781
268 20781 -17212 7339 6389 -32127 9324 41036 -22779 -31346 27768 8414 -24691 13801 14660
281 14660 -24223 -954 17900 -12152 1995 21647 -23255 -22251 35492 14583 -31886 -1767
293 -1767 15929 -9943 2656 13957 -15892 -8611 18275 -5497 -12625 21157 3084 -30165 4809
306 4809 27190 -6996 -12557 4292 -4929 1876 17326 -7307 -18257 11268 9077 -13989 3540
$$ packed form
219I112p7667Q9368K3989q8394L6429N5560p2889n958O6856m1116k1383O7230
231D1137m1041o2747Q9402L0359r9115J3954O7190m8275j1253N5972m0257l2617
243c7291O5300j2088n6912N8689K2753q5323J8008P7660m5557l8402M7200j3599
255D38k3545N2665j2693o0803M5505L6957o2081M510N8181m1426l6130N4870M333
268B0781l7993K4551r50l8516M1451L1712o3815q567N9114j9354l3105L8492Q59
281A4660l8883K3269J8854l0052J4147J9652m4902J004N7743k0909m6469L0119
293a767J7696k5872J2599J1301k9849P281K6886k3772p128L3782j8073l3249L4974
306D809K2381l4186n561J6849r221O805J5450k4633j0950K9525k191k3066J7529
$$ plain form
319 3540 14576 -12930 -13232 12663 7896 -4063 -676 -8072 -5538 16704 8302 -17083 -5522 11865
333 11865 -159 -4756 6532 702 -9016 -764 5027 2697 3217 -4792 -12091 4068 15561 -1356
347 -1356 -12855 -1709 6363 2851 -288 -687 -1415 -1968 -483 2641 4703 890 -7071 -6525 5486
362 5486 10873 -971 -12377 -4098 9481 4759 -4743 -1501 -134 -2857 2486 4278 -1162 63
376 63 -1362 -7122 3787 14121 -3775 -15917 2460 11161 -1467 -2055 144 -7272 1300 10266
390 10266 -4752 -5887 8843 -3380 -11915 11870 12352 -13949 -8009 9293 655 535 7278 -10689
404 -10689 -10451 16974 5808 -17023 4412 10764 -15029 -2567 18283 -4716 -12085 7815 -1773
417 -1773 -6374 17003 1766 -25359 5621 23056 -12178 -10265 15273 -5792 -12042 16420 2378
$$ packed form
319C540J1036k7506l02K5895m767j1959L387p396K534K2242q402k5385J1561J7387
333A1865j2024m597J1288n830r718Q252N791k330N20q009p299J6159J1493j6917
347a356j1499J1146Q072l512l139l99p28n53J485L124K062l813p961N46J2011
362E486N387j1844j1406Q279J3579m722r502L242J367k723N343J792n440J225
376F3j425n760J0909J0334j7896j2142J8377Q701j2628n88K199p416Q572Q966
390A0266j5018j135J4730j2223q535K3785M82k6301N940J7302q638j20O743j7967
404a0689K38K7425j1166k2831K1435O352k5793J2462K0850k2999p369J9900r588
417a773m601K3377j5237k7125L0980J7435l5234J913K5538k1065o250K8462j4042
$$ plain form
430 2378 -16650 9721 6057 -20235 8276 23395 -19854 -17482 22752 4311 -15269 10767 1318
443 1318 -18763 14016 15546 -23133 -1326 23226 -16251 -15027 27565 2323 -26534 8890 12041
456 12041 -15189 8776 12700 -26794 -2205 33002 -12054 -24083 23987 5832 -26285 13027
468 13027 17592 -22069 -342 17822 -18741 -3096 30831 -15589 -30428 28571 16434 -30557
480 -30557 3950 19622 -20688 -709 24594 -17508 -12743 28627 -8141 -27643 28648 16629
492 16629 -37818 54 30780 -15033 -10364 20857 -14661 -14575 31688 -2465 -33814 21983 20547
505 20547 -35002 381 35050 -18181 -20394 25223 -2479 -17276 24577 -1392 -34924 22724
517 22724 28230 -37070 -8278 37016 -15264 -23357 29346 1435 -27030 19114 8627 -29939
$$ packed form
430B378j9028K6371l664k6292K8511J5119m3249K372M0234j8441j9580K6036r449
443A318k0081L2779J530l8679K1807K4552l9477J224M2592k5242k8857L5424L151
456A2041k7230K3965L924l9494K4589L5207m5056j2029M8070j8155l2117L9312
468A3027M565l9661K1727J8164l6563J5645L3927m6420j4839N8999j2137m6991
480c0557L4507J5672m0310J9979K5303m2102M765M1370l6768j9502N6291j2019
492A6629n4447L7872L0726m5813M669L1221l5518Q6M6263l4153l1349N5797j436
505B0547n5549L5383L4669n3231k213M5617k7702j4797M1853k5969l3532N7648
517B2724N506o5300K8792M5294n2280q093N2703k7911k8465M6144j0487l8566
$$ plain form
529 -29939 17473 27001 -38323 -10963 44557 -10031 -31916 26350 7067 -29070 18102 15964
541 15964 -32405 7056 29409 -30252 -12506 42326 -10425 -37808 27862 17629 -31709 9204
553 9204 20042 -29707 2717 34431 -25487 -20688 38711 -3797 -36535 26745 19752 -37261 3625
566 3625 29195 -24388 -6448 32527 -21012 -24181 39690 3202 -40455 20779 23868 -35226 2469
579 2469 33620 -25397 -15372 35179 -11328 -27752 33890 6677 -42129 17439 30905 -33714
591 -33714 -5747 33745 -21427 -17652 37378 -6917 -34668 29000 15660 -38503 10751 31841
603 31841 -31116 -11217 35843 -14179 -22555 32468 -3015 -35654 27592 21727 -40398 1776
615 1776 35363 -23782 -15500 33662 -9658 -26017 29505 4648 -34459 21655 23394 -39715 -1486
$$ packed form
529b9939M7412R528o5324K7360N5520n4588k1885N8266j9283l6137M7172k138
541A5964m8369L9461K2353n9661J7746N4832n2751k7383O5670j0233m9338M0913
553I204J0838m9749L2424L1714n9918M799N9399m2508l2738O3280o993n7013M0886
566C625K5570n3583J7940L8975n3539l169O3871l6488m3657O1234L089n9094L7695
579B469L1151n9017J0025N0551m6507j6424O1642k7213m8806N9568J3466o4619
591c3714K7967L9492n5172L775N5030m4295k7751O3668j3340n4163M9254K1090
603C1841o2957J9899M7060n0022q376N5023l5483l2639O3246n865o2125M2174
615A776L3587n9145Q282M9162m3320j6359N5522k4857l9107N6114J739o3109L8229
$$ plain form
628 -1486 40822 -20555 -24499 31413 -1893 -26759 24842 7892 -34694 16345 26939 -35484
640 -35484 -5671 40953 -18246 -29558 33388 7001 -31565 16769 13935 -30174 11312 27289
652 27289 -32503 -10513 39942 -12718 -31732 30478 11305 -34491 11441 22019 -26157 1622
664 1622 26569 -24991 -12350 37989 -8624 -34072 26828 16463 -33338 6447 25117 -24136
676 -24136 -5933 27868 -16698 -16837 31976 -4115 -33365 24451 20198 -34013 1251 28590 -19956
689 -19956 -10438 27920 -11604 -20887 28235 2611 -32051 18431 21543 -32334 -2183 31430 -17156
702 -17156 -16563 26710 -5708 -22345 24610 6786 -31531 13113 24452 -27485 -6438 30527
714 30527 -13142 -19837 25460 651 -24515 18376 10776 -28791 8492 25390 -24468 -11069
$$ packed form
628a486M2308o1377l944N5912l3306k4866N1601j6950m2586N1039J0594o2423
640c5484K9813M6624n9199j1312O2946k6387l8566M8334k834m4109M1486J5977
652B7289n9792K1990N0455n2660j9014O2210j9173m5796M5932J0578m8176K7779
664A622K4947n1560J2641N0339m6613k5448O0900j0365m9801L9785J8670m9253
676b4136J8203L3801m4566j39M8813l6091k9250N7816m253n4211L5264K7339m8546
689a9956R518L8358l9524r283M9122k5624l4662N0482L112n3877L0151L3613m8586
702a7156N93M3273l2418j6637M6955j7824l8317M4644J1339n1937K1047L6965
714C0527m3669o695M5297k4809k5166M2891p600l9567L7283J6898m9858J3399
$$ plain form
726 -11069 29382 -7531 -21602 21590 4887 -24424 13736 15024 -25276 2921 25250 -20152
738 -20152 -13400 28592 -3938 -24265 18185 9227 -23195 8917 16210 -22466 -1070 25019 -15488
751 -15488 -15797 25998 -366 -24871 15985 13198 -22729 4005 18038 -18109 -4192 22973 -12105
764 -12105 -17066 23015 3128 -24527 11567 15343 -20737 -324 19371 -13734 -8214 20466 -6897
777 -6897 -16683 19484 5385 -23013 8270 17097 -17516 -4327 18506 -9276 -10915 17349 -2354
790 -2354 -16705 14564 7352 -20462 5553 17299 -15521 -6863 18281 -5245 -12289 14137 1148
803 1148 -15358 10645 8974 -17635 2135 16586 -12747 -8597 17269 -2863 -14009 11467 4376
816 4376 -13887 6654 9221 -14163 113 15346 -9397 -9462 14989 38 -13848 8859 6725
$$ packed form
726a1069M0451l6913j4071M3192j6703k9311L8160J288m0300K8197K2329m5402
738b0152O752M1992l2530k0327M2450q958l2422L2112P293l8676K1396K6089m0507
751a5488l09M1795k6364k4505M0856k787l5927K6734J4033l6147J3917K7165l5078
764a2105m961M0081j9887k7655L6094L776l6080K0413J9695l3105N520K8680k7363
777f897r786L6167j4099k8398L1283Q827l4613J3189K2833k7782j639K8264j9703
790b354j4351L1269p212k7814K6015J1746l2820Q658K5144k3526p044K6426j2989
803A148j6506K6003j671k6609J9770J4451k9333M150K5866k0132j1146K5476p091
816D376j8263K0541K567k3384J4276J5233k4743o5K4451j4951j3886K2707k134
$$ plain form
829 6725 -12740 2801 9751 -10511 -2127 12600 -6702 -9273 12385 1962 -12781 5727 7944
842 7944 -10142 -12 9748 -7047 -3993 10419 -3565 -8305 9584 2430 -11385 3951 8149
855 8149 -8315 -2243 8356 -4162 -4812 7871 -1153 -7532 6722 3387 -9039 2596 7646 -6718
869 -6718 -2965 7748 -1901 -4992 5210 313 -5733 4079 3229 -6788 680 6211 -4609 -3184
883 -3184 6212 -701 -4878 3631 1739 -3870 1929 2538 -4022 200 4437 -2565 -2985 3847 428 -3682
899 -3682 1640 2006 -2855 51 2036 -1731 -259 2162 -1313 -1645 2201 973 -2008 7 1640 -562
915 -562 -752 1019 93 -785 236 129 -315 161 167 -525 -635 608 1051 -1168 -964 1701 327 -1644 1063
934 1063 1155 -1716 -22 1909 -1068 -1031 1980 -685 -2442 2358 1352 -3735 568 3124 -2828 -1194
$$ packed form
829F725j9465J5541O950k0262Q384J4727j9302k571K1658j0423j4743J8508K217
842G944j8086J0130R760j6795L054J4412j3984m740J7889p154j3815J5336M198
855H149j6464O072J0599j2518o50J2683r024o379J4254l335j2426J1635N050j4364
869f718L753J0713r649l091J0202m897o046R812q50j0017P468N531j0820J425
883c184R396o913m177Q509j892n609N799O09o560M222M237p002m20O832l419m110
899c682N322L66m861K906J985l767J472K421l475l32L846j228k981K015J633k202
915e62j90J771r26q78J021j07m44M76Oo92j10J243M43k219K04K665j374j971K707
934A063R2k871J694J931k977L7L011k665j757M800j006n087M303K556n952J634
$$ plain form
950 -1194 3818 -1517 -2896 3621 652 -3808 2399 2626 -4511 325 4959 -3259 -2967 5199 -886 -4824
966 -4824 4364 1848 -6086 2031 4443 -5286 -726 6126 -3469 -4196 6598 360 -6534 4333 3715
981 3715 -7133 1412 6649 -6030 -2766 7926 -2893 -6020 7221 1112 -8459 4150 5610 -7951
995 -7951 -175 8185 -5705 -4494 9351 -1365 -8362 7124 3454 -9506 3462 7488 -8633
1008 -8633 -1837 9692 -4880 -6528 9469 -29 -10183 6538 6000 -10443 1165 9367 -7988
1021 -7988 -3618 11187 -3829 -8612 9961 2045 -11326 5940 7782 -11181 -732 11402 -6821
1034 -6821 -6339 11290 -2222 -10512 9913 4168 -13092 4502 10140 -11350 -2298 13252 -6226
1047 -6226 -8837 11902 521 -11802 8443 5995 -13782 2959 12435 -11203 -5436 14268 -4565
$$ packed form
950a194N012n335j379O517k969m460O207K27p137M836M634q218K92Q166o085l938
966d824R188k516p934Q117K412r729M560O852r595p27J0794o238o894J0867o18
981C715j0848Q545N237j2679L264J0692j0819l127J3241o109r571J2609J460j3561
995g951P776Q360j3890J211J3845j0716o997J5486l670j2960J2968M026j6121
1008h633O796J1529j4572j648J5997r498j0154J6721n38j6443J1608Q202j7355
1021g988M370J4805j5016m783J8573p916j3371J7266J842j8963J0449J2134j8223
1034f821M82J7629j3512q290K0425n745j7260J7594N638k1490R052J5550j9478
1047f226k611K0739j1381j2323K0245k448j9777J6741R476k3638N767J9704j8833
$$ plain form
1060 -4565 -11098 12033 2815 -13629 6659 8609 -12896 915 13483 -10218 -7532 15425 -1851
1073 -1851 -13494 10752 5317 -14614 5015 11111 -12937 -2201 14375 -8271 -9239 15191 -277
1086 -277 -15391 9787 8665 -14683 2341 12857 -12177 -4332 16195 -6418 -12096 14508 2030
1099 2030 -16274 8783 10529 -15615 -328 14640 -10125 -6756 15846 -4661 -14136 14511 5582
1112 5582 -17526 5972 12798 -14392 -2252 16051 -8630 -9770 15207 -1565 -14670 12496
1124 12496 7226 -18295 3443 15790 -12656 -6140 15800 -6030 -11167 14957 1068 -16026
1136 -16026 10193 9434 -17076 1735 16840 -12058 -9422 16475 -2161 -13114 12037 2917 -16082
1149 -16082 8829 11608 -16937 -1078 17664 -10259 -10777 17032 134 -15660 9965 6863 -14604
$$ packed form
1060d565o533K3131r218j6444K0288J950k1505J3811J2568k3701K686K2957j7276
1073a851j1643K4246n435j9931J9629O096k4048J0736J6576k2646r68K4430j5468
1086b77j5114K5178j122k3348J7024J0516k5034P845K0527k2613n678K6604j2478
1099B030j8304K5057J746k6144J5287J4968k4765L369K2602k0507r475K8647q929
1112E582k3108K3498O826k7190J2140J8303k4681j140K4977j6772j3105K7166
1124A2496n270k5521K1738J2347k8446O516K1940k1830n137K6124j3889j7094
1136a6026K6219p59k6510J8811J5105k8898K636K5897j8636j0953K5151r120j8999
1149a6082K4911K779k8545J5859J8742k7923n18K7809j6898j5794K5625l102k1467
$$ plain form
1162 -14604 5643 11838 -16001 -2975 19229 -8116 -14003 15636 2688 -16426 8547 9623
1174 9623 -14657 1522 13010 -12101 -4375 17890 -6699 -15718 15386 6815 -17298 4696 11545
1187 11545 -13233 -922 14299 -9943 -7819 15811 -3480 -14956 13850 7791 -18508 2347
1199 2347 15079 -10707 -4716 13510 -7291 -9050 15626 -511 -16186 10851 9221 -17039 1468
1212 1468 16084 -10785 -8450 14070 -2843 -10303 12604 883 -16357 9703 12159 -16202 -2003
1225 -2003 16049 -8594 -9226 14636 -874 -12977 9808 4476 -14148 6782 11749 -15793 -4195
1238 -4195 17722 -5352 -11989 12090 1344 -12626 9106 6937 -14162 2913 12326 -12025 -4637
1251 -4637 16664 -4733 -14294 11526 5724 -12563 5028 7127 -12893 1817 13726 -10577 -7704
$$ packed form
1162a4604K0247O195k7839J3026K2204k7345n887K9639j2948j9114K4973J076
1174I623k4280J6179J1488k5111P726K2265k4589r019L1104q571k4113K1994O849
1187A1545k4778J2311J5221k4242K124K3630j9291j1476K8806o059k6299K0855
1199B347J2732k5786N991J8226k0801j759K4676j6137j5675K7037j630k6260J8507
1212A468J4616k6869K335K2520j6913p460K2907j1721j7240K6060K456k8361J4199
1225b003J8052k4643o32K3862j5510j2103K2785n332j8624K0930M967k7542J1598
1238d195K1917k3074o637K4079j0746j3970K1732k169k1099J7075R413k4351P388
1251d637K1301k1397r561K5820n802j8287J7591K099k0020J4710J1909k4303K873
$$ plain form
1264 -7704 14892 -2256 -13174 11053 6626 -14142 2335 10187 -9414 -704 11733 -9562 -8233
1277 -8233 15573 343 -14740 7834 7561 -12498 1825 11136 -9250 -4429 11404 -4834 -7753
1290 -7753 12755 482 -15041 7139 10882 -11101 -1927 10064 -7117 -4462 11733 -3228 -10100
1303 -10100 9346 3083 -11956 5434 9859 -11551 -3878 11795 -3269 -6143 8537 -2201 -9162
1316 -9162 9643 5202 -12290 1826 9554 -8182 -3336 10889 -3471 -8554 7617 1683 -7721
1329 -7721 6327 3896 -11725 1823 11783 -6607 -6360 8497 -1203 -6550 7505 2009 -9112
1342 -9112 3511 5777 -7879 597 9328 -6915 -7239 9510 2149 -7501 3318 2076 -6643 4066
1356 4066 6422 -7883 -2411 8410 -2987 -5575 7634 1353 -8702 2472 5444 -4527 612
$$ packed form
1264g704K2596j7148j0918K4227m427k0768J6477P852j9601Q710J2437k1295J329
1277h233K3806j5230j5083K2574k73k0059J4323R311k0386M821J5833j6238k919
1290g753K0508j2273j5523K2180L743k1983R174J1991j7181K655J6195j4961o872
1303a0100J9446o263j5039J7390M425k1410P673J5673j5064k874J4680j0738o961
1316i162J8805m441j7492J4116P728j7736M846J4225j4360n083J6171n934r404
1329g721J4048k431j5621J3548R960j8390K47J4857r700n347J4055n496j1121
1342i112J2623K266j3656Q476Q731j6243l24J6749p361r650J0819j242q719J0709
1356D066K356j4305N472J0821j1397k588J3209o281j0055J1174K972r971N139
$$ plain form
1369 612 3742 -6653 -1175 9357 -2160 -7859 4729 3145 -5639 2217 4524 -5258 -1367 5019
1383 5019 -2543 -1478 5888 -3061 -6960 6098 5118 -6340 -1447 3617 -2482 -8 4388 -3066 -3531
1398 -3531 4673 190 -4337 4077 2932 -6685 -881 6307 -561 -2799 1281 -1752 -957 5022 -154
1413 -154 -5772 1419 3749 -3054 -699 3966 -1911 -3557 2468 1669 -834 1247 -1575 -3500 3436
1428 3436 4390 -3657 -3313 2559 962 -1190 1223 -17 -2307 445 1105 -803 1383 1002 -3753 -1270
1444 -1270 4405 1656 -3039 -1602 781 1255 1426 -311 -2108 -213 1530 -152 -341 1305 -544 -2620
1460 -2620 183 2845 1071 -2056 -2377 397 2562 1237 -1441 -2053 155 1911 599 -968 106
1475 106 69 -1436 -111 2565 905 -2538 -1769 1026 1781 1174 -1131 -3222 297 3647 87 -2332
$$ packed form
1369F12L130j0395N478J0532j1517n699J2588j584q784P856K307r782L891O386
1383E019p562J065P366q949l899J3058r80j1458M893N064o099K474M396p454m65
1398c531Q204m483m527Q414j145r617N804P188o868k238M080l033P95N979n176
1413a54n618P191K330o803K355M665n877j646O025p99k503K081k822j925O936
1428C436R54q047L44N872j597k152K413j240k290K752O60j908K186l81m755K483
1444a270N675k749m695J437K383M74J71j737j797J895J743j682j89J646j849k076
1460b620K803K662j774l127l21K774K165j325k678o12K208J756j312j567J074
1475A06l7j505J325K676j660l443P69K795P55o07k305k091L519L350l560k419
$$ plain form
1491 -2332 571 396 -1447 1215 2168 -1323 -1542 225 -419 1369 2892 -2525 -4364 2682 3666 -2060
1507 -2060 -1256 790 -1712 406 3176 -1083 -2186 1643 -475 -2044 3742 2316 -5305 -1881 4461
1522 4461 419 -1465 1110 -2391 -2050 4549 1286 -4542 834 2511 -3461 158 5186 -2062 -4529
1537 -4529 2591 1660 -1437 2678 -452 -5754 2464 5928 -3643 -3110 3675 -1344 -2890 4642 1129
1552 1129 -5195 942 2545 -3091 1961 4397 -5867 -3654 7143 1281 -4968 2195 758 -4498
1566 -4498 3306 4382 -5380 -1682 4698 -2916 -2286 6760 -941 -7838 3364 5066 -4021 342 2985
1581 2985 -5422 -319 7821 -2421 -5817 4765 937 -5677 4280 4557 -7294 -1845 6134 -2264
1595 -2264 -1819 5369 -3705 -6150 7363 3742 -7549 919 4590 -5344 17 7429 -3837 -5508
$$ packed form
1491b332K903j75j843K662R53l491k19J767o44J788J523n417j839P046R84n726
1507b060Q04K046k502K118K770m259j103L829k118j569N786j426p621L424O342
1522D461m042j884K575l501L41O599l263n828N376J677n972L619N028p248k467
1537d529P120r31l097M115l130n302Q218L464r571N33O785n019j546P532l513
1552A129o324O137J603n636N052K436j0264K213J0797n862o249P163j437n256
1566d498P804J076r762L698O380p614O30R046p701o897J1202J702r087M363K643
1581B985q407N103Q140j0242l396J0582l828o614R957K77j1851N449P979q398
1595b264M45P188r074k445J3513l621j1291Q468L671r934N361P412j1266j671
$$ plain form
1609 -5508 5701 378 -4931 5587 1831 -9398 1767 8456 -4698 -3452 5549 -3137 -4189 7846
1623 7846 954 -8165 3144 4314 -6282 1892 7319 -7106 -5164 8674 421 -5977 4550 475
1637 475 -7609 4811 6486 -7722 -2028 7056 -4085 -3678 8703 -782 -9143 4580 5091 -5914
1651 -5914 1852 4732 -7884 -1284 9945 -2878 -7003 6040 640 -7121 5500 5222 -8800 -1130
1665 -1130 7360 -3912 -2145 7448 -4066 -7561 8299 3810 -8340 2079 4835 -7192 424
1678 424 8829 -4907 -5987 6799 -344 -5784 6853 2221 -10303 2088 8677 -5541 -2843 6617
1692 6617 -4197 -4778 8800 936 -8618 3702 4214 -7091 2210 7796 -7356 -5139 8658 -158
1706 -158 -5832 5451 268 -8268 5039 6924 -7687 -1899 7071 -4337 -3603 8736 -876 -8767
$$ packed form
1609e508J1209n323n309J0518l756j1229J1165O689j3154J246R001q686j052J2035
1623G846o892r119J1309J170j0596Q174N427j4425J942J3838q253o398J0527m075
1637D75q084J2420J675j4208N694R084j1141M07J2381r485q361J3723N11j1005
1651e914P766K880j2616O600J1229j2823m125J3043n400p761J2621k78j4022P670
1665a130Q490j1272J767R593j1514l495J5860m489j2150J0419K756j2027P616
1678D24Q405j3736j080J2786p143n440J2637m632j2524J2391O589j4218K698R460
1692F617j0814n81J3578p864r554J2320N12j1305R301N586j5152K217J3797q816
1706a58n674J1283n183q536J3307J885j4611N788Q970j1408P34J2339r612p891
$$ plain form
1720 -8767 4679 4276 -6259 2664 5042 -8403 -1680 9958 -2699 -6645 5904 308 -6824 5644
1734 5644 4738 -8317 -218 6823 -4727 -1718 8186 -3971 -7965 7601 3920 -7542 1926 3968
1748 3968 -6877 976 8258 -5276 -5324 7140 -613 -6207 6627 3038 -9397 1083 7568 -4481
1762 -4481 -1727 5791 -4844 -4416 8951 798 -8677 3440 4385 -6669 1352 7099 -5916 -4197
1776 -4197 7071 -962 -4509 6195 -210 -8626 4833 7162 -6923 -2129 6041 -3611 -2671 7326
1790 7326 -1605 -7000 4996 2669 -6509 3355 5404 -8082 -2349 8652 -1421 -4978 4361 -912
1804 -912 -5006 6236 3107 -8195 749 6511 -4900 -2292 7398 -2375 -6628 4918 2572 -4631
1818 -4631 2771 1597 -7102 2299 8044 -5249 -5242 6283 362 -5003 4316 2152 -5969 1307 3989
$$ packed form
1720h767J3446m03j0535Q923K378j3445O723J1638j2657l946J2549n596p132J2468
1734E644r06j3055Q099P041j1550L009R904j2157l994J5566l681j1462R468K042
1748C968j0845P853P282j3534m8J2464p753n594J2834l589j2435J0480O485j2049
1762d481K754P518j0635M28J3367q153r475J2117R45j1054Q021N747j3015J719
1776d197J1268q033l547J0704o405q416J3459K329j4085M794Q170r652R40R997
1790G326q931n395J1996k327r178R864K049j3486N733J1001j0073l557R339n273
1804i12m094J1242l129j1302Q944N762j1411K608R690r773m253J1546k346p203
1818d631P402j174q699R401N745j3293PJ1525n921n365R319k164q121P276K682
$$ plain form
1833 3989 -4209 892 5284 -5893 -4345 8383 1625 -7285 1473 3135 -3649 1578 3703 -4874
1847 -4874 -1237 5440 -2733 -3330 6480 15 -7903 2761 6079 -3654 -1873 2431 -2849 55 5406
1862 5406 -2903 -5051 4875 1860 -5558 2272 4755 -4933 -2513 4917 -102 -1821 2420 -2406 -3155
1877 -3155 5760 2247 -6607 13 4866 -2622 -1875 4101 -1137 -3646 2682 898 -2282 2945 572
1892 572 -5651 1487 6131 -2677 -4000 2855 524 -1964 2615 428 -3660 1439 2303 -3059 641
1907 641 3778 -3523 -3338 4542 1818 -3312 217 590 -1795 2311 2250 -3728 -1160 3560 -908 -2185
1923 -2185 3018 318 -3899 958 2785 -1312 -216 645 -2591 217 4088 -1071 -3596 1598 1693 -1708
1939 -1708 746 1493 -2296 -715 2191 -425 -585 1641 -1502 -2382 2671 2221 -2550 -1190 1167 -283
$$ packed form
1833C989q198N101M392j1177J548J2728o758q910Q758J662o784N227K125q577
1847d874L637O677q173n97R810o465p918J0664L318r733J781M304n280K904N351
1862E406q309k148R926l015p418P830K483r688K420P430n019j719M241m826p49
1877c155Q915l513q854O620M853p488P47N976n238k509O328j784l180N227k373
1892E72o223P138M644q808j323O855k331k488M579k187m088N099Q64n362L700
1907F41L137p301J85P880k724n130L529L73k385M106o1n978K568M720m468j277
1923b185N203k700m217M857J827m097J096Q61l236K808L871n159k525N194R5l401
1939a708K454P47l789J581K906k616j60K226l143q80N053m50m771J360K357j450
$$ plain form
1955 -283 411 1481 -1516 -1653 1754 703 -1294 1015 554 -2269 -43 2403 -96 -1238 -146 -628
1971 -628 210 1942 -177 -2411 31 1568 -303 -277 661 -877 -857 1031 678 -273 46 -735 -856 1299
1989 1299 1474 -1097 -1600 364 1003 289 -44 -607 -727 400 656 -55 -4 -125 -751 -46 1099 773 -720
2008 -720 -1305 74 1261 551 -615 -882 -233 624 680 -143 -607 -176 -26 -188 585 838 -890 -1285 665
2027 665 1135 72 -319 -732 -535 1164 1043 -1053 -760 667 -104 -398 1059 267 -1511 -195 901
2044 901 32 369 163 -1651 -284 2187 160 -1652 254 554 -795 540 1069 -1260 -717 1158 -345
2061 -345 -380 1515 -724 -2225 1405 1804 -1420 -625 807 -955 78 1915 -755 -1734 1371 523 -1498
2078 -1498 1156 1259 -2418 -547 2361 -433 -1103 1181 -799 -1402 2289 845 -2601 244 1822 -1505
$$ packed form
1955b83O94J070k997j37L407j051j997K309m61k823K226K446k499j142J092m82
1971f28Q38J732k119k234K442J537j871K6R38j538K0J888l53r51L19p81j21K155
1989A299J75k571n03J964O39p14l33n63j20J127K56p11N1j21o26P05J145l26j493
2008g20n85J379J187p10j166k67O49Q57N6q23m64M31J50j62P73K53j728l95J950
2027F65M70j063l91m13J97J699j21k096K93J427p71k94J457p92j778J316J096
2044I01q69L37k06j814J367K471k027j812J906L00j349J335N29k329N43J875j503
2061c45l5J895k239j501L630L99l224P95J432j762J033J837k670r79L105q48k021
2078a498K654J03l677J871K908k794o70K284j980o03L691j444l446K845J578l327
$$ plain form
2094 -1505 -239 2275 -1182 -1987 2010 610 -1736 1273 569 -2741 863 2823 -1920 -1660 2160 -469
2110 -469 -1609 2240 518 -2889 940 2001 -2068 135 2439 -2187 -1613 3329 160 -2630 1427
2125 1427 878 -2436 1234 2273 -2806 -975 2878 -1069 -1763 2816 -254 -3322 2007 2165 -2689 177
2141 177 2198 -2452 -652 3499 -1155 -2839 2455 706 -2873 1741 1989 -3435 -275 3316 -1756
2156 -1756 -1549 2957 -961 -2752 3086 1327 -3569 848 2501 -2645 -256 3399 -1927 -2454 3198
2171 3198 239 -2914 2174 1212 -3756 880 3363 -2668 -1407 3197 -1269 -2286 3281 439 -3645
2186 -3645 1656 2278 -3067 320 3152 -2785 -1697 3876 -599 -3105 2573 751 -3384 1756 2635
2201 2635 -3346 -653 3373 -1752 -1794 3547 -493 -3570 2583 1940 -3398 719 2694 -2990 -735 3740
$$ packed form
2094a505J266K514l457q05L997j400k346L009p04l310L604J960m743K60L820k629
2110d69j140L849j722l407L829J061m069K203K304m626N74M942l169k790M057
2125A427n49l314L670J039n079J831L853l947o94M579l070l068N329J58m854K866
2141A77K021m650J800M151m654j684N294j749l579M614K48n424L160L591n072
2156a756K07M506l918j791N838j759m896M417J653n146K389L655n326n27N652
2171C198k959l153N088r62m968M636K483o031J261M604m466j017N567k842m084
2186c645N301O22n345L387K832n937J088N573m475k506N678j822m135N140Q79
2201B635n981K693M026n125m2N341m040l077O153o43n338M117J975n684K255M475
$$ plain form
2217 3740 -1493 -2837 3006 430 -3284 2089 2087 -3710 25 3504 -2180 -1582 3436 -1103 -2939 3144
2233 3144 1179 -3659 1217 2468 -3036 -149 3495 -2152 -2345 3396 -47 -3146 2423 1371 -3720
2248 -3720 1039 3118 -2774 -1037 3344 -1562 -2281 3462 262 -3622 1875 2182 -3254 296 3104
2263 3104 -2685 -1568 3635 -816 -2840 2810 586 -3500 1794 2619 -3279 -536 3402 -1775 -1924
2278 -1924 3288 -432 -3226 2555 1551 -3453 1010 2756 -3099 -839 3716 -1444 -2656 2901 305
2293 305 -3028 1995 1816 -3429 376 3197 -2441 -1381 3480 -1112 -2859 2927 907 -3363 1306
2308 1306 2064 -2929 86 3133 -2230 -1912 3333 -348 -2926 2430 1234 -3302 1059 2609 -2622
2323 -2622 -578 3053 -1665 -1951 3167 21 -3181 1898 1763 -2950 411 2635 -2413 -1071 3256
$$ packed form
2217C740n233j344N843k576l714N373kn797L735L479n684N98N018m539j836O083
2233C144j965m838M876J251n504K887L644n647j93N741l443l099N569j052n091
2248c720M759K079n892J737M381m906p19N743l200l884N497L07n436L550K808
2263C104n789J117N203m451k024N650k224m086N294Q25n898K743L938n177j49
2278a924N212l720k794N781j004n004M463J746n855K260M555n160j212N557k596
2293C05l333N023j79n245L805K821n638J060M861m592j747N786k020m270M669
2308A306P58m993L015L047n363L18N245l681k578N356j196m536M361J550n231
2323b622K044L631m718k86N118l146l202N079j35m713L361K224n048J342M327
$$ plain form
2338 3256 -968 -2402 2687 455 -2965 1651 2014 -2880 -170 2766 -1762 -1379 2848 -630 -2637
2353 -2637 2295 1094 -2939 917 2072 -2478 -372 2809 -1472 -1710 2598 -44 -2440 1902 1279
2368 1279 -2796 458 2367 -1883 -874 2471 -1054 -1804 2397 188 -2604 1426 1578 -2447 78
2383 78 2398 -1579 -1282 2280 -313 -1841 1791 479 -2359 1160 1829 -2288 -414 2362 -1131 -1488
2399 -1488 1936 -11 -1924 1248 815 -1936 669 1677 -1920 -605 2465 -734 -1843 1724 493
2414 493 -1858 897 1034 -1654 261 1581 -1473 -672 2081 -593 -1867 1609 910 -1850 438 1231
2430 1231 -1325 -62 1519 -1182 -779 1779 -292 -1664 1248 861 -1777 101 1424 -991 -521 1257
2446 1257 -636 -851 1456 3 -1546 1005 968 -1428 51 1354 -797 -697 1187 -211 -904 947
$$ packed form
2338C256m224j434N089k232l420M616L63m894K710K936m528L83M227l478k007
2353b637M932j201m033L856J155m550K106L181m281k38M308k642k396M342o23
2368A279m075L254J909m250J009L345l525p50M201k209k792M030J52m025K525
2383G8K320l977K97L562k593j528L632j312k838L519O69m117J874K776l493l57
2399a488L424j947j913L172m33k751K605J008l597J315L070l199j109L567j231
2414D93k351K755J37k688J915J320l054Q01K753k674j274L476o99k760K288P93
2430A231k556J263J581k701M03K558k071j372K912l87k638J878J323k415M70J778
2446A257j893k15K307j453j549K551l7k396J479J303k151J00J884j398o93J851
$$ plain form
2462 947 208 -1318 692 942 -1352 -258 1262 -538 -659 1044 -42 -957 740 401 -934 315
2478 315 784 -905 -221 1099 -321 -873 759 175 -824 505 398 -822 47 708 -558 -329 844
2495 844 -160 -651 642 348 -737 135 479 -594 35 584 -419 -355 566 -9 -540 273 207 -547 23
2514 23 459 -265 -193 431 -134 -266 439 53 -427 221 293 -257 7 184 -199 -157 198 46 -179 63 76 -174
2536 -174 71 185 -116 -101 138 73 9 19 72 -5 -87 68 74 -146 -82 130 -83 -45 162 -96 -240 120 151 -151
2560 -151 -123 182 -55 -117 245 12 -304 213 191 -316 146 339 -398 -191 449 -66 -301 186 66 -418 200
2581 200 373 -478 -25 582 -383 -313 682 27 -614 354 288 -514 154 399 -558 -76 743 -335 -627 677
2601 677 175 -807 399 576 -647 -36 594 -514 -183 825 -330 -677 792 366 -980 295 751
$$ packed form
2462I47p39j526K010K50k294J094J520j800j21J703j086r15J697l39j335J249
2478C15M69j689O84J320j420n52J632n84r99J329j07j220Q69O61j266K29J173
2495H44j004m91J293k94j085Q72L44j073O29N49j003O4R21n75n31Q13o6p54N70
2514B3M36p24P2O24n65j32P05l86m80O48P2n50K64J77l83M2L55j52k25K42J3k50
2536a74K45J14l01J5K39o5o4J0N3p7q2J55Ok20O4K12k13L8K07k58j44L60L1l02
2560a51K8L05k37o2L62k33l16N17k2n07M62J93p37K07O40n15k35M87j20m84O18
2581B00J73q51M53O07r65P0R95o55o41R68o6q02O68K45r57M82Q19j078k92J304
2601F77n02r82J206J77j223O11O30j108L31J008j155l47J469m26j346J275M56
$$ plain form
2618 751 -726 -186 864 -500 -517 887 -173 -845 774 413 -1157 189 1043 -684 -443 914 -330
2635 -330 -707 885 100 -1047 730 668 -1236 8 1254 -786 -676 1113 -83 -881 830 249 -1168
2652 -1168 605 863 -1226 -175 1403 -729 -933 1347 83 -1210 754 481 -1204 460 975 -1203
2668 -1203 -316 1482 -583 -1137 1288 294 -1380 692 831 -1277 212 1208 -1078 -555 1536 -403
2684 -403 -1293 1251 466 -1485 561 1069 -1356 -141 1458 -865 -755 1628 -200 -1457 1165 771
2700 771 -1538 366 1234 -1222 -304 1513 -742 -1114 1508 46 -1559 1027 895 -1598 201 1450
2716 1450 -1141 -528 1570 -587 -1187 1483 311 -1677 753 1144 -1436 -72 1510 -1022 -857 1629
2732 1629 -308 -1442 1279 521 -1770 544 1334 -1290 -450 1485 -713 -926 1589 -66 -1690 1151
$$ packed form
2618G51j477N40J050j364j7J404j060o72J619l61j570J346Q54j727K41J357j244
2635c30l77J592p85j147J777o2j904J244J246k040J10J789j196p98J711n81j417
2652a168J773K58k089J051J578k132k04K280j264j293J964k73j685J664N15k178
2668a203Q87J798k065n54K425r94j674K072J39k108J489R96k286N23K091j939
2684d03q90K544p85j951K046N08k425J215J599k323J10K383j828j257K622l94
2700G71k309J904Q68k456R18J817k255l72K622j462j605K586j32k493J799J249
2716A450k591O13K098k157o00K670j172j988K430L91k580J364J582k532J65K486
2732A629j937j134K721p58k291K314P90k624Q40J935k198k13K515j655j624K841
$$ plain form
2748 1151 933 -1774 166 1596 -1210 -722 1601 -424 -1200 1294 97 -1625 959 1126 -1734 -117
2764 -117 1768 -924 -1016 1533 -129 -1433 1163 499 -1568 679 1140 -1674 -241 1925 -730 -1353
2780 -1353 1438 265 -1396 957 747 -1582 406 1434 -1331 -497 1799 -670 -1435 1498 536 -1596
2796 -1596 541 978 -1379 153 1464 -1208 -888 1767 -269 -1574 1253 652 -1704 411 1355 -1187
2812 -1187 -320 1357 -879 -901 1636 -40 -1808 973 999 -1511 215 1377 -1197 -509 1559 -537
2828 -537 -1094 1373 120 -1643 944 1209 -1502 -228 1430 -754 -681 1467 -465 -1379 1272 510 -1606
2845 -1606 510 1178 -1433 -327 1560 -609 -992 1167 -108 -1225 1140 662 -1695 240 1455 -1006
2861 -1006 -552 1372 -528 -1029 1216 228 -1335 691 708 -1363 145 1485 -983 -938 1329 -62 -1009
$$ packed form
2748A151k18k707J940J430k806M88K323k025p76K494j197j722K584J67k860J617
2764a17J885k692r2K549j662j304K596o64k067K247M61k814J433K166k655o23
2780a353K791j173j661K353k10k329J988J028k765Q34K296k469p65K933r62k132
2796a596K137M37k357J532J311k672L20K655k036j305K827o01k356K115R44k542
2812a187Q67J677k236k2K537j676j768K781K6k510J726J162k574O88K068k096
2828e37n57K467j253j763K587K65k711J274J658k184P3K148j932r14K651p62k116
2845a606K116O68k611J106J887k169l83K159j275j117K365m78k357J935J215k461
2861a006M54J924j900n01K245r88j563K026J7k071J508J340k468M5K267j391r47
$$ plain form
2878 -1009 1024 250 -1344 655 1023 -1158 -229 1226 -776 -807 1242 112 -1155 634 500 -1097
2894 -1097 479 928 -1177 -429 1371 -282 -840 859 116 -1036 728 715 -1036 99 873 -844 -386
2911 -386 1324 -252 -1228 707 547 -835 375 447 -979 71 1152 -642 -695 1020 -30 -1012 725
2928 725 652 -927 -99 640 -542 98 784 -762 -682 1101 293 -1059 256 612 -708 -18 766 -394
2946 -394 -326 595 -338 -414 959 58 -1217 294 953 -495 -381 370 -300 -174 649 -179 -551 529 204
2965 204 -854 357 926 -726 -637 660 243 -232 198 -276 -419 671 385 -776 -96 624 -419 -406
2983 -406 709 137 -660 64 242 -123 448 100 -850 102 928 -204 -606 313 168 -298 250 249 -314 -26
3003 -26 198 -337 178 564 -428 -610 513 484 -281 -194 39 -111 186 233 -315 -198 272 -79 -310 443 210
$$ packed form
2878a009K033p74j594J999L68k181R29J455k002l1K049j130j267J789j34j597
2894a097J576M49k105P48J800j653n58J699p43j152J764j3j751J135P74j717M58
2911c86J710j576r76J935j60j382J210P2j426J050J081j794n3J715j050r82J737
2928G25p3j579Q28P39j182O40O86j546Q0J783q08j352J315L56j320O90P84j160
2946c94O8R21r33p6J373r01j275J511O59j448J14P51o70J26Q23q28l72J080l25
2965B04j058J211N69j652Q9J297m17m75M30m74j43J090k86j161O80P20j043J3
2983d06J115n72p97P24J78l65N71l48r50R52Q26j132m02R19j45m66N48jn63K88
3003b6K24n35N15L86r92j82J123k9p65Q7K33j50K97M7n48J17M70l51k31P53k33
$$ plain form
3024 210 -547 -165 379 195 -63 -132 -304 119 536 30 -446 -31 237 -92 -54 278 -35 -312 -51 113 198
3045 198 89 -317 -348 226 481 -80 -386 -14 269 83 -4 30 -76 -112 7 114 152 -6 -290 -236 203 393
3067 393 -121 -455 -8 303 155 34 -117 -178 43 259 52 -24 54 -176 -174 346 372 -279 -406 134 136 164 117
3090 117 -362 -354 350 255 -177 16 63 -305 -42 509 27 -378 3 19 -36 442 101 -650 -114 548 -12 -182
3112 -182 166 -186 -286 491 263 -364 -70 147 -327 230 614 -282 -562 359 215 -132 319 -91 -631 171
3132 171 631 -310 -328 240 -243 -228 638 168 -681 76 330 -317 230 486 -643 -443 714 260 -445 169
3152 169 11 -486 410 556 -547 -300 554 -252 -281 748 -12 -853 332 552 -355 72 253 -692 1
3171 1 966 -145 -749 415 178 -556 421 483 -825 -209 598 -316 -99 631 -502 -782 871 564 -797
$$ packed form
3024B10p57L82N44j84k58o9j72M23M17n06m76M15K68l29L8L32l13k77K61J64Q5
3045A98j09m06l1N74K55n61l06L72K83j86q7L4j06l6J19J07L8j58k84N4M39J90
3067C93n14l34M47L11j48j21j51o1K21K16k07p6P8k30KN20K6o51j27N40KK8m7
3090A17m79QP04r5m32J93M7l68K63N51m82m05L81J6n5M78l41p51N36O62n60j70
3112a82L48l52j00P77k28o27K94K17m74N57L84q96k80R21j44l47M51m10n40Q02
3132A71M60r41j8N68m83J5Q66m70q49P57K54o47N47K56j129K00J157m54p05O14
3152A69j58m97Q96J46j103K47Q54q06k9J029p60q41J185K20r07M27J81r45O93
3171AR65j111o04J164k37p34R77O2j308O16Q07r14K17P30j133k80J653l07j361
$$ plain form
3190 -797 -53 447 -425 67 788 -447 -596 740 74 -583 673 281 -1082 58 976 -291 -366 411
3208 411 -368 -296 968 2 -1028 332 642 -691 104 824 -698 -573 795 107 -478 437 -139 -839
3226 -839 687 834 -953 -405 792 -230 -416 859 -115 -852 453 390 -643 373 538 -1066 -231
3243 -231 1286 -110 -870 379 101 -502 617 416 -1018 -55 822 -513 -220 938 -386 -1003 796
3260 796 559 -717 49 292 -754 210 975 -716 -829 865 74 -736 651 343 -1034 40 884 -428
3278 -428 -133 640 -663 -484 1148 204 -1086 231 637 -661 116 795 -751 -529 849 -113 -555 711
3296 711 -15 -1042 549 976 -800 -400 600 -431 -267 935 -223 -1038 608 511 -756 280 634
3313 634 -905 -239 1014 -136 -694 512 -148 -682 792 632 -1088 -171 884 -366 -210 814 -411
$$ packed form
3190g97P44N00q72M92P21j235j49J336o66o57J256l92j363J140R18j267p5P77
3208D11p79P2J264r66j030J360L10j333P95P20j522J25J368o88n85R15n76p00
3226h39J526J47j787N48J197j022j86J275r74p37J305o3j033J016J65j604Q35
3243b31J517j396p60J249k78o03J119k01j434R63Q77j335K93J158j324o17J799
3260G96k37j276P66K43j046R64P65j691j13J694p91q10J387l08j377J074Q44j312
3278d28K95P73j303J79J632r44j290J317M06j298P77O79j546K22J378r62m42J266
3296G11p26j027J591M27j776M00J000j031J64J202j158q15J646r7j267J036L54
3313F34j539O66J253j150n58J206o60n34J474j60j720R17J055j250J56J024j225
$$ plain form
3330 -411 -812 783 436 -700 289 345 -793 52 1044 -498 -708 605 -6 -482 689 163 -1099 237
3348 237 848 -590 -244 634 -458 -551 837 199 -796 226 255 -668 386 804 -836 -506 934 47
3366 47 -520 496 29 -801 488 652 -635 -68 547 -586 -281 1012 -137 -970 394 441 -494 301
3384 301 322 -855 -68 922 -307 -559 552 -128 -678 627 559 -702 -165 438 -354 73 661 -555 -691
3403 -691 810 328 -615 239 334 -604 79 736 -357 -356 450 -151 -368 768 131 -1009 183 706 -359
3422 -359 -75 367 -377 -256 638 -1 -580 353 94 -587 327 700 -631 -478 523 31 -182 368 -183
3441 -183 -547 444 477 -485 -53 366 -425 -166 660 18 -612 174 110 -182 389 165 -729 -25 692 -146 -353
3462 -353 311 -96 -344 429 315 -449 -28 174 -260 122 483 -403 -516 443 273 -298 112 75 -475 137
$$ packed form
3330d11m01J595l47j136R89N6j138Q45R92j542k10J313o11m76J171n26j262J336
3348B37O11j438L46Q78j092r3J388o38r95J022K9r23J054M18j640L30J440q87
3366D7n67J016m67q30J289J64j287N67O15j133L05J293j149q33J364M7r35P95
3384C01K1j177P87R90j229k52J111o80n50J305o8j261N37O03p92M27N88j216j36
3403f91J501m82r43Q54R5r38O83O57j093JQ06o01k17J136o37j140J192N23j065
3422c59K84M42p44J21Q94o39n79R33k59o81R14L73j331J53J001m92k13N50n51
3441a83l64R91L3r62M32M19p91K59Q26o42o30P86o4k92N71k24q94P04P17q38k07
3462c53O64m07k48P73j14p64M21K02m34L82L61q86j13R59j70n71M10l7n50O12
$$ plain form
3482 137 458 -201 -212 212 -168 -146 452 64 -526 19 358 -96 47 180 -404 -179 427 130 -273 61 16
3503 16 -283 197 352 -313 -259 217 -1 -50 280 -152 -431 171 287 -138 -90 45 -210 31 377 -33 -277
3524 -277 28 99 -45 172 127 -328 -121 288 47 -17 32 -172 -136 280 185 -202 -173 60 -28 76 185 -152 -188
3547 -188 74 69 -26 31 -163 -210 98 274 -54 -186 -93 -64 80 112 8 -211 -72 66 116 99 -51 -189 -54
3570 -54 109 107 -19 -122 -126 10 144 100 -114 -145 10 57 119 20 -93 -142 -72 130 187 -53 -187 -62 140 165 118
3595 118 -84 -208 25 210 13 -90 -74 -57 -43 164 58 -147 -150 18 -32 134 145 -242 -187 234 165 -133 -29
3618 -29 0 -124 122 195 -141 -92 96 -96 -59 274 -17 -357 98 218 -61 13 34 -187 -50 332 -75 -215
3640 -215 106 -11 -195 223 262 -338 -158 263 24 -54 246 -192 -303 326 229 -266 20 202 -224 14 462
$$ packed form
3482A37L21o59j1M24l80K2N98l88n90N45L39m54J43J33n84K25O06k97m03L34m5
3503A6k99M80J55o65N4M76k18m9L30m32k79O02J16m25M8J35k55K41L46m10k44
3524b77L05P1j44K17m5m55K07M09k41o4M9k04L6M16r5l87K9K33q8J04J09l37l6
3547a88K62nr5N7j94m7L08J76l28j32R3K9J44L2j04k19J39J38N0j7j50j38J35
3570e4J63kj26j03mJ36J34m4k14l1J55M7O2r9j13m9P0K02N7k40j34J25K02K5m7
3595A18k02j24K33J85j97j03J6J7J4K07j06k05lJ68n0J66J1l87N5M21o9k98J04
3618b9K9j24K46P3l36M9J88j92L7L33k91l40M55J20k79P4K1k21J37L82m07j40
3640b15L21j17j84M18L9o00J80M21k39p8L00m38j11O29r7m95K86J82m26K38M48
$$ plain form
3661 462 -70 -302 160 81 -178 218 104 -454 34 361 -185 -208 252 -153 -295 356 150 -389 66 189 -256
3682 -256 81 343 -331 -267 397 135 -292 187 88 -428 145 370 -271 -146 318 -142 -192 462 14 -469 193
3703 193 348 -258 -28 294 -431 -103 518 -20 -355 232 32 -438 316 358 -512 -164 370 -169 -233 366 -170
3724 -170 -452 345 239 -387 83 280 -409 -86 528 -201 -380 357 70 -368 279 141 -561 45 477 -345
3744 -345 -201 442 -237 -344 521 161 -488 171 246 -390 28 503 -403 -350 532 -24 -377 396 117 -554 183
3765 183 445 -372 -162 447 -272 -310 517 22 -578 241 339 -457 145 368 -464 -165 585 -144 -399 398 48
3786 48 -494 316 387 -524 -152 506 -264 -177 541 -191 -529 485 212 -563 218 327 -517 -107 548 -251 -365
3807 -365 435 -65 -486 431 167 -626 60 507 -239 -150 512 -229 -380 446 113 -455 253 337 -469 70 535
$$ packed form
3661D62n32k32M62p9k59L96j14n58M88L27n46k3M60m05j42O51k06n39M55J23m45
3682b56L37K62o74O4O64k62m27M79r9n16N73K25o41J25M64m60n0O54m48m83O62
3703A93J55o06K30L22p25L28O21n38l35N87k00m70P54M2q70L48N34n39o4N99n36
3724a70k82P97j06o26M70J97o89L23O14p29j79P37k87m38O47j38p02O06M32q22
3744c45J44O43o79j07Q65l60o49O59P5o36M18M75r06N3Q82n56l53P73k79o71P37
3765A83K62q17K10O09p19l8Q27m95o00Q19R8p96O02K23q32K99P50p29k55P97l50
3786D8n42Q10P1r11L72O58p70Q7P18p32l38J014k73p75P81J09q44M10O55p99j14
3807c65Q00n00m21R17k64p93O86M47p46Q9O62p41j51Q26l33n68P08Q4q06N39M65
$$ plain form
3828 535 -431 -306 550 -40 -378 366 68 -504 249 378 -428 -75 526 -286 -259 512 18 -546 279 253 -449
3849 -449 170 341 -549 -155 580 -225 -444 485 91 -521 336 351 -467 3 428 -326 -107 511 -166 -441
3869 -441 485 250 -548 193 341 -425 -2 448 -299 -319 421 -67 -410 405 197 -598 120 483 -345 -142
3889 -142 467 -211 -297 458 2 -457 242 277 -489 59 478 -374 -243 410 -84 -303 360 -40 -409 290 334
3910 334 -445 -69 477 -262 -172 438 -50 -427 290 187 -388 204 265 -420 -96 481 -227 -304 411 25 -355
3931 -355 255 188 -428 48 343 -376 -125 415 -175 -348 406 96 -350 128 208 -309 62 412 -287 -160 397
3952 397 -121 -334 367 140 -384 145 303 -266 -18 282 -262 -151 380 -64 -326 223 158 -343 58 344
3972 344 -244 -145 265 -142 -178 239 -8 -330 209 214 -384 24 295 -226 -185 292 -24 -263 190 111 -263 172
$$ packed form
3828E35r66J25Q56n90l38P44k98n72P53J29q06L53O01q12K7P71m94n64Q25k6p02
3849d49O19J71q90L94P35q05k19R29l94o12Q57J5q18M70M25p54K19O18o77k75
3869d41R26k35p98P41J48p66M23M50p47k0P40m88l43Q15k08p95P18L63q28K03
3889a42O09o78q6P55m56m59O99L5p66N48M19q52J31O53m94k19O63m00l69O99M4
3910C34p79L76N46p39R0O10m88l77P17j03n75N92O1o85L24N77p08p7P15l86l80
3931c55O10o7o16M76K95p19K51N40n90j73P54l10m46M78Q0n17L71L50o99J27N57
3952C97n18k13P01k27n24N29J58n69K48L00n44J11N31m44k62N49o5n01M01K86
3972C44n88R9M10m07l6M17k47l22N39Nn98M08K71n21M1M77l16k39M53p9l74M35
$$ plain form
3994 172 238 -297 24 276 -115 -181 288 -89 -221 182 88 -269 88 221 -242 -61 276 -158 -174 267 28
4015 28 -277 101 109 -254 41 263 -182 -101 279 -52 -171 161 117 -210 96 172 -221 71 219 -172 -104 222
4037 222 -24 -179 85 94 -153 79 124 -147 22 164 -93 -80 223 -69 -173 125 58 -176 -16 103 -163 -22
4059 -22 102 -22 -81 114 47 -116 -6 86 -65 12 103 -89 -17 131 -122 -51 148 -2 -133 63 129 -75 40
4082 40 113 -74 -19 104 -15 -22 91 -9 -45 51 76 -58 -91 -1 -2 -30 -44 -47 -41 31 -63 -48 33 22 -45 7 21 21 -59 -18
4112 -18 -57 14 27 -83 -49 87 71 -18 15 11 -38 34 -14 -17 87 32 -61 -14 110 9 -23 20 49 29 8 -77 -56 56
4140 56 0 -94 -29 69 -35 -98 99 -16 -47 14 -58 -25 99 14 -75 37 116 -40 -29 157 36 -59 63 -22 -75 70
4166 70 -6 -173 -7 129 -104 -52 107 -1 -83 121 -6 -145 57 117 -129 59 91 -143 -97 208 -37 -229
$$ packed form
3994A72O6n35L21K52l91o6M69l77j32M03r4l57L57J33m63J81L37m34j6M41k39
4015B8l05L78Ql63K95K22m45Q1L80l31j19L32m4l27L06P6l93K92J48l91O8L26
4037B22k46j55K64Rk47K32M5k71J69J42k57J3L03k92j04K98o7k34J60J19k66J41
4059b2J24j24n9J95o7j63J10R2j51P7R1j92P2J48k53P1J99j50j31J96O6k04J15
4082D0P3j87N5J23j19pJ13j00l6R6K5j34l3R0jk8j4lOP2r4J5Q1j1o7N2J4%q0M1
4112a8l9P1J3j10L4J36j6q9L3mm9P2m8lJ04n5r3M7J24j01l2M3K9k0k1q5K1J12
4140E6n6r4O5R8j04o3J97j15l1O1p2L3J24q5q9J12P9j56J1J86j21r5J22q5n3J45
4166G0p6j67J66J36k33N2J59j08q2K04j27j39K02O0k46J88L2k34M6L05k45j92
$$ plain form
4188 -229 46 1 -155 138 92 -156 6 187 -120 -65 150 -54 -180 130 156 -174 27 145 -172 -48 163
4209 163 -163 -99 175 20 -190 99 161 -203 20 156 -95 -76 177 -146 -174 208 -3 -246 108 159 -242 -112
4231 -112 193 -140 -111 203 -27 -221 186 64 -319 66 259 -254 -27 219 -80 -151 217 43 -252 176 103
4252 103 -236 104 269 -193 -105 306 -107 -265 212 1 -275 123 185 -281 -36 266 -171 -74 251 -55 -243
4273 -243 221 93 -295 85 201 -269 -41 309 -201 -163 266 -44 -211 238 133 -314 53 255 -251 -73
4293 -73 337 -118 -259 306 42 -368 182 195 -328 52 321 -251 -144 301 -88 -305 248 76 -343 123 260
4314 260 -311 -1 328 -260 -153 364 -32 -283 220 96 -283 121 228 -265 -26 369 -139 -272 365 87
4334 87 -296 190 229 -291 47 248 -265 -151 275 -110 -273 308 53 -354 110 273 -352 -20 328 -247 -174
$$ packed form
4188b29K75m5j56K93m6k48J62J81l07N5K15k04j26L10K6l30K01J18l17J24K11
4209A63l26O4K74j55k10K89O2l64K23J36k51J9K53l23k8L82k11k43L54N1m01J30
4231a12L05l33K9L14k30j94M07j22l83L85J93n13K27K46k99p1L68j74k95M28p3
4252A03l39L40J65m62Q8M11m13j58M77k11k76L98O2m66K45L02m37R7L25l06j88
4273b43M64j28l88L80J16m70K28L50n10L8M29l10j67M49j05m47L67K02n06J78
4293g3M10m55j41N65k64m10N50J3n23L80K69n72J07M45l89k17N53j72m19M66J37
4314B60n71L10L29n88J07N17l96k51N03j24l79M04J07m93K39L95n08j33O37k78
4334H7l83M86L9n20L38K01n13J14M26l85j63N81k55m07M64J63o25L32L48n75P3
$$ plain form
4355 -174 328 -48 -306 295 86 -347 121 258 -315 -81 367 -185 -232 324 -26 -365 224 197 -311 82 310
4376 310 -244 -111 311 -121 -207 350 67 -425 84 175 -368 7 276 -231 -149 354 -120 -260 283 103 -360
4397 -360 167 297 -292 -96 363 -128 -205 361 -22 -282 231 152 -378 118 325 -344 -140 361 -39 -223 233
4418 233 51 -332 218 159 -365 58 325 -239 -165 352 -104 -310 226 50 -322 174 161 -341 30 358 -209
4439 -209 -248 343 12 -288 237 151 -286 98 245 -235 -52 318 -133 -221 286 63 -293 176 150 -270 112
4460 112 281 -235 -131 357 -119 -230 339 14 -358 108 223 -261 -16 256 -227 -163 305 -67 -265 179
4480 179 100 -386 85 259 -211 -67 289 -68 -133 291 -58 -299 214 162 -283 34 235 -153 -26 250 -148
4501 -148 -174 268 27 -301 146 132 -290 -41 217 -140 -176 223 -99 -187 208 116 -307 47 142 -179 8 229
$$ packed form
4355a74N02l76k58O01k09m33M68J37n73K34M48n52m7N56l50l39N89k7n08L93K28
4376C10n54J33M22m32q6N57k83m92N09R1n43L75K69n07Q2N03m74j40N43j80m63
4397c60N27J30n89J96M59m91p7N66l83k60N13p9n30M96K07o69K04N01m00j84M56
4418B33j82l83N50n9n24M23K67n64P4N17m56k06N36j76l72M96j3n02L71L28n67
4439b09l9N91l31l00N25q6m37L84J47m80J83L70m51q8N07k23l56M69k6m20L82
4460A12J69n16J04M88m76j11N69l25l72M66J15m84K45K72m83O4M68l72j98M44
4480A79p9m86M71J74m70J44L56l57o5M24l49k41N13n2m45L17K01l88J27K76l98
4501a48k6M42k41l28M47j4m22K49K58l57l6L99l22q8L95r2m23L54R5l21J87K21
$$ plain form
4523 229 -89 -107 173 11 -184 182 148 -246 79 272 -213 -100 210 40 -143 157 -12 -163 192 114 -207
4544 -207 -6 211 -178 -126 232 23 -180 93 4 -123 139 89 -244 -13 169 -127 -186 153 32 -220 110
4565 110 155 -41 45 63 -138 -14 233 -143 -231 145 78 -106 38 28 -93 -2 89 -33 -3 107 -128 -144 170
4588 170 86 -199 22 83 -81 -10 33 -123 -93 52 -67 -90 96 31 -165 -13 147 -29 -78 40 17 45 112 -108
4612 -108 -125 110 90 -53 52 101 -43 -14 38 13 -11 24 -13 20 113 76 -150 -49 58 43 5 -38 -41 20 -7 -42 -7
4639 -7 44 -42 -81 14 133 -39 -83 -34 21 40 20 -46 -53 41 54 -23 39 -12 -33 -10 24 95 -11 -99 -31 88 46 -3 -75
4668 -75 -18 -18 93 79 -65 -47 9 -14 -24 32 -35 -126 33 -4 46 -65 49 -100 6 147 12 -81 -19 111 7
4693 7 36 33 -88 -31 57 33 -34 94 -70 -146 76 141 -29 -73 15 -61 44 119 -112 -123 112 31 -67 95 98 -137 -103
$$ packed form
4523B29l18j8K80j62j95L66l4l94L25J93m85J13L10j70j83L00j69j51L55p8l21
4544b07K01K17l89N2L58k09k03K73q9j27K62n0l33K31J82k96n9L39j21k52L30
4565A10M5j96Q6J8k01J24K47l76q8L76o7j84J44j0j21R1R1j22L0J10k35j6L14
4588A70q4k85K21O1j64P1M3j56L0J45j19k3J86o5j96J52J60j76m9J18k3K8O7k20
4612a08j7K35k0j43J05M9j44K9N2k5k4L5l7L3R3l7k26J01J07j5l8m3lO1k7l5L5
4639gN1q6l9R5J19j72m4M9N5J9k0o6pR4J3p7O2n1k1K3L4P1j06q8O8J19m2m9p2
4668g5N7%J11j4j44J8N6k3j0N6o7r1J59l7N0j11J14j49J06J41j35r3O2J30j04
4693GK9lj21N7Q8k4o7J28j64p6K22O5j70m4Q8p6J05P5k31j1K35q1r8J62Lk35L4
$$ plain form
4720 -103 139 37 -65 9 -65 -62 196 15 -175 26 139 -103 -45 105 -24 -102 117 43 -111 95 -13 -180
4742 -180 67 194 -123 -138 81 41 -59 125 -13 -170 85 101 -155 4 133 -149 -131 232 39 -155 17
4763 17 54 -120 81 181 -213 -68 258 -85 -141 122 -74 -203 162 200 -179 -48 84 -168 17 283 -99
4784 -99 -206 191 92 -207 58 119 -206 6 222 -77 -148 133 -44 -230 308 129 -213 44 162 -165 22
4805 22 172 -171 -156 213 48 -162 185 92 -288 73 313 -164 -119 197 -15 -111 257 32 -318 127 207 -162
4827 -162 25 172 -137 -72 327 -25 -228 85 45 -215 172 274 -310 -94 252 -75 -73 173 -76 -270 163
4848 163 165 -231 -18 147 -221 -36 275 -141 -241 217 139 -221 143 124 -299 -29 319 -142 -157 214 -120 -198
4870 -198 314 136 -277 53 215 -197 14 288 -208 -240 208 60 -228 131 -11 -340 75 325 -217 -157 232
$$ packed form
4720a03K42j02j02P4p4LK58j81j90K01J13k42N8J50j29p8K19p4j54K06j08j67
4742a80K47J27l17j5K19m0j00J84j38j57K55J6k56J59J29k82J8L63j93j94J72
4763A7L7j74K01J00l94J45L26l43n6K63j96j29L65L8l79J31J32k52J85K66l82
4784i9j07L97r9k99K65O1l25K12K16k99p1K81j77j86N38j79l42K57J18l27J87
4805B2J50l43J5L69j65k10L47r3l80L61K40m77M5L16k12r6L68k25l50M45Q0l69
4827a62J87J47l09O5L99l52k03L13m0k60L87J02n84K16L46l27KK46k49j94M33
4848A63Kl96K13J65l68J85L11m16j00M58p8l60L64j9m23K70L48m61j5L71l34p8
4870a98N12j78m13L30J62m12K11K74m96l2M48j48k88L59j42l29M15K50n42O0L89
$$ plain form
4891 232 -4 -161 270 -13 -327 129 135 -222 39 259 -219 -131 372 65 -257 134 63 -273 261 158 -251
4912 -251 -27 250 -83 -139 235 -67 -319 190 189 -245 61 63 -291 7 369 -204 -283 230 8 -240 166 146
4934 146 -326 61 228 -127 -55 167 -186 -270 263 131 -321 -14 191 -165 45 207 -220 -131 297 -25 -189
4955 -189 261 78 -286 83 316 -145 -125 172 -128 -91 265 -69 -383 172 159 -242 52 241 -205 -156 210
4976 210 10 -167 148 -76 -248 235 229 -338 -122 291 -26 -91 181 -46 -179 208 99 -244 108 157 -320
4997 -320 -39 396 -95 -271 126 33 -97 207 47 -257 76 212 -200 -112 246 -123 -312 247 181 -242 -7
5018 -7 47 -159 153 184 -284 -189 316 20 -207 137 108 -208 9 134 -115 -39 114 -216 -88 412 -44 -330
5040 -330 67 192 -140 36 70 -118 -59 165 -65 -136 169 -66 -230 165 214 -176 -115 139 -32 -37 161 -134
$$ packed form
4891B32k36j57M31k83l14M56Ol57K61K20m78Q8N03l07l22L91p1l36N34j03m09
4912b51K24K77l33n6L74l02k52N09jm34L06Kl54K98L62n73p9N13k22k48M06k0
4934A46m72L87J67l55P2K22l53q4N33j32m52L07K05l56K10J62m27Q9M28l22j64
4955a89M50j83l64L69K33m61K0K97l00L7L56l34l14N55j3m01K94J89m46M9L66
4976B10k00j77L15k24j72M83on67K16M13l17o5K72k27j33L87j09l43L52M9m77
4997c20K81M35m91j76L97r3j30L04j60l04L33J36m12Q8L58l69j89N59o6m23K35
5018gN4k06L12L1m68R5N05k96k27L44k9l16K17J25k49P6J53l30J28N00m56k86
5040c30L97J25l32J76L4j88N9K24k30p1L05k35j64L95M9l90O1K54j71nJ98k95
$$ plain form
5062 -134 -179 202 113 -234 46 117 -199 -79 284 -8 -117 116 -9 -43 196 -16 -289 42 250 -40 -73 117
5084 117 -100 -123 166 78 -138 61 -8 -152 51 214 -195 -181 161 53 -94 71 -48 -90 65 135 -119 -75
5106 -75 75 -135 -119 225 49 -206 -9 89 43 128 -15 -161 36 188 9 -98 57 42 -171 48 135 -72
5128 -72 -90 39 -72 41 170 -111 -136 103 98 -99 -18 -21 -52 49 128 -51 -4 89 -58 -88 131 89 -149 -92 135
5153 135 22 28 -42 -55 7 102 38 -88 7 12 -31 27 127 -41 -120 12 59 51 68 -51 -107 95 121 -61 -114 -37 12
5180 12 -25 50 4 -29 -71 -19 -61 111 23 -102 -125 85 169 -63 -68 11 95 72 59 -26 -4 4 -11 16 41 39 -103 -89 88
5209 88 151 -149 -70 11 44 34 -44 -51 -83 48 -24 -79 132 -1 -198 -53 148 56 -92 -58 35 25 54 -48 -127 95
5235 95 62 -54 -22 115 -20 -111 57 95 33 -31 -13 -69 65 125 -59 -100 109 106 -139 19 87 -94 -8 19 2 -38
$$ packed form
5062a34m5L81q9l47K80P1l16J20L63k92j09K33j25l4K39k12k73L31K08k90l3J90
5084A17k17k3K89q8k16J99o9j44K03J63m09J4L42j08j47J65j19m2J55P0k54M4
5106g5J50k10J6L44j76k55J97R8m6Q5j43j46J97J52j79j07J55j5k13K19Q7k07
5128g2j8J29j11J13J29k81k5K39nj97Q1ll1J01P9j79M7R3j47l0K19m2k38N7K27
5153A35j13Op0j3O2R5o4j26R5Nm3N8J00j68p9J32M7qJ7j19n6K02K6j82n3P7M9
5180A2l7P5m6l3m2N2m2J72q8j25k3K10Q4k32nP9Q4k3j3q5K2Qj5K7K5kj42J4J77
5209H8O3l00P9Q1L3j0p8pl2J31p2n5K11j33j97J45K01r2j48L4R3j0K9j02p9K22
5235I5l3j16L2J37j35r1J68L8o2o4J8n6J34O0j84m1K09lk45J58O8j81Q6K7j7m0
$$ plain form
5261 -38 16 -107 -63 212 41 -181 -60 133 -21 -70 50 -62 -56 118 59 -74 40 13 -184 38 218 -40 -176
5284 -176 51 -37 -53 86 -15 -147 54 161 -131 18 64 -96 -120 164 72 -88 44 -28 -91 42 159 -191
5306 -191 -134 211 -21 -115 93 37 -119 83 82 -103 32 82 -133 -58 204 -20 -274 42 93 -64 99 68 -189
5329 -189 7 197 -138 -118 143 -39 -237 132 128 -199 -42 115 -12 50 34 -130 -147 207 31 -266 96 103 -123
5352 -123 2 204 -110 -103 118 -65 -91 223 47 -270 71 284 -132 -71 115 -128 -82 166 0 -187 165 51
5374 51 -208 93 160 -163 -133 232 61 -107 103 -51 -192 202 124 -216 18 169 -218 -149 274 -15 -156 140
5396 140 32 -173 153 102 -223 37 221 -108 -157 161 35 -189 101 101 -215 61 137 -187 -57 228 -186 -221
5418 -221 168 97 -178 77 80 -194 93 182 -170 -73 241 -93 -209 258 57 -261 60 139 -120 -40 142 -199
$$ packed form
5261c8N4j23M4K75j71k22J21J93j54m9J20j12OJ74n9j33J14k7j97K22J80k58j36
5284a76K27q8j6J39j01j32K01J07k92J49M6j60k4K84r2j60J32p2o3J33J17l50
5306a91N7L45k32r4K08n6j56K02jj85J35N0k15P5K62k24k54L16N1j57J63l1k57
5329a89J96J90l35K0K61j82j98L69ml27J57J57j27O2j6j64j7L54j76k97L62Pk26
5352a23J25K02l14PK21j83k6L14j76l17L41K13m16O1J86k43M6K48j66j87L52j14
5374E1k59L01O7l23L0L65j71j68K10j54j41L94p8l40K34J51l87O9M23k89j41K96
5396A40j08k05L26n1l25K60J84l29m9L18j26k24K90%l16K76P6l24J30K85m14l5
5418b21L89p1k75K55Lk74K87Q9l52R7L14l34j16M67k01l18L21P9k59Q0J82l41
$$ plain form
5440 -199 -58 237 -56 -252 121 135 -239 63 232 -171 -123 209 -97 -103 260 -38 -256 196 96 -281 4
5461 4 196 -110 -47 158 -97 -140 175 -26 -273 152 223 -261 -35 265 -80 -154 118 -13 -135 192 110 -275
5483 -275 131 216 -193 -35 260 -75 -232 184 38 -175 136 62 -214 139 222 -198 -104 254 -5 -200 144
5504 144 124 -246 101 77 -198 4 153 -211 -153 256 5 -215 96 102 -218 49 142 -227 -5 223 -117 -57
5526 -57 238 -52 -240 134 196 -190 -42 154 -136 -31 241 -91 -218 198 82 -240 95 153 -223 -2 128
5547 128 -112 -52 143 -52 -108 148 70 -230 -9 170 -180 -86 191 -79 -140 161 6 -147 152 39 -236 64
5569 64 205 -133 -131 148 32 -118 152 35 -164 99 126 -176 30 177 -167 -86 181 24 -173 70 16 -189
5591 -189 8 129 -172 -33 216 -93 -157 171 63 -81 81 190 -101 22 125 -125 16 199 -33 -176
$$ packed form
5440a99J41K95k93j96L73J4l74L02J69m03M8L32l06oL63k98k18M52j00l77K85
5461DJ92l06O3K05k55m3L15k01k47M25P1m84K26L00l45p4K72j31j22L27q2l85
5483b75M06Q5m09J58K95l35j57M16j46k13L11p4k76L53Q3m20R4L58k59j95L44
5504A44k0l70L47k4k75K02J49l64N8M09k51k20L11Ol20K67R3l69K22K28l40O0
5526e7K95k90j88L74O2l86J48J96k90J05K72l32j27M16j16l22L35N8l76K21J30
5547A28k40O0J95j95n6K56p8l00K21J79l50R4K77k70o1L01j55j53K99j13k75L00
5569F4J41l38KK79j16j50K70j17j99K63K7l02K06J47l44Q1K67j57j97K43n4k05
5591a89J97J21l01J39K49l09o4L28j08j44J62J09k91J23J03k50J41J83k32j43
$$ plain form
5611 -176 102 55 -186 43 130 -47 -12 95 -31 -54 127 -41 -102 185 123 -144 -14 150 -74 5 99 -7 -85
5634 -85 132 -5 -133 87 90 -129 9 172 -85 -70 58 -39 -42 86 22 -68 80 84 -112 -23 139 -20 -109 125
5658 125 6 -63 72 51 -59 55 88 -167 26 111 -27 -116 58 41 -108 21 70 -69 8 23 -41 -70 145 -40
5682 -40 -57 110 54 -125 -10 86 -46 1 58 -36 -48 101 25 -79 2 57 -83 -26 107 -37 -44 31 21 -62 89 -20
5708 -20 -55 5 93 -15 -70 13 28 -35 53 15 -42 7 -11 -68 -5 85 -31 -33 38 37 -51 -47 7 7 -50 31 -64 -41 5 -23 -44
5739 -44 11 56 -41 1 23 56 46 70 -24 -68 -3 9 -88 15 6 24 -44 43 50 -59 24 6 -23 18 48 -103 -90 10 17 -50
5769 -50 3 43 -35 -13 122 5 -13 25 -37 -26 80 17 -102 36 89 -29 -9 31 5 -61 75 -74 -68 13 -21 -100 15
5796 15 68 -64 -68 10 23 -43 1 -15 -57 22 17 -131 -39 97 -79 -113 80 30 -129 -37 21 -60 21 80 -58 6 91 -56
$$ packed form
5611a76K78m7k41K29Q7j77L5J07j26k3J81j68o1K87o2k67J30J64k24P9R4j06p8
5634h5K17j37j28K20Lk19J38J63k57J5J28r7lJ28o4r0J48Mj96Q9J62j59q9K34
5658A25j19o9J35k1j10J14L3k55J93Q5j38q9J74j7j49J29M9j39P7J5o4k9K15j85
5682d0j7J67n6j79J15R6j32M7N7r4j2J49p6j04Q1N5j40N7J33j44pP5j0q3J51j09
5708b0l5O0Q8j08n5Q3J5o3Q8l8n7M9j8n7O3R0j16kP1jq8MN4%n7Q1r5K3M6k8k1
5739d4N5M5r7M2K2L3j0K4r4m4O5J2r7J03rJ8o8Q7Pj09Q3j8k9M1L0j51J3J00Po7
5769e0N3M0p8K2J35j17j8L8o2J1J06o3j19J38N3j18K0M0k6o6J36j49OQ1l4p9J15
5796A5N3j32mP8J3o6M4j6m2P9nj48R2J36j76l4J93n0j59R2N8q1Q1N9j38O4Q5j47
$$ plain form
5824 -56 -109 98 85 -91 36 57 -29 -77 52 -42 -48 57 -29 -96 132 21 -178 -3 82 -50 -9 82 -53 -83 100
5849 100 -19 -88 35 27 -107 -1 114 -61 -60 52 -38 -66 67 35 -131 125 135 -64 -21 109 -31 -112 153 61
5873 61 -139 82 3 -115 61 131 -152 -118 101 -65 -101 29 13 -179 31 91 -106 -52 104 -129 -42 166 55
5896 55 -128 90 65 -161 -8 97 -102 -19 143 -76 -92 175 9 -160 134 120 -145 11 145 -64 16 151
5918 151 -54 -136 118 55 -135 74 71 -200 -65 141 -81 -151 103 -42 -144 114 -11 -177 65 109 -132 -25
5940 -25 109 -74 -113 113 46 -91 114 101 -58 16 114 -93 -80 181 -8 -172 140 61 -155 96 52 -141 -23
5963 -23 101 -76 -99 109 -49 -211 101 67 -161 21 120 -130 -45 152 -16 -91 114 19 -186 100 168 -138 -13
5986 -13 144 -91 -42 146 -14 -98 170 55 -152 57 118 -140 -19 139 -106 -63 87 -6 -87 92 5 -139 61
$$ packed form
5824e6n3K07j3j76J27K1q6m8J29r4oJ05q6o7K28j11j99J75Q5j32M1R1j35l0J83
5849A00j19o9J23qj34J06J15j75JJ12r0k8J33l2j66K56J0j99M3J30j40q1K65r2
5873F1k00K21p9j18J76P0k83L4K19j66l6J30j6j92K10O0j97N4J56k33Q7K08j11
5896E5j83K18k5k26J53J05j99Q3J62k19j6K67j66j69K94j4k65J56J34k09Q0J35
5918A51k05q2K54o3j90K09lk71J35K06k22p0K54j45j02K58j25j66K42M4k41J07
5940b5J34j83l9K26o7j37K05j3j59P4R8k07J3K61j89j64L12p9k16K51m4j93J18
5963b3J24j77k3K08j58j62L12l4k28J82R9k50Q5J97j68p5K05r5k05K86O8l06J25
5986a3J57k35M9J88j60q4K68j15k07K09O1k58J21J58k45M3J50r3q1J79q7j44K00
$$ plain form
6009 61 123 -145 -50 105 -142 -142 87 -9 -178 51 69 -77 79 80 -134 -79 117 -22 -136 111 63 -155 60 121
6033 121 -90 -25 153 -25 -26 140 -47 -196 102 76 -158 20 77 -99 -91 116 -9 -77 101 -9 -116 56 32
6056 32 -144 -16 126 -54 -76 103 4 -48 139 48 -153 18 42 -118 -1 124 -51 -109 80 31 -61 13 17 -147
6080 -147 13 139 -131 -81 108 -30 -101 110 61 -155 7 52 -74 22 57 -102 -129 116 38 -135 43 40 -132
6103 -132 6 71 -43 -6 63 -60 -39 96 47 -129 -10 58 -40 -25 51 -74 0 129 -38 -61 84 47 -76 15
6127 15 88 -67 -66 73 25 -24 71 -23 -95 52 78 -66 -28 91 5 -52 48 16 -27 41 6 -59 92 56 -53 -37 50
6154 50 21 -75 5 26 59 -9 45 12 -32 25 -36 -42 37 47 -66 40 39 -45 -71 -17 -57 19 96 -134 -69 133 10 -76 -19
6183 -19 33 -39 -49 87 45 -27 -3 -58 -10 152 24 -128 -28 97 37 -56 -7 44 -64 24 31 -14 53 23 -37 -35 108
$$ packed form
6009F1O2k68R5J55k47%K29r6j69K29J8j46J56Jk14N5J96j39j14K47m8k18K15O1
6033A21k11O5J78j78jJ66j87j49K98k6k34J78N7j76QK07j25o8J78j10j07J72k4
6056C2j76J28J42j80k2J79r9n2J87r1k01J71K4j60J17J25j75n8J89m9r2P4Mj64
6080a47J60J26k70N0J89j38p1K11m9k16J62M5j26R6L5j59k7K45p8j73J78lj72
6103a32J38O5j14L7O9j23K1J35m9j76J19O8r8J5P6j25P4J29j67k3J45l7j23R1
6127A5P3j55JJ39m8m9R5r4p2J47K6j44L8J19q6n7J00l2m3O8l5o5J51l6j09J6Q7
6154E0k9r6Q0K1L3o8N4l3m4N7o1oP9J0j13J06jq4k6N4m0P6P7k30O5K02j23q6N7
6183a9N2p2j0J36m2p2K4n5M8J62j28j52J00J25o0r3M9N1j08Q8Pm5O7l0o0KJ43
$$ plain form
6210 108 16 -146 -34 57 26 -21 -49 -47 -39 33 -43 -18 73 -29 -73 16 111 -27 -107 13 14 33 29 -29 -102 97 91 -79 29
6239 29 78 -56 -88 77 2 22 -24 -16 1 32 137 -168 -80 103 76 -130 -19 48 -25 70 -3 -114 35 52 -96 -12
6265 -12 102 5 -161 -40 128 40 -20 -40 -61 93 174 -143 -77 143 64 -154 73 80 -11 -39 17 -20 30 53 -217 -132
6291 -132 150 94 -225 -40 76 5 -19 88 -30 -82 48 -38 -107 100 5 -253 9 213 1 -116 34 14 20
6314 20 86 -38 -116 103 85 -107 -1 235 -108 -142 103 128 -28 84 -63 -135 131 118 -147 -98 198 -65 -122
6337 -122 84 46 -96 -4 36 -40 1 60 -304 -41 206 -34 -257 -18 94 -83 29 9 -60 33 75 -87 -81 161
6361 161 -49 -237 135 228 -85 -52 87 -65 93 155 -149 -84 226 -12 -156 30 138 -171 -89 112 -3 -9
6383 -9 24 -119 -23 167 17 -264 23 215 -57 -66 95 -89 -30 84 -63 -107 102 24 -183 92 271 -126 -196
$$ packed form
6210A08r2j62J12R1l1m7k8KQP2p6K5R1j02m4Q9R5j38q0J20JJ9mn8p3J99oj70J08
6239B9M9j34l2J65p5K0m6QJ7L1J05l05Q8J83k7k06J11O7p3R5p3j11J49J7j48Q4
6265a2J14r7j66J21J68q8o0k0k1J54Q1l17O6K20p9k18K27Pr1k8N6l7N0K3k70Q5
6291a32K82n6l19J85J16p1k4J07j18n2J30q6o9K07r5k58K62K04k12j17J50k0O
6314B0O6j24p8K19j8j92J06K36l43l4K45K5j56J12j47p2K66j3k65M9K96k63n7
6337a22K06l8j42R2M0p6M1N9l64K63K47k40k23K39J12j77J12k0o9R3M2j62OK42
6361A61k10j88L72R3l13L3J39j52J58O2l04O5L10k38j44J86J08l09Q2K01j15o
6383iL3j43R6J90j50k81K87J92k72rJ61j84N9J14j47m4K09p8k07K75J79l97p0
$$ plain form
6406 -196 135 79 -18 65 -32 -145 97 107 -187 0 163 -119 -106 160 14 -116 -23 2 -85 94 65 -245 -31
6429 -31 234 -52 -138 109 -35 -152 53 98 -93 28 58 -152 11 256 -60 -257 112 136 -154 -79 -8 -106 12
6452 12 165 -130 -45 168 -72 -176 143 123 -262 -64 75 -43 15 51 -204 -69 184 43 -219 83 112 -175
6474 -175 -84 136 -74 -121 49 -69 -21 187 27 -226 68 190 -97 -72 95 -87 -54 160 -18 -64 136 -40
6496 -40 -151 112 155 -195 -56 170 10 -58 36 -107 -133 119 65 -213 -40 128 -128 -100 151 -23 -120 35 5
6519 5 -30 55 7 -220 53 280 -68 -165 142 -2 -65 68 61 -100 -16 46 -113 38 190 -153 -146 181 136 -134 3
6544 3 -31 -93 63 65 -199 -79 47 -73 -121 175 -1 -171 -17 155 26 -11 54 -81 9 152 -20 -137 100
6567 100 89 -90 44 107 -67 -127 89 -11 -7 73 -55 -139 160 174 -112 -78 60 -9 1 117 -44 -106 64 25
$$ packed form
6406a96L31n6r7Q3r7j13K42J0k94J87J63k82J3K66j46j30R3K5q7J79k9l10K14
6429c1K65k86q6K47j44j17K05M5j91J21L0k10J63K45l16j97L69K4k90P5P1r8J18
6452A2J53k95Q5K13k40j04L19k0l85J98J39j18N8L6k55J35K53j41k62L02K9k87
6474a75R1K20k10m7J70j18M8K08j60k53K94J22k87K5J67j82L3K14j78m6K00j76
6496d0j11K63M3l50J39K26j60o8R4j43k6K52n4k78J73J68k56K8K51j74r7J55l0
6519El5Q5m8k27K73K27l48r7L07j44o3J33pj61Q4O2j59J51J52l43PL27m5k70J37
6544Cl4o2J56Kk64J20J26j20m8K96j76j70J54J72j29l7O5j35R0J43j72j17K37
6567A00j1j79J34O3j74o0K16j00MQ0j28q4K99J4k86L4J38o9J0J16j61o2J70l9
$$ plain form
6591 25 -16 98 74 -142 -66 174 2 -92 10 -77 -41 36 -25 -123 -11 104 -3 2 86 -51 -116 81 87 -32 -22 19
6617 19 -58 35 99 -15 -35 64 39 -32 39 -29 -76 -31 25 -16 -18 35 -71 -4 25 9 -25 -45 35 -32 -10 26 -60 -87 20
6646 20 31 -4 7 -40 -63 62 74 -36 -94 -24 -27 -24 81 -19 -68 8 39 79 38 39 -80 -88 21 95 -105 -85 -2 45 55
6675 55 0 -46 -66 48 16 -5 29 9 -37 -52 38 4 -35 -89 -44 63 38 -38 -47 65 44 -35 21 77 -37 -29 50 95 51
6704 51 -45 -73 -9 69 52 -35 -77 60 46 -15 -9 39 -42 -85 -12 59 -64 -54 -44 -29 75 39 -122 -81 95 75 -11 18
6732 18 55 47 27 -12 44 39 -48 -109 20 89 8 -98 -13 160 3 -46 -41 -93 31 127 6 -36 13 12 -85 -8 54 -80 -83
6761 -83 51 34 -13 16 -98 -94 85 63 -70 14 78 -28 -77 80 20 -69 87 13 -39 117 44 -202 -10 135 -20
6786 -20 -56 -45 15 -32 125 8 -64 15 32 -107 15 144 -29 -105 61 59 -57 80 -34 -127 34 68 -89 -97 124
$$ packed form
6591B5m1J14k4k16P6K40j72r4J02q7L6P7o1r8J12J15j07NQ4j37o5J97Oj19J0M1
6617A9p7R3O4j14k0R9k5p1P1o8m7M5N6m1kN3j06O7K9j6l4k0Q0o7K2L6q6k7J07
6646B0J1l5J1m7k3J25J2j10n8P0lLJ05j00m9P6L1M0m1Jj19qJ09P4k00K0Q3M7J0
6675E5n5m6k0J14l2k1L4k0m6j5R0l4l9n4M5J07k5p6rJ12k1p9N6N6j14QP9M5m4
6704E1r6k8O4P8j7q7m2J37j4o1OM8q1m3P3P1j23J0J0J5J04l6j61M1J76k0q6K9
6732A8L7qk0l9N6nq7o1J29O9q1j06Q5J73j57m9Nn2J24R6j21m2M9jr7P7O2j34l
6761h3J34j7m7K9j14MJ79k2j33Q4O4j06m9J57o0q9J56p4n2J56p3k46J92J45j55
6786b0l6J1O0m7J57j17p2P9J7j39J22J29j73p6J66kj16J37j14r3J61L4j57qK21
$$ plain form
6811 124 -5 -137 156 15 -57 -8 74 -51 37 -2 -120 -24 164 35 -196 30 100 -69 37 130 -83 7 99
6834 99 -56 -71 138 -44 -219 62 67 -57 9 12 -82 -8 79 -135 -83 141 -5 -138 74 149 -115 -87 129 18
6858 18 -35 32 -58 -81 159 31 -165 -37 159 -80 -35 173 -69 -69 73 1 -110 196 37 -222 57 218 -44
6881 -44 -166 100 52 -66 72 -18 -107 99 64 -195 25 197 -208 -189 183 85 -131 13 9 -140 132 137 -242 28
6905 28 175 -141 -103 160 37 -155 27 69 -82 87 64 -216 -62 229 -70 -206 99 76 -169 98 112 -140
6927 -140 -25 66 -124 14 190 -96 -198 155 177 -200 -78 106 -96 33 140 -102 -67 139 -60 -195 109
6948 109 75 -221 -19 176 9 -61 46 -66 -40 191 -71 -233 72 112 -149 7 133 -135 -105 158 -84 -109
6970 -109 113 -1 -151 60 143 -168 -71 177 -73 -114 148 -62 -177 85 73 -126 65 107 -151 -53 225 -2
$$ packed form
6811A24j29j32K93j41p2M9Q2j25Q8l9j18R6J88j29k31K26P0j69J06R3k13R0R2
6834I9j55j5K09j82j75K81Nj24O6Lr4P4Q7k14N2K24j46j33K12P5k64K8K16j11
6858A8n3O7r0k3K40j28j96J28J96k39M5K08k42%J42p2j11L06j59k59K79J61k62
6881d4j22K66m8j18J38r0q9K06l5k59K20J72m05J9L72r8k16J44mj49K72Nl79K70
6905B8J47l16L8K63j23j92J82M2j51J69k3k80J54K91k99j36L05k3k45K67J4k52
6927a40J15R1j90J38J76k86j02L53K2l77J22J84k02J29J07k42L5K06j99j35L04
6948A09l4k96K02J95j67p0J07j12K6K31k62j62L05M0k61J56J26k68L0K63k42k5
6970a09K22j14j50K11Q3l11R7K48k50m1K62k10j15K62j2j99J91M2k58R8K78k27
$$ plain form
6992 -2 -148 66 76 -135 61 60 -209 -29 176 -103 -96 205 -55 -163 145 68 -182 30 67 -125 13 187 -134
7015 -134 -137 102 30 -103 108 71 -189 50 170 -84 -48 197 -106 -86 143 70 -168 91 124 -123 22 125 -138
7038 -138 -67 204 -95 -127 125 19 -127 41 144 -163 -26 102 -75 -95 127 -98 -128 140 84 -145 44 94
7060 94 -151 12 180 -66 -72 112 29 -81 158 85 -244 -47 128 -73 -46 100 -50 -116 133 49 -102 35 53
7083 53 -98 48 196 -89 -143 119 51 -89 71 12 -145 75 75 -87 -32 85 -103 -115 191 69 -185 28 103
7106 103 -67 69 117 -120 -26 102 -94 -86 77 73 -127 39 92 -95 -19 143 -67 -31 64 -40 -159 139 49 -174
7130 -174 -5 39 -97 -100 87 -56 -127 58 -52 -134 100 59 -190 -6 145 -43 -31 78 4 -52 79 1 -62 105
7154 105 63 -126 24 113 -45 -74 94 29 -43 23 -1 -54 108 47 -113 -36 145 -31 -120 21 0 -121 3 -6 -55
$$ packed form
6992bj46K14J0k11J96jk69J80K05k79PL01k60j08L08p7k50K12L7j92J38J74l21
7015a34lK39p2j33K11l7k60K39J20k54L6K45l03K0K29p3k38K59L3k47J45J03k63
7038a38P1K71k99l2K52j06j46J68J03l07J37J28j77k0K22k25l0K68n6k29J89N0
7060I4k45J63J68k46oJ84q3j10K39p3l29J97J75k01K7J46j50o6K49q4j51J37J8
7083E3j51J46J48k85n4K62o8j40J60n9j57K20%j62N5J17j88j2L06j22k54K13P5
7106A03j70J36M8k37R4J28j96QJ63mk00J66N3j87P6J62k10L6R5j04j19K98r0k23
7130a74J69M4j36lJ87j43p1J85j10q2K34m1k49J84J51j88J2J09p4n6J31p8o3J67
7154A05m2j89J50Q9j58k9J68o5p2O6k4n3J62o1j60P7J81j76q9J41k1j21J24rm9
$$ plain form
7179 -55 45 102 -119 -69 98 -44 -80 25 2 -78 41 17 -32 32 49 -81 -25 114 -18 -69 47 113 -4 -48 8
7204 8 -79 25 6 -81 -35 31 3 -89 43 76 -77 -70 84 41 -23 26 -118 28 96 34 -55 -27 59 -54 -68 19 -24 23
7232 23 13 22 35 50 -69 -90 56 100 -9 -46 -44 50 55 -76 8 14 16 0 -76 22 86 -53 -82 24 82 -2 -62 -64 44 80
7262 80 -11 -41 -25 4 -1 -42 -8 7 -36 -105 -15 105 -40 -38 -23 66 5 5 -72 4 72 -15 19 11 70 -18 -50 3 50 18 -33
7293 -33 -13 32 69 23 -94 -25 79 -34 -48 7 28 26 -56 35 -16 1 19 -36 -12 48 8 -100 26 89 18 -38 -14 -15 27
7322 27 -9 -63 6 96 2 -56 55 61 -49 -39 41 30 -22 -34 -68 -36 87 5 -148 7 20 -35 2 27 15 -64 17 -2
7350 -2 -45 35 -6 -53 44 83 -140 -50 84 1 -57 34 30 -67 60 -8 -123 87 64 -56 -67 63 -11 -27 89 -18 -71
7377 -71 29 63 -112 -26 109 -49 -46 105 26 -70 31 0 -92 29 15 -36 13 108 -88 -85 96 -10 -127 -7 79
$$ packed form
7179e5J00N7k21N0J67j42l6J05k3q0J19k4m9O4J7j30N6J39j32n1J16O6j17m4N6
7204Hq7J04j9q7M6O6k8r2J32L3j53PJ54m3o4M9j44J46O8o2q9K8Q6j13j4Q7m3M7
7232B3j0RJ3J5j19k1J46M4j09l7KR4Nj31Q4OKj6p6R8O4j39k9J06N8q4o0kJ08L6
7262H0r1l0J6K9nm1L4J5m3o9R0J20j45KJ5Q9o1%p7P6O8q7L4qN9q8l2N3M7l2n1
7293c3K0M5L7m6j17O9J04j13j4N5K1kq2R1n1J7J8n5K4O0m0j08J26O3p1n6K4jM2
7322B7l6n4O9R0r4n8J11Oj10J0Q0j1n2j2l4L2J23q2j53J55J3n5L7K5j2p9Q1j9
7350bm3Q0m1m7R7L9k23R0J34q3n8R1mr7J27o8j15K10k3j20j1J30p4j6J16j07n3
7377g1J00L4j75Q6J35j58LJ51p9r6J01l1r2J21j4n1M9R5j96LJ81j06j17J20Q6
$$ plain form
7402 79 -104 -14 71 -52 -18 164 -7 -105 80 9 -64 -2 68 -67 20 93 -86 -53 69 -43 -143 65 40 -67
7426 -67 -10 50 -86 -13 56 -63 -33 56 -26 -134 40 120 -106 -7 49 -56 -26 149 -68 -86 151 -29 -104 105 68
7451 68 -65 6 136 -23 -22 105 49 -118 106 17 -166 28 88 -112 -53 91 -61 -100 26 -68 -140 49 33 -144
7475 -144 13 150 -75 -99 106 1 -99 89 38 -122 52 79 -87 27 139 -60 -66 117 65 -68 28 29 -120
7498 -120 -25 115 -117 -28 121 -78 -57 110 5 -150 33 105 -113 11 109 -109 -53 99 -100 -118 108 21 -114
7521 -114 51 61 -137 31 81 -29 -54 147 -11 -122 120 91 -109 42 82 -63 -21 123 -72 -121 106 -52
7543 -52 -108 101 15 -176 -24 66 -91 -41 107 -74 -114 87 -27 -151 66 63 -125 -7 51 -123 -38 184 -11
7566 -11 -69 63 73 -131 50 69 -58 12 160 -5 2 151 2 -49 108 46 -133 46 64 -104 -23 86 -85 -53
$$ packed form
7402G9j83R0Q5j23L4J82j71r8J85p1p3O2P0j35Q7P3j79L3J22j12j00K08k5j07
7426f7N7O0j36P3O9j19L0Q9q2j08J74Q0k26R9N6j05L0J75k17j8K37j80p5K09l7
7451F8j33P1J30j59JJ27n6j67K24q9j83J94O0k00N9J44j52l9J26r4p2J89j6j77
7475a44J57J37k25k4K05j05j00J88n1j60J74K7j66J14J12j99oJ83n2j33R6Jj49
7498a20R5J40k32Q9J49j99K1J67j05j55J83P2k18J24R8k18N6J52j99j8K26q7j35
7521a14J65J0j98J68N0j10k5K01j58j11K42k9k00J51M0j45M2J44j95m9K27j58
7543e2n6K09q6j91J52R0j57N0J48j81m0K01j14j24K17lj88J18N8j74Q5K22j95
7566a1n8J32J0k04J81J9j27P0J48j65PJ49j49n1J57o2j79J79J8j68Q1J09j71L2
$$ plain form
7590 -53 64 4 -125 77 47 -150 -35 170 -55 -74 97 -62 -51 72 -47 -82 120 27 -160 31 86 -29 -85
7613 -85 126 -32 -93 79 -8 -113 103 93 -44 -11 147 -61 -114 48 -20 -83 37 45 -96 48 97 -109 -72 82
7637 82 -64 -56 25 -3 -100 54 37 -120 45 70 -121 -76 109 -12 -129 93 40 -87 4 33 -61 -24 121 -39 -130
7662 -130 102 -18 -155 87 31 -92 0 26 -105 28 47 -68 -48 94 73 -93 14 81 -46 0 60 -102 26
7685 26 89 -63 -77 114 56 -142 54 71 -70 -40 32 -30 -6 46 -40 -94 76 14 -41 81 16 -50 -41 72 -28 -62
7711 -62 -21 -25 -11 89 23 -72 15 52 -41 -49 81 -39 -77 27 -29 -36 50 -36 -83 25 90 -39 -73 33 34 -31 35 -48 -68
7740 -68 77 51 -95 -15 91 -74 -17 69 43 -27 27 23 -57 37 -35 -107 10 35 -56 -58 70 20 -35 -34 17 -17 -30 27 -68
7769 -68 9 58 -62 -45 60 89 -42 -4 -3 4 -7 35 -16 1 106 -22 -79 26 65 -46 -30 60 14 23 5 -30 23 50
$$ packed form
7590e3J17o0j29K02l0j97J15K05k25j9J71j59J1J23j19l5K02r3j87J91N5j15n6
7613h5K11j58o1J72q7j05K16j0j37L3J58k08n3J62o8o3J20Qj41J44M9k06L7J54
7637H2j46QQ1k8r7J54j7j57J65K5j91M5J85j21j17K22n3j27R1K9r4L7J45j60r1
7662a30K32j20j37K42n6j23R2K6j31J33J9j15K0J42k1j66J07O7j27M6O0j62J28
7685B6O3j52j4J91n8j98J96J7j41L0P2o2K4N2q6n4J70o2n5J22o5o6RJ13j00l4
7711f2M1mJ4J00o6r5Q7L7r3qJ30j20l8J04n6pQ6q6m7J08O5j29l4J06Jo5O6q3k0
7740f8J45k6j46Q0J06j65N7Q6k6p0N4mq0R4p2p2J17K5r1kJ28n0n5JN1l4j3N7r5
7769f8P7M9j20J7J05K9j31L8JPj1M2n1J7J05j28n7J05L9j11J6R0m6Rj8l5N3K7
$$ plain form
7797 50 -41 -60 44 -22 -60 5 13 -16 -6 -50 -62 55 101 -52 -92 68 57 -18 2 49 48 6 53 -32 55 67 -36 -52 57
7826 57 -5 -27 -36 113 15 35 -5 -36 49 58 -50 -39 -10 -15 25 -36 8 -51 -32 4 -43 20 44 -96 -47 12 64 -49 1 13
7856 13 34 29 -56 -13 31 30 -10 -2 52 32 -38 28 24 -50 7 -75 -38 53 62 -91 -17 58 -10 -65 -25 30 -9 -27 -53 -32 27 43
7888 43 -93 -23 91 -61 -71 -2 24 -3 -3 -55 -51 35 23 -28 -2 66 -3 -27 40 57 14 -39 -31 -61 66 -15 -26 -4 54 31
7918 31 -103 12 22 -31 -67 -18 -33 44 40 -30 -1 57 8 -150 1 67 -47 8 25 -21 16 15 30 -54 91 -62 -70 31
7946 31 48 -59 -41 54 -20 89 1 -35 -10 103 -29 -56 22 58 -72 -58 51 41 -17 13 -29 -13 95 -43 -96 40
7972 40 45 -53 -37 38 -4 -11 40 -1 -65 73 -53 -82 51 81 -33 -44 58 8 -77 -3 21 -79 88 -23 -43 4 73
7999 73 -92 -36 28 -4 -51 -28 -18 -52 95 13 -77 -3 68 -33 -83 40 36 -60 65 23 -74 71 14 -59 53 39 -98
$$ packed form
7797E0r1j9J04o6l8O5Qk9J0m4j2J17M6j53m0J60j1p5K0M7jm2M7q5Q7J2j03j6J09
7826E7o2k2rJ49r8K0m0l1Q5Rj08J1K9nM0o1M4n9J9L6m7O3K4j40M9N9N2j13N0J2
7856A3K1nq5M3M4jm0QN4k0p0O6mp4N7q2L7R1Rj53P4P5o8n5M0N5l9j8k6K1N9J6
7888D3j36P0J14j52j0O9K6k7%n2MQ6j2n1K6O8o9k4O7J7m3n3Ql0J27q1j1K2N8k3
7918C1j34J15J0n3l6M9j5P7mp0K9N8m9j58J51O6j14N5J7m6L7jJ5q4J45j53qJ01
7946C1J7j07J8R5p4J09q8l6K5J13j32k7P8L6j30J4J09j0n8L0m2J6J08j38n3J36
7972D0Nr8J6P5m2pN1m1o4J38j26k9J33L0j14j1J02n0q5P4K4j00J67j11k0M7O9
7999G3j65N6O4l2m7K3J0l4J47q2r0P4P1j01n0J23mr6J25m2r7J45n7p3J12j4j37
$$ plain form
8026 -98 -40 52 -24 -65 72 20 -51 -18 54 -38 -3 132 -81 -78 63 8 -74 66 -24 -26 20 48 -85 -40 76 -40 -81
8053 -81 42 -25 -116 53 57 -60 51 5 -16 -49 88 -58 -126 41 39 -22 -10 9 -36 28 54 -67 -12 131 -57 -58 70
8080 70 52 -96 -11 9 -74 -9 36 -70 -34 77 12 -136 63 9 -91 -17 3 -90 2 24 -48 -24 53 -51 -107 66
8106 66 19 -67 -36 -11 1 24 99 -24 -76 39 -56 -25 -7 68 -113 -29 98 -60 -69 23 -32 -66 96 73 -49 -25 101
8133 101 -65 6 20 -35 -68 15 25 -58 56 -10 -107 31 79 -36 -66 83 -51 -19 57 -3 -36 5 39 -102 -22 58
8159 58 -36 -39 -2 -19 -51 13 7 -38 73 -9 -57 -2 61 -42 -49 24 -36 -58 -9 5 -41 4 -5 -79 16 96 -44 -82 51 4
8189 4 3 84
$$ packed form
8026i8N8R2p6m1J37n2p1L3P2r2L5J35k13LJ41n5q2J40r0kM6K8j33M5J16j16m1
8053h1J23o7r1J69Mj17J11m6k1l3J37j46o8J67ko1J2J9m5O4K6j21N5J43j88jJ28
8080G0j8j48Q5K0q3O5M5j06L6J11o5j48J99n4j00P4K0r3R2K2p2K4P7j04n6J73
8106F6m7q6L1K5J2K3P5j23n2J15r5L1J8P5j81Q4J27j58rR2n5l4J62k3j22K4J26
8133A01j66P1J4n5l3Q3J0q3J14o6r7J38M8j15l0J49j34L2P6o0l3M1L4j41Q0Q0
8159E8r4lL7j7l2O4om5J11q2m8N5O3j03pP3o0k2M9J4m6M5rp4R5Q0j40l8J33m7
8189DjQ1
8191H4
$$ Imaginary data points
##PAGE= N=2
##DATA TABLE= (X++(I..I)), XYDATA
$$ plain form
0 0 0 0 0 0 0 0 0 0 0 0 0 3 -8 8 -8 8 -16 16 -19 24 -27 33 -41 49 -55 66 -76 86 -100 114 -129 148 -170 192
34 192 -216 242 -272 305 -341 381 -423 470 -520 578 -637 705 -775 855 -945 1041 -1145 1262
52 1262 -1391 1537 -1697 1878 -2086 2327 -2603 2933 -3327 3813 -4428 5236 -6341 7950 -10527
67 -10527 15292 -26963 113476 64765 -223638 39032 120608 -66734 -13035 67607 -98277
78 -98277 -1020 132747 -82118 -108958 164196 27185 -191706 50785 160032 -95871 -68667
89 -68667 77223 -32331 -11449 106632 -74351 -114206 139167 62066 -162037 23913 132581
100 132581 -95178 -68719 113146 -7987 -64875 64000 -27366 -80970 119032 53118 -165202
111 -165202 3463 147654 -60833 -76600 92045 -9557 -77081 73395 18886 -88028
$$ packed form
0@%%%%%%%%%%%Lj1J6j6J6k4L2l5M3n1O0p4R0j04J21j42J62j86K14k43K77l18L62
34A92m08M58n14N77o46P22q04Q93r90J098j215J342j480J630j800J986k186K407
52A262k653K928l234L575l964M413m930N536o260P140q241R664j1577J4291j8477
67a0527K5819m2255J40439m8711k88403K62670Q1576j87342N3699Q0642j65884
78i8277R7257J33767k14865k6840K73154j37011k18891K42491J09247k55903K7204
89f8667J45890j09554K0882J18081j80983l9855K53373p7101k24103J85950J08668
100A32581k27759K6459J81865j21133n6888J28875r1366n3604K00002o5914k18320
111a65202J68665J44191k08487j5767J68645j01602o7524J50476n4509j06914
$$ plain form
121 -88028 59664 51923 -124460 10297 141558 -67356 -103612 89487 27359 -68625 50074
132 50074 16037 -91836 46553 80877 -92906 -23717 107540 -46890 -84505 93889 34372
143 34372 -91732 21108 40295 -60244 32240 65591 -92140 -37547 111784 -11414 -86143
154 -86143 58182 31061 -78140 27193 59133 -61170 -5378 60042 -57331 -27504 99509
165 99509 -17159 -100507 51297 58915 -61970 2499 43634 -55449 -5118 73604 -39418
176 -39418 -49472 72630 -1763 -79680 52901 58704 -74847 -17341 58141 -25517 -11688 51601
188 51601 -41254 -49977 75579 19917 -79144 23098 52190 -57963 -10757 64492 -25551 -36683
200 -36683 42029 -12007 -33650 59161 8908 -80972 20729 68804 -41578 -29419 45238 -17275
$$ packed form
121h8028J47692p741j76383J34757J31261k08914l6256J93099o2128r5984J18699
132E0074l4037j07873J38389L4324j73783O9189J31257j54430l7615J78394n9517
143C4372j26104J12840J9187j00539R2484L3351j57731N4593J49331j23198p4729
154h6143J44325k7121j09201J05333L1940j20303N5792O5420j17373K9827J27013
165I9509j16668q3348J51804P618j20885O4469M1135r9083N0331P8722j13022
176c9418j0054J22102p4393p7917J32581N803j33551N7506P5482q3658J3829O3289
188E1601r2855q723J25556n5662r9061J02242K9092j10153M7206P5249r0043j1132
200c6683P8712n4036k1643R2811n0253q9880J01701M8075j10382J2159P4657o2513
$$ plain form
212 -17275 -29958 46760 -771 -46726 33691 17829 -56455 21604 58811 -50067 -39218 54199
224 54199 7153 -32306 24419 -2953 -39368 36358 30380 -53554 -1045 49080 -33741 -28516
236 -28516 53764 1922 -48481 17282 18669 -23351 20632 15810 -50569 1720 58035 -20935
248 -20935 -39872 35082 7900 -35981 21099 22423 -31992 1078 20666 -25743 3530 40329
260 40329 -27978 -39722 39466 23269 -34584 1154 16994 -20938 5355 26222 -21961 -12468
272 -12468 28306 -11904 -23483 34111 12500 -42020 -960 31067 -7720 -7668 10014 -17593 -6069
285 -6069 31792 -4149 -29460 17075 13941 -26105 5205 27325 -15991 -18037 14664 2497 -3061
298 -3061 13537 -11316 -23174 21144 20828 -23697 -8900 18141 -6995 -9151 16364 536 -13980
$$ packed form
212a7275j2683P6718m7531m5955Q0417j5862p4284P8059L7207j08878J0849R3417
224E4199m7046l9459N6725k7372l6415P5726n978q3934N2509N0125q2821N225
236b8516Q2280n1842n0403O5763J387m2020M3983m822o6379N2289N6315p8970
248b0935j8937P4954k7182m3881N7080J324n4415L3070J9588m6409K9273L6799
260D0329o8307j1744P9188j6197n7853L5738J5840l7932K6293K0867m8183R493
272a2468M0774m0210j1579N7594k1611n4520M1060L2027l8787N2J7682k7607J1524
285f069L7861l5941k5311M6535l134m0046L1310K2120m3316k046L2701j2167n558
298c061J6598k4853j1858M4318l16m4525J4797K7041k5136k156K5515j5828j4516
$$ plain form
311 -13980 4801 1642 -6061 14549 5999 -24880 -4255 25428 1699 -15902 1848 2111 -4699
324 -4699 7981 3792 -10254 861 4282 -8390 3549 14956 -8017 -17227 6895 14252 -1353
337 -1353 -5907 -3851 -2440 6998 7149 -6705 -5155 4919 -1496 -4253 7087 5283 -8725 -8384 4656
352 4656 9789 1878 -7815 -7096 2937 8983 2373 -6304 -3795 2892 2098 -1230 1985 3676 -5283
367 -5283 -8483 5454 10784 -2582 -8542 -2984 1872 7628 4719 -9681 -7152 8993 4199 -6645
381 -6645 3007 5239 -9187 -3893 10679 2377 -4712 -44 -6186 -2200 15617 2024 -19203 199
395 199 14149 -4598 -4647 8569 -4709 -8678 9723 3434 -7699 7198 1110 -17190 7581 21291
409 21291 -13034 -15887 12841 3244 -7550 9373 -1029 -16037 9140 12168 -15324 65 17323
$$ packed form
311a3980J8781l159p703K0610q550l0879K0625K9683k3729j7601J7750K63o810
324d699J2680m189j4046J1115L421j2672J1939J1407k2973r210K4122P357j5605
337a353m554K056J411R438J51j3854J550J0074o415k757J1340j804j4008L41J3040
352D656N133p911r693P19J0033O046o610q677K509O687p94l328L215J691q959
367e283l200J3937N330j3366n960N558M856N756k909j4400K529J6145m794j0844
381f645R652K232j4426N294J4572q302p089M668o142L986J7817j3593k1227J9402
395A99J3950j8747m9J3216j3278l969J8401o289j1133J4897o088j8300K4771J3710
409B1291l4325k853K8728r597j0794J6923j0402j5008K5177L028k7492J5389J7258
$$ plain form
422 17323 -14417 -13655 23062 5685 -19844 4376 6557 -11079 10746 11594 -23278 -4777 25495
435 25495 -7009 -17714 17824 3490 -22461 9424 16038 -15804 -248 12707 -17684 -1624
447 -1624 29283 -11073 -27428 20310 14061 -21447 4813 14374 -19405 -1235 21885 -13904 -11130
460 -11130 24269 -8485 -26173 25774 17337 -31895 -1943 23443 -12787 -4242 20043 -16075
472 -16075 -15259 29474 414 -30052 18581 18542 -32072 -1007 31761 -14671 -17052 20092 -6617
485 -6617 -14098 27266 -901 -35662 17941 28309 -29302 -8537 30866 -12663 -19929 25472 981
498 981 -22407 18785 4900 -30742 17734 29003 -35039 -15242 37857 -4910 -25826 21061
510 21061 4070 -25212 18079 14282 -30575 8187 29224 -30875 -14448 42801 -5593 -36897
$$ packed form
422A7323l1740P62L6717j7377k5529K4220K181j7636K1825Q48l4872J8501L0272
435B5495l2504j0705L5538j4334k5951L1885O614l1842J5556J2955l0391J6060
447a624L0907m0356j6355M7738o249l5508K6260R561l3779J8170K3120l5789K774
460a1130L5399l2754j7688N1947q437m9232K9952K5386l6230Q545K4285l6118
472a6075Q16M4733k9060l0466M8633l9n0614L1065L2768m6432k381L7144k6709
485f617p481M1364k8167l4761N3603J0368n7611K0765L9403m3529p266M5401k4491
498I81k3388M1192j3885l5642M8476J1269o4042J9797N3099m2767k0916M6887
510B1061j6991k9282M3291l797m4857L8762K1037o0099J6427N7249m8394l1304
$$ plain form
522 -36897 21325 15527 -25433 10931 15516 -30905 3872 34594 -25386 -21273 38941 -2431 -38063
535 -38063 24527 22537 -32664 1847 23655 -23208 -1098 32658 -23811 -25624 39635 5453
547 5453 -40224 17744 24689 -33109 -1008 31571 -21019 -13276 31247 -13571 -25329 36357 7247
560 7247 -43554 14971 32551 -30302 -7887 32067 -18458 -18676 34074 -5079 -32028 28073 12894
573 12894 -40226 12830 34815 -32746 -14376 36847 -11515 -23255 31445 -1049 -35305 25839
585 25839 21994 -39195 3193 35482 -27571 -16566 38511 -9226 -30736 29170 7067 -35301
597 -35301 20310 24702 -38745 -2966 39862 -19586 -22871 33114 -3635 -30169 27876 12182
609 12182 -37902 13300 29603 -34033 -8003 40096 -16381 -29138 31158 5487 -30454 19672
$$ packed form
522c6897N8222n798m0960L6364M585m6421L4777L0722n9980M113O0214m1372l5632
535c8063O2590j990n5201L4511K1808m6863K2110L3756n6469j813O5259l4182
547E453m5677N7968O945n7798L2101L2579n2590P743M4523m4818j1758O1686k9110
560G247n0801N8525J7580o2853K2415L9954n0525k18N2750l9153k6949O0101j5179
573A2894n3120N3056K1985o7561J8370N1223m8362j1740N4700l2494l4256O1144
585B5839l845o1189M2388L2289o3053J1005N5077m7737k1510N9906k2103m2368
597c5301N5611M392o3447L5779M2828n9448l285N5985l6749k6534N8045j5694
609A2182n0084N1202J6303o3636K6030M8099n6477j2757O0296k5671l5941N0126
$$ plain form
621 19672 14008 -35060 10544 33436 -31831 -15177 40583 -9822 -32007 29616 10838 -33626
633 -33626 13309 20043 -29674 4573 30886 -29434 -17427 42319 -5168 -37815 25398 17986
645 17986 -33524 7804 25153 -26706 -3381 30777 -21218 -18499 37911 -3082 -39022 23649
657 23649 24352 -33819 -946 28072 -20869 -9483 29929 -14270 -22649 32113 2780 -36226 19763
670 19763 25722 -33466 -5327 32440 -14956 -16479 26489 -6990 -23762 27268 7781 -35543
682 -35543 13363 27537 -30054 -8537 33277 -12843 -21852 26048 806 -25133 20700 11517
694 11517 -32452 9222 29798 -26604 -13486 32696 -8111 -24355 24384 5132 -27644 15412
706 15412 16189 -28763 3513 28808 -22525 -16212 31815 -2735 -26847 19802 10330 -26153 10681
$$ packed form
621A9672n664m9068M5604K2892o5267J6654N5760n0405k2185O1623j8778m4464
633c3626M6935O734m9717L4247K6313o0320J2007N9746m7487l2647O3213p412
645A7986n1510M1328J7349n1859K3325L4158n1995K719N6410m0993l5940O2671
657B3649P03n8171L2873K9018m8941J1386L9412m4199q379N4762k9333l9006N5989
670A9763N959n9188K8139L7767m7396j523M2968l3479j6772N1030j9487m3324
682c5543M8906J4174n7591K1517M1814m6120r009M7900k5242k5939M5833r183
694A1517m3969M1674K0576n6402J3118M6182m0807j6244M8739j9252l2776M3056
706A5412P77m4952L2276K5295n1333O313M8027l4550k4112M6649r472l6483L6834
$$ plain form
719 10681 19335 -25798 -2254 28662 -16690 -18569 28246 653 -27727 15937 14735 -24343 4113
732 4113 20206 -20818 -5782 27682 -12145 -21138 25449 5408 -27131 12386 17230 -22895 -222
745 -222 21581 -16147 -9451 24438 -8137 -21531 22568 8372 -27506 8048 20066 -20181 -4070
758 -4070 21926 -12426 -12179 22285 -3397 -20993 18242 10124 -25284 4986 21460 -17435 -8832
771 -8832 20879 -7223 -14324 18461 361 -20302 13861 12110 -21952 1696 20813 -13979 -10873
784 -10873 19841 -2470 -15876 13919 4490 -17907 9352 12715 -19117 -1359 20036 -10957
796 -10957 -12589 17666 186 -16337 10774 7539 -15714 4757 12823 -14669 -3179 18410 -8095
809 -8095 -13646 15914 3165 -16359 7597 9251 -13924 1326 12605 -11027 -5258 15241 -5030
$$ packed form
719A0681Q654m5133K3544L0916m5352j879M6815k7593k8380M3664j202l9078K8456
732D113J6093m1024J5036L3464l9827q993M6587k0041l2539L9517M844m0125K2673
745b22K1803l7728O696L3889l2575j3394M4099j4196l5878L5554J2018m0247J6111
758d070K5996l4352K47L4464k5682j7596L9235q118l5408L0270J6474l8895Q603
771h832K9711k8102p101L2785j8100k0663L4163j751l4062K3648J9117l4792L106
784a0873L0714k2311j3406K9795r429k2397K7259L363l1832J7758K1395l0993
796a0957j632L0255j7480j6523K7111l235k3253K0471Q066k7492J1490K1589k6505
809h095n551K9560j2749j9524K3956J654k3175J5250J1279k3632N769K0499k0271
$$ plain form
822 -5030 -12759 13192 5025 -15527 4658 11169 -11102 -1770 11859 -7408 -6320 12685 -2267
835 -2267 -11714 9688 5531 -13255 2387 10999 -8845 -4577 10531 -3597 -7031 9295 10
848 10 -10113 7285 6139 -10832 747 9964 -6521 -5061 9116 -1221 -7442 6155 2020 -8064
862 -8064 4184 5510 -8748 -503 9094 -4710 -5496 7455 237 -6511 4440 3073 -5931 1759
876 1759 4780 -5460 -1082 6825 -3175 -5378 5721 1394 -5807 2179 3042 -4272 415 3727 -3160
891 -3160 -1382 4303 -1312 -3439 3745 1765 -4286 631 3289 -2143 -934 2249 -1375 -1273 2338
906 2338 -482 -2180 1453 1020 -2030 -30 2031 -502 -1425 884 827 -524 198 209 -497 282 642 -167
924 -167 -593 86 684 -640 -903 1299 361 -2097 487 1821 -1268 -719 1654 -566 -1249 2013 418
$$ packed form
822e030p729K5951q167k0552K0185O511k2271R332J3629j9267J088J9005j4952
835b267r447K1402m157j8786J5642Q612j9844M268J5108j4128l434J6326r285
848A0j0123J7398j146j6971J1579R217j6485J460J4177j0337o221J3597m135j0084
862h064J2248J326j4258Q245R597j3804p86J2951p218o748J0951j367r004P690
876A759L021j0240M378P907j0000k203J1099m327p201P986Q63p314M687L312o887
891c160J778N685n615k127P184j980o051M917K658n432J209L183l624J02L611
906B338k820j698L633m33l050K000K061k533r23K309n7j351P22J1p06P79L60q09
924a67m26O79N98j324k63K202r38k458K584J334l089N49K373k220o83L262j595
$$ plain form
941 418 -2526 1299 2112 -2816 -230 3543 -2148 -2612 3638 59 -3586 2469 1566 -4064 1171 3748
957 3748 -3577 -1481 4845 -1601 -3807 4768 1122 -5548 2672 3845 -5185 78 5273 -4274 -2868
972 -2868 6263 -1305 -5719 4895 2174 -6828 2465 5706 -6224 -1555 7440 -3561 -4744 7482
986 7482 -237 -7586 5501 4148 -8115 1431 7125 -6667 -2948 8795 -2927 -7164 7581 1753
1000 1753 -9112 4791 6288 -9139 -151 9320 -5931 -4709 9642 -1917 -8713 7934 3818
1013 3818 -10434 3105 8252 -9056 -2349 10694 -5129 -7463 9997 109 -10142 7439 5467
1026 5467 -11575 2159 10579 -8582 -4548 11671 -3447 -9296 10132 2458 -11882 5870 7637
1039 7637 -11951 540 12282 -8948 -7084 13124 -1630 -11397 9427 4505 -12775 4622 10138
$$ packed form
941D18k944L825Q13m928K586L773n691m64O250l579l645O055r03n630N235K577
957C748p325K096O326o446k206Q575l646o670Q220J173r030N263N195r547J406
972b868R131p568m414J0614k721r002R293L241j1930M669Q995j1001j183J2226
986G482p719p349J3087j353j2263R546N694j3792L719J1743j1722m237J4745n828
1000A753j0865J3903J497j5427Q988R471j5251J222J4351j1559o796J6647m116
1013C818j4252J3539N147j7308O707J3043j5823k334J7460r888j0251J7581j972
1026E467j7042J3734Q420j9161M034J6219j5118n849J9428p674j4340J7752J767
1039G637j9588J2491J1742k1230J864K0208j4754r767K0824m922j7280J7397N516
$$ plain form
1052 10138 -11536 -2042 13485 -7453 -9060 14019 255 -14128 8455 7528 -13270 2284 11405
1065 11405 -11048 -4307 14491 -5265 -11217 13065 2685 -15103 7480 10540 -13724 -733
1077 -733 13512 -9211 -6449 14692 -3862 -13255 12410 5333 -15780 5062 11937 -13523 -2961
1090 -2961 15430 -7451 -9767 14456 -1002 -14272 11853 7471 -17064 3115 14551 -12161
1102 -12161 -5350 15546 -6113 -11709 14443 1928 -16098 9273 9736 -16766 1155 16679 -11327
1115 -11327 -8830 16046 -2742 -12783 12930 3667 -16680 7568 12569 -15642 -2384 17071
1127 17071 -9165 -11095 16102 133 -15281 10316 6496 -15601 5655 13439 -15411 -4687
1139 -4687 18505 -6129 -13292 14485 2844 -15894 8572 9577 -15184 1952 13931 -13351
$$ packed form
1052A0138k1674R494J5527k0938j607K3079j3764j4383K2583r27k0798J5554R121
1065A1405k2453O741J8798j9756n952K4282j0380j7788K2583L060k4264J2991
1077g33J4245k2723K762K1141j8554r393K5665p077k1113K0842O875k5460J0562
1090b961J8391k2881k316K4223j5458j3270K6125m382k4535K0179J1436k6712
1102a2161O811K0896k1659n596K6152j2515j8026K5371M63k6502J7921J5524k8006
1115a1327K497K4876j8788j0041K5713r263k0347K4248N001k8211J3258J9455
1127A7071k6236j930K7197j5969j5414K5597l820k2097K1256P784k8850J0724
1139d687K3192k4634p163K7777j1641j8738K4466J005k4761J7136J1979k7282
$$ plain form
1151 -13351 -5712 18832 -5530 -16279 14165 6531 -16239 5552 11000 -14080 -378 15474
1163 15474 -10585 -8434 17519 -3176 -16707 13907 9036 -18136 2014 13825 -11256 -3345
1175 -3345 14338 -8637 -10116 16638 316 -17283 10679 10641 -17344 295 16522 -9928 -7904
1188 -7904 13873 -4165 -10344 14260 1437 -17786 8716 13131 -15780 -3040 16238 -8228
1200 -8228 -10041 14556 -573 -12893 10741 4155 -15729 7493 13720 -16032 -5327 17781 -4983
1213 -4983 -11824 12672 1238 -13925 9184 7665 -15173 3154 13544 -13715 -5935 18426 -4062
1226 -4062 -15008 11541 5281 -12939 6453 8156 -14480 1025 15350 -10418 -8748 15934 -1875
1239 -1875 -14985 11082 7784 -14472 2320 10018 -10925 -541 14072 -9585 -10399 15789 1938
$$ packed form
1151a3351P639K4544k4362j0749L0444p634k2770K1791N448k5080J3702J5852
1163A5474k6059K151K5953k0695j3531L0614m871k7172K0150J1811k5081P911
1175c345J7683k2975j479K6754j6322j7599K7962l8k7985J7639J6227k6450K024
1188g904K1777j8038o179K4604j2823j9223K6502M415k8911J2740J9278k4466
1200h228j813K4597j5129j2320K3634o586j9884K3222O227k9752J0705K3108k2764
1213d983o841K4496j1434j5163K3109j519k2838J8327J0390k7259P780K4361k2488
1226d062j0946K6549o260j8220J9392J703k2636J5505J4325k5768J670K4682j7809
1239a875j3110K6067l298k2256J6792P698k0943J0384J4613k3657q14K6188j3851
$$ plain form
1252 1938 -15144 7783 8598 -13539 1151 12500 -9447 -4639 12574 -6340 -9539 14781 1974
1265 1974 -16924 6086 11669 -11380 -1699 11407 -8177 -5778 13360 -2985 -11277 11212 3480
1278 3480 -14904 6155 12448 -12385 -4947 12383 -4153 -6596 10609 -2370 -11728 10180 6694
1291 6694 -13726 2069 11509 -10200 -4855 13434 -2851 -9770 8413 1328 -9359 7955 5857
1304 5857 -13686 407 13105 -6803 -7076 10236 -1773 -9287 8712 3681 -10509 3945 6647
1317 6647 -10035 637 12143 -7226 -8898 10356 2113 -8420 5222 2960 -9679 3684 8712
1330 8712 -8805 -2991 9981 -4763 -7333 10225 2114 -10452 3146 5679 -6263 1968 6443
1343 6443 -8524 -3340 11218 -1634 -8738 6265 2815 -8461 3323 6520 -6923 -1613 6164
$$ packed form
1252A938j7082K2927Q15k2137J4690J1349k1947M808J7213j8914l199K4320j2807
1265A974j8898K3010N583k3049R681J3106j9584K399J9138j6345q292K2489p732
1278C480j8384K1059O293k4833P438J7330j6536k443J7205j2979r358K1908l486
1291F694k0420J5795R440k1709N345J8289j6285o919J8183p085j0687J7314k098
1304E857j9543J4093J2698j9908k73J7312j2009p514J7999n031j4190J4454K702
1317F647j6682J0672J1506j9369j672J9254q243j0533J3642k262j2639J3363N028
1330H712j7517N814J2972j4744k570J7558q111j2566J3598K533j1942Q231M475
1343F443j4967N184J4558j2852p104J5003l450j1276J1784L197j3443N310P777
$$ plain form
1356 6164 -4475 -2256 8765 -2606 -9463 6114 6236 -6846 -344 4920 -4912 -795 7137 -3339
1370 -3339 -4928 6016 -426 -6576 5640 4769 -8301 -1891 6798 -1306 -2311 3625 -3221 -3752 6963
1385 6963 1557 -7228 2208 4593 -5373 -531 6526 -2449 -4697 3165 540 -1910 3860 -606 -6841
1400 -6841 2831 6632 -4151 -3475 4033 -757 -2634 3823 673 -3718 1412 1179 -2791 2604 3695
1415 3695 -5207 -3471 5525 2081 -3562 -84 161 -1704 2570 1821 -3562 -297 2690 -2074 -998
1430 -998 4212 -63 -4604 132 3228 435 -311 -1102 -2584 1412 3888 -1522 -3179 1328 943 -1413
1446 -1413 993 1639 -1405 -1682 325 1301 1587 250 -2863 -1690 3124 2692 -1931 -2348 396 1076 467
1463 467 62 -304 -667 -825 -2 1275 1149 -577 -2305 -1088 2641 2711 -1787 -3130 510 2364 476
$$ packed form
1356F164j0639K219J1021j1371o857J5577J22j3082O502N264r832M117P932j0476
1370c339j589J0944o442o150J2216q71j3070O410Q689q104j005N936o846n31J0715
1385F963n406q785R436K385r966M842P057q975k248P862k625k450N770m466o235
1400f841R672L801j0783O76P508m790j877O457l150m391N130k33l970N395J091
1415C695q902J736Q996l444n643L478K45j865M274p49n383L265K987m764J076
1430i98N210m275m541M736L096k793p46p91j482L996K476n410j657M507l85k356
1446a413K406O46l044k77K007R76K86j337l113J173M814m32m623m17K744O80o09
1463D67m05l66l63j58Q23J277j26j726j728J217L729P0m498j343L640J854j888
$$ plain form
1480 476 -474 -460 -1001 -54 1309 83 -231 432 -1917 -1672 3367 2477 -3220 -2436 1567 1342 753 472
1498 472 -2362 -1592 2899 1307 -2299 777 1142 -3353 -105 4333 -352 -3228 109 14 197 3329
1514 3329 -656 -5116 1018 4562 -1705 -1727 2559 -1458 -2669 3485 1714 -2950 456 318 -2951 2777
1530 2777 4337 -4777 -4053 4550 1703 -2767 1590 149 -3986 2253 3907 -3287 -757 3292 -3417
1545 -3417 -1927 6471 436 -6602 1028 3451 -2111 1364 2171 -5365 -1120 6453 -1271 -4395 3815
1560 3815 141 -5490 3767 4907 -5170 -1868 3729 -2230 -178 5667 -3482 -6382 5502 3857
1574 3857 -5628 914 3511 -5388 -489 6909 -2488 -4454 4196 -914 -4133 6291 2701 -8663
1588 -8663 44 7194 -2875 -2241 4816 -3311 -4555 6866 1710 -6807 2623 3042 -6609 1761 7783
$$ packed form
1480D76r50J4n41R47J363j226l14O63k349K45N039q90n697P84M003k25n89k81
1498D72k834P70M491j592l606L076L65m495L248M438m685k876L337r5J83L132
1514C329l985m460O134L544o267k2M286m017j211O154j771m664L406j38l269N728
1530B777J560r114P24Q603k847m470M357j441m135O239J654p194K530M049o709
1545c417J490Q398o035p038P630K423n562L475Q07p536M245P573p724l124Q210
1560C815l674n631R257J140j0077L302N597n959K052N845r149k900J1884j645
1574C857r485O542K597q899M899P398r397j966Q650n110l219J0424l590j1364
1588h663Q707P150j0069O34P057q127j244J1421n156q517R430M19r651Q370O022
$$ plain form
1603 7783 -5385 -5573 6159 567 -4019 5008 272 -8019 3829 6921 -6087 -1828 6226 -4408
1617 -4408 -3966 8517 269 -8108 3240 3336 -5384 3152 5169 -8210 -2625 9407 -1623 -6028
1631 -6028 5736 158 -7501 5310 5796 -7557 -929 5789 -4949 -1463 8688 -3582 -8719 6582
1645 6582 4297 -6953 2195 4466 -7565 -223 8983 -3846 -5286 6456 -1304 -6261 7528 3688
1659 3688 -10066 481 7704 -4472 -1812 6672 -4690 -5918 8491 1823 -8045 3670 3618 -8118
1673 -8118 2284 8953 -6400 -5385 7409 -692 -4840 6727 384 -9333 4152 7213 -6943
1686 -6943 -1231 6931 -5619 -4258 9489 -80 -8509 4196 3081 -6407 3850 6088 -8710 -2766
1700 -2766 9471 -1953 -5788 6351 -262 -8032 5687 5810 -7835 -505 6020 -5587 -1691 9214
$$ packed form
1603G783j3168j88J1732n592m586R027m736q291J1848L092j3008M259Q054j0634
1617d408M42J2483q248q377J1348R6q720Q536K017j3379N585J2032j1030m405
1631f028J1764n578p659J2811M86j3353O628O718j0738L486J0151j2270n137J5301
1645F582k285j1250R148K271j2031P342R206j2829j440J1742p760m957J3789l840
1659C688j3754J0547P223j2176K660Q484j1362j228J4409o668r868J1715n2j1736
1673h118J0402O669j5353J015J2794q101m148J1567o343r717J3485L061j4156
1686f943N712Q162j2550J361J3747r569q429J2705j115r488J0257K238j4798N944
1700b766J2237j1424l835J2139o613p770J3719J23j3645P330O525j1607L896J0905
$$ plain form
1714 9214 -3201 -8574 6337 3828 -6635 2890 4244 -8072 -8 9017 -4130 -5073 6723 -1578
1728 -1578 -6740 7349 3879 -9361 399 6581 -4674 -799 6867 -5330 -5863 8683 1774 -7937
1742 -7937 3814 3779 -7824 1741 8291 -5638 -4437 6545 -1696 -4356 7374 345 -9825 3667
1756 3667 7403 -6239 -1643 6181 -4790 -3684 8418 -475 -7289 4652 2363 -6994 3873 6662
1770 6662 -8014 -3584 8170 -1172 -4580 5376 -1025 -7032 5844 4797 -7777 216 6216 -5628
1784 -5628 -2212 8603 -2080 -7260 4885 2389 -5029 3891 2939 -8414 602 8862 -4209 -5137
1798 -5137 6173 -930 -5722 5749 2815 -7091 1371 4260 -5282 752 7191 -5552 -6161 7747
1812 7747 2486 -6372 2229 2391 -5549 2287 5535 -5585 -2156 6195 -3099 -4472 7331 1379 -8455
$$ packed form
1714I214j2415n373J4911k509j0463R525J354j2316Q064R025j3147r43J1796q301
1728a578n162J4089l470j3240R760O182j1255L875P666j2197n33J4546o909r711
1742g937J1751l5j1603R565O550j3929J201J0982q241k660J1730p029j0170J3492
1756C667L736j3642M596P824j0971J106J2102q893o814J1941k289r357J0867K789
1770F662j4676M430J1754r342l408R956o401o007J2876j047j2574P993O000j1844
1784e628L416J0815j0683n180J2145k496p418Q920r52j1353R016Q260j3071r28
1798e137J1310p103m792J1471k934r906Q462K889r542O034O439j2743o09J3908
1812G747n261q858Q601J62p940P836L248j1120L429Q351r294j373J1803n952r834
$$ plain form
1827 -8455 1479 5743 -3297 -425 3154 -4878 -1094 7577 -1989 -6298 5024 2224 -6498 2374 5699
1842 5699 -4994 -2894 4249 -1133 -1104 4483 -3183 -5806 6276 4165 -6964 -316 5211 -3443 -1828
1857 -1828 5212 -1215 -3656 3082 -286 -3254 4855 2007 -7692 -54 7432 -1966 -4189 3065 -366
1872 -366 -2715 3819 778 -4474 2075 2511 -4567 829 5909 -3522 -5189 4239 2523 -2950 800
1887 800 86 -3459 2665 3693 -4397 -1518 4439 -1749 -3178 4371 1418 -4736 249 2661 -1241
1902 -1241 992 1568 -4214 -814 5599 -628 -4367 2148 1467 -3034 1333 2665 -2682 -1082 2107
1917 2107 -1274 -179 3404 -1865 -4207 3005 3368 -2841 -949 1611 -1507 192 2812 -1528 -2199
1932 -2199 2023 -16 -2116 2304 1610 -3683 -955 3221 137 -1136 726 -1360 -980 3084 691
$$ packed form
1827h455R934M264r040K872L579q032L784Q671r566m309J1322k800q722Q872L325
1842E699j0693K100P143n382K9N587p666k623J2082k111j1129O648N527q654J615
1857a828P040o427k441O738l368k968Q109k848r699P638P486r398k223P254l431
1872c66k349O534l041n252O549M36p078N396N080r431j667R428j716n473L750
1887H00p14l545O124J028q090K879N957o188j429P549k953o154M985K412l902
1902a241K233N76n782L400O413o227l739O515o81m501M367J332n347J600L189
1917B107l381J095L583n269k342P212L63o209J892K560l118J699K620m340o71
1932b199M222k039k100M420o94n293K728M176l084j273J862k086L80M064k393
$$ plain form
1947 691 -3106 322 1715 -1466 25 2244 -1151 -2028 1182 725 -474 1011 -646 -2515 1305 2829
1963 2829 -1318 -1678 894 9 -189 1407 -185 -1591 361 722 -537 638 821 -1893 -1129 1973
1979 1973 1083 -1155 -640 -295 -45 1338 548 -1467 -544 903 167 -48 722 -194 -1214 32 1148
1996 1148 472 -373 -898 -800 842 1367 -275 -1353 -333 729 537 -69 -265 -248 -451 60 755 472 -500
2015 -500 -809 -274 773 1062 -199 -1457 -483 1267 607 -677 -268 -85 -435 511 734 -414 -343 23
2033 23 -425 509 1519 -516 -1856 360 1511 -175 -431 4 -908 72 1443 -401 -1073 757 -154
2050 -154 -1054 1298 1162 -1686 -962 1238 304 -136 720 -997 -1252 1786 1105 -1851 -3 1072 -1339
2067 -1339 -69 1944 -665 -1616 881 275 -762 1401 320 -2472 371 2581 -918 -1221 1424 -569
$$ packed form
1947F91l797L428J393l181J491K219l395q77L210m57j199J485j657j869L820J524
1963B829m147l60K572q85j98J596j592j406J952L61j259J175J83k714P64L102
1979A973q90k238N15L45K50J383p90k015R23J447p36k15P70r16j020J246J116
1996A148o76q45n25R8J642N25j642j078J020J062j92o06j96J7k03N11O95k83r72
2015e00l09N35J047K89j261j258R74J750o60j284M09J83l50R46K23j148P1L66
2033B3m48R34J010k035j340K216J151j686k56M35r12R80J371j844o72J830r11
2050a54r00K352j36k848P24K200r34m40Q56j717k55L038o81k956J848J075k411
2067a339J270K013k609r51K497o06j037K163j081k792K843K210l499l03K645j993
$$ plain form
2083 -569 -1227 2043 490 -2227 529 1035 -1599 468 2153 -1914 -1853 2424 566 -1798 1040 436
$$ packed form
2083e69o58L270j553k717K756N06k634K067J685m067O1M277j858k364K838o04
$$ [...]
8191C7
##END NTUPLES=NMR FID
##END=
