##TITLE=1H_IVA0503-2
 CDCl3
 8 sc, 
 6.3.2024
##JCAMPDX= 6.0         $$ Bruker NMR JCAMP-DX V2.0
##DATA TYPE= NMR FID
##DATA CLASS= NTUPLES
##ORIGIN= UXNMR, Bruker Analytische Messtechnik GmbH
##OWNER= root
$$ XWIN-NMR		Version 3.5
$$ Wed Mar  6 13:35:39 2024 Russian Standard Time (UT+4h)  she@DPX200
##.OBSERVE FREQUENCY= 200.1313
##.OBSERVE NUCLEUS= ^1H
##.DELAY= (6, 6)
##.ACQUISITION MODE= SIMULTANEOUS
##.ACQUISITION SCHEME= undefined
##.AVERAGES= 8
##.DIGITISER RES= 18
##SPECTROMETER/DATA SYSTEM= spect
##.PULSE SEQUENCE= zg30
##.SOLVENT NAME= CDCl3
##.SHIFT REFERENCE= (INTERNAL, CDCl3, 0, 15.7039)
##AUDIT TRAIL= $$ (NUMBER, WHEN, WHO, WHERE, WHAT)
$$ ##TITLE= Audit trail, XWIN-NMR		Version 3.5
$$ ##JCAMPDX= 5.01
$$ ##ORIGIN= Bruker BioSpin GmbH
$$ ##OWNER= she
$$ F:/spectra/data/she/nmr/H-F/1/audita.txt
$$ ##AUDIT TRAIL=  $$ (NUMBER, WHEN, WHO, WHERE, WHAT)
(   1,<2024-03-06 13:34:39.28 +0400>,<she>,<DPX200>,
      <created by zg, POWCHK disabled, PULCHK disabled
       configuration hash MD5:
       00 E9 B6 7A A2 85 ED C7 34 08 36 98 17 FE 4E 26
       data hash MD5: 16K
       C5 00 D9 2A 46 9E 23 F4 3F EC D0 53 E1 7B 22 20>)
$$ ##END=
$$ 
$$ hash MD5
$$ D8 C1 C6 F6 02 7F FF 24 3A DB FE D2 B0 09 92 1E
##$RELAX= 
##$RELAX= 
##$RELAX= 
##$RELAX= 
##$RELAX= 
##$RELAX= 
$$ Bruker specific parameters
$$ --------------------------
##$DU= <F:/spectra>
##$EXPNO= 1
##$NAME= <H-F>
##$PROCNO= 1
##$TYPE= <nmr>
##$USER= <she>
##$AMP= (0..31)
100 100 100 100 100 100 100 100 100 100 100 100 100 100 100 100 100 100 
100 100 100 100 100 100 100 100 100 100 100 100 100 100 
##$AQSEQ= 0
##$AQ_mod= 1
##$AUNM= <au_zg>
##$AUTOPOS= <>
##$BF1= 200.13
##$BF2= 200.13
##$BF3= 200.13
##$BF4= 200.13
##$BF5= 200.13
##$BF6= 200.13
##$BF7= 200.13
##$BF8= 200.13
##$BYTORDA= 1
##$CFDGTYP= 0
##$CFRGTYP= 5
##$CHEMSTR= <none>
##$CNST= (0..31)
1 1 145 1 1 1 1 1 1 1 1 1 1 1 1 1 1 1 1 1 1 1 1 1 1 1 1 1 1 1 1 1 
##$CPDPRG= <>
##$CPDPRG1= <>
##$CPDPRG2= <>
##$CPDPRG3= <>
##$CPDPRG4= <mlev>
##$CPDPRG5= <mlev>
##$CPDPRG6= <mlev>
##$CPDPRG7= <mlev>
##$CPDPRG8= <mlev>
##$CPDPRGB= <>
##$CPDPRGT= <>
##$D= (0..31)
0 1.2 0 0 0 0 0 0 0 0.06 0 0.03 0 0 0 0 0.0002 0 0 0 0 0 0 0 0 0 0 0 0 
0 0 0 
##$DATE= 1709717678
##$DBL= (0..7)
120 120 120 120 120 120 120 120 
##$DBP= (0..7)
150 150 150 150 150 150 150 150 
##$DBP07= 0
##$DBPNAM0= <>
##$DBPNAM1= <>
##$DBPNAM2= <>
##$DBPNAM3= <>
##$DBPNAM4= <>
##$DBPNAM5= <>
##$DBPNAM6= <>
##$DBPNAM7= <>
##$DBPOAL= (0..7)
0.5 0.5 0.5 0.5 0.5 0.5 0.5 0.5 
##$DBPOFFS= (0..7)
0 0 0 0 0 0 0 0 
##$DE= 6
##$DECBNUC= <off>
##$DECIM= 32
##$DECNUC= <off>
##$DECSTAT= 4
##$DIGMOD= 1
##$DIGTYP= 9
##$DL= (0..7)
0 120 120 120 120 120 120 120 
##$DP= (0..7)
150 150 150 150 150 150 150 150 
##$DP07= 0
##$DPNAME0= <>
##$DPNAME1= <>
##$DPNAME2= <>
##$DPNAME3= <>
##$DPNAME4= <>
##$DPNAME5= <>
##$DPNAME6= <>
##$DPNAME7= <>
##$DPOAL= (0..7)
0.5 0.5 0.5 0.5 0.5 0.5 0.5 0.5 
##$DPOFFS= (0..7)
0 0 0 0 0 0 0 0 
##$DQDMODE= 0
##$DR= 18
##$DS= 0
##$DSLIST= <SSSSSSSSSSSSSSS>
$$ [...]
##$SUBNAM2= <"">
##$SUBNAM3= <"">
##$SUBNAM4= <"">
##$SUBNAM5= <"">
##$SUBNAM6= <"">
##$SUBNAM7= <"">
##$SUBNAM8= <"">
##$SUBNAM9= <"">
##$SW= 18.0517328524113
##$SWIBOX= (0..15)
0 0 2 0 0 0 0 0 0 0 0 0 0 0 0 0 
##$SW_h= 3612.71676300578
##$TD= 16384
##$TD0= 1
##$TE= 0
##$TE2= 300
##$TE3= 300
##$TEG= 300
##$TL= (0..7)
0 120 120 120 120 120 120 120 
##$TP= (0..7)
150 150 150 150 150 150 150 150 
##$TP07= 0
##$TPNAME0= <>
##$TPNAME1= <>
##$TPNAME2= <>
##$TPNAME3= <>
##$TPNAME4= <>
##$TPNAME5= <>
##$TPNAME6= <>
##$TPNAME7= <>
##$TPOAL= (0..7)
0.5 0.5 0.5 0.5 0.5 0.5 0.5 0.5 
##$TPOFFS= (0..7)
0 0 0 0 0 0 0 0 
##$TUNHIN= 0
##$TUNHOUT= 0
##$TUNXOUT= 0
##$USERA1= <user>
##$USERA2= <user>
##$USERA3= <user>
##$USERA4= <user>
##$USERA5= <user>
##$V9= 5
##$VALIST= <valist>
##$VCLIST= <CCCCCCCCCCCCCCC>
##$VD= 0
##$VDLIST= <DDDDDDDDDDDDDDD>
##$VPLIST= <PPPPPPPPPPPPPPP>
##$VTLIST= <TTTTTTTTTTTTTTT>
##$WBST= 1024
##$WBSW= 4
##$XGAIN= (0..3)
0 0 0 0 
##$XL= 0
##$YL= 0
##$YMAX_a= 172382
##$YMIN_a= -176707
##$ZGOPTNS= <>
##$ZL1= 120
##$ZL2= 120
##$ZL3= 120
##$ZL4= 120
##$ABSF1= 10
##$ABSF2= 0
##$ABSG= 5
##$ABSL= 3
##$ALPHA= 0
##$AQORDER= 0
##$ASSFAC= 0
##$ASSFACI= 0
##$ASSFACX= 0
##$ASSWID= 0
##$AUNMP= <proc_1d>
##$AZFE= 0.1
##$AZFW= 0.1
##$BCFW= 1
##$BC_mod= 2
##$BYTORDP= 1
##$COROFFS= 0
##$CY= 11.3945322036743
##$DATMOD= 1
##$DC= 2
##$DFILT= <>
##$DTYPP= 0
##$F1P= 15.7292609196834
##$F2P= 12.9074282941183
##$FCOR= 0.5
##$FTSIZE= 0
##$FT_mod= 4
##$GAMMA= 1
##$GB= 0.15
##$INTBC= 1
##$INTSCL= 1
##$ISEN= 128
##$LB= 0.24
##$LEV0= 0
##$LPBIN= 0
##$MAXI= 10000
##$MC2= 0
##$MEAN= 0
##$ME_mod= 0
##$MI= 1.114404
##$NCOEF= 0
##$NC_proc= 0
##$NLEV= 6
##$NOISF1= 3.799351
##$NOISF2= 2.8
##$NSP= 1
##$NTH_PI= 0
##$NZP= 0
##$OFFSET= 15.70392
##$PC= 1
##$PHC0= -24852.57
##$PHC1= 9.58731
##$PH_mod= 1
##$PKNL= yes
##$PPARMOD= 0
##$PSCAL= 0
##$PSIGN= 0
##$REVERSE= no
##$SF= 200.130013532006
##$SI= 16384
##$SIGF1= 3
##$SIGF2= 2
##$SINO= 400
##$SIOLD= 16384
##$SREGLST= <1H.CDCl3>
##$SSB= 0
##$STSI= 0
##$STSR= 0
##$SW_p= 3612.71676300578
##$SYMM= 0
##$S_DEV= 0
##$TDeff= 0
##$TDoff= 0
##$TI= <>
##$TILT= no
##$TM1= 0
##$TM2= 0
##$TOPLEV= 0
##$USERP1= <user>
##$USERP2= <user>
##$USERP3= <user>
##$USERP4= <user>
##$USERP5= <user>
##$WDW= 1
##$XDIM= 8192
##$YMAX_p= 0
##$YMIN_p= 0
$$ End of Bruker specific parameters
$$ ---------------------------------
##NTUPLES= NMR FID
##VAR_NAME=  TIME,          FID/REAL,        FID/IMAG
##SYMBOL=    X,             R,               I
##VAR_TYPE=  INDEPENDENT,   DEPENDENT,       DEPENDENT
##VAR_FORM=  AFFN,          ASDF,            ASDF
##VAR_DIM=   8192,          8192,            8192
##UNITS=     SECONDS,       ARBITRARY UNITS, ARBITRARY UNITS
##FACTOR=    0.0002768,     1,               1
##FIRST=     0,             0,               0
##LAST=      2.2672688,     0,               0
##MIN=       0,             -176707,         0
##MAX=       2.2672688,     172382,          0
$$ Real data points
##PAGE= N=1
##DATA TABLE= (X++(R..R)), XYDATA
0@%%%%%%%%%%%JrJ6j6J6j8K6l3M1m9N7o8P9r3J09j27J48j72J98k26K57k94L35
34A78l80M28m79N38o02O73p49Q32r25J025j135J254j384J526j681J853k043K251
52A180k481K735l019L340l702M115m593N151n818O628p629Q911j0622J3031j6689
67i462K2960l6531J14611j01578j66707K69412l8949j36755J19456Q630j39146
78i4059J39322J8038j85286J30216J59060k61576m8418K74269n9668j83718J29708
89A7888J8829j06207J18032J3405j72041J16890J13359k12198P304K33646j25914
100B2993j62940J70522L8362j22278Q2311K984j33732J23246R2592j97370J8844
111f4466J86723j34954j05140J90377l314j49867Q4188L1952j01141J03313M8308
$$ y = [0, 0, 0, 0, 0, 0, 0, 0, 0, 0, 0, 0, 1, -8, 8, -8, 8, -10, 16, -17, 24, -25, 32, -36, 43, -50, 59, -68, 80, -92, 106, -120, 137, -157, 178, -202, 226, -253, 285, -317, 356, -393, 439, -486, 539, -596, 658, -726, 800, -881, 972, -1071, 1180, -1301, 1434, -1585, 1755, -1947, 2168, -2425, 2726, -3092, 3536, -4093, 4818, -5804, 7227, -9462, 13498, -23033, 91578, -10000, -176707, 92705, 53756, -82999, 36457, 45087, -94059, 45263, 63301, -121985, 8231, 167291, -94285, -142703, 131566, 71898, -111820, 17888, 36717, -69490, 48542, 61947, -110094, 6796, 120155, -92043, -84739, 148907, 22993, -139947, 30575, 68937, -53341, 28970, 31954, -101778, 21468, 114060, -83310, -64466, 122257, -12697, -117837, 72540, 69226, -80641, 3547, 35499, -65642, 37671, 85979]
122H5979j86079M5561J75557j32192q2943J66002l5891j27679J14335L3670j12056
133e5736P2401L5274j40233P1385J37781j50192o7937J61495l1057j02543J04139
144C4777N863j10001P9534M3991j15237N8307R0579j41560k4170J61176m7917
155C5342j06683Q9701P941q0021Q2220K2491j16895N5967Q1402j17496p67J31488
167H4690p7119r0787J08851J4980p8817N8233M511r1583P5382O7490j21305J089
179d4385J13603p5499o0316J12725q155q9911N6899J7687o4381O5843L0397j17342
191f2835K6015J11131p6533n3714R5910k0764p3232O9975J8068o7715M4031J8607
203B8944q3561M7679Q2286r4643m2076R9020j5483o1455N8920K771o3318M7410
$$ y = [85979, -100100, -54539, 121018, -11174, -94117, 71885, 35994, -91685, 22650, 56320, -55736, 16665, 51939, -88294, -16909, 120872, -29320, -97257, 64238, 33181, -69362, 34777, 40640, -69361, 10173, 54164, -61073, -2766, 87813, -53747, -77917, 83259, 35342, -71341, 18360, 26301, -53720, 28500, 50991, -65904, -9937, 71465, -46031, -46798, 84690, 7571, -83216, 25635, 40615, -38202, 20031, 24542, -67041, 8341, 75831, -45474, -44385, 69218, -6281, -66597, 46128, 37973, -51938, 4961, 22648, -41733, 24110, 54507, -62835, -36820, 74311, -2222, -55936, 39974, 19210, -54022, 15953, 34021, -33694, 10337, 28944, -54617, -6938, 75348, -19295, -61371, 37649, 22166, -39289, 19631, 22402, -40916, 6494]
215F494K4332o6466L7773M9071q8923q249J01123l3039o7900N4147Q110m5227
227b8754M5898J0489o5940L4594M3161o9488O886P7445n4179n4446P1253J1776
239B8695m9571K8884K647m6871M4268L3049o8349N492O1094m7758k9957O9774
251C1397o992n7659L0647J6706l0915L1022J0127o0349J9708N7006m4193k5650
263b9145N2825j4326m1903L9968J5998l7225J4029Q950l4470K7835L5954n2601
275a4111j8195N3186r036l2384L0658L415l4437J8609J6828k4685J3868J4921
287A8637m1356L422N0477j9895l6285K6574P977k1137J7562P068k6395R547J5039
300A1235k2769Q145K7834k9068k2812L5621R768k4779M788M094j3113J4278J0593
$$ y = [6494, 30826, -35640, 2133, 51204, -37719, -45968, 55155, 22116, -45784, 8363, 16473, -28754, 17144, 27633, -38307, -3713, 39448, -30040, -23154, 54291, 112, -54334, 16919, 28695, -20876, 8008, 10655, -36216, 8052, 41101, -27248, -21756, 39338, -8420, -38377, 31397, 24405, -33254, -2607, 14099, -16816, 14206, 24333, -36016, -16308, 40698, -3495, -29145, 23680, 9354, -32549, 7419, 23417, -13808, 221, 9171, -25299, 2536, 38490, -14111, -32306, 20880, 11844, -20540, 10118, 13533, -20904, -2295, 14533, -10152, 3716, 18637, -22719, -19297, 31180, 11285, -25000, 1574, 9551, -11586, 5976, 13044, -13351, -3804, 11235, -11534, -3389, 24445, -4623, -27435, 8186, 17954, -6825, -2037, 2057, -11056, 3222, 13815]
313A3815k1137J753J5990j7506n013K8262m215k7706P236J5329m097J891k153
326B449j4328P962J5270j1482n617J2711o718j2841J3694J1978j1230r075J735
339e492M150Q604P63j3903k766J2046M47o238M272K105q326k999Q832P463n100
354C858j0745j098R597O647m589q553n00O985J611m434K334L746q887n467J3022
369C527P151j0765o548K063L865Q248j522j4041K248J2537o762n416J2819k362
383E042j5865O466J1839m556j176k401j0792J1030J6230j7301j1245J8416j452
396D235j4324J3786O981j7410J233Q990p529Q040R136k4415m315L0759n575k3209
410a3617J5482O172j9203J0313J2700j7178K321J1352j9406L394K9723j9082k6660
$$ y = [13815, -7322, -5569, 10421, -7085, -12098, 16164, 11949, -15757, -8521, 6808, 2711, 4602, 2449, -11879, -3917, 11353, -129, -5746, 6965, 247, -12594, 1100, 13078, 1848, -7227, -5492, -1342, 7262, 8025, -5878, -8644, 3402, 3849, -2389, 1883, 3988, -4338, -7337, 1495, 8958, 3858, -6887, -7985, 1612, 8259, 3670, -4883, -5383, 1602, 3213, -1221, 1113, 4859, -4028, -9495, 3527, 10678, -87, -6635, -4572, -707, 7541, 6019, -8022, -5774, 6763, 1, -5415, 7404, 5042, -10823, -4357, 7482, 2926, 1750, -651, -11443, -413, 15817, -1484, -12729, 5687, 4235, -10089, 3697, 10678, -6732, -5499, 3491, -4038, 4002, 13138, -11277, -15592, 15167, 9592, -13617, 1865, 8037, -11166, -853, 11847, -5331, -3010, 8342, -11064, -7670, 22053, 2971, -23689]
423b3689K7541J0909k4127R210J0174k1548P838J8083k1604M9K5185k2944j7737
436b2660L7601K842l5391J2253J6575j9729R138J4759k8106K046L0191k2903j4851
449a8235L7169q472l6502K6322J9982k8912M812J4743k5389R218L0192l1593j5575
462b2240M1315j0930l3707L4088J2901l9829J0799K3553k5351O802K3940l5600
474a4259o992M7897j7530l7399L7121R942m0853J9042K5110l3638L489K5951l1093
487a3212n56M3734k8611l4863M6572R040m4077K0066K2547l6365P601K9872l1911
500a0163k812L8509l0823k4896N2784j466n1007K6672K6135l7446Q727K7674l5472
513a3584p95M0280l0640k0740N0938j2068m9088L9968K5276m7508Q401L0260l4406
$$ y = [-23689, 3852, 14761, -9366, -156, 10018, -11530, -3692, 14391, -7213, -7164, 18021, -4923, -22660, 14941, 17783, -17608, -5355, 11220, -8509, 629, 15388, -12718, -10672, 19519, -3384, -18235, 18934, 10462, -26040, 282, 20264, -8648, -3836, 10907, -14482, -5264, 24928, -6665, -22240, 19075, 8145, -25562, 8526, 21427, -18402, -7603, 15950, -9401, -2599, 21341, -14259, -21251, 26646, 9116, -28283, 8838, 18780, -22073, -3031, 22079, -11559, -8070, 17881, -13212, -13768, 29966, 1355, -33508, 13064, 22104, -21973, -1907, 20640, -15725, -8124, 21748, -10163, -12975, 25534, -5289, -30185, 22599, 21133, -29874, -3202, 22933, -14513, -5786, 21888, -13584, -14379, 25901, -4739, -25479, 25459, 13391, -35697, 4271, 29547, -17961, -9560, 20700, -13706]
526a3706K800L8822l5283j8803N1298j5427m3403M5553J6163n4591J6371L6528
538B6322l7195j93L5722l5465j2703N1948k0143m1405M6138J0084n1968K4818
550d040L3979m4800l27L9068l2283j0585M7107k5430l6298N0081N775n0690K8196
563b47K7479m7391P519M1056l6685j1818M5531k5640k9834N1296k160n1012L3371
576A465K4798m7371J3470L6582m3233o188M9193k8622k8521N0228p372m7324L8988
589F093K0986m9487J5522L2892m3048J844M7042l6592k5500N3532r787m4748L9970
602H719J5544m8687J8912L0922m1046M589L9892l9605j6252N5714j7233m4979
614c3510M2859J3725m7221K0913K7718m0615O043L5403l7444q170N0866k6614
$$ y = [-13706, -10906, 27916, -7367, -26170, 25128, 9701, -33702, 11851, 28014, -26577, -10206, 26322, -10873, -11066, 24656, -10809, -23512, 28436, 8293, -33112, 13026, 23110, -28858, -4040, 29939, -14861, -15188, 23880, -8403, -18988, 28119, 2689, -33609, 16472, 22247, -28443, -247, 27232, -20159, -12640, 28416, -8269, -20087, 25444, -196, -30030, 21266, 19106, -31906, 1465, 26263, -21108, -7638, 28944, -14289, -20477, 28716, 94, -28427, 21801, 14429, -32895, 6093, 27079, -22408, -6886, 26006, -17042, -15198, 31844, -4748, -30248, 23284, 13497, -31251, 8719, 24263, -24424, -5512, 25410, -15636, -11047, 28845, -10760, -27012, 28702, 11469, -33510, 9349, 23074, -24147, -3234, 24484, -16131, -10088, 25315, -12129, -20299, 30567, 3953]
626C953l9360N0419R319n0491K3070K6721m0130Q372L2309l6853l591M4737l1304
639b829k8876N4052j841n2588L0850K7558m2637Q127L0516l5373l36M0172l2377
652e582k0782N1174j1600m7097L9357K2505m7607R599L1939l2785l32L4984l1237
665g464j5117M6969j6193l9447M2158J3788m8858J6097L2691l4521j870L2164
677B0397k7965j0536M1973j9594l3232M2552O878m6442K2498K9160l8820K18L3451
690B0538k6672r185L7016k1249k6325M2348O15m3456K6491K4169m0338N004L3264
703B2220k8812q758L5002k0560k1073L9610n079l8964K9537J9625l9727Q131L0545
716B1697k9674o506L3834k0151j8592L5875p663l3112L0766J3954l8758J1101
$$ y = [3953, -35407, 15012, 24331, -26160, -3090, 23631, -16499, -8127, 24182, -12671, -16262, 28475, -2829, -31705, 22347, 20506, -32082, -1232, 26326, -16311, -8184, 22332, -13041, -13377, 26795, -5582, -26364, 24810, 13210, -33887, 5470, 27975, -19632, -10033, 21906, -10879, -11211, 23773, -7464, -22581, 24388, 8195, -31252, 10906, 24694, -24164, -8067, 24624, -9897, -11767, 20397, -7568, -18104, 23869, 4275, -28957, 13595, 20473, -25969, -3471, 25689, -13131, -12913, 20538, -6134, -15319, 21697, 448, -25877, 16471, 17086, -26370, 121, 24290, -16048, -11044, 22220, -6592, -15350, 19652, -908, -21981, 17629, 12550, -26414, 3123, 22748, -16979, -8848, 21697, -7977, -14483, 19351, -800, -19392, 16483, 8820, -24292, 6474, 20428, -18330, -7229]
728g229K7856k9104m039L0849k0489j5472L3369q957k8408K9886Q754l6244J4920
741d308K4866k9969j883K8494k0408j1836L0733j1381k4249K9234M677l2879J7484
754a425K0529l0394J199K7128k0625r539K7794j2769j9442K8355L82k9384J9021
767H30J6057k8909M279K4242k0961p575K5390j2491j5541K5439k894k4932K0075
780C009J1802k7015O529K0817k0406m941K2835j2289j2937K2315m152k0299J9392
793D660P600k4890Q738J7939j9939k778K0382j2470j0132K0064n190j6490J7814
806E308M135k1465J0523J4405j9642o34J8437j2407p855J7822o266j3175J6430
819E616J408j7860J1129J0357j8040J851J6011j2252o217J5591o030j0312J4374
$$ y = [-7229, 20627, -8477, -12516, 18333, -2156, -17628, 15741, 6784, -21624, 8262, 17016, -19228, -4308, 20558, -9411, -11294, 17200, -3208, -15044, 15689, 4308, -19941, 9293, 13970, -18909, -1425, 19104, -11290, -10091, 17037, -3588, -13127, 14667, 1898, -17544, 10811, 11193, -18191, 830, 16887, -12022, -7743, 16499, -4462, -12037, 13353, 862, -14679, 10760, 7866, -17066, 3009, 14811, -12204, -5675, 15142, -5264, -10205, 12630, 341, -12596, 9719, 5567, -14732, 4660, 12260, -12630, -3892, 14047, -5892, -8670, 11712, -758, -10890, 9174, 3984, -12506, 5308, 9443, -12022, -1499, 12906, -6736, -7370, 11067, -1340, -9195, 8627, 2361, -10814, 5616, 7024, -10836, 293, 10650, -7390, -5539, 10472, -1780, -7997, 7594, 1564, -8748, 5626]
832E626m93j4625J0871P190j5659L490J2782j1829m221J3637n563q373J1763j162
846C434j1291R985M691j3468M381J0176j0895k294J1659n739o702R925j236q583
860e957Q122K591j0692M790P763r718j136R702n392n030Q437j476o589O397J353
875C165p587M463M853p944M0P556m571l772O419j328m753M839P20n193L397K638
891B942n529J107N017l836k541M576n31l220K791N35l130J961J516l114Q48K633
907B025k637j245L012j47k166Q64R66r99K22O73q20r9R25n10o94R23N30j237n70
926i84J539M80j908J27J776j198p50J825p62j395K102j27k409K164J473l695M70
943a272L909k709k236L995p98l414L685O96m564K758K758n226R39N200m482k666
$$ y = [5626, 5133, -9492, 1379, 8569, -7090, -3600, 9182, -2647, -6868, 6769, 1206, -7167, 4596, 3434, -7857, 2128, 6819, -6649, -2268, 7908, -2987, -5281, 6378, 639, -6063, 3862, 2626, -5957, 2165, 4756, -5936, -1146, 6617, -3101, -4237, 5465, 73, -4957, 3480, 2004, -4585, 1812, 3165, -4422, 41, 4894, -3050, -3010, 4546, -25, -3797, 2622, 1294, -3459, 1380, 2100, -3093, 304, 2942, -2587, -1480, 3537, -299, -2840, 1736, 1205, -2015, 776, 1311, -1819, 142, 1658, -1456, -608, 2025, -612, -1857, 1155, 1008, -1158, -294, 672, -327, -105, 568, -252, -351, 574, 64, -630, 293, 823, -414, -984, 555, 1035, -873, -746, 1030, -168, -918, 907, 145, -1250, 852, 725, -1684, 480, 1953, -1742, -1272, 2637, -72, -2308, 1687, 889, -2525, 1160, 1856, -2708, 50, 2808, -2418, -1479, 3721, -761, -3427]
959c427O211j402m914N056R96o115L743L679o761J245O244o112k352Q138l035
974A194o043O963Q38p486M976M000q339K046P320p607k054R663m746o769R425
989C381K02r216O496M171r856L192P949r265j564J0799o186o881J1287p08j0739
1004f938Q081M627j1209M055Q254j0633p26J1700p593o683J2435j874j1363R668
1018A801M524j2507M670Q612j1436J78J2094r253o063J3808l403j1503J1470L501
1032F493j3765O115Q887j2393Q25J1985j0572m816J4968n543j1532J3471K094
1045F217j4785Q344Q647j4089J895J2214j1484l532J5188p530j0918J5320O79
1058F166j5581J0082Q020j5562L308J2712j2614k886J5007q765r423J6315j262
$$ y = [-3427, 2784, 1382, -3532, 1524, 2520, -3595, 148, 3827, -2934, -1689, 4555, -1557, -3909, 4229, 1194, -4849, 2114, 2952, -4534, 442, 4442, -3897, -1851, 5469, -2138, -4192, 5471, 725, -6044, 3381, 3583, -5633, 863, 5034, -4822, -1630, 6319, -2946, -4510, 6289, 103, -6778, 4509, 3801, -6938, 1143, 5770, -5439, -1384, 6870, -3763, -4489, 7211, -382, -7065, 5370, 3496, -7867, 1801, 6325, -6182, -1512, 7100, -4336, -4158, 7936, -1317, -7380, 6428, 3025, -8478, 2992, 6493, -7272, -1157, 7730, -4663, -3838, 8147, -2425, -7241, 7727, 2184, -9348, 4123, 6217, -8568, -224, 8423, -5666, -3771, 8443, -3041, -6573, 8615, 1085, -9833, 5487, 6166, -9415, 667, 8687, -6875, -3567, 9145, -3469, -6355, 8652, -113, -9536, 6779, 5517]
1071E517j5816J1715P409j6389M659J2646j3973k169J5485r633q350J6510l579
1084D032j4994J3954N809j7423O338J2041j5134n02J5828j1282p728J7182n024
1097C097j3924J5600L321j8146Q861J1379j6387J270J5269j3247o028J8183o702
1110B546j3549J6388J684j7799J1081J0043j7753K884J4859j4258l927J8166r127
1123A238j2709J7745N68j7476J1819Q503j8007M603J4382j5071k741J7504j0834
1136d76j0693J9166j626j7879J3013P845j7622N765J2899j5706j195J6904j1795
1149a400q584J9236m830j7147J5941O703j8922O585J2178j5657O80J5814j3098
1162b501o725J8800o836j5035J7812L908k0196Q627J2555j5907R66J4180j3372
$$ y = [5517, -10299, 1416, 8825, -7564, -2905, 9741, -4232, -6401, 9084, -549, -8899, 7611, 4032, -10962, 2992, 8801, -8622, -2284, 9757, -5377, -5879, 9949, -1333, -9061, 8121, 3097, -10827, 4773, 8094, -10052, -1191, 10188, -6199, -4929, 10340, -2907, -8935, 9248, 2546, -11003, 5385, 7069, -10730, 351, 10394, -7359, -4475, 10384, -3874, -7801, 10365, 1238, -11471, 6274, 6842, -10634, 1185, 9688, -8319, -3716, 10666, -4405, -7146, 10358, -476, -11169, 7997, 6371, -11508, 1505, 9350, -8272, -2507, 10392, -5314, -6509, 10395, -1400, -9984, 9252, 4422, -12725, 3216, 9919, -9003, -2418, 9760, -5897, -5217, 10597, -2501, -9226, 9574, 2738, -12297, 5515, 9423, -10773, -2146, 10409, -5498, -4532, 9648, -3724]
1175c724m370J8147q495j3108J7945J232j9321J1194J1760j7424R59J4151j2198
1188c252l133J6288r987j1003J8328o58j7974J2528R395j8338K789J4841j2440
1201b616l576J4586r699q112J8015l439j7058J4096P559j8198N170J3624j4132
1214c780k764J4634r028o585J5876n778j4432J5948N400j8606O379J2381j4410
1227d765q28J4433j0015o179J4709n960j1301J5765J965j8254Q416J2061j4435
1240d388n07J2966j0307m650J4509o292j0094J4421k38j5821J0779R993j5932
1253e561J75J2953r342l518J2807p516q601J4482j219j4053J1364O796j6290L063
1267d460J3292j0299l954J1403o988n829J3841l468j3041J1831N215j4984N166
$$ y = [-3724, -8094, 10053, 1558, -11550, 6395, 7627, -11694, -500, 11260, -6164, -5205, 8946, -3252, -6385, 9903, -84, -11087, 7241, 6583, -11391, 1137, 10532, -7806, -5017, 9824, -2616, -6192, 8394, -1305, -9417, 8598, 5159, -11899, 2197, 9756, -8442, -3272, 10352, -3780, -6544, 8090, -938, -7523, 8353, 2575, -11857, 4091, 9491, -9115, -2736, 9645, -4765, -5593, 8840, -1175, -7354, 7355, 1395, -9906, 5859, 7824, -10430, -2014, 10047, -4388, -4895, 8071, -2236, -6886, 7623, 1331, -8763, 5658, 5420, -10401, 378, 10371, -5561, -5386, 7567, -1775, -5293, 7514, -2, -8603, 5879, 4660, -9393, 1971, 8767, -7523, -4460, 8832, -1467, -5421, 5982, -1006, -6835, 7006, 3538, -9503, 2328, 7543, -7441, -2275]
1280b275J1354j2268k803J2096o228n007J1287n108j0094J2981L232j4618N632
1293a819R541j1776n43J1736p396n382J0422m158p241J1823k8j3706P482Q884
1307G839j1387j40R892p871l759J0768m109o993R864j191j0732R218O447j2611
1321d765O94R733o956k349R090n520n953R929r69r002Q132L539j1732L286R627
1336F784p772k890P749m813l426R392k680q607P702L074r340L927P019q584j859
1351d324Q251l680l185O814l729o108Q623K151r201L057N644o878k1P183m592
1366El596O036k188l893P240m71q749M474N988o234o55N110m359j669O063k202
1382I00l945N239q88n938N569M137p396q25N539k424j113L869l285k743N352l80
$$ y = [-2275, 9079, -3189, -5992, 6104, -124, -5131, 6156, 1048, -9046, 3935, 7167, -7451, -1819, 7722, -4054, -4597, 7139, -257, -5639, 4783, 625, -6616, 5207, 5179, -8527, -1045, 7839, -3548, -3688, 6204, -1667, -5426, 5342, 1233, -5760, 4104, 2913, -7819, 1399, 7846, -4765, -4071, 5662, -1294, -3643, 5447, -73, -6026, 3903, 2934, -6068, 2064, 5603, -6129, -2843, 6784, -988, -3878, 3871, -942, -4368, 5024, 2344, -6263, 1439, 4513, -4827, -900, 6119, -2465, -4324, 3927, 247, -2938, 3876, 147, -5961, 2662, 4813, -4388, -1331, 4313, -2565, -2586, 4597, 5, -3591, 2445, 257, -3636, 3604, 3133, -5616, -1142, 4846, -1388, -2043, 3067, -1292, -2961, 3102, 900, -3045, 2194, 1306, -4632, 937, 5074, -2322, -3147, 2392, -32, -1145, 2724, -561, -3304, 2048, 1668]
1398A668m569L988J827o232J163N751k757k721K372j314l88M126j934m295L606
1413B91J976m062J259L373l346k090L205M02q75R91k274j564M380J038m419L58
1429a357K704j754o22K386n37j689M07j71N59K337j507l660J827L365j428j841
1445i81P68N1k51O96J41j08k7j251m20K424J270k623k000J768K082n25j497k38
1463g21O33Q3j27N56L07q43j069J22J997J247k416k321K128K272j223j199M34
1480a40k24k6R61j90k63L57j538p29L403R48m006p92K847K17n27L91j527m35K263
1499I90n11j388K226l78l727J893L918k267k325J309m20N04K492k166k674L090
1515E66O60l017K280K219m340r33M110m48j409J420k337j304M908Lm982K069K523
$$ y = [1668, -2901, 1087, 2914, -3318, -2155, 3596, 839, -1882, 490, -824, -1212, 2914, 980, -3315, 291, 2267, -1795, -536, 2837, -509, -2599, 606, 1008, 133, 1124, -1150, -2714, 1666, 2704, -1715, -1357, 1347, -407, -1029, 1357, 820, -869, -462, -633, -74, 2263, 756, -2904, -1077, 2288, 860, -981, -213, -162, -413, 283, 424, 316, 289, -962, -1382, 1042, 2312, -311, -2311, -543, 1539, 1014, -483, -721, -88, -5, -132, 424, 731, -112, -1181, -1059, 938, 2185, -231, -2552, -424, 1848, 625, -574, -140, -364, -390, 571, 381, 118, 475, -1063, -1792, 1611, 2559, -1447, -2239, 608, 825, 298, 689, -838, -1273, 990, 479, -909, 1317, 939, -2788, -895, 3023, 756, -1569, -260, -680, -176, 2316, 150, -2524, 566, 1226, -1791, 489, 2708, -1632, -2565, 1545, 1097, -312, 1108, -1229, -2533, 2375, 2378, -2604, -535, 1988]
1532A988l858Q67M155l136k549L202n84j129L765j911n043M327L557m905K0L507
1548B273l699q20N063j822l160L349j119l270N352J513o957R99N142l312p93M202
1564B941l690k705N627n46m138M196J63o161L843N286n774j833M827k774j478
1579b216N822k628n277N359J363n536L844L322p339J71O997l303k845M742k894
1594d18l707P020M98p322L487L697o406J840O347n949l240O627j718l533N994
1609C217j549p105N846M370p327J055N341o188j016P954l461n189N966q60n289
1624d235O668J978r051K419O703n880q78O651n114m173P969n73o131N417P29p775
1640e276N102O158q181j386P188m320k736P700k660o824O394J889o789M633L788
$$ y = [1988, -1870, -1003, 3152, 16, -2533, 669, 85, -1044, 2721, 810, -4233, 94, 3651, -1254, -1234, 2273, -1426, -2246, 2817, 995, -2165, 1184, 65, -3205, 2147, 3660, -3297, -2298, 2844, -468, -1261, 2941, -749, -3454, 2173, 1627, -2511, 1685, 1848, -4313, -470, 4816, -958, -2791, 2036, -738, -2216, 3606, 978, -4299, 1060, 2423, -3113, 731, 4053, -3286, -3115, 3882, 579, -2266, 2476, -418, -4125, 2895, 3393, -3929, -442, 3255, -3151, -1311, 5036, -913, -4153, 2474, 756, -2777, 3217, 1668, -5437, 409, 4779, -2548, -1493, 3848, -2340, -3356, 4598, 1137, -4052, 1914, 1054, -4235, 2433, 4411, -4640, -2221, 4482, -1398, -2276, 4375, -739, -4912, 3057, 2484, -3647, 1770, 2499, -5276, -174, 5984, -2197, -3583, 3605, -715, -3451, 4249, 1589, -5235, 1159, 3048, -3741, 892, 4680]
1655D680r023J039Q703n207l832O839k990n052P844P35q171M205L823p411K750
1670a068P050p726l275Q586k287m891O735j208p434O277L965p899K052N480p426
1685c069n75R111m296o017O759l49n671O443J665q836L263O251o765j74P209n810
1701h61m443Q536l50o554N012R24p056N144N238q383m63P339m985k762Q025k663
1717A698o894O165J976o149M237K861q323J919Q073n928l408P153k955n119P432
1732B738O70p436L877L068o525L226N909p847k350Q482k520m897O274q65o611
1747d807N600L237o964K288M496p079K35Q418m558n642O437O5n154N371J258p492
1763d291L226N181o260K78O547n766l867Q104l81o123M244R28n768M623M006p574
$$ y = [4680, -4343, -3304, 5399, 192, -3640, 3199, 209, -4843, 3001, 3736, -4435, -230, 3593, -3818, -1068, 5982, -1744, -5019, 3567, 1280, -3611, 3124, 1916, -5518, 759, 4724, -3175, -1123, 4357, -3069, -3644, 5467, 1171, -4846, 1913, 1564, -4107, 2336, 4001, -4835, -1572, 4679, -2086, -2260, 4949, -861, -5304, 3232, 2882, -3672, 1340, 2264, -4792, 352, 5590, -2793, -3256, 4083, -902, -3664, 4361, 1698, -5196, 969, 2945, -3204, 1033, 3894, -4429, -2510, 5563, -365, -3773, 3380, 425, -4694, 2738, 3408, -4028, -151, 2917, -3608, -382, 5527, -2320, -4670, 3812, 1292, -3605, 2669, 1804, -4807, 793, 4030, -2934, -646, 3850, -3229, -2994, 5424, 866, -4776, 1661, 1726, -3428, 1943, 3201, -4291, -1065, 4116, -2144, -1866, 4681, -1085, -4952, 3152, 2771, -3352, 892, 1820, -3948, 675, 4681, -2893]
1779b893K15O584m897k420P485k543o287N567J889n279L632J955p176K464O882
1794E178n813k946O624k533m557O312O58o262L278K335n399L245M715p331j673
1809d169P814k213m671N074k60n307M375K464n510K165L385o292P17P446m243
1824G75n269N622P58m247L646Q53n378K828L560n228Q56N361n320l289P239Q6
1840B853n529K703J173l685L454K131n762J048M917m502j658O396k028n573M105
1855D3K359l576J799P78m502K596M381m934j633N357k221l823M866J189m743J229
1871h35J912k550K191K176n278k62N695k113l518L856J36l932K462K204k955O50
1887a61J313l357J382M429l628l309M250O06l098K128R03l206J212J988k382Q59
$$ y = [-2893, -2678, 3906, -991, -3411, 4074, 1531, -4756, 811, 2700, -2579, 1053, 3008, -4168, -1704, 5178, -635, -3581, 3043, 510, -4047, 2265, 2923, -3339, -61, 2274, -3125, 120, 4835, -2496, -4169, 3645, 1432, -3239, 1835, 1575, -3732, 643, 3107, -2403, -238, 3147, -3145, -2428, 5018, 775, -4494, 1128, 1886, -2361, 1285, 2138, -3240, -412, 3148, -2080, -1224, 4137, -1183, -4472, 2767, 2853, -2676, 27, 1200, -2485, 969, 3100, -2662, -1614, 3303, -1199, -2857, 3539, 1511, -4062, 43, 2402, -1174, 625, 1403, -3099, -503, 3878, -1056, -2689, 2668, 447, -3376, 1490, 2679, -2064, -835, 1077, -1473, 718, 2894, -2384, -2646, 3049, 936, -2582, 1274, 1410, -2522, -60, 2144, -811, -161, 1152, -2205, -823, 3606, -22, -3331, 919, 1525, -1573, 555, 1458, -1748, -536, 1452, -930, -71]
1903g1K316l649j245M851k98l797J587J097j982J661J206k963M69K237k279k04
1919a064L381j830l165K700J698k045L88L90k001J389K164k452p65K373j281j522
1935a642K721M21k695L95J166p03R72N58k572N0K775q71j523J508k19j591J305
1952E5J054j247K6J43j148J144J795j879j589J762N73r59O48k7j188N99P72o64
1970a30M65L60j659j30K151K4j627l7M66PO50j4j065J57O20n12K50R34q45j140
1990a075P09J103j05o43n59J6Q34M35o96l53K99q5j18N33K75o32o63K53J047K39
2010H14r38n91L73O31K59m15m73J64K28k28L16N83p85q89P29Q67k14l98m63k53
2030f83R67N69j038k44P44n22k88J183n3j241J76N56j08N78m9j593L80J667p59
$$ y = [-71, 2245, -1404, -2649, 2202, 1904, -1893, -306, 791, -1191, 470, 1676, -1287, -818, 1419, -860, -1064, 2317, 487, -2678, 22, 1720, -325, 63, 453, -1548, -159, 2005, -447, -1212, 1161, -120, -1642, 1079, 1500, -1195, -800, 366, -337, 635, 1193, -1379, -1329, 1446, 575, -948, 560, 341, -1250, 55, 1109, -138, -112, 31, -1117, 27, 1822, -57, -1646, 116, 689, -270, 378, 351, -837, -238, 534, -130, 335, 695, -964, -1094, 1057, 1081, -546, -583, -117, -110, 540, 526, -539, -382, 238, -274, -24, 910, 65, -1075, -366, 737, 632, -11, -570, -554, 280, 715, 19, -334, -35, -120, -238, 295, 570, -62, -725, -472, 575, 814, -124, -715, -342, 289, 548, 133, -340, -176, 52, -176, 140, 723, -62, -951, -222, 645, 431, 33, -430, -683, 284, 853, -185, -429, 315, -207, -495, 688, 635, -606, -430, 126, 18, 596, 547, -1046, -666, 1001, 242]
2049B42q59J054m15r65J252N41j211K45L01r94Q85J421j793j045J893j7j168J136
2067E03lj670J056J102j470L63J076j874j80K537p33j964J369L96j402J379P04
2084A189k304M95J794j616k02K156j604j712K482M91k063J018N87k025J155J886
2100A727k318n16K335j394j194K724m28k665J694J183k082J021J318k687J17K930
2116A765j689j524K570o85k298K530R15k931R51J669k384N84K580k469j453L178
2132A309o09k271K454K75l125J802K055k836K10K381k505o63L531j424k607K739
2148G16L30k769K119J458l371N45K811k393o39L062j944k184L531P3l163K072
2164B54J208l203J262K725l025o87L155j809j598L451p80l263K686J374l328J403
$$ y = [242, -617, 437, 22, -943, 309, 850, -361, -116, 185, -809, 76, 1497, -296, -1341, 552, 535, -633, 503, 500, -1170, -114, 988, -482, -119, 957, -917, -1097, 1440, 707, -1257, 112, 508, -894, 485, 1189, -1115, -620, 1174, -442, -644, 1512, -92, -1804, 678, 1169, -894, 124, 711, -1314, -159, 1727, -591, -1107, 1228, -166, -1360, 1364, 936, -1729, -35, 1148, -934, 87, 1405, -1282, -1165, 1765, 76, -1448, 1122, 437, -1861, 669, 1584, -1347, -396, 1273, -1111, -527, 2053, -416, -1869, 1309, 700, -1571, 883, 1158, -1967, -165, 1890, -946, -736, 1645, -860, -1523, 2008, 584, -2023, 716, 1046, -1723, 396, 1854, -1517, -972, 1839, -554, -1193, 1869, -75, -2259, 1272, 1345, -1818, 254, 1462, -1741, -479, 2246, -779, -1466, 1689, -120, -1718, 1733, 953, -2310, 376, 1750, -1578, -175]
2180a75K162l375L4L484k217j667L241j071k649L299P12l782J693K229l263N06
2196h39L140k920j345L683j223k464L199k1l564K455K116l624N11K915k894p42
2212a617L763j795k541L364j00l209K770J378l921J050L050k921o09L327k159
2227a70k047L734l51l300K696J073l658J680K733l485l92L456k191j583L587j029
2243G53l115L088R98l634J787K244l689K77L616k635j553L588j288k668L443L82
2259A594l729K056K088l494O62L169l084j188L817j398k596L331L0l556K489J901
2275B092l634P25K860k931o64L679j876k500L491m0l320K583J487l735J054K908
2291B179l007n03L312k152j930L642m40l266K638J220l527J456K568l265k53L271
$$ y = [-175, 1987, -1388, -1354, 2130, -87, -1754, 1487, 416, -2233, 1066, 1778, -2004, -311, 1918, -1345, -839, 2301, -619, -1964, 1719, 496, -1968, 1231, 1210, -2354, 101, 2217, -1407, -896, 2019, -875, -1617, 2146, 351, -2190, 1174, 1074, -2135, 635, 2013, -1908, -858, 2192, -729, -1338, 1989, -170, -2217, 1517, 1166, -2134, 562, 1635, -2023, -343, 2390, -1095, -1487, 1969, -222, -1805, 1782, 753, -2362, 726, 1724, -1910, -123, 2121, -1568, -1291, 2325, -310, -1863, 1725, 437, -2231, 1212, 1594, -2135, -79, 2009, -1485, -823, 2346, -738, -1926, 1891, 493, -2103, 1228, 1258, -2298, 191, 2092, -1542, -817, 2043, -888, -1552, 2127, 251, -2249, 1242, 1202, -2118, 465, 1952, -1783, -729, 2179, -828, -1331, 1981, -171, -2101, 1541, 1101, -2165, 473, 1693, -1834, -378, 2190, -1075, -1328, 1943]
2307A943k177j488L445j057k944L052Q44l434J616K155l281K34L171k427j374
2322a722L341j211k469L158L05l378J924J901l141N06K747k595r92L342j331k234
2338a849K885N6l001K156J530l170P10K476k582m64L053j656j994K931q1k691
2354a691K080J042k920J075K134k571k12K753j914j477L050n53k564K164Q40k591
2370a355J204J677k531J87K445j964j061K861r36k340K423O75k593J127J471k220
2386i30L81J990j977o79K626j149j909K460L48k594J290J473k091K83J677j793
2402e94k77K199j298j506K393n7k321J511J252k113K82J576j522j39J802j434
2418b46r34K231m68j957J686Q19k075N45J466j460j61J453j203n46J917q04j577
$$ y = [1943, -234, -1722, 1723, 666, -2278, 774, 1618, -1816, -200, 1955, -1326, -1092, 2079, -348, -1722, 1619, 408, -2061, 1097, 1402, -1976, -52, 1849, -1292, -786, 1961, -634, -1626, 1716, 385, -1849, 1036, 1092, -1909, 247, 1777, -1393, -683, 1793, -789, -1253, 1800, 144, -1850, 1081, 1000, -1691, 389, 1431, -1489, -414, 1720, -851, -1063, 1690, -224, -1701, 1349, 796, -1768, 396, 1236, -1355, -151, 1526, -1005, -818, 1627, -337, -1398, 1463, 527, -1813, 610, 1285, -1308, -181, 1290, -930, -549, 1441, -536, -1215, 1411, 262, -1647, 813, 1161, -1433, -143, 1330, -761, -478, 1199, -594, -871, 1328, 30, -1476, 917, 860, -1461, 50, 1302, -811, -529, 1047, -475, -614, 1188, -246, -1180, 1051, 583, -1374, 312, 1131, -944, -399, 1067, -393, -554, 899, -304, -850, 1067, 263, -1314]
2435a314J815M49j969P80J268j507o4J391j032m82J514p72j166J728J43j808Q75
2452a51J104j471N0J262r74m42J316o58q07J363j11j433R98Q64j440R9J131q68
2470a68l26J088n58o67J105j57j068R38M96j277K37R98p72k79Q74m65m62Q89k13
2489B13p88P81K74j006L70P59q13j83P61l39l57O20j85n33N77K23p54L22N07o22
2509a73o3N58k41l22M12q1l29L77N8m91K08L59l62r8M03j93k31K78M2j96J12O
2531C3j62J05J80j69j34J69O9j47PJ22n8j08Q7R2q8k5L1m3kJ99j18k23K35J05
2555A57l03J05K27k62q3L22j54j26K52j49k40L89R5n17J80M12m51o4N04k88l04
2576b98M75q5l58M63M6o64L78N05o55j26P20m24m06P21j39n38N95O2p28N45M78
$$ y = [-1314, 501, 950, -1019, -239, 1029, -478, -542, 849, -183, -665, 849, 77, -1089, 639, 782, -1026, -151, 953, -518, -468, 794, -180, -622, 694, 36, -771, 592, 481, -952, 46, 910, -530, -431, 700, -168, -494, 594, 36, -631, 474, 317, -751, 187, 683, -594, -357, 641, -131, -410, 464, -1, -463, 426, 213, -575, 206, 480, -526, -156, 603, -210, -393, 368, 29, -328, 292, 107, -426, 151, 374, -380, -58, 449, -173, -236, 322, 81, -241, 171, 90, -239, 138, 196, -295, -87, 272, -90, -188, 215, 22, -209, 69, 111, -85, 27, 33, -129, -24, 156, -13, -147, 22, 91, -56, -49, 73, 15, -93, -6, 86, -2, -27, 4, -39, -41, 158, 40, -183, 52, 157, -146, -41, 186, -76, -159, 163, 9, -117, 135, -14, -254, 135, 230, -287, -107, 305, -146, -210, 294, 6, -298, 177, 92, -266, 197, 243, -421, -43, 462, -193, -319, 401, -23, -429, 292, 153, -385, 210, 272, -456, 89, 567]
2597E67r48L7R05n52m75Q31j95o60P11J00q39O18M32j078K50J025q24m72J032
2616D65k76p20Q20L2r25P33M38j141L85R89j094l26J253m62q20R93k9r62Q66L23
2636E42j191N05R69j237j57J411p66q42J239j13j049R83K41j306P77Q68j430J4
2654e42J484j029p81J488k67j168J124K12j371R67P60j607K63J525j284o42J674
2671H06n22j233J375J52j460J017P24j684M76J478j474n05J790p55j205J611j4
2688E77j549J170O59j743O09J431j689k96J870r75j153J832k35j600J406N64j894
2705a016Q71J292j817l5J884j253r74J886m40j553J651L80k033J080J264j964
2721g77J47J852j463p97K022o49j524J824J38k016J305J197k108K52J884j615
$$ y = [567, -381, -344, 561, 9, -466, 365, 170, -490, 221, 321, -518, 100, 532, -546, -296, 729, -95, -567, 465, 189, -531, 289, 321, -604, 129, 567, -574, -189, 800, -294, -620, 633, 171, -649, 344, 315, -647, 219, 542, -649, -144, 825, -412, -569, 842, 76, -766, 473, 360, -689, 294, 535, -771, 6, 874, -556, -542, 942, -87, -868, 620, 353, -815, 309, 521, -850, 117, 877, -730, -467, 1058, -226, -868, 806, 284, -949, 426, 578, -882, 135, 859, -825, -349, 1129, -345, -850, 940, 185, -1020, 591, 577, -972, 198, 857, -886, -277, 1154, -535, -831, 1039, 64, -1089, 743, 508, -1092, 314, 878, -1016, -145, 1147, -670, -705, 1179, -74, -1048, 838, 398, -1155, 496, 876, -1157, -77, 1187, -777, -630, 1222, -241, -1038, 984, 335, -1189, 635, 773, -1243, 62, 1259, -849, -597, 1287, -328]
2737c28o45K074r20j410J928j3j973J484J022k255M46J935j701o24K048r57j287
2754a176J977j80j906J641P53k305Q07J811j942m49K078j066j110J937m18j773
2770a321J792N93k278J042J571k154j56K147j245j068J939n44j509J817K56k188
2786a306J226J408k171O6K117j492j003K046n72j428J776O4k046J415J243k225
2802h82K25J947j553q08K103p14j467J749Rj816J499R06k264M82J888j644n55
2819h95J924r06j269J845j03j739J526N79k119Q60J664j871m21J920j001r51J794
2836H37m68j573J628M91j956R58J321j941j09J963j145r29J706n71j310J726J98
2853H26k013J117J202j873J35J800j347q47J783n46j177J611j00j812J353J066
$$ y = [-328, -973, 1101, 181, -1229, 699, 686, -1287, 197, 1219, -1036, -590, 1345, -356, -980, 1068, 111, -1176, 801, 621, -1285, 356, 1109, -1196, -389, 1422, -520, -969, 1109, 43, -1067, 870, 452, -1321, 471, 1064, -1214, -172, 1399, -755, -911, 1236, -9, -1077, 862, 318, -1191, 626, 882, -1306, -80, 1328, -843, -777, 1340, -152, -1155, 891, 319, -1109, 667, 731, -1315, 100, 1343, -882, -657, 1290, -263, -1071, 1032, 318, -1149, 600, 609, -1207, 292, 1198, -1066, -584, 1304, -340, -895, 1029, 123, -1146, 699, 596, -1143, 383, 962, -1157, -297, 1367, -504, -925, 995, -6, -957, 837, 369, -1204, 424, 915, -1041, -83, 1238, -703, -812, 1151, 6, -923, 783, 212, -1098, 628, 826, -1187, -70, 1132, -741, -606, 1194, -153, -1000, 783, 237, -940, 671, 571, -1241, 112, 1178]
2869A178j940K52J572j386n10J760p39j151J538j55j485J437O55j999N20J545
2885A092j397l26J530r86q16J626k53j420J293L69j694Q28J260j533k47J431r23
2902a66n08J500n96j329J485L75j620Q01R77j502oJ484r50n61J308p02r29J584
2920F45J07j746Q19J032j322P6J194r66m79J221m99p20J296k59j479J139R78j471
2938d34l8J070q02j91J021o44n99J080k61j044J178N14j557J71J234o46l63P00
2956C89n50l18J049l76q50R90J62j262N48J075r21n31Q06j53k17O74n51o80J045
2975C29J79j079M94P65r69k26R31j69m52L02k54k10Q70q5j085M61P55p50q1O98
2995D24l63m43M41K6j44M04l54o23P34N37p65k75N75j27j98L38r5k84K28j01j48
$$ y = [1178, -762, -510, 1062, -324, -834, 926, 187, -964, 574, 419, -1066, 371, 1026, -973, -453, 1092, -305, -631, 899, -87, -903, 723, 470, -950, 343, 712, -982, -154, 1106, -427, -674, 757, -166, -674, 826, 230, -1099, 386, 761, -859, -58, 919, -583, -589, 895, -55, -616, 692, -10, -939, 645, 752, -994, -175, 857, -465, -389, 805, -161, -640, 581, 82, -638, 658, 399, -1080, 59, 1037, -434, -472, 598, -204, -395, 626, -18, -617, 463, 202, -842, 336, 850, -707, -536, 698, 52, -311, 389, -161, -479, 570, 194, -656, 334, 496, -766, -218, 857, -64, -595, 211, 58, -159, 515, -36, -716, 329, 508, -571, -77, 688, -281, -507, 424, 255, -197, 105, -149, -359, 511, 426, -659, -198, 557, -193, -274, 424, 61, -382, 59, 85, -59, 345, -9, -632, 102, 639, -126, -401, 174, 47, -151, 187, 92, -192, 36, -65, -213]
3016b13N26M5p65L8O79k0l81N4m7l8L32j24k20K31k3m27L32M53l67m44K01K63
3038H5J19p9k73j03L20J24k77O1J76k47j23K82K50k11l53K9L16J74j70k72k5K56
3060E9J00j53k4J10j87j50L09K73l11l21J23K44J46m2l81q8M13M5k58J24O4l63
3082b68N1M57n2k39n4j05J35M81k04n79K35L50k63R6K20m11j57M02Lr5K30l68
3104a35l45O42L47o42q0L21k64J16M83m83l19M83q6k64N64m2q30L17O18l90o1
3125e0K85n53p7Q87k34o67M97N8o01O10M39q88m0O04l85J3O72o40o83R78K70q00
3147c05L72K29q08L74P85p13k54O66n49l01J127j51j162M91O13o69L01M93j007
3166d68j3J092n52n07R51m11r43J050N65j148J49N67p47L16R75j053n99J278k08
$$ y = [-213, 313, 358, -407, -369, 310, 290, -91, -37, -84, -122, 210, 86, -134, 97, 74, -353, -21, 432, 65, -379, -178, 85, 204, 125, -148, -251, 69, 193, -84, -23, 153, -94, -217, 65, 315, 104, -249, -220, 96, 270, 100, -172, -197, 59, 159, 6, -18, 92, -95, -245, 64, 337, 26, -295, -172, 72, 218, 176, -205, -293, 120, 165, -93, 31, 95, -268, -217, 240, 188, -51, -105, -210, -75, 406, 202, -377, -142, 208, -55, 41, 261, -150, -307, 95, 98, 3, 233, -135, -480, 162, 509, -133, -213, 108, -156, -40, 443, -40, -359, 124, 38, -226, 338, 296, -534, -217, 401, 11, -50, 235, -318, -395, 492, 258, -409, 88, 146, -455, 155, 594, -294, -334, 270, -115, -102, 570, -70, -753, 225, 495, -305, 67, 296, -512, -138, 647, -66, -320, 346, -203, -504, 623, 472, -690, -199, 414, -255, 46, 539, -468, -481, 611, 59, -448, 503, 92, -851, 199, 764, -384, -235, 332, -415, -99, 876, -177, -776, 502, 294]
3185B94r13J028J26j368O19Q91q47M1O99j099j13J534n12j250J037K83j122P81
3203A09O88j322O6J040q32o7J205r64j082J559L69j383N72N67j180M30J134j127
3221b18l04J175q34o18J660k28j654Q38Q70j041L11P39j292LJ474q34p70J372
3239F49m02j362J382P40j565J92Q89r88K64J231j288p29J626k47j217J259K69
3256G03j664O92J154j090o7R12j150k11J783o60j437J246L63j303Q50Q09j480
3273e50j9J268q85k11J317j009j106J708L12j541O66O39j301M79J214j194m40
3290f53J259p10o28J595k94j689J027Q29j159L69P92j370jJ553p91q32J210l38
3308A69j155J355N61j573L19R36j072K26J271j247p86J580j91j046J043J20j465
$$ y = [294, -619, 409, 535, -833, -214, 677, -170, -129, 570, -529, -642, 892, 380, -870, 167, 450, -672, 109, 797, -525, -459, 581, -251, -318, 887, -77, -1159, 400, 769, -614, -42, 525, -655, -225, 909, -218, -522, 653, -181, -799, 861, 633, -1021, -183, 687, -354, -43, 696, -596, -593, 881, 47, -723, 649, 247, -1115, 267, 1007, -558, -366, 523, -465, -201, 1030, -258, -987, 639, 392, -825, 434, 703, -961, -269, 885, -205, -272, 640, -510, -721, 1062, 402, -1035, 211, 574, -729, 121, 930, -550, -569, 699, -186, -397, 920, -89, -1195, 513, 825, -716, -50, 589, -712, -233, 981, -213, -653, 606, -104, -732, 863, 569, -1120, -93, 736, -423, -54, 738, -632, -633, 920, 129, -703, 507, 169, -986, 369, 930, -643, -324, 612, -460, -234, 1037, -210, -996, 584, 393, -653, 390, 510, -955]
3325i55P95J104j275pJ006j082l22J729n83j383J128L04j092Q45O00j509K07J275
3343G85r69k77J269q51j059J557L36j406N96M63j110O01J066j331l69J365o75
3360ip28J457k02j497Q74P84j037L87O39j367J25J589q72r05J222k30j094J186
3378C22M94j406K59Q46r51K91J150j274p34J587r9j148R71J53j277P09R15j104
3396b96k5Q91r79k30J573n43j351J024M33r80O42M99j267K16J069q30k08J063
3414G01p82q83J367L27j248L89M25q07M88Q68j160k92J112m99n55J139j85j232
3432h27O96O94p57J75M37r75J65J181o89p14R43j39q36R01M00j108J49O55n67
3451b16J72O87r06m66J133lq14N69Q9q23M97O92p22j43M97n16j1R26m08q83O38
$$ y = [-955, -160, 944, -331, -338, 668, -414, -736, 993, 410, -973, 155, 459, -633, 212, 812, -697, -490, 785, -184, -461, 808, -43, -1102, 455, 791, -615, -19, 444, -666, -65, 1001, -330, -699, 666, -9, -737, 720, 518, -979, -105, 679, -358, 29, 668, -699, -574, 1015, 143, -762, 460, 230, -864, 322, 816, -590, -331, 515, -436, -145, 1005, -269, -1003, 584, 485, -663, 308, 461, -816, -107, 808, -296, -321, 570, -409, -639, 934, 391, -960, 64, 497, -483, 159, 658, -609, -393, 676, -154, -362, 701, -81, -964, 403, 730, -518, -129, 296, -511, -23, 845, -315, -607, 505, 6, -549, 590, 405, -827, -131, 563, -194, -19, 418, -557, -392, 789, 100, -614, 329, 190, -646, 255, 655, -453, -304, 351, -216, -44, 643, -263, -729, 404, 401, -413, 156, 245, -578, -81, 611, -111, -254, 243, -273, -284, 642, 234, -649, -11]
3472a1L44n71L86K45q05J00P37l73k20M82m60l75Q44J54p56J28L06m46L35M74
3492E18o58k86O33j22k63N27k16o65M39M79m53N2J62n04J21P13l17m71L47j8k41
3513b23M53J27o49J11L30k15J23K87n19k32N79J23l53O2j2k72L59K59l61j09J86
3534E4k01J00L96k47m15J89K41p5J31j21l48J26L89j35j27J04j89r4L58J28l01
3555c7j01M7K2K55O9l51j28K64N3l5O7j38k17J75K07l2n1j84q8J84K45n9k73o3
3579a69J39J21J7n5j17p8P9J46Q5r4k15j8J52J85J6l32o2K42N4m4K7j44j29J67
3603b7J75n5m7q5j95K15L42k27k85J30N2m5K09k3l32R1K18j27J02J34m26j07N34
3626B21K4l57O6N6k12K96J93m18pK69k77O3M69l60m46M30K24l02J58L0m11J96
$$ y = [-11, 333, -238, 148, 393, -412, -312, 425, 52, -168, 314, -146, -521, 323, 477, -279, -151, 155, -291, 44, 518, -140, -426, 207, 85, -178, 349, 133, -532, -93, 386, -67, -15, 147, -357, -236, 477, 160, -311, 36, 18, -223, 230, 357, -292, -181, 149, -66, 57, 344, -175, -407, 172, 295, -58, 4, -8, -280, 79, 338, -23, -132, 54, -147, -47, 349, 102, -313, -124, 117, 42, 173, 52, -296, -170, 219, 84, -43, 61, -128, -222, 136, 264, -37, -138, -91, -69, 186, 255, -96, -224, 40, 93, 58, 125, -13, -230, -55, 152, 120, 69, -115, -203, -19, 226, 167, -106, -169, -30, 91, 108, 53, -64, -142, -63, 83, 168, 74, -141, -159, -7, 178, 194, -138, -200, 42, 96, 52, 79, -65, -194, -27, 148, 93, 46, -39, -234, -19, 323, 96, -189, -59, -7, -52, 157, 134, -198, -107, 111, -16, 86, 220, -206, -313, 221, 245, -112, -46, 10, -202, 94, 287, -131, -138, 131, -146, -83, 386, 26, -420, 10, 234, -68, 90, 120, -291, -95]
3648i5M75l84j62L78l05k59O96k6o61K41L06l69K37K98o27q1O49k39l38N66k06
3669I4o41O01M08o59O3L70n03J16O62m96m52O35l8n27N95J71q92K84O22n15m8
3690a50N35o00k24Q89j82o81N90P8o88M70N41q29r0O64l93j67P30m39o59Q20J85
3711D00p88M29L93q75J60Q45n54m06P06l48m40R49j00r62N63M95q32K44P05q27
3731b43k55R38k87n46P27j77q10Q64M05j014J75P24p93k1R07n46o05Q49j03o64
3751d75P53J33j032M51P86q12j31Q41o19m20J020k25q15P44J17q87O46N86j068
3770d07qR31n85l23Q95m15p33R42J28r44N82M65j055K87R75q26m02R12l81n76
3790e38R59p1j028P03N11r80K89Q10r42k49J069m10o25Q49j69q17Q74L53j104
$$ y = [-95, 380, -4, -166, 212, -93, -352, 344, 318, -343, -102, 204, -165, 72, 370, -257, -338, 311, 72, -266, 300, 94, -547, 54, 462, -197, -134, 236, -267, -151, 511, 15, -437, 198, 160, -367, 228, 399, -493, -209, 413, -102, -150, 385, -215, -439, 450, 268, -413, 177, 255, -433, 37, 578, -251, -341, 323, -70, -237, 493, 54, -605, 215, 400, -388, 41, 434, -441, -281, 564, 10, -396, 310, -38, -478, 471, 371, -591, -28, 467, -365, -121, 584, -243, -498, 440, 153, -393, 334, 157, -653, 211, 616, -398, -223, 501, -292, -313, 594, 48, -557, 292, 189, -475, 278, 411, -621, -170, 616, -196, -327, 514, -105, -525, 495, 270, -545, 199, 316, -571, 75, 661, -407, -415, 516, -69, -392, 503, 88, -645, 297, 425, -519, 63, 528, -527, -240, 735, -91, -493, 419, 38, -538, 421, 350, -678, 25, 536, -444, -155, 655, -287, -536, 533, 123, -502, 347, 178, -639, 235, 588, -516]
3809e16L06Q05q87r1J014o01o24R55j32p48Q23J27j099N82Q15r86j27R68o64m25
3829e05R93k30q59Q12J26r24O67N93j175O8J100p08m59R56l59p38R22J40r80O39
3849G9M56j073K82J042q96m80J031l16o53R00l3r64O79M99j039L18Q57r53l05
3868e69J167l92p76Q19J6q53P45L90j072L35Q09r18j22J011n73o62R57Nq17O74
3888A74K21r62M96P28r74o3R77o45n19J022j55q61O67K85q47M79N46r79N4R73
3908F17o44m55R31k77p76Q15K15q83M33N04q72J94Q45p77l96R57k56o93P60J10
3928C52q86N54M73q52K06O67p27k17R45l65o48P39N4p36N16L47p93K02O45p02
3948b26p4P93m94n14P97Op05M98K42p29L36M93o84l1P12m73l45P75j67o72N77
$$ y = [-516, -210, 595, -292, -383, 631, 30, -594, 361, 229, -519, 304, 431, -668, -86, 729, -257, -384, 584, -80, -505, 488, 258, -601, 211, 337, -587, 80, 673, -502, -434, 666, -42, -501, 455, 96, -642, 280, 420, -560, 79, 535, -538, -256, 786, -110, -590, 441, 125, -528, 372, 339, -625, 54, 553, -486, -168, 689, -264, -569, 598, 206, -570, 249, 265, -588, 157, 547, -525, -190, 619, -299, -421, 590, 17, -645, 312, 317, -500, 174, 395, -567, -71, 657, -317, -380, 597, -48, -567, 455, 300, -561, 106, 391, -456, 23, 569, -410, -356, 617, -27, -482, 449, 172, -604, 211, 426, -457, -24, 480, -392, -198, 647, -130, -526, 431, 175, -518, 242, 352, -534, 20, 493, -359, -153, 514, -213, -430, 515, 150, -498, 241, 295, -441, 75, 422, -371, -169, 476, -226, -300, 493, -1, -515, 282, 288, -417, 81, 323, -406, -70, 423, -261, -292, 420, -53, -398, 377, 210, -462, 115]
3969A15K24o75L17L89o65O3O66m89k93O62k16n32O22J43o99L59L61o01J48N11
3989D10n31k00O36k13m32N35Po00M32K97n84J13M70n14o6O10l62l56N09J4m63
4010b88L80J71n45J86M17m63p1M82k97k67N24p5m53L81J04m33K63L14n14J8M43
4031B77k85k27M57j10l99L65J56m46K31J95l96O1M55l94j94M32j04l15L44P2l79
4052b04J81K22l25P2L18l50j27M04j07k80K60N0k67J93J17k70O5K16k41k4K97
4073B00j71k30K81K9k13J23O8j84P8J23j66jJ98j51j28K65j8k19R5R1j17Q0Jr0
4097e6K2J26j10l6J38m4j21O9R8p0l1K1n6J01K8j32K6Q7l3l6M1Ql3l4NR3lj20
4125e2RR0j0q0J9J3j9P0l5o8J33Nk37J61J29j57p4J68k8o6P1q0m5J62l2j76J51
$$ y = [115, 339, -336, -19, 370, -295, -232, 434, -55, -348, 314, 98, -434, 188, 331, -368, -9, 352, -249, -101, 410, -121, -321, 315, 102, -330, 205, 212, -388, 44, 341, -243, -130, 340, -174, -240, 370, 8, -348, 161, 175, -288, 92, 263, -282, -96, 321, -142, -213, 269, -28, -295, 229, 154, -299, 82, 186, -247, 16, 330, -184, -166, 277, -8, -235, 222, 112, -287, 78, 234, -212, 19, 214, -182, -121, 334, -60, -254, 178, 74, -241, 103, 175, -204, -23, 199, -126, -54, 264, -86, -213, 191, 84, -196, 64, 114, -153, 40, 157, -113, -48, 168, -73, -97, 200, 29, -201, 80, 109, -104, 19, 87, -97, -19, 104, -62, -63, 135, -16, -144, 121, 103, -116, -21, 70, -47, 33, 34, -56, -34, 92, -18, -54, 84, 40, -81, -12, 86, 16, -15, 6, -50, 51, 79, -53, -27, 60, 27, -9, 32, 40, 7, -27, -22, 71, 68, -52, -43, 47, 37, -43, -24, -11, -30, 40, 5, -63, 70, 75, -162, -1, 128, -29, -103, 65, 37, -29, 42, -38, -83, 79, 47, -129, 22]
4152B2J43k74j3K55j07j25J73n6q9K02q4j85J84J32l23N1L15k62j28K66m4j43
4174i0J99r5j99K82O3l52J66K29k98m4L19j53j80K62q2j81K75N7m54K86K67m32
4196a55lL75k33j70L55j02k62L32j5l55K70K52m68M9M03l22j41M07j88k79L94
4217A44k0l87L35J34m59J52M16l79j78M79k11k59M29o9m37M23J33n16K44L69n11
4238a68n6N30k89k75M80j29l89M32R7n43K93L55n93P3N28m13k35N51j46m51N36
4259A88K9n94L97L30o31J22N18m84j83O65k97m26N56K3n84M34L00o68J65N50n70
4280a60j14O34l35m25O76p4o01N08K38o98K47N38o20o9O41m24l60P13j53o26O04
4301A40K13p43L00N08o62NO64n04k88O89k23n41O39J12p18L89M62p40O8P03n69
$$ y = [22, 165, -109, -122, 133, 26, -99, 74, 18, -71, 131, 47, -138, 46, 178, -145, -94, 221, -41, -169, 97, 53, -90, 109, 14, -185, 97, 160, -192, -26, 203, -95, -139, 180, 27, -153, 109, 27, -154, 121, 178, -276, 10, 277, -155, -158, 217, -16, -186, 169, 67, -195, 137, 122, -233, 37, 289, -179, -130, 273, -49, -190, 217, 29, -250, 144, 124, -263, 72, 206, -253, -101, 315, -64, -242, 237, 26, -233, 196, 127, -310, 113, 246, -270, -26, 343, -168, -224, 306, 17, -258, 222, 93, -296, 136, 233, -310, -17, 338, -255, -182, 346, -67, -302, 249, 103, -348, 188, 217, -377, 20, 350, -281, -159, 359, -125, -308, 357, 60, -366, 190, 213, -371, 63, 363, -305, -140, 410, -160, -274, 360, 25, -400, 276, 202, -399, 109, 347, -351, -104, 434, -186, -255, 386, -38, -398, 315, 162, -464, 140, 353, -390, -90, 418, -244, -239, 425, -79, -367, 322, 99, -442, 197, 309, -409, -20, 442, -298, -230, 473, -96]
4322i6k85P81l00n38P01O3p86M52M75p67O2O89n61k63P83l15n50P03M4p68N30
4343E4L83q18K05O57o35k04P77l44n53P61mp38N27L26p83L02N91o97j10P44m35
4364Fm49P68r0o71N64K59p91L21N54p05l5P39m88m38Q02j25o98O22K23p58L16
4385g4M98p02K7P23n54l25P95k41o60O61J74p20L41M74o80P7O26n89k14P66l24
4406G9n69P33J14p43L35M81o79J09N35n62j43P57l96m85P27k3p18M69L89o96J33
4427a53N15n44q1O85m53m01P51q5o98N51L18p59K27N42n90o6O20m53k94P38j93
4448A77o43O07K24p27L09M56o36K8N87m75k46O79k25n74O61J21o95L23L78o05
4468b76J05N59n01j69O43l02m55O07L3o30M02L52o02Q4M83m94j21O45l45m02O37
$$ y = [-96, -381, 400, 100, -438, 263, 326, -460, -8, 467, -300, -238, 451, -110, -373, 410, 95, -455, 248, 292, -476, 54, 437, -381, -176, 481, -154, -358, 419, 75, -478, 283, 279, -459, 68, 394, -389, -87, 504, -193, -303, 441, 6, -443, 325, 235, -436, 128, 387, -404, -83, 471, -234, -269, 470, -18, -456, 346, 221, -477, 145, 368, -390, -74, 424, -278, -251, 472, -82, -407, 388, 147, -513, 148, 322, -398, -57, 417, -263, -186, 440, -149, -363, 403, 79, -490, 243, 357, -386, -51, 430, -249, -140, 395, -167, -310, 447, 51, -434, 293, 270, -448, 21, 410, -286, -153, 362, -182, -263, 422, -31, -432, 319, 234, -464, 87, 405, -354, -127, 415, -175, -241, 379, -74, -368, 370, 177, -466, 141, 365, -362, -53, 403, -233, -205, 382, -93, -339, 340, 115, -459, 202, 323, -372, -49, 329, -276, -171, 388, -113, -282, 361, 59, -396, 211, 244, -386, 16, 368, -234, -150, 333, -161, -282, 363, 18, -384, 253]
4489B53m8n56M44K70o31J43M72m95o5N74l65l68O18l0n70M59J51n65K67L91n29
4510a80MN02l96k38N77j08n09M15J74m66K17L17n27L0N10l69k13N13j64m36M36
4531H9J80m74J53K90m10P5M20l95j90N36j71l81L79R7m24J78K66l44N5K81l64
4552a54m6M75j95l69L69P9l59J91K13l43Q5K32k86L5L31k81k70M48M3l52J18J59
4574A23k32R9J73k36j8K64k42j03L86o8l81J59K67k06J1R5j93P7J92k10j03K91
4596A45r9k61K58J47k37n0R9k5N8M1j76KK27q2j74J80O1k16L9J50n3j5k7r7J13
4621HJ58j40j81J91M2j24L4P2o9l3M5m0J27Jk00K2J61J7j29J5k4M0J7K6l6Llr0
4649i0R6R5p7j18M1J04L9m2j30N3N6nj8L6o2l9M7L7K6j4p6m9J04R1j20o7M8JO7
$$ y = [253, 205, -351, 93, 363, -268, -125, 347, -148, -213, 361, -4, -372, 246, 216, -354, 105, 256, -309, -42, 349, -180, -176, 326, -70, -308, 269, 161, -348, 67, 241, -225, -8, 309, -218, -188, 322, -47, -260, 253, 89, -347, 89, 269, -205, -52, 238, -172, -97, 323, -72, -262, 274, 103, -278, 101, 198, -226, -48, 218, -126, -71, 210, -154, -200, 275, 80, -289, 80, 159, -200, -9, 204, -139, -54, 178, -108, -73, 258, -23, -293, 155, 198, -154, -36, 123, -109, -10, 163, -73, -91, 173, -69, -172, 214, 146, -235, -76, 191, -15, -4, 91, -102, -25, 167, -43, -146, 145, 46, -215, 43, 190, -47, -97, 2, -23, 35, 76, -100, -98, 129, 47, -127, 53, 114, -102, -63, 87, 34, 19, -8, -105, 8, 166, 26, -155, 36, 78, -46, -12, 60, -9, -42, 3, -37, 90, 91, -109, -87, 74, 91, -38, -23, -47, -7, 10, 36, 0, 3, 0, -90, 6, 101, 24, -94, -53, 51, 90, 48, -82, -29, 27, 22, 4, 40, -22, -61, -14, 23, 49, 35, -41, -90, 14, 105, -15, -82, -34, -33, 34]
4678C4M7r9o5J09k3m4J39ok04M4J79p6j1qj30O9J84j16j32J59k2j20J22J13j90
4703d7k2R8m4O9J04k72o8L08j5k21J05R2k09J12J37j43lR0j95M7L06j49l41K58
4727cJ59k28P9Q6k10M9K16k02J1K76k92j91M25N0m00J15J70k06R5K23l34m1L30
4750A77k16j26M03j02m30K62K67k95J8J68l03P2L72k57k39L90j01l38L56J66m48
4771b04O7L18k80L3L08l54j58N02r4l79L57M4m56K67L83m57n6L78l03p8M79k09
4793A08m64M29J80m63K36K34n08R5M73l41k08M43k30l20N46N5n50K14K89l94J07
4814f9M29m66j92N58j98k93M34m3n82M29L55n43O2L90m26m6N59l00l84M68k1l87
4836b66M29J55o14J69M45m08o7M65l72l21O03J1n13L45J34n01K92M20n79p6M95
$$ y = [34, 81, -18, -83, 26, 3, -41, 98, 92, -112, -68, 111, 35, 24, 16, -114, -45, 139, 23, -109, 50, 28, -92, 30, 143, -47, -69, 29, -15, 54, 158, -114, -182, 126, 111, -110, -5, 87, -122, -10, 127, -16, -19, 71, -124, -77, 229, 80, -261, -3, 156, -72, 7, 93, -117, -68, 148, -54, -43, 233, -59, -250, 175, 225, -175, -60, 110, -96, -1, 222, -112, -153, 177, -39, -165, 238, 136, -294, -32, 235, -60, -42, 126, -177, -105, 267, 10, -229, 161, 60, -278, 78, 244, -204, -137, 181, -99, -66, 242, -112, -270, 232, 138, -241, 116, 160, -296, -29, 354, -103, -159, 219, -84, -162, 317, 108, -356, 73, 253, -210, 26, 260, -248, -153, 320, -21, -229, 214, -16, -336, 210, 265, -285, -71, 218, -176, -69, 360, -106, -298, 260, 62, -231, 203, 160, -422, 7, 362, -181, -119, 271, -155, -201, 358, 58, -326, 142, 121, -266, 163, 318, -296, -127, 318, -90, -157, 308, -64, -385, 218, 229, -284, 61, 195, -306, -14, 406, -173, -249, 246]
4857B46k62k34N49j70m94M59J45m73K57L04n97O0O10l70l11M85j84l18N30M5o06
4878c29L08K96n13J83M62n38k31O05j11l57M03n8m64L87K87n41Q0M14m68p8O59
4899C96l10m47M57N0l83L92R6o07K53M60m63p9N18l96l06O20pm97L32P2m65L72
4921E8L65o27p5N85l05k49N38j62n03M39J53m68K95K22o19J58O30m11l65N44j33
4942G0l52M89M7n66L09K80n15J86M93n82k22O58j20l95L47j4m44M26K71n87J27
4963i4M19m97q6O68k75m92M21J03l55L46O1o16K92N16n53q7N42l17l81N83L3m56
4985b25K19J34m26L83L16o65l5O13k63l36N04o2m68L50J87m08K21K05n62J27O63
5006D72m44l86N00J2l84L56Q7m43K27K06m19K22L60n08k14N95j8m41K54P9l13
$$ y = [246, -16, -250, 299, 129, -365, 94, 239, -234, 23, 327, -270, -210, 400, 30, -281, 204, 20, -298, 232, 277, -329, -21, 275, -238, -55, 407, -131, -362, 243, 132, -225, 178, 120, -344, 43, 330, -211, -131, 283, -185, -263, 396, 86, -361, 96, 146, -237, 155, 251, -356, -103, 357, -106, -185, 333, -63, -369, 251, 244, -253, 79, 151, -314, 58, 423, -204, -279, 306, 1, -248, 290, 128, -375, 64, 217, -251, 44, 266, -353, -195, 435, 24, -341, 203, 70, -282, 207, 254, -312, -3, 277, -238, -52, 441, -141, -363, 295, 175, -220, 127, 113, -331, 95, 366, -221, -94, 325, -172, -258, 410, 135, -357, 64, 167, -188, 158, 219, -397, -105, 411, -142, -229, 313, -4, -385, 198, 231, -225, -6, 128, -298, 85, 401, -264, -299, 314, 51, -285, 219, 157, -311, 39, 226, -182, 39, 244, -318, -191, 472, 28, -358, 142, 154, -230, 126, 213, -230, -3, 203, -216, 6, 366, -142, -356, 239, 221, -220, 34, 113, -200]
5027b00K67J83m54R3L57m13k5N38k37m63L68J92l09J67Q7l99J86L50l72p4M19
5048B61k69l05M74J10m42J04J41k21K03K04m60k2M71j86k59L49o8l23K07K16k72
5069h7Q0O5k66J37L84k83l19L59N1k89K21Q3k83J16J59k24R9K02l36j34M37Ll07
5092a32R6N8j57K04J12l02M8K01k27j3L29j82l07K49J68j70N8K6k41J77K26k76
5114e5r3K80j59j37K82N3k69M2P1n3J28P2k89kK76p8j85J64Nj85J36J45j50J3
5138A2L9j98J09K46j87k23K14Q8j27L0N4j60Q7M5n7N9Q1k31n0K72M9k15k6R3k1
5163a7N2K6j08J3O0n3J9J69j18k08P8K22p2r0m4kJ13M9r2l6O7k8q8J09J10j28
5189Cj27R4J31l5n5j03M1J26k4p3qQ1q1k9J30O5j67q2O5J26j7n5o0K5J53q8q2
$$ y = [-200, 67, 250, -204, -111, 246, -167, -192, 346, 109, -354, 14, 206, -103, 64, 151, -248, -62, 288, -84, -158, 261, -8, -313, 161, 271, -171, -67, 74, -147, 56, 260, -200, -222, 249, 63, -196, 153, 85, -238, -31, 185, -87, -7, 58, -208, -71, 313, 30, -289, 70, 121, -168, 53, 136, -147, -31, 128, -96, 3, 205, -131, -265, 172, 175, -132, -36, 22, -135, 69, 181, -121, -73, 128, -99, -112, 217, 35, -272, -23, 145, -25, 33, 59, -182, -5, 221, -55, -148, 132, -27, -164, 118, 171, -98, -56, 15, -38, 90, 162, -127, -129, 147, 69, -116, 48, 53, -132, 4, 149, -1, 12, 51, -147, -38, 208, 21, -202, 12, 100, -27, 3, 57, -103, -16, 29, -28, 31, 112, -119, -169, 103, 152, -63, -89, 4, -17, 35, 61, -47, -34, 26, -27, -8, 161, 43, -165, -87, 135, 63, -27, -71, -73, 40, 89, -3, -39, 28, 0, -88, 21, 131, 3, -124, -30, 101, 66, 11, -92, -51, 75, 51, -22, -30, 51, -30, -59, 71, 136, -31, -113, -48, 78, 61, 6, -54, -29, 124, 36, -46]
5216d6Q4M0j61nJ83j4j33m3O9Q9K2q6j19J48Q5j31m1J32q7j42J71Q5q5k0m6l1
5242h2J57O5k51K7J79p4j05J53j1j48O2R3p9O8J1j92Q0K41j52j97J75L2j20J15
5266D7Q2k28O7J29j87R8J72k52j27K73N6k32P8O6j54J47J26k18oJ99j79j04K90
5289A43m6k81J23J77j55P2P2k24N5K55k01j15K59n2k50K14J07k25K1J20j49R7
5311A7J72k79p7L01m7k17J80P6k80J12J83j96O7J11k65K7L49j63l02K85N8k44
5333a32J79Q9k16L9J99k31JK93k48k10L81N6l44J12J39k20J13J61k80K5K48k17
5355f3j12L69q2l67K04J98k36O6J22k43P6K93k62j14L13j10k71K90J13l13P2J82
5377A25k16O5K20k87p8L81j34l03L21N9l36J74J73k42L7J78k55j9L76k07l05L44
$$ y = [-46, 38, 78, -83, -88, 95, 81, -52, -95, -26, 63, 85, -1, -120, 28, 113, -18, -59, 73, -14, -156, 15, 100, 15, -5, -51, -82, 75, 140, -111, -84, 95, 21, -84, 69, 58, -90, -28, 65, -14, 54, 65, -127, -47, 194, 42, -155, 20, 52, -68, 47, 129, -99, -32, 97, -90, 8, 180, -72, -199, 74, 130, -102, -24, 42, -112, 35, 161, -57, -63, 136, -43, -147, 143, 97, -184, -61, 116, -39, 33, 105, -119, -64, 191, -10, -125, 134, 82, -168, 46, 153, -72, -51, 69, -80, 17, 189, -90, -167, 134, 87, -130, 50, 126, -154, -42, 141, -55, 12, 123, -142, -115, 234, 71, -231, 54, 112, -132, 47, 136, -80, -41, 158, -73, -72, 221, -27, -237, 144, 200, -144, -32, 107, -113, 0, 161, -119, -94, 154, -63, -175, 194, 112, -255, -51, 147, -89, -23, 99, -144, -68, 225, -37, -151, 162, 52, -219, 71, 184, -129, -57, 125, -91, -26, 194, -93, -171, 210, 76, -227, 94, 153, -183, -9, 164, -78, -41, 137, -118, -137, 239, 32, -273, 71]
5399G1Q6l35J69J89l41R1K58l03K6L02k46k30M04L9l74J63J97l04J31K03l19J4
5421a09L17k49j71M25o8m02K72J82l00Q4J56k80O0L18l05j55M24j11l61L26J83
5442B36l87O2K43k55O0K33k99j19M40j06m05L99P6l75J47K67k93pK47k45m0L72
5464B51k22l24L99J10m17J75K12k87j1K99k55n8L18k11k35M15L1m34K15K35l04
5485i8K3K34k51l9K94j89j85L70l5l88K75K26l46L4K51k27o1L15k15j65L64r8
5507H9l16K96J32l74O7K89k54mK23j97j13L54j21k97K79J02l29J08K60k39q3K47
5529A19j47q8K82j42k46L20P5l54J36K09k33k9K45j44j11K32j21j45K88j7l31
5550b02J65K28k76L2J90j59r4K31j01j31K54r0k40K38J72l16k2K55j69n8K42j71
$$ y = [71, 157, -178, -9, 180, -161, -70, 188, -115, -89, 213, -33, -263, 141, 180, -194, -31, 166, -138, -7, 196, -123, -109, 208, -41, -212, 213, 145, -257, 15, 197, -103, -19, 137, -143, -83, 235, -70, -225, 199, 88, -273, 53, 236, -151, -89, 154, -101, -41, 192, -107, -226, 214, 108, -297, 102, 178, -197, -50, 217, -76, -83, 164, -81, -121, 251, 29, -295, 104, 214, -203, -28, 184, -103, -114, 185, -70, -128, 190, -21, -256, 159, 190, -244, -29, 206, -98, -75, 159, -92, -131, 163, -26, -211, 159, 124, -264, 11, 237, -109, -75, 176, -51, -112, 203, -12, -177, 187, 89, -227, 69, 201, -173, -106, 183, -71, -75, 148, -49, -162, 192, 71, -226, 53, 155, -174, -66, 194, -45, -128, 119, -28, -116, 166, 24, -222, 98, 173, -181, -45, 164, -69, -98, 147, 3, -108, 124, 3, -142, 146, 129, -202, -37, 191, -85, -53, 137, -22, -116, 115, 14, -117, 137, 47, -193, 45, 217, -99, -121, 134, -35, -93, 149, -22]
5572b2j01K37o6k31K49Q6l07P5K78k37n8K02j14j07K30o9j86K07M3k39J18J94
5594A82k15q7K46r4j32J84n3j81K16O3k70J14J70k16o0K56r4j39J58l9q6J69m1
5617E1k18J43J93k50rJ91q4j19J49j4j13J31k1j41J64R4k41rK34j28r3J65m3j30
5641i8J49Lj27R1N7j88P2J78j35j21J94k4j48J32K6j57J07P6j97R0J42j51j02
5664a31J97k6j16P8L8r9R9J8j09K6J00r2m0J55k3j59P9N6n9PL2o4K2J08j15n5
5690g3J40l1j37J08M0q1N2Om6J6Q3j21j1J30m7q3L9N7p8jQ3l0k7O9p7kQ9j9j09
5719f1O2P9p8l1L9j9PK4mk2N6k9o8L7O9q1l3M6Jk4QK7m2N0Ql8j4Q9q0l9N5O5p7
5752a8l7P3j3KRm9L2M9o9l0O4L0p0J1N9k6n7J9nK6L5p0j0J06j7j26O7O5p6%K3
$$ y = [-22, -123, 114, 48, -183, 66, 152, -155, -80, 198, -39, -97, 105, -9, -116, 114, 45, -141, 66, 109, -130, -12, 182, -33, -120, 126, 32, -100, 84, 31, -150, 66, 129, -141, -27, 143, -73, -133, 123, 29, -110, 48, 9, -77, 92, 51, -167, -24, 169, -81, -90, 101, 17, -102, 47, 33, -80, 51, 30, -111, 53, 147, -94, -103, 131, 3, -90, 75, 32, -98, 51, 54, -73, 18, 75, -113, -41, 137, 2, -119, 75, 51, -97, 35, 61, -96, 11, 87, -110, -20, 122, -29, -131, 66, 40, -76, 2, 40, -59, 40, 58, -51, -25, 75, -17, -57, 98, 75, -84, -5, 51, -8, -1, 31, -33, -11, 97, -18, -73, 67, 36, -101, 7, 47, -34, 18, 24, -22, -6, 77, -44, -55, 75, 28, -55, -16, 41, -37, -38, 45, 15, -12, 57, -20, -22, 67, 48, -61, 1, 80, 2, -29, 10, -9, -2, 22, 18, -4, 52, 23, -45, -8, 61, -20, -53, -7, -6, -30, -22, 5, -37, 13, 21, -17, -31, 58, -22, -61, -6, 59, -18, -55, 18, 5, 7, 16, -33, -1, 48, -21, -51, 13, 43, -27, -16, 43, 17, -40, -21, -26, 0, 35, -35, -45, 61, 44, -82, -15, 50, -26, -26, -3]
5783cj2J4J6m9oJ06j7j32P8J09r7l5O3k2k6K4k7nJ06m7r5R6L7j13JR8m0l1N5n2
5813fl4Q6l5j06J13N9j20j9J02m2m0N1ml3O2j5q5R9L8j35L1J17r8l7Q3l9k8J18
5841H3n8r1J03N9j64M8J20j24KJ19q6p5J34m7q8J12L1j50P4P1q4n6J33o8p6J08
5867C0K2j26R9L8j69J30P8j67qJ65q0r9J56k1j35J39Mj31P2R9j43j2J96j26p8
5892f7J22k1r5J09J2j64J01J27j92KJ74j54p5J90l8j10J25Pj63J38O0j52PJ49
5916I2j12q7K00o5j49J74Oj49J07J08k00K5J84j62n2J79q3j10J37L5j73P0P1j23
5940g7N2J22j53m8J73o8j08J56k9j23Q9J17j59J7J42j48k2J44p2j10J66j6j60
5963a15J46L9j36K4J67j61k3J47p4r5J48rj56J14N5j35L7J53j63l6J44n1j02J38
$$ y = [-3, -15, -1, 15, -34, -40, 66, 49, -83, -5, 104, 7, -28, 35, 13, -13, 11, -16, -21, 85, 38, -57, 39, 76, -37, -36, 62, 22, -9, 46, -6, -40, 46, 11, -95, 18, 77, -43, -62, 40, -2, -42, 9, 5, -28, 34, 19, -66, 33, 71, -64, -33, 84, -14, -51, 32, -7, -35, 83, 25, -66, 37, 96, -68, -20, 100, -24, -22, 97, 11, -64, 70, 23, -65, 47, 78, -72, 2, 73, -11, -67, 66, -2, -78, 30, 52, -74, 25, 63, -106, 24, 102, -65, -73, 92, 12, -87, 69, 48, -87, 52, 56, -75, -3, 96, -47, -59, 137, 11, -67, 55, 34, -61, 48, 60, -104, -3, 124, -68, -66, 108, -46, -121, 69, 31, -79, 46, 53, -110, 28, 88, -64, -57, 92, -20, -107, 93, 28, -121, 53, 59, -90, 17, 125, -75, -50, 134, -28, -80, 99, 16, -94, 43, 78, -95, -25, 46, -77, -25, 97, -56, -104, 69, 1, -107, 49, 20, -103, -14, 103, -56, -39, 103, -45, -67, 77, 5, -105, 61, 45, -115, 31, 70, -66, -42, 125, -36, -59, 88, 14, -81, 67, 58, -98, 16, 71, -64, -27, 126, -37, -73, 71, 20, -82, 56]
5987E6l7j11J32J6j30P0Q2j22m0J91q0j28J54j6j27J44lj33R3R3j42j4J27r2q0
6012i7J59k7r1J05Mj00P0P8j93M3J26j02n9J62n9j14J24K4j04P3J4j24N0J50j14
6037bp4J47m0j04J24J9j22O0K7p9N4P4j57RJ48o5r8J29Mj28R4M7j11L8R2j54J8
6064e0J40n4j53J54L6j52R7L9j45P4R8j22k6J48o6j21J72l0j10O1O4o3J1Q8j35
6089d5l1J62r5n0J05lj25P5N7o5j9P0n4j0R2o6n0J03jj16P9L4j05L8O8o4pM8m0
6118a5p3J45k5j24P6O3p2J6M1n2oP2n5m8J45k5j43O6Q7p5j5L5l3k1Q0o5k1Q0k8
6147A0o7O8O3j02k8J06l7m1L8l9j7Q4Oj03L7R1q9k9Q5j3n8M3k8QN8m3n5N5Q3j24
6177c8mO6J0q4Q6j2k7K0j4rK5O9j10j0P6k1o1L0J5k7M1j1n6M6L5o3k4R0mq1K3
$$ y = [56, 19, -92, 40, 56, -74, -4, 78, -44, -84, 107, 27, -101, 53, 37, -90, 54, 51, -82, 11, 104, -38, -52, 75, -17, -97, 62, 35, -56, 49, 53, -47, 23, 101, -92, -49, 77, -25, -84, 78, 19, -95, 29, 53, -51, 22, 36, -88, -38, 112, -2, -76, 71, 31, -73, 51, 70, -52, 8, 35, -44, 10, 84, -73, -64, 84, 19, -79, 50, 54, -74, 20, 67, -44, -6, 86, -68, -50, 90, 36, -117, 37, 73, -79, 18, 57, -88, -14, 84, -38, -64, 84, 18, -103, 69, 39, -71, -10, 54, -9, 2, 90, -45, -76, 86, -9, -59, 46, 43, -82, -7, 50, -15, -34, 36, -18, -28, 64, -2, -52, 51, 50, -66, 13, 47, -58, -20, 48, -16, -23, 25, -15, -88, 57, 32, -92, -16, 47, -25, -9, 32, -20, -26, 46, -9, -57, 88, 63, -80, -14, 73, -2, -17, 18, -15, -36, 44, -21, -42, 38, 10, -57, 11, 74, -28, -56, 50, 13, -28, 10, -29, -46, 38, 44, -59, -22, 69, -20, -49, 36, 23, -35, 8, -20, -12, 46, 3, -52, 3, 86, -38, -42, 24, 34, -50, 36, 24, -3, 17, 3, -6, 19, 88, -22, -32, 44, 23, -38, -8, 7, -20, 21, 10, -46, 0, 35, -28, -52, 38, 34, -47, -24]
6208b4K8pL0j7l9L3N4p0%Q5n1q9R0K4l8lj1j0N4K4q3l3J03k9o4O1K6m4m4M2K7
6239B5k6K2p0nJ22l5j00M6M9n4K3K3k7nKj6J8P7p7r5J12Q2q4l9O3j8oK5l6j1R1
6270G6p4p2J20L7j51QJ04l2Nk4j4J2P0n5m9J08Kj46N7R0r0mK0K1J5M3j00o1J38
6299E4Qj54O7P8m4l6O1k1Rqo3J8J24m0j57Q8R5p4l4O9k8k8K3l8MJ34r0j23J17
6328A1R3j53l4J43p0l9P0k1n5J21n2r0R9O7j74OJ62j6q8N4m1jR2o2r9J23M2j47
6356e9mJ51q5r1J09lk6O5p6o3J12N5j65K3J73j32r0J53j2o9M7l3m7J29Mj66L7
6383f3J77j08j08J50k3n2N3l5k8Q3l3j22R9J41j58r6J42L4q7O1l5o1J00J1j34
6408i2P4J18j46m0J71l4j16L3O3p0P9kj18O6Q8j29lJ60p9r9P7M1o4O2l4p9J13
$$ y = [-24, 4, -3, 27, 10, -29, 4, 58, -12, -12, 73, 22, -67, 23, 47, 9, 6, -5, -15, 39, 63, -20, -53, 50, 21, -43, 18, 44, 0, -44, -2, 25, -1, 21, -49, -54, 68, 33, -67, -21, 28, -26, -3, 20, -7, -12, -10, -26, -8, 69, -8, -103, 9, 91, 7, -32, 31, 13, 7, 32, -4, -15, 76, 2, -70, 50, 87, -64, -56, 48, 16, 21, -3, -17, -5, 65, 10, -39, 69, 71, -75, -18, 72, -18, -22, -2, 19, 34, 77, -23, -84, 54, 62, -92, -25, 53, 9, -27, 34, 13, 22, 14, -49, -31, 93, 53, -104, -16, 79, 5, -29, 40, 12, -16, 7, -31, -27, 107, 17, -106, 11, 104, -49, -83, 60, -10, -49, 21, 0, -55, 66, 14, -76, 23, 90, -84, -78, 84, 68, -20, 34, -7, -8, 84, 22, -77, 46, 88, -59, -63, 88, 3, -88, 21, 18, -8, 57, -19, -82, 30, 85, -80, -57, 116, -16, -106, 47, 35, -34, 13, -20, -67, 62, 66, -100, -63, 114, 6, -102, 48, 25, -27, 26, -9, -37, 46, 13, -109, -10, 131, -27, -123, 19, 53, -34, 27, -8, -69, 31, 42, -92, -18, 100, -46, -86, 85, 51, -65, -32, 31, -39, 40, 38, -80, -14, 74, -55, -58, 102, 23, -76, 1, 42, -22, 40, 6, -73, 40]
6435D0O9j56lJ48q6q5Q0L5o5K4po4Q7O0j62j5J92o3q5P3k8l3N9K7p8O4Qj34P0
6464b8J48j26j13J41K0n2M7qr3J21%j07L3J17j28n1J42Kj00K0K2m8J17k2j34N2
6490b8J32j59kJ01j8j12R1K0l0M7k7j05J31M8j41m3J48k2p3Q1j2o6M5J1l5N7L6
6517G5j31PJ30p8q9R5L3o6O7k8o5Q2k0r2P1J30j27r0J47j7q1O1j3q2R5Kl6k1J20
6546G9j16l4J29l0p9K6M9m3P0rr3M9J04j19l4J18l9q6P2M4q7J9Pk5M3N7r5j8P3
6575C2j7n0O3jo6J1O1l1JM6p2JQ2m8m6K8N5q3L7L6o0nM0qk0O2mj00M7O0n8K5J2
6608C0m6MM5%m0K4rm5O0K8r9K3P1n3J7L2o0j1L7Mj1K4m7m0O4L8n0k3M0lrL3j9
6641Ik8%N2k9M4ln8k2P8mo2K1k4J9Q%nm1O0j9nO1n7k7J0O1n2J5Qm1K2J7Npj3j1
$$ y = [40, 109, -47, -50, 98, 12, -73, 7, 42, -23, 1, -6, -70, 17, 77, -85, -100, 92, 29, -56, 17, -11, -44, 15, 42, -36, 28, 36, -98, -28, 120, -6, -119, 22, 42, -10, 37, 29, -64, 57, 57, -50, -17, 100, -28, -79, 63, 65, -35, -15, 7, -41, 76, 54, -80, -28, 104, -55, -57, 44, 26, -86, 5, 25, -5, 42, 15, -90, 41, 89, -52, -95, 53, 31, -42, 39, 27, -39, 6, 17, -18, 39, 75, -56, -49, 81, 3, -86, 9, 42, -24, 43, 15, -50, 32, 12, -80, -9, 121, -6, -96, 51, 34, -47, 14, 1, -81, 14, 16, -20, -41, 79, -37, -71, 58, 28, -51, -25, 24, -19, 51, 42, -51, -2, 102, -17, -51, 67, 28, -58, 14, 58, -29, -10, -3, -28, 15, 72, -23, -41, 32, 15, -35, 28, 27, -39, -28, 33, 2, 3, 49, -23, -22, 60, 12, -34, -6, 49, -34, 3, 39, -21, -26, 14, 6, -14, 48, 44, -56, -9, 51, -7, 18, 30, -16, -12, 33, 33, -7, 17, 8, -37, 23, 51, -48, -25, 46, -7, 10, 42, -18, -29, 8, 12, 1, 25, -22, -62, 2, 40, -10, -33, 7, 4, -5, 28, 9, -19, -19, 33, 4, 48, 45, -13, -35, 43, 39, -23, -2, -26, -7, 1, 1, -4, -45, 15, -4, -9, 52, -5, -32, -22, 39, -13, 2, 10, -31, -9, 8, 13, 6, -7, -18]
6677a8j0P0k2m7j8N8k2K4ok6LO1k8j6PMm1K0K3m5Oj2L1K0J7m2j8N4k4lj7L9k0
6710Bk8M8Kqj7Kj2N3Qq1mO9j7l7M7rk4K5mqL1rn6N2L6o4k6M8j0m0M6k7J0Qom1
6746d1M7K6o7l5P5L6l1Kl3J8L2Mo2J3O4o7k1R1k4p4M5K2j4L0l3l6N1L7p4MP5o0
6778@n0O1J0n8J3Mj3P0Lo2pP9j6p8L1O2p8J7L5n1QO4r0RJ46r1r1P7N5q5O5J2n4
6811cRJ3l0K0M0n4m5Q5N0r7J3K1j8J9Ln4j4J15q2o8J02%r1L5P2m1k2L8o1J4J14
6842H3r8m6R8j3q3N5M2m4k4M4m1L6Q0j06n6J62l6j00M5L8m8qM1l0j0O0r3oJ33
6871G5l8j18P0N6p0JO0o8M5K9p4nJ02m8r9Q8O1r9MO3l9J3K6n4j2P3l8m5J02j2
6901D9j05N5O8m5l3J0k0M0M1p1q3J08L5j25O9Q2j18nN3lJ5Qn3l3J11pj37Q2N3
$$ y = [-18, -28, 42, 20, -27, -45, 13, -9, 15, 9, -17, -14, 47, 19, 3, 10, 14, -27, -7, 16, -29, -23, -35, -4, 16, 33, -9, -27, 27, 3, 0, -17, 22, 2, -26, 22, 24, 16, -1, 1, -11, 42, 50, -31, -35, 34, 17, -20, 27, 18, -6, 19, 15, 7, 38, 29, -27, 25, 61, -3, -29, 19, 9, -31, 15, -12, -2, 6, 0, -41, 6, 32, -35, -70, 5, 41, 10, 12, -21, -3, 29, 33, -29, -16, 48, -19, -40, 51, 27, -47, -2, 20, 6, 36, 3, -33, 18, 55, -19, -15, 60, 0, -50, 11, 21, -37, -24, -20, -33, 37, 40, -22, -29, 50, 34, -44, -13, 49, -29, -12, 23, -28, -20, 44, -46, -37, 109, 18, -73, 4, 59, -26, 39, 51, -3, 6, 19, -11, 9, 49, -5, -50, 35, 85, -12, 1, 22, 4, 23, 26, -28, -42, 73, -9, -77, 25, 25, -66, -31, 41, 0, -22, 16, -45, -31, 83, -15, -61, 37, 24, -59, -4, 38, -6, -30, 14, -27, 9, 89, -17, -73, 89, 53, -47, -2, 36, -12, -20, 21, -9, -19, 41, -52, -58, 75, 37, -81, -11, 45, -25, -24, 36, -32, 13, 42, -32, -37, 65, 17, -82, 6, 67, -32, -28, 35, -4, 9, 35, -19, -31, 42, 4, -41, 61, 49, -56, -1, 67, 22, -11, -1, -21, 19, 60, -11, -94, 14, 49, -76, -7, 75, -43, -48, 5, 2, 17, 25, -28, -61, 50, 43, -94, -12, 41]
6930D1o8K3O3p5j7R3p9OM9J2j26J08L5p6nO6n9lL5n0L3M7o9m6R5K7q7j9R2l7j3
6961dL1o0JO6l6n2Q5kj19P0R5o0k9O3o8L2K6l5p2R7J0n0K2L4o7J4M0l6JL0n7j3
6993d3N5L1r0O4Pn5K3M6p7pQ5m2m9R9m2q1O3O5q8K0O1p5oO6j9m1P2j3r2Q0K6p9
7025c6%R8m9l6L5k4k4P3j3p0O8J8p6L9N8q6NN7k2k2M2m7j7L5On6K5O6o0pN7l5
7057Bl5O2k8m3Q5oq8P1J5m3MK9l2LJ0%j7L8Rn9L9L4q0RO2n8j7L4rqJ5Ln3O6K3
7092C7n5rO3l0l6M5l9J6M7m1k0O0l9rQN2o9J1K6k6kK5Rm7M6%k1j5M3l7qL5Km8
7126b6lJ1nK9Pl6K9L1k8j4K4km9M1lk3J0Oj9J1J7k4J9PQj2K2pk9M8l5l%J2m7K4
7162iM7j7o1N7pkjk1PK1j7qJN5m4MQmk6K3joK4m3J4K0Kl0oP3k4l7K0NMk3PqK0
$$ y = [41, -27, -4, 59, -16, -33, 60, -19, -13, 36, 48, -78, 30, 65, -11, -16, 50, -9, -12, 23, -27, 6, 53, -16, -62, 33, 60, -27, -46, 46, 9, -4, 27, -33, -32, 34, -2, -54, 31, 29, -90, -20, 75, 15, -14, 49, -19, 13, 39, 4, -68, 29, 39, -11, 11, 45, -22, -8, 32, -4, -3, 27, -30, -43, 12, 43, -47, 17, 24, -31, -8, 38, -39, -46, 39, -3, -52, 47, 5, -76, -13, 52, -36, -16, 45, -30, -36, 30, 11, -30, 42, 29, -63, 17, 43, -36, -36, 62, 13, -23, 12, -12, -36, 37, 24, -46, 22, 40, -36, 3, 61, -25, -20, 37, 15, -7, 35, -12, -29, 6, 12, -44, -19, 47, -13, -20, 37, 2, -33, 29, 1, -42, 43, 37, -51, 20, 35, -8, -4, 25, -7, -4, 6, 6, -11, 27, 36, -23, 16, 50, -30, -21, 41, -17, -34, 0, -9, -17, -2, 1, -52, 14, 37, -18, -27, 36, 6, -30, 15, -24, -8, 39, -2, -22, 38, -1, -10, -2, 50, -19, -8, 18, -8, -10, 15, 24, -23, 23, 23, 2, -13, 30, -7, -15, 20, 22, -26, -29, -18, -23, 6, 13, -23, 6, 37, 9, -5, 19, 17, -32, 9, 6, -17, -7, -1, -20, -9, 8, -16, 3, 10, 18, 6, 28, 21, -8, 40, 5, 2, 2, 14, -33, -9, 38, 21, -40, 17, 10, 8, 7, -14, -7, 14, -3, -11, -10, 45, 1, 5, 13, 9, -17, 6, 5, -1, 23, -20, -6, 14, 16, -14, -20, 53, 29, -8, 12, 17, 21, -2, 5, -3, 17]
7201A7nj6nLL1n0J6M5l1qj0NL8ql2j2L0J2m4J1L3k6Lj7L2k2J0j1J1K7k7j2%N6
7235D4l3j9K0Pl9M6k6RJ5pk7OM0o4K1K1J0k1m0L6K3m0LoK4Ml8RK4JrqJ6KJ6k5
7271eOKK8o5K9J2J9n2L8L4j2l9K0k5K6mk1l1N8j2l7L1J0l6mM1j1%J6j8OK0k1m0
7305c7L6J4pk1L4Mm5J9QNJ4k0l2J5K1k5%M7l3j3J4k1MN0n5k1N0J0k2jL7n1OL8
7339B2l5nJ3Km2P5k3o6N1J3Mk4K4mj4L9l1m2M8Pl9K5K8l2J6KOk8L1ql0K7j5ON
7374FJ7j8m6M9%j2RQj7RQm0K9Kj1j1L0l4J4K3j7j9L5qJ2J0nj8L%Pjj8K3k3L1k6
7411AQlrmj2K7lk2PKkJ6j4%j5K1kj2K3Jl8L3j1QK1k1J1J9k1J0l2K0J1k9M5j7m5
7448b8N6m6PK1J0l4K1K0o2M8Pm0L5ll2L3k5K5k9K9j8k0NL4k2RnL0k4K5l5rK7K2
$$ y = [17, 12, -4, -9, -6, 25, -25, -9, 36, 5, -3, -13, -8, 30, 22, -10, -22, 8, 20, -24, -13, 20, -6, -3, -20, 12, -10, 0, -11, 0, 27, 0, -12, -12, 44, 11, -8, 12, 19, -20, 26, 0, 9, 24, 17, -10, -4, 36, -28, -7, 14, 24, 3, -37, -1, 22, -18, -15, -21, 3, 7, -31, -22, 2, 3, -6, -14, 2, 4, 20, -5, 1, 3, 31, -34, -5, 7, 26, -26, 12, 46, 34, -5, 15, -10, 16, 12, -9, -40, 18, 6, -31, 0, 10, -26, -30, 11, 0, 0, 16, -2, 4, 24, 3, -37, -1, 13, 6, -15, 19, 23, -22, -3, 5, 10, 24, 4, -28, -13, 8, -17, -17, 30, -3, -16, -2, -23, -19, 31, -24, -45, 5, 15, -7, -8, 29, -22, -16, 22, -13, -18, -5, -3, -45, 30, 7, -59, -8, 5, 9, -15, 9, 5, -9, 30, -1, -43, 5, 12, -27, -2, 26, -6, 10, 12, 18, -10, 21, 13, -17, 10, -5, 1, 6, 23, 5, -41, 8, 8, -4, 5, 13, -4, 5, 13, -27, 2, 4, -7, -18, 12, -22, -8, 15, -2, -21, 14, 6, 18, 28, 23, 5, 8, 8, 15, 14, -4, 19, -4, 27, 1, 9, 6, -3, -7, -19, 8, 5, -17, -10, -8, -10, 6, -8, -8, -23, -2, -4, -16, 7, 8, -30, 3, -8, 0, 21, 0, 11, 30, 9, 19, -13, 7, 18, -11, 34, 17, -28, 28, -18, -11, 10, 20, -14, 7, 27, -35, 13, 20, -20, 15, 12, -20, 13, -12, 13, -16, 13, -5, -25, -20, 14, -8, 1, -4, 26, 2, 27, -8, -17, 10, 32]
7482C2l0lK6j8j2Ojmj4J3QoJK4j8LOl7K8k6J6npJ4j5M1k7J0%j2k0K8j6Lj4J2P
7519gJ0Jj2OJ2Qk6L8m1J5qKoK4l5j2L4lqj5J9RJ3j4J1j9j5L1k7kK0Jj9QQlj7J2
7557gk7K4oK2k9R%J2J3k0J8lnJ1Plj6lpJ6nJ1k1Rjj2K5j7J9l0K2J9l4k9L7Pjj0
7595elMJ3Pm0J8LpK3Rj0kkk5L6j6J8Lj0J0j4jrOj1J7J3ln2K6M1k4l4L3nj0j5N
7633a3MK1j3j8oL1j1j7J8lNqoRomlL4Jnk5K0j0J7J4m0K5Jnj0J8m7J9PKj5QNjj2
7673a9L5Lj5mlk0PknL6J8m2k0L1l8L2NL5n9M6mj2K1j7JjK0j6J0%j5mlJ9k6J7k2
7710a1NK9l8J4l4N2J0j2j8j0j9K6J7k1JL3l4J4POk1NRrLoJ1j8J2k%M1n6K0j5K2
7746A3m2K6Qj2LmJ2mPj6k9M4Lj4j0L5j4l6K4joRrK0mKOPk2NMnQnJ6k4J3L3n8K7
$$ y = [32, 2, -1, 25, 7, -5, 1, 0, -4, -18, -5, 3, -3, -2, 22, 4, 7, 13, -24, 4, -22, -6, -11, -18, -4, -19, 22, -5, 5, 5, -7, -27, 1, -15, -12, -26, -14, -7, 3, 4, -8, -2, 10, 18, -8, 30, -11, 4, -4, -2, -8, 16, -19, -31, 3, 0, -8, -23, -4, 5, 18, 4, 15, -4, -19, 12, -15, -17, 3, 4, -15, -7, 1, -2, -19, -7, -34, -10, -16, 6, -23, -14, -14, -2, 11, -9, 9, 6, 1, 12, 19, 16, 0, -3, -10, 6, 1, 12, -9, 0, -1, -13, 12, -5, 14, -16, 6, 25, -9, -38, -1, 6, 5, -5, -8, -4, 9, 16, -24, -6, -3, -10, 13, 22, 12, 10, 8, -17, 19, 3, 21, 24, 14, 24, 10, 9, 0, 6, -5, 12, 25, 22, -30, -4, 37, 13, -21, 12, 7, -3, -18, -13, -9, 12, -1, -19, -25, 6, -5, -22, -4, -7, -2, -10, -16, -7, -13, -17, -20, 14, 15, 10, -15, 5, -5, 12, 26, -14, 11, 12, 7, -3, 15, -32, -13, -6, -4, -19, -11, -6, -7, -19, 16, 19, 4, 0, -3, -23, -16, -18, -23, 13, 31, -11, -31, 0, -38, -6, -1, 34, -25, 21, 17, 5, 26, 9, 10, 9, 29, 13, 23, 23, 8, 4, 1, 20, -6, 11, -11, -6, 23, -15, -1, -35, 17, 27, 15, -3, -13, -32, -6, 11, -10, -9, 24, -10, 4, 11, 17, -4, 1, 10, 1, 4, -2, 9, -9, 3, 1, 1, 42, -14, 6, -9, 13, -29, -3, 5, -7, -4, -8, 4, 0, 7, -9, -38, 6, 9, -5, -15, 20, 6, -30, -6, -7, -13, -4, -13, 7, 3, 5, 11, 18, -4, 1, 5, 0, 8, 3, 19, -5, 8, 41, -17, 10]
7786A0KJJ9k6Mk8J9Qpl3N5k7k0K7Oj2J3j4J3qkj0J2Nl6L2J2Jl1K4pJ0n%lQL2o1
7824a7L6rj2J9Nj0rK0poJ1Jj2Qk5Ol4L9L5m6O%kj1K1n0N7rk2J7J0Lj1lj0J6j9
7861a4RJ9k3K3j6Nj7M3m4L0K0m3L3l1NL4k6nj5jK5l2K7J1k5MnJ0P%j5J2j5rjJ6
7897dj9L4j3J6k1j0NpK4J5m3K2J9k2RJ2mJ7Nl5LK5l8oK5jl8K3J7k3J1k7J2K2j
7932Dmj4jJ2J1oJ1k3NpK7j5MqqJ2K2nqKk4QJ6LlRpk7K1Rl7K9lk8j0J8RK6l9%K
7973a7K4jl9j3M1J8l1lJ3J9oj7lJ9J5k4K1on0K6L9jk3J1lj8MK4l3J0J5J9m0K2
8007A2j5oL1n5L0J4%l0K5J2k9%k2J6J1J8m8MN8n8NM7j3rM1l4Rk5L2oj0k1LKK7
8042A6Kmj8L1l7J5K1k8j5PjJ0L0k4l0M1J0m6%M3l0k6L3rpL9k4k6N3k7qJ6Pn3M0
$$ y = [10, 12, 13, 32, 6, 10, -18, 1, 9, 2, -31, 24, -3, -23, 4, 10, -2, 11, -3, 10, 2, 0, -10, 2, 7, -29, 3, 15, 16, -15, 9, 2, 12, 7, 7, 4, 12, 44, -17, 19, 10, -2, 17, 22, 12, 3, 23, 16, 10, 21, 22, 10, 18, -7, -1, -35, 4, 39, -7, -1, -1, -3, -14, 7, -43, 14, 5, -17, 0, 10, 13, 2, -1, -11, 5, -14, -5, 14, -9, 14, -2, 3, -14, 29, -15, 15, 35, -8, 25, -6, -1, 33, 7, 2, -13, -14, 11, -21, 6, 17, -8, -4, -9, 1, 8, 8, -7, 5, -10, -19, -20, -4, -23, 11, -2, 14, -7, -17, -12, -19, 5, 20, -23, -1, 18, -4, 5, 17, 13, 30, 35, 0, 3, 28, -10, -16, 9, 8, -30, -7, 10, -13, -2, -29, -17, 5, 4, 0, -14, -15, -3, 8, 2, 13, -10, -5, -12, 15, 0, 4, -4, -12, 0, 22, 17, 9, 11, -13, -5, 11, 14, 11, 20, 13, -14, 7, 16, -21, 8, 5, -23, -33, -15, -6, 20, -19, -19, -17, 7, 6, -33, -46, -5, 13, -18, -21, -8, 11, 5, -12, -15, 4, 19, -5, 16, 10, -40, -14, 25, 24, 1, 12, 9, -9, -5, 19, -14, -4, 11, 30, -10, 12, -3, -9, 22, -33, -3, 11, 11, -19, 6, 18, -11, -11, -33, -17, -6, 12, -36, -32, 26, -32, -27, 20, 7, -2, 39, 5, 14, -11, 21, 15, 5, -16, -13, -11, 16, 18, 14, -4, 27, -10, 5, 26, -2, -17, -10, -11, -1, 29, 5, -25, 16, 26, -20, -20, 23, -7, -33, 0, -9, -16, 23, -1, -27, 26, -1, -9, 7, 14, -39, 1]
8077ANpnL0l4rM5l2mJ5j0kj0J9k0K2K9n9LM7m1LM0ml5K5j4k6K4J1l3K8L2m0nM3
8113C2j0k7L2lj2Qmm9K6J3km9P7lk3J9j3k0J7Kj3J3J5k6%jKj9K5nl7L7Ok2j2N0
8149B4n1M0pK0n6K4K4k0J3kj7J5J6l4j2K0j4K7L0l3j8J1J9k6OJ6k2J7rJ7l9M7
8181B6m7LRJ8l7RMj4K6M0
$$ y = [1, 6, -1, -6, 24, -10, -19, 26, -6, -10, 5, -5, -7, -17, 2, -18, 4, 33, -26, -23, 24, -17, -14, 26, 22, -13, 12, -2, -28, -4, 7, -26, 2, 34, -6, -11, 32, 22, -5, 27, 24, 12, 20, 16, -33, -7, 6, 4, -45, 32, 29, 6, 25, 12, -8, 9, 11, -2, 11, 26, 0, 0, -1, 1, -18, 7, 2, -35, 2, 8, -14, -26, 24, -27, 13, 6, 26, -30, -6, 18, -2, 11, 9, -8, 7, 23, -11, -23, -3, -17, 10, 40, 7, -11, 0, 19, -7, -1, 15, -7, 10, 1, 18, -21, 26, -21, -18, -9, 9, -28, -19, -15, -29, -3, 37]
8191C7
$$ Imaginary data points
##PAGE= N=2
##DATA TABLE= (X++(I..I)), XYDATA
0@%%%%%%%%%%%%%%%%%%%%%mJ0j3J5j6J6j6J6j6J9k5K9l1L4l8M2m6N2n8O3o9P7
43D1q4R2j01J09j20J33j47J61j77J95k17K43k71L03l45L99m60N39o45P89r95J304
65G46j808K706m591R848m6736j21331K51779K4272k40501R3998J11620j20445
77d0443N9577N2973j92313P3568K19020j93706j32996K49428j3611k13515J34407
88B389J02844j59972L1247P5308j26239P2703J40837k04736p2419K53620m0083
99G5499j99037J36044P4099j60893N4239R4823j22495L3633J01648j60664j1243
110h4347K20872r5456j83370J61030P0148j52523N6979P4382j29065L7127J08338
121H4115j31002q351J65374j12949j26928J85932L7517j70282N5906P5193j05503
$$ y = [0, 0, 0, 0, 0, 0, 0, 0, 0, 0, 0, 0, 0, 0, 0, 0, 0, 0, 0, 0, 0, 0, -4, 6, -7, 8, -8, 8, -8, 8, -8, 11, -14, 15, -16, 18, -20, 22, -24, 28, -30, 33, -36, 41, -43, 49, -52, 57, -63, 70, -77, 84, -93, 102, -115, 128, -143, 160, -185, 214, -246, 293, -352, 437, -558, 746, -1062, 1644, -2947, 6901, -39835, -161166, 90613, 114885, -125616, -31618, 80002, -40443, 19134, 72107, -120206, -46638, 172382, -21324, -154320, 95108, 81497, -132018, 2389, 105233, -54739, -23492, 51816, -74423, -1720, 139117, -65619, -138038, 115582, 75499, -123538, 12506, 86605, -74288, -20049, 74774, -47721, -14088, 87560, -73104, -84347, 136525, 41069, -142301, 18729, 88877, -63646, -6667, 67715, -61350, -24223, 84115, -46887, -55238, 110136, -2813, -129741, 56191, 93708, -76574, -20668, 54525, -50978]
132e0978M7565Q5837j35466o031J48744r3392q8462J60266o850j56801Q4103Q1946
144G0481j03618K6874N8824j13585K3833J34168j02144q1390J38923j2430j19250
155g9314R3484N3892j15665K6412O6267q4206K7597R3208j14508n0606J48654
166F5215j9996j15189Q1036L5782r9010M5547O1362q8077J5630P3711r4269j4890
178e3148J33550n4035j12116R5755M2004q9228L7991L9522q3942K8403P1814q2978
190b6408j0046J01011o5615p6972J12008K4008j03090L0830M3967n9834L2473
201B332M8168q5893j362R1643n6616n2564R5957n722r4888N0805N1864n9944J2450
214c770L0472o5090K0528P8351o6956m6625Q6552j0344p2130N9000L2717p1228
$$ y = [-50978, -3413, 82424, -53042, -59073, 89671, -3721, -92183, 68083, 61233, -95568, -11465, 70481, -33137, -6263, 52561, -61024, -37191, 96977, -5167, -86557, 52366, 39936, -79314, 14170, 68062, -47603, -21191, 45076, -39130, -11533, 81675, -32833, -83439, 65215, 45219, -69970, 11066, 46848, -52162, -6615, 54747, -33330, -17700, 56011, -38258, -53148, 80402, 26367, -85749, 10006, 52010, -37218, 773, 40295, -43647, -15244, 56570, -26408, -36454, 64557, -1058, -78030, 33978, 57986, -45104, -14274, 29693, -30141, 2332, 50500, -35393, -36755, 54888, -1728, -54292, 41665, 35943, -58945, -8140, 43724, -16220, -3770, 26702, -38388, -17860, 60491, -6465, -53090, 33462, 23118, -49012, 9988, 42705, -28523]
226b8523J2660M0033m3704J8003M7229p1307k2480R1764j7616p0139N1683K0947
238B8550o0921K6989L8643m8716N488L5827n0269Q42P3545l9878o3090O0852K4781
251C2643n4074K0041K4584m5787J2365L8264l9768k591M7117m0381l4327O6245
263B4331R229o1308J5821K9081k9096J2289K3739m0564j253M2383k7736k0240
275b3324M8944j0225n1088L0949L2480l1764k181J4431k4537J0594L3496l1242
287c467j9937L8749p761l1789L2554J5747l9236R88K4068j1235L979J2073k9128
300a4395m098L8631r171k9136K1620Q104k7089J0993K1602j7340o909Q898j0240
313h530P108K1829k0433k2145K4587J1619j9532L654J0108j4487j492J3922l252
$$ y = [-28523, -15863, 24170, -19534, -1531, 45698, -25609, -48089, 43675, 26059, -44080, 7603, 28550, -32371, -5382, 33261, -15455, -9967, 25860, -24409, -23567, 49978, 10100, -52990, 7862, 32643, -21431, -1390, 23194, -22593, -10228, 28036, -11732, -14323, 32794, -7587, -41914, 24331, 33560, -27748, -11927, 17154, -11942, 347, 24086, -16478, -17731, 24652, -3084, -23324, 25620, 15395, -35693, -4744, 27736, -4028, -6209, 8222, -16315, -5721, 27775, -3467, -23404, 15345, 7584, -24205, 8349, 24096, -15140, -14152, 9916, -1319, 2660, 14733, -14395, -18493, 20138, 10967, -18169, 3451, 11555, -15534, -4541, 17061, -279, -7188, 1710, -8530, -1422, 20407, -26, -22171, 2416, 14035, -5497, -1843, 8265, -6222, -7714, 6208, 2956]
326B956j985L815j3938k343K4094O56k3325P54J3483k311j713L815m931l427L794
341f06l59K934O669r291j2326J0367J4265n812j1692l70O369L076j504j210k13
356B97k169k108K910O279J155q898q074Q173J3690n152j3934K820Q133k673J29
371E78L357n114k372K851j674N222P313j3954j1269J8015J0312j5118l888P034
385A293m266K413P981q829k923R730r359n482K1757j277k6075O789J8700q783
399A669l149O095j2010J018J8096j0927j1198K0045m677k3450K0003J8153k4899
412e231n687J6076p913J639J5187j9247j1209K8166l304k4829K0846J1652l1058
425a4912M464K6255j4976p198J4493j6248l359L1479j2791l0192K6425J3230l1019
$$ y = [2956, 971, 4786, -9152, -11495, 12599, 13255, -10070, -9316, 4167, 1856, 143, 3958, -973, -4400, -606, -965, 1969, 8638, -653, -12979, -2612, 11653, 5841, -5851, -6221, 148, 3224, 1720, 510, 297, -1872, -3980, -1070, 5209, 6364, -2534, -10608, -2435, 11255, 6103, -7831, -5011, 3122, 449, 578, 3935, -1179, -3551, -700, -2374, 2848, 10161, -3793, -15062, 2953, 13265, -1853, -5741, 1293, -2973, -560, 7421, -1408, -4331, 5399, -3960, -9442, 12315, 11038, -15037, -8248, 10452, 1669, -1480, 4615, -7395, -6377, 11719, 792, -10406, 9639, 4962, -18488, 1515, 19668, -5231, -10918, 5158, -2755, -1116, 14071, -5176, -16385, 11781, 8477, -16352, 4494, 16146, -14912, -10448, 15807, 831, -6367, 8126, -8122, -11481, 19998, 7207, -22985, 3440, 16670, -14349]
438a4349R527K3744k5154o770K3961j2836n876K5518j9492k4401L8282R506m0268
451a8608J1643K4863k7147n33K7634k0379j0596K7619j6520j8190L9739k821m5955
464b9251K4122L0688l4329k039K7593k4186o596L3555j9170k0756L7998p114m0755
477c0240L4786K5778m6733o0L5641k3129o970L1004k4448j8583M2579q488l9197
490b8060L6141J7492m9631J0564M0797l0225j2686L1287k0671j2790M1922j6187
502G953l9635M1172J5271m9660J7275L7239l9772r924L9423j9412j5681L6300
514B0549j9517l2103M8130Q390n4984K2702L6814m4141l556M3443k6945j9528
526b0746L8985j6253k7158M5921k014n4153L3282L6129n0340j316M4043l1468
$$ y = [-14349, -4822, 18922, -6232, -13002, 10959, -1877, -7753, 17765, -1727, -26128, 12154, 21660, -18608, -6965, 17898, -9249, -9782, 17852, -2527, -13123, 14496, -2024, -20214, 19525, 16704, -29251, -5129, 25559, -8770, -10809, 16784, -7402, -13998, 19557, 387, -20369, 17629, 10515, -30240, 4546, 30324, -16409, -16469, 19172, -3957, -10927, 20077, -4371, -22954, 19625, 11137, -28060, 8081, 25573, -24058, -13494, 27303, -2922, -15608, 15679, -4992, -17782, 24140, 7953, -31682, 9490, 24761, -24899, -7624, 29615, -10157, -20081, 19342, -70, -15751, 20549, 1032, -31071, 17059, 25449, -29535, -6833, 29981, -14160, -17716, 25727, -1218, -20746, 18239, 1986, -25172, 20749, 18735, -35418, -2136, 33993, -16347, -17663, 26380, -5088]
538e088j6974M4164j7563k9641M2708m052m6252L8779K7096n6124M961M6847l3593
551d732j5662M3404k1385k8703M5259l854m3850L7195J9099n3859J5369M4747
563C3028m1205j3964M4994k2623k4900M6279r089m4212L9675J7366n1249J9661
575f239L7630m6521n893M8241k7827k3664M6366j4168m0433M5537J3106n4018
587b7883K1652L5389m5273L33M4825l4266j9610M8577j7562l6633M7333N423n4262
600c1957K7989L4929m6258M84L9990l3320j2192M6311k3135l2666M8441r5n1070
613c2549L4087L0272n0831K773M1334l0952j0601L9660k5659k4442M9063p150
625A5005m8089L8797K3857n3377J0113M2679l5223j1831L8239k3308j7523M4652
$$ y = [-5088, -22062, 22102, 4539, -25102, 17606, 13554, -32698, 6081, 33177, -22947, -17986, 28861, -4732, -20394, 23010, 1625, -27078, 18181, 14327, -29523, 7672, 26771, -27088, -11719, 33028, -8177, -22141, 22853, 230, -24670, 21609, 12520, -31692, 7983, 25349, -25900, -6239, 31391, -15130, -21023, 27218, -609, -24273, 22093, 7925, -32508, 13029, 26135, -27883, -6231, 29158, -16115, -15782, 29043, -5223, -24833, 23744, 6182, -30451, 16882, 22305, -31957, -3968, 30961, -15297, -14813, 25177, -8143, -20335, 25976, 2841, -29825, 18616, 18521, -32549, 1538, 31810, -19021, -16248, 25086, -5866, -16467, 23193, -2466, -26908, 22155, 15005, -33084, 5713, 29570, -23807, -13694, 28985, -6238, -18069, 20170, -3138, -20661, 23991]
637B3991j5915m1599M4854J6208n4723J7526M0453m1280r324M1545k2559j7709
649a8532L8916j7717l1866M6391N747n3578K5310L6531m4861m722M2404k5050
661a027j8646L7380j4798k6307M1046j947m6862L1961K9819m7957M70M1796k7663
674b735j6754L7458j4423k4719L6575l951l8952L3691K0701m8725P985M1092l1795
687d552j4910L7881j5972k2972L5583n247l4486L2585J3853m5117J5042L6416
699B8104l6491j1092L9222j7623k1449L4577p380l1261L2353R794m1170J8039
711d377L0042l7595n274L8601k0212k0410L3294p544k7473L0974N982l7810J9727
724b075K5310l6198p23L5062k2652j7287L2735q115k4720K8298K941l3286K1368
$$ y = [23991, 8076, -33523, 11331, 27539, -27184, -9658, 30795, -10485, -19809, 21736, -823, -18532, 20384, 2667, -29199, 17192, 22939, -30639, -5329, 31202, -13659, -18381, 24023, -1027, -19673, 17707, 2909, -23398, 17648, 15701, -31161, 800, 30619, -17338, -16868, 24928, -2735, -19489, 17969, 3546, -21173, 15402, 11451, -27501, 6190, 26891, -21834, -13849, 27243, -4552, -19462, 18419, 2447, -20525, 15058, 9811, -24675, 7910, 21763, -23354, -8312, 28104, -8387, -19479, 19743, 2120, -19329, 15248, 7868, -23393, 8960, 18754, -22416, -4377, 25665, -11930, -17204, 21397, 1185, -19225, 14069, 6525, -20948, 10026, 16008, -21802, -2075, 23235, -12963, -13686, 21376, -1276, -18563, 14172, 6057, -18663, 9635, 12576, -20710, 658]
737F58K0578l5400K704L2102k3970j3398L1842j0463k2345K7329P46k8970K1762
750C175J5022l3708O895K9001k5300j0377L0333j2263j9366K6773j613k5803K1527
763D296J0627l0345J0419K4149k6163o500K8634j3221j6695K4707l276k2224K0702
776E110P324k6912J1879J9138k5128k246K5884j4689j4066K3010l873j8791J8840
789E480M517k3304J2512J5220k3320O79K2523j5814j0858K1993n176j6490J7214
802E176K492j9447J2604J1178k1275L181J9210j5907p710K0328o755j4221J6551
815E405R95j6627J2002P585j8376N458J5236j5670m761J8008p552j1500J5206
828E409k46j4235J0999N534j5263O127J1339j4439j864J5470q052r108J3323j032
$$ y = [658, 21236, -14164, -11460, 20642, -3328, -16726, 15116, 4653, -17692, 9637, 10383, -18587, 3175, 18197, -15511, -8616, 20385, -4915, -15292, 15041, 2778, -16588, 10185, 8572, -17231, 4296, 14923, -15422, -5003, 19146, -7017, -13517, 15117, 1896, -14799, 9908, 6632, -15592, 5110, 12434, -14478, -2599, 16539, -8589, -10835, 15049, 360, -13706, 9304, 5431, -13360, 5480, 9997, -13307, -795, 14425, -8895, -8216, 14307, -1507, -12365, 9628, 4452, -12038, 5176, 7668, -11779, 825, 12003, -9272, -6091, 13119, -2788, -10498, 9830, 3075, -11146, 5405, 6400, -10227, 1775, 9360, -9016, -3558, 11678, -3992, -8753, 9255, 1703, -9797, 5409, 5163, -9072, 1927, 7461, -7802, -1675, 9664, -4775, -6639, 8831, 779, -8329, 4994, 3962]
842C962j1594R645L978j2673N698Q556j2313J32J2569q467o784J2198j676r650
856f419Q380K598j0045N242O214j0037R35R664p764m501J0553k485q090P395J942
871C582p822M379M063p728J647O857o360k565P977k692n866O177J386o182L087
886f0K810n269J783M181n024j072N583k369l675M454O58m338J996K294l045O63
902d30K198k904j30L387j824k248K705M45k407Q09J536j266n60R47k69k37Q32
919E84m82r51R50Q57j061p02J115O03j569k8J856q90j550J672K37j618J393M77
937H93k497J337K311l003p79L797j565l026L751P07m232K230K363m228J231L769
953C059m512j093N706k593m161N484M28n964L646L488o010J149N148n536j150
$$ y = [3962, -7632, 2013, 5991, -6682, -984, 7572, -4741, -4609, 7960, -507, -7291, 4907, 3231, -6419, 1961, 4559, -5486, -244, 5970, -4067, -3132, 6532, -1232, -5733, 4820, 2335, -5755, 1640, 3582, -4240, 139, 4202, -3526, -1879, 4978, -1382, -3947, 4030, 1338, -4528, 1649, 3035, -3147, -60, 2750, -2519, -736, 3445, -1579, -2651, 2932, 563, -3112, 1342, 2000, -2338, -342, 1952, -1093, -430, 1768, -1136, -1266, 2121, 297, -1951, 754, 1199, -1208, -399, 1137, -129, -689, 258, -11, -248, 584, 102, -849, 101, 958, -103, -805, 310, 913, -656, -684, 1172, 282, -1268, 404, 641, -977, 416, 893, -1604, -267, 2044, -959, -1738, 2059, 494, -2532, 1219, 1926, -2306, -76, 2287, -1941, -710, 3059, -1453, -2546, 3160, 567, -3594, 1890, 2318, -3646, 0, 3488, -2522, -1373, 3775, -1761, -2911]
968b911P245l998m928P446k29p307N462L493p987K105O334o903j079Q242n324
983c39n094R441j203q782P389L549r950L630P360q893p73R474o512m978J0801
998E120k515r754R238L528j1590M709Q062j0560k72J0697p717m895J1741l781
1012B011r709J0927K692j2869N911Q456j1710K95J1390q921m816J2662m757r545
1026g983J2250J166j3721Q070Q349j3343J287J1809j0079m096J3432n983r319
1039h161J3319l41j3939J0457P265j5453L096J2556j1693l333J4031p519q735
1052h450J4419j652j3802J1960N868j6647N332J3035j3741k841J4854q570q041
1065h276J5128l188j3571J3128M580j6766P129J2189j5463j607J5905r609p904
$$ y = [-2911, 4334, 336, -4592, 2854, 2625, -4682, 780, 4273, -3714, -1609, 4725, -2178, -3257, 4985, -339, -5433, 4008, 2805, -5977, 1412, 4961, -4989, -1359, 6001, -2892, -3665, 5809, -703, -5681, 5120, 2605, -7149, 2089, 5617, -5973, -1264, 6798, -3762, -4034, 6663, -1054, -5949, 5792, 2011, -7698, 3229, 5921, -6948, -1037, 7419, -4291, -3996, 7394, -1527, -6343, 6319, 1562, -7983, 4267, 5433, -8288, -218, 8131, -5212, -3925, 7884, -2195, -6291, 7141, 1158, -8161, 5158, 4817, -9122, 1335, 8600, -6853, -3757, 8799, -2894, -6227, 7804, 285, -8450, 5969, 4317, -9485, 2475, 8343, -8304, -2972, 10063, -3678, -6519, 8335, -235, -8276, 6852, 3664, -9907, 3221, 7801, -8965, -1836, 10353, -5110, -6717, 9188, -421, -8325]
1078h325J5529m328j2882J4427L051j7049Q852J0870j6589P57J6034j1847p256
1091h756J6464n360j2223J5374J048j7171J1029R814j7639K884J5255j3974n130
1104h385J7596p486j1776J6223n76j6621J2985Q267j8857M492J4916j4923l280
1117g425J7393r848j0544J7646k068j6174J4074O387j9068O447J4598j5847k622
1130g051J6761j0661q622J8077m393j5798J5493N050j9056Q320J3387j7238j328
1143g059J6914j0829p484J7019o342j3772J7297K736j9612J0316J2159j8412Q92
1156f177J7038j2486o975J6644o779j1322J7191o58j8872J3168J0877j9564K463
1169e452J6639j3909n787J7189p302j0552J5995k472j6129J4974P855k0580M458
$$ y = [-8325, 7204, 2876, -10006, 4421, 7472, -9577, -725, 10145, -6444, -5687, 10347, -1500, -8756, 7708, 2348, -9875, 5499, 6547, -10624, 405, 10219, -7420, -4536, 10719, -3255, -8385, 9211, 1725, -10051, 6172, 5596, -11025, 1960, 10227, -8630, -4138, 10778, -4145, -7425, 9968, 120, -10424, 7222, 5154, -11020, 3054, 9441, -9627, -3180, 11418, -4429, -7051, 9710, -951, -9573, 8504, 4111, -11687, 3806, 8856, -10200, -1880, 11507, -5731, -7059, 9855, -974, -8458, 8561, 2219, -11553, 5744, 8480, -11132, -816, 11343, -7069, -6177, 10861, -1625, -8600, 8044, 1265, -10057, 7134, 6476, -12396, 772, 11649, -7915, -5452, 11187, -2722, -8509, 8680, 1378, -9174, 6821, 4349, -11780, 3194, 11049, -9531, -5073]
1182e073J6418j4420m854J6832q154j0013J5740k577j4138J4525M610j9732P724
1195c112J5542j6334m193J6777q331q886J5456l481j3384J4116L043j7658R875
1208e70J2490j8316j528J7756r376q504J4638m439j1478J4473J457j6582J0394
1221D15R870j7944J758J7072j1959q118J5171m194r934J3471q38j5086J1661Q353
1235I698j7173L108J4862j3046o039J6060m803j0318J2151j226j2305J2297N484
1248H750j7298M701J3821j2998m095J5066o551r697J2660p01j1005J0947K719
1261F319j5690P694J2416j4621l099J4592p237p802J2839k167j0759J0340K087
1274D912j2943Q669Q885j5740k80J5145q041p422J1835l177r022J0962J036j2027
$$ y = [-5073, 11345, -3075, -7929, 8903, 749, -9264, 6476, 3899, -10239, 4286, 8896, -10836, -3112, 12430, -3904, -8097, 8680, 349, -8537, 6919, 3438, -9946, 4170, 7213, -10445, -570, 11920, -6396, -7924, 9832, 456, -8048, 6590, 2151, -9327, 5146, 6603, -9979, 415, 10285, -7659, -5901, 11171, -788, -8906, 6265, 2071, -7863, 5608, 4770, -10316, 1345, 9698, -7475, -4367, 10495, -2551, -8590, 7470, 2667, -7651, 4500, 3274, -9031, 3266, 8750, -8548, -3847, 9974, -3024, -7119, 7947, 1396, -8301, 4359, 3658, -7347, 3600, 6319, -9371, -1677, 10739, -3882, -6981, 7611, 374, -7428, 5411, 3244, -7515, 2825, 4912, -8031, 638, 9523, -6217, -6497, 8648, 607, -6815, 5020, 1843, -7179, 3783, 4819, -7208]
1288g208Q031O360j3891K824J3386j0398o787J2332k557p754R678p07j0850Q825
1302A284N461j2487L396J0370j0936l842J2982l680q367Q468n24q289Q977L172
1316E985j2506M157R485r984j871J1257n882p241R642o5p594P154J130j0446O216
1331e63Q246j0709j650J0022n603m907R478j883p769O881J460p948O014M997j0679
1346d613K84J0196n253m817P435k395n672P408Q59p832M765L640q351K298Q274
1361F226o727m593P404r13m282N561j003o680N705L698p490J733N925o509k193
1376d138P838j652n090L978l90l812N526J395p694K076N981n047j537N986k903
1391E17m198M730O60l246L145m36n292L981M845n721k140N029j450k537L807l75
$$ y = [-7208, 823, 7183, -6708, -3884, 9502, -896, -7683, 4649, 2092, -5662, 4016, 3309, -7541, 1284, 6745, -5742, -2346, 8024, -2912, -6754, 6228, 2548, -5819, 2649, 2125, -6164, 2813, 5985, -6521, -2364, 7121, -2863, -4734, 6523, 641, -6600, 3042, 2977, -4617, 2537, 3667, -6779, -563, 7683, -3026, -4676, 5346, -257, -5164, 4314, 2431, -5338, 1543, 3003, -4945, 1069, 6066, -4613, -4329, 5867, 614, -4203, 3232, 837, -4835, 2573, 3432, -4400, 365, 4005, -4346, -2048, 6226, -501, -5094, 2310, 1397, -2885, 2676, 1673, -5007, 698, 4396, -3094, -1361, 4564, -1945, -4138, 3700, 2048, -3042, 936, 546, -3266, 2260, 3655, -4039, -1963, 4018, -1029, -2566, 3420, 517, -3681, 1049, 1709, -1537, 1608, 1172, -4120, -139, 4706, -1015, -3155, 1874, 424, -2113, 1694, 1319]
1407A319l507K358O20k693L186J715n704k03N696j055l292J629j1j383K388K33
1423A296k678J595Q32l247J578L913k856l346K388J758o51J00j208j212K227J010
1439A499k230M70J669k239j175L049J042k306j286M33J446J401j207k243P53J840
1455I16n36q31R79Q7j643k01J999J097j568k044N10K133P16j339j548L94J582
1472G03j69j063R68L98k170j58K782M68k100r57L03J293J696j365k706J487K062
1489A472j798k27K107j557k041J965J228o50J26j573j434L428J905l966r45L008
1505A048r53j181K623o12k540J409M26r95K615j69m815J354M827k185k591K387
1521F48q05j652L187J77l157J860O10l447K877L696n099k396M856k1k382K410
$$ y = [1319, -2188, 170, 790, -1903, 1283, 2998, -2706, -2909, 2787, 1732, -1560, 69, 58, -1325, 1063, 1296, -1382, 213, 1045, -2202, -624, 3289, 433, -2913, -525, 1233, 582, 682, -526, -1738, 489, 1499, -731, -261, 1408, -831, -2006, 1043, 2085, -221, -1507, -1074, 372, 1773, 566, -1677, -924, 916, 380, -451, 528, 615, -1028, -1229, 770, 1867, 299, -1745, -1235, 898, 1614, 275, -1273, -879, 703, 534, -529, 439, 837, -1333, -1491, 1291, 1759, -341, -1298, -995, 298, 1994, 629, -2077, -590, 1472, -326, -553, 1554, -3, -2044, -79, 1149, 499, 625, -948, -2382, 1046, 2951, -1015, -1960, 1048, 95, -1086, 1537, 925, -1615, -206, 220, -775, 1840, 1671, -3144, -1790, 3037, 852, -1739, 648, -157, -1809, 1378, 1555, -1602, 258, 868, -2579, 298, 3994, -1105, -3501, 1355, 1334, -1048, 1362]
1537A362j098l252L656J796m276J647K666m974K9O193k352m291L214J48k299M021
1553B190K7n713K540M044m454P4M759m259l200N986J35m110K985k97m481M668
1569H94L489o632k38N395l700j717O047k337n243M687J355m342L811J499p222
1584d254K156O872m891k899N556k620l732O421K91o347L434K443n780L223N408
1599E281p363k330P679k053m170N587j354o033N635L084o811K113M377o804K05
1614b957Q318m463n527O395l72m923N959R74q130L523N534o465L38O538o192l709
1630e159Q704p88o536M995P70o550N313M592q446K60O983n454k101Q274l434p021
1646e598O765K037o401M155K648q250K513P758o503k858P481l758n027Q360M17
$$ y = [1362, 264, -2988, 668, 2464, -1812, -165, 2501, -2473, -2444, 3749, 1397, -2894, 320, 468, -1831, 2190, 2217, -3496, -956, 3088, -1366, -1292, 3467, -792, -3992, 1994, 2129, -1981, 1004, 707, -3774, 894, 4383, -2249, -2487, 2908, -792, -2509, 3538, 1201, -4042, 645, 2000, -2342, 1469, 2968, -4254, -2098, 4774, -117, -3016, 2540, -80, -3812, 2609, 2900, -3447, -13, 2430, -3350, -127, 5281, -2082, -4412, 3267, 1214, -2956, 2631, 1277, -4756, 879, 3963, -2848, -735, 3642, -3162, -2957, 5361, 898, -4629, 1766, 1394, -3529, 2430, 3404, -4726, -1203, 4331, -2134, -1796, 4742, -1450, -5159, 3545, 2757, -3779, 1216, 1986, -4564, 749, 5341, -3105, -2845, 4138, -1316, -3417, 4857, 1423, -5598, 1167, 3204, -3197, 958, 3606, -4644, -2131, 5627, -876, -3734, 3747, -11, -5038, 3322, 3739]
1661C739q222M164L512o608L218N657q233j682Q848l524m843P302j484p511O588
1676I21L743p721K129M619p133R20Q461n871n272P896q71o103O606J554q618L422
1692a318N630o487P05O217o831k967R458j809p091N717J279o906M863M586p956
1707b910L48O499n548j406Q205m328o827P592J953o886L855K828p493K412O794
1722E088o249k026P032m310m446Q609o7q358M290L678o161K800M733p488p09P904
1738D320m070m016P217j822p164O433L645p308J689M123o093J319P124n967m166
1753d736P627j259n690O177J445p861K990N123n515N88N076o236j956Q639k299
1768B113o524N661J174o307M244L988o864L99N415m878p46P101m448n873P323
$$ y = [3739, -4483, -319, 3193, -3415, -197, 5460, -2773, -4455, 4393, 869, -3974, 3328, 1844, -5667, 921, 4664, -3057, -928, 3691, -3442, -2522, 5939, 68, -5204, 2692, 1821, -4282, 2324, 3878, -4740, -1318, 4312, -2175, -1470, 4747, -2084, -5051, 4407, 2598, -4493, 1224, 2503, -4403, 460, 5046, -2910, -2562, 3937, -1611, -3017, 5188, 860, -5967, 1625, 3578, -3308, 547, 3375, -4118, -1706, 5088, -1161, -3187, 3845, -465, -4911, 3698, 3631, -4727, -437, 3241, -2920, -120, 4613, -2875, -3584, 4320, 250, -3766, 3451, 1629, -5535, 898, 4543, -2765, -1076, 3047, -3046, -1727, 5397, -570, -4736, 2891, 1632, -4058, 2119, 3564, -4297, -1307, 3816, -1699, -1111, 3965, -2271, -4227, 4412, 2113, -4411, 1250, 2424, -3883, 361, 4349, -2515, -2116, 3299, -1579, -2325, 4776, 328, -5545, 1778]
1783A778J675o561L366K616o366K282N545n637j281O075m233l549P862l43p664
1798d435L812L606n134K153L595o375P6O732m082l363O578j700o360N517L464
1813D084o114Q93L241m484J481N417n545l060O927j300n272N341J599o551J910
1828a433M323l813M50L214n152o32P270k688n696N122J483n491K950L478m957
1843a572kL521l346L56N065m507m236O599J330n869K278K690m432J085L782l522
1859g80n22L642l599j716O329r27o308L031L552l688N42K460l549k0L927k730
1875c56j517M455k058m412M634K734m848j32K653k037O46K734l349j361M096j355
1891E27k903L949O48m898J331L536k113n28J423k517K48L902k029l005L229M90
$$ y = [1778, 3453, -3108, 258, 2874, -3492, -1210, 4335, -1302, -2583, 3492, -741, -4290, 3572, 3229, -4435, -623, 2983, -2151, 2, 3597, -2778, -2702, 4030, -52, -3415, 3163, 1463, -4897, 620, 4084, -2030, -1137, 2104, -2380, -899, 4518, -1027, -4087, 2840, 1540, -3732, 1609, 3208, -3343, -1433, 2890, -923, -473, 2741, -2411, -3043, 4227, 1539, -4157, 965, 2448, -3043, -93, 3385, -1572, -1574, 1947, -1399, -1043, 4022, -485, -4721, 1878, 3208, -2661, -383, 2307, -2125, -1040, 2742, -780, -1302, 2340, -1259, -2975, 3354, 2427, -3881, -850, 2702, -986, -444, 2016, -1533, -1553, 2374, -356, -1873, 2582, 524, -3888, 746, 3480, -1368, -1500, 1153, -884, -238, 2496, -853, -2214, 1882, 527, -2376, 1573, 2221, -2677, -1346, 2190, 77, -451, 972, -1545, -1297, 2605, 576, -2429, 800, 1290]
1907A290l367K187K314l280o07K257j144K89K079k815j813L918M79l248J322J323
1923A184k468N98K321j620p65J448j510k79L184j002l333J754J901j686J93R67
1939H87j723k9J892r38o41J595j242j714K510J278k458l54J133n11N68R20j684
1956e11n62J728m43q96J516r0k118O74J649m99m34n6r72P11J671j055j279J015
1974D9K20q38P99P07j159n01N81K06N23J49j436m58J674M01j110j03K83k60J61
1993a12N14q6l49l10k09O52Q59n87j214J82J026K93n23n05Q8K73MJ76K30m13n19
2014e30J24N85N61l14j142p6J237L20q48j56K18k78K82N19l95k53N9m72M56J193
2034A090q55j398Q55R08n07K5J10q41K81R54o01k16Q09r39p84J825M16j748O5
$$ y = [1290, -2077, 110, 2424, -856, -1463, 794, -350, -61, 2018, -797, -2610, 1308, 1787, -1461, -139, 1184, -1284, -686, 1635, 15, -750, 698, -812, -1091, 2093, 1091, -2242, -488, 1413, -273, -80, 887, -836, -865, 1027, 89, -552, 1043, -199, -1913, 597, 1875, -583, -937, 196, -315, 253, 1173, -511, -1073, 655, 212, -684, 832, 742, -1376, -702, 947, 448, 14, -42, -1014, -303, 1368, 313, -966, 49, 269, -569, 230, 937, -222, -723, -142, 64, 587, 736, -700, -1158, 516, 917, -193, -296, -13, -273, -112, 402, 316, -33, -343, -552, 100, 959, 372, -842, -660, 366, 659, 136, -369, -281, -8, -4, 172, 402, -11, -530, -406, 179, 740, 426, -716, -792, 445, 765, -83, -239, -21, -299, -17, 502, 107, -146, -87, -559, -103, 1090, 235, -1163, -308, 600, 93, 118, 228, -613, -332, 622, 21, -195, 614, -325, -1109, 716, 1132, -616, -551]
2053e51P69n41N38O92j477l22J635n81q66J540k82j947J174J438j390q5P28j302
2071h30L13J996j315j487J800K9j608J512Q37k273K80J711j246l5J579j807j025
2088a569K737j76k230J410P07k124J098J737k094m50J893j333n96K561j046k527
2104b002K265J125k423J015J342k463K38K554j678j127K314j066j911K844N10
2119A537l167J183J794k327N05K284k442j002L033r49j939K579j08l024K082J956
2135A995k996K60K285k385m08L240j686k268K889m5k652K387J189l534Q78K753
2151A902k441n41K839k009j762L473l03l058K333R55l251J622K508l257m50L092
2167A652j864j373L322j109k928K930R94l277J642J956l457L61L396k401j532
$$ y = [-551, 218, -323, 215, 907, -570, -892, 743, 162, -704, 836, 554, -1393, -219, 1219, -171, -256, 472, -830, -517, 1479, 164, -1323, 477, 506, -1102, 410, 1247, -1026, -746, 965, -281, -316, 1263, -544, -1569, 1168, 992, -1238, 172, 879, -1245, -147, 1590, -504, -954, 939, -394, -990, 1571, 525, -2002, 263, 1388, -1035, -20, 1322, -1141, -903, 1651, -27, -1154, 1160, 94, -1817, 1027, 1537, -1630, -447, 1347, -980, -475, 1809, -633, -1635, 1398, 449, -1490, 1089, 981, -2043, 39, 1995, -1001, -741, 1544, -841, -1249, 1991, 305, -1963, 926, 881, -1771, 616, 1805, -1729, -851, 1902, -539, -1080, 1759, -250, -2012, 1461, 1158, -1900, 433, 1388, -1863, -241, 2267, -990, -1440, 1652, -212, -1585, 1737, 628, -2300, 630, 1624, -1653, -11, 1945, -1512, -1151, 2245, -156, -1688]
2182a688L205j243k331L311K76l632J994J966l326P86L002l150j092L757j391
2197D44k338L205l34l301K751J663l710R29K708l081m01L670k050k356L432k99
2213I32k979K847R68l867J503K853l237k57L302k384j753L766o67l099K732Q13
2229A473l516J989K390l730K9L431k427j415L624j289k911L223O77l451K001J887
2245A985l692P00L415k911j325L628j533k448L557K3l638K362J794l527R77K916
2261B283l245q04L796j732k352L432l41l349K819J561l816J051K811l161l55L574
2277B172k152k177L544m10l114K866J046l820J476K847l276l23L356k293j695
2292a953L639q28l005K852Q21l517J843K373l538l0L365k312j378L408j276k654
$$ y = [-1688, 1517, 274, -2057, 1254, 1530, -2102, -108, 1858, -1468, -682, 2320, -830, -1922, 1835, 444, -1894, 1311, 977, -2324, 427, 2090, -1620, -691, 2017, -1064, -1465, 2205, 155, -2201, 1231, 932, -2047, 800, 1768, -2099, -596, 2257, -980, -1237, 2065, -319, -2072, 1694, 1027, -2072, 660, 1473, -2043, -54, 2336, -1394, -1365, 2066, -361, -1776, 1848, 559, -2352, 871, 1548, -1903, 98, 1985, -1707, -1007, 2408, -503, -1828, 1800, 267, -2181, 1376, 1399, -2239, 123, 1917, -1610, -633, 2283, -962, -1766, 2030, 298, -2054, 1378, 1037, -2312, 507, 2068, -1748, -697, 2114, -1047, -1402, 2172, 20, -2157, 1387, 977, -2137, 729, 1775, -2045, -569, 2278, -998, -1321, 2035, -258, -1953, 1686, 858, -2147, 705, 1526, -1991, -148, 2225, -1313, -1343, 2022, -290, -1668, 1740, 464, -2190]
2308b190L197M53l406K022J864l460O11L113k686j184L310j354k229L162j7l314
2324b108K281J639l342Q76K687k873o80L333j579k063L008k26k907K406J274l283
2340a557R71K468k775k81L022j942j704L075m60k623K401Q45l070J292K133k630
2356h35j56K632j979j158L009r76k368K563N57k891J499J780k695J41K370j854
2372c61q05K530j215j864K713J47k824J710J531k650M01K215j924o81K261j157
2388B7j361K419l33k470J916J331k644M36K112j873n23K107j113j139K081n40
2404D33j895K027P24k580P80J947j868m68J943j090r37J848o08j452J868K29k262
2421a361J226J536k020j98J848j070p95J618o34j176J693l9j828J347J057k073
$$ y = [-2190, 1007, 1460, -1946, 76, 1940, -1520, -909, 2204, -482, -1666, 1644, 290, -1939, 1223, 1206, -2108, 173, 1812, -1530, -654, 2033, -840, -1520, 1813, 234, -1829, 1179, 953, -1954, 452, 1726, -1557, -586, 1882, -893, -1174, 1848, -94, -1798, 1277, 817, -1806, 595, 1440, -1630, -338, 1795, -835, -991, 1641, -338, -1496, 1513, 537, -1831, 732, 1289, -1602, -103, 1677, -1018, -877, 1493, -361, -1166, 1364, 149, -1715, 998, 1145, -1679, 31, 1562, -1088, -687, 1528, -396, -1077, 1184, 27, -1334, 1085, 752, -1718, 198, 1529, -1115, -679, 1433, -440, -963, 1144, 31, -1108, 973, 433, -1462, 565, 1289, -1291, -511, 1436, -432, -900, 1043, -47, -984, 864, 256, -1196, 672, 901, -1361, -135, 1401, -619, -817, 1031, -39, -834, 784, 150, -1026, 667, 628, -1200, 147, 1204, -869]
2437h69K12J786j220p16J485n66q92J398j61j480J254P27j811M17J551j344o23
2454h52J524m72q99J150j90j128J158M29j497N13J199j276l63J438n68q60J074
2471C80p8r08R33J70j208N96Q76j123j54J137o01o08R38p4p72O71J41q85O05N68
2491F04r97K8R13n68m14P77j58o09N42J36o29L73L72p10J31O89m99l68O31j24
2511A20m12M06P8m07K09K77m13N6L77l45k10M36j1l52J73J39k61J53R8j73j4J71
2533I5j07q1J98Mk11K1J73l7j12L7M7n0jQ3q1n6J05Rj59J81R0l04K8L16j33k18
2559a63K60k0k04K17L6l13K07K13m43P9M57l75l00N57m1m31L70P1m69L59K53n70
$$ y = [-869, -657, 1129, -91, -807, 678, 112, -780, 618, 457, -1023, 231, 958, -853, -436, 1115, -229, -852, 672, 200, -699, 451, 261, -867, 291, 720, -777, -264, 935, -341, -704, 734, 166, -694, 380, 302, -606, 327, 497, -711, -115, 761, -362, -516, 621, 20, -588, 350, 276, -496, 175, 316, -569, 36, 604, -393, -365, 548, -20, -434, 343, 185, -424, 118, 254, -375, -2, 370, -340, -209, 480, -19, -387, 244, 120, -292, 114, 192, -215, -6, 271, -142, -86, 291, -54, -264, 172, 161, -191, -18, 121, -140, 13, 111, -62, -76, 95, -12, -93, 105, 109, -102, -81, 92, 55, -57, -20, 27, -23, -24, 59, -22, -78, 27, 36, -123, 58, 148, -156, -128, 188, 55, -163, 97, 77, -127, 90, 126, -187, 20, 233, -210, -131, 326, -49, -349, 208, 167, -264, 106, 177, -292, 67, 320, -250]
$$ [...]
8191d
##END NTUPLES=NMR FID
##END=
