##TITLE=1H_IVA0503-1
 CDCl3
 8 sc, 
 6.3.2024
##JCAMPDX= 6.0         $$ Bruker NMR JCAMP-DX V2.0
##DATA TYPE= NMR FID
##DATA CLASS= NTUPLES
##ORIGIN= UXNMR, Bruker Analytische Messtechnik GmbH
##OWNER= root
$$ XWIN-NMR		Version 3.5
$$ Wed Mar  6 13:42:40 2024 Russian Standard Time (UT+4h)  she@DPX200
##.OBSERVE FREQUENCY= 200.1313
##.OBSERVE NUCLEUS= ^1H
##.DELAY= (6, 6)
##.ACQUISITION MODE= SIMULTANEOUS
##.ACQUISITION SCHEME= undefined
##.AVERAGES= 8
##.DIGITISER RES= 18
##SPECTROMETER/DATA SYSTEM= spect
##.PULSE SEQUENCE= zg30
##.SOLVENT NAME= CDCl3
##.SHIFT REFERENCE= (INTERNAL, CDCl3, 0, 15.7039)
##AUDIT TRAIL= $$ (NUMBER, WHEN, WHO, WHERE, WHAT)
$$ ##TITLE= Audit trail, XWIN-NMR		Version 3.5
$$ ##JCAMPDX= 5.01
$$ ##ORIGIN= Bruker BioSpin GmbH
$$ ##OWNER= she
$$ F:/spectra/data/she/nmr/H-F/1/audita.txt
$$ ##AUDIT TRAIL=  $$ (NUMBER, WHEN, WHO, WHERE, WHAT)
(   1,<2024-03-06 13:41:38.65 +0400>,<she>,<DPX200>,
      <created by zg, POWCHK disabled, PULCHK disabled
       configuration hash MD5:
       00 E9 B6 7A A2 85 ED C7 34 08 36 98 17 FE 4E 26
       data hash MD5: 16K
       D9 C4 FA 24 DA 71 E1 D2 CA 0E 4C 7F 12 26 A6 63>)
$$ ##END=
$$ 
$$ hash MD5
$$ C8 64 E2 23 D7 8D 48 C0 44 72 75 8E F3 75 92 62
##$RELAX= 
##$RELAX= 
##$RELAX= 
##$RELAX= 
##$RELAX= 
##$RELAX= 
$$ Bruker specific parameters
$$ --------------------------
##$DU= <F:/spectra>
##$EXPNO= 1
##$NAME= <H-F>
##$PROCNO= 1
##$TYPE= <nmr>
##$USER= <she>
##$AMP= (0..31)
100 100 100 100 100 100 100 100 100 100 100 100 100 100 100 100 100 100 
100 100 100 100 100 100 100 100 100 100 100 100 100 100 
##$AQSEQ= 0
##$AQ_mod= 1
##$AUNM= <au_zg>
##$AUTOPOS= <>
##$BF1= 200.13
##$BF2= 200.13
##$BF3= 200.13
##$BF4= 200.13
##$BF5= 200.13
##$BF6= 200.13
##$BF7= 200.13
##$BF8= 200.13
##$BYTORDA= 1
##$CFDGTYP= 0
##$CFRGTYP= 5
##$CHEMSTR= <none>
##$CNST= (0..31)
1 1 145 1 1 1 1 1 1 1 1 1 1 1 1 1 1 1 1 1 1 1 1 1 1 1 1 1 1 1 1 1 
##$CPDPRG= <>
##$CPDPRG1= <>
##$CPDPRG2= <>
##$CPDPRG3= <>
##$CPDPRG4= <mlev>
##$CPDPRG5= <mlev>
##$CPDPRG6= <mlev>
##$CPDPRG7= <mlev>
##$CPDPRG8= <mlev>
##$CPDPRGB= <>
##$CPDPRGT= <>
##$D= (0..31)
0 1.2 0 0 0 0 0 0 0 0.06 0 0.03 0 0 0 0 0.0002 0 0 0 0 0 0 0 0 0 0 0 0 
0 0 0 
##$DATE= 1709718098
##$DBL= (0..7)
120 120 120 120 120 120 120 120 
##$DBP= (0..7)
150 150 150 150 150 150 150 150 
##$DBP07= 0
##$DBPNAM0= <>
##$DBPNAM1= <>
##$DBPNAM2= <>
##$DBPNAM3= <>
##$DBPNAM4= <>
##$DBPNAM5= <>
##$DBPNAM6= <>
##$DBPNAM7= <>
##$DBPOAL= (0..7)
0.5 0.5 0.5 0.5 0.5 0.5 0.5 0.5 
##$DBPOFFS= (0..7)
0 0 0 0 0 0 0 0 
##$DE= 6
##$DECBNUC= <off>
##$DECIM= 32
##$DECNUC= <off>
##$DECSTAT= 4
##$DIGMOD= 1
##$DIGTYP= 9
##$DL= (0..7)
0 120 120 120 120 120 120 120 
##$DP= (0..7)
150 150 150 150 150 150 150 150 
##$DP07= 0
##$DPNAME0= <>
##$DPNAME1= <>
##$DPNAME2= <>
##$DPNAME3= <>
##$DPNAME4= <>
##$DPNAME5= <>
##$DPNAME6= <>
##$DPNAME7= <>
##$DPOAL= (0..7)
0.5 0.5 0.5 0.5 0.5 0.5 0.5 0.5 
##$DPOFFS= (0..7)
0 0 0 0 0 0 0 0 
##$DQDMODE= 0
##$DR= 18
##$DS= 0
##$DSLIST= <SSSSSSSSSSSSSSS>
$$ [...]
##$SUBNAM2= <"">
##$SUBNAM3= <"">
##$SUBNAM4= <"">
##$SUBNAM5= <"">
##$SUBNAM6= <"">
##$SUBNAM7= <"">
##$SUBNAM8= <"">
##$SUBNAM9= <"">
##$SW= 18.0517328524113
##$SWIBOX= (0..15)
0 0 2 0 0 0 0 0 0 0 0 0 0 0 0 0 
##$SW_h= 3612.71676300578
##$TD= 16384
##$TD0= 1
##$TE= 0
##$TE2= 300
##$TE3= 300
##$TEG= 300
##$TL= (0..7)
0 120 120 120 120 120 120 120 
##$TP= (0..7)
150 150 150 150 150 150 150 150 
##$TP07= 0
##$TPNAME0= <>
##$TPNAME1= <>
##$TPNAME2= <>
##$TPNAME3= <>
##$TPNAME4= <>
##$TPNAME5= <>
##$TPNAME6= <>
##$TPNAME7= <>
##$TPOAL= (0..7)
0.5 0.5 0.5 0.5 0.5 0.5 0.5 0.5 
##$TPOFFS= (0..7)
0 0 0 0 0 0 0 0 
##$TUNHIN= 0
##$TUNHOUT= 0
##$TUNXOUT= 0
##$USERA1= <user>
##$USERA2= <user>
##$USERA3= <user>
##$USERA4= <user>
##$USERA5= <user>
##$V9= 5
##$VALIST= <valist>
##$VCLIST= <CCCCCCCCCCCCCCC>
##$VD= 0
##$VDLIST= <DDDDDDDDDDDDDDD>
##$VPLIST= <PPPPPPPPPPPPPPP>
##$VTLIST= <TTTTTTTTTTTTTTT>
##$WBST= 1024
##$WBSW= 4
##$XGAIN= (0..3)
0 0 0 0 
##$XL= 0
##$YL= 0
##$YMAX_a= 91192
##$YMIN_a= -99516
##$ZGOPTNS= <>
##$ZL1= 120
##$ZL2= 120
##$ZL3= 120
##$ZL4= 120
##$ABSF1= 10
##$ABSF2= 0
##$ABSG= 5
##$ABSL= 3
##$ALPHA= 0
##$AQORDER= 0
##$ASSFAC= 0
##$ASSFACI= 0
##$ASSFACX= 0
##$ASSWID= 0
##$AUNMP= <proc_1d>
##$AZFE= 0.1
##$AZFW= 0.1
##$BCFW= 1
##$BC_mod= 2
##$BYTORDP= 1
##$COROFFS= 0
##$CY= 11.3945322036743
##$DATMOD= 1
##$DC= 2
##$DFILT= <>
##$DTYPP= 0
##$F1P= 15.7292609196834
##$F2P= 12.9074282941183
##$FCOR= 0.5
##$FTSIZE= 0
##$FT_mod= 4
##$GAMMA= 1
##$GB= 0.15
##$INTBC= 1
##$INTSCL= 1
##$ISEN= 128
##$LB= 0.24
##$LEV0= 0
##$LPBIN= 0
##$MAXI= 10000
##$MC2= 0
##$MEAN= 0
##$ME_mod= 0
##$MI= 1.114404
##$NCOEF= 0
##$NC_proc= 0
##$NLEV= 6
##$NOISF1= 3.799351
##$NOISF2= 2.8
##$NSP= 1
##$NTH_PI= 0
##$NZP= 0
##$OFFSET= 15.70392
##$PC= 1
##$PHC0= -24853.3
##$PHC1= 11.58731
##$PH_mod= 1
##$PKNL= yes
##$PPARMOD= 0
##$PSCAL= 0
##$PSIGN= 0
##$REVERSE= no
##$SF= 200.130013532006
##$SI= 16384
##$SIGF1= 3
##$SIGF2= 2
##$SINO= 400
##$SIOLD= 16384
##$SREGLST= <1H.CDCl3>
##$SSB= 0
##$STSI= 0
##$STSR= 0
##$SW_p= 3612.71676300578
##$SYMM= 0
##$S_DEV= 0
##$TDeff= 0
##$TDoff= 0
##$TI= <>
##$TILT= no
##$TM1= 0
##$TM2= 0
##$TOPLEV= 0
##$USERP1= <user>
##$USERP2= <user>
##$USERP3= <user>
##$USERP4= <user>
##$USERP5= <user>
##$WDW= 1
##$XDIM= 8192
##$YMAX_p= 0
##$YMIN_p= 0
$$ End of Bruker specific parameters
$$ ---------------------------------
##NTUPLES= NMR FID
##VAR_NAME=  TIME,          FID/REAL,        FID/IMAG
##SYMBOL=    X,             R,               I
##VAR_TYPE=  INDEPENDENT,   DEPENDENT,       DEPENDENT
##VAR_FORM=  AFFN,          ASDF,            ASDF
##VAR_DIM=   8192,          8192,            8192
##UNITS=     SECONDS,       ARBITRARY UNITS, ARBITRARY UNITS
##FACTOR=    0.0002768,     1,               1
##FIRST=     0,             0,               0
##LAST=      2.2672688,     0,               0
##MIN=       0,             -99516,          0
##MAX=       2.2672688,     91192,           0
$$ Real data points
##PAGE= N=1
##DATA TABLE= (X++(R..R)), XYDATA
$$ [...]
1588b258M723k701k518N311n00n330L130K456m355J951L514n642j034O591j930
1603A408m431M133L26m615L754K991n778K00M892l726j434N839k720n321N456
1618I74K210n489K035K889n383J011O009m331l581N858r79m907N424J949p376
1633c687J822N648m687j048N466m182l705P284K03o964L637L436o204J460O163
1648D642n415l280O603j312m533N555L03p170L915N426o241j062N849l877k950
1663c547O822j026o384M406K660n869K639M594o636j286P337k532m487N282m72
1678A501n535M901L244o743P12N288m705j319O699l155n642N947J782n791L022
1693B06K886o342J258O528m634l537O124j339n044N642J957p194J825N218m870
$$ y = [-2258, 2465, -236, -2754, 2557, 2057, -3273, -143, 2313, -2042, -91, 3423, -2219, -3253, 3338, 1408, -3023, 1110, 1436, -3179, 575, 3566, -2212, -2012, 2880, -846, -2280, 3559, 839, -4482, 974, 3184, -2305, -270, 2619, -2764, -1753, 4256, -75, -3656, 2202, 1223, -3684, 1740, 3689, -3687, -1865, 3783, -904, -1952, 3514, -668, -4373, 2911, 3114, -3850, -213, 3223, -2981, -1521, 4642, -773, -4053, 2550, 1238, -3295, 2260, 2563, -4607, -692, 4734, -1507, -2569, 3280, -597, -3547, 3275, 2249, -4135, 271, 2931, -2938, -299, 4295, -2341, -3627, 3710, 1178, -3309, 1973, 1501, -4034, 867, 4111, -2632, -1920, 3368, -1337, -2656, 4043, 888, -4754, 1193, 2975, -2816, 206, 3092, -3250, -1992, 4536, -98, -3635, 2489, 1150, -3894, 1748, 3705, -3489, -1664, 3554, -1316]
1708a316n04N640m471l864P174L45o544L476L018n801J611N461n007k574N885
1723B529j867l837N704n8o842L697M760n482n12M704l849j860O089j739n141M633
1739I29J404n589L312M156o345j034O310k470l121M708j635m540N419K113o599
1754b982J593M792m971r88O299k962m696N153P53m677L832J809o623J903O281
1769D516m781l070N705j498m380N197J230o120K428L760n150P50N586m981l569
1784d377O832R1n457L254J748m960K521M125n335r92N587l050l297N979l11o213
1800c855L328L538m446Q02L226m692l06O187k841m772N085J090n402K952L566
1815C460n179l94M538k935j280M860k906m537N842K236o290J048M258l846o70
$$ y = [-1316, -1820, 3820, -651, -4515, 2659, 3004, -3540, -64, 2954, -2847, -1236, 4225, -782, -3356, 2529, 662, -3175, 2529, 2471, -4371, -674, 4086, -1396, -1908, 2796, -1053, -2913, 3176, 1437, -3704, 929, 2333, -3256, 56, 4212, -2133, -3167, 3143, 673, -2448, 2260, 625, -3915, 1504, 3617, -2982, -1389, 3403, -1568, -2556, 3743, 781, -3915, 1238, 1991, -2686, 1146, 2955, -3668, -1765, 4516, -265, -3335, 2370, 872, -3508, 1689, 2919, -3201, -773, 2987, -2163, -1413, 4173, -808, -4377, 2455, 2546, -2911, 343, 2091, -2869, -348, 3777, -1558, -2550, 3037, -13, -3310, 2669, 2358, -3855, -527, 3011, -1435, -633, 2593, -2099, -2405, 3782, 941, -3831, 1254, 2344, -3058, -106, 3460, -1719, -2113, 2425, -510, -1790, 3070, 164, -4373, 1469, 3705, -2585, -1537, 2721, -1125, -1795]
1830a795M662k718k897M471p31l970M528J655o524J204N749l246k717L706j231
1845A46k387M062j07m575K904K570m791P51M966l595l289M453N90l031K060N1
1861G78l266K829K662m477n58M332k128k633L986K23l934J783J789k397J364J620
1877A973l946N4M766j805l507K912R07l013J731J891l071N1K542k152m43L399
1893B289j953l297L354J952l248J66J721j891K59K532j916j650K664l60k302K385
1909G05J147l376K28K655j125p52J344j410p87K721j23k696J157J457j879K92
1925d42J926j636j072J742k37p77J457o62k049J720J679j899o49J381p15l14J582
1942A035p49j495J421L77j424J157Q66k097k27K095l62j035O47m18o97J626M04
$$ y = [-1795, 2867, 149, -2748, 1723, 992, -2978, 1550, 3205, -3319, -2115, 3634, 388, -2329, 1377, 146, -2241, 1821, 1714, -2861, 43, 2613, -2178, -1427, 3539, -56, -3345, 1108, 1698, -1333, 727, 778, -2488, 341, 3003, -1474, -2032, 2300, 172, -2461, 1525, 1748, -2186, -403, 1386, -1011, 353, 1973, -1973, -1919, 2847, 1042, -2465, 447, 1354, -1659, 72, 1963, -1108, -1057, 1485, -667, -1110, 2289, 336, -2961, 393, 2345, -903, -737, 984, -907, -648, 1884, -32, -1682, 982, 622, -1680, 705, 1852, -1524, -1296, 1359, 234, -518, 826, -584, -1371, 1350, 1227, -1469, -312, 1145, -734, -442, 1484, -152, -1224, 518, 281, -496, 961, 299, -1750, -30, 1649, -250, -899, 482, -233, -547, 1035, 286, -1209, 212, 589, -835, 322, 1188, -909, -1136, 959, 597, -438, 209, -209, -906, 720, 1124]
1959A124k015J84J441q87k75J288o86j171J015N08n22L59k13j122P34J437r38
1976B61j057O92K40k91M75p5p68L46L89l94L93L59j015l66J158L58p14l63Q7K14
1996g1N38k1q51j1O79k29j50M73k12o20J89N78J59l04n26j30O22N85m74p44K04
2017c16N77m0k28R2n9l13L2N23J61n49k65J11L28M93j70j047J61J065j66p02L66
2038E4J26o31L34P66o04m49N33l16q4J071m37j464Q82J110q98l22O68n34l01J074
2058E78j56j030O82K72j054P59J055j517n74J514j44p87P56k94j001J160P34j525
2076e72J10J235j117l36J711o14j517J220M94j191Q82N54j904L80J957j203j097
2093a008J656l42j498J657P07k164N38J509j632l1K053j502j570K387L29k165
$$ y = [1124, -891, -707, 734, -153, -428, 860, 174, -997, 18, 526, 4, 363, 150, -972, -238, 1199, 261, -796, -104, 136, -155, 320, 245, -523, -177, 212, -182, 211, 570, -445, -811, 347, 705, -9, -372, -285, -71, 467, 446, -405, -416, 263, 34, -116, 357, 145, -475, -286, 292, 451, 147, -379, -509, 113, 698, 224, -520, -316, 261, 221, -7, 85, 26, -287, -255, 268, 429, -120, -385, -274, 54, 547, 377, -670, -509, 556, 390, -312, 54, 180, -451, -117, 649, 45, -404, 129, -187, -271, 800, 363, -1101, -219, 891, -7, -329, 339, -195, -496, 578, 422, -608, 74, 346, -708, 51, 1106, -411, -985, 529, 385, -402, 354, 60, -941, 219, 953, -572, -462, 773, -344, -680, 1031, 417, -1100, 120, 614, -577, 305, 859, -1045, -665, 1292, 89, -1008, 648, 306, -1192, 465, 1172, -992, -454, 1055, -577, -608, 1445, -57, -1627, 760, 1089, -1076]
2109a076J033J117k117M07K166j724j172K314n40j840K140N57k693Q90K008j871
2125d01l80J975j368j194K434j04k383J487J109k268O93K060k198p66K459q77
2141B78j448K097k58k304J792J418k470J73K110j862p44K660r35k168K172M91
2157A002k337J458J411k755J44K721j618j446K468n19k211K261R41k859Q46K078
2173A585k361k49K755j680j914K804J66k572J652J193k688O27K468k141j035K669
2189A279r52j931K514K87k797J390J796k420J31K211j919r94K704o78k197K086
2205E10N78k562J323J843k588k06K577j542j237K592o94k399K293J045k817Q22
2221d62K071k410m12K874j430j972K611O8k583J943J354l034N18K682k141j098
$$ y = [-1076, -43, 1074, -1043, -636, 1530, -194, -1366, 948, 408, -1432, 708, 1265, -1428, -538, 1470, -401, -781, 1194, -174, -1368, 1066, 962, -1421, 66, 1175, -1093, -400, 1660, -538, -1304, 1155, 278, -1170, 927, 669, -1635, 157, 1575, -895, -722, 1388, -474, -1218, 1442, 507, -1661, 511, 1002, -1335, 123, 1534, -1221, -1077, 1644, 26, -1420, 1048, 529, -1682, 579, 1520, -1339, -493, 1585, -776, -1025, 1730, 50, -1864, 940, 1106, -1466, 186, 1379, -1309, -682, 1786, -355, -1390, 1279, 327, -1604, 910, 1197, -1600, -210, 1586, -834, -703, 1508, -411, -1405, 1299, 621, -1576, 510, 1088, -1474, -151, 1692, -896, -1102, 1475, -67, -1304, 1288, 594, -1805, 488, 1533, -1284, -462, 1609, -801, -1213, 1661, 231, -1741, 870, 938, -1645, 298, 1652, -1382, -864, 1818, -323, -1421]
2237a421K815r95k180K564N92k942J333J900k715N1K850k026j564K904l30k505
2253a669K119Q98k825J047K247k476o01K812j375j847K745nk799J812J436k722
2269a203O27K289k342q40L001j019k289K490M45k759J543J836k855J6K755j913
2285b18j333K956p15k627K380J128l020R55K250k547m82K959j473k018K791Q6
2301A072k802J911J554k998M29K607k112j032K730r52k106K436N16k740J272J841
2317A626k575j5K636j830j401K692m23k247K004P58k573R88J966k247m66K504
2333A397j329j530K429q2k439J695J203k430N49K017k004o15K451j000j730K123
2349G05K63k359J404J457k334J6K211j514j058K293o66j870J961N56k303R88J620
$$ y = [-1421, 1394, 399, -1781, 783, 1375, -1567, -234, 1666, -1049, -998, 1852, -174, -1738, 1166, 836, -1669, 450, 1348, -1477, -430, 1817, -659, -1260, 1552, 177, -1670, 1075, 1070, -1729, 83, 1519, -1203, -576, 1713, -629, -1469, 1532, 513, -1776, 714, 1159, -1600, -57, 1779, -1076, -1060, 1695, -218, -1551, 1405, 690, -1937, 443, 1571, -1449, -494, 1756, -791, -1273, 1686, 213, -1805, 986, 1072, -1730, 181, 1735, -1263, -834, 1773, -339, -1371, 1359, 407, -1699, 737, 1253, -1487, -215, 1626, -949, -964, 1672, -158, -1559, 1133, 710, -1537, 467, 1225, -1348, -360, 1606, -641, -1107, 1397, 68, -1462, 967, 885, -1554, 141, 1344, -1086, -537, 1480, -524, -1139, 1312, 312, -1418, 705, 968, -1391, 13, 1470, -864, -848, 1363, -151, -1209, 1084, 418, -1452, 509, 1065, -1238, -250, 1370]
2366A370k052k67K159j049j348J845q1j665J403O52k011P05J653j795m87K011
2382A043q04j373J619K18j598R59Q00j632M98J437j602n26K026o63j518J491L97
2399G72j619P74R37j483K15J348j280n54J859n70j627J445P16j702M82J167j309
2416d29p7J381r89p07J591l17j543J270Q48j703J29J412r77n24J290n71q50J306
2434E40k4j403R38Q67j456j6J369p52p68J142j65r02R15J68j202O97Q58j229j23
2453e46J224o40o99J042l9r49P37L90j060M76Q33j153k08J309n28r21J042J15
2471D25j016N98N67r75J09Q99p60l87J079k44r88Q11M60j008K38P33p85p1P74
2490D59m37m94P69kp91M34N57p38q4P21l86l48N92j51m30M62J52n60J97M01l85
$$ y = [1370, -682, -949, 1210, 161, -1187, 658, 577, -1088, 315, 967, -1044, -339, 1314, -481, -968, 1043, 239, -1134, 485, 703, -895, 64, 864, -768, -270, 1167, -435, -961, 1065, 402, -1116, 375, 772, -847, -73, 864, -619, -404, 944, -336, -890, 969, 399, -1228, 217, 933, -769, -287, 880, -429, -506, 875, -114, -821, 770, 453, -1090, 180, 1028, -675, -546, 866, -111, -635, 655, 84, -766, 540, 516, -887, 51, 918, -538, -554, 815, 63, -705, 437, 272, -630, 285, 453, -749, -52, 806, -423, -546, 678, 38, -661, 381, 342, -607, 130, 520, -540, -64, 769, -384, -592, 717, 189, -732, 310, 425, -591, 7, 574, -401, -292, 607, -153, -540, 539, 295, -693, 118, 578, -430, -192, 541, -244, -315, 459, 22, -472, 297, 295, -496, -62, 495, -243, -327, 394, 8, -340, 252, 101, -329, 133, 285, -275, -78, 323, -62]
2511f2j49M04r6l14K92O1k85J69J23l25J34K74k73r9K77r1j43J63M2j74K3J41
2533I2j64L8J50j59j18K15R7k23J1J35p8j01J34O1j40M2J01j28k6K42j69k11K93
2556I4J11l04l4K94q5k40K43L4l11K01K08l66M3M06l61j98M92n7m99K99K82m18
2578a66N1L91l42k06N57j95m93N36J89o62K17N24m91j66N01k07k63M46l3n39M29
2599G8L23o75R1O01m55l05N92j52l63M16j2n22M65L09p09J31O38n09l14O84j54
2620A58n59N98O0o64M50L92q14Q2Q54n72m97Q02kp30N66K80p91L20O25q12j31
2641c85J000n25p10R32Q9r03M79M85q01J70P00p39k57R96l90p87R13K01j005M50
2661h7O35q44Q4P24p08k57J009l94q42R27K36j025M31P08r20pR06p29l76J129
$$ y = [-62, -211, 193, 97, -217, 75, 136, -149, 20, 143, -182, -48, 226, -47, -146, 131, 40, -103, 60, 102, -72, -49, 92, -72, -34, 116, -43, -161, 54, 151, -72, -61, 74, -4, -105, 29, 90, -50, -8, 93, -35, -61, 181, 12, -199, 94, 205, -99, -133, 161, 76, -164, 79, 113, -198, 3, 211, -155, -112, 294, -67, -265, 227, 170, -329, -30, 252, -166, -115, 276, -66, -272, 285, 90, -403, 133, 322, -340, -123, 401, -90, -256, 245, 38, -225, 221, 188, -351, 78, 401, -274, -183, 418, -37, -342, 250, 98, -265, 151, 139, -383, 82, 391, -318, -187, 451, -58, -372, 312, 158, -401, 197, 257, -407, 43, 435, -379, -297, 557, -15, -512, 290, 288, -442, 124, 404, -387, -67, 558, -254, -385, 615, 90, -620, 312, 401, -502, -23, 462, -339, -169, 531, -208, -465, 531, 141, -646, 267, 468, -537, -87, 548, -296, -212, 512, -196, -453, 556, 162, -680, 247, 483, -542, -111, 597, -323, -330, 576, -153, -529, 600]
2681F00l78r74J007L42j191M43Q65j036j50J161o78p05J184j28j182R73O07j380
2699f20K36J190j042l84J260m99r61J233J30j316P69Q21j336M5J298r10o52J299
2717E61k97j054J103K95j348O02R56j189j41J298p93p79J363j54j287J078N35
2734G49j454M68J136j197m05J406n73r57J288Pj348R44Q36j525J78J392j150o21
2752h26J562l78j249J193L45j427P28R94j482j21J597q75r99J491Kj437J004O78
2770H00j436L59J165j217l68J554o23j183J310L26j381O06Q32j266J01J270j015
2787a66n96J436m14j160J209L95j426M78J006j113q7J215q61p20J428j27j360
2804h63J000O25j426L61J198j148l66J274n77q41J318l2j456R07R16j372PJ261
$$ y = [600, 222, -752, 255, 597, -594, -151, 714, -322, -472, 689, 11, -694, 490, 362, -820, 153, 760, -620, -384, 806, -236, -620, 640, 141, -820, 413, 543, -773, -4, 817, -519, -474, 824, -86, -738, 561, 264, -790, 313, 608, -740, -138, 818, -371, -512, 786, -7, -786, 577, 423, -864, 214, 749, -705, -237, 899, -298, -703, 703, 130, -827, 461, 468, -880, 64, 900, -625, -447, 945, -205, -826, 736, 358, -891, 302, 647, -780, -52, 942, -540, -661, 936, 61, -938, 553, 555, -882, 122, 800, -636, -277, 888, -329, -697, 857, 234, -949, 361, 687, -694, -88, 744, -522, -421, 849, -166, -762, 674, 260, -900, 309, 704, -722, -244, 762, -351, -438, 777, -84, -804, 624, 497, -863, 137, 762, -664, -303, 895, -253, -619, 655, 78, -763, 555, 523, -933, -26, 890, -482, -475, 786]
2822G86r43n14J337m26j047J129K42j346O92R63j283j79J287n99p43J097j80j000
2840g27J014L93j320M28J005j125k16J242n55q05R75L7r36P81L87j215L60J095
2858H18r89m32J133m10p56J028L5j095P02N51j127L22J047j023n76J317k21r51
2876f27Q64J80j072O57P46j175j3J136p45n94J179j34j110P36N30r60L09P16j016
2895c93j24J231n81q27R98O7r45O15N35r78J20Q08o96k62J032m66q81R56L69j050
2915d72L23N70p62J18P99p38l81R75k21p98P98L29j036K51P86o30j64O93n93l81
2935e34J088j78j051O51N67q64O9Q00o08l90P34j53n23O99rr58O19P49q73k87
2955d52P70k22m33O11n4o28M55K29o55L20N82p19l30Q90k8o41L05J34l58L67J86
$$ y = [786, -157, -671, 666, 240, -807, 322, 564, -782, -90, 873, -410, -589, 698, 99, -644, 453, 273, -727, 287, 680, -640, -212, 793, -332, -548, 694, 139, -666, 309, 346, -590, 191, 578, -637, -277, 818, -171, -603, 530, 120, -636, 392, 427, -668, 34, 585, -542, -220, 827, -196, -772, 545, 324, -627, 237, 417, -655, 2, 748, -427, -440, 696, -49, -643, 536, 402, -708, 28, 558, -402, -93, 623, -393, -517, 714, 133, -694, 304, 371, -574, 41, 576, -402, -282, 526, -170, -432, 600, 134, -747, 209, 578, -472, -149, 421, -341, -223, 576, -162, -543, 432, 211, -587, 211, 540, -496, -245, 541, -89, -253, 440, -153, -534, 554, 376, -675, -24, 543, -321, -252, 548, -60, -450, 284, 131, -392, 307, 298, -660, -41, 708, -165, -452, 318, 96, -337, 274, 220, -408, 47, 276, -379, -59, 523, -196, -526, 364, 336, -305, 0, 134, -224, 143, 329]
2976C29o01J06N47m12l03O15o3o40L38L78l79N7J27m07K37N23m46m32N66P2m35
2997b23K29K05l76K5L32k24m0L31l51k78N85J32n72K0L39j31k7J93k30j37L10
3018A12nk41K27J11m11K4M60r6k83NL4P6J42r3k66J16K11j23o8J34o3j57R8J74
3042A18j8q2j80M3K65L4k33r0R4J70l5r7l8K2J8J3M9P1j56j27J13J71J3j70j48
3067a80J29K05k3j81k5K2K9R1m0l8l8o0LK13O5k93q6K27R3m4l0j68j5K58P1k61
3093g6J7J38j76jL23j24l03J29J48m7J11m8l56J39L92j12k76J11L2j44K23P9l25
3116a46K4J89j19L8K22k56k74L94J13k43P7m5k04K89K49l82r3K88j60j01L87r4
3138A53m22K28K52k64J12J69n01L8N87j77m55L08N4k92L36K12n62J1M75k90j72
$$ y = [329, -272, -166, 381, -31, -334, 281, 218, -422, -84, 294, -85, -28, 99, -308, -71, 452, 6, -426, 140, 212, -223, 6, 211, -165, -140, 192, -32, -72, 259, -92, -370, 215, 347, -225, -205, 134, 3, -24, 169, -61, -198, 112, 107, -134, 93, 204, -207, -183, 277, 181, -102, -97, -63, 13, 155, 62, -204, -88, 123, 0, -68, 66, 3, -154, -56, 118, 100, 18, -162, -119, 146, 180, -53, -143, -49, 121, 86, -11, -49, -27, -9, 4, 53, 124, -32, -159, -46, 125, 138, -32, -180, -51, 154, 131, -50, -75, -53, -24, 67, 27, -11, -49, -109, -106, 107, 172, -121, -207, 20, 113, 69, 39, -129, -144, 114, 185, -76, -59, 79, -97, -98, 225, 101, -202, -73, 75, 28, 139, 91, -265, -126, 266, 154, -122, -11, 21, -123, 100, 179, -146, -122, 67, -52, -14, 208, -48, -322, 72, 185, -58, 19, -26, -230, 59, 308, -74, -167, 121, -39, -140, 247, 153, -269, -41, 211, -53, 59, 228, -273, -235, 352, 175, -280, 28, 82, -210, 126, 338, -224, -213, 262, -28, -200]
3159b00N54k65n85N71L32n75N8K98m48J21N84m20m61O02M1n21M09K87p05O3O48
3180C88l39k25M55l65l25P76L2q04K55M76m83J4N81n08l36O63p8m82N61pq33N09
3202g5P08p44k75O50l35k32P18k25p36N69L85p45K13O72q01k86R84j59o38M89
3222A37N1o33O05M21r54l3R06m60m48P98j49q03O16M03p33K32L93p11O2R32n31
3243A01o92P31J37o10M49K91q13J55P19n64j96P04m42n52Q52K09q42K16M48n61
3263b60J76O41o96l78Q66j09o49O54J13q81L92O85o44j74N95m79k42Q84k07q88
3283f01N57M40o73J57N77p28j84Q58k39n51O06m6p23O16N31q42j32P05l59k35
3303b66O88l31o27O73K79p23K66M35p22P2P51m12m54N70j40m26O47R7q72K59O88
$$ y = [-200, 354, 89, -496, 75, 407, -168, -110, 188, -260, -139, 445, 25, -436, 166, 207, -314, 95, 382, -323, -260, 388, 49, -176, 279, -86, -411, 365, 397, -407, -152, 324, -159, -145, 436, -72, -408, 255, 177, -305, 256, 249, -584, -75, 633, -111, -386, 264, -71, -303, 415, 190, -546, 23, 408, -337, -124, 548, -253, -539, 445, 286, -352, 137, 188, -445, 160, 581, -373, -406, 500, 40, -408, 390, 241, -562, 54, 457, -276, -44, 349, -362, -300, 632, 101, -591, 140, 277, -333, 116, 407, -406, -251, 468, -96, -292, 412, -30, -582, 270, 479, -363, -147, 301, -260, -84, 557, -139, -517, 349, 240, -409, 245, 358, -523, -131, 554, -90, -264, 331, -148, -390, 494, 287, -601, -44, 396, -277, -120, 457, -271, -455, 403, 164, -387, 219, 173, -550, 66, 597, -245, -377, 328, -31, -266, 422, 91, -536, 137, 416, -307, -41, 394, -328, -256, 495, 83, -371, 199, 59, -367, 280, 377, -495, -236, 452]
3324D52n45j06N88m78m04Q08j3o76M46K02p25L87O85p67l63Q00j78m14O05r2p77
3345e65N98N10q02M7O94o21k99R21j53p89M85K37n83M24L66q34n2R16m02n12O69
3366B55j08o35N92L76p38R8M74n64K0P89n23o26P51K03o59L59K48p06K46O50n51
3387d9k93O66l19m64P62J26q77K42N99n01kN49o07l15Q87j23p02N26J94p37L46
3408i2O43o78k56O10k06l24O33j23p81N21N09o34j5N19m93j60O70j54n22L90J16
3429A73m77L70L85o78j41O63j46l54L72j05m06M62K15n21R5L36m20K8N42k91m74
3450c72M33J49l60K49J06n49J79N30l80k19L90j82k74M75J32n40Q5L30k72M8L59
3471C17l91k44M82O0l76J93J00l84K21L30l25j82K85m8j56L22n3m01J56K92k33
$$ y = [452, -93, -199, 389, -89, -493, 315, 302, -374, 72, 274, -451, -64, 621, -146, -509, 291, 113, -301, 304, 212, -565, 33, 543, -259, -212, 482, -139, -438, 483, 330, -459, 26, 263, -320, 104, 470, -364, -416, 500, 98, -414, 255, 147, -488, 104, 480, -258, -160, 314, -250, -230, 559, 36, -590, 161, 364, -295, 64, 312, -394, -148, 502, -49, -342, 324, 5, -459, 303, 429, -448, -206, 393, -108, -110, 439, -168, -483, 404, 281, -421, 105, 299, -438, -92, 551, -127, -383, 227, 21, -303, 330, 207, -574, -53, 456, -178, -193, 326, -167, -327, 343, 189, -333, 57, 173, -304, 66, 451, -227, -368, 295, 149, -205, 167, 62, -344, 118, 333, -188, -93, 243, -177, -149, 393, 102, -372, 61, 210, -150, 99, 205, -344, -165, 365, -15, -234, 156, -26, -300, 175, 307, -233, -148, 182, -90, -42, 317, -74, -318, 164, 224, -152, 41, 141, -243, -22, 308, -17, -199, 86, 38, -118, 204, 151, -250, -94, 198, -35]
3492c5J9J37k81LL58n6l05J50M7j42J70J06k99n3K60p2k4J64j75k16L01J36k47
3515e4J6O8j53J43J81k19j62K21Qj22K12nl26P6K76j35p0R9j89KL14m3k77L6J80
3540G7j24O3J27j79j48K33K5p6P8q5j78J93J97j82j28R6J7k2J32r3j45J14Q9n5
3564B6M1j8j62L4J98l8q4n2pO1R2k0j49J7O8mQM9j19m8P0R3j8pr5l7J20J15q7
3593D7j23kJ31Jk7K4p4l5O6J03n8q8oMM9J05o2j75L8K04r4m5N1p1o9J86K0j42
3621d2j3P4r5Q3J83j85k27K36J01j74M5O3j91Q4K09j07j27J44r6r5K67L3l03L1
3645a02K60j48n1J74j84j09K71ok09J23L6k07J35K69k82j44K59m4j42K50o4l17
3667b32J98K61l11k7K75k51j26L99l8l76K21J19k70J45K98m56n3M65j76k44L41
$$ y = [-35, -16, 121, -160, -157, 201, 145, -160, -10, 37, -105, 65, 171, -128, -181, 79, 7, -17, 147, -28, -244, 57, 193, -54, -38, 30, -123, 20, 201, -18, -180, 41, 49, -73, 139, 134, -192, -116, 160, 25, -45, 54, -135, -133, 181, 138, -139, -103, 77, -47, 16, 143, -36, -184, 49, 74, -2, 76, -9, -187, 6, 203, 21, -107, -11, 6, -16, 116, 23, -122, -8, 81, 26, 67, 49, -113, -79, 119, 81, -3, -55, -62, -1, 91, 71, -78, -61, 7, 3, 11, 60, -59, -107, -37, 56, 38, 31, -64, -101, 19, 134, 47, -76, -78, 53, 54, 27, 51, -23, -58, 8, 111, 53, -35, -41, -37, 12, 117, 55, -120, -82, 122, 28, -17, 34, -37, -106, 80, 100, -42, -55, 19, -76, 7, 190, 5, -222, 14, 115, -59, -14, 49, -142, -58, 151, 44, -83, 61, -35, -130, 137, 170, -133, -102, 158, 10, -41, 133, -51, -160, 111, 105, -104, 19, 55, -152, -17, 252, -30, -174, 85, 41, -101, 149, 85, -232, -34, 227, -84, -111, 164, -87, -213, 186, 148, -228, -7, 112, -158, -13, 285, -171, -224, 241, 65, -179, 162]
3688A62Km25K90K82m32k7L49k26j52M54j67m39L71J96m04J14K67l62l2M36k05
3709E2k50K85j1k92L14J47m65O1L94k90p4L31k15k58M07K3l76K45J89m29J43M10
3731C41l83k07M21p3k89L66k6m42K51L39m44RL85l10k17M98n3m47L08J54l66J50
3753c5L20m57p3N07k02l32M31j3m27K91K67m12K7L06l17l9M36k19l74M16J01m02
3775b00K24K19m29O8L84l07j26M05k22k77M07J11n29K10L02l75L0L72l65j85N03
3796B20j16l85L96J06n28K65L55m40q7M35k12k55M90q2n26M06K57n30J52M23m57
3817a13j90N96j88l77M15L2m66L26L03n51KN47l40k75N24j44l96L70J60m62J83
3838d4L30m68rN17l02l73M89M8m47L33J57m89J99M12m36j31N19k94l63N38P1n37
$$ y = [162, 164, -261, 29, 311, -121, -148, 201, -25, -177, 277, 110, -329, 42, 238, -166, -52, 215, -147, -179, 257, 52, -198, 87, 76, -216, 98, 245, -220, -159, 235, -55, -129, 202, -13, -271, 136, 159, -217, 28, 217, -212, -69, 341, -42, -249, 172, 99, -190, 176, 150, -292, -41, 298, -146, -137, 248, -62, -279, 219, 166, -281, 27, 181, -185, -35, 285, -172, -245, 262, 60, -272, 159, 146, -281, 10, 277, -135, -108, 198, -119, -158, 278, 59, -315, 101, 202, -200, 24, 243, -186, -118, 266, -41, -167, 238, 16, -261, 146, 257, -272, -62, 240, -135, -105, 267, -98, -283, 220, 104, -281, 115, 221, -307, -42, 313, -127, -214, 221, 9, -246, 244, 162, -364, 42, 299, -231, -79, 344, -113, -303, 293, 105, -272, 143, 175, -291, 35, 338, -213, -211, 336, -4, -279, 245, 101, -295, 75, 235, -227, -44, 286, -182, -191, 326, 24, -349, 140, 188, -259, 74, 231, -258, -59, 353, -83, -214, 305, 11, -352, 186, 257, -280]
3860b80K61L02m57M5M80m06k40N73j44m83M84J42n81K36M17m90r6M59k29k94N50
3881B49o9n31L66K95n36P1M84m15j86N56j88l71L98O2m50K71L35n28j2N16k71
3902D6k91M65j04l93L60J41m38J83K66l89jM40k70l02M08Ql91L40J24m55J70L52
3924B69l84p7M06j88k99M27L7m36K57K03l61P5L41l33j60M33j04l57L66O9l82
3945a98J74K61l49k6L17j96j51L24m6l36K57J49l44J16K31l02j9L06j59j97K92
3966A04j8k89K60J10l20P7K66k29j02L10j77j56L05l1k76K05J31l00Q3K76k76
3987d7r5L05j04k52L03L3l18J35K25l14NK84k02j17K89m0k71K26R7k86R7K09k34
4010g2p7K80j14j76K37j1k62K40P6k38M0K53k05p8K45q3k01K28K6k29J68R2k60
$$ y = [-280, -19, 283, -174, -129, 351, -55, -295, 278, 134, -349, 135, 277, -304, -68, 349, -141, -237, 222, -7, -301, 249, 180, -351, 15, 310, -226, -155, 329, -86, -272, 284, 96, -275, 123, 185, -265, 6, 341, -187, -199, 317, 46, -245, 220, 116, -277, 83, 224, -214, -31, 235, -154, -155, 285, 15, -287, 121, 129, -262, 78, 202, -253, -83, 269, -115, -192, 214, 26, -273, 154, 191, -245, 12, 215, -146, -71, 270, -63, -223, 210, 106, -251, 115, 184, -198, -24, 237, -112, -138, 179, -17, -168, 156, 110, -226, 31, 180, -164, -48, 183, -119, -138, 168, 9, -188, 104, 86, -203, 57, 167, -153, -76, 190, -39, -141, 169, -8, -164, 141, 110, -166, 39, 170, -130, -47, 229, -47, -142, 163, 59, -193, 110, 143, -175, -40, 185, -129, -124, 160, -42, -159, 130, 90, -181, 45, 142, -144, -47, 162, -72, -149, 131, 17, -159, 78, 67, -195, 45, 121, -117, -77, 176, -29, -107, 138, 55, -146, 82, 108, -121, 47, 139, -121]
4033a21L0K57j63j37K28o5j65K01J6k00R5J25j77j3K28j61j31K38K5k71J53J11
4055A03k03Q0J44j69o2K26j11j36J79Q2k45N7J98j68n2J65p2j06J82n2j25J17
4077C2N2j30nJ25q3q7J33k1n6M5rn1R5K0j04J5M6k0l5O5j0l7L2ok0P7n2o1K4Q0
4107E4l2o5N0oK5pl6L0J3j3Kj1L4l0p5O8%Kl7qP6mr0J8N7n2N0J4n8L9M8q1oP4
4141D3j5j20Q3J01j07k7J20j21%J28o7j21J55Pj38N4J39j29q2J81k6j03Q8lj15
4166g5J01N4j60QJ63j10o5J53j2j55J13K9j08M5J12j81M6J55j19r9J88l8j06R8
4190C7L7j06M3P0j37L9J22j17o9J69pj80J19Q2j79P9J05j66k8J94j31j07K15r
4214G5k14J36J14j91L7J46j53k6J61n3j66J73P8k57J26J38j49m6J59q8j02K10
$$ y = [-121, -91, 166, 3, -134, 94, 29, -136, 65, 81, -119, -24, 101, -76, -89, 139, -22, -153, 85, 110, -161, -8, 103, -100, -20, 124, -45, -107, 119, 8, -128, 51, 133, -112, -55, 143, -25, -77, 88, 16, -90, 92, 40, -85, 32, 84, -46, -51, 74, -9, -96, 37, 16, -40, 5, -4, -55, 40, 60, -44, -29, 17, -3, -38, 27, 17, -20, 12, 6, -14, 63, 11, -50, -26, 54, 22, -43, 7, 1, 26, 19, -17, 13, 26, 13, 15, 4, 38, 8, -67, 1, 1, 3, -34, -42, 34, 30, -60, -42, 15, -37, 13, 27, -31, 8, 56, -25, -31, 43, 28, -92, -9, 92, -15, -42, 78, -43, -43, 85, 18, -103, 52, 59, -79, -25, 114, -15, -97, 84, 58, -45, 43, 40, -75, 26, 80, -80, -72, 91, -19, -84, 69, 57, -98, 15, 44, -64, -19, 93, -88, -42, 113, -6, -105, 83, 45, -61, 37, 74, -32, 11, 81, -56, -17, 105, -12, -81, 88, 81, -99, 20, 102, -77, 2, 107, -59, -87, 107, -24, -131, 84, 75, -139, -3, 111, -80, -43, 103, -50, -76, 85, 32, -134, 39, 117, -140, -14, 124, -25, -71, 88, 0, -102, 108]
4236A08m3k04K10N1k26Q5J42j68j3J70j42q1J93n2j62J89K7k15R6J70k12j9K21
4259A25j53j11K47l9k29J80J28l06J14K06k46k0K63j38j81K61J4k89K11J30l01
4280a34P0K48k27j05K98j05k13K18P3k97J47K24l01l8L19j89j67K96m2k81K81
4301G5O7l28J34K49l23n2L54j67k09K90Pk68K22J44l53N5L34l03j01L72j23k95
4323b19L18N1l37J71K34l76K4L71k58j67L33m9l46L23J09l76J32L02l18r8L59
4344A83j39k60L43K5l76K38K06l75K6L52k66j58L83p4l04K63J00l23J34K32l28
4365a18jL50k35k18L57m3l08K73J05k91O4K43k67m1L13j71k22K99L7l50K06K20
4387B02l28K8K87k59p7L52j48k71L34M8l71J85K30k95m3K94j53j56K98j10k30
$$ y = [108, 65, -139, 71, 122, -104, -19, 123, -45, -58, 112, -30, -111, 82, 30, -132, 57, 84, -131, -35, 135, -77, -96, 125, -28, -139, 108, 69, -160, 20, 148, -158, -44, 162, -84, -104, 159, 21, -160, 101, 115, -174, 37, 167, -134, -64, 184, -43, -148, 150, 45, -168, 50, 123, -174, -27, 197, -104, -142, 177, -12, -179, 117, 75, -206, 75, 142, -186, -52, 197, -126, -178, 176, 9, -200, 90, 97, -171, 51, 195, -158, -103, 231, -72, -173, 199, 76, -219, 99, 150, -187, -16, 218, -158, -134, 237, -21, -188, 145, 96, -250, 73, 182, -194, -62, 240, -78, -176, 183, 44, -216, 127, 152, -224, 14, 220, -155, -129, 223, -43, -201, 182, 108, -196, 67, 167, -156, -22, 210, -118, -119, 231, -4, -222, 135, 92, -216, 57, 162, -129, -65, 178, -89, -130, 183, 12, -210, 89, 126, -224, -18, 202, -126, -98, 189, -70, -147, 205, 57, -214, 120, 168, -203, -18, 212, -83, -126, 168, 15, -141, 157, 47, -183]
4408a83K67J05l62J18K52k69r6L26j25k06K66k6k38K08J20l19Q2K96k82r5L13
4429A52j05k15K50L3k66J87J29k83L6K87k56r5L11j08k38K62L1k57J71J36k86
4450a24M8K60j92j48K78m3k66K41J04l22J27J71k38k3L14k09j73K90Lk75K04J31
4472A58l00R0K06k13p2K78j22k41L33J4k93J86J25k35L4K16j86j17K76o0j98J70
4494D9P4k75J22K20k86J0K26j65j21K71p7k31J95J23k23J7K25k44l6K97j31k34
4516a94K52M9k84J87J72k68l1K73j64q9K36p6k18J63J58k48J6J92j43q7K46r6
4538D6j77K12j3j78J41J16k60M1K07j05j21J44l2r8J06L0j70J07J03j62K1J54
4560A12j17j01J16N9j11O6jj22J09J09j63k6J44m3j15J69Jj60M4Q5q6N8L1j52
$$ y = [-183, 84, 189, -173, -55, 197, -72, -168, 158, 33, -173, 93, 67, -171, 37, 157, -162, -80, 216, -66, -161, 152, 47, -168, 82, 115, -151, 36, 165, -118, -82, 205, -51, -146, 165, 57, -181, 81, 112, -145, 26, 162, -124, -76, 184, -8, -156, 122, 79, -187, 54, 158, -164, -37, 134, -104, -127, 187, -22, -195, 95, 98, -177, 27, 158, -142, -52, 154, -59, -131, 147, 25, -216, 117, 131, -162, 24, 149, -86, -52, 164, -22, -139, 137, 77, -121, 49, 123, -152, -30, 190, -96, -86, 140, -25, -146, 125, 48, -183, 12, 135, -88, -71, 154, -90, -126, 171, 40, -194, 58, 107, -177, 10, 182, -86, -117, 156, -8, -97, 139, 63, -155, 8, 166, -82, -66, 126, -17, -104, 142, 46, -131, 81, 68, -110, 31, 147, -113, -72, 135, 30, -91, 53, 21, -77, 29, 59, -111, -4, 99, -63, -42, 112, -5, -106, 10, 69, -42, 24, 23, -99, 10, 119, -44, -70, 74, 31, -84, 85, 86, -74, -30, 55, -31, 27, 58, -94]
4584i4RJ88l3j75J25M1j06L3N9p5LN5q7LJ18p8r5Q1R9n4o6L4J5K4J1k7k5O4m5
4613Bj0L6M4j00nM7J6jkr1O3P1n7n6N7J2n8N3J9m5Jj1n2R3J5n9m6Q8mm6RL0m5
4646c2L0N4p9K9L8p0K4P2k8p3M4J9J5Lo4m3O8K9k1k6mnK7M6k7n7M7m6J0P9l4o5
4678d0qR1k3l6K0l3jQ8m9n5M7M5p0J4J00q2m5N3J4K5kq0l0R8M8q4j8J8m2O0J4
4709C7k3%Kn9J6Q6n0j00M2P6qJl2l9L9R6q9n1J21m1j24J52M1j38mP9k6J5N8q7
4739a0q1J54L8j70N4J28j72NJ86j00j03R6%j05J64J0k26O1K14j46p9J59r8p6J98
4764A01k3j54P7P2j35N0J57j97p7K24j3j43R8Oj63J31J48k16j1J77j57m0K41p8
4788G5k22J63R1j68O1J49k27k2K82j35j88J99Mk08J64J60k73l5K64j59n6K10j00
$$ y = [-94, -85, 103, 70, -105, 20, 61, -45, -12, 47, -28, -25, 30, -57, -54, 64, -14, -109, -28, 71, 17, -49, -15, 0, 24, 35, 8, -17, 47, 2, -8, 28, 72, -28, -33, 14, 30, 29, 27, -64, -1, 70, 13, -43, 14, 26, -32, 21, 40, -5, -4, -15, -67, 26, 41, -18, -64, 24, 20, -26, -17, 13, -32, -2, 52, -27, 2, 40, -30, -6, 66, 38, -35, 9, 28, 43, 46, -18, -61, 7, 36, 15, -11, -15, -20, 7, 53, 26, -31, 16, -30, -20, 59, 25, -40, -48, 43, 20, -16, 4, -29, -30, 58, 9, -46, 1, 46, -24, -10, 90, 8, -37, 16, 30, 55, 53, -27, -57, 41, 89, 5, -13, 5, -37, 23, 37, 14, 14, 16, -43, -27, 59, 9, -91, -49, 27, 19, 20, -12, -51, -12, 84, -5, -56, 65, 24, -100, 52, 93, -45, -49, 30, 4, 19, 77, -10, -91, 63, 101, -69, -15, 113, -59, -54, 132, 32, -71, 25, 25, -80, 84, 94, -132, -71, 143, -3, -82, 77, -21, -97, 101, 78, -76, 1, 73, -62, -12, 145, -52, -129, 95, 82, -61, 37, 43, -120, 11, 159, -57, -68, 109, -48, -88, 153, 75, -147, 16, 107, -61, 0, 149, -78, -100, 182, 47, -141, 58, 62, -146, 18, 178, -95, -130, 134, -25, -81, 129, 29]
4811B9j95K04Q9k22M6J87k18pK58j48j57K12j4j84K03N5k67M0K63j52q7J78j15
4834bj48K49K5k60J32J17k11O1K16k08j42K55k8j83J81K4k47J66J86k30l4J95
4856A14j61q1K64o2k55J78J20j85Q0J06j86n5K72j06j74K22l3k13J76J45k50n1
4878a35K38j37o1J54m2k03K42L6k10R0J25k15J4K37j25j32J86m2j23K35k5k62
4900a55J13J80j59m3J78j52q9K36l3j72J33L5k22J36K11k73q4L01j25j20K01m7
4922E0k36K15J43k76N4J78k06q1L05j05k51K17N6j71J40J25l14K5L23j64j57J90
4944F0j1j96K08R4k79O6J95k11J4K53j96k02K85N0k33J14O9j95J00K17k48o9K66
4967A51j75j52K99L5l44J51J79k02L4J63k42n4L35j07k73K36J07k91J00K51k56
$$ y = [29, -166, 38, 127, -95, -49, 138, -80, -87, 171, 23, -134, 78, 64, -120, 83, 138, -129, -89, 174, 22, -65, 113, -2, -150, 99, 124, -136, -4, 113, -98, -37, 179, -29, -171, 84, 56, -127, 54, 78, -169, -3, 183, -47, -81, 114, -47, -128, 136, 74, -181, -3, 117, -68, 12, 118, -68, -123, 149, 43, -131, 91, 58, -155, 21, 166, -84, -135, 103, -34, -95, 59, 17, -186, 56, 92, -118, -28, 97, -118, -104, 133, 8, -124, 62, 20, -103, 132, 107, -155, -42, 138, -21, -64, 114, -38, -127, 109, 76, -96, 37, 72, -150, -14, 197, -76, -160, 141, 16, -104, 97, 50, -186, 29, 172, -104, -50, 128, -78, -159, 146, 41, -210, 7, 63, -108, 32, 157, -157, -132, 191, 27, -130, 60, 49, -147, 61, 155, -124, -58, 137, -74, -60, 193, -3, -205, 80, 130, -103, 11, 80, -115, -15, 202, -46, -115, 151, -24, -176, 123, 158, -186, -35, 144, -58, -24, 139, -103, -157, 178, 71, -202, 34, 141, -150, -50, 201, -55]
4988e5q6K56j13r3K07l7k79K09K09k84o9K63j49j15K58o7k06J97J6j89J39J64
5010A76k62p2K59n2j56J39j6j27J61M0k05O4J43j85PK37q6k22J61P8j18J07nk13
5034a47J33K03j97p9J47%j63J34O7j66K8J01j22M4J38j80j01K84j6k09N4J04j39
5057h2O7J17j38j9J08p2l0J16J1k17Q5J87j39o7J22r5mJ53j01q7J23lj12R6N6
5082G5j35jJ07k8l7M9p7o0J66J0j34M6N6r1K1R6r3k8P7ln2Q0j8j54J19J41j34
5109bn2R1o0KJ24n3j19N9N6r4M2R0j09o6J56kq1K5pl9Q4O4j84KJ12l8m0Q0k1q5
5139f5N5O3q3M8Jr2MJ43l2j37J05rk9O6J0p7RM2n5M5N8p8o7J17N2r7l8K7j4M7
5169A9M3o5n8R0Pq8M9N4j24PJ00J7p6lj7L3M7J0j10J7P6l6j2L4K3r3M3O4k3n3
$$ y = [-55, -141, 115, 2, -91, 116, 79, -200, 9, 218, -66, -135, 128, -21, -136, 122, 55, -151, 46, 62, -127, 12, 176, -86, -158, 101, 49, -107, 32, 16, -111, 50, 90, -115, -51, 92, -93, -86, 151, 65, -157, 4, 82, -36, 71, 66, -147, -14, 189, -8, -87, 60, 60, -103, 31, 98, -68, -40, 61, -61, -17, 121, -59, -160, 124, 108, -101, -47, 57, -82, -15, 102, -36, -55, 53, -19, -49, 67, 78, -139, -54, 133, -6, -73, 49, -46, -50, 103, 2, -85, 38, 35, -77, 19, 75, -60, -61, 46, 18, -19, 30, -47, -107, 59, 69, -65, -19, 37, -54, -33, 63, -30, -58, 19, 16, -36, 44, 26, -128, -9, 132, -2, -54, 37, -23, -21, 103, 50, -69, -10, 46, -48, -6, 84, -25, -91, 65, 63, -18, 7, 0, -39, 45, 109, -75, -73, 39, 1, -39, 41, 20, -65, -10, 53, -30, 18, 19, -73, -69, 74, 42, -95, 10, 1, -28, 38, 48, -29, -20, 22, -33, 12, 70, -8, -75, 42, 94, -3, -41, -14, -28, 19, 62, -3, -61, 29, 36, -52, -3, 51, -73, -66, 34, 51, -25, -28, -45, -12, 35, 45, -65, -48, 28, -8, -20, 14, 37, -56, -13, 51, 28, -25]
5199b5MqM3M7m5n4RO8k5n2L7J3m2J6O2j2q2K3oM3L5q1n6Q8L7n4kM3m2n8R8%n3
5232c1L4l3j7N8O5j17k9J05J6m7K2j1o9O8L9j02N6M9j11J7J19l8j17P3O3o5L4
5259C1J6j23L2J45j17q8J22Pj26J12P5j29k5J24m6m3Q1n5j02J37Q2j54j2J01p5
5284c0k7J35o2q2Q1j2m3N8O0j20k1J30n3l2M3m2o3J13J2j28O0O9r9MJ24p6r4J33
5312C8k5n6O0j9j02P5J21j53rJ32o7p6J33Mj26O8L4o2N1Q7j82j1J68l7j31J04
5338A9K2j17Q6N0j00J9Q5r1m0J75p3j84J32R1j27K6N2r1J6J30j22n1J24k9p3J22
5364E1%j15L4R8r6L4O4j34k7K26p9j88J66M2j71Q9R8j40j1J34r4j15K28n7j82
5389a45J42J38k07QJ70j81LJ99j08j59K11kj90J12J36j82l1J79r1j01J77m3k06
$$ y = [-25, -21, -29, 14, 61, 16, -38, -29, 39, 14, -38, -1, 12, -30, -14, 48, 36, -46, -23, -29, 14, 49, -32, -88, 0, 37, -17, -19, 24, -18, -76, 22, 22, -31, 3, -30, -47, 11, 76, -41, -70, 35, 51, 4, 26, 15, -54, 14, 53, -49, 7, 56, -55, -38, 81, 43, -74, -1, 62, -3, 31, 47, -76, -44, 101, -16, -104, 18, 25, -101, 11, 86, -43, -68, 56, 10, -33, 48, -7, -109, 28, 110, -44, -56, 45, -30, -57, 78, 16, -66, 15, 3, -40, 18, 78, -42, -63, 67, 14, -18, 25, -17, -80, 33, 45, -83, -23, 46, -53, -49, 75, -1, -95, 38, 13, -43, 17, -2, -104, -29, 92, -61, -70, 62, -5, -81, 52, 56, -70, -2, 32, -30, 21, 108, -74, -85, 83, 46, -85, 19, 41, -76, 10, 60, -40, -21, 64, -27, -67, 108, 35, -149, -17, 74, -53, -27, 25, -66, -50, 80, -42, -93, 31, 2, -71, 51, 51, -64, -30, 68, -28, 6, 70, -64, -91, 135, 56, -132, 34, 76, -95, -6, 92, -48, -59, 75, -19, -134, 94, 37, -145, -3, 135, -72, -64, 106, -75, -72, 127, 19, -140, 71, 69, -121, -9, 127, -55, -86, 93, 2, -99, 78, 35, -171]
5412a71K33M6k38J14J60j98k9J86o4j61J82nj30J05P5k45R4K28j91j29K26l6j84
5435a32J78J4j97J51J02k15M1K15j93j53L10Jk44J14J00j67Q4J18k09j3K55j29
5457C1j88K34M4k53J10J78k24jJ76j67o3K52o4k56K27R9k37P2J57j65o0J80r8
5480a6q1J78n0j85J75J58k89M5J67j30o8J75p7r3J56Lj53J43R3k36MK44j32j29
5504i8J79n3j11J47Jj88J48Q6j70k3K04j07j50J89Mj40P0N3j31O9J22j68o8K33
5528I8p0j47J62K1j10K1R4j19J5R0j11l0J91m0j80J49M4j34O7O3j39O3P8r4m6
5553f4J61q0j28J23M9j51N5O5q8kJ56j34m8J60j4j63J36P2j81L9J22j18k1J37
5577H3q1j08J91k7j97J44J29j91J1J33q3q8J71m3j31J13L6j48O3J25j43m6J75
$$ y = [-171, 62, 108, -130, -16, 144, -54, -83, 103, 39, -122, 60, 55, -75, 30, 105, -140, -46, 182, -9, -138, 88, 52, -132, 46, 60, -137, 14, 116, -99, -58, 157, -36, -189, 121, 122, -122, -8, 92, -75, 9, 127, -82, -95, 160, 31, -157, 77, 121, -132, -22, 156, -68, -69, 107, -60, -123, 129, 65, -191, 36, 135, -102, -30, 127, -38, -98, 82, -16, -97, 81, 31, -154, 21, 179, -110, -65, 102, -28, -96, 79, 2, -91, 65, 68, -85, 58, 151, -85, -81, 163, 31, -98, 81, 28, -83, 64, 65, -123, 25, 111, -59, -82, 122, 15, -135, 54, 58, -82, -12, 41, -90, -21, 101, -67, -135, 98, 28, -119, 43, 64, -46, -25, 69, -50, -35, 55, -56, -86, 105, 65, -115, 34, 78, -56, 11, 74, -65, -2, 76, -18, -64, 97, 17, -111, 12, 61, -90, -35, 30, -58, -60, 96, -38, -86, 74, 60, -103, 33, 105, -76, -37, 85, -33, -54, 83, 2, -106, 85, 58, -139, 5, 134, -57, -46, 87, 4, -84, 87, 44, -87, 26, 62, -86, -23, 102, -41, -87, 88]
5600H8p5q1R0Mj02J01L8j39N9Q3r2q1J89n5q2P8no0N4L3j16O4J43j53o5J52l5
5627C5j32J07Q0j45L0R0r5j2J40j00q1J47J5j74P8J04j19k8J22p6n9J26j6j40
5651a03J42K0j36L5J30j13l5Q0k3m2R1mn7J1P3r8M2K0k5l4M1K8o8L7K4r3J02o
5679C9k1k5R0j08K9j7Q6p0j33J79j18O1l3N0o9J04l1n0j5J4Jm7M4M8n1Q7m7J1
5707HlN7q5K9L9j54L6J76o4O8j18lo1N2M1m7J4O2m5n1K7M1k4q4J05m7O3m6O1o6
5737a9M1j7j1L4o9O9o2M1Kj8pL3k3K4Lk7l2P0j3l5jRlL9m2NL6k4l6K0K9j3n2M3
5771fJ4l2kK6n8N9L1o7J3N2j4m8M8L4m9l0O7Ko7O4k5n3P6%o7K4L5j3rL6m4l7P1
5804C1k0j6OK7p2M0K9k5l9L9k7nL6Pk5J5J0m5M7K9q2J6O8m7k6K7oj3P1l5n4O1
$$ y = [88, 13, -68, 22, 26, -76, 25, 63, -76, -17, 66, -26, -107, 82, 27, -55, 23, 18, -42, 12, 45, -71, -7, 136, -17, -82, 70, 35, -97, 10, 90, -55, -25, 65, -30, -42, 98, -2, -83, 64, 79, -95, -17, 87, -32, -60, 62, -14, -73, 53, 37, -103, 39, 59, -77, -42, 88, -25, -60, 20, -3, -45, 46, 42, -15, -4, 69, -29, 13, 33, 8, -26, 15, 43, -25, 12, 36, -57, 45, 39, 18, -7, 83, -25, 4, -13, 73, 3, -130, 49, -69, -8, -41, 9, -60, 44, 13, -37, -52, -38, -37, -84, -40, 8, -43, 44, -3, 8, 5, 62, -23, 6, 45, -109, -73, 103, 39, 107, -11, -14, -75, -23, 18, -29, -15, 47, 2, -49, -22, 19, -5, -89, 16, -31, 32, -14, 47, -19, 22, 5, -6, 28, -41, 28, -34, 7, 9, -9, -16, 17, -6, 18, 21, -6, -38, 32, 19, -16, -17, -8, -11, 28, -14, -9, 27, 3, -33, -13, 16, 3, -49, -6, 8, -24, -26, 0, -58, 1, 32, -35, -22, 30, 16, -32, 16, 50, 1, -29, 38, 40, -27, 37, 12, -41, 35, 35, -32, -8, 27, 14, 5, 41, -3, -40, 31, 11, -5, 1, 28, -44, -4, 25, 0, -39, 0, -27, -32, 4, 11, -14, 1, 11, -34, 13, 42, -40, -24, 44, -3, -29, -2, -8, -21, 50, 15, -39, 22]
5836B2K7q9j5J56j09m8R4j1r1P7K2r1M5Q8j32rR5k5o6N7O1j28M4R0j20jJ21o4
5864@p0J24K4j32L7Q2q7jJ15j21qJ02l3j21J04P4j46N4J03j23k7J22p5m3J22p2
5890Dr8J11N5j03rJ17j02m9J38m9j19J43lj22J00Q9j70NJ79j25r1J52j9j40J41
5915C5M3j40L1J47j54m8K04j04j14J34N2j51N6Q6j24j2J32m4j10J46j1j52J10
5938A2P0j63RJ38r1k7Q3jj21J31Rj08O3P6j08k4J27o5o3J26o2p2Q8K3j04M7R6
5965H9j38rJ26p5q4J55k1j42J08L9j04M8O9r6j6J03l1q9Q9L9j51R4P6j05k2J19
5991G1p6o7J39l9r7J23Qj04K5P4n6l5R2j6q6Q3l0o9J01k4j03P3N5p1lP0n2o0J14
6020D0k6q1R7j4r8R9N2j34KJ29p2n1R3j5r7R5M0j15L0J03j22l1J84o4j45J41%
$$ y = [22, 49, -40, -55, 101, -8, -56, 38, 27, -64, 13, 35, -56, -11, 77, -55, -64, 31, 6, -60, -3, 58, -70, -26, 64, -56, -57, 64, 0, -70, 54, 78, -54, -17, 65, -22, -23, 92, -29, -37, 65, 32, -89, 15, 89, -57, -3, 100, -23, -50, 72, -3, -46, 76, 4, -94, 17, 72, -31, -40, 77, -25, -74, 64, 15, -104, 39, 36, -86, 14, 103, -67, -62, 117, -8, -99, 53, 34, -106, 35, 78, -62, -31, 116, -38, -86, 118, 14, -100, 34, 86, -65, -9, 77, -47, -59, 73, 29, -81, 65, 54, -98, 12, 82, -81, -72, 66, -25, -52, 31, 30, -91, 40, 49, -59, 4, 80, -28, -52, 75, 10, -53, 73, 11, -61, 27, 50, -54, -7, 89, -49, -58, 68, -7, -91, 64, 43, -99, 9, 48, -56, -8, 61, -35, -51, 52, 21, -68, 21, 60, -91, 3, 79, -26, -48, 71, -5, -72, 67, 28, -69, 54, 62, -42, -17, 57, 1, -34, 58, 42, -44, 39, 9, -60, 41, 17, -86, -13, 42, -29, -32, 38, -14, -74, 40, 14, -67, 30, 16, -82, 17, 69, -65, -63, 66, -6, -57, 36, 21, -76, 19, 59, -56, -26, 77, -45, -76, 108, 44, -101, 40, 40]
6047D0r7O0M3j14L9J16q4q7J11lj03Q8Q1j43K5N5n6j2Q4p0o2J07L6j16N3P1j05
6074d3J2P3l9n5R4m2o4J19k7j03M0J02p5k5R4n0p4Q7J3j12P9O7j56O2J08q6r0
6101i1J48%j34P7L9r5J8J20j40qJ18l5r4R3N3j27K6R2r3L2N7r4l7R7L2j22O5O5
6129F2j02J0Q8p4nM8k0m1P7%j00L9R4q1n5R4n9MK8j9m5O8K2o9J7N7p7j9P8j4j9
6160a3L5k1l2O4Qr5K2R4o0k9O6oj9jK5n5M8pp0JQ6oq4J7R8r8nP0m8j3M2nk1J5
6194CJ4p6L3O9j7p0N3K1l3L8l8m5M3M6o2RL2j6rRJ5J9l7mJ4J5J3o6k8P1J1m5J0
6227hoj2K5j6jL7on5K1P3m1q1M5M1k9K4k5k0L9L3n9k2P6rq2P3M7m0n8ML5RQn5
6261c5KQ6J1q9rO3k4m1K8K9l8ooKP8l0j02L5R9l3m1Rk2M4L6o9kQ1l6o6N7M6o5
$$ y = [40, -57, 3, 46, -68, -29, 87, 3, -84, 27, 24, -79, 9, 90, -53, -28, 27, -29, -41, 43, -27, -89, 18, 54, -62, -9, 62, -43, -31, 42, 3, -52, 42, 0, -64, 55, 28, -75, -35, 67, -8, -33, 61, 11, -63, 24, 37, -75, 4, 71, -85, -23, 85, -1, -91, 57, 57, -77, 0, 39, -56, -38, 82, -58, -66, 52, 17, -77, 16, 69, -58, -32, 60, -33, -1, 56, -38, -75, 22, 54, -68, -3, 62, -40, -30, 58, -16, -21, 27, 7, -34, 43, 43, -57, -18, 76, -5, -60, 34, -25, -21, 7, -12, -57, 11, 33, -36, -19, 38, -39, -58, 20, 6, -13, 22, 1, -31, 33, 41, -54, -32, 62, 2, -27, 39, 33, 14, 13, 38, -17, 31, 24, -46, -45, 41, 35, -49, -32, 66, -32, -37, 33, -15, -28, 14, 9, -12, 3, 17, -59, -26, 43, 26, -44, 9, 30, -3, 35, -3, -48, -5, 41, -21, -12, 20, 4, -5, 4, 19, 38, 1, -3, 11, 26, 39, -27, -55, 16, 27, -18, -8, -14, -26, -1, -17, -18, 19, 13, -42, -21, 52, 11, -70, -25, 16, -13, 11, -14, -34, 5, 38, -21, -43, 33, 24, -58, 15, 62, 22, -36, -32, 3, 12, 20, -35, -33, 53, 64, -25, -34, 29, 5, -36, -8, 21, -17, -23, -29, -27, 51, 21, -81, -46, 53, 20, -21, -12, -34, 10, 46, -23, -25, 56, 20, -46, 11, 57, -8]
6294hp1J02MqL1p2l7J08K5j51M7J15j00m5J08K5j29O8%n9P2L8j32K1J53o7j27
6321h9O7R2j23L1R2r6rQ5j10K6J22o9j30R8J09j04k4K8j5J5N9l6n3R6l0j20J10
6348B2Q4j18o6J29l4m1M4n6l2J50j5j61O8J11j10m9J86j02q6P4Pm2R4L2j86M6
6374e1J92j40q9J27J0j10J23oj19N1R1j25K3J36r0j48J48Q7j51J7L8n3M2R9j24
6399b2n9J73m9j31J02O3j55K0R0j6j1J3o5NJ54o6j45P0J16j12J6L5o4OP7m6mR9
6427I4q2j12J16J18j60l6J15k3n5O5n4p3J62l0j15N3J19j61l2J43lj03K8j6J0
6452c2J14k6j62O6J31q1m9J00l0p5N6L1m6K6rj07J15J00j09r9J32l5l6O6m9r3
6478a01J23J0r0P8M8j24k2J66l4j13N2L0p5J12l3j18O0J15j12m1J45l3j29J01
$$ y = [-8, -79, 23, 27, 19, 50, -22, -59, 49, 74, -77, -30, 85, -15, -60, 48, 73, -56, 12, 12, -47, 25, 63, -69, -48, 105, 38, -89, -22, 70, -53, -22, 70, -26, -35, 50, -60, -34, 88, 19, -111, -13, 96, -8, -32, -4, -19, -4, 55, 19, -34, 62, 32, -88, 22, 106, -12, -78, 51, 17, -24, 20, -36, -68, 82, 67, -94, -26, 85, -25, -74, 112, 10, -76, -2, 5, -37, 57, 89, -97, -51, 141, 1, -88, 39, 49, -61, 62, 56, -63, -12, 79, -46, -23, 113, 23, -125, 23, 110, -41, -24, 14, -39, 3, 102, -22, -81, 92, 43, -88, 14, 77, -78, -58, 32, 16, 5, 18, -47, -42, 112, 46, -99, -29, 87, -25, -9, 26, -38, -32, 45, -1, -5, 94, 12, -100, 16, 134, -26, -62, 53, 30, -25, 40, -14, -87, 75, 45, -70, -17, 102, -59, -91, 52, 49, -54, -26, -42, -32, 82, 56, -106, -40, 91, 10, -39, 61, 31, -44, 12, 43, -3, 23, 14, -93, 22, 122, 13, -86, 46, 11, -25, 41, -8, -101, 22, 32, -58, 20, 68, -56, -78, 88, 54, -59, -7, 23, -52, 60, 27, -91, -31, 84, -28, -69, 76, 43, -86, 15]
6502A5O9r1j0M6r0M6J24j01j43J93J5j37N1P2j10OR6p4qO5n1o8J48K5j73J1J42
6529F8o4k3P6j00j1J25m0r4J05lj24N6J33j01p9R7nm1J06n1j29J07J01j38jR9
6555F9q0m9J13nj33O9Q6j36O4J10j52n8J77n0r4J00l3n7K9J02r8j3P5l3m6J04
6581F1rj36N1J12q3OL1o2J5P4l7l7J6M6o8J4Q5q0m4P1%m7M2m4k9N1O5o0k9K6l3
6612c2NO0j6q4O9j8rN1J0q5PQ9m8k0M4l5k9Q2L1q3l1P0l4RN0m4l1M3L8o0rK6j9
6645cj6L2M0j11N9Rk3M2j7n5PP9j0m2k5L3j0L2j1L0m0k9M9LRk7m0PM9J7k5k6l1
6678d4N9Rj9LPpK1j0jl6l0M1L5mk8n1K9L1Pk3K6l3L1%J9k4l5LqM1L8k8p9L8O2
6713D0l6k2K5Mj2L6Ok9J0Ql1K8L6p0n9P4M0m2j6j1J6POl5J7RJkL7rp5L0J9j3P
$$ y = [15, 84, -7, -17, 29, -61, -15, 109, 8, -135, 58, 73, -64, -13, 59, -51, -45, 51, -23, -31, 34, -17, -85, 63, 88, -85, -74, 68, 4, -19, 57, -43, -54, 71, 31, -63, 42, 39, -85, -29, 104, 3, -76, 21, 16, -25, 81, 30, -99, 8, 109, -29, -30, 69, -11, -60, 53, 48, -85, -16, 70, -66, -2, 108, -44, -102, 75, 25, -69, 31, -2, -59, -30, 72, -26, -39, 36, 3, -43, 61, 52, -84, -33, 79, -4, 2, 33, -29, -14, 60, 23, -14, 2, 48, -20, -6, 79, -1, -45, 26, 26, -21, 21, -23, -52, -1, 64, 4, -25, 1, -32, -27, 33, 17, -67, 2, -16, -25, 26, 36, -49, -42, 47, -1, -21, 23, -12, -41, 41, 72, -11, -42, 28, -6, 3, 53, 9, -22, 21, 59, -1, -10, 16, -3, -19, 13, 53, -58, 1, 10, -13, 29, 12, -43, -36, 43, 33, -9, -34, -1, -11, 21, 10, 40, 0, -29, 20, 23, 32, 5, -35, -28, 21, 38, 13, -13, -44, 15, 24, 5, 8, 15, 8, 29, 19, 18, -18, -48, -7, 28, 24, -4, -55, -26, 5, 12, -11, 15, -18, 13, 13, 32, 8, -27, -24, -32, 9, 47, 19, -60, -22, 40, 4, -18, 7, 11, -1, 35, 41, 12, 22, 30, -1, 27, 63, -7, -66, 8, 48, 6, -10, -21, -5, 2, 8, -27, -10, -1, 0, -2, 35, 26, -49, -19, 0, -13, -6]
6748fOm6M6M9m8m0L3M5o5N3L4q8RL9m0J1R3n9j13J30M5j05n1P3Ln4Q8l0q3O3O1
6779E3j08P0P1j28m5J16K3j09N7K3o7N1P5j28j7J52o2p7Q2J2j02O0M1l7kL6o8
6806b8pJ21m0j31Q0P9r0K4K0j03L9J02q5j6J00p3j07J48M5j31j0J17p4l2J14r8
6832c6p6J76j1j32Q8O1j32MJ51m2q9M8Oo0J17mj47M2J29q7r2J65o9p8J04K4j03
6859d3P4jj07N7J25j11j13J62J6q9ML4m2O6%q2M0M4o1o9J24M9j29L6N8n1K7M5
6887F3j25L8J49j15p6J16nj01M0Q8r6j0M2l8OJ39j31j18J67L5j36NJ18p5j2P2
6913D0l6l5Q7o2p8J40L1j79K5J44m6m0L1l0nO8m0p7J28j7j21N3R9r0k6N5k3k0
6941b4J04q9p6J24M8j46K1Q6r2OP9l6p6J24n4q0Q8P7j63J6J56p9q7J49p0o9J13
$$ y = [-6, 0, -46, 0, 49, 1, -39, -6, 39, -26, 27, 61, -27, -18, 21, -19, -8, 85, 26, -87, 43, 88, -17, -68, 5, 8, -46, 42, 12, -71, -8, 53, -55, 15, 86, -42, -87, 29, 52, -57, 0, 23, -44, 7, 82, -46, -63, 89, 27, -50, 32, 44, -58, 2, 43, 6, 4, 40, -28, -35, 86, 46, -85, -5, 74, -16, 8, 28, -75, -36, 66, -19, -35, 65, -8, -115, 33, 78, -53, -63, 54, -20, -52, 62, -36, -112, 64, 53, -79, 9, 70, -62, -58, 93, 51, -38, 10, 16, -44, 73, 69, -78, -36, 93, 6, -86, 79, 10, -68, 36, 60, -43, 31, 30, -77, -20, 105, -6, -119, 43, 59, -30, -26, 8, -34, 32, 32, -50, -10, 34, -27, -96, 28, 77, -52, -16, 42, -9, 18, 63, -62, -24, 125, 10, -66, 50, 45, -56, -16, 72, -24, -34, 8, -30, -24, 115, -16, -134, 33, 68, -68, -63, 55, -20, -32, 40, 4, -31, 56, -6, -84, 56, 87, -92, -67, 77, 31, -9, 22, -8, -13, 55, 15, -62, 66, 49, -72, -19, 80, -10, -36, 19, -4, -24, 80, -9, -85, 39, 87, -59, -38, 48, -44, -38, 41, 5, -71, 53, -1, -81, 7, 84, -79, -63, 93, 14, -73, 76, 6, -63, 50]
6968E0J7j36O7J02j62qJ97j16j56J99Oj30J03J6j40M5J57j44m9J48o8j10J46M1
6992G5j62N5J01j13K4J19j36n6J56j6j26R5M0j32O1J07j20j4J20m8j08J77k9j63
7016i3R3P6j25J6J14j04o1J96r8j16J32K0j43O8J48j76m0J63m7r0J11k0j03Q5
7040FQ9j83L7J27p9q3J49m7q9P8N2p1L2N4j49M7J07o4o7Q7ko2J4M2n9K1O3q2J9
7069a3P6p8p5J26K0q1K0L6o3K9N5r5pQ2m0o6J10j8p8Q4K6m4nN9q6j5R1k3o0N2
7099A9L0p5QO9m9m3O8k8l3O0j5o7P2K8q7J3M3k8j4K5ok4L4j3j0M0jq0N9N5r3K6
7131a7J2NrN0m5k0M7J8p0J9P3r1jN4k6j5L4k3n2R2L8j32K5J03j13k2J09j7r3P9
7161A2K7p2N1Rm7pQ9n7l9O8Jn2NM9l4mL8q8N3N9l0o4O5L5p0MJ0l2J4K0k6k2O7
$$ y = [50, 67, -69, -2, 100, -62, -70, 127, 11, -145, 54, 60, -70, 33, 49, -91, -46, 111, -33, -82, 66, -2, -112, 34, 75, -87, -32, 69, -44, -20, 99, -37, -93, 63, 47, -79, 16, 56, -76, -15, 92, -28, -42, 78, 30, -78, 99, 70, -93, 0, 76, -49, -33, 81, -23, -84, 112, 14, -102, 30, 50, -93, -25, 123, -53, -93, 70, 23, -67, 44, 24, -79, 6, 95, -88, -51, 76, -3, -86, 63, 16, -73, 5, 57, -14, 18, 72, -77, -30, 77, 13, -54, 33, 31, -31, -17, 25, -34, -13, 50, -32, -13, 63, -15, -90, 36, 56, -25, -5, 31, -32, -3, 52, -43, -50, 32, -8, -74, 36, 18, -60, 24, 50, 6, 1, 60, -26, -41, 50, 27, -33, 19, 49, -26, -18, 51, 2, -41, 27, -1, -34, 26, 11, -56, 16, 44, -43, -30, 13, -15, -29, -4, -10, -34, 0, -13, -23, 17, 16, -64, -5, 50, -43, -17, -5, 0, -9, 41, -4, -24, 23, 41, -29, -10, 63, -28, -29, 25, -1, -16, 18, -5, -57, 35, 73, -59, -34, 69, -44, -66, 43, 26, -67, 12, 39, -33, 18, 27, -20, -27, 62, 5, -34, 34, 35, -17, -12, 37, 3, -1, 37, -51, 2, 61, 31, -33, 32, 67, -3, 1, 11, -21, -7, 13, -13, -35, 32]
7194C2j4o1O6L3j03j0Q4k0j8J8Lm0N9k8m9L8O5n8j9O4m7j5L0Rk6K0M7j12M1P1
7224F0p1l0M8L4m8j7L2jMrPj9M1l3n6O7J5k0m2L0N6o1m2N3lKK1l4J6J2k1l8O2
7257A5J1j6m6L1M8m2k2oK1N3k8m6M6J4l9j9M3L2m0k5J3j6L3l2m6Q6J2l7n3N9J1
7288A5n4K6L4l4l5N9l7KO2o5l1O8O2j26J5O8k0k3N1m8nM3Np2N6L3p2lQ6n4l0N7
7320C3k0m0M8Oo7L6M7k6n4M1j4l1J6L0j5J2J6m2PM8l3k6K3M0m7J0OKOK0n9M3J8
7353C4n0rN7l0m3L9K0m4M7Nn4mP2m6n4P2kq2Q2Rn3L8jl3L4J2k2l6O1nn8L6J1j2
7387ij3P6o9J9K9n3J1M5qo0K0K4oRJ9q9M0O2o7n4J25j8j05Q6J2p4L4N9j03J8O3
7418B3m1n6Q0L1j18O4R2r6pQ3j05nJ12k7j20J40J7j06K3O7o4PO3p3m4R5k8r5R3
$$ y = [32, 18, -43, 23, 56, -47, -57, 27, 7, -11, 7, 10, -30, 29, 1, -48, -10, 55, -3, -22, 42, -5, -20, 10, 19, -7, 13, 60, -52, -11, 60, -11, -41, 7, 41, -7, -24, 8, 7, 11, 2, 9, -10, 31, -2, -58, 9, 24, 4, -38, -8, 48, -13, -55, -2, -5, -3, 18, -16, 0, 12, -9, -47, 15, 26, 10, -36, -5, 43, 1, -21, -27, -6, 47, 19, -27, 19, 33, -6, -25, 18, 50, 10, -15, -2, -18, 15, -17, -63, 23, 35, -2, -55, 4, 15, -39, -13, 21, -13, -48, 11, -26, -24, 38, -27, -58, 10, 72, -54, -39, 29, 9, -14, 37, -11, -16, 27, 32, -40, 16, 49, -23, -26, 60, 6, -24, 33, 13, -27, 21, 27, -40, -4, 43, 17, -37, 4, -10, -41, -25, 5, -10, 2, 18, -24, -17, 31, -2, -28, -5, 35, -12, -2, 4, 6, 12, 32, -27, 16, 34, -16, -25, 32, 2, -41, -2, 18, -26, 21, 26, -28, -32, 40, -6, -60, 12, 10, -72, 10, 19, -34, 4, 3, -30, 4, 16, -6, -42, 19, 14, -44, -8, 3, -9, -22, 54, -15, 4, 33, -20, -9, 36, 28, -32, -12, 12, 6, 15, 34, -55, -15, 47, -20, -74, 51, 33, -72, 14, 26, -48, -14, 45, -58, -40, 23, -18, -74, 6, 37, -81, -17, 75, -21, -28, 55, -50, -55, 57, 30, -90, 50, 67, -39, -16, 51, -13, -6, 57, -16, -60, 35, 7, -88, 5]
7447EO3j23l7J60q8n6Q1k8j4O3j0j16J04P4r3l7J28n8j03R9j1n2N4L4j18P9O2
7474F2j08JJ18n3j14J18J6r7N2Q5j22J0J09j21l7J66m8j02P2R6j35JO8p5j0J31
7500H3p9r5J28K3j56O9P8o9l9J09p1l7R4oq3R1Or2L9J07j09j8Q7o6k7Q1Jj05Q3
7529B7ko1K3O1q7MP6m2m8P9oq7Q6np7P4M9j02J1J03p6n4P8kp6O9M3r0J5N3l8q
7561a0O5n9m6P2J2n5K6N5m9l0P8n6m9R7l1m3M0kn8J7P1n6pO3o1k5P2k8m8P6J5
7592D6j03M3P3o7j8R8o5l5N9km4M6Rp7L0P7j11j8J21n6o6J13rj10L8Q9j22K7Q0
7621D6o4n3J05Rj16N9O9r9M3O2q4j0P6m0p2R6J0p4K9M5n6K4N1p6j6R5j6j11J16
7650D8Mr3L7R0r7J1L2m4k1Q1k7j06J03N5j47L3P5o4J4N7n5l9R9n0n5P3M1p8KQ0
$$ y = [5, 68, -55, -92, 68, -20, -76, 5, -23, -37, 26, 16, -100, 4, 78, -15, -52, 76, 18, -85, 14, 3, -49, 5, 39, -79, 0, 62, -46, -45, 73, 20, -94, 24, 40, -57, -5, 80, -42, -32, 77, -44, -81, 85, 37, -65, 7, 103, -32, -31, 37, -38, -48, 83, 4, -91, 37, 60, -96, -27, 51, -18, -57, 52, -19, -56, 38, 32, -51, 40, 46, -46, -7, 100, -9, -27, 60, -6, -33, 48, 49, -56, 27, 25, -36, -13, 48, -39, -35, 41, -1, -49, 30, 24, -63, 23, 18, -59, 15, 64, -38, -27, 76, 0, -54, 24, 22, -54, 15, 58, -32, -17, 36, -2, -10, 55, -4, -50, 22, 34, -21, 5, 60, 11, -19, 59, 3, -46, 51, 20, -23, 17, 15, -43, -26, 45, -11, -18, 45, -16, -41, 31, 3, -45, 31, 46, -57, -14, 59, -8, -26, 72, 7, -28, 31, 29, -15, 31, 40, -37, -7, 70, -41, -59, 62, 6, -60, 53, 44, -66, -28, 61, -61, -34, 46, -18, -71, 34, 43, -73, -14, 55, -44, -1, 61, -23, -33, 43, 3, -69, 27, 37, -37, -8, 37, -19, 5, 56, -20, -36, 59, 43, -68, 48, 52, -41, -4, 86, -11, 0, 32, -12, -33, 48, 21, -85, 18, 73, -74, -41, 34, -30, -16, 41, -14, -53, 46, -4, -59, 14, 55, -23, -21, 59]
7680E9l3p2J08m6o0R1j7o6M1O9q1l6P3Nq0L8J7j6J3J8r3P5J8n4l3N6J7m0M7l1
7710a3j0QJj4L3K4m9LK1Ok7L9k5J7J3k4RPJ4n2J7M3oo8M3%j0j6J8l2L9L2m4j7
7744b0M1J0m1MK6Jj6l3M1j2K4k8l0Q4m5l0MJ6J3J4j4j7K2J9n3K5J2J3j5Pk8pL6
7777B3l1j8O4Op9K8M2k1j8NLkQJ6n4M9J9p7j1Q8Jr8M6L9j8J7k6j1M4j4l5lM8k
7811B8n5J4L5%k5oK6l2L3k4k4M9qn0J0N3lk5KoJ6J6n5K1N5j1p7K9K1kk1j4%M8
7845A8k3lkK7jl4K3K1jo5J9M4j4Jl4J5M4j5m4NN2J2n6J2K9Jl3k6L7M4o1Rj0K4
7879A5Ml0l8M2J7jj8K3J9o2oP5k0j9MJ9k4L1k5%NN1r2LN8qn1RP8o0J2j1n6N8N8
7914F0q6oL5ok3L4K8k9oj4MJ6K4m0m8Q2pm4L4Nmklj4KN0m9k3O1Mo7OP0m2l2O7
$$ y = [59, 26, -46, 62, 16, -44, 47, 30, -36, 5, 74, -7, -43, 30, 35, -45, -7, 10, -6, 7, 25, -68, 7, 25, -29, -62, -6, 11, -29, 18, -13, -23, -15, -14, -28, 5, 29, -20, -17, 4, 10, -17, 22, -3, 14, 27, 3, 12, 19, 33, -19, -2, 41, 35, -33, 10, 10, 0, -16, 2, -30, 9, 41, -3, -20, 21, 31, -10, -6, 20, 21, 5, -28, 13, 1, 25, -3, -33, 51, 6, -24, -20, -4, 9, 23, 9, -8, 14, 33, -20, 5, 17, 30, 15, 22, -6, -13, 23, -8, -26, 38, 44, -35, -7, 35, 14, -4, 1, 4, 2, 10, 26, -28, 21, 40, -37, -48, 40, 41, -57, -11, 28, 10, 27, 1, -10, 34, 20, -15, -18, 30, 28, -27, -13, 22, 22, -3, -9, 17, -15, 18, -6, -30, 19, 11, -39, -29, 24, 21, -4, -2, -8, 8, 24, -31, -10, 45, 34, -43, -14, 7, 5, -16, -30, -30, 18, -5, -8, -10, 17, 16, -18, 5, 26, 25, -40, -21, 23, 9, 10, -24, -9, 35, 20, -24, -19, 33, 45, -11, 1, 30, 31, -2, -28, 9, 53, -8, 1, -9, 15, 19, -11, -49, -7, 10, 9, -9, 14, 33, -29, -35, 40, 20, 1, 5, 24, 0, 31, 6, 6, 11, 62, -30, -27, 31, 23, -28, -19, 59, -1, 11, 0, -56, 2, 60, -26, -32, 3, -3, -26, 8, 36, 7, 1, -13, -9, 7, 31, -9, -57, 25, 18, -26, 8, 13, 9, 7, 4, -10, -8, 42, -7, -30, 31, 35, -32, -26, 44, 2, -30, 37]
7950C7n5J5N0n6m2P7K0j23O7K6m9JO2j6n5Q3m4m2Q2Qq9J2Q8Ko6JK1n4O2J0l5j1
7982a3M6k4l9R0m9k9OLlL2oo0M2L4m6j7O4np8O8j4k2K3Ml6M9K7j00QN8j0k4KN3
8016C4k6J3L6n0%L6p0J4P4n1m9L3J7k4K4Ol5pL7k2k0N4l2k4L6%k4K4Qk0K5L6o5
8049a2j0N8po0L7K9n2L4L1m6J7J5n3J5N0kn9PJ8j5K2L5q9K3O8m8m6J04p4m1O8
8080A7M0r3mO1n0J2L8m4l1O6J2p5L6O5n6j0O6m8m2O8l8k7N1On4M6M8m7j6K8m4
8111a9j6R2n5m4M6K4p0N1M0p1LO7m7l3M4k4n3M6O9q1k7Q4j4l7O8j5p2P7Lp3M5
8142HP2j07J5R7p6n4P8Lp6M8L2m8mL9pm2L5ro0N8K9q1P0j7k4OJ7nk8L7j5j5L5
8175A1J3m9QJ9j8J1M2o5lO0j7k1J0J5l0O
$$ y = [37, -18, -3, 47, -9, -51, 26, 46, -77, -10, 16, -33, -32, 30, 14, -41, 42, -2, -44, 38, 46, -43, -31, 57, 59, -7, -6, 15, -39, 23, 33, -2, -13, 33, 9, -30, 60, 11, -18, -12, -9, -12, 20, 14, -46, -4, 30, -16, -33, 31, 26, -52, 16, 2, -20, 3, 7, -29, 20, 47, -53, -45, 13, 3, -21, -19, 34, 8, 21, 57, 7, 7, 43, -27, -13, 61, 10, -39, -6, 11, -13, 11, 17, -18, -25, 12, -10, -30, 24, -8, -32, 4, 4, -20, 4, 12, -8, 17, 53, -12, -22, 36, 29, -31, 6, 35, -17, 17, 48, 2, 19, 34, -19, -4, 46, 44, -15, -8, 10, -5, 17, 52, -37, -14, 54, 6, -40, 64, -10, -51, 17, 57, -36, -40, 21, -29, -17, 21, -23, -54, 12, 24, -51, -15, 50, -6, -16, 50, 2, -40, 28, -10, -37, 14, 20, -34, 12, 60, 13, -3, 25, -19, -35, 57, 2, -42, 4, 28, -42, 9, 49, -22, -19, 48, 1, -32, 12, -12, -65, -19, 50, -31, -58, 26, 12, -25, 43, 28, -44, 33, 36, -37, 8, 80, -27, -12, 85, 9, -45, 33, 36, -40, 8, 40, -8, -12, 27, 20, -22, 13, 4, -56, 2, 31, -50, 20, 3, -21, -15, 2, -3, -31, 6, -9, -24, 11, 24, -25, -17, 2, -16, -5, 37, -28, -31, 29, 12, -9, 1, 16, -14, -8]
8191h
$$ Imaginary data points
##PAGE= N=2
##DATA TABLE= (X++(I..I)), XYDATA
0@%%%%%%%%%%%%%%%%%%%%%%%%%%%jNj0J2j4J6j6J6j6J6j6J8k3K7k8K9l1L5m0M3
47B2m5N0n5O0o8P5q3R3j05J18j34J58j86K22k69L35m32N78q22J267k218M932k4221
70b0728p0515J36026K2960j35211M3883P2183o7645J7749M5902r8228J1566J32953
82I0895p6584j10064J20756M2988j23200L1507Q1575p5290j2328O6448n5069j1461
94b9827R4415o0658r1065J14682M9902j25801Q838Q9254n6646k2661O8797m4265
106e035l7378Q2461k3927p8314Q5356L8993j16524J3230J02028n2901m7653O2472
118B2808k1564l7902P4281j0386q6508O1423N4446r2365K681Q8964n4170n2762
130e1054P3473o67n2437M8650K826p1405N1340N9953q5097j9945Q4305k8521n0721
$$ y = [0, 0, 0, 0, 0, 0, 0, 0, 0, 0, 0, 0, 0, 0, 0, 0, 0, 0, 0, 0, 0, 0, 0, 0, 0, 0, 0, 0, -1, 4, -6, 6, -8, 8, -8, 8, -8, 8, -8, 10, -13, 14, -14, 15, -16, 19, -21, 22, -23, 27, -28, 32, -36, 39, -44, 49, -56, 62, -72, 86, -100, 122, -147, 188, -244, 334, -488, 779, -1439, 3493, -20728, -91243, 44783, 67743, -67468, -23585, 48598, -19047, -1298, 44604, -53624, -42058, 90895, 14311, -95753, 25003, 67991, -55209, -23702, 57873, -17417, -29745, 36703, -18366, -29827, 64588, 3930, -87135, 27547, 77449, -48352, -39514, 49740, -6906, -29567, 39230, -5035, -42413, 40048, 16121, -62193, 23163, 62156, -54368, -41138, 60890, 7989, -39664, 22808, 1244, -36658, 37623, 27237, -59271, 2152, 56598, -35767, -33086, 55878, 1708, -51054, 22419, 21752, -30685, 17965, 20791, -50614, 726, 60679, -24418, -44363, 39942, 11421, -39300]
143c9300O0798J358n9824M0931K5479n9262K5119M8899o7809j8023Q2178j8118
155B2426o1607M3207J6259m5767L2198K4054o0300J2829N5919m8026k3974O5587
167C2805j7195n7422M6169K6688m9428J3351K6088m5398J2263N4600m7862l6276
179d1617O4192m5n4381L5431K4568n1063J0963L8731l6782m202M3677l6051l0645
192c7224O2664M280o2892K3011L6570l8502K679L4271l5369j1675M6634j9296
204E151l3332M5200M908n4393K3513M2625l8457j4355L3344j7738j1239L8359
216B3586j7471l7729L9577J6744m5942J2643L5240l4855j3445L8611r871k1588
228a4500K5563q052k7409L6320J5011m9365N757M1053k4656j6774L2028j0638
$$ y = [-39300, 21498, 22856, -36968, 3963, 29442, -29820, -4701, 44198, -23611, -41634, 40544, 22426, -39181, 4026, 20285, -25482, 6716, 30770, -29530, -16701, 39218, -8808, -32782, 32805, 15610, -41812, 4357, 31045, -18383, -5032, 21056, -24342, -12079, 42521, -5341, -41617, 22575, 22530, -31851, 3580, 28148, -22915, -11952, 26779, -10003, -14205, 29472, -6579, -37224, 25440, 29720, -33172, -10161, 26409, -12093, -9414, 24857, -10512, -22187, 24447, 5151, -28181, 17019, 21927, -32466, -8953, 33672, -4785, -19140, 14204, -3534, -14773, 23586, 6115, -31614, 7963, 24707, -21235, -8592, 26648, -8207, -21652, 16959, 7088, -14500, 11063, 3011, -24398, 11922, 26933, -22432, -16675, 24378, -278, -17052, 14976, 4338]
240D338k3896K7791L203k8129K1316J3530l9111P780M1963k5140k7859L0583L579
253I948k1816J8911L499k8499J5868K1136k8600j829L0674j9089k2864L1033Q581
266A6953k8054O391J1637j5882J0132J5792k6434o159L0251q054k1409K0015O258
279A1437k3932P108J7486j3377k857J0599j3679j416K4350r441k3972J6803J3163
292A2272j7338J597J1591j2037k591J3487o279n802J2458o555j4242J7119J0878
305A4558k0490l914J4906l547l735P533o772o320J1944N72j0748P372N746j3925
319f820k60J5934l061j1756L302L147j001N392k320r656M722Q079n826k910O245
334C211k220o468M355O194k771m272j344J060N650J885p348l198N787K763k796
$$ y = [4338, -19558, 8233, 11436, -16693, 4623, 18153, -20958, -13178, 28785, 3645, -24214, 6369, 9948, -11868, 7043, 10542, -17957, -2089, 19047, -9553, -11382, 19292, 203, -22661, 8372, 16953, -11101, -4710, 6927, -8955, 1177, 16969, -9465, -15624, 14627, 6573, -14836, 5179, 11437, -12495, -5387, 12099, -1278, -4135, 6464, -7215, -8631, 15719, 6278, -17694, -891, 12272, -5066, -3469, 8122, -3915, -6506, 6981, 702, -5100, 7358, 803, -13439, 3680, 14558, -5932, -9846, 5060, 1513, -2222, 5311, -1461, -7781, 4163, 4735, -6013, 1359, 7105, -6820, -7080, 8854, 5793, -5963, -2661, 486, -515, 4877, 2557, -7099, -2377, 5702, -124, -3034, 3211, 991, -5477, -1122, 5072, 2301, -1971, -3315, -2255, 3395, 5280, -2068, -5266, 521, 3284, 488]
349D88j296R07k73j679R63L718k14m867j954M012M127r76m992k538M231M962l034
366A585m709K791J720l346J946L590l516k766J424O06L048J920p265l732R120
381B416L542p652r11L926k812Q52M609m369k348N156l693k903J0045q00j3130
396h072L919J0768n390l788M672m694j709J0515l186j0285Q738M060j2437M968
410a921J2050j1425p193J1711l39n828P282l430j0520J1754Q071j5814n89J3892
424G701q430o709J3667k203j1352Q656K226r770R417N674j7859J586J8681q511
438B774j1984J2416J6j0491J0731L147j4934P310R994j6039J137J9037j2451j4505
452a3842J8213M050j4917P385M589j4930Q829J4028j9406m465K2338r583j6366
$$ y = [488, -808, 99, -174, -1853, -890, 2828, 2614, -2253, -4207, -195, 3932, 2956, -2036, -4574, -343, 4619, 1585, -3124, -333, 1387, -1959, -13, 3577, 61, -2705, -1281, -675, 2373, 4293, -2972, -6704, 2416, 5958, -1694, -2605, 1321, -1491, -639, 3970, -399, -2747, 2409, -1284, -4187, 5858, 5058, -8072, -4153, 6615, 1225, -2563, 2109, -2585, -4294, 6221, 3035, -7250, 1488, 5548, -6889, -1921, 10129, -1296, -8489, 3222, 2883, -2945, 4337, 907, -9613, 2141, 10212, -5602, -6191, 7701, -729, -7438, 6229, 4026, -7326, 1330, 3556, -6214, 3203, 8877, -8982, -7396, 11285, 2774, -9210, 3206, 3222, -7269, 3462, 6609, -8325, -1015, 8979, -7060, -5923, 13114, 663, -13842, 4371, 8421, -6496, 889, 5478, -9452, -623, 13405, -6001, -10466, 11872, 2289, -14077]
465a4077K0452M300k2015Q041J2734j5154L388J4206j8770n694K7020p276k3475
478a6320J8483J0369k2615N976J6632j7256k979J8354j3084q578K3847o538k4916
491a8625J9671J5854k4887m63J9343j3651n375J9731j1394j3527K2902j526k4578
504a6525J8234J6075k8367j533K6195j2196j2651J8938o718j5185K3133K073k8810
517a7337J5008K1169k7729m109K9593j3607j8983K2788P73j9779J7569N719k8005
530a6930J2969K5405k7845j0628L1844q790k3429K3751N400k5763J3633J4144
542A3761k5505N887K5296k4700j3598L3674m196k8526J9605J1640k5556R327J8150
555A5259k4187j287K6774j7926j5678K9911k493k9418J9387J6292k6561L451K1098
$$ y = [-14077, 6375, 10675, -11340, -3299, 9435, -5719, -2331, 11875, -6895, -12589, 14431, 7155, -16320, 2163, 12532, -10083, -4107, 12525, -4731, -7710, 10644, -2440, -11018, 12829, 6291, -18625, 1046, 16900, -7987, -8450, 10893, -2758, -8133, 11598, 204, -13323, 9579, 8053, -16525, 1709, 17784, -10583, -12116, 14079, 1883, -10768, 8170, 1452, -13733, 9400, 11473, -17337, -2329, 18840, -8889, -12998, 16595, 2988, -15995, 6793, 7566, -12213, 5356, 11075, -16930, -3961, 21444, -6401, -17029, 14815, 6025, -17404, 6347, 11747, -14016, -383, 13761, -11744, -5857, 19439, -5261, -18859, 14815, 10619, -17907, 1698, 13338, -12218, -2891, 15259, -8928, -10215, 16559, -1367, -17045, 12866, 10373, -19045, 342, 16634, -9927, -6476, 14622]
568A4622k0950n082K7790j4432k0459K7996K343k9140J7288J7346k8438J291K6297
581A6472j9111j0874K7576j0016k3139K6883P539l1502J1943K1476k5796j928
593a0477K7487j8146j5575K8937m021k6046K1923J1722l0438P527K4864k2296
605d539p950K6156j2705j6953K7329r07k8895J8863J6979k8444J930K5451j8586
618b271j1438K5016p205j8686K2469K103k7076J6634J9252k8654k647K8190j4530
631A157j5112K3533l938j9995K0082N331k5999J3317J9627k7678m127L0876j3269
644C805k0759K3659K196k2064J6201Q988k5588R592K1756k4811p240L0252j0750
657E237k3462K3565P556k5012J0284J4113k1946M009K1918k0976j0478K8867o536
$$ y = [14622, -6328, -11410, 16380, 1948, -18511, 9485, 11828, -17312, -24, 17322, -11116, -9825, 16472, -2639, -13513, 14063, 4047, -19092, 7791, 15330, -16172, -4229, 17247, -8549, -10477, 17010, -1136, -16711, 12226, 8205, -17841, 4082, 15804, -14634, -7107, 17757, -4539, -12489, 13667, 962, -15991, 11338, 10431, -18464, 399, 17378, -11066, -9136, 16315, -2271, -13709, 11307, 4102, -14584, 7885, 9988, -17088, -454, 18798, -9856, -12503, 15687, 1157, -13955, 9578, 5640, -14355, 5727, 11058, -14941, -1624, 18003, -9675, -13802, 17074, 3805, -16954, 6705, 8901, -13163, 3038, 12026, -13562, -3970, 17786, -7025, -14265, 15987, 5237, -18225, 5340, 12896, -12116, -1832, 12281, -9665, -5656, 16262, -4714, -15192, 13675, 7139]
670G139k4436K0723J0364k5283O746J8046j9082k124K1281j5390j2298K6371l548
683H509k5603J8388J3604k5007L552K0085j7576o026K1971j0816j5031K3030P1
696I151k5037J5860J6044k4974r7K2621j4958r797K1873p359j7577K0827M223
709A0800k4753J1653J7804k2858l420K4017j1716j4324K0614j780j9096J6945
721C886Q011k3995P257J9975j9327p477K2912p454j6632J7939L163j9338J1422
734C42J0984k0533L097J9945j6044j0205K1762l679j7529J4928N777j8241P986
747a410J2320j7580r6J8809j2868j1294K0307j368j8685J2892Q667j7587M774
760c119J3357j5191k468J8027r792j2246J7856J097j8282J0354J0751j6513J037
$$ y = [7139, -17297, 3426, 13790, -11493, -4747, 13299, -5783, -7907, 13374, -2016, -14314, 12057, 8509, -17094, 1294, 14898, -10109, -6557, 13528, -4048, -10074, 11897, 1081, -13950, 9080, 9151, -15886, -26, 16018, -8956, -9053, 13568, -1390, -11187, 10686, 3327, -14250, 6577, 10800, -13953, -2300, 15504, -7354, -10774, 13243, 1527, -12797, 7817, 6037, -13059, 3886, 11897, -12098, -4841, 15134, -4193, -11670, 11242, 3788, -12844, 5095, 8258, -11080, 342, 11326, -9207, -6110, 13835, -2209, -12414, 9348, 5669, -11860, 3068, 8845, -9396, -1410, 10910, -6670, -6766, 12043, -825, -12119, 8188, 6820, -11865, 1027, 9694, -7893, -3119, 10238, -4953, -7421, 10606, 814, -11432, 6424, 7521, -10761, -407, 10344, -6169, -5132]
773e132J4428j1687n212J6172o635j2653J5356L260j7178P323J1783j4204j813
786f192J4421q113p820J3673k551j2329J1749M931j5484M685J2153j1828l907
799f612J3167n168q496J0964M6j0961Q213N531j2576K803J1129r941m501J2187
813E785l614q602R237J142r830O406N431j0730J628J0077q240m867J1244k360
827B707r227Q184L044r585M265O124r076K66R400o395n489R639o65q834O178M379
843D915q623J641O827o562j706Q082m227n551Q025N92q049M325M779o929P1O374
859C984m426k918O412j905n165N717J370o849K988M730n608p98N388k845k769
874b694M689p67m163L862J561n037J850L915m455j038M801k059k897L772k71l420
$$ y = [-5132, 9296, -2391, -7603, 8569, 1934, -10719, 4637, 7897, -9281, -1958, 9825, -4379, -6192, 8229, 116, -7704, 5969, 3418, -8911, 2838, 7769, -7715, -3030, 9123, -2705, -6612, 6555, 1387, -7109, 3855, 3901, -7060, 1153, 6684, -5892, -3089, 8040, -1901, -6402, 5785, 2171, -6431, 2806, 3948, -5882, 524, 5955, -4775, -3147, 6930, -1310, -6177, 5067, 2707, -6520, 1664, 4708, -4877, -612, 5512, -3564, -3298, 6102, -293, -5782, 3857, 3192, -5642, 536, 4915, -3708, -2067, 4760, -1802, -3508, 4574, 347, -5204, 2821, 3413, -4636, -311, 4468, -2461, -2390, 3984, -442, -3360, 3052, 1147, -4018, 1699, 3069, -3780, -792, 3938, -1670, -2468, 2920, 75, -2694, 1995, 1228, -2935, 927, 2488, -2549, -699, 3216, -1239, -2277, 2524, 465, -2432, 1340, 1069, -2351]
890b351K909J504l998R85L323k979j405L873q88l202K682J217l057J112J990k621
906i06j90K670j270j846K031N09k071O02J700j435p82J545j67j043Q64L75j069
923d83J52J008m40r07P11P30j198j68J487p73j217J557L65j834P44J392j656m22
941i52K248r49j968K246P16k802J282K060k924k06L196j880j947L107k72l058
957b103K428J666l653P06L163k950j074M126j879l197M203L70m431K833K535m843
973b100O71M560l724k157N316j646m547N085J453o398K717M756o048n72O618l942
989D2m062O694l95o408M873L191p367J613O665o050k876P934k473o238O762J557
1005C462p817L887N131p449O6P599n338m279Q344r48p812N955L651q316K302O605
$$ y = [-2351, 558, 2062, -1936, -951, 2372, -607, -2012, 1861, 973, -2229, 453, 1670, -1387, -275, 1715, -906, -1096, 1574, 304, -1542, 489, 998, -1073, -471, 1229, -206, -988, 557, 390, -653, 211, 586, -483, -331, 677, 237, -670, 41, 771, -427, -595, 892, 119, -1098, 459, 824, -1010, -266, 1126, -530, -952, 1296, 347, -1621, 625, 1341, -1461, -179, 1881, -1043, -1249, 1947, 67, -1880, 1227, 955, -2103, 325, 1991, -1662, -956, 2207, -743, -1817, 2309, 430, -2767, 1436, 1806, -2625, 208, 2743, -2100, -1429, 3131, -593, -2750, 2566, 920, -3627, 1458, 2911, -3487, -770, 3986, -2062, -2634, 3984, 42, -4020, 2674, 2279, -4129, 744, 3935, -3432, -1819, 4846, -1204, -4080, 3854, 1381, -4857, 1905, 3462, -4355, -468, 4663, -2786, -2720, 4879, -459, -4738, 3606, 2658, -5154, 801, 4452, -3864, -1562, 5043]
1021E043p131j623Q402m344n517Q413p4q713N701N134q679P69P742o353l047Q953
1037D676l414o940Q484J133r681N565O340r848j33R535o017m885R411k171q259
1052f204Q382K982j0856M229Q385j0013j885J1259n271p431R762K62r521O882
1066I62M640j0732K510R669q900m071J1524l544q904R425K269j0595N347O386
1080E986j0138J098J0014q331n069J1819k321j0062Q756L647j1145M443Q034j0338
1094c607o66J1025p423o154J2268j776j1410Q852N327j1709L198R061j0177j976
1108e167J2264o458q325J2266Nj2561Q469P087j2834J505J1006r177l870J2470
1122F680n079r932J1970K628j3614O123R212j2219o89J2414p810o558J2221k610
$$ y = [5043, -2088, -3711, 4691, 347, -5170, 3243, 3169, -5544, 157, 5291, -3388, -2619, 5123, -1230, -4277, 4676, 1262, -5678, 2806, 3939, -5742, -177, 6163, -3685, -3818, 5717, -300, -5185, 4226, 2055, -6204, 2178, 5160, -5696, -1467, 6918, -3095, -4980, 6279, 1008, -6423, 3339, 3601, -5920, 962, 5602, -5130, -2620, 7049, -1851, -5922, 5602, 2058, -6846, 2579, 4848, -5747, -400, 5986, -4152, -3054, 6960, -1371, -6440, 5379, 3058, -7004, 1752, 5399, -5746, -1303, 6731, -3607, -4273, 6752, -671, -6825, 5443, 3667, -7743, 1109, 6436, -5273, -2075, 6986, -3191, -5167, 7097, 639, -7686, 4580, 4585, -7976, 493, 7580, -5254, -3749, 7257, -1920, -5790, 6680, 1601, -8331, 3639, 6267, -7347, -1224, 7988, -4231, -4920, 7494, -316, -6874, 5347, 2737]
1136B737j0646J0634M033j3879M433J0982j0898l170J2318n848p833J1851p04
1149D010j1716R224N529j3648L554J1956j1127n014J3407l896r454J0686J022
1162D533j2208Q119P616j3759J186J3245r893o819J4201k268j1872R598M105j2033
1176f249N541Q572j2745r27J4270p623r432J3116M96j2817Q120O850j2278K196
1190b910J0148j0152k865J3477n974j0769J2226L449j3262N203Q473j1106j3J1238
1204G163q213n415J2312l460j0624J1017M245j3573L705J0102r492k186J0548
1217F129o565o264J1984j507j1591R156N539j2935K908J0991r510m276J1142m077
1231A124p221J0424k61j1965Q033P887j2434j34J1553p603n766J1333k169r211
$$ y = [2737, -7909, 2725, 6758, -7121, -2688, 8294, -2604, -5774, 6544, 696, -7137, 4714, 4010, -7706, 1518, 7047, -6601, -3047, 8909, -2218, -7232, 6175, 2279, -7175, 3511, 4533, -7675, 444, 8060, -5699, -4513, 8732, -1161, -7980, 6221, 3953, -7919, 1679, 5784, -6249, -708, 7864, -4881, -5808, 8462, 839, -8593, 4523, 5019, -7798, 322, 7172, -5106, -2910, 7238, -2914, -5779, 7698, 1724, -9045, 3181, 6630, -6632, -1429, 7044, -4062, -4075, 7163, -1050, -6465, 5847, 2387, -8237, 2780, 7025, -6548, -2843, 7259, -2233, -4419, 6129, -436, -6700, 5284, 3777, -7814, 1342, 6881, -6054, -3146, 7845, -1665, -5941, 5201, 1124, -6097, 4327, 4066, -7899, 134, 8021, -4413, -4547, 7006, -597, -6363, 4970, 2801, -6410]
1245f410Q511K377j0711N876Q039j1743j815J2469n094p728R462j01r124P342
1259A350M151j0570L324Q375r649k239J1820m665q952Q983K359q830M871M298
1273D626r412K553Q994q502l813J0809l352q413Q815K681r752L624N730p698J222
1288a888P847p882m149J1151j830r411P139L690r271L248O942p882j159Q251n417
1303f21m478R818j327j0057O444O063q701M61O896o315k041Q627l787o267P898
1318B613O30q628N356N877q624j025P831l817l310O571k826n843P525K028q784
1333d426L141N995p007r47P621l767m671O056m88n145N620J605q222K725P234
1348E324n973k971O581k351m261N947J53o140L868K971o255J779O203n816l766
$$ y = [-6410, 2101, 4478, -6233, -357, 7682, -4061, -5876, 6593, 1499, -6229, 3233, 3132, -5992, 1350, 5501, -5069, -1745, 6630, -3019, -5258, 6562, 1897, -7055, 1928, 4287, -4543, 328, 4626, -4786, -2233, 6761, -1741, -5554, 5255, 1903, -6510, 2305, 4986, -4766, -1142, 4588, -3110, -1888, 5959, -1923, -6072, 5079, 3249, -6162, 977, 4667, -4604, -1356, 5586, -2296, -3455, 4796, -621, -5099, 4719, 3392, -6665, -221, 5842, -2859, -2398, 4498, -1817, -3858, 4769, 982, -5285, 2613, 3243, -5385, -29, 5848, -2776, -3801, 4030, 213, -3097, 3474, 648, -5195, 2330, 4358, -4426, -1285, 4710, -2297, -3244, 4377, 610, -4061, 1995, 1507, -3638, 1982, 3587, -4635, -1910, 5324, -649, -3620, 2961, 610, -3651, 2296, 2449, -3691, 177, 3148, -3107, -1328, 4875, -941, -4707]
1363d707P228m8n389L701J129n320L491M117o205o78O109l432l585O089J40o076
1379c436K568L438l757Q00K987m659p18O242k003m837L949J462m253J956K988
1394B727l778n43L191k046q10L828k119m046M030K585m136j30K441k075J29K800
1410B048k153j791K963l61k553K714J434m003j90L529p09j499J043j231o42L056
1426A655k28l271J212J970j948j83K274j065j939J292Q84m80O53p66j983J697
1442b26K416j858j839J252P01n77L46J70o79k05L39K07N36J81j379p90J630J440
1460A665j175j669K92J505K30q93j82J36k67L13L73n4k4o23p85J242J620j286
1478D18k005Q02J698j45o46m72m72Q99Q68j129j18J015j181q88K160P41k104o37
$$ y = [-4707, 2521, 2473, -2916, 785, 1914, -3406, 85, 4202, -2003, -2681, 3428, -4, -3589, 2500, 2640, -3436, -868, 2570, -1187, -387, 2600, -2059, -2777, 3465, 1462, -3375, 574, 2036, -2217, -261, 2727, -1051, -1594, 1597, -449, -1259, 2569, 450, -3596, 434, 3019, -1117, -1247, 1194, -881, -752, 2048, -105, -1896, 1067, 706, -1847, 867, 2301, -1702, -1892, 1637, 928, -571, 472, -759, -1401, 1655, 1427, -1844, -632, 1338, -610, -793, 1481, 416, -1523, -231, 653, 173, 826, 60, -1923, -226, 2190, 332, -1507, -255, 446, -131, 215, 385, -294, -499, -160, 47, 583, 764, -615, -1405, 225, 1665, 490, -1179, -887, 618, 848, -45, -227, -91, -358, -45, 328, 274, 250, -373, -1158, 84, 1704, 418, -1587, -785, 913, 768, 122, -350, -822, 77, 945, -184, -302, 713, -468, -1356, 804, 1545, -559, -1196]
1496a196R52M02Q29k9k338m9K846m50k033J362M07k076J043J920j491p10P40j120
1514i91N97K690j844l223K531K237k420j22J609j986k05K717j143j575K057q33
1530I6k260L164J778m241p35L502o50j270J737j436j831L286N42l285J520J691
1546A608l352N72L879k151k684K410J73j369K572n34m109K392L449l535p91L412
1562A942k481j953M390j91l758K169R90l260K579L011n130j400N492j136l456
1577b192L532j72m295L377K869m745L11L760l848j021N875j955n378L969K397
1592B484m246J847K629n126K30N770l199l351M959r07m728M661K592o070N91M401
1608B537l534n27M974l690l991O178Q90n733K994K649n662J497N562m577k669
$$ y = [-1196, -244, 158, 987, 958, -1380, -1429, 1417, 967, -1066, 296, 703, -1373, -330, 1590, 99, -611, 129, -991, -394, 2296, 452, -2771, -240, 1997, -423, -545, 1064, -922, -1127, 1590, 447, -1128, 929, 96, -2164, 1000, 2778, -1463, -2198, 1304, 654, -616, 1121, -315, -2146, 1140, 1682, -1603, -83, 1608, -1744, -1172, 2707, 556, -2128, 282, 455, -914, 1658, 1124, -2985, -593, 2856, -679, -1470, 1942, -539, -2492, 1898, 1707, -2051, 118, 1108, -2152, 427, 3438, -1692, -3092, 2400, 1264, -2192, 1340, 1168, -3127, 250, 3119, -1626, -1315, 2445, -1403, -2424, 3451, 1496, -3882, 87, 2484, -1762, 85, 2714, -2412, -2182, 3588, 389, -2962, 1997, 1090, -3638, 1023, 3615, -2455, -1864, 2537, -997, -1524, 3450, -240, -4231, 1947, 2837, -2896, 98, 2747, -2915, -1418, 4144, -433, -3102]
1623c102N336j890l537N825J18p156L369N110n525m65N371m501k784P072j011
1638B230n999M547J859o275L232N358o718k226P096k051m276N587n11o432M805
1653B26M085o694N44N454n120j849P353k183o218N074K046n559L132L515o770
1668b964J30O989l828l730N968j459n392N671K537o908J447M643m795j91O081
1683D199m380m441O774N85n980L816K463o514J982N926n166k342N819k623l813
1698c695O493L14p431L290M879n450J2N241m815k652P059j155n785M679J625o281
1714c672L105N249o139k005O164k162l308N413j118n944M875L432o255R30M894
1729C459m999j506O578k164m879M457P15m613L978K508o772P85O362l895k931
$$ y = [-3102, 2234, 344, -3193, 2632, 2750, -4406, -1037, 4073, -1452, -1917, 3454, -1047, -3831, 3241, 2230, -3769, 778, 2637, -3638, -406, 4952, -1766, -3992, 3104, 1053, -3223, 2364, 1853, -4579, 226, 4311, -2383, -1839, 3615, -1505, -3354, 3999, 1816, -4402, 672, 2718, -2841, 291, 3806, -2964, -2834, 4155, 327, -3403, 2565, 1106, -4286, 1385, 3922, -2986, -1539, 3104, -1691, -1882, 4199, -181, -4622, 2152, 2737, -3243, 573, 3036, -3478, -1496, 4430, -736, -3078, 2741, 118, -3695, 2798, 3112, -4319, -1029, 3850, -1600, -1588, 3653, -1162, -3814, 3245, 2090, -3695, 984, 2609, -3672, -567, 4682, -1457, -3462, 2702, 540, -2768, 2645, 1527, -4417, 458, 3890, -2365, -1435, 3459, -1540, -3046, 3532, 1368, -3511, 946, 1661, -2952, 1026, 3534, -3238, -2453, 3909, 14, -2917]
1744b917N432j779m507N289J483n828K346L275n255R49N976m708m133O316L30
1759B269n035L666J475n824K643M804n356j134N687l394l650O548K98o688K886
1774h05L760m725J066M238n304j665O857j930n154M942J142n939L073M307n310
1789a447p80M665l087j618N653k282n592N183K934n869J180L921m510m68N304
1804C187k970l086M820j014m556M943K479o790N50N624l168j936M199k489k982
1819c189N410L5n501L365K966n678O53N832l567l728M535L4l092L550k8n261L327
1836c37M262n347j024N299k583l401M800N39m397J983J640l436K186L110n197
1851a903j298O014j272m266L291J064l752J960K390l397L25K777l164o24M830
$$ y = [-2917, 2515, 736, -3771, 1518, 3001, -2827, -481, 2794, -2461, -1512, 4464, -244, -4377, 1939, 2269, -2766, 900, 2375, -3449, -806, 3998, -1358, -2492, 3195, -199, -3849, 2699, 2997, -3691, -805, 2955, -1770, -704, 3534, -1770, -3435, 3422, 1492, -3662, 1280, 2422, -3517, -444, 3863, -1447, -2227, 2438, -649, -2267, 3386, 1104, -4488, 695, 3629, -2240, -1060, 2861, -1649, -2117, 3187, 217, -2869, 1951, 937, -3619, 1324, 3803, -2987, -2437, 3187, 19, -1917, 2282, -207, -3189, 2221, 2256, -3245, 120, 3086, -2592, -1939, 3893, 326, -3402, 1133, 1167, -1925, 1625, 1597, -3664, -337, 3925, -1422, -2446, 2853, 270, -3131, 1669, 2208, -2189, -206, 1434, -2002, 184, 3294, -1903, -3201, 2813, 1541, -2725, 566, 1630, -2122, -162, 2228, -1169, -844, 1933, -1231, -1855, 2975]
1866B975j796m609L387K516l453N22J852k856M61L351k573j747L611r81l309L346
1882F97K047m267j70L161j461n98K268k250j763L859K11l735J787J967l133K13
1898a167L191j735j865K080l41j252K476k04l500J670K835k400q95K139j185j134
1914a287K323j76k015J321M63j914J383J843k608j087K597q8j329J112m76j386
1930a324J816Q44k100K90J368j448k96K086p23j749J115N45q56J033J47k180P56
1947f76K164j279j101J305l26r36J393L50j578L53Q14j002M41J383j507j275J795
1964C18O44j198J62J13p47Q14Q21j125l72R10l94m35J086N6j333J10Q63o8P4j84
1984A15r19L78J221m44q73L85K54l26K93L30m41k91J95L6L89L29q86o28R95O32
$$ y = [2975, 1179, -3430, -43, 2473, -980, -458, 1394, -1462, -1001, 2350, -223, -1970, 1641, 660, -2649, 697, 2744, -1523, -1693, 1468, 7, -591, 1677, -573, -2336, 1523, 1734, -2001, -214, 1753, -1380, -1167, 2024, 289, -1576, 504, 163, -1089, 1387, 1183, -2317, -647, 2188, -212, -1107, 1032, -153, -1287, 1036, 860, -1155, 166, 629, -1285, 98, 1941, -667, -1754, 843, 755, -574, 538, 62, -1324, 492, 1336, -764, -474, 894, -554, -850, 1236, 513, -1236, -121, 424, -432, 601, 748, -1432, -676, 1488, 209, -892, 413, 87, -849, 544, 894, -684, -331, 483, -519, -78, 1305, -202, -1477, 318, 962, -236, -74, 39, -708, 106, 927, -198, -570, 340, -54, -489, 597, 653, -680, -570, 293, 225, 299, 115, -804, -426, 795, 351, -522, -137, 117, -209, 84, 414, -27, -318, -123, -87, 302, 631, -255, -883, 112, 744]
2004G44o13m74O1J87L03P0l07j66J09k2P0L79N2p59k74P85N48m54p00Q0M64J55
2026B38l3k09l94K39M15k64k6L93n63n73R63P13r90n44O56O2p0N18n37p91R94
2047A97M54j054L22O94j082k25J362j03j108M14K68n13P45M01j530N4J550o58
2065A88q02J089k68j095J067O35j240J99O72j042K54J491j092j284J537L91j307
2082f07P74N26j593N19J531j317n14J494q72j120J938L06k208O79J411j422J21
2099c54J576j665r06K397l40j977J625O34k274Q87J998j900q76K108p79j363K187
2116I78n0k633J565J696k304j1K085j677r76K500m60k074J677O20k144J167J661
2133A620k429m09K524j114j371K121m47k105K004R82k465O33J771k055k78K606
$$ y = [744, 131, -343, -282, -95, 208, 278, -29, -195, -86, -108, -38, 341, 393, -366, -640, 145, 693, 239, -461, -381, 83, 238, 205, -4, -398, -159, 256, -8, -34, 359, -204, -777, 186, 899, -91, -635, 21, 83, 13, 531, -6, -797, 197, 651, -403, -81, 613, -469, -694, 668, 565, -543, -129, 139, -374, 371, 772, -758, -704, 846, 188, -614, 475, 207, -888, 179, 814, -426, -227, 445, -597, -343, 1148, 56, -1228, 309, 700, -607, 167, 693, -900, -381, 1150, -167, -681, 813, -59, -1179, 759, 1065, -1143, -464, 947, -475, -354, 1222, -443, -1349, 1048, 708, -1269, 356, 990, -1284, -397, 1601, -299, -1175, 933, 154, -1209, 978, 928, -1705, -140, 1556, -748, -759, 1326, -351, -1327, 1173, 713, -1361, 316, 936, -1208, -41, 1620, -809, -1218, 1306, 192, -1179, 942, 495, -1610, 394, 1376, -1089, -456, 1315, -740, -1018, 1588]
2149A588j325j923K327K44k214J618J067k720O45K404k045r10K521j086j875K499
2165H15N14k827J156J773k350J62K489k014j432K973m32k403K075Q13k808J075
2181d21K201k380o34K569j290j574K638j73k733J833J488k597M70K187k215o98
2197a329K768j038j889K181J74k355J673J399k706K04K471j806r92K555r82k070
2213a742K466N49k695J314J636k619K14K691j849j610K718l09k363K145Q61k974
2229a567J022K362k488n31K740j510j798K829Q6k827J687J501k719N54K511k367
2245e15j082L054q66k332K449N19k909J518J921k701p2K607j794j314K858n54
2261G87k626K212J107k785Q85K093k502l76K869j547j779K669j18k654J998J423
$$ y = [1588, 263, -1660, 667, 911, -1303, 315, 1382, -1338, -693, 1711, -334, -1244, 1277, 191, -1684, 815, 1329, -1498, -342, 1431, -919, -757, 1732, -282, -1714, 1259, 827, -1576, 499, 1312, -1496, -421, 1780, -600, -1234, 1335, 45, -1529, 1109, 936, -1797, 36, 1524, -1073, -603, 1584, -631, -1329, 1439, 401, -1488, 693, 867, -1488, 185, 1584, -1122, -918, 1553, -253, -1245, 1310, 328, -1742, 724, 1273, -1422, -108, 1528, -1091, -877, 1814, -35, -1645, 1073, 764, -1599, 546, 1407, -1567, -545, 1817, -671, -1202, 1538, 28, -1770, 1059, 1145, -1682, 5, 1506, -1213, -659, 1852, -515, -1597, 1457, 591, -1741, 708, 1227, -1682, -164, 1757, -944, -1016, 1591, -203, -1517, 1341, 787, -1839, 373, 1480, -1305, -420, 1673, -829, -1205, 1664, 117, -1662, 1007, 889, -1765, 233, 1656]
2277A656k947M51K549k171q87K883j186k224K715M84k955J508J847k832N8K883
2293A832j913j600K880m53k520K278J019l106J023K409k503o49K865j406j894
2308a738K719J03k671J679J411k698N01K425k123j114K816p94k129K291M02k613
2324a533J433J655k481L3K366j636j188K530n38k233J983Q60k452Q85J807k251
2340g60k71K441j324j469K270k07k123J743J030k490N43K112j920p19K390r43
2356C03j749K124K43k196J324J202k227K89K148j645j089K186l54j811J567O32
2372I47j951P98J343j801RJ884j337j049K008j78j826J272P67j593M04J233j440
2389e10j50J670j033j082J862j15j805J214J027j705J34J346j105l37J440p97
$$ y = [1656, -1291, -840, 1709, -462, -1349, 1534, 348, -1876, 839, 1323, -1632, -124, 1723, -1109, -1051, 1832, -81, -1681, 1199, 746, -1774, 504, 1523, -1583, -560, 1849, -654, -1303, 1562, 156, -1738, 981, 1084, -1587, 92, 1503, -1195, -694, 1731, -392, -1506, 1310, 516, -1613, 678, 1080, -1533, -100, 1555, -926, -893, 1473, -163, -1351, 1179, 641, -1592, 391, 1251, -1201, -316, 1491, -760, -1031, 1410, 86, -1383, 887, 680, -1443, 300, 1330, -1160, -617, 1495, -425, -1144, 1246, 303, -1446, 678, 921, -1275, 49, 1251, -976, -687, 1461, -184, -1273, 913, 559, -1252, 315, 947, -1004, -206, 1137, -664, -655, 1229, -108, -1157, 851, 673, -1153, 119, 886, -707, -303, 930, -510, -660, 1010, -23, -1105, 757, 642, -1163, 51, 1078, -627, -493, 853, -252, -589, 851, 54]
2405E4j100J686Q5j828J006J184j698p9J610r55p20J396m67j058J419K04j726
2422i87P92J295j487l96J644o72j049J299j5j207R94M49j445N81J170j276n16
2439h26J520l49j109R90K60j075O09O32j154K24J060j024m57J370l64j092R34
2456A49L57j001M11O57j005O8J051p61o05J234k03j117R06N52j161K07Q37p91
2474b15j68R26n33o90J007J22j078N51P14r72o3R63n64m73Q32j78o55O61K40q50
2494d23K32P10o09l11P43k16n17N35J20o15L34L28n17L7M92l15l14M61M3l69J94
2515B3J47l17R9K56k97l5L01k12j44L15k3k68R4J68j28j4J08j19n5K03rk01J56
2538D8N7k03K1J56n6j70R3J01o1l7J22j06p1K18n5k16J80J93l03m6L00q8k71K27
$$ y = [54, -1046, 640, 725, -1103, -97, 1087, -611, -690, 920, -35, -755, 641, 174, -884, 535, 739, -987, -195, 1100, -387, -783, 861, 189, -860, 439, 424, -783, 211, 660, -785, -204, 966, -310, -826, 694, 345, -764, 226, 486, -589, 20, 652, -502, -278, 782, -242, -699, 671, 307, -785, 149, 506, -495, -84, 573, -432, -364, 687, -74, -679, 555, 352, -765, 141, 693, -468, -261, 576, -215, -383, 543, 10, -680, 327, 449, -629, -78, 636, -336, -399, 564, 0, -473, 359, 181, -474, 187, 427, -423, -191, 519, -90, -401, 342, 126, -391, 144, 264, -351, -17, 311, -206, -169, 323, 8, -306, 155, 198, -171, 23, 170, -147, -48, 208, -89, -124, 177, -35, -179, 136, 113, -155, -61, 107, -21, -35, 73, -46, -101, 102, 93, -108, 48, 105, -98, -77, 79, 23, -147, -54, 47, -14, -51, 71, -35, -106, 112, 57, -159, 21, 214, -89, -135, 165, 77, -194, 33]
2562C3J46l04M8K47k95n8M25k21l43M45J02m71J54L78l87j34M41j27l21M02J6
2583A76n36M21L49o39k9N95l02l72N19j7m64L66J51m83K48L88n69r3O65k68m65
2604c59M96Q0n06L59J79n47K65L97o14m2O85l03n44O46J23o78L71L32o67K36N84
2625D93p05j81Q76l45p23P63K58q44K80O11p11j8P88o49l79R51k00r34P88M27
2645E46r85K67O86p05j46P91m80m64Q82q8r61O91N66j017J13Q37o84k56Q55m06
2665D2n74R08o8r26P10N36j053R2R24p49l28R95m17p21R79M6j087P22O73j192
2685d88R5J108p73n74J126k24j005J023K97j307N98R65j246j69J310p08q31J264
2703D61n5j162Q96N49j336L45J153j076m61J402n13j009J205J22j323Q12P65j320
$$ y = [33, 179, -125, -77, 170, -125, -183, 242, 21, -322, 123, 225, -246, -92, 286, -101, -235, 206, 79, -242, 160, 176, -360, 61, 410, -229, -258, 337, 35, -337, 182, 165, -299, 67, 218, -265, -17, 371, -198, -291, 374, 106, -359, 137, 217, -289, 70, 249, -298, -33, 364, -250, -292, 393, 90, -454, 192, 315, -363, 8, 340, -327, -91, 493, -212, -393, 483, 138, -585, 178, 436, -408, -128, 483, -228, -246, 542, -107, -486, 465, 265, -669, 119, 546, -439, -172, 514, -191, -337, 454, -26, -490, 392, 304, -657, 34, 600, -417, -304, 533, -151, -407, 448, 42, -532, 376, 308, -618, 92, 628, -425, -333, 591, -158, -486, 509, 92, -629, 350, 396, -691, 31, 704, -488, -393, 715, -58, -632, 494, 270, -735, 288, 585, -722, -124, 841, -405, -574, 736, 28, -803, 461, 406, -756, 140, 689, -647, -302, 851, -225, -686, 716, 203, -806, 399, 521, -802, 10, 775, -545]
2721e45J32J222r58o15J421l51j142J118K95j323O84R41j397l4J401q62p59J339
2739E67k08j232J041N68j397L70J141j255l07J588p19j135J378J87j373Q36P87
2756H37j460K16J341j150n94J591m39j342J256N81j591M80J109j228j44J401r20
2773e6q36J521j22j412J000P53j463K06J255j033m73J335n76r38J342O4j505Q71
2791f7R27j331%J245r20n50J328l29j103J117K92j433P17J077j406j98J370p06
2809C0p34J268k25j214J057N48j444M12J186j227l69J460n05j042J143J00j159
2826g15Q43O42j411K12J300r76o21J288l17j053J037L60j195N28P54j192R7J269
2844H50q86p35J240o7j026P93L20j084N03P88j040r7J093o94o93J231l9j188P58
$$ y = [-545, -413, 809, -149, -764, 657, 306, -836, 282, 577, -746, -62, 879, -518, -552, 849, -13, -772, 567, 359, -873, 168, 736, -661, -291, 850, -405, -712, 876, 157, -978, 400, 587, -786, 50, 837, -623, -407, 934, -216, -810, 781, 342, -1000, 256, 837, -754, -274, 835, -393, -537, 864, -56, -892, 629, 507, -905, 95, 848, -615, -409, 846, -187, -660, 675, 99, -839, 503, 567, -938, -67, 860, -471, -471, 774, -146, -696, 632, 303, -800, 317, 609, -824, -107, 970, -436, -634, 736, 30, -704, 564, 339, -875, 182, 730, -714, -302, 884, -343, -712, 748, 243, -799, 344, 444, -715, 128, 770, -641, -429, 871, -105, -726, 562, 245, -808, 229, 589, -606, -78, 676, -516, -419, 850, -36, -771, 469, 402, -624, 169, 489, -595, -92, 696, -344, -441, 652, -42, -735, 496, 457, -731, 27]
2863B7N00j007M23P25j078j39J253n66q58J089Q5j164P28O90j154J29R10q40k67
2882e14J226n07j049J047L99j126M04P30r71jJ049o99n92J070k19r75R05M61j160
2901e22K28Q43p21j60Q42n81n60J048Lj024O12N53r55J19Q88o86l63Q00l31m83
2921d50Q37m3j032O11P19q55j76Q45n13l84Q78k00p86P17K16r31N39P25r97k81
2941e61R81j91o04N64m9o41O26L94r38J35Q29o73l87R81j55q25M72L33m95K66
2961F2K73p16R3Q36m51o08O62J57o60L36L93n54jL97l72L7N33m49n06P00K63o52
2983b27M9L67l20L8L63l22j70M16j86l35N56Q2o57J23M97j57j96J65k06m6M73
3004C07j49m40K80K09l92R2L98k93l11L17O4p5J19j35k94L01L71m15k19L47j1
$$ y = [27, 527, -480, -57, 668, -410, -549, 704, 138, -720, 369, 454, -710, 18, 708, -446, -317, 593, -247, -514, 712, 205, -844, 203, 602, -524, -120, 610, -361, -362, 687, -12, -604, 466, 247, -728, 177, 638, -522, -294, 549, -172, -332, 510, -71, -631, 417, 420, -604, 8, 561, -394, -275, 613, -73, -436, 364, 33, -450, 387, 344, -688, -77, 642, -213, -389, 456, -57, -441, 437, 237, -549, 168, 384, -547, -8, 717, -280, -561, 420, 229, -375, 189, 140, -501, 125, 519, -419, -284, 545, -128, -515, 466, 311, -514, -42, 291, -204, 62, 335, -381, -288, 548, 97, -511, 151, 308, -352, -16, 377, -177, -178, 219, -153, -116, 417, -32, -538, 162, 425, -227, -178, 189, -131, -93, 270, -52, -222, 194, 8, -327, 229, 311, -346, -223, 274, 117, -79, 86, -120, -166, 307, 158, -282, -2, 207, -185, -93, 305, 12, -299, 18, 82, 7, 126, -9, -303, -2, 369, -46, -265, 82, 71]
3025G1j37J47K7k09N1L2j8J29M0k93p8L27J22k23j48R0J19N5q3r1O7K5n2P8P9
3050A27j09j08j9J79J26j50k19N7K17N1j39j16M1L6P9k1j3k1q2l4K01O6j71j24
3074a46OK18R0j09k24L9J99j4p0K1m3j05J42J50j54k7Rj22J92K22k87k47K73J28
3098A41j26K2k8j52R0K43j62j72K17j20j43L30J05m12J4K07n9Q4O8k65j22L79
3120A39L1k92J29jj99K00K35k88j13K13j58O9L26k34m04L23K42k76N9J34l77J03
3142a39M91k92l11L70q9l22M73J51n79j7M69k20m8L50l82l41O76R1o20K06L31
3163B48m87Q5N76m40l35N21j17l05N00N9p80K43P12m86k58M92k77k51O24r5o09
3184c80M13K56n87K65N28o59k89P13p5m24M33j19n63N81M47q13o4P22n13k25P93
$$ y = [71, -66, 81, 108, -101, -50, -18, -36, 93, 133, -160, -238, 89, 211, -12, -160, -70, 49, 104, 21, -70, -3, 22, -30, 48, 127, 18, -90, -109, 70, 196, 46, -173, -116, 101, 152, 13, -103, -62, -26, 53, 32, 19, -2, -84, -118, 83, 149, -22, -146, -140, 78, 168, 59, -165, -126, 73, 59, -11, 10, -33, -138, 4, 154, 0, -27, -18, -140, 52, 274, -13, -260, 13, 141, 15, 37, 9, -143, -53, 190, 28, -144, 73, -47, -190, 140, 245, -167, -153, 54, -5, 79, 147, -118, -240, 139, 170, -122, 7, 6, -193, 7, 242, -46, -159, 54, -104, -35, 291, 57, -347, -24, 218, -58, 1, 135, -242, -139, 352, 60, -251, 119, 30, -292, 181, 332, -247, -264, 205, -15, -63, 287, -95, -436, 240, 331, -289, -83, 248, -239, -154, 422, -18, -353, 168, 51, -254, 246, 305, -475, -232, 480, -6, -264, 228, -49, -300, 324, 229, -380, 33, 289, -298, -33, 495, -164, -453, 260, 185, -239, 194, 75, -488, 93, 540, -273, -337, 385, -128, -353, 440]
3205D40k43p11N51K73o04L78L66q86J3J019m18p02P17K6o65O07L43q72J58O19
3225D09n54j46Q47m73p77Q56L65q64K26M44o69J37P54o24m47Q34j54o06O56K32
3245D46r13J91P17m59j86N45m97l27R25r5q71M85M07o92K76N58o84k71P44j82
3265A17m22O49j43q24O57N95q52j14O77m70k22Q54l46p16O66K27p11M01M97q48
3285c28j23R46l05n67N70j33n47P02L11r41J38O79n01j76P18l68o25O99J82o37
3305c06L56K43p14K27P68n89m38O74j32m05N97M3q12L84N32o16K5O07o21l24Q72
3326C71p3p20M51J39n95N16M62q60j16Q21l49l98P14j58p50N57M69p37J39N30
3346D13p34m3R65m50p35O92K17o70M13L66q22R0P91n20l08P31l43o48Q05K90q71
$$ y = [440, 197, -514, 37, 310, -294, 84, 450, -436, -423, 596, 178, -524, 193, 219, -446, 161, 504, -368, -210, 409, -145, -291, 556, 83, -694, 162, 527, -337, -111, 333, -336, -199, 555, -69, -516, 318, 164, -442, 214, 446, -467, -276, 441, -18, -204, 341, -156, -483, 442, 347, -524, -39, 368, -324, -48, 510, -174, -445, 299, 117, -305, 344, 201, -623, 34, 629, -223, -337, 340, -130, -352, 502, 156, -560, 106, 333, -378, 23, 520, -328, -451, 495, 190, -377, 193, 60, -487, 215, 526, -415, -277, 402, -99, -275, 443, 75, -550, 149, 331, -306, 50, 293, -421, -194, 574, -15, -453, 221, 89, -316, 281, 324, -488, -104, 428, -188, -163, 444, -177, -501, 371, 298, -422, 29, 168, -427, 89, 551, -309, -425, 396, 47, -351, 363, 205, -545, 12, 481, -256, -117, 413, -321, -364, 601, 151, -584, 108, 325, -345, 68, 434, -388, -298, 493, -27, -335, 396, 53, -595, 210, 500, -371]
3367c71J38N52n20R1N81n63m21Q07m7o22N07K19p75K35P14n71k57N67l65k62P87
3388D24j32q66N14M64o44R4N77n80k75Q02j84n57N42J0o95N54N32q34j57P33l05
3409A7k91O04k09o36N83L47p14J92M62o30r7Q41k76n91M20J37m38M07K09o87R9
3430b51O52l94k77N15j87m70N22K38n41J09K64l94J29M83m41l87N54P5l81K63
3450H1J22n03J98M14l46j43L39k46j87N61k7n85K13L13k98O9K97l77j96N33n1
3471A81l75K65M2l90K78L67m32j63L54j20j33L47j43l80K74K71l04NJ61k55j1
3492a61L78j27k50J66Mj38K04J16l35l8K81q0MO8j81j18L26N1k88J24M3j79J52
3515B2J77k20j37J80m3j8J88q0l40K35K67k34n8J31j87KK70n8k44J42K7j17J49
$$ y = [-371, -233, 319, -201, -110, 471, -92, -513, 294, 247, -375, 132, 351, -424, -189, 525, -46, -303, 264, -101, -363, 424, 292, -574, -60, 404, -240, -146, 431, -149, -424, 378, 194, -363, 179, 189, -506, 48, 580, -254, -411, 322, 17, -274, 330, 121, -515, 68, 415, -299, -107, 355, -275, -372, 469, 193, -398, 22, 159, -279, 128, 337, -350, -251, 401, 7, -270, 245, 58, -412, 110, 348, -193, -84, 180, -214, -85, 398, -43, -430, 124, 199, -182, 81, 203, -300, -102, 312, -34, -177, 162, -84, -271, 290, 263, -322, -109, 204, -94, -25, 272, -105, -301, 232, 181, -194, 71, 113, -277, 1, 368, -64, -227, 127, 7, -126, 221, 78, -302, -28, 243, -61, -56, 105, -150, -161, 217, 90, -160, 6, 10, -128, 76, 192, -143, -181, 100, 20, 24, 92, -89, -207, 119, 170, -118, 6, 49, -130, 22, 199, -21, -158, 22, -21, -39, 149, 69, -271, -36, 231, -3, -61, 70, -117, -115, 155, 97, -147, -5, 22, -95, 54]
3538E4J28k76r6K58M3j27M9o2j21K32N6j96k5J16q2N4J28j00j58M8J33pJ0l4j67
3563a42R0K10r5j11M1j2J6Q5l1j08J9K1QJ06j0j57m8J48Q5r8n7j4k5R7J17j32
3589Cp3L8PM8J7Mj20m2J63N0q7o4MO4M0O0j09p7L0J13p4L0N7j61n2K04O2k19J8
3618f6N6j4P2L6j45q7J95J8j32J24Kk38Q3K89j47j63J11j4m4J79l3k58J01K41
3642A66j71l6J54j64j44L15Lk23J26K5j99J97J97l10j27L00p3j66K69o8k87K24
3664HJ78k82N1J87k83j3M16j78l37L02P9k91J84K00l72rL87j86k24L57j01l86
3686c13M00K07m69M7L31k48j23M00j93l24L86R5l87K24J98m44N5M69k90k60L40
3707A01o0k52L15Q8m45J38L26l00kL30k49k86M67K2m01K44J01l49K09K80l79j48
$$ y = [54, 182, -94, -190, 68, 111, -16, 33, -29, -150, 82, 138, -58, -83, 33, -49, 5, 133, 33, -125, -77, 56, 49, 59, 25, -142, -52, 158, 63, -48, -7, -19, -3, 82, 51, -57, -38, -17, -9, 97, 87, -70, -118, 30, 115, 17, -40, -54, -79, 18, 135, 3, -70, -32, -25, 23, 40, 44, -76, -118, 45, 95, 8, -56, -52, 12, 52, 112, 3, -74, -44, 69, -5, 25, 82, -79, -131, 73, 135, -84, -66, -10, -24, 48, 84, -61, -148, 47, 65, -67, 57, 59, -179, -96, 193, 46, -117, -6, -20, -64, 115, 82, -176, -75, 166, -5, -41, 113, -51, -195, 120, 123, -100, 26, 51, -148, 49, 246, -64, -191, 109, 36, -130, 139, 71, -216, 8, 186, -96, -45, 142, -141, -154, 262, 84, -253, 49, 128, -163, 21, 221, -151, -160, 227, 41, -183, 174, 73, -313, 87, 294, -175, -128, 203, -45, -168, 232, 39, -285, 101, 196, -191, 33, 231, -213, -158, 311, 21, -239, 101, 41, -211, 104, 192, -253, -115, 211, -89, -91, 239, -10, -296, 171, 193, -208, 36, 137, -212, -3, 277, -102, -250]
3729b50M45j44k54L74Km41K82K53m00N0L17l70r7N35k19l99L89J06m26K55K77
3750B85m51k2M14k32j99M18j41m30M40K07m83J07L41l67k6M18k78k65M17k2l81
3771b50L28J20m32J20M22l32j33L53k09k28M44m6m43L15K16m43J05L85l72j93
3791b73M91j18l18L76k1m31L63K67n47J1M63k94j92M53j24m21M00J81m88K26L25
3812C29n30l2O12l00m22M91Nm30L41K31n24J08M46m12j59N27j97m39M76J26n20
3833b73K24K67m27Q2M60l97k48N37r6m49M05J74n47J88M01m05n8M41l17k39N45
3854B68q5n24L67K37m60Q0M43m29j76N27j72l73M90j4n51L90L40n78j9N26l17
3875c0k44N19j27m62M33J85n51J96M31n40p1N54k44l69M74L8m54L16J88m61J08
$$ y = [-250, 195, 51, -203, 171, 173, -268, 14, 267, -133, -83, 234, -136, -233, 302, 83, -316, 73, 179, -247, 8, 285, -166, -188, 226, -6, -205, 213, 72, -358, 82, 289, -194, -87, 254, -113, -139, 279, 1, -264, 153, 131, -250, 78, 198, -234, -114, 308, -24, -157, 196, -13, -241, 203, 157, -286, 29, 245, -198, -93, 292, -80, -273, 218, 100, -218, 158, 137, -294, 69, 336, -211, -200, 263, -31, -223, 230, 106, -315, 85, 266, -222, 4, 329, -201, -233, 379, 79, -343, 148, 153, -277, 64, 295, -229, -121, 325, -87, -246, 281, 84, -355, 121, 247, -273, -49, 218, -209, -127, 333, -64, -312, 225, 129, -320, 85, 259, -288, -100, 301, -104, -162, 279, -38, -277, 268, 183, -341, 26, 263, -197, -117, 326, -103, -279, 248, 76, -297, 193, 179, -372, 18, 358, -220, -239, 287, -30, -274, 245, 118, -344, 89, 274, -277, -81, 350, -190, -261, 293, 49, -320, 154, 192, -262, 54, 242, -219, -111]
3896a11M27l83j46M93k08l91M54Q1m55K25K42l89M6M04l68j86M49r8l66L79J09
3917B08m45J74L26l82l3L96k78k36M95q7l99K90J69m23J41L39l71p1M32k18k52
3938b25L79j1l82K64K16m11N7L26k43j43L75j43k62K83J24l98J73K16l40J4L30
3959A99k14j64L14n0k77K74O8l21J48K33k99KK55j65j86L37p4k78K76N4k81J34
3981a5K19k94j7K72j44j77K99o2k68K33J56l35N9K70k58r2L43j51k47K72N9l01
4003a79J86J53k79PK72j52j74K74m0k54K33R9k89J17J63k09l2K34j12j63K33J8
4025A06k17J33J00k34J01J70k25o1K58j00j76K41kk34J25J42j95J5J81j78p7K19
4047I2l0k35K16Q0k46J05J69j86m8J95j36q1J95j5k16J70J15k08l8K12j05j32
$$ y = [-111, 316, -67, -213, 280, 72, -319, 135, 216, -239, -14, 228, -161, -115, 289, -79, -265, 184, 86, -280, 99, 208, -237, -63, 263, -119, -152, 244, -34, -270, 225, 138, -261, 29, 198, -225, -84, 255, -116, -187, 245, 27, -225, 154, 143, -239, 25, 241, -170, -113, 213, -30, -173, 202, 59, -203, 80, 204, -194, -21, 195, -145, -131, 199, -15, -179, 135, 85, -192, 82, 150, -171, -23, 210, -89, -87, 168, 3, -183, 154, 80, -198, 78, 132, -149, -15, 204, -90, -107, 165, 21, -156, 143, 81, -187, 46, 202, -133, -74, 196, -62, -154, 189, 38, -209, 63, 122, -179, 7, 160, -119, -112, 160, 8, -166, 108, 68, -186, 47, 146, -143, -26, 137, -72, -104, 130, 18, -145, 88, 106, -111, 22, 122, -112, -11, 159, -66, -127, 131, 31, -145, 96, 94, -140, -15, 127, -68, -53, 128, -50, -127, 92, 62, -173, 43, 123, -123, -18, 151, -35, -83, 112, -24, -105, 90, 75, -141, 29, 144, -64, -102, 110, 5, -127]
4069a27K04j1j48J12M6j19O7P2j30l7J27j9j02O8N8r7M5J0p0N3O0r9PQ8n6p2P5
4096EN1k9j5j2j4K3M9q9QO4m0m9N9kk3K6mK7J7l8m0j5P8j6n5J9K8rj2jL3mn1J3
4130a8J7j5qK3l3K6O0n8p8J30L6j38L7O8j7o8J10m9p9Q8Kq7R1N4j54lJ81r8r0
4159g0J22Pj28P1N6j24L6J05j37j8J88o6j42J10P5j24L4N4q2kQ9q5l0J70o9j43
4185a03J70L4j56O5P1j07J0J10j34k5J66p3j27J47M5j72M4J45j69KJ65j29r0K07
4209I6n9j75J88M8j83L8J55j31q5K32j19j38J85J1j91J27J56k60N2K02j54r0K13
4232A18p9j31J53L3j89J01J01j78nK28j73o5J61o9j05J52J2j95J42J14k13K6K02
4255A41j73p7K36q7k07K44K8k66J43J95k90K0K69k02j10K90r5k18K19J07l20J11
$$ y = [-127, 77, 66, -82, 30, 76, -43, 24, 96, -34, -71, 56, 37, -65, 3, 61, -36, 9, 19, -51, 2, 62, -37, -30, 58, 2, -70, 5, 56, 27, 12, 0, -14, 9, 58, -31, -23, 41, 1, -48, 11, 9, -14, 12, 8, 35, 52, 14, -26, -41, 37, 21, -34, -15, 13, 4, -8, -9, 24, 20, -31, -18, -1, -16, -24, -1, -34, -8, 52, -6, -84, 46, 82, -56, -19, 49, 32, -36, 74, 25, -54, 34, 36, -51, 40, 94, -60, -63, 118, 20, -70, 52, 59, -69, 2, 58, -66, -30, 75, -62, -80, 108, 42, -100, 10, 85, -39, -5, 49, -33, -35, 54, -31, -61, 109, 40, -103, 67, 101, -55, 10, 81, -26, -16, 94, -40, -65, 101, 28, -99, 48, 93, -79, -35, 110, -59, -57, 108, -21, -111, 96, 37, -138, 50, 98, -85, -47, 108, -23, -108, 124, 5, -133, 52, 63, -128, -1, 155, -105, -53, 149, -5, -95, 118, 39, -92, 61, 94, -95, 6, 107, -71, -76, 152, -21, -86, 75, 6, -99, 53, 65, -130, 12, 126, -87, -61, 141, -32, -109, 127, 40, -167, 77, 105, -161, -18, 177, -113, -93, 176, -26, -136, 154, 59, -159, 60, 167, -153, -42]
4277d2K61k87o3L21j73j95K85ok84K00J52l19Q2K48k33j14L20r4k46K37Q5l21
4299a86J48K33k93mK74k11j24K99p7k42K54J19l70J29K72l21j4K78j46k14L37
4320A41rl39K44J65l41L8L59l25j11L96j46l06L16Q8l92J76K49l46j5L73k30k07
4342b22L78l2l32K54J49l74P4L41l01j35L87j38k60L34K3l55K22J92l22JL18k47
4364d5j34L46p0l29L11J05l55J42K34l08k6L32k20j53L02n7l08L02J38l73R7K62
4386A93k49p1K92j62j95L32l9k85K43J55l81N0L22k38j33L34r5k61K82M7l14J52
4408b1K01l03J3L28k07k01L24j4l26K19J11k70J47J82l05kL08j92k07L07nk54
4430a67J89J12k54J18J72k73k4L28j82k10K91Rk69J85J56l28R7K27k26o5K86j57
$$ y = [-42, 219, -68, -131, 190, 17, -178, 107, 101, -183, 17, 169, -150, -68, 180, -53, -167, 153, 59, -187, 50, 135, -186, -38, 195, -98, -102, 172, -39, -163, 136, 59, -183, 71, 190, -180, -51, 221, -100, -114, 164, 18, -196, 141, 132, -207, 37, 202, -139, -101, 258, -67, -178, 218, 72, -234, 82, 170, -222, -46, 203, -143, -158, 215, -15, -222, 156, 124, -208, 46, 195, -179, -105, 236, -65, -200, 187, 49, -211, 123, 146, -209, 13, 205, -117, -116, 202, -45, -179, 167, 97, -232, 79, 184, -171, -29, 205, -103, -129, 203, -17, -170, 132, 75, -233, 69, 207, -166, -69, 193, -56, -127, 165, 3, -192, 140, 101, -184, 59, 214, -167, -117, 205, -33, -166, 168, 73, -188, 94, 141, -173, -21, 180, -123, -110, 218, 11, -190, 134, 120, -206, 13, 124, -146, 1, 183, -122, -124, 184, -8, -215, 92, 87, -167, 22, 134, -120, -2, 170, -103, -127, 201, 19, -191, 100, 109, -160, 25, 181, -147, -50, 177, -49, -114, 172, 15]
4452A5k23L15M9l21J53J89l07L6K86k34j33L18o9k94L14L1k83J31K35k62l6K62
4474A72j57j85L02Rl15K04J17k87Q6K29k32o0K62j12j75K32K9k85J70J55k42L
4496h0K15j70q4K53r5k32K46O3k65J45J37k56J3K56j43j51K24k6k25K48J30l63
4518a60P8K43j96q4K60j26j48K28J8k59J42J74k67J0K72j65k05K54Qj76J26N7
4540H4k01R3J53j84p5K33q4j47K09J9j98O5Q9j16Q3O9j53p0K38l9j51J05M6j21
4564e3L4J02j09j1J19j36l1K22j04j73J66Q0j35KO4o9QR1o3q6J19j0j38J19J17
4589A25j79j1Q6qk2M0n6n1J08L2j17K2Q7r6J3O3%q6L6j2K1O8n5q4Q2O2n4qpMj1
4620hK4Nl9M2p0OQ3Pj20L4N4k6J7qk5kP9m8k6M0jo8K2O1l4l3RJ5L1L3m8p4J01
$$ y = [15, -208, 107, 156, -165, -12, 177, -130, -94, 192, -42, -175, 143, 74, -220, 94, 125, -158, -27, 208, -54, -90, 172, 15, -170, 132, 141, -174, 30, 147, -140, -54, 175, -57, -117, 145, 33, -142, 90, 119, -166, 4, 159, -83, -80, 135, -35, -119, 134, 39, -193, 53, 116, -149, -4, 133, -123, -110, 146, 3, -148, 76, 50, -175, 73, 203, -160, -82, 161, -35, -119, 141, 15, -133, 95, 113, -146, -4, 170, -97, -87, 185, 20, -185, 69, 77, -99, 27, 84, -117, -24, 129, -55, -130, 103, 19, -128, 81, 100, -98, -33, 56, -60, 23, 92, -61, -131, 107, 68, -83, 22, 68, -53, -19, 83, -26, -37, 82, -54, -85, 137, 33, -140, 26, 106, -29, -27, 37, -32, -24, 67, 4, -82, 37, 27, -111, 8, 125, -54, -65, 21, 13, -9, 31, -25, -76, 32, 64, -53, -31, 56, -40, -27, 36, 36, -50, -14, -26, -5, 63, 8, -76, 6, 68, 14, 6, -1, 3, -8, 16, 21, -18, 24, -46, -40, 43, 50, -70, -36, 18, -8, 9, 1, -24, -26, 53, 5, -21, 19, 18, -50, -28, 33, -1, -34, -25, -10, 21, 54, 6, -68, 33]
4653C3Om3K8l5L4k0J2Kk5L5o3J1N8j7o0J1M5j1L7o6m6O6N9o6j0L5k2j0N7Ln4Q
4685hl0j0R1J4j18OJ02qm2njl8N4K1l9L3l3l0L5Q2n9p9M2L2%N2r5k9O4J4p7N8
4717aL0r5K3R6l0l8M8p1j2J50n0j36P0J02o5l9R5j00l6J09rr0R1K4j73R9J50j66
4745b4r1J39K8j01R6rj60J16J26j68j6J67j40o3K14j6j75O4O8j18R3Q3k18OJ89
4770I0n6j25J48%j70J40R3j72LJ46j31j8K16j15k13K27O6k23J30P7k11K1K01j06
4794A8j34K02m5j94K01R6k92O6K14j76n6K04j21j58K44M1k37J35J14k26L8K17
4816A51j41j69K65l6j55J47M0k18P8J82j67n9J72j16j32K77nk51J01J50k16Q4
4838a8J62k07o6K31q3j29J90l8k04J80J62k52PJ86j50m7K22r5k18K13N0k20J32
$$ y = [33, 39, -4, 24, -11, 23, 3, 15, 17, -8, 27, -36, -25, 33, 16, -44, -33, 12, 1, 38, -28, -74, -8, 51, -15, -25, 10, -12, -22, 35, 38, -16, -8, -38, -48, 43, 57, -61, -55, 47, 39, -3, -8, -9, -47, 7, 28, -11, 22, -11, -41, -6, 76, 17, -62, -20, 12, 12, 64, -31, -60, 4, 18, -59, -1, 29, -66, -43, 53, 23, -15, 33, -38, -50, 100, 50, -86, -16, 86, 21, -18, 77, -23, -59, 50, 41, -49, 42, 66, -107, -8, 142, -24, -115, 24, 52, -49, 47, 38, -122, -6, 120, -48, -64, 103, -37, -100, 114, 98, -77, -13, 55, -63, 30, 113, -105, -99, 90, 34, -91, 57, 57, -113, 27, 120, -52, -49, 97, -34, -52, 164, 49, -164, 63, 129, -94, 36, 113, -98, -77, 124, 18, -116, 86, 41, -153, 48, 144, -148, -82, 132, -44, -100, 104, -17, -175, 69, 110, -127, 8, 122, -104, -66, 151, 10, -159, 106, 70, -85, 62, 102, -116, -38, 144, -23, -82, 90, -26, -158, 119, 114, -137, -36, 114, -102, -18, 144, -63, -129, 102, 19, -110, 80, 42, -162, 18, 180, -72, -65, 121, -29, -76, 146, 51, -167, 46, 96, -124, 8]
4861HJ41k44oK60r3j84K05n7j54K00P0k62K5K44j84l0J75j08j64K23M0j83R1O1
4885G4k13R7K30k03j27K16k4j43J87k9j94J20J15j75K6J71j93p7K94l2k35J37
4907B2L3j80J79J06k81K6K48j61r5K15p7k32K34R1k22P7J44k30K4K71j77k26K76
4930F5L2k36J74R2k52P1K25k01p9K37j17j91K83J05l42R4J65j77L2K09k40j00
4952a51K79rk22J61Q9l22J27K00j70q0J80j22q0K97r6k99K07J59k31M4J87k17
4974f9o6K66j03j54K03rk53K10K02l46k7K94j17j23J95p0j99K39P3k59J08J74
4996A69k68k9L27j04k77K06N5j79J31P5k53O1K74j85j26K04l2j90J65J05j96K1
5018d6J09j19L3J88k00j23K74Lk05R7M8j58N2J79j52rJ18j33m7K01Lk79J11J86
$$ y = [8, 149, -95, -101, 159, 66, -118, 87, 30, -124, 76, 146, -116, -91, 153, -31, -61, 114, 6, -158, 65, 105, -78, 13, 74, -139, -42, 188, -15, -142, 74, 50, -93, 94, 65, -129, -9, 106, -69, -43, 128, -65, -142, 152, 120, -115, 22, 55, -125, 54, 160, -121, -95, 153, -8, -103, 112, 35, -197, 37, 128, -94, -17, 127, -103, -79, 192, 15, -211, 65, 97, -139, 35, 127, -125, -54, 171, -30, -109, 128, 11, -180, 103, 208, -134, -40, 125, -52, -20, 189, -51, -151, 128, 119, -103, 58, 147, -175, -48, 152, -18, -98, 82, -40, -120, 177, 81, -218, -11, 148, -83, -39, 148, -69, -135, 131, 28, -126, 77, 68, -185, 25, 227, -119, -146, 148, 31, -92, 103, 33, -166, 73, 146, -113, -5, 169, -99, -128, 199, 95, -182, 24, 79, -100, 31, 106, -147, -86, 188, 3, -123, 81, 49, -141, 24, 129, -67, -46, 63, -56, -23, 165, -35, -158, 116, 119, -86, 11, 59, -99, -47, 132, -20, -29, 89, -44, -91, 110, 113, -166, -55, 131]
5042A31j48j0J01j13n7J90o8j18J49K2k18J02J99j64j09J49m6m5J48q4j69J97
5064C9Q6j86J9J29r9n1J68n3j19Q2k1n0J27pj60L7J67o2o5L1l1m0Q4K4r5P4jr3
5092f6N7J13j32o3J09K5m2N1p1o7J26P0j47J4J00j11m8J63%j24L8M0p4J04J5j73
5118i3QJ58l7j08J19j2q6P0P2j28J2O3n3jR9o7j01P8Q9o1l3Lk2N3M7r8k2Q9k9
5147Ip5J09K5j17NQ1l2K7jp3J3J07l6q2L2P7j15K6R0m8o2N4%m1R8m9j31Q8J19
5176I8j16m3O3rqK0M1o6k7N2m0O9N3j25m8R1Q9q1n4M6K3poJm0MO0m1J0M4p9l6
5208f2Q1O1q0m9M6K1rJ9m7mL5pl8N0Op2k8J17Jr3J9PQN2qr2M5P7n1l3O5lq3N4
5242EN6p5J0J5p4O5Q1r7m3Q4K2j07N1M9r5M5O2m5m9Q5m3q9J36N5j61PJ09p3oP5
$$ y = [131, -17, -27, 74, -39, -96, 94, 26, -92, 57, 79, -139, -37, 162, -2, -111, 38, -8, -53, 95, 11, -158, 39, 125, -61, -42, 87, -12, -63, 105, 52, -67, 15, -6, -56, 71, 64, -96, -59, 108, 46, -19, 12, -19, -59, 25, 49, -46, 28, 27, -66, -9, 104, -28, -91, 18, 43, 1, 52, -19, -86, 40, 110, -37, -23, 77, -34, -82, 81, 81, -43, -5, 35, -39, 65, 80, -93, -85, 73, 36, -72, 47, 35, -51, 19, 91, -37, -25, 38, -15, -16, 83, 16, -85, -7, 82, 21, -12, -9, -31, 22, 69, -29, -51, 38, 9, -66, 43, 68, -49, -44, 37, 5, 32, 31, -42, -29, 78, 42, -40, -8, 69, -46, -20, 70, 22, -40, 14, 14, -27, 71, 22, -109, -21, 98, -18, -61, 2, -7, -15, 5, 46, -20, -47, 5, -35, 34, 87, -38, -86, 5, 94, 13, -41, 5, 28, 21, 15, 16, -24, -20, 40, -1, 9, 53, -26, -62, 19, 80, 0, -49, -3, 18, 9, 28, -19, -23, 12, 5, -33, 17, 23, -49, -77, 40, 41, -52, -33, -26, -18, 34, 26, -66, -21, 56, 5, -28, 37, 34, -49, 5, 61, -14, -4, 11, -63, 2, 83, -14, -57, 27, 49, -58, -7, 42, -53, -8, 54, 9, -40, 45, 2, -87, 49, 104, -57, -50, 59, -14, -20, 55]
5272E5q4o3J24J7r3L7P7j20PJ32m6j18R0%m0J01l5j32M8J47j11o4Q6k1p0J30J9
5299G3j17N1J5q4O4P7j28o5J69kj28J09J1j11Q0N2j30M0J30j39m0J60k5j58R5
5324aM0o1L3N1j20M1J21q5j23J64k1j36R9J41k01lJ32r5RR0j08p7J49M0j42L5
$$ y = [55, -29, -92, 32, 49, -44, -7, 70, -50, -43, 89, 43, -75, 15, 15, -25, 76, 41, -91, -43, 104, -7, -71, 15, -6, -76, 54, 73, -44, 7, 22, -62, 2, 79, -49, -114, 55, 53, -75, 34, 45, -66, 14, 66, -64, -24, 106, -33, -73, 87, 62, -96, -1, 39, -22, 11, 62, -58, -17, 104, 19, -104, 60, 39, -97, 2, 143, -58, -61, 71, -24, -15, 75, -33, -110, 39, 79, -63, -28]
$$ [...]
8191C6
##END NTUPLES=NMR FID
##END=
