##TITLE=1H_IVA 1502
 CDCl3
 8sc, 
 16.2.2024
##JCAMPDX= 6.0         $$ Bruker NMR JCAMP-DX V2.0
##DATA TYPE= NMR FID
##DATA CLASS= NTUPLES
##ORIGIN= UXNMR, Bruker Analytische Messtechnik GmbH
##OWNER= root
$$ XWIN-NMR		Version 3.5
$$ Fri Feb 16 14:17:46 2024 Russian Standard Time (UT+4h)  she@DPX200
##.OBSERVE FREQUENCY= 200.1313
##.OBSERVE NUCLEUS= ^1H
##.DELAY= (6, 6)
##.ACQUISITION MODE= SIMULTANEOUS
##.ACQUISITION SCHEME= undefined
##.AVERAGES= 8
##.DIGITISER RES= 18
##SPECTROMETER/DATA SYSTEM= spect
##.PULSE SEQUENCE= zg30
##.SOLVENT NAME= DMSO
##.SHIFT REFERENCE= (INTERNAL, DMSO, 0, 15.7039)
##AUDIT TRAIL= $$ (NUMBER, WHEN, WHO, WHERE, WHAT)
$$ ##TITLE= Audit trail, XWIN-NMR		Version 3.5
$$ ##JCAMPDX= 5.01
$$ ##ORIGIN= Bruker BioSpin GmbH
$$ ##OWNER= she
$$ F:/spectra/data/she/nmr/H-F/1/audita.txt
$$ ##AUDIT TRAIL=  $$ (NUMBER, WHEN, WHO, WHERE, WHAT)
(   1,<2024-02-16 14:16:22.10 +0400>,<she>,<DPX200>,
      <created by zg, POWCHK disabled, PULCHK disabled
       configuration hash MD5:
       00 E9 B6 7A A2 85 ED C7 34 08 36 98 17 FE 4E 26
       data hash MD5: 16K
       72 C5 61 FB CA 7B 06 65 27 F8 C5 3E B6 D7 BD 7E>)
$$ ##END=
$$ 
$$ hash MD5
$$ E5 BE 6F 77 F5 7F B0 52 1D E1 82 82 5E 8D 29 0A
##$RELAX= 
##$RELAX= 
##$RELAX= 
##$RELAX= 
##$RELAX= 
##$RELAX= 
$$ Bruker specific parameters
$$ --------------------------
##$DU= <F:/spectra>
##$EXPNO= 1
##$NAME= <H-F>
##$PROCNO= 1
##$TYPE= <nmr>
##$USER= <she>
##$AMP= (0..31)
100 100 100 100 100 100 100 100 100 100 100 100 100 100 100 100 100 100 
100 100 100 100 100 100 100 100 100 100 100 100 100 100 
##$AQSEQ= 0
##$AQ_mod= 1
##$AUNM= <au_zg>
##$AUTOPOS= <>
##$BF1= 200.13
##$BF2= 200.13
##$BF3= 200.13
##$BF4= 200.13
##$BF5= 200.13
##$BF6= 200.13
##$BF7= 200.13
##$BF8= 200.13
##$BYTORDA= 1
##$CFDGTYP= 0
##$CFRGTYP= 5
##$CHEMSTR= <none>
##$CNST= (0..31)
1 1 145 1 1 1 1 1 1 1 1 1 1 1 1 1 1 1 1 1 1 1 1 1 1 1 1 1 1 1 1 1 
##$CPDPRG= <>
##$CPDPRG1= <>
##$CPDPRG2= <>
##$CPDPRG3= <>
##$CPDPRG4= <mlev>
##$CPDPRG5= <mlev>
##$CPDPRG6= <mlev>
##$CPDPRG7= <mlev>
##$CPDPRG8= <mlev>
##$CPDPRGB= <>
##$CPDPRGT= <>
##$D= (0..31)
0 1.2 0 0 0 0 0 0 0 0.06 0 0.03 0 0 0 0 0.0002 0 0 0 0 0 0 0 0 0 0 0 0 
0 0 0 
##$DATE= 1708078581
##$DBL= (0..7)
120 120 120 120 120 120 120 120 
##$DBP= (0..7)
150 150 150 150 150 150 150 150 
##$DBP07= 0
##$DBPNAM0= <>
##$DBPNAM1= <>
##$DBPNAM2= <>
##$DBPNAM3= <>
##$DBPNAM4= <>
##$DBPNAM5= <>
##$DBPNAM6= <>
##$DBPNAM7= <>
##$DBPOAL= (0..7)
0.5 0.5 0.5 0.5 0.5 0.5 0.5 0.5 
##$DBPOFFS= (0..7)
0 0 0 0 0 0 0 0 
##$DE= 6
##$DECBNUC= <off>
##$DECIM= 32
##$DECNUC= <off>
##$DECSTAT= 4
##$DIGMOD= 1
##$DIGTYP= 9
##$DL= (0..7)
0 120 120 120 120 120 120 120 
##$DP= (0..7)
150 150 150 150 150 150 150 150 
##$DP07= 0
##$DPNAME0= <>
##$DPNAME1= <>
##$DPNAME2= <>
##$DPNAME3= <>
##$DPNAME4= <>
##$DPNAME5= <>
##$DPNAME6= <>
##$DPNAME7= <>
##$DPOAL= (0..7)
0.5 0.5 0.5 0.5 0.5 0.5 0.5 0.5 
##$DPOFFS= (0..7)
0 0 0 0 0 0 0 0 
##$DQDMODE= 0
##$DR= 18
##$DS= 0
##$DSLIST= <SSSSSSSSSSSSSSS>
$$ [...]
##$SUBNAM2= <"">
##$SUBNAM3= <"">
##$SUBNAM4= <"">
##$SUBNAM5= <"">
##$SUBNAM6= <"">
##$SUBNAM7= <"">
##$SUBNAM8= <"">
##$SUBNAM9= <"">
##$SW= 18.0517328524113
##$SWIBOX= (0..15)
0 0 2 0 0 0 0 0 0 0 0 0 0 0 0 0 
##$SW_h= 3612.71676300578
##$TD= 16384
##$TD0= 1
##$TE= 0
##$TE2= 300
##$TE3= 300
##$TEG= 300
##$TL= (0..7)
0 120 120 120 120 120 120 120 
##$TP= (0..7)
150 150 150 150 150 150 150 150 
##$TP07= 0
##$TPNAME0= <>
##$TPNAME1= <>
##$TPNAME2= <>
##$TPNAME3= <>
##$TPNAME4= <>
##$TPNAME5= <>
##$TPNAME6= <>
##$TPNAME7= <>
##$TPOAL= (0..7)
0.5 0.5 0.5 0.5 0.5 0.5 0.5 0.5 
##$TPOFFS= (0..7)
0 0 0 0 0 0 0 0 
##$TUNHIN= 0
##$TUNHOUT= 0
##$TUNXOUT= 0
##$USERA1= <user>
##$USERA2= <user>
##$USERA3= <user>
##$USERA4= <user>
##$USERA5= <user>
##$V9= 5
##$VALIST= <valist>
##$VCLIST= <CCCCCCCCCCCCCCC>
##$VD= 0
##$VDLIST= <DDDDDDDDDDDDDDD>
##$VPLIST= <PPPPPPPPPPPPPPP>
##$VTLIST= <TTTTTTTTTTTTTTT>
##$WBST= 1024
##$WBSW= 4
##$XGAIN= (0..3)
0 0 0 0 
##$XL= 0
##$YL= 0
##$YMAX_a= 46518
##$YMIN_a= -46643
##$ZGOPTNS= <>
##$ZL1= 120
##$ZL2= 120
##$ZL3= 120
##$ZL4= 120
##$ABSF1= 10
##$ABSF2= 0
##$ABSG= 5
##$ABSL= 3
##$ALPHA= 0
##$AQORDER= 0
##$ASSFAC= 0
##$ASSFACI= 0
##$ASSFACX= 0
##$ASSWID= 0
##$AUNMP= <proc_1d>
##$AZFE= 0.1
##$AZFW= 0.1
##$BCFW= 1
##$BC_mod= 2
##$BYTORDP= 1
##$COROFFS= 0
##$CY= 11.3945322036743
##$DATMOD= 1
##$DC= 2
##$DFILT= <>
##$DTYPP= 0
##$F1P= 15.7292609196834
##$F2P= 12.9074282941183
##$FCOR= 0.5
##$FTSIZE= 0
##$FT_mod= 4
##$GAMMA= 1
##$GB= 0.15
##$INTBC= 1
##$INTSCL= 1
##$ISEN= 128
##$LB= 0.24
##$LEV0= 0
##$LPBIN= 0
##$MAXI= 10000
##$MC2= 0
##$MEAN= 0
##$ME_mod= 0
##$MI= 1.114404
##$NCOEF= 0
##$NC_proc= 0
##$NLEV= 6
##$NOISF1= 3.799351
##$NOISF2= 2.8
##$NSP= 1
##$NTH_PI= 0
##$NZP= 0
##$OFFSET= 15.70392
##$PC= 1
##$PHC0= -25038.06
##$PHC1= 11.45264
##$PH_mod= 1
##$PKNL= yes
##$PPARMOD= 0
##$PSCAL= 0
##$PSIGN= 0
##$REVERSE= no
##$SF= 200.130013532006
##$SI= 16384
##$SIGF1= 3
##$SIGF2= 2
##$SINO= 400
##$SIOLD= 16384
##$SREGLST= <1H.CDCl3>
##$SSB= 0
##$STSI= 0
##$STSR= 0
##$SW_p= 3612.71676300578
##$SYMM= 0
##$S_DEV= 0
##$TDeff= 0
##$TDoff= 0
##$TI= <>
##$TILT= no
##$TM1= 0
##$TM2= 0
##$TOPLEV= 0
##$USERP1= <user>
##$USERP2= <user>
##$USERP3= <user>
##$USERP4= <user>
##$USERP5= <user>
##$WDW= 1
##$XDIM= 8192
##$YMAX_p= 0
##$YMIN_p= 0
$$ End of Bruker specific parameters
$$ ---------------------------------
##NTUPLES= NMR FID
##VAR_NAME=  TIME,          FID/REAL,        FID/IMAG
##SYMBOL=    X,             R,               I
##VAR_TYPE=  INDEPENDENT,   DEPENDENT,       DEPENDENT
##VAR_FORM=  AFFN,          ASDF,            ASDF
##VAR_DIM=   8192,          8192,            8192
##UNITS=     SECONDS,       ARBITRARY UNITS, ARBITRARY UNITS
##FACTOR=    0.0002768,     1,               1
##FIRST=     0,             0,               0
##LAST=      2.2672688,     0,               0
##MIN=       0,             -46643,          0
##MAX=       2.2672688,     46518,           0
$$ Real data points
##PAGE= N=1
##DATA TABLE= (X++(R..R)), XYDATA
$$ [...]
$$ plain form
935 -411 247 344 -615 -86 677 -362 -487 672 -40 -762 534 363 -818 270 593 -891 10 1047
953 1047 -744 -640 1137 -148 -1015 918 385 -1210 482 821 -1171 102 1215 -1129 -594 1611
969 1611 -465 -1285 1339 280 -1535 880 907 -1527 284 1332 -1418 -344 1872 -973 -1361 1866
985 1866 23 -1881 1296 844 -1971 589 1466 -1760 -109 1967 -1447 -1116 2352 -386 -2089 1804
1001 1804 769 -2285 954 1558 -2098 78 2007 -1758 -762 2550 -1017 -2054 2373 473 -2586
1016 -2586 1342 1519 -2412 338 2099 -1993 -492 2564 -1547 -1705 2903 -147 -2838 1945 1344 -2792
1032 -2792 730 2112 -2348 -285 2559 -1854 -1260 3106 -902 -2751 2744 977 -3208 1296 2090
1047 2090 -2776 92 2637 -2160 -937 3066 -1462 -2316 3273 287 -3505 1947 1970 -3150 490 2651
$$ packed form
935d11O58R7r59N29P63j039j25J159p12p22J296j71j181J088L23j484R01J037
953A047j791J04J777j285q67J933n33j595J692L39j992J273J113k344N35K205
969A611k076q20K624j059j815K415K7k434J811J048k750J074K216k845l88L227
985A866j843j904L177m52k815K560Q77l226J651K076l414L31L468k738j703L893
1001A804j035l054L239O04l656K176J929l765R96L312l567j037M427j900l059
1016b586L928J77l931K750J761m092J501L056m111j58M608l050k691M783o01m136
1032b792L522J382m460K063K844m413N94M366m008j849N495j767m185M504P94
1047B090m866K868K545m797J223M003m528q54N589k986l792N452K3n120L640K161
$$ plain form
1063 2651 -2531 -656 3075 -1792 -1816 3391 -523 -3312 2692 1567 -3567 934 2573 -2898 -278
1078 -278 3125 -2165 -1530 3403 -1090 -2824 3268 741 -3787 1728 2421 -3272 220 3069 -2665 -1114
1094 -1114 3601 -1541 -2479 3481 -85 -3648 2617 1876 -3759 824 2901 -3085 -486 3652 -2188
1109 -2188 -2196 3723 -539 -3290 3050 1108 -3931 1596 2645 -3447 55 3414 -2800 -1598 4013 -1074
1125 -1074 -3117 3197 587 -3620 2226 2087 -3746 673 3218 -3143 -865 4056 -1901 -2868 3642
1140 3642 245 -3445 2415 1393 -3677 1414 2784 -3518 -202 3792 -2686 -2155 4232 -522 -3616
1155 -3616 2782 1127 -3405 1874 2051 -3748 582 3496 -3153 -1370 4299 -1522 -3402 3500 906
1170 906 -3524 1882 1552 -3453 1352 2944 -3586 -634 4101 -2176 -2683 3987 167 -3753 2179 1566
$$ packed form
1063B651n182J875L731m867k4N207l914k789O004j125n134M501J639n471K620
1078b78L403n290O35M933m493j734O092k527m528N515O93n693L492K849n734J551
1094a114M715n142r38N960l566l563O265p41n635M583K077n986K599M138n840
1109b188qN919m262k751O340j942n039N527J049o092L502L359o214J202N611n087
1125a074k043O314k610m207N846j39n833M419K545o361K278M921n957r67O510
1140C642l397l690N860j022n070N091J370o302L316L994o478N31O387m754l094
1155c616O398j655m532N279J77n799M330K914o649J783N669n821j880O902k594
1170I06m430N406l30n005M805J592o530K952M735o277n07O670l820l920N932o13
$$ plain form
1186 1566 -3094 1468 2081 -3680 300 3864 -2768 -2053 4061 -741 -3503 2915 1324 -3309 1368
1201 1368 1696 -3198 1077 3133 -3446 -1262 4199 -1414 -3000 3384 517 -3528 1863 1679 -2955
1216 -2955 1214 2216 -3558 -73 4149 -2266 -2630 3632 -80 -3241 2489 1279 -3196 1287 1868
1231 1868 -3140 704 3341 -3106 -1863 4012 -514 -3069 2527 704 -3053 1735 1702 -3009 836
1246 836 2520 -3161 -657 4013 -1518 -2976 2830 544 -2666 1912 1067 -3035 1179 2224 -2959
1261 -2959 54 3348 -2422 -2175 3561 102 -2809 1851 670 -2544 1742 1664 -3133 407 2819 -2566
1277 -2566 -1137 3576 -1001 -2854 2336 708 -2252 1635 793 -2976 1155 2561 -2675 -687 3028
1292 3028 -1546 -2067 2883 273 -2507 1429 646 -2235 1623 1725 -3020 -174 2897 -1566 -1424 2619
$$ packed form
1186A566m660M562O13n761L980L564o632P15O114m802k762O418j591m633M677
1201A368L28m894M275K056o579K184N461n613j586O384k867m045N391j84m634
1216b955M169J002n774L485M222o415l64O262l712l161N730j210m475M483N81
1231A868n008L844K637o447J243N875m526k555N596j823l757M788l3m711L845
1246H36J684n681K504M670n531j458N806k286l210M578q45m102M214J045n183
1261b959L013L294n770K47N736l459k911M660j181l214M286p8m797L540K412n385
1277b566J429M713m577j853N190j628k960L887q42l769M131J406n236J988L715
1292C028m574n21M950k610k780L936p83k881L858J02m745K846L071m463J42M043
$$ plain form
1308 2619 -514 -2290 1904 763 -1970 1317 870 -2697 804 2687 -2122 -1295 2388 -701 -1572 2105
1324 2105 90 -2148 1292 770 -2019 1171 1698 -2611 -588 2703 -786 -1424 1696 -423 -1614 1783
1340 1783 542 -1995 957 1059 -2146 374 2380 -1463 -1455 1707 -129 -1010 1528 -184 -1888 1282
1356 1282 1104 -1747 421 1506 -1713 -719 2036 -254 -1223 918 -290 -1044 1590 528 -2017 377
1372 377 1355 -1263 -146 1578 -879 -1129 1161 113 -642 1028 -276 -1646 1068 1359 -1365 -378
1388 -378 1089 -749 -444 1284 -231 -894 644 -175 -731 1270 536 -1738 -92 1382 -318 -424 589
1405 589 -522 -530 909 27 -612 643 -92 -1195 662 1263 -801 -874 441 103 44 512 -450 -618 616
1424 616 154 -556 600 462 -1082 -380 995 355 -369 -274 -360 164 797 -100 -707 229 272 -512 149 781
$$ packed form
1308B619l133j776M194j141k733L287m47l567L501J883m809Q27L683l089q71L677
1324B105k015k238L440n22k789L190N27m309K023L291l489o38L120k119j191L397
1340A783j241k537K952J02l205K520K006l843QL162j836q81K538j712j704L170
1356A282j78k851K168J085l219R94K755k290r69K141j208p54K634j062k545K394
1372C77R78k618J117J724k457k50K290j048p55J670j304j370K714K91k724R87
1388c78J467j838L05J728j515o63J538q19n56K001p34k274J646J474j700j06J013
1405E89j111qJ439q82o39J255p35j103J857O01k064p3J315l38n9M68r62j68J234
1424F16m62p10J156j38j544P02J375o40p24R5q6N24O33q97o07R36M3p84O61O32
$$ plain form
1444 781 -212 -761 -68 490 504 -21 -736 -373 614 433 -360 -207 200 -169 -304 336 540 -182 -721 -242
1464 -242 600 607 -218 -668 -177 506 335 -275 -107 243 -303 -400 546 644 -404 -682 -46 444 542 -37 -814
1485 -814 -221 724 70 -418 380 101 -791 -20 768 119 -275 -331 -487 439 1007 -471 -972 454 343 -512
1505 -512 372 512 -759 -369 475 20 298 412 -1022 -614 1308 449 -998 114 330 -684 289 859
1523 859 -544 -388 382 -540 32 1349 -442 -1519 640 877 -612 199 379 -1027 -22 1107 -407
1540 -407 -360 780 -742 -927 1495 648 -1438 -22 582 -660 489 949 -1195 -587 1208 -310 -570
1557 -570 1288 -233 -1660 828 1145 -886 95 482 -1289 177 1730 -792 -1085 1127 -219 -1065
1573 -1065 1393 611 -1724 107 996 -811 381 1122 -1580 -821 1910 -67 -1244 1061 32 -1607
$$ packed form
1444G81r93n49O93N58J4n25p15L63R87j81p93J53M07l69j35O40K04p22n39M79
1464b42Q42Pq25m50M91O83j71o10J68L50n46r7R46R8j048k78O36M90R8n79p77
1485h14N93R45o54m88P98k79q92P71P88o49l94n6j56R26N68j478n01J426j11q55
1505e12Q84J40j271L90Q44m55K78J14j434M08J922q59j447J112K16j014R73N70
1523H59j403J56P70r22N72J317j791j077K159K37j489Q11J80j406J005J129j514
1540d07M7J140j522j85K422q47k086J416O04j242J149M60k144O08J795j518k60
1557e70J858j521j427K488L17k031R81L87j771J466J553k522k93K212j346q46
1573a065K458p82k335J831Q89j807J192P41k702P59K731j977j177K305j029j639
$$ plain form
1589 -1607 970 1249 -1327 -112 864 -1264 63 2040 -948 -1692 1398 384 -1219 1138 554 -1890
1605 -1890 349 1451 -1059 -1 1343 -1527 -976 2281 122 -1791 885 381 -1488 1096 1238 -1806
1621 -1806 -207 1401 -1160 -223 2059 -1031 -1938 1684 764 -1498 834 568 -1931 525 1814 -1363
1637 -1363 -504 1527 -1260 -1030 2394 98 -2205 861 880 -1390 884 1224 -1980 -308 1911 -921
1653 -921 -700 1894 -854 -1975 1859 1027 -1826 470 818 -1720 527 1942 -1530 -959 1716 -743
1669 -743 -1110 2149 44 -2402 948 1292 -1438 522 1163 -1982 -294 2220 -827 -1159 1676 -535
1685 -535 -1811 1877 1078 -2074 257 1129 -1459 436 1893 -1657 -1154 1982 -295 -1319 1752 121
1701 121 -2293 953 1546 -1460 95 1149 -1735 -284 2374 -777 -1655 1514 25 -1608 1529 961
$$ packed form
1589a607K577K79k576J215R76k128J327J977k988p44L090j014j603K357n84k444
1605a890K239J102k510J058J344k870N51L257k159j913K676n04j869K584J42l044
1621a806J599J608k561R37K282l090r07L622r20k262K332k66k499K456J289l177
1637a363Q59K031k787K30L424k296k303L066J9k270K274L40l204J672K219k832
1653i21K21K594k748j121L834q32k853K296L48k538K247J415l472N71K675k459
1669g43l67L259k105k446L350L44k730J960O41l145J688K514l047l32K835k211
1685e35j276L688p99l152K331Q72k588J895J457l550N03L136k277j024L071j631
1701A21k414L246N93l006J555J054k884J451K658l151q78L169j489j633L137n68
$$ plain form
1717 961 -2117 119 1397 -1209 125 1696 -1590 -1299 2152 106 -1606 1229 309 -1944 969 1542
1733 1542 -1562 -165 1276 -1402 -321 2288 -732 -1932 1421 552 -1427 1107 766 -2018 238
1748 238 1646 -1173 -277 1602 -1309 -1315 2133 400 -1797 714 537 -1464 917 1389 -1743 -408 1601
1765 1601 -971 -664 1970 -488 -1962 1226 907 -1238 657 605 -1792 359 1881 -1184 -833 1562
1781 1562 -688 -1273 1785 493 -1762 475 681 -1143 833 1186 -1896 -524 1932 -562 -1071 1453
1797 1453 -203 -1644 1086 892 -1205 436 533 -1637 466 1997 -1238 -1292 1474 -30 -1102 1221
1813 1221 348 -1517 498 756 -1061 642 1132 -1804 -653 2112 -122 -1361 862 120 -1088 941
1829 941 664 -1243 331 719 -1377 233 1880 -1062 -1540 1273 469 -885 657 71 -1222 684
$$ packed form
1717I61l078K236J278k606J334J571l286K91L451k046j712K835r20k253K913N73
1733A542l104J397J441k678J081K609l020j200L353q69j979K534l41k784K256
1748B38J408k819Q96J879k911oL448j733k197K511j77k001K381M72l132J335K009
1765A601k572L07K634k458j474L188l19k145J895n2k397K151J522l065L51K395
1781A562k250n85L058j292k255K237K06j824J976L53l082J372K456k494n09K524
1797A453j656j441K730j94k097J641R7k170K103J531l235n4K766j504j072K323
1813A221q73j865K015K58j817J703M90k936J151K765k234j239K223p42j208K029
1829I41k77j907J574L88k096J610J647k942m78K813q04j354J542n86j293J906
$$ plain form
1845 684 832 -1130 260 1108 -1389 -708 1877 110 -1398 420 265 -617 894 361 -1390 299 1031
1862 1031 -1024 -117 1488 -689 -1330 1010 637 -652 329 -93 -978 826 955 -1192 -252 1071 -706
1879 -706 -641 1286 113 -1152 218 291 -365 731 209 -1369 138 1258 -580 -537 874 -313 -839
1896 -839 769 444 -559 216 -69 -770 742 952 -1050 -579 904 -83 -425 669 -61 -767 355 281
1914 281 -367 520 194 -1121 22 1183 -211 -674 320 -69 -299 589 109 -625 195 172 -549 412 735
1933 735 -746 -646 625 284 -208 166 -236 -417 494 328 -445 125 252 -603 -64 818 -30 -573 15
1952 15 53 77 462 -132 -621 173 403 -242 30 336 -356 -373 375 300 -76 -74 -314 -197 525 302 -460 -201
1974 -201 199 -61 -2 299 -48 -315 -46 106 183 262 -180 -462 92 459 56 -200 -82 -66 5 154 127 -50
$$ packed form
1845F84J48j962J390Q48k497O81K585j767j508J818j55q82J511n33j751J689P32
1862A031k055R07J605k177o41K340l73j289R81m22q85J804J29k147R40J323j777
1879g06O5J927j173j265J370P3o56J096n22j578J507J120j838M3J411j187n26
1896h39J608l25j003P75k85p01J512K10k002M71J483r87l42J094p30p06J122p4
1914B81o48Q87l26j315J143J161j394m63R94l89k30Q88m80p34Q20k3p21R61L23
1933G35j481J00J271l41m92L74m02j81R11j66p73N70J27q55N39Q82q48n43N88
1952A5L8K4L85n94m89P94K30o45K72L06o92j7P48p5l76Kk40J17P22k23p62K59
1974b01M00k60N9L01l47k67K69J52P7P9m42k82N54L67m03k56J18J6P1J49k7j77
$$ plain form
1996 -50 -148 -160 31 314 192 -264 -344 66 322 116 -152 -153 -49 24 130 144 -60 -180 -135 -2 255 229 -251
2019 -251 -395 115 320 28 -69 -71 -170 35 262 13 -59 39 -232 -122 467 212 -422 -161 174 37 136 132 -309
2042 -309 -151 290 4 -110 290 -109 -500 225 480 -176 -155 26 -221 131 429 -232 -357 281 5 -302
2062 -302 385 249 -562 -122 395 -67 45 220 -461 -208 635 25 -448 274 101 -501 241 492 -382 -201
2082 -201 265 -262 31 610 -333 -604 486 224 -464 273 246 -624 -6 573 -261 -144 376 -417 -328 759
2102 759 65 -730 255 295 -521 239 505 -584 -216 545 -239 -192 648 -254 -713 607 422 -621 175 374
2122 374 -637 51 740 -410 -361 570 -256 -447 770 113 -861 281 479 -576 148 561 -701 -274
2140 -274 805 -218 -461 632 -156 -743 646 438 -797 114 519 -651 -4 841 -489 -544 738 -74
$$ packed form
1996e0r8j2J91K83j22m56q0M10K56k06k68jJ04P3J06J4k04j20M5J33K57k6m80
2019b51j44N10K05k92r7kr9K05K27k49p2R8k71J10N89k55o34K61L35j37R9mm41
2042c09J58M41k86j14M00l99l91P25K55o56K1J81k47L52K98o61j25O38k76l07
2062c02O87j36q11M40N17m62J12J75o81K53Q43o10m73P22j73o02P42K51q74J81
2082b01M66n27K93N79r43k71J090k62o88P37k7q70O18N79q34J17N20p93Q9J087
2102G59o94p95R85M0q16P60K66j089L68P61p84M7Q40r02m59J320j85j043P96J99
2122C74j011O88O89j150M9R31q26j91J217o57r74J142J98j055P24M13j262M27
2140b74J079j023k43J093p88n87J389k08j235R11M05j170O47Q45j330n5J282q12
$$ plain form
2158 -74 -579 708 153 -934 373 653 -663 24 670 -659 -318 944 -183 -681 624 27 -777 611
2176 611 485 -930 67 708 -638 -119 867 -515 -650 834 48 -697 600 218 -936 380 742 -776
2194 -776 -114 765 -607 -377 968 -195 -788 657 174 -769 560 498 -963 57 841 -605 -255 858
2212 858 -448 -661 893 99 -851 531 338 -896 327 767 -808 -242 826 -480 -454 919 -157
2229 -157 -889 678 350 -834 383 552 -906 -1 909 -545 -392 849 -313 -686 869 189 -921
2246 -921 434 501 -820 218 783 -758 -293 903 -371 -547 842 -88 -892 643 440 -846 227
2263 227 604 -799 -54 899 -551 -521 837 -180 -723 770 241 -935 340 594 -742 72 738 -681
2281 -681 -338 926 -251 -652 763 81 -853 557 521 -820 116 654 -665 -125 863 -451 -577 815
$$ packed form
2158g4n05J287n55j087J307K80j316O87O46j329L41J262j127m98J305n97q04J388
2176F11j26j415R97O41j346N19R86j382j35J484p86p45J297l82j154J316L62j518
2194g76O62Q79j372K30J345j163n93J445m83r43J329o2j461J020P84j446L50J113
2212H58j306k13J554p94r50J382j93j234J223M40j575N66J068j306K6J373j076
2229a57p32J567l28j184J217J69j458R05R10j454J53J241j162l73J555o80j110
2246i21J355O7j321J038N65j541M65J196j274j76J389r30q04J535k03j286J073
2263B27L77j403P45R53j450L0J358j017n43J493n29j176J275K54j336Q14O66j419
2281f81L43J264j177m01J415o82r34J410l6j341R36N38j319N40R88j314j26J392
$$ plain form
2299 815 -7 -743 608 309 -873 257 639 -689 -61 711 -580 -369 869 -176 -703 644 175
2316 175 -773 432 507 -778 28 699 -553 -219 793 -341 -586 740 78 -727 484 355 -783 207
2334 207 669 -614 -183 715 -372 -419 750 -81 -684 536 252 -711 316 517 -725 -57 724 -421
2352 -421 -364 644 -183 -544 590 123 -666 380 370 -690 130 663 -546 -288 672 -193 -431 543 -2
2371 -2 -556 445 245 -630 244 499 -613 -109 707 -291 -420 530 -49 -443 441 99 -546 308 354 -613
2391 -613 49 617 -440 -359 596 -50 -437 365 45 -441 342 223 -555 158 494 -493 -182 610 -160 -432
2411 -432 398 85 -357 304 111 -455 255 358 -499 -32 542 -284 -323 451 24 -378 245 96 -345 253
2431 253 211 -461 69 426 -355 -207 451 -98 -355 283 75 -303 186 111 -373 150 330 -361 -120 428 -144
$$ packed form
2299H15q22p36J351k99j182J130L82j328O28P72j291K11J238j045n27J347m69
2316A75r48J205P5j285Q06O71j252L34J012j134k45J326o62q05J211j29j138R90
2334B07M62j283M31Q98j087m7J169q31o03J220k84r63J027K01j242O68P81j145
2352d21N7J008q27l61J134m67p89J046j0j060Q20N33j209K58R60q65k38R74n45
2371bn54J001k00q75Q74K55j112N04Q16r98j29R50n79l94Q84l42o45Q54M6r67
2391f13O62N68j057Q1R55o46l87Q02l20m86P83j19p78P13L36r87L11P92p70k72
2411d32Q30l13m42O61j93n66P10J03q57M67N74q26l9P74m27m02O23j49m41N98
2431B53m2o72N30L57p81J48O58n49k57O38k08l78M89p5m84N23J80o91K41N48n72
$$ plain form
2452 -144 -265 317 52 -293 192 123 -270 150 204 -316 -9 361 -173 -199 297 -20 -264 205 89 -247 109
2473 109 131 -248 48 254 -230 -136 253 -40 -190 157 20 -207 124 104 -215 40 162 -188 -53 228 -61
2494 -61 -151 141 27 -125 112 57 -145 62 134 -116 -21 170 -68 -99 136 32 -99 58 16 -90 64 71 -118
2517 -118 -34 100 -45 -76 81 17 -92 16 31 -27 11 9 -73 3 79 -17 -56 38 27 -43 -8 69 4 -60 8 34 16 8
2545 8 2 -24 20 59 -23 -42 68 20 -89 38 83 -79 -58 53 -17 -6 53 -61 -66 99 19 -129 47 109 -137 -43 147
2572 147 -42 -93 90 -32 -66 117 7 -147 113 126 -173 12 192 -92 -110 169 20 -94 129 2 -151
2593 -151 158 102 -221 43 212 -169 -102 222 -36 -174 150 19 -167 164 62 -279 100 218 -244 -63 269
2614 269 -121 -186 216 7 -182 156 44 -246 155 201 -280 -6 306 -169 -150 290 -36 -222 217 60 -236
$$ packed form
2452a44j21N82k65l45M85o9l93M20N4n20L07L70n34k6M96l17k44M69j16l36L56
2473A09K2l79K96K06m84R4L89k93j50L47j37k27L31k0l19K55J22l50J35K81k89
2494f1r0K92j14j52K37n5k02K07P2k50R5J91k38l1K35j04j31J57m2j06J54Pj89
2517a18Q4J34j45l1J57o4j09J08J5n8L8kq2P6P6r6l9R4j1p0L5P7o5o4O8K6j8q
2545Hok6M4L9q2j9J10m8j09J27M5j62K1J11p0J1N9j14nJ65q0j48J76O2k46R4J90
2572A47j89n1J83j22l4J83j10j54K60J3k99J85J80k84j8K79j49j14K23j27j53
2593a51L09n6l23K64J69l81O7L24k58j38L24j31j86L31j02l41L79J18m62J81L32
2614B69l90o5M02k09j89L38j12k90M01M6m81K74L12m75J9M40l26j86M39j57k96
$$ plain form
2635 -236 176 161 -316 62 319 -245 -149 331 -104 -246 266 20 -282 211 122 -340 117 279 -325 -91 354
2656 354 -160 -220 303 -32 -291 270 107 -360 172 258 -368 -1 378 -235 -167 361 -75 -269 328 54 -364
2677 -364 232 232 -389 51 376 -306 -145 395 -155 -256 349 -24 -382 280 178 -436 116 338 -369 -90 408
2698 408 -218 -247 387 -80 -354 354 115 -450 197 316 -409 -7 413 -276 -181 428 -137 -307 407 34 -445
2719 -445 294 283 -436 74 395 -332 -104 431 -209 -274 434 -50 -431 345 196 -492 124 356 -388 -54 412
2740 412 -298 -222 459 -110 -391 398 111 -486 215 328 -416 2 407 -321 -138 463 -190 -338 458 43
2760 43 -466 302 279 -461 74 379 -337 -72 432 -281 -274 489 -46 -466 338 172 -484 147 339 -399 -35
2781 -35 392 -319 -174 488 -161 -425 410 145 -459 212 292 -423 37 398 -318 -115 460 -228 -335 483 69
$$ packed form
2635b36M12j5m77L78K57n64R6M80m35j42N12k46l02M93q9m62M57J62o04K34M45
2656C54n14o0N23l35k59N61j63m67N32Q6o26L67L79o13O8N28m36j94N97k74m18
2677c64N96%o21M40L25o82J61N40n50j01O05l73l58O62j02o14N52K22p07K79M98
2698D08o26k9O34m67k74P08k39n65O47J19p25M02M20o89R5O09n65j70P14l73m79
2719d45P39j1p19N10L21p27K28N35o40o5P08m84l81P76j49o88O16K32p44L34M66
2740D12p10P6O81n69k81P89k87n97P01J13p44M18M05p28J83O01o53j48P96m15
2760D3n09P68k3p40N35L05p16K65N04p13PP63n35m20Q04j66o56O31J92p38L64
2781c5M27p11J45O62o49k64Q35k65o04O71Q0p15M60L61p16K03N75o88j07Q18m14
$$ plain form
2802 69 -474 244 245 -409 110 348 -382 -67 434 -265 -255 474 -58 -471 323 210 -418 122 250 -391 3
2823 3 409 -323 -214 456 -137 -384 401 144 -439 159 249 -352 99 332 -362 -114 476 -171 -319 413 42
2844 42 -421 255 236 -363 90 261 -354 3 440 -284 -277 418 -17 -368 288 144 -399 120 248 -334 27
2865 27 323 -357 -176 461 -88 -374 284 81 -347 210 214 -338 52 293 -300 -48 428 -189 -309 349 65
2886 65 -292 227 105 -340 144 271 -295 -33 319 -225 -183 370 -12 -307 214 58 -276 208 180 -371 -11
2907 -11 316 -201 -135 295 -107 -252 248 57 -229 184 92 -338 128 344 -255 -159 291 -69 -143 239 -12 -219
2929 -219 183 66 -240 189 217 -338 -84 337 -63 -190 153 -36 -132 203 16 -215 154 98 -292 62 322
2950 322 -179 -239 181 48 -97 108 -75 -176 177 81 -226 96 205 -248 -119 287 45 -175 35 3 -36
$$ packed form
2802F9n43P18Jo54N19K38p30L15N01o99J0P29n32m13P94j13o28N40J28o41L94
2823CM06p32J09O70n93k47P85k57n83N98R0o01M51K33o94K48N90o47j48P32l71
2844D2m63O76j9n99M53J71o15L57M37p24PO95m35l51O56j44n43N19J28n82L61
2865B7K96o80J81O37n49k86O58k03m28N57Mn52L90K41n93K52M76o17j20O58k84
2886F5l57N19j22m45M84J27n66K62L52n44M2N53l82k95N21j56l34M84k8n51L60
2907a1L27n17O6M30m02j45N00j91k86M13r2m30M66K16n99R6M50l60p4L82k51k07
2929b19M02j17l06M29K8n55K54M21m00j27L43j89r6L35j87k31L69n6l90L54K60
2950C22n01o0M20j33j45K05j83j01L53r6l07L22J09m53J29M06k42k20K10l2l9
$$ plain form
2971 -36 188 5 -242 94 166 -193 -23 229 -87 -208 98 83 -42 40 -67 -153 163 136 -199 -51 149 -89
2993 -89 -106 143 27 -124 -8 1 -11 139 11 -218 16 200 -39 -84 85 -10 -77 67 74 -28 29 -34 -99 123
3017 123 153 -105 -136 73 66 -7 34 -17 -74 15 36 -23 50 25 -138 -62 145 62 -109 -82 6 36 59 0 -78 -18 25 -31
3045 -31 7 109 -29 -138 -12 125 68 -58 -77 -14 65 92 -10 -71 26 21 -42 50 103 -55 -122 20 94 39 -25 -98
3071 -98 -68 80 86 -66 -53 42 -66 -62 119 61 -128 -85 9 41 90 11 -163 -40 144 -1 -63 73 -10 -132 64
3096 64 128 -32 -7 -14 -92 74 182 -90 -161 90 43 -60 84 34 -174 -12 114 -38 37 71 -180 -102 204 43
3120 43 -151 17 -12 -130 119 124 -163 -63 90 -78 -5 194 -84 -199 124 84 -81 98 6 -219 48 225
3142 225 -94 -89 119 -101 -98 230 41 -196 43 45 -131 148 162 -276 -104 216 -32 -101 138 -83 -209 157 96
$$ packed form
2971c6K24j83k47L36P2l59J70K52l16j21L06j5j25Q2j07q6L16k7l35J48K00k38
2993h9j7K49j16j51J16Rj2J50j28k29K34J84k39m5J69r5o7J44Pj02N7o3o5K22
3017A23L0k58l1K09pp3M1n1n7Q9K1n9P3k5j63P6K07q3j71K7Q8L0K3n9p8O0M3n6
3045c1L8J02j38j09J26J37n7j26j9O3P9K7j02o1R7no3R2N3j58o7J42P4n5o4p3
3071i8L0J48Oj52J3R5j08MJ81n8j89M3R4L2M9p9j74J23J84j45o2J36q3j22J96
3096F4O4j60K5pp8J66J08k72p1K51m7j03J44n0k08J62J26j52P5L4k51P8L06j61
3120D3j94J68k9j18K49Nk87J00J53j68P3J99k78j15L23m0j65J79r2k25K67J77
3142B25l19NK08k20LL28j89k37K39Kj76K79J4m38J72L20k48o9K39k21j26L66o1
$$ plain form
3165 96 -165 71 55 -280 55 314 -136 -207 127 -20 -91 198 -11 -257 116 131 -198 105 207 -270 -136 303
3187 303 34 -151 103 -57 -159 248 117 -273 31 160 -247 -8 315 -145 -265 165 25 -103 182 -52
3207 -52 -329 153 238 -237 -23 217 -222 -155 314 13 -210 114 -18 -191 265 143 -371 -7 272 -155 -60
3228 -60 268 -136 -235 230 61 -166 175 10 -345 164 332 -254 -137 205 -142 -113 296 -61 -274 158 30
3249 30 -228 207 161 -381 -57 333 -93 -118 197 -150 -201 310 71 -272 136 93 -304 116 336 -233 -184 215
3271 215 -53 -86 266 -79 -318 216 164 -246 99 184 -317 -63 328 -80 -165 159 -122 -187 314 79 -365 60
3293 60 183 -227 41 257 -237 -180 247 -31 -111 235 -79 -325 225 243 -247 -10 175 -204 -5 317 -101
3314 -101 -206 208 -47 -181 284 98 -359 11 249 -132 -4 181 -237 -140 299 -9 -208 186 -23 -307
$$ packed form
3165I6k61K36j6l35L35K59m50p1L34j47p1K89k09k46L73J5l29L03J02m77J34M39
3187C03k69j85K54j60j02M07j31l90L04J29m07K39L23m60j20M30j40j28K85k34
3207e2k77M82Q5m75K14K40m39O7M69l01k23L24j32j73M56j22n14L64K79m27R5
3228f0L28m04r9M65j69k27L41j65l55N09J68n86J17L42l47K9M09l57k13M32j28
3249C0k58M35m6n42L24L90m26k5L15l47n1N11k39l43M08m3l97M20K20n69M9L99
3271B15k68l3L52l45k39N34n2m10L45Q5n01K54L91m08q5L24k81o5N01k35m44M25
3293F0J23m10K68K16m94N7M27k78q0L46l14k46N50J8m90K37J85l79J99L22m18
3314a01j05M14k55j34M65j86m57L70K38l81J28J85m18R7M39l08j99L94k09k84
$$ plain form
3334 -307 174 243 -253 -85 166 -149 7 285 -160 -254 232 54 -202 172 103 -312 28 264 -117 -50 155
3355 155 -191 -111 347 8 -289 119 81 -200 128 193 -252 -85 184 -107 -33 240 -164 -283 226 138 -213 43
3377 43 61 -248 38 239 -167 -131 155 -128 -132 297 25 -311 68 157 -124 84 135 -242 -52 261 -74 -109 193
3400 193 -90 -244 215 182 -198 -18 70 -160 81 222 -195 -164 193 -41 -139 196 26 -266 35 160 -95
3421 -95 34 63 -236 -28 275 -62 -189 116 -11 -164 150 125 -182 -37 81 -91 70 197 -175 -167 208 56
3443 56 -134 91 18 -191 66 152 -93 -16 51 -161 -19 249 -50 -218 58 60 -97 90 59 -193 -25 115 -59
3466 -59 9 107 -141 -148 183 85 -126 9 10 -102 87 128 -108 -63 73 -53 13 169 -37 -159 43 91 -30 52
3490 52 22 -150 -10 149 -16 -57 36 -65 -64 123 38 -125 -22 1 -58 72 93 -116 -109 63 28 -11 47 -58 -105
$$ packed form
3334c07M81O9m96J68K51l15J56K78m45r4M86j78k56L74o9m15L40K36l81O7K05
3355A55l46Q0M58l39k97M08l8k81L28O5m45J67K69k91P4K73m04j19N09q8l51K56
3377D3J8l09K86K01m06L6K86k83mM29k72l36L79Q9k81K08N1l77J90L13l35l5L02
3400A93k83j54M59l3l80J80Q8k30K41J41m17L1L57k34r8L35j70k92L01J25k55
3421i5J29K9k99K08L03l37j27L05j27j53L14k5l07J45J18j72J61J27l72QL75j52
3443E6j90K25p3k09K57Q6k45P7O7k12J42K68k99j68K76Kj57J87l1k52J68J40j74
3466e9O8R8k48pL31r8k11J35Jj12J89M1k36M5J36j26O6J56k06j22K02M8j21Q2
3490E2l0j72J40J59j65m1R3j01JJ87q5j63J03K3n9J30K1k09PJ72l5l9N8j05m7
$$ plain form
3515 -105 63 72 -28 13 4 -91 4 134 8 -93 -21 2 34 87 2 -97 -12 52 4 40 50 -82 -78 63 63 -10 -46 -57
3543 -57 -34 64 53 -58 -53 -8 -26 7 72 -16 -92 -42 32 56 27 -43 -74 -1 70 31 -31 -12 -19 -16 45 75 -20 -68 -36 36 67
3574 67 32 -50 -66 8 51 11 -18 -15 -48 -43 53 47 -28 -72 -35 5 55 44 -73 -78 12 41 -6 28 -9 -87 -5 71 17 -11 -23 -63
3606 -63 -3 110 29 -86 -6 23 -14 45 62 -74 -51 45 9 17 54 -69 -105 67 75 -57 -20 -8 -79 24 94 -49 -80
3633 -80 23 -39 -35 102 8 -146 -3 71 -25 9 43 -98 -44 115 18 -58 61 -19 -107 94 103 -94 -26 47 -46 15 116
3660 116 -68 -103 77 13 -66 77 15 -156 -2 115 -56 -28 54 -102 -42 145 -21 -132 52 10 -111 77 100
3683 100 -137 -61 109 -40 -7 126 -70 -117 121 56 -109 73 56 -147 45 168 -75 -70 96 -48 -48 165 -1
3706 -1 -173 81 73 -115 52 106 -166 -64 140 -27 -70 95 -62 -132 138 61 -163 34 76 -149 21 168 -97
$$ packed form
3515a05J68Rj00M1rr5R5J30j26j01P2K3L2N3q5r9Q5O4m8L6J0j32MJ41%p3l6j1
3543e7K3R8j1j11NM5j8L3O5q8p6N0P4K4k9p0l1P3P1l9o2J9pLO1L0r5m8L2P2L1
3574F7l5q2j6P4M3m0k9Ll3NR6op5m4L7M0N0j1j17nR0K9m7L4l7p8Q2P6n4k8j2m0
3606f3O0J13q1j15Q0K9l7N9J7j36K3R6l6QL7j23l6J72Qj32L7J2p1J03P0j43l1
3633h0J03o2MJ37r4j54J43P4r6L4L4j41N4J59r7p6J19q0q8K01Rj97O8P3r3O1J01
3660A16j84l5J80o4p9J43o2j71J54J17j71K8Q2j56O0J87j66j11J84m2j21J88K3
3683A00k37P6J70j49L3J33j96m7K38o5j65J82j7k03J92J23k43NJ66j44%K13j66
3706aj72K54qj88J67N4k72J02K04j67m3J65j57p0K70p7k24J97M2k25J70J47k65
$$ plain form
3729 -97 -118 125 -19 -74 150 9 -171 106 121 -118 37 138 -138 -52 184 -11 -107 115 -29 -116 154 66 -183
3752 -183 27 125 -132 -16 171 -104 -140 133 6 -107 105 -6 -192 101 140 -164 -15 135 -115 -64 191
3773 191 -24 -150 114 24 -115 138 78 -201 27 176 -103 -36 166 -67 -110 166 29 -138 107 36 -178 86
3795 86 153 -165 -56 146 -87 -76 165 -51 -171 125 39 -151 96 91 -199 0 181 -106 -78 148 -70 -102 179
3818 179 40 -162 98 87 -149 77 173 -143 -60 172 -51 -80 147 -33 -157 139 74 -174 63 123 -173 -10
3840 -10 186 -96 -110 119 -58 -119 162 8 -198 77 116 -164 11 149 -135 -77 165 -35 -105 123 -26 -154
3862 -154 131 96 -171 27 148 -103 -27 153 -83 -98 142 -2 -122 134 38 -188 76 142 -135 -17 126 -97
3884 -97 -74 150 -37 -122 118 -6 -151 100 104 -171 -9 137 -98 -38 137 -71 -97 144 14 -126 119 60 -167
$$ packed form
3729i7k1K43j44n5K24j41j80K77J5k39J55J01k76Q6K36j95r6K22j44q7K70q8k49
3752a83K10R8k57J16J87k75l6K73j27j13K12j11j86K93L9l04J49J50k50N1K55
3773A91k15j26K64r0j39K53o0k79K28J49k79O7K02k33m3K76j37j67K45p1k14K64
3795H6O7l18J09K02k33J1K41k16j20K96q6j90K47nk90J99J81k87K8K26k18l2K81
3818A79j39k02K60j1k36K26R6l16Q3K32k23k9K27j80j24K96o5k48K37O0k96J63
3840a0J96k82j4K29j77o1K81j54k06K75L9k80J75J38k84N8K42k00p0K28j49j28
3862a54K85l5k67J98J21k51P6J80k36j5K40j44j20K56r6k26K64O6k77J18J43k23
3884i7K3K24j87q5K40j24j45K51Mk75J62J46k35O0J75k08k6K41j30j40K45n9k27
$$ plain form
3907 -167 59 154 -101 -51 126 -57 -50 141 -23 -120 107 37 -130 68 105 -143 -29 143 -52 -58 110 -60 -81
3930 -81 111 11 -137 63 66 -143 24 126 -96 -54 102 -37 -56 117 -11 -118 103 62 -114 39 100 -94
3952 -94 -9 121 -46 -61 93 -16 -71 111 35 -125 61 86 -107 -3 105 -80 -64 109 -28 -69 76 -16 -104
3975 -104 63 56 -105 1 77 -85 -25 97 -48 -70 94 2 -61 79 38 -84 40 71 -63 -8 90 -47 -38 104
3999 104 -5 -65 61 33 -67 53 61 -79 1 63 -46 -23 72 -44 -53 68 18 -77 35 28 -74 13 67 -66 -19 53
4025 53 -38 -28 85 2 -71 39 43 -44 28 46 -52 3 56 -19 -12 69 -18 -36 62 32 -59 11 31 -37 14 27 -33 -16 28 -26
4055 -26 -37 42 -13 -57 18 17 -51 1 12 -26 -1 14 -9 -16 23 -18 -34 39 27 -32 5 34 -3 14 25 -7 0 35 3 0 25 3
4087 3 -25 13 36 -17 -13 -2 -10 7 4 -10 -9 7 -11 -18 8 -12 -27 -16 12 13 -1 -11 3 6 0 -6 -4 10 4 -1 -3 17 19 -5 -3 37 32 -3 -7
$$ packed form
3907a67K26R5k55N0J77j83PJ91j64r7K27p0j67J98L7k48J14J72j95oJ68j70k1
3930h1J92j00j48K00Lk09J67J02k22M2J56j39j9J73j28j07K21m1j76J53O1j94
3952i4Q5J30j67j5J54j09n5J82p6j60J86K5j93J04J08j85J6J73j37m1J45r2q8
3975a04J67pj61J06P6j62O0J22j45k2J64r2o3J40m1j22J24L1j34N5R8j37RJ42
3999A04j09o0J26k8j00J20Qj40Q0O2j09K3R5j16rJ21n0r5J12pj02Q7N4j33M7P2
4025E3r1J0J13q3p3J10Mq7P2J8r8N5N3p5PQ1q7j8R8l0r1P0K0o8N1J3o0J7M4n4
4055b6j1P9n5m4P5jo8N2J1l8K5J5k3pL9m1j6P3j2n9L7K9l7J7J1l2PL5l2lK5k2
4087Ck8L8K3n3MJ1qJ7lj4JJ6j8pK6k0j5J1K8Jj4j0J4LooKJ4onkK0Kk4KM0nl5m
$$ plain form
4126 -7 18 8 14 14 2 10 9 -9 -11 32 0 -38 12 28 -18 -6 9 -17 -8 7 -18 -18 27 -16 -33 20 39 -36 -10 31 -5 -13 25 -13 -3
4161 -3 50 0 -22 39 24 -26 15 57 -26 6 38 -8 -3 51 -9 -42 49 8 -36 29 32 -45 -13 40 -18 -18 32 -31 -44 60 -5 -66
4193 -66 27 30 -45 7 48 -42 -2 55 -7 -15 68 0 -62 64 44 -57 27 47 -48 -3 70 -27 -19 82 -25 -53 56 16 -68
4222 -68 27 46 -60 -3 57 -56 -34 60 -39 -57 66 0 -76 52 52 -76 13 65 -49 -9 76 -43 -36 88 1 -68 70
4249 70 42 -65 31 71 -60 6 85 -39 -25 90 -19 -64 80 26 -83 31 59 -94 4 77 -64 -29 83 -50
4273 -50 -65 76 -3 -90 60 34 -108 26 75 -66 -16 81 -42 -26 101 -12 -87 89 45 -77 53 69 -70 9
4297 9 96 -45 -37 101 -27 -71 89 11 -85 51 43 -103 21 83 -81 -37 99 -49 -75 74 -11 -95 60 36 -103
4322 -103 38 66 -102 -16 112 -56 -55 104 -5 -78 88 34 -78 58 72 -90 11 102 -63 -48 101 -29 -67
$$ packed form
4126gK5j0O%j2Qjj8kM3l2l8N0J6m6J2J5k6RJ5k5%M5m3j7N3J9p5K6M1l6qL8l8J0
4161cN3n0k2O1j5n0M1M2q3L2L2m6NN4o0l3R1m1m4O5Lp7L2N3n8%N0o3j3J04o5o1
4193f6R3Lp5N2M1r0M0N7o2qQ3o8o2J26k0j01Q4K0r5M5P3r7QJ01j07k8J09m0q4
4222f8R5J9j06N7O0j13K2R4r9j8J23o6p6J28%j28Q9N2j14M0Q5j19PJ24q7o9J38
4249G0k8j07R6M0j31O6P9j24J4J15j09m5J44n4j09J14K8j53R8P3j41L5J12j33
4273e0j5J41p9q7J50k6j42J34M9j41N0R7j23J6J27j13p5J76m4j22J30J6j39P9
4297IQ7j41QJ38j28m4J60p8r6J36qj46J24O2j64M4J36j48k6J49q5q4J55k4j39
4322a03J41K8j68Q6J28j68JJ59j09p3J66n4j12J36J4j62J01R1j65J5J49j30l8
$$ plain form
4345 -67 85 9 -90 48 48 -105 12 72 -91 -44 96 -51 -79 77 -13 -87 50 40 -105 35 78 -96 -14 94
4369 94 -58 -57 100 -7 -78 90 31 -85 65 77 -80 7 90 -58 -35 97 -30 -67 95 2 -88 50 46 -95 9
4394 9 77 -89 -36 80 -49 -60 83 -23 -91 62 42 -92 29 74 -83 -13 81 -53 -46 88 -18 -70 90 25 -81
4419 -81 57 76 -86 9 80 -62 -33 100 -28 -58 93 1 -82 57 55 -96 18 77 -68 -21 72 -49 -54 80 -15
4444 -15 -69 71 24 -93 27 62 -78 -12 68 -46 -21 74 -25 -54 77 20 -78 47 58 -79 15 76 -45 -19 68 -39
4470 -39 -29 77 -7 -75 47 30 -84 12 63 -67 -19 49 -44 -44 69 -25 -77 59 9 -79 15 38 -67 -2 63 -45 -27
4497 -27 60 -31 -33 68 6 -72 39 51 -49 17 63 -50 -15 73 -20 -32 58 -1 -62 40 26 -62 13 38 -59 -9 56 -48
4525 -48 -47 46 -16 -68 24 5 -55 17 22 -47 11 38 -48 -19 67 -14 -44 37 16 -24 30 24 -21 21 33 -37 6 66 -33 -41 46 32
$$ packed form
4345f7J52p6r9J38%j53J17O0j63M7J40j47k8J56r0p4J37j0j45J40M3j74Q2J08
4369I4j52JJ57j07p1J68n9j16J50J2j57Q7Q3j48K3J32j27l7J62r3r0J38mj41J04
4394IO8j66N3J16j29j1J43j06o8J53k0j34J21M5j57P0R4j34PJ34j06n2J60o5j06
4419h1J38J9j62R5P1j42K9J33j28l0J51r2q3J39kj51J14N9j45M7R3j21nJ34r5
4444a5n4J40m7j17J20L5j40O6Q0j14K5R5r9k9J31n7r8J25J1j37R4O1j21K6Q7j07
4470c9J0J06q4o8J22j7j14R6N1j30M8O8r3%J13r4n2J36n0q8R4K3j05O5O5j08J8
4497b7Q7r1kJ01o2p8J11J2j00O6M6j13L5Q8r3j2R0n9o1J02j4q8P5K5r7N0O5j04
4525d8JR3o2n2R2j9o0P2No9N8K7q6K9Q6q1l0Q1k1m0N4om5M2J2p0M3O0r9qQ7j4
$$ plain form
4557 32 -23 14 0 -31 11 13 -35 7 38 -45 -38 38 4 -51 4 9 -15 13 -9 -35 1 18 -33 -9 46 -13 -44 22 35 -13 4 -5
4589 -5 -7 31 17 -26 -4 39 -3 -18 41 19 -34 2 10 4 11 -11 -31 2 17 -22 -29 18 -1 -36 2 10 -4 -3 -18 -9 19 8 -27 -19 24
4624 24 12 -6 6 0 2 4 9 12 11 0 5 21 27 12 -23 -3 13 13 13 -13 -2 -8 -11 -7 4 -5 -17 -22 -3 8 3 -26 -27 2 3 -8 -6 -12 -10 -4 -4 -4
4666 -4 13 -2 -26 6 21 -2 -11 6 3 9 15 -7 -11 9 2 -15 13 24 -23 -13 19 15 -7 6 -25 -6 37 -6 -40 0 20 -29 -9 16
4700 16 -8 -34 -8 -6 7 24 -27 -42 22 26 -30 -11 37 -12 -9 29 5 -8 17 -21 -18 58 20 -52 9 41 -6 -5 29 -16 -27 6 -9
4733 -9 -7 33 -9 -59 26 39 -34 -26 11 -23 -11 40 -20 -35 18 -10 -28 45 22 -64 2 50 -20 -5 30 -19 -20 52 8 -22 45 23
4765 23 -37 30 61 -28 -27 46 -14 -17 39 -22 -52 31 17 -40 29 19 -61 -23 53 -22 -27 36 -23 -31 58 14 -62 21 21 -39 23 46 -40
4798 -40 -11 50 -9 -21 71 -8 -46 50 50 -36 21 43 -44 2 60 -18 -29 47 -6 -36 54 20 -69 7 40 -43 -9 37 -44 -36 57
$$ packed form
4557C2n5L7j4l1M2Km8M2L1q3PP6l4n5N5Nk4K8k2k6L6J7n1K4N5n9l1O6J3m8J7r
4589ekL8j4m3K2M3m2j5N9k2n3L6QoPk2k0L3J5l9pM7j9l5L8Qj4Jj5RK8j1l5QM3
4624B4j2j8J2oKKNLjj1NJ6Oj5l5K0J6%%k6J1olMJ1rj2nJ9J1nk9jK9Jj1KoKO%%
4666dJ7j5k4L2J5k3rJ7lOOk2mK0pj7K8J1m7J0L2mk2J3l1J9M3m3l4M0K0m9K0K5
4700A6k4k6K6KJ3J7n1j5O4Mn6J9M8m9LL8k4j3K5l8LP6l8p2O1L2m7JL4m5j1L3j5
4733iKM0m2n0Q5J3p3QL7l4J2N1o0j5N3k8j8P3k3q6O6M8p0J5L5m9jP2m4l0O7k2
4765B3o0O7L1q9JP3o0lN6o1l0Q3j4n7O9j0q0L8P6p5nO3n9qQ9m4p6Q3%o0O2K3q6
4798d0K9O1n9j2R2p9l8R6%q6N7K2q7M6N8p8j1P6n3l0R0l4q9P6L3q3L4M6q1QR3
$$ plain form
4829 57 -20 -49 34 -19 -71 33 45 -57 -11 37 -41 -3 80 -24 -50 51 14 -28 49 25 -70 25 72 -37 3 55 -37 -34
4857 -34 69 0 -58 34 7 -77 33 34 -69 -14 46 -45 -17 44 -23 -59 40 10 -56 31 10 -71 14 67 -35 -19 46 -24 -14
4886 -14 73 16 -45 38 30 -44 54 47 -70 -14 80 -6 -31 53 -13 -38 46 24 -48 21 18 -72 18 75 -52 -46 42 -4 -26 46 -9
4917 -9 -64 39 32 -54 24 48 -66 -21 72 0 -27 34 2 -34 73 28 -62 33 53 -45 10 93 -37 -44 50 5 -18 43 -4 -63
4947 -63 38 43 -63 -5 44 -47 -25 55 -21 -53 24 -3 -42 55 20 -73 8 71 -28 -15 50 -34 -32 58 23 -33 60 4 -47 54
4977 54 57 -51 -24 46 -16 0 59 -3 -40 48 6 -45 39 28 -80 -5 56 -23 -37 18 -34 -32 49 -7 -68 33 23 -53 17 50
5007 50 -47 -36 42 -13 -5 44 -31 -39 61 37 -35 28 38 -36 -5 60 -8 -11 27 -17 -13 67 5 -65 35 44 -40 -9 35 -36 -39 34
5039 34 -12 -18 27 -22 -51 49 44 -55 -11 28 -23 1 50 -10 -20 38 -8 -5 59 10 -65 22 63 -12 -7 34 -16 -4 48 -2 -4 24
$$ packed form
4829E7p7k9Q3n3n2J04J2j02M6M8p8L8Q3j04k6J01l7m2P7k4r5R5M7j09M0N2r2L
4857c4J03o9n8R2k7q4J10Jj03N5O0r1K8O1o7l6R9l0o6Q7k1q1Q5N3j02J6O5p0J0
4886a4Q7n7o1Q3qp4R8pj17N6R4q6k5Q4o6k5Q4k2p2O9lr0R0N7j27OQ8m6k2P2n5
4917in5J03pq6P8K4j14M5R3p2k7O1l2l6J07m5r0R5K0r8N5Q3j30pR4m5k3O1m7n9
4947f3J01Nj06N8M9r1K2Q0p6l2P7k7l9R7l5r3Q1O3r9J3O5q4KR0l5n6R3n6n1J01
4977E4Lj08K7P0o2J6N9o2l7Q8m2n1Q4j1j08P5O1p9j4N5n2KQ1n6o1J01j0p6P0L3
5007E0r7J1P8n5QM9p5qJ00k4p2O3J0p4L1O5o8lL8m4MQ0o2p0J00Rq4L1M4p1lP3
5039C4m6oM5m9k9J00nr9M4L9n1K4M9o0j0N8m6LO4m9p5Q7M1p5NM1n0J2N2n0kK8
$$ plain form
5071 24 -10 -32 28 37 -44 -23 27 -5 -4 18 -26 -28 21 -2 -38 26 1 -44 3 39 -3 -25 10 -22 1 37 -3 -33 20 19 -10 36
5103 36 43 -26 -3 30 6 4 21 -24 -21 42 25 -24 -2 10 -12 -1 27 -12 -17 -5 -12 -4 29 -2 -40 7 23 -19 -16 -1 -26 0 12 0
5137 0 -8 17 -6 -14 28 21 -15 -7 22 14 11 12 -11 5 25 7 8 36 9 -33 -3 26 2 -26 -14 -7 4 14 -16 -37 4 -5 -19 -2 2 -14
5173 -14 -21 5 24 4 -7 -17 -10 31 14 -5 -5 16 -17 3 25 15 -14 -8 4 17 4 -2 -14 10 24 5 -18 7 5 -21 3 23 -8
5206 -8 -25 -25 -5 7 2 -25 -21 9 7 -22 -12 10 -14 -31 12 11 -2 0 -14 0 28 11 -9 6 27 2 4 34 16 -20 15 17 14 16 -3 -21
5242 -21 9 26 -6 -21 11 -1 -28 11 -8 -22 -6 1 -11 1 2 -34 -16 19 1 -14 11 -7 -18 7 10 2 14 1 -6 16 43 -5 -18
5275 -18 23 3 2 17 12 -17 9 26 -12 2 27 -20 -26 26 9 -10 6 -1 -28 22 7 -38 -9 9 -24 -12 32 -4 -22 16 3 -8
5307 -8 23 4 -31 23 51 -22 -5 44 -8 -4 29 18 -6 11 8 -13 33 29 -35 -12 39 -11 -21 17 4 -29 13 8 -22 11 -8 -43 10
$$ packed form
5071B4l4k2O0Rq1K1N0l2JK2m4kM9k3l6O4k5m5M7L6m2k2L5l2K3L6m0l0N3jk9M6
5103C6Po9K3L3k4kJ7m5LO3j7m9K2J2k2J1K8l9nJ2pQL3l1l8M7J6m2LJ5k5K6J2j2
5137@qK5k3qM2pl6QK9qlJk3J6K0j8JK8k7m2L0K9k4k8J2PJ1J0l0k1M1rj4J7Mj6
5173a4pK6J9k0j1j0PM1j7j9%K1l3K0K2j0k9OJ2J3j3oj2K4J4j9k3K5kk6K4K0l1
5206hj7%K0J2nk7ML0kk9J0K2k4j7M3jj3Kj4J4K8j7k0J5K1k5KL0j8l6L5KlKj9j8
5242b1L0J7l2j5L2j2k7L9j9j4J6Pj2J2Jl6J8L5j8j5K5j8j1K5LqJ2j3pK2K7m8j3
5275a8M1k0jJ5nk9K6J7l8J4K5m7oN2j7j9J6pk7N0j5m5K9J8l3J2M4l6j8L8j3j1
5307hL1j9l5N4K8p3J7M9n2ML3j1k4J7lk1M6mo4K3N1n0j0L8j3l3M2nl0L3j9l5N3
$$ plain form
5340 10 33 -27 -40 15 -4 -22 22 2 -32 13 10 -26 23 28 -31 -11 56 11 -15 21 4 -15 30 17 -12 24 26 -37 -2 49 -20 -28
5372 -28 27 7 -19 20 -10 -43 7 24 -42 -11 25 -38 -25 26 -9 -36 12 -5 -28 37 8 -38 11 31 -18 0 44 -5 -22 30
5402 30 17 -15 33 7 -37 34 40 -36 4 37 -10 -12 33 -6 -20 19 3 -31 27 6 -56 -16 37 -18 -21 24 -13 -27 21 4 -33 20
5434 20 8 -46 24 48 -28 -15 39 -2 -4 31 -2 -25 44 11 -30 28 29 -33 -6 46 0 -24 28 -18 -20 46 0 -46 17 15 -37 -9
5466 -9 37 -27 -38 26 -4 -18 32 -17 -32 27 22 -40 8 36 -21 -16 44 -1 -22 32 12 -14 46 9 -38 28 46 -31 3 43 -19 -16
5498 -16 32 -5 -23 21 -21 -31 24 15 -49 -12 39 -29 -20 13 -19 -38 18 -11 -24 27 11 -47 10 39 -27 -20 18 -1 -16 38 9 -22
5530 -22 28 6 -27 28 39 -29 -14 40 -15 -11 29 -8 -11 29 -6 -34 17 11 -57 -5 23 -23 -27 7 -14 -28 14 -9 -33 14 10 -31 6
5563 6 25 -25 -9 28 -3 -4 30 -14 -6 32 12 -11 10 31 -19 1 38 -4 -10 35 -1 -9 28 -8 -38 23 11 -27 -9 17 -6 -20 27
$$ packed form
5340A0K3o0j3N5j9j8M4k0l4M5ll6M9Nn9K0O7m5k6L6j7j9M5j3k9L6Ko3L5N1o9q
5372b8N5k0k6L9l0l3N0J7o6L1L6o3J3N1l5k7M8j7k3O5k9m6M9K0m9J8M4m9j7N2
5402C0j3l2M8k6m4P1Op6M0L3m7kM5l9j4L9j6l4N8k1o2M0N3n5lM5l7j4M8j7l7N3
5434B0j2n4P0K4p6J3N4m1kL5l3k3O9l3m1N8Jo2K7N2m6k4N2m6kO6m6m6O3kn2K8
5466iM6o4j1O4l0j4N0m9j5N9no2M8K8n7NO0m5k1N4k0k6O0l7m7O6J8p7L4M0o2L
5498a6M8l7j8M4m2j0N5ro4L7N1o8RL3l2j9N6k9j3N1j6n8N7K9o6PL8j9j5N4k9l1
5530b2N0k2l3N5J1o8J5N4n5MM0l7lM0l5k8N1oo8N2K8m6mL4k1j4M2k3k4M7mm1L7
5563FJ9n0J6L7l1jL4m4QL8k0k3K1K1n0K0L7m2oM5l6qL7l6l0O1j2l8J8K6k3j4M7
$$ plain form
5596 27 -11 -20 18 -6 -12 18 21 -30 8 24 -7 4 26 -1 5 24 4 -8 37 11 -30 14 25 -6 -9 38 -3 -6 14 -4 -12 21 1 -27
5630 -27 7 11 -30 -16 26 -16 -22 -9 -3 -13 19 -7 -20 15 4 -29 8 25 -24 -11 17 10 -2 16 1 0 30 16 -12 8 32 -16 5
5663 5 25 -1 0 6 0 -7 7 -9 -15 4 14 -28 -5 11 -5 -14 3 0 -2 -6 3 -9 6 1 -20 -3 15 -7 -8 16 11 2 12 5 -1 25 7 0 13
5702 13 18 1 5 15 10 2 8 10 -15 20 -3 -9 0 20 -4 -16 -3 5 -14 -2 -6 -17 -9 -13 -28 0 7 -9 -3 5 5 -3 4 8 7 10 11 1 8 10 13 2 16
5745 16 16 -2 1 30 7 10 7 -3 4 3 -13 -12 11 2 -1 -3 5 -10 -12 -2 -7 -5 -7 -2 -12 4 -7 -14 2 4 -17 -10 6 -3 1 12 0 6 9 1 1 19 16
5788 16 -12 0 13 5 -4 7 -1 2 9 -9 -16 10 7 -23 -7 2 -10 -23 -8 -10 -15 2 -1 -20 5 3 -13 -2 12 -14 -13 21 8 -10 4 1 -7 14
5826 14 18 3 20 24 0 9 27 8 -3 15 5 -6 12 19 -12 7 19 -16 8 7 -4 -20 7 -6 -25 9 -11 -10 0 -2 -24 -6 17 -17
5860 -17 -4 22 5 -9 16 6 -12 24 13 -11 22 30 1 6 32 -13 0 23 19 -6 7 20 -9 7 15 -23 -7 15 -10 -13 13 -9 -19
$$ packed form
5596B7l8rL8k4oL0Ln1L8J6l1J1K2k7OJ9k0j2M5k6m1M4J1l1lM7m1lK0j8qL3k0k8
5630b7L4Mm1J4M2m2oJ3Oj0L2k6j3L5j1l3L7J7m9J3K8pj2J8j5jL0j4k8K0K4m8K1
5663EK0k6JOopJ4j6oJ9J0m2K3J6j6rJ7lkmRj2J5nk1J7J8k2jK4nrJ0poK6j8pJ3
5702A3Nj7MJ0nqOKk5L5k3oRK0k4j2J3Qj9J2mj1Qmj5K8Pj6OQ%qPMjLJj0PKLj1J4
5745A6%j8LK9k3Llj0Pjj6JK3rlkQj5kJ0nKkNj0J6j1pJ6Kk1PJ6rMJ1j2OLq%J8l
5788A6k8J2J3qrJ1qLPj8pK6ll0J6Rj2j3J5knJ7lj9K5kj6J1J4k6JL4j3j8J4lqK1
5826A4Mj5J7Mk4RJ8j9j1J8j0j1J8Pl1J9J2l5K4jj1j6K7j3j9L4k0JJ0kk2J8K3l4
5860a7J3K6j7j4K5j0j8L6j1k4L3Qk9NK6m5J3K3mk5J3J3k9J6Ql8J6K2k5lK6k2j0
$$ plain form
5893 -19 19 4 -25 6 9 -16 0 27 -7 -10 24 4 -8 18 11 -15 24 37 -13 22 39 -7 3 30 11 -2 33 16 -5 21 16 -6
5925 -6 8 25 -13 4 27 -9 -22 14 -3 -12 20 10 -22 7 20 -19 -3 22 -2 -5 28 3 -20 15 9 -21 20 27 -20 6 31 -4 9
5958 9 33 -5 -2 34 5 -16 12 8 -20 11 23 -18 -13 18 -14 -15 9 7 -10 10 7 -25 7 11 -18 -10 20 -15 -13 24 1 -24 15 6 -17 13
5994 13 16 0 2 25 3 5 37 8 -3 24 18 -9 11 23 -9 -2 11 -1 12 19 -12 -5 6 -5 -20 11 13 -31 -6 8 -12 -12 15 -18 -11
6029 -11 23 -11 -15 27 14 -19 11 28 -15 -11 21 3 6 24 8 -4 30 18 -6 16 28 -20 0 22 2 0 19 -12 -1 12 7 -17 9
6062 9 8 -28 -11 12 -22 -16 10 0 -11 2 -13 -4 23 14 -13 9 24 -6 7 21 5 -3 21 8 10 25 4 -13 4 21 -6 6 15 -1
6096 -1 -18 8 -3 -5 0 -10 -20 -2 3 -32 -10 8 -14 -17 1 -7 -23 -1 -2 -10 12 -6 -11 4 24 3 3 20 5 -5 20 3 -5 20 20 0
6132 0 17 16 -7 -3 25 6 0 11 -3 -10 12 9 -18 1 11 -15 -12 4 -13 -9 -8 -11 -22 6 -4 -22 11 13 -15 -3 13 -6 3 8 2 1 15 1
$$ packed form
5893a9L8j5k9L1Lk5J6K7l4lL4k0j2K6pk6L9J3n0L5J7m6J0K7j9j3L5j7k1K6nk2
5925fJ4J7l8J7K3l6j3L6j7rL2j0l2K9J3l9J6K5k4lL3k5k3L5ol0M1Pm7K6K5l5J3
5958IK4l8LL6k9k1K8mk8L1J2m1NL1l2jK4kj7K0ll2L2Mk9QL0l5KL7k3k5L9rk3L0
5994A3Lj6KK3k2KL2k9j1K7ok7K0J2l2PJ3j2J3Pl1PJ1j1j5L1Km4K5J4k0%K7l3P
6029a1L4l4mM2j3l3L0J7m3ML2j8LJ8j6j2L4j2k4K2J2m8K0K2k0kJ9l1J1J3nk4K6
6062Ijl6J7K3l4OK6j0j1J3j5RK7rk7K2J5l0J3J4j6qK4j3KJ5k1j7J7J7k7J2Rj6
6096aj7K6j1kNj0j0J8Nl5K2J8k2lJ8qj6K2jqK2j8nJ5K0k1%J7j5j0K5j7qK5%k0
6132@J7jk3MK8j9oJ1j4pK2lk7J9J0k6LJ6j7MJlj1K8j0j8L3Kk8J2J6j9RNojJ4j4
$$ plain form
6170 1 0 19 12 1 1 23 -1 1 5 4 -3 4 9 -2 9 2 -16 -8 13 -1 -13 3 10 0 5 -11 -18 3 3 -17 3 12 -5 -1 5 13 3 6 9 3 10 7 -5
6213 -5 10 21 -2 -3 23 5 6 -3 1 2 9 7 -9 2 -2 -7 -11 9 -7 -13 -4 0 -26 0 -12 -16 2 5 -18 -13 5 15 -10 6 13 3 3 0 -2 7 13 -3
6255 -3 -5 19 17 -12 6 13 5 7 3 -2 6 15 -18 -10 20 -13 -28 -4 2 -5 -14 -4 -1 1 9 -16 -6 6 -8 -18 -4 12 -14 1 11 0 6 -4 -11 15
6295 15 22 5 -1 20 9 -9 16 23 7 10 -3 -3 15 16 -9 -20 17 4 -26 0 5 -15 -19 -3 -8 -5 -3 -28 -7 18 -6 -26 4 17 -3 -1
6331 -1 -1 -11 -13 6 -9 14 27 -7 -14 12 19 -24 -5 1 -14 9 7 -14 3 20 -19 -15 10 -7 -33 -14 5 1 -9 -4 -16 -8 9 -28 -14 16
6367 16 -5 -20 1 18 -8 -5 -2 -12 3 19 -19 -14 20 2 -16 20 14 -11 3 18 1 13 18 -22 -6 29 -15 -32 12 11 -8 -2 7 -16
6401 -16 0 7 -16 -6 13 -15 -20 18 14 -22 1 1 -13 11 9 -10 -8 8 -20 -8 28 4 -18 2 16 -2 7 1 -13 8 28 -1 8 27 -4
6436 -4 -15 19 11 -21 -2 -5 -11 5 10 -30 -18 19 -5 -20 9 -6 -25 -18 1 -14 -4 -1 -25 9 25 -5 -12 20 7 -22 15 15 -7 1 11
$$ packed form
6170AjJ9pj1%K2k4KMjpPNj1J1pj8QK1j4j2J6Pj0Nj6pK1%k0K0Rj7MOQj0LLoPlj2
6213eJ5J1k3jK6j8JrMJPkj6J1mnmK0j6oRMk6K6j2mJ8Lk3NJ8J0k5J6Pj0%lkROj6
6255ckK4kk9J8PqKmnQRl3QL0l3j5K4OprJ0LKQk5J0J2j4j0J4J6k6J5J0j1Oj0pK6
6295A5Pj7oK1j1j8K5Pj6Lj3%J8Jk5j1L7j3l0K6Nk0mJ6nLKk5K1K5k4k0L0J3k0K
6331a%j0kJ9j5K3J3l4pK6Pm3J9Oj5K3kk1J7J7l9MK5j7k6J9J9mj0Nj2QJ7l7J4L0
6367A6k1j5K1J7k6LLj0J5J6l8NL4j8j8L6ok5J4J5j7J2Nm0J6L5m4j7M4jj9ORk3
6401a6J6Pk3J0J9k8nL8ml6K3%j4K4kj9KJ6k8J2L6k4k2K0J4j8Roj4K1K0k9RJ9l1
6436dj1L4ql2J9loJ6Nm0J2L7k4j5K9j5j9PJ9j5J0Lk4L4J6l0pL2j3k9L7%k2QJ0
$$ plain form
6471 11 -8 19 19 -26 -10 26 2 -23 5 0 -5 6 6 -21 3 2 -27 -14 8 -10 -23 -1 5 -15 2 -10 -20 -3 15 -11 6 21 -15
6504 -15 -18 14 14 -8 3 0 -13 20 18 -22 11 28 -6 -2 24 10 -14 6 6 4 6 -4 -20 7 8 -15 -11 11 -10 -30 -6 2 -17 -8 -6 -9 4
6541 4 9 -20 -6 17 0 -18 3 10 -11 19 8 -9 13 11 -17 12 19 -1 -11 14 11 -5 8 8 -12 7 4 -10 -5 6 -28 -13 9 -6 -22
6576 -22 -13 -5 -23 -2 10 -13 -8 -2 -13 3 10 -7 -6 14 4 6 0 5 -11 4 12 5 4 17 -1 2 13 18 -11 13 3 5 0 11 -13 -13 5 -5 -3
6615 -3 11 -8 -25 0 -1 -9 -6 -5 -18 -3 0 -2 -15 -6 -9 4 14 2 -13 -6 1 5 -3 5 5 6 25 7 6 7 12 7 7 17 -8 -6 -1 -7 -1 -3 -13 -9 -4 1 0
6660 0 1 -12 -17 -12 8 7 -11 -11 -13 -4 -5 -6 -8 -2 8 2 11 17 0 -3 5 13 10 13 10 -4 18 10 12 9 9 3 5 16 15 -1 -6 -4 0 3 1 -23 -17 -7 1 -12 -8 -8 -10
6709 -10 -6 3 1 -14 -14 -4 6 12 -3 -9 8 6 7 10 12 -3 0 4 6 18 6 2 -2 21 30 -3 -8 4 0 -3 3 -9 -11 2 -9 -10 8 -10 -27 -9 7
6750 7 -17 -12 -7 -20 -6 7 -11 -6 1 -7 -11 15 15 -12 3 6 10 13 10 -1 5 17 15 1 25 12 -12 9 10 4 -4 4 -6 -6 18 -2 -20 1 8 -13
$$ packed form
6471A1j9K7%m5J6L6k4k5K8nnJ1%k7K4jk9J3K2j8j3K2Ok0J7j2j0J7J8k6J7J5l6
6504a5lL2%k2J1lj3L3km0L3J7l4MK6j4k4K0%kKj0j6K7Jk3MK2k1k0K4Qj9RKlJ3
6541DNk9J4K3j7j8K1Pk1L0j1j7K2kk8K9Pk0j0K5lj6J3%k0J9lj4NJ1l4J5K2j5j6
6576b2RQj8K1J2k3NOj1J6Pj7JK0j0KoNj6J5QpjJ3j8LJ1Nk9K4j0KnJ1k4%J8j0K
6615cJ4j9j7K5jqLJj3J5Lkj3RlJ3J0j2j5PPMqQ%JJ9j8jJNn%J0k5KNoOkj0MNNj
6660@Jj3nNK0jj8%kRjjkOJ0oROj7lQQlLlj4K2qKl%oKJ1jj6nKMLkk4OJ0Qj3M%k
6709a0MRkj5%J0J0Oj5oJ7kJLKj5LMKJ2j2mmK3Rl3nJ2mlOj2kJ3j1jJ8j8j7J8J6
6750Gk4NNj3J4J3j8NPqmK6%k7J5LMLlj1OJ2kj4K4j3k4K1JoqQj0%K4k0j8K1Pk1
$$ plain form
6790 -13 -8 8 -19 -6 -10 -17 -6 6 -15 -8 20 20 -6 4 18 -2 7 20 -2 -1 17 -4 11 26 13 -18 11 22 2 -3 7 -8 9 14 -8
6825 -8 -9 20 0 -10 10 6 -19 -10 4 -2 -8 6 -20 -15 27 -2 -3 20 0 -23 4 17 0 7 8 -3 14 35 0 -13 30 16 -6 12 26
6860 26 4 10 24 -2 15 18 -19 -10 18 10 -20 5 0 -16 3 9 -4 3 8 -14 1 23 -10 -24 16 20 1 10 18 6 24 9 -5 12 37 -7
6896 -7 1 40 22 -8 6 20 8 23 9 -12 -5 17 -14 -13 10 -1 -24 13 13 0 0 0 -22 0 9 -8 -12 11 -6 -25 11 13 -16 -11 2 -10
6932 -10 15 13 -4 3 26 6 0 27 20 -9 10 18 -8 13 16 -6 8 18 -14 -16 25 5 -14 4 8 -18 5 12 0 -5 10 -30 -3 19 -1
6967 -1 -21 5 5 -10 19 4 -14 5 8 1 5 31 -1 2 17 12 -9 14 15 -7 15 19 -4 4 21 -13 3 18 17 -15 9 10 -7 -1 9 -22 -8
7004 -8 7 -12 -6 20 -5 -6 5 4 -12 2 0 -19 19 14 -14 2 21 6 -4 20 7 -6 12 12 -3 14 16 -16 12 31 3 -8 -2 -9 2
7039 2 7 2 -13 -3 -1 -10 5 17 -18 -14 19 13 -10 14 -2 -11 7 10 -2 15 21 -15 5 26 8 -6 6 9 7 14 8 -2 10 18 -4 7 24 -8
$$ packed form
6790a3NJ6k7J3mpJ1J2k1PK8%k6J0J4k0RJ3k2JJ8k1J5J5j3l1K9J1k0nJ0j5J7Nk2
6825hjK9k0j0K0mk5RJ4ooJ4k6NM2k9jK3k0k3K7J3j7PJj1J7K1l5j3M3j4k2J8J4
6860B6k2OJ4k6J7Ll7RK8ql0K5nj6J9Oj3PNk2J5K2l3j4M0Mj9RQj2J8j5j4J7K5m4
6896gQL9j8l0J4J4j2J5j4k1PK2l1JK3j1k3L7%j3%%k2K2Rj7mK3j7j9L6Kk9NJ3j2
6932a0K5kj7PK3k0oK7pk9J9Qk6K1Lk2J4J0l2kM1k0j9J8Mk6K3Pj2nJ5m0K7K2k0
6967ak0K6%j5K9j5j8J9LpMK6l2LJ5nk1K3Jk2K2Mk3QJ7l4J6J5jl2K4Jj7OJ0l1J4
7004hJ5j9OK6k5jJ1jj6J4kj9L8nk8J6J9j5j0K4j3j3J8%j5J7Kl2K8J9k8j1OpJ1
7039BNnj5J0KrJ5J2l5ML3ok3K4j6rJ8Lj2J7Ol6K0K1j8j4J2LkPoj0J2Qk2J1J7l2
$$ plain form
7077 -8 -15 5 7 -14 -4 -8 -15 12 3 -24 -13 9 -13 -5 15 -4 -26 1 2 -5 -2 -13 -12 5 12 -1 6 8 6 -1 15 10 -3 14 14 4 17 12 -5 12
7117 12 16 -4 4 23 -12 -7 -6 -4 -2 6 6 -16 -1 6 -15 -17 -5 -6 -13 -2 -5 -14 -3 -1 -9 15 10 -14 10 16 7 7 16 5 8 4 4 -1 11 9 -7 12 7 -4
7161 -4 -9 3 -7 2 -5 -3 -9 7 2 -14 1 -8 -12 -12 -1 -4 -7 0 -21 -16 5 -12 -16 2 -2 -11 -1 12 6 9 2 5 9 4 -5 6 15 -2 3 1 14 2 -3 5 0
7206 0 -6 -21 -2 7 2 -9 -25 -5 -8 -6 -16 -6 -9 -5 -9 -3 1 -10 -7 -10 0 -5 -19 -5 8 -4 -7 2 0 -6 -5 -7 10 -1 0 -3 7 14 -1 -2 1 -4 -1 -5
7250 -5 -6 -6 -7 -6 -5 -7 -1 -6 -5 4 0 -2 -6 -7 -6 5 3 -5 -4 0 -4 -1 9 4 1 -6 9 3 -1 -1 7 7 9 9 9 10 12 -1 -12 7 5 -3 2 3 -7 3 4 -7 -2 1 -9
7301 -9 -2 -7 -8 -13 -5 -4 -6 -11 1 -9 0 8 -4 -2 14 5 2 8 3 -1 15 14 10 1 1 2 6 12 4 -9 1 16 -6 -11 1 -12 -7 -9 2 10 -4 -9 -17 4 -9 -13
7347 -13 -7 -2 -8 11 -5 -2 7 3 -9 -13 9 1 -7 5 13 10 0 6 2 10 12 3 7 13 0 -4 13 1 -2 8 11 5 5 3 -19 -7 11 -3 -4 8 -1 -7 -6 -1 -13
7392 -13 3 8 -20 -11 10 -3 -1 8 -1 -13 12 1 -1 2 0 5 13 10 -3 9 23 -1 -9 10 -2 -6 9 1 -9 2 6 -14 -5 6 -6 -10 2 -8 -8
$$ packed form
7077hpK0Kk1J0mpK7rk7J1K2k2QK0j9k2K7JpLj1JJ7Pj3PKkpJ6nj3J7%j0J3nj7J7
7117A2Mk0QJ9l5NJKKQ%k2J5Pk1kJ2jpJ1lrJ1KqK4nk4K4Or%Rj1Lm%nJ2kj6J9nj1
7161dnJ2j0RpKoJ6nj6J5rm%J1llPk1NK1j7mJ8mrJ0J3oLpLMnrJ1Rj7NkJ3j2nQn
7206@oj5J9Rnj1j6K0lKj0J0lMmOMj1LlJ0nj4J4J3j2lRkoJkJ7j1JlJ0Pj5jLnLm
7250ej%jJJkOnJRmkmjJJ1kqJMmLJ0nlpJ5om%Q%K%%JKj3j1J9kqNJj0J0Jj1NLj0
7301iPnjnQJknJ2j0RQj2KJ6rlOnmJ6jmr%JMOqj3J0J5k2nJ2j3NkJ1Qj4nqK1j3m
7347a3ONoJ9j6LRmj2mK2qqJ2Qlj0OmQKrMOj3mJ7j2lJ0Lo%kk2J2J8j4jJ2roJNj2
7392a3J6Nk8RK1j3KRrj2K5j1kLkNQlj3J2J4k4qJ9j2mJ5qj0J1Mk0RJ1j2mJ2j0%
$$ plain form
7431 -8 2 -8 -17 0 4 -14 -2 5 -12 -7 12 2 4 8 -2 4 18 6 -11 8 21 -2 -4 14 -5 3 1 6 6 12 1 -3 -1 8 -14 -9 2 -26 -1
7470 -1 2 -9 -20 4 -10 -23 -3 4 -12 2 -4 -5 -12 9 -5 -4 7 6 6 21 6 12 12 19 6 7 15 1 1 7 1 -4 4 3 -5 10 9 -11 7 12 0 3
7512 3 5 1 -2 10 4 -6 5 3 -18 8 5 -6 2 5 -15 -5 9 -6 -8 6 9 -9 13 13 -3 10 10 -2 -9 14 -7 1 11 2 -4 16 -7 -19 0
7551 0 3 -9 -4 2 -25 -10 3 -2 -8 0 1 -16 9 5 -20 13 4 -18 -9 17 -10 -4 10 -1 -4 3 11 7 13 20 -4 2 23 3 4 14 0 3 8 7 -7 3
7593 3 5 -7 -6 9 -10 -4 7 -5 -11 4 -2 -11 9 4 -3 2 8 -8 -2 20 4 -9 12 4 -9 13 1 -8 7 18 7 11 24 4 0 6 7 9 22 9
7633 9 -1 14 0 -20 3 13 -10 -9 7 -3 -12 4 -6 8 8 -7 -1 -2 4 -6 2 8 -5 -1 12 7 -8 17 5 -4 20 6 3 9 9 9 10 10 0
7672 0 4 -1 -6 -3 0 -5 -6 -4 4 -10 -10 2 -19 -12 -7 -8 -19 15 5 -11 1 3 -5 -3 11 -2 -2 17 0 10 6 3 1 1 18 -6 4 3 10 5 2 -3 5 14 2
7717 2 -4 5 0 -3 2 0 -7 0 0 -9 -2 -2 0 -4 4 4 -13 9 9 -3 3 -3 -5 20 10 0 7 14 7 5 5 18 0 13 20 12 1 7 9 10 6 10 6 4 -1 -8 6 -6 4
$$ packed form
7431hJ0j0rJ7Mj8J2Pj7NJ9j0KMj0OJ4j2j7J9J3k3kJ8j9QkN%Oj1mKRk2NJ1k8K5
7470aLj1j1K4j4j3K0Pj6J4ojpK1j4JJ1j%J5j5O%Pj3JQj4%OonQjqJ5jk0J8Nj2L
7512CKmlJ2oj0J1kk1K6lj1QLk0J0J4j5kJ4Lj8K2%j6J3%j2pK3k1QJ0roK0k3j2J9
7551@Lj2NOk7J5J3noQJj7K5mk5L3rk2RK6k7OJ4j1lPQmOPk4OK1k0JJ0j4LNjj4J0
7593CKj2JJ5j9OJ1j2oJ5orK0npNOj6OK2j6j3K1qj3K2j2rJ5J1j1MJ3k0mOJKJ3j3
7633Ij0J5j4k0K3J0k3JJ6j0rJ6j0J4%j5OjOj0QOj3MJ3nj5K5j2rK4j4lO%%J%j0
7672@MnnLLnjKQj4%J2k1PNjj1L4j0j6J2KqKJ4j3%J9j7J0mlk%J7k4J0jPnlnQRj2
7717BoRnlNkpP%rP%KmQ%j7K2%j2OokK5j0j0PPpk%J3j8J3Pqj1OKJmMmknpJ4j2J0
$$ plain form
7766 4 6 -2 -11 9 8 -7 -9 6 9 -12 -2 -7 -10 6 -16 7 13 14 -4 5 16 9 9 13 9 8 14 7 8 14 8 9 1 15 8 -3 2 8 -1 -3 0 -7 9 0 -1 2 7 -5
7814 -5 2 21 13 -1 -3 3 -1 -5 -1 -4 10 18 -10 6 11 8 2 4 12 13 9 10 11 28 6 1 17 14 2 -9 9 23 9 7 -2 8 9 0 -3 4 9 1 -11 4 0
7859 0 -6 5 -1 5 2 -7 -1 1 7 -1 -3 12 3 9 -2 8 -7 2 5 1 14 0 0 5 12 3 4 2 9 4 1 4 2 4 -3 7 0 -1 -8 -7 -7 -7 1 -11 -18 -8 -9 -16 10 -8
7909 -8 -12 10 2 5 -4 -4 2 -4 10 3 1 5 0 5 10 12 3 13 1 2 5 6 -1 -2 -2 9 3 -1 -8 -3 -1 -1 -8 -1 -11 -8 -16 -9 -3 -10 -13 -9 3 -2 -4 -5 1 6 -11 6 15 1
7961 1 3 11 7 -4 11 11 10 8 9 4 3 9 3 -9 0 7 -3 2 3 -7 0 -5 -16 6 -4 -16 -4 1 -11 -10 5 6 2 -2 -9 -2 7 -1 0 0 11 1 -3 4 -1 11
8007 11 14 6 6 1 5 -4 8 6 -7 14 10 -6 -4 -1 -5 0 1 3 -6 -4 0 -16 -11 4 -5 -3 0 -5 0 3 5 -4 5 8 1 7 11 0 11 20 4 15 13 15 -1 14 14 -3
8055 -3 7 3 1 7 9 3 -3 3 7 -2 -4 -5 -7 -1 2 -5 -1 0 -2 2 3 -1 7 11 -11 0 7 6 -9 8 2 -3 10 19 -4 -5 24 -15 -2 10 14 -8 13 8 -1 9 5
8102 5 -12 4 7 7 -8 2 -4 -14 5 -3 -13 -1 -3 -2 0 8 -5 -4 2 1 -3 7 7 -8 12 4 -6 3 12 -6 0 23 0 6 18 2 7 21 1 -16
$$ packed form
7766DKqrK0jj5kJ5Lk1J0nlJ6k2K3OJj8RJ1p%MmjOpJOoJqJ4pj1NOrkLpJ6rjLNj2
7814ePJ9qj4kOmmMlJ4Qk8J6NloKQJmJJJ7k2nJ6lj2j1J8J4j4krJ0JrlPNqj2J5m
7859@oJ1oOlrOKOqkJ5rOj1J0j5RLmJ3j4%NPrJkPnlLkKpJ0pjpJ%%Qj2pJ0jpK6j8
7909hmK2qLr%OoJ4pkMnNNKrJ0j2JLJpj%J1ompNK%pPj0LqPOplMJ2nkjONj7J7Rj4
7961AKQmj1J5%jkJnjOoj2RPj0NJj0Pnj1K2j0j2J2Nj2JJ5JmmpPRqJ%J1j0mPnJ2
8007A1Lq%nMrJ2kj3K1mj6KLmNJKrKMj6NJ5rKLnNLKrRLpOMj1J1Rj6J1kKj6J5%j7
8055cJ0mkOKooOMrkjkOLpMJkMJmQMk2J1Pjj5J7onJ3Rk3jK9l9J3J2Mk2K1nrJ0m
8102Ej7J6L%j5J0oj0J9qj0J2kJKQj3JOjmJ0%j5K0qj0RRj8OK3k3OJ2j6NJ4k0j7
$$ plain form
8142 -16 13 6 -6 8 2 -7 -2 1 0 -6 0 -3 -2 7 4 -9 -4 10 -16 -5 8 4 -18 0 1 -9 12 17 0 13 10 -3 8 15 10 1 1 6 -4 11 10 -7
8184 -7 0 9 -12 -4 13 -3 -3
$$ packed form
8142a6K9pj2J4orNLjoOlJRlj3NJ4k6J1J3mk2J8Jj0K1Nj7J3lj3J1Pnr%Nj0J5jj7
8184gPRk1QJ7j6%
8191c
$$ Imaginary data points
##PAGE= N=2
##DATA TABLE= (X++(I..I)), XYDATA
$$ plain form
0 0 0 0 0 0 0 0 0 0 0 0 0 0 0 0 0 0 0 0 0 0 0 0 0 0 0 0 0 2 -5 8 -8 8 -8 8 -8 8 -10 13 -13 16 -16 18 -20 21 -25 26 -29
47 -29 33 -36 39 -43 47 -53 57 -64 72 -79 92 -104 120 -138 162 -196 244 -316 430 -633 1068 -2344
69 -2344 12833 44112 -29116 -29846 36136 6705 -20992 12142 -8116 -17972 35084 7740 -46643
82 -46643 13150 38083 -32734 -16008 39539 -6299 -27748 16923 2517 -11347 23472 -6113
94 -6113 -36674 25482 30534 -37010 -9548 35014 -13830 -21094 25266 1384 -17855 15148 -4197
107 -4197 -21178 28438 14634 -41093 660 35697 -16377 -16145 23683 -6107 -17481 19377 -126
120 -126 -17722 20575 3535 -33340 13907 30973 -24837 -14744 23700 -6003 -11337 19777 -5570
133 -5570 -18737 19238 3877 -23973 15873 18463 -28826 -6022 27252 -7107 -12175 14052 -8007
$$ packed form
0@%%%%%%%%%%%%%%%%%%%%%%%%%%%KpJ3j6J6j6J6j6J6j8K3k6K9l2L4l8M1m6N1n5
47b9O2o9P5q2R0j00J10j21J36j51J71j96K24k58L00l58M40n60P46j063J701l412
69b344J5177L1279p3228p30O5982k9431k7697L3134k0258r856N3056k7344n4383
82d6643N9793K4933p0817J6726N5547m5838k1449M4671j4406j3864L4819k9585
94f113l0561O2156N052o7544K7462M4562m8844p264M6360k3882j9239L3003j9345
107d197j6981M9616j3804n5727M1753L5037n2074K32L9828k9790j1374L6858j9503
120a26j7596L8297j7040l6875M7247J7066n5810J0093L8444k9703n334L1114k5347
133e570j3167L7975j5361k7850L9846K590m7289K2804L3274l4359n068K6227k2059
$$ plain form
146 -8007 -11584 22030 534 -23161 13626 12379 -23366 3200 23253 -14350 -12414 15375 -3922
159 -3922 -6325 17270 -7328 -20215 18484 11348 -21883 3809 16478 -16257 -5655 18293 -5427
172 -5427 -8441 11885 -7676 -10954 21192 3514 -24549 6617 16387 -14016 -2067 14455 -9959
185 -9959 -7086 13221 -5015 -7010 15795 -4481 -19841 14256 14723 -17166 -3162 12209 -8084
198 -8084 -2295 12519 -7355 -7301 12591 -4353 -11635 15720 5980 -20048 1342 14832 -6809
211 -6809 -3278 7566 -8196 -3145 13286 -4718 -9784 12327 685 -15688 8210 12880 -11678
224 -11678 -4960 8133 -4056 36 9396 -8423 -8019 12869 474 -11921 8554 6695 -13624
237 -13624 -347 11322 -3998 -2773 4692 -7151 -1778 13054 -3152 -11829 7978 4893 -10235
$$ packed form
146h007l577L3614k1496k3695L6787j247l5745K6566K0053l7603J936K7789j9297
159c922k403K3595k4598j2887L8699p136l3231K5692J2669l2735J0602K3948k3720
172e427l014K0326j9561l278L2146j7678k8063L1166R770l0403J1949J6522k4414
185i959K873K0307j8236j995K2805k0276j5360L4097M67l1889J4004J5371k0293
198h084N789J4814j9874N4J9892j6944p282K7355r740k6028K1390J3490k1641
211f809L531J0844j5762N051J6431j8004n066K2111j1642j6373K3898M670k4558
224a1678O718J3093j2189M092R360j7819M04K0888j2395j2395K0475j859k0319
237a3624J3277J1669j5320J225P465j1843N373J4832j6206q677J9807l085j5128
$$ plain form
250 -10235 3339 8640 -7823 -3547 6125 -2899 123 7444 -7101 -7888 10857 3935 -9839 2224
264 2224 5305 -6878 42 7107 -3545 -2367 4012 -4722 -1871 10105 -1322 -10664 3842 6173
278 6173 -4842 300 3853 -4995 -1227 5241 -2239 -1273 5280 -4095 -6315 7587 4799 -7101 -1247
293 -1247 3475 -2256 1002 3663 -3838 -2017 3966 -2000 -2193 5959 -100 -7529 1479 5558 -1534
308 -1534 -1242 563 -2833 762 4197 -1949 -2372 2880 -1137 -3480 3848 3448 -4121 -2575 1870 867
324 867 1267 723 -3366 -1202 3373 154 -1807 1854 274 -3429 194 3572 561 -1928 -1574 -554
340 -554 1980 2350 -1629 -2466 959 1010 -804 637 1349 -1261 -2256 402 2573 1139 -1808 -2250 236
357 236 2207 1123 -1284 -1376 454 451 -625 826 1722 -1588 -2906 1163 2892 41 -1448 -1380 -521 2192
$$ packed form
250a0235J3574N301j6463M276R672r024L022P321j4545p87J8745o922j3774J2063
264B224L081j2183O920P065j0652J178O379q734K851J1976j1427r342J4506K331
278F173j1015N142L553q848L768O468p480R66O553r375k220J3902k788j1900N854
293a247M722n731L258K661p501J821N983n966j93Q152o059p429R008M079p092
308a534K92J805l396L595L435o146m23N252m017k343P328m00p569J546M445j003
324H67M00n44m089K164M575l219j961L661j580l703L623L378l011k489L54J020
340e54K534L70l979q37L425N1j814J441P12k610r95K658K171j434k947m42K486
357B36J971j084k407r2J830lj076J451Q96l310j318M069J729k851j489O8Q59K713
$$ plain form
375 2192 1597 -2145 -854 1751 -1143 -1364 3076 1191 -3454 -1001 1761 548 1138 -190 -3575 303
391 303 3990 -1286 -2344 2658 -284 -3537 2098 2978 -2071 -866 302 -1888 2186 3622 -4047 -3077
407 -3077 4459 359 -3403 2805 1360 -4268 559 2806 -1741 971 1762 -4877 -565 6694 -1285
422 -1285 -5285 3157 1547 -3799 2346 2574 -4067 316 2635 -3667 899 5606 -4486 -5082 6018
437 6018 2031 -4885 1866 1588 -4321 2118 3562 -4494 260 4586 -5036 -2501 7937 -571 -7084
452 -7084 3062 2799 -3790 2477 2087 -5920 1375 5509 -5160 -1654 7370 -3293 -6561 6420 2967
467 2967 -5787 1721 1847 -4904 3370 4746 -7164 -1171 7725 -4029 -5058 7689 572 -7612 3218
482 3218 3304 -4516 2867 2583 -7664 1491 8410 -5721 -4805 7988 -912 -7010 5455 3057 -6161
$$ packed form
375B192n95l742J291K605k894k21M440j885m645K453K762j213N90j328l385L878
391C03L687n276j058N002k942l253N635Q80n049J205J168k190M074J436p669R70
407c077P536m100l762O208j445n628M827K247m547K712P91o639M312P259p979
422a285m000Q442j610n346O145K28o641M383K319o302M566M707j0092n96J1100
437F018l987o916O751k78n909O439J444q056M754M326r622K535J0438q508o513
452g084J0146k63o589O267l90q007P295M134j0669L506R024j0663l268J2981l453
467B967q754P508J26o751Q274J376j1910N993Q896j1754j029J2747p117q184J0830
482C218Q6p820P383k84j0247R155O919j4131R16J2793q900o098J2465k398r218
$$ plain form
497 -6161 2124 2566 -6018 3291 6513 -8289 -3297 9706 -1949 -6938 6227 1612 -6957 3528
511 3528 3428 -5855 2795 4404 -8400 30 10309 -5056 -7340 7907 1092 -7069 4748 2703
525 2703 -7011 2997 4322 -7444 1701 8315 -7728 -5199 10351 -365 -8014 5398 2089 -6961
539 -6961 4298 4038 -7817 1958 6787 -7876 -2105 10418 -3647 -8060 7373 1947 -7058 4649
553 4649 2871 -8107 3124 6562 -7853 -848 8943 -5655 -5814 9299 62 -8026 5336 2425
567 2425 -7642 4382 5449 -8870 106 8561 -6147 -3821 9209 -2735 -7471 7509 1733
580 1733 -7941 5129 4066 -9294 2115 8546 -7288 -3245 8698 -3719 -5586 8438 -485
593 -485 -8210 6407 3234 -9158 3697 7364 -8714 -2030 9134 -3951 -4678 7465 -2130 -6505
$$ packed form
497f161Q285M42q584R309L222j4802M992J3003j1655m989J3165m615q569J0485
511C528j00r283Q650J609j2804Q430J0279j5365k284J5247o815q161J1817k045
525B703r714J0008J325j1766R145O614j6043K529J5550j0716p649J3412l309r050
539f961J1259k60j1855R775M829j4663N771J2523j4065m413J5433n426r005J1707
553D649j778j0978J1231L438j4415P005R791j4598j59J5113r237q088J3362k911
567B425j0067J2024J067j4319Q976Q455j4708K326J3030j1944m736J4980n776
580A733r674J3070j063j3360J1409O431j5834M043J1943j2417j867J4024q923
593d85p725J4617l173j2392J2855L667j6078O684J1164j3085p27J2143r595m375
$$ plain form
607 -6505 7755 1441 -9301 5028 6031 -9478 -28 9345 -5450 -4704 7372 -2070 -4811 7336
621 7336 -887 -8304 6897 4572 -9989 1900 8734 -7259 -3693 8497 -2420 -4840 6352
634 6352 -1801 -6097 7879 1799 -10226 4230 7719 -8738 -1895 9138 -4009 -5038 6769
647 6769 -1450 -4850 6994 -556 -8695 6481 5704 -9886 116 8897 -5580 -4226 7527 -1800
661 -1800 -4881 6024 -1024 -6420 7010 2885 -9840 2629 8159 -6945 -2905 7808 -2899
674 -2899 -4621 6207 -1058 -5349 6317 880 -8459 4714 6381 -8371 -1268 8045 -4045 -3954
688 -3954 6564 -1719 -4935 6100 40 -6953 5490 4019 -8684 1006 7706 -5454 -3178 6774
702 6774 -2504 -4270 6245 -764 -6128 5652 2353 -7867 2837 6349 -6570 -1839 6938 -3087
$$ packed form
607f505J4260o314j0742J4329J003j5509R450R373j4795P46J2076r442k741J2147
621G336q223p417J5201k325j4561J1889O834j5993L566J2190j0917k420J1192
634F352q153m296J3976o080j2025J4456L489j6457O843J1033j3147j029J1807
647F769q219l400J1844p550q139J5176p77j5590J0002Q781j4477J354J1753r327
661a800l081J0905p048n396J3430m125j2725J2469N530j5104M040J0713j0707
674b899j722J0828p265m291J1666n437r339J3173J667j4752P103R313j2090R1
688c954J0518q283l216J1035o060o993J2443j471j2703R690O700j3160K276R952
702F774r278j766J0515p009n364J1780l299j0220J0704L512j2919M731Q777j0025
$$ plain form
716 -3087 -3608 5957 -1517 -5176 5775 1251 -7001 3630 4661 -6777 -197 6493 -3998 -2983
730 -2983 5683 -1932 -4077 5634 38 -6198 4325 3440 -6593 1082 5621 -4854 -1963 5735 -2481
745 -2481 -3375 5300 -952 -5119 4888 2076 -6401 2119 4707 -5174 -773 5435 -3182 -2657 5138
760 5138 -1521 -4031 4941 649 -5757 3149 3673 -5323 120 4756 -3566 -1828 4781 -1985 -3242
775 -3242 4574 -247 -4707 3689 2388 -5215 1029 4134 -3690 -1098 4213 -2293 -2391 4201 -830 -3749
791 -3749 3685 1215 -4705 1895 3347 -3949 -437 3824 -2431 -1634 3787 -1322 -2888 3611 367
806 367 -3980 2422 2372 -3980 344 3469 -2668 -1204 3336 -1594 -2101 3338 -364 -3241 2643 1448
822 1448 -3601 1029 2806 -2815 -704 3005 -1573 -1550 2809 -770 -2410 2609 669 -3075 1384 2020
$$ packed form
716c087n21R565p474l659J0951m524q252J0631J031j1438O580O690j0491J015
730b983Q666p615k145R711n596o236J0523q85j0033P675M539j0475K891P698q216
745b481q94Q675o252m167J0007k812q477Q520K588r881M401O208q617N25P795
760E138o659k510Q972m292o406Q906N24q996N443M636q322J738O609o766j257
775c242P816m821m460Q396j301p603O244L105p824K592N311o506r8O592n031k919
791c749P434k470n920O600J452p296L512M261o255P97N421n109j566O499l244
806C67m347O402n0o352M324L125o137J464M540m930n07N439l702k877N884j195
822A448n049M630J777n621K111L709m578K3M359l579j640N019j940l744M459O36
$$ plain form
838 2020 -2694 -123 2567 -1633 -1170 2338 -773 -1649 2250 63 -2442 1633 1367 -2436 328 2026
854 2026 -1699 -706 2020 -827 -1233 1752 -270 -1740 1567 717 -2110 625 1561 -1582 -307 1673
870 1673 -900 -869 1443 -310 -1132 1254 201 -1527 800 1041 -1373 -118 1233 -799 -523 1118
886 1118 -334 -788 899 48 -893 704 521 -1007 73 853 -513 -352 634 -215 -450 523 21 -524
904 -524 335 190 -540 122 446 -303 -261 290 43 -170 118 50 -185 25 165 -104 -93 151 11 -232 31
925 31 312 -121 -334 232 156 -321 153 246 -417 33 474 -359 -222 627 -199 -617 617 319 -784 212 539
946 539 -709 4 791 -671 -423 994 -354 -840 1011 206 -1231 548 816 -1059 55 1031 -942
963 -942 -388 1360 -593 -1013 1369 29 -1523 1025 856 -1597 240 1285 -1244 -280 1563 -958
$$ packed form
838B020m714K571K690m200M63L508l111q76L899k187k505M075k66l803K764J698
854B026l725R93K726k847m06K985k022j470L307q50k827K735R36l143J275J980
870A673k573L1K312j753q22K386j053j728K327K41k414J255J351k032K76J641
886A118j452m54J687q51r41J597j83j528J080P80j366J61R86q49k35R73n02n45
904e24Q59j45p30O62L24p49M2N51k47k13K88o8k35K10J40k69J1K44j40k43K63
925C1K81m33k13N66p6m77M74R3o63M50M41q33J37Q49q26m18J234k98j103R96L27
946E39j248P13P87j462K48J417j348m86J851q05j437J779K68j875J114R76j973
963i42N54J748j953m20K382j340j552K548j69k453J837J045k529R64J843k521
$$ plain form
979 -958 -984 1764 -238 -1658 1503 689 -2065 682 1537 -1710 -182 1767 -1311 -852 2052 -672 -1714
996 -1714 1937 366 -2338 1232 1553 -2258 30 2066 -1563 -734 2223 -1043 -1568 2333 -28 -2413
1012 -2413 1770 1260 -2692 515 2271 -1988 -685 2355 -1288 -1358 2550 -506 -2363 2271 841 -2967
1028 -2967 1201 2214 -2627 -394 2657 -1580 -1244 2600 -950 -2156 2679 303 -3101 1863 1882 -3225
1044 -3225 266 2934 -2171 -1140 2814 -1210 -1826 2900 -267 -3003 2443 1435 -3492 968 2859
1059 2859 -2863 -824 3199 -1516 -1731 2959 -719 -2670 2880 849 -3569 1599 2496 -3323 -193
1074 -193 3393 -2111 -1684 3152 -962 -2378 3053 158 -3507 2252 1998 -3638 561 3196 -2834 -1181
1090 -1181 3560 -1411 -2275 3222 -340 -3215 2870 1410 -3884 1266 2887 -3320 -387 3634 -2246
$$ packed form
979i58k6K748k002j420L161q14k754K747Q55l247J528J949l078M59K904k724j042
996a714L651j571k704L570L21l811K288K036l629Q29K957l266n25L901k361k385
1012b413M183n10l952L207J756m259J303L040l643p0L908l056j857M634j430l808
1028b967M168J013m841K233L051m237L36L844l550j206M835k376l404M964J9n107
1044c225L491K668n105J031L954m024o16M726l167k736N446j008m927M460J891
1059B859n722K039M023m715k15M690l678j951N550k031m418N168Q97n819L130
1074a93L586n504M27M836m114j416N431k895l665N759k54n636M199K635o030J653
1090a181M741m971q64N497l562k875O085j460n294N150J621o207K933M021n880
$$ plain form
1105 -2246 -1999 3603 -766 -2974 3170 713 -3923 1956 2560 -3613 195 3337 -2842 -1284 3909
1120 3909 -1458 -2837 3438 210 -3681 2488 1991 -3865 679 3067 -3030 -604 3696 -2268 -2355 3933
1136 3933 -307 -3586 2864 1437 -3904 1340 2854 -3227 -180 3284 -2654 -1408 4123 -1344 -3437
1151 -3437 3504 945 -3954 1948 2407 -3621 297 3122 -2759 -729 3701 -2249 -2655 4204 166
1166 166 -4123 2427 2050 -3755 831 2934 -3025 -442 3303 -2477 -1626 4227 -999 -3900 3233 1765
1182 1765 -3858 1151 2574 -3139 -2 3143 -2519 -1084 3717 -1827 -3019 3967 834 -4227 1635
1197 1635 2452 -3132 381 2776 -2775 -686 3450 -2068 -2107 4005 -432 -4069 2715 2204 -3521 563
1213 563 2418 -2798 -33 3174 -2471 -1560 3766 -1183 -3271 3487 1298 -4050 1132 2534 -2676
$$ packed form
1105b246K47N602m369k208O144k457m636N879O04o173L808L142o179J558N193
1120C909n367j379O275l228l891O169m97n856M544K388o097K426M300n964q7O288
1136C933m240l279O450j427n341N244J514o081L047L464n938J246N531n467k093
1151c437O941k559m899N902M59o028L918K825n881K030M430n950m06O859m038
1166A66m289O550l77n805M586K103n959K583L745n780Q51N853n226k901P133j468
1182A765n623N009J423n713L137L145n662J435M801n544j192O986l133n061N862
1197A635Q17n584L513K395n551K089M136n518l9O112m437l637O784n11n725M084
1213E63J855n216K765L207n645R11N326m949k088O758k189n348N182J402n210
$$ plain form
1228 -2676 281 2585 -2789 -829 3723 -1597 -2658 3492 298 -3833 2018 2356 -3056 168 2236
1243 2236 -2485 -49 3274 -2293 -2160 3594 -222 -3260 2516 1545 -3416 665 2393 -2265 55
1258 55 2445 -2601 -1137 3793 -973 -3084 2732 910 -3193 1463 2085 -2674 116 2187 -2244 -233
1274 -233 3257 -1970 -2508 3321 522 -3041 1681 1381 -2812 733 2168 -2263 -143 2456 -2215 -1373
1290 -1373 3526 -398 -3136 1898 1225 -2414 1088 1613 -2525 128 2330 -1929 -728 2881 -1318
1305 -1318 -2537 2589 1000 -2501 896 1112 -2136 796 2038 -2196 -583 2469 -1381 -1530 2770
1320 2770 36 -2681 1280 1232 -1729 825 1151 -2346 117 2484 -1503 -1263 2274 -601 -2055 1940
1336 1940 899 -2040 590 851 -1718 817 1878 -2071 -972 2280 -505 -1487 1724 120 -1984
$$ packed form
1228b676K957K304n374J960M552n320j061O150l194m131N851L38n412L224K068
1243B236m721K436L323n567J33N754l816l038N776r71m961M081J728m658K320
1258E5K390n046J464M930m766k111N816j822m103M656O22m759K790K071m431K011
1274b33L490n227n38N829k799l563M722l00m193L545J435m431K120K599m671Q42
1290a373M899l924k738N034o73l639L502N25m138K653K202m259J201L609m199
1305a318j219N126j589l501L397K16l248K932J242m234J613L052l850j49M300
1320B770k734k717L961m8k961K554L26l497K463K367l987K40L537k875j454L995
1336A940j041k939K630K61k569K535J061l949J099L252k785r82L211j604k104
$$ plain form
1351 -1984 1000 1057 -1413 570 993 -1967 -47 2372 -877 -1563 1391 79 -1239 1264 559 -1645
1367 -1645 453 947 -1306 392 1603 -1542 -1196 1793 246 -1140 724 -16 -1199 970 855 -1344
1383 -1344 152 1025 -1267 -301 1833 -348 -1458 646 338 -494 837 30 -1444 508 1140 -930
1399 -930 -182 1115 -746 -949 1136 499 -714 135 -177 -591 1016 686 -1314 -297 1002 -340 -428
1416 -428 825 -64 -892 192 355 -45 483 -243 -1156 412 1235 -453 -729 379 16 -296 418 223
1434 223 -312 -71 -230 -205 791 489 -1022 -623 806 496 -302 -179 -89 -99 158 109 80 206 -275 -635 254
1455 254 945 25 -913 -355 532 432 -123 -293 -77 4 -81 79 328 124 -464 -582 312 954 -22 -957 -199
1476 -199 609 202 -104 6 -180 -169 100 75 254 353 -582 -833 704 1007 -504 -687 154 85 161 398 -290
$$ packed form
1351a984K984N7k470J983M23k960J920K419l249o86K954j312j318K503p05k204
1367a645K098M94k253J698J211l145L46K989j547j386J864p40j183K169j15k199
1383a344J496Q73k292R66K134k181j110K104l08q32J331q07j474J952O32k070
1399i30P48J297j861k03K085o37j213Q49l12m14J607l30k000J017J299j342q8
1416d28J253q89q28J084J63m00N28p26r13J568Q23j688k76J108l63l12P14j95
1434B23n35K41j59K5R96l02j511L99J429l10p98J23R0j0K57m9k9J26m81l60Q89
1455B54O91r20r38N58Q87j00n55j70K16Q1q5J60K49k04n88j18Q94O42r76r35P58
1476a99Q08m07l06J10j86J1K69k5J79R9r35k51J537L03j511j83Q41o9P6K37o88
$$ plain form
1497 -290 -380 288 -155 -266 875 272 -1290 -282 1058 151 -319 47 -523 -155 917 -17 -662 466
1515 466 11 -975 613 1162 -796 -811 496 40 101 728 -644 -957 920 448 -828 513 511 -1269 -128
1534 -128 1335 -166 -568 352 -577 -332 1453 67 -1496 418 711 -906 375 1060 -1100 -707 1038
1551 1038 -125 -283 987 -662 -1398 1258 998 -1258 30 702 -1100 83 1508 -702 -894 943
1567 943 -389 -725 1608 229 -1970 393 1283 -858 89 953 -1318 -564 1678 -266 -999 1157 -289
1584 -289 -1607 1365 1300 -1649 -297 1016 -912 93 1579 -1095 -1281 1496 49 -1229 1376 431
1600 431 -2151 417 1693 -982 -265 1021 -1314 -490 2108 -347 -1649 1214 273 -1629 1224 1339
1616 1339 -1920 -363 1450 -850 -116 1610 -1296 -1481 1975 403 -1654 1069 613 -2040 560 1918
$$ packed form
1497b90r0O68m43j11J141o03j562J008J340r07m70L66n70L68J072r34o45J128
1515D66m55r86J588N49j958j5J307m56O1O27j372l13J877m72j276J341kj780J141
1534a28J463j501m02R20r29K45J785j386j563J914K93j617J281O85k160L93J745
1551A038j163j58J270j649p36K656k60k256J288O72j802J183J425k210j92J837
1567I43j332l36K333j379k199K363Q90k141R47Q64k271P54K242j944p33K156j446
1584b89j318K972o5k949J352J313j928J005J486k674j86K777j447j278K605r45
1600D31k582K568J276k675P17J286k335Q24K598k455j302K863r41j902K853J15
1616A339l259J557J813k300P34J726k906j85L456j572k057K723m56k653K600J358
$$ plain form
1632 1918 -1284 -653 1250 -1108 -566 2240 -471 -2141 1302 800 -1666 928 1306 -2049 -391 1876
1648 1876 -732 -575 1537 -1086 -1526 2175 642 -2081 723 981 -1807 501 1950 -1495 -965 1553
1664 1553 -672 -759 2020 -429 -2291 1391 1252 -1716 514 1253 -1952 -282 2177 -799 -1068 1463
1680 1463 -736 -1432 2136 657 -2369 511 1319 -1536 295 1792 -1601 -1063 1867 -381 -1055 1749
1696 1749 -299 -2240 1442 1553 -1792 9 1282 -1543 -208 2154 -873 -1443 1510 -228 -1460
1711 -1460 1807 718 -2425 307 1677 -1199 -57 1478 -1486 -980 2072 -178 -1487 1382 68
1726 68 -2026 1264 1630 -1825 -346 1336 -1133 -165 1962 -1011 -1600 1666 263 -1523 1349 760
1742 760 -2198 269 1832 -1052 -374 1290 -1299 -828 2218 -109 -1897 1101 565 -1673 901 1450
$$ packed form
1632A918l202O31J903k358N42K806k711j670L443n02k466K594L78l355J658K267
1648A876k608J57K112k623m40L701j533k723K804K58k788K308J449l445N30K518
1664A553k225q7K779k449j862L682j39k968K230P39l205J670K459k976k69K531
1680A463k199o96L568j479l026K880Q08k855J831J497l393N38K930k248o74K804
1696A749k048j941L682J11l345J801J273k825J335K362l027n70K953j738j232
1711a460L267j089l143K732J370k876J142J535k964N06L052k250j309K869j314
1726F8k094L290L66l455J479J682k469R68K127k973n89L266j403j786K872n89
1742G60k958K467J563k884O78J664k589M71L046k327j788K998n36k238K574N49
$$ plain form
1758 1450 -1730 -490 1454 -820 -339 1752 -953 -1771 1736 791 -1641 637 810 -1697 254 1713
1774 1713 -1079 -639 1288 -942 -889 2098 86 -2130 777 1059 -1224 502 1087 -1590 -306 1628
1790 1628 -745 -642 1593 -691 -1751 1611 1084 -1631 100 782 -1174 403 1449 -1327 -753 1529
1806 1529 -601 -1076 1758 256 -2057 489 1248 -844 165 676 -1422 -55 1792 -779 -1123 1427
1822 1427 -154 -1578 1210 1109 -1419 -173 744 -717 456 1189 -1416 -854 1741 -82 -1274 1133
1838 1133 419 -1606 366 1160 -692 -2 468 -1224 86 1809 -717 -1457 1151 376 -1187 711
1854 711 798 -1183 -111 732 -603 324 1021 -1308 -888 1707 303 -1300 467 453 -976 380 862
1871 862 -764 -80 598 -904 -42 1578 -491 -1500 788 721 -690 286 338 -921 145 813 -583
$$ packed form
1758A450l180J240J944k274M81K091k705q18L507r45k432K278J73k507J951J459
1774A713k792M40J927k230N3K987k012k216K907K82k283J726N85k677J284J934
1790A628k373J03K235k284j060L362n27k715J731O82j956J577J046k776N74K282
1806A529k130m75K834j502k313K546P59k092J009N11k098J367J847k571l44K550
1822A427j581j424K788j01k528J246R17j461J173P33k605N62K595j823j192K407
1838A133p14k025J972P94j852O90M70j692J310J723k526p40K608p75j563J898
1854G11Q7j981J072Q43j335R27O97k329M20K595j404j603J767j4j429J356M82
1871H62j626O84O78j502Q62J620k069j009K288o7j411R76N2j259J066O68j396
$$ plain form
1888 -583 -66 851 -844 -840 1328 497 -1120 33 350 -432 465 508 -896 -139 786 -501 -279 1062 -233
1907 -233 -1167 484 717 -353 84 20 -729 371 888 -600 -414 679 -286 -567 816 386 -792 -106
1925 -106 273 -158 449 301 -916 -212 896 -90 -469 430 -48 -619 316 471 -255 -33 -56 -484 347 778
1945 778 -475 -651 410 193 -222 304 68 -471 40 242 -90 268 163 -650 -202 739 202 -440 -72
1964 -72 4 -96 313 153 -313 -44 66 -209 210 459 -287 -541 138 344 62 -53 -229 -244 197 256 -101
1985 -101 -39 32 -251 -86 375 202 -267 -300 -7 253 244 -74 -301 -97 167 114 7 12 -93 -196 -6 283 203
2008 203 -193 -320 -13 250 206 -29 -283 -149 185 141 -52 56 -48 -290 -11 350 95 -212 -162 -111 123
2029 123 374 -47 -423 33 218 -102 94 218 -263 -239 226 156 25 92 -276 -314 417 354 -383 -135 204 -194
$$ packed form
1888e83N17R17j695MK168q31j617J153L17p82Q97M3j404P57R25j287K22J341j295
1907b33r34J651K33j070M37o4p49J100N17j488J86J093r65k81J383m30j178O86
1925a06L79m31O07j48j217P04J108r86l79Q99m78n71R35J55p26K22k3m28Q31M31
1945G78j253j76J061k17m15N26k36n39N11K02l32L58j05q13M48R41n37o42L68
1964g2P6j00M09j60m66K69J10k75M19K49p46k54O79K06k82j15j76j5M41N9l57
1985a01O2P1k83J65M61j73m69l3K93K60rl18k27K04K64n3j07Nj05j03J90K89q0
2008B03l96j27L07K63m4k35k54J34L34m4j93J08j04k42K79L61k55l07N0N1K34
2029A23K51m21l76M56J85l20J96J24m81K4M65p0j31O7l68l8P31o3p37K48L39l98
$$ plain form
2051 -194 -1 396 -128 -313 144 -39 -85 448 -2 -666 65 522 -180 -137 226 -298 -195 468 5 -303 258
2072 258 -81 -449 452 474 -558 -240 412 -129 -51 424 -283 -424 444 102 -379 400 146 -727 121 684
2092 684 -290 -279 329 -268 -196 639 -46 -602 357 182 -549 350 522 -696 -251 621 -171 -212 479 -299 -545
2113 -545 635 252 -639 266 339 -692 97 787 -435 -406 547 -178 -323 727 -9 -806 407 449 -608
2132 -608 193 543 -718 -227 823 -218 -459 575 -178 -642 698 348 -822 167 493 -646 56 804
2150 804 -553 -514 742 -84 -554 669 53 -895 449 602 -714 59 622 -690 -223 952 -264 -661
2168 -661 653 24 -699 637 415 -937 130 696 -632 -65 821 -574 -582 886 -4 -714 599 170
2186 170 -900 434 688 -804 -77 728 -616 -302 980 -300 -791 713 148 -765 559 418 -962
$$ packed form
2051a94J93L97n24j85M57j83m6N33m50o64P31M57p02M3L63n24J03O63m63l08N61
2072B58l39l68R01K2j032L18O52n41P8M75p07j41Q68l42m81P79k54q73Q48N63
2092F84r74J1O08n97P2Q35o85n56R59j75p31Q99J72j218M45Q72p92m1O91p78k46
2113e45J180l83q91R05P3j031P89O90j222K9R53p25j45J050p36p97J213M2j057
2132f08Q01L50j261M91J050j041k41J034p53m64J340l50j170R89L26j139P02P48
2150H04j357L9J256q26m70J223o16r48J344J53j316P73N63j312M67J175j216l97
2168f61J314o29p23J336k22j352J067N66j328N67Q86j395qJ468q90p10J313m29
2186A70j070J334K54j492P27Q05j344L14J282j280m91J504n65r13J324j41j380
$$ plain form
2203 -962 152 813 -633 -196 824 -506 -584 960 31 -837 567 304 -886 396 735 -857 -172
2220 -172 829 -497 -382 911 -248 -843 744 296 -852 426 512 -916 65 892 -607 -373 821
2237 821 -361 -613 885 87 -930 504 458 -837 249 744 -795 -260 904 -397 -480 847 -171
2254 -171 -820 748 375 -891 294 602 -805 -10 891 -567 -450 820 -228 -640 811 127 -960
2271 -960 460 584 -807 93 728 -687 -284 886 -311 -599 761 -29 -831 644 450 -911 154
2288 154 682 -675 -116 833 -489 -515 815 -85 -682 683 230 -898 366 667 -731 -49 736 -552
2306 -552 -323 860 -244 -663 684 95 -775 510 462 -844 72 709 -571 -212 756 -388 -537 754
2324 754 8 -726 540 283 -806 273 634 -678 -134 721 -424 -393 757 -123 -691 580 223 -699
$$ packed form
2203i62J114O61j446M37J020j330p8J544r29q68J404k63j190J282L39j592O85
2220a72J001j326J15J293j159n95J587m48j148J278Q6j428R81Q27j499K34J194
2237H21j182k52J498p98j017J434m6j295J086M95j539N35J164j301q3J327j018
2254a71o49J568l73j266J185L08j407P95R01j458J17J270j048m12J451o84j087
2271i60J420J24j391R00O35j415M03J170j197k88J360p90q02J475j94j361J065
2288A54N28j357N59R49j322k6J330r00n97J365m53j128J264L01j398O82P85j288
2306e52K29J183j104m19J347n89q70J285m8j306R16O37j280L59R68j144j49J291
2324G54p46p34J266k57j089J079L61j312N44Q55j145L1J150q80n68J271l57r22
$$ plain form
2342 -699 354 457 -726 33 714 -493 -316 709 -234 -568 635 131 -675 357 328 -647 177 565
2360 565 -634 -180 719 -330 -464 645 -12 -621 416 272 -565 217 384 -599 42 650 -469 -360
2378 -360 673 -110 -566 474 197 -561 226 316 -498 133 469 -531 -170 680 -210 -511 516 128 -543
2397 -543 267 279 -463 125 340 -472 -3 559 -382 -400 569 29 -521 299 237 -439 130 295 -387 55 400
2418 400 -413 -178 585 -127 -466 372 181 -406 160 238 -348 71 312 -354 -59 473 -260 -359 444 101 -425
2439 -425 184 196 -324 75 246 -313 -35 340 -269 -216 416 -49 -401 244 187 -312 84 194 -267 24 282
2460 282 -240 -126 334 -105 -279 287 110 -314 102 179 -224 46 219 -224 -65 274 -114 -188 239 20 -259
2481 -259 136 145 -199 24 145 -178 -12 219 -134 -151 200 -16 -185 125 69 -169 34 109 -129 2 134 -119
$$ packed form
2342f99J053J03j183P59O81j207J77J025r43l34J203n04q06J032k9r75Q24L88
2360E65j199M54Q99j049j34J109o57o09J037j44q37P82J67r83O41O08j119J09
2378c60J033p83m56J040k77p58P87R0q14O31L36j000L61Q50q90l01J027l88o71
2397e43Q10J2p42N88K15q12M69N62r41j8R69n40n50Q20o2o76N69J65o82M42L45
2418D00q13K35P63p12l39Q38j91n87N66P8n86M19K41o66K95N32p33r9Q03l43n26
2439d25O09J2n20L99J71n59K78L75o09N3O32m65l52O45n7m99L96J10m61K91K58
2460B82n22J14M60m39j74N66j77m24M16P7m03K70J73m43J59L39l88p4M27k19k79
2481b59L95Rl44K23J21l23J66K31l53j7L51k16j69L10n6k38K03P5k38J31J32k53
$$ plain form
2503 -119 -84 182 -1 -139 103 66 -100 45 88 -89 -4 95 -65 -26 115 -34 -103 78 67 -70 -6 51 -43 7
2527 7 54 -32 -26 46 -29 -53 46 46 -71 -43 50 24 -49 3 11 -12 0 11 -6 -1 35 -20 -45 73 34 -100 -10 104 -30 -53
2557 -53 64 4 -56 49 4 -52 69 24 -123 43 146 -102 -97 130 10 -104 82 26 -107 61 39 -117 61
2580 61 131 -168 -74 199 -31 -174 114 51 -159 93 78 -153 73 132 -184 0 246 -116 -189 204 49 -190
2602 -190 114 80 -177 80 142 -213 17 239 -192 -139 283 -14 -245 151 88 -210 97 142 -241 39 231 -216
2624 -216 -92 313 -96 -263 255 87 -266 133 149 -250 82 242 -255 -62 337 -152 -228 325 36 -310 191
2645 191 155 -275 112 220 -307 -16 342 -218 -195 357 -44 -318 259 113 -329 152 204 -341 42 330 -288
2666 -288 -156 386 -122 -295 323 55 -346 211 171 -361 94 312 -333 -89 417 -175 -259 382 -19 -357 291
$$ packed form
2503a19L5K66j83j38K42l7j66J45M3j77Q5R9j60L9J41j49o9J81j1j37O4N7r4N0
2527GM7q6OP2p5k4R9%j17K8R3k6p3N2Qk3J2J1j7NL6n5k5J18l9j34R0J14j34k3
2557e3J17o0o0J05m5n6J21m5j47J66J03k48NK27j20j14J86n6j33J68k2j56J78
2580F1P0k99R4K73k30j43K88o3k10K52j5k31K26N9l16J84K46l62p3L93j55k39
2602a90L04l4k57K57O2l55K30K22m31N3M22k97k31L96o3k98L07M5l83K80J92m47
2624b16J24M05m09j67N18j68l53L99J6l99L32J60m97J93L99m89p6N53k89l46N01
2645A91l6m30L87J08n27K91L58n60K3N52m01k74N77j46m42M81N2n45L83K88o18
2666b88J32N42n08j73O18k68m01N57m0n32M55K18o45K44N06n92q4O41m01l38O48
$$ plain form
2687 291 152 -388 166 298 -381 -14 415 -257 -234 411 -66 -349 338 78 -416 227 248 -428 47 405 -326
2708 -326 -182 438 -135 -314 370 16 -402 317 200 -452 127 379 -395 -95 453 -212 -267 409 -48 -352
2728 -352 362 123 -464 206 342 -435 -23 447 -294 -227 441 -115 -343 401 34 -465 292 277 -482 42 415
2749 415 -342 -157 460 -184 -310 416 -30 -425 348 205 -513 141 408 -388 -97 438 -223 -244 452 -72
2769 -72 -374 395 117 -495 242 371 -446 -34 431 -272 -170 430 -178 -343 428 46 -461 285 269 -485 27
2790 27 428 -328 -152 409 -223 -259 460 -51 -444 337 215 -476 133 388 -380 -104 414 -220 -191 439 -140
2811 -140 -393 422 153 -473 199 336 -407 -12 424 -255 -173 390 -177 -291 455 35 -504 255 286 -408 37
2832 37 347 -319 -100 397 -196 -216 421 -73 -424 358 225 -439 66 313 -313 -17 369 -265 -191 407 -114
$$ packed form
2687B91j39n40N54J32o79L67M29o72K3O45m77k83O87k60m94O43K1o76M75L58p31
2708c26J44O20n73j79O84l54m18P19j17o52N79K52p74L00N48o65n5O76m57l04
2728c52P14k39n87O70J36p77M12M70p41O7O68n56k28P44l67m99P57j5p59N24L73
2749D15p57J85O17o44j26P26m46l95P73j43p18O54K67p96K91N35o61k1O96n24
2769g2l02P69k78o12P37J29q17M12M65p03J02O00o08j65P71l82n07P46j6p54N12
2790B7M01p56J76N61o32l6P19n11l93P81j22o91O09K55p68K76N18o34K9O30n79
2811a40k53Q15k69o26O72J37p43L95M36o79Q2N63n67j14P46m20n39P59L1o94M45
2832C7L10o66K19M97n93k0O37m94l51P82j33o64N05K47o26K96L86o34P4N98n21
$$ plain form
2853 -114 -320 387 111 -463 166 331 -306 0 311 -286 -103 424 -178 -298 361 14 -403 259 246 -385
2873 -385 14 286 -248 -35 343 -247 -246 395 -13 -334 265 127 -375 141 276 -278 -23 279 -244 -118 400
2894 400 -96 -340 258 100 -290 173 178 -321 34 293 -231 -68 330 -182 -261 325 82 -284 121 88 -266
2915 -266 137 232 -313 -47 305 -177 -176 321 2 -303 148 124 -178 120 89 -298 68 319 -200 -165 284 -47
2937 -47 -247 201 132 -204 45 47 -162 161 198 -309 -109 319 -52 -212 192 59 -221 60 105 -100 77 43
2959 43 -267 53 319 -154 -253 185 55 -169 91 79 -132 28 53 -131 103 176 -239 -153 282 78 -187 44
2981 44 68 -71 64 86 -94 44 75 -165 11 274 -54 -231 73 133 -49 24 -7 -108 57 99 -95 -3 108
3004 108 -110 -140 153 114 -124 -50 8 -1 102 41 -136 -23 109 -32 -47 103 9 -136 5 112 45 11 -49 -92
$$ packed form
2853a14k06P07k76n74O29J65o37L06L11n97J83N27o02j20O59l47m17O62j3o31
2873c85L99K72n34K13L78n90JO41m08l21N99j38n02N16J35n54K55L02n23J26N18
2894D00m96k44N98j58l90M63Nm99L55K59n24J63L98n12p9N86k43l66M05l3l54
2915b66M03R5n45K66L52m82JM97l19l05M51k4l02K98l1l87L66K51n19L5M49l31
2937d7k00M48o9l36K49Kk09L23L7n07K00M28l71j60M04j33k80K81M5k05J77l4
2959D3l10L20K66m73r9M38j30k24K60j2k11J60K5j84K34P3m15Q6M35k04k65K31
2981D4K4j39J35K2j80J38L1k40J76K63l28j77L04O0j82P3l1j01J65M2j94R2J11
3004A08k18l0K93l9k38P4N8rJ03o1j77J13J32j41j5J50r4j45J41J07o7l4o0m3
$$ plain form
3028 -92 55 138 -41 -104 34 38 -37 34 72 -40 -71 0 44 83 41 -113 -92 106 118 -49 -64 12 -3 -3 55 38 -39 -44
3056 -44 -41 26 110 26 -147 -56 116 75 -53 -18 4 -37 19 72 13 -10 -40 -75 48 169 -24 -176 -2 93 -3 8 3
3083 3 -89 -29 66 2 10 62 -101 -124 124 135 -118 -71 23 -31 49 109 -77 -87 73 -17 -48 133 11 -194 3 174
3109 174 -2 -22 27 -133 -24 199 -1 -127 72 -6 -112 131 131 -174 -72 91 -49 33 141 -135 -180 164
3131 164 80 -108 78 9 -193 66 205 -103 -56 96 -125 -61 246 9 -227 59 87 -83 119 100 -246 -33
3153 -33 217 -66 -55 191 -96 -221 189 154 -158 14 40 -174 119 242 -209 -146 199 -62 -123 220 26 -271
3175 -271 56 138 -110 104 94 -293 -22 338 -69 -215 175 -22 -196 201 136 -216 22 98 -184 116 277
3196 277 -240 -224 284 48 -169 169 17 -262 127 191 -187 39 149 -274 -51 378 -52 -303 130 57 -160
$$ packed form
3028i2J47Q3j79o3J38Mp5P1L8j12l1P1M4L9m2j54K1J98J2j67j5P6j5%N8j7p7n
3056d4LO7Q4q4j73R1J72m1j28L5K2m1N6N3n9k3l0l5J23J21j93j52J74R5r6J1n
3083Cr2O0R5o4QN2j63k3K48J1k53M7R4n4Q0O0j86j0J60r0l1J81j22k05J97J71
3109A74j76k0M9j60J09K23k00j26J99p8j06K43%l05J02J63j40Q2J08k76m5L44
3131A64q4j88J86o9k02K59J39l08M7J52k21O4L07k37k36K86K8j70K02j9l46K13
3153c3K50k83J1K46k87j25M10l5l12J72K6k14K93J23m51O3L45k61o1L43j94k97
3175b71L27Q2k48K14j0l87K71L60m07j46L90j97j74L97o5l52K38P6k82L00J61
3196B77n17J6N08k36k17L38j52k79L89O4l78K26J10m23K23M29m30k51M33p3k17
$$ plain form
3217 -160 186 95 -302 42 203 -188 15 292 -228 -246 307 114 -206 107 15 -240 190 229 -271 -44 242
3238 242 -197 -91 375 -47 -318 154 111 -146 176 81 -348 44 323 -170 -117 242 -152 -231 295 104 -266
3259 -266 97 51 -237 183 262 -320 -145 301 -72 -127 266 -64 -293 203 152 -204 118 100 -353 30 386 -152
3281 -152 -219 205 -72 -169 285 59 -308 96 139 -227 114 268 -294 -177 314 -1 -146 183 -71 -262 236
3302 236 161 -274 36 165 -253 -2 327 -128 -239 186 -4 -135 268 19 -356 103 242 -197 11 221
3322 221 -225 -137 303 9 -186 146 -44 -240 254 207 -323 -47 221 -144 -25 261 -136 -228 213 32 -161
3343 -161 198 33 -345 95 313 -171 -92 160 -152 -91 290 -38 -241 143 38 -225 189 199 -301 -85 236
3364 236 -64 -50 183 -154 -198 269 82 -224 108 82 -264 75 283 -148 -148 153 -90 -62 279 -45 -311 137
$$ packed form
3217a60L46r1l97L44J61l91K03K77n20j8N53j93l20L13r2k55M30L9n00K27K86
3238B42m39J06M66m22k71M72m3k57L22r5m29L92K79m93N3L59l94p9N26j91l70
3259b66L63m6k88M20P9n82J75M46l73n5L93l30k29M96n1l56L22j8m53L83L56n38
3281a52o7M24k77r7M54k26l67M04M3l66L41J54n62J17M91l15j45L29k54j91M98
3302B36p5m35L10J29m18K51L29m55j11M25j90j31M03k49l75M59J39m39K08K10
3322B21m46Q8M40k94j95L32j90j96M94m7n30K76K68l65J19K86l97r2M41j81j93
3343a61L59j65l78M40K18m84P9K52l12O1L81l28k03L84j05k63M14J0n00K16L21
3364B36l00J4K33l37m4M67j87l06L32k6l46L39K08m31%L01k43K8L41l24k66M48
$$ plain form
3386 137 145 -191 75 164 -244 -67 258 -56 -82 148 -134 -183 284 128 -278 17 141 -149 51 210 -152 -141
3408 -141 167 -50 -67 229 -47 -294 128 214 -139 -22 94 -174 -13 232 -61 -133 139 -62 -166 234 114
3429 114 -266 -46 142 -60 19 124 -169 -102 206 -4 -118 148 -7 -235 114 212 -119 -75 71 -97 28
3450 28 199 -89 -168 129 31 -118 154 86 -214 -32 176 -17 -15 66 -142 -71 207 29 -141 53 12 -127 80
3473 80 144 -138 -102 59 -33 16 133 -96 -171 97 83 -59 46 29 -147 18 149 -30 -61 31 -61 -44 162 44
3497 44 -144 -13 32 -29 75 66 -133 -79 95 18 -19 60 -62 -110 70 95 -32 -30 -18 -83 53 118 -52 -107 31 9
3523 9 0 74 4 -95 -24 52 22 45 19 -119 -34 116 51 -58 -24 -20 -17 65 63 -24 -43 -13 -25 48 77 -55 -109 13 73 24
3553 24 3 -25 -54 1 57 23 -9 -29 -63 -10 85 44 -82 -78 24 44 28 4 -35 -40 12 38 25 -2 -30 -58 9 85 36 -71
$$ packed form
3386A37Ql36K66Q9m08J77L25l14k6K30k82m9M67j56m06K95J24k90K00J59l62J1
3408a41L08k17j7K96k76k47M22Q6l53J17J16k68J61K45k93p2K72k01j04M00j20
3429A14l80K20J88k02P9J05k93O7L08k10j14K66j55k28L49R8l31M4J46j68J25
3450B8J71k88p9K97r8j49K72o8l00J82K08j93KQ1k08P1K78j78j70J94m1j39K07
3473H0O4k82L6J61r2M9J17k29p5K68j4j42J05j7j76J65J31j79l1R2r2J7K06j18
3497D4j88J31M5o1J04rj99N4J74p7l7P9j22m8J80K5j27KJ2o5J36O5j70n5J38k2
3523IrP4p0r9P1P6l0K3k6j38Q5J50o5j09L4MLQ2kq7j9L0j2P3K9j32n4J22O0m9
3553B4k1k8k9N5N6l4l2k0l4N3R5m1j26MJ02K0j6k4l9nN2K6j3k7k8k8O7P6m9j07
$$ plain form
3583 -71 -39 19 37 47 27 -48 -45 14 22 19 22 -40 -89 26 94 6 -45 -20 -30 17 81 -3 -72 -3 9 -20 60 50 -83 -56 71
3614 71 36 0 20 -68 -53 83 65 -52 7 15 -68 29 113 -34 -77 20 -19 -9 83 -19 -126 26 79 -38 11 45 -101
3641 -101 -46 104 14 -64 29 -39 -78 109 71 -122 -28 59 -59 8 121 -71 -98 78 34 -43 85 2 -136 58 129
3666 129 -70 -30 76 -72 -39 150 -3 -112 56 9 -89 105 77 -164 -34 135 -49 -32 103 -67 -113 117
3688 117 55 -90 73 17 -141 70 161 -115 -75 108 -55 -57 143 -18 -147 70 72 -92 80 96 -167 -17 175
3711 175 -44 -80 107 -43 -121 141 64 -133 49 59 -140 51 156 -138 -114 145 -24 -97 132 -3 -164 77
3733 77 96 -136 37 92 -162 -33 202 -56 -142 114 -7 -117 138 60 -172 41 109 -119 32 158 -140 -104
3755 -104 186 16 -114 102 18 -157 92 122 -162 5 121 -149 -40 206 -64 -167 117 31 -117 109 48
$$ packed form
3583g1L2N8J8J0k0p5LN9QlLo2m9J15O8q8n1K5j0M7O4q4o9O9J2k9Q0j0j33K7J27
3614G1l5l6K0q8J5J36j8j17N9Qq3R7Q4j47m3R7l9J0R2j02j07J52N3j17M9L4j46
3641a01N5J50r0p8R3o8l9J87l8j93R4Q7j18O7J13j92k7J76m4p7J28q3j38J94P1
3666A29j99M0J06j48L3J89j53j09J68m7r8J94k8k41J30J69j84J7J35j70m6K30
3688A17o2j45J63n6j58K11R1k76M0J83j63kK00j61j29K17Kj64J72J6k63J50J92
3711A75k19l6J87j50p8K62p7j97J82J0j99J91J05k94K4K59j69p3K29j35j61K41
3733G7J9k32J73N5k54J29K35k58q6K56j21j10K55p8k32K13O8k28J51J26k98L6
3755a04K90j70j30K16q4j75K49L0k84J67J16k70J09K46k70j03K84q6j48K26o1
$$ plain form
3776 48 -183 35 152 -128 -23 167 -126 -116 181 22 -142 95 30 -162 106 129 -164 -9 162 -103 -63 190
3798 190 -54 -166 135 59 -135 88 49 -176 40 177 -132 -63 146 -74 -102 164 10 -170 85 65 -151 80
3820 80 134 -182 -49 171 -85 -90 150 -25 -143 147 73 -157 72 92 -172 31 184 -122 -101 168 -28 -96 154
3843 154 14 -163 86 91 -156 50 136 -167 -63 193 -38 -130 122 -19 -133 122 73 -166 41 106 -152 -18
3865 -18 174 -98 -127 147 2 -114 119 16 -161 97 112 -155 10 142 -122 -66 169 -20 -130 105 25 -110
3887 -110 114 73 -167 32 139 -112 -33 147 -75 -106 137 16 -106 91 35 -153 72 121 -149 -37 138 -81
3909 -81 -77 149 -25 -125 87 42 -110 88 63 -158 20 154 -78 -60 126 -34 -103 120 29 -122 77 48 -129
3932 -129 58 128 -124 -44 136 -46 -72 108 -8 -113 81 46 -101 56 71 -120 -2 152 -68 -78 100 -5
$$ packed form
3776D8k31K18J17k80J05J90k93J0K97j59j64K37o5j92K68K3k93J55J71k65M0K53
3798A90k44j12L01p6j94K23l9k25K16J37l09O9K09k20k8K66j54j80K55k0k16K31
3820H0N4l16J33K20k56nK40j75j18K90p4k30K29K0k64K03J53l06K1K69j96o8K50
3843A54j40j77K49Nk47K06Q6l03J04K56k31r2K52j41j14K55m9k39K07O5k58J34
3865a8J92k72k9K74j45j16K33j03j77K58J5k67J65J32k64N6K35j89j10K35q0j35
3887a10K24m1k40J99J07k51P9J80k22l1K43j21j22J97n6j88K25M9k70J12J75k19
3909h1MK26j74j00K12m5j52J98k5k21J78J34k32J8J86j60o9K23r1j51J99k9j77
3932a29J87P0k52Q0J80j82k6J80j16j05J94l5j47J57J5j91J18J54k20j0J78j05
$$ plain form
3954 -5 -85 93 23 -114 53 79 -90 30 112 -95 -45 126 -29 -70 93 -1 -97 82 61 -98 36 73 -93 -17
3978 -17 118 -65 -65 84 -6 -76 77 15 -104 31 62 -84 6 84 -73 -34 98 -26 -72 61 4 -81 54 51 -91
4003 -91 13 82 -50 -2 90 -38 -51 81 9 -60 53 30 -73 35 61 -67 -13 62 -23 -19 81 -13 -58 61 23 -67
4029 -67 29 44 -71 -12 59 -29 -22 59 -38 -28 63 7 -49 38 33 -34 20 41 -40 -25 42 0 -9 53 -19 -49 42 21 -52 24 41
4060 41 -53 -4 33 -16 -16 24 -9 -24 36 8 -40 14 23 -33 -7 27 -28 -17 11 2 -2 16 -9 -19 37 21 -30 -5 21 -3 -5 23 14
4093 14 -9 7 5 14 29 -3 -23 17 16 -1 -10 12 15 -7 -5 -4 6 -4 -9 4 15 12 -15 -6 0 10 5 -16 6 5 -17 1 18 4 -16 1 5
4130 5 -1 6 -16 -11 26 26 -21 4 31 -15 -13 32 13 -8 4 1 -8 30 14 -36 4 31 -33 -15 31 -26 -23 22 -1 -33 13 -9 -42 26 30
4165 30 -49 -15 38 -15 -33 41 -1 -32 38 6 -42 28 23 -70 0 46 -33 -23 40 -7 -26 42 4 -50 35 34 -55 17 47 -58 -20
$$ packed form
3954eq0J78p0j37J67K6j69J20Q2k07N0J71j55m1J63r4r6J79k1j59J34L7j66P6
3978a7J35j83%J49r0p0J53o2j19J35L1j46R0P8j57L9J32j24m6J33n7q5J35lj42
4003i1J04O9j32M8R2j28j3J32p2o9J13k3j03J08K6j28N4P5q5MJ00r4m5J19l8r0
4029f7R6J5j15N9P1q8PQ1r7J0R1n6n6Q7no7N4K1q1J5O7m2rO2p2l0R1k1p3P6J7
4060D1r4M9L7m9%M0l3j5O0k8m8N4Rn6K6L4n5J1K8rmJ8k5j0N6j6n1K5K6k4kK8r
4093A4k3J6kRJ5l2k0M0jj7rK2Lk2KJJ0j0nJ3J1lk7ROJ0nk1K2jk2J8J7j4k0J7M
4130EoPk2NL7%m7K5K7m6KM5j9k1J2lrL8j6n0M0K7o4J8M6n7LM5k3l2M6k2l3O8M
4165C0p9L4N3n3j8P4m2l1P0l2m8P0nr3P0M6p9J0O3m7j9O8l8n4Q5jq9P2L0j05L8
$$ plain form
4196 -20 56 -13 -27 50 -28 -45 54 12 -67 27 47 -55 -4 62 -35 -30 54 -12 -48 56 4 -70 30 45 -63 8 70 -51
4224 -51 -17 75 -15 -36 71 -7 -63 58 24 -85 20 59 -62 -11 70 -41 -46 68 -15 -63 74 0 -91 37 55 -79
4250 -79 -9 74 -61 -27 71 -30 -64 80 4 -79 56 50 -98 3 83 -77 -15 93 -44 -55 86 0 -66 60 31
4275 31 -96 26 69 -78 -23 88 -55 -48 88 -20 -79 70 31 -91 51 63 -85 11 79 -61 -25 91 -42 -74
4299 -74 88 13 -93 57 35 -93 22 70 -90 -22 93 -50 -54 98 -18 -95 76 42 -89 35 66 -96 -15 102
4323 102 -75 -58 96 -22 -83 80 24 -93 40 50 -96 2 92 -78 -34 101 -42 -73 90 1 -100 65 46
4346 46 -101 26 67 -87 -6 106 -51 -68 100 -2 -88 70 40 -94 41 65 -86 0 98 -66 -41 100 -22
4369 -22 -91 80 18 -92 48 52 -94 7 89 -78 -28 109 -42 -63 89 3 -83 63 37 -98 30 82 -84 -11
$$ packed form
4196b0P6o9j4P7p8j7R9m2p9R4K0j02N1O6r7NQ4o6l6J04n2p4J00J5j08P1O2j21
4224e1L4R2r0k1J07p8n6J21l4j09J05L9j21N1Q1j11nJ14q3m8J37p4r1J28J8j34
4250g9P0Q3j35L4R8j01l4J44p6q3J35oj48J01Q0j60O2J08j37j1J41q6o6J26k9
4275C1j27J22M3j47N5J11j43PJ36j08n9J49l9j22J42J2j48R6O8j40L6J16j33l2
4299g4J62p5j06J50k2j28J15M8j60O8J15j43mJ52j16p7J71l4j31J24L1j62Q1J17
4323A02j77J7J54j18o1J63n6j17J33J0j46R8R0j70M4J35j43l1J63q9j01J65j9
4346D6j47J27M1j54Q1J12j57j7J68j02q6J58l0j34J35K4j51Q6R8j64K5J41j22
4369b2o9J71o2j10J40Mj46J01Q2j67N0J37j51k1J52q6q6J46k6j35J28N2j66P3
$$ plain form
4393 -11 98 -51 -39 101 -10 -71 83 42 -94 51 73 -80 2 99 -52 -36 89 -17 -62 77 4 -85 48 61
4417 61 -95 11 90 -73 -23 95 -27 -55 79 -4 -71 77 41 -92 35 82 -73 -14 91 -42 -39 69 -5 -61
4441 -61 72 18 -74 57 58 -79 7 84 -62 -37 83 -22 -57 72 1 -78 62 40 -96 7 73 -65 -28 62 -40
4466 -40 -54 75 -6 -66 64 18 -80 43 62 -72 -8 76 -30 -37 68 -14 -50 57 10 -58 48 44 -78 10 73 -61
4492 -61 -30 67 -30 -41 59 -2 -65 36 30 -78 4 56 -56 -20 67 -22 -34 55 -14 -57 47 12 -59 20 36 -36 0 55
4520 55 -37 -15 50 -17 -46 55 12 -65 16 39 -39 2 33 -40 -4 63 -24 -38 48 -1 -44 40 45 -35 -5 32 -22 9 37 -25
4550 -25 -19 68 -2 -47 40 25 -39 1 34 -9 5 24 -26 14 60 -21 -50 40 25 -39 17 29 -15 0 25 -13 8 27 -23 -24 58
4581 58 12 -47 16 39 -10 -2 25 -5 6 12 -6 12 44 -15 -26 26 35 -21 1 14 -5 6 9 -10 11 34 -11 -15 45 35 -17 1 20
$$ packed form
4393a1J09j49J2J40j11o1J54m1j36J45K2j53Q2R7j51J6J25j06m5J39p3q9J33J3
4417F1j56J06P9j63N0J18j22k8J34q3o7J48l6j33J27M7j55N9J05j33LJ08p4n6
4441f1J33n4r2J31Jj37Q6P7j46K5J20j05l5J29p1p9J40k2j36J03O6j38L7R0j02
4466d0j4J29q1o0J30m6r8J23J9j34O4Q4j06pJ05q2l6J07m7o8J06mj22Q8O3j34
4492f1L1R7r7j1J00o1o3J01oj08Q2N2j12L6Q7q9j2Q9o9m3J04l5p1P9J6p2L6N5
4520E5r2K2O5o7k9J01m3p7Q1K3p8M1L1p3L6O7q7j4Q6m9m3Q4Nq0L0L7n4L1K8o2
4550b5OQ7p0m5Q7j5o4M0L3m3J4J9n0M0M6q1k9R0j5o4N6J2m4J5K5l8K1J9n0jQ2
4581E8m6n9O3K3m9QK7l0J1Oj8J8L2n9j1N2Rn6K2J3j9J1Lj9K1K3m5mO0j0n2J8J9
$$ plain form
4614 20 4 10 4 -9 2 16 -5 0 31 -3 -18 6 18 2 -6 -1 -4 17 15 -7 -16 12 6 4 21 12 -6 -19 13 26 21 -5 -7 3 21 19 4
4651 4 -7 14 10 4 8 15 -6 -14 11 20 6 -4 0 -11 33 18 -1 -3 2 5 5 10 3 -2 7 5 9 23 14 -30 -10 45 9 -11 0 -1 3 20 15 5 10 1
4693 1 -13 23 44 -17 -16 19 28 -6 10 -3 -16 19 9 -12 23 22 -34 -7 55 16 -24 1 4 1 28 -2 -37 26 17 -35 10 43 -35 -30
4727 -30 29 29 -10 17 -19 -15 50 26 -33 13 36 -27 -3 57 0 -36 12 9 -4 38 -2 -56 21 47 -41 -2 36 -29 -25 49 17 -19
4759 -19 16 -1 -44 39 53 -55 -13 46 -26 -22 44 -15 -50 30 27 -29 36 22 -59 19 57 -30 -24 30 -23 -22 50 3 -58 21 15 -54
4791 -54 23 46 -61 -36 57 -21 -27 33 -18 -47 47 39 -39 15 32 -63 13 66 -40 -44 43 -13 -31 58 3 -71 22 49 -29 13 53
4822 53 -51 -20 68 -10 -37 49 -6 -46 48 32 -59 5 43 -41 6 69 -41 -45 54 11 -41 42 10 -84 23 58 -46 -1 38
4851 38 -47 -24 66 -3 -59 31 12 -42 55 41 -73 0 58 -29 -7 58 -26 -63 55 17 -47 35 14 -60 22 62 -53 -24 61
$$ packed form
4614B0j6Ooj3J1J4k1NL1l4j5K4J2j6qNlK1kk2rK8okJ7rj8j3L2J3nk6kJ0J8kj5
4651Dj1K1moMPk1qK5Rj4j0Mj1M4j5j9kNL%NpnRkMJ4rm4K0N5l6k0J1jMJ7nj0Nr
4693Aj4L6K1o1JL5Rl4J6j3j3L5j0k1L5jn6K7O2l9m0K5LlK7l0l5O3rn2M5L3p8N
4727c0N9%l9K7l6MO5k4n9M6K3o3K4O0n7l6M8lj3M2m0n4P7K6q8L9L8o5MP4l2l6
4759a9L5j7m3Q3J4j08M2N9p2MO6n9l5Q0ln6O5j4q1P8L8q7ON4n3JP2m7o1P9oo9
4791e4P7K3j07K5R3p8oO0n1k9R4qp8N4J7r5P6N3j06mQ7n6j8Q9n5p4R3K7p8M2M0
4822E3j04L1Q8p8k7Q6n5m0R4j6r1O4L8q4M7O3j10mR9m3n2Q3l2r4J07L5j04M5L9
4851C8q5K3R0o9n6R0j9n4R7j4j14P3N8q7K2O5q4l7J18l8o4Q2k1p4Q2M0j15K9Q5
$$ plain form
4880 61 -39 -28 77 10 -71 21 24 -46 33 29 -74 8 59 -39 -29 60 -16 -45 63 35 -45 14 23 -51 40 61 -56 -23 66
4909 66 -17 -34 70 10 -52 31 39 -33 33 24 -53 7 75 -24 -49 48 4 -40 53 25 -59 13 25 -36 27 56 -60 -43 71 4
4939 4 -44 32 -5 -56 33 44 -50 13 44 -54 -1 78 -9 -58 34 13 -25 52 11 -51 36 43 -37 -5 55 -31 -43 77 23 -40 21
4970 21 -4 -43 29 42 -59 -14 45 -34 -6 55 -11 -51 32 13 -33 31 18 -69 18 72 -42 -20 53 -23 -37 48 4 -38 30
4999 30 21 -41 43 43 -61 -18 55 -14 -26 39 -2 -39 37 23 -32 31 8 -65 9 68 -30 -44 36 3 -23 35 6 -36 32 23 -41
5030 -41 31 34 -56 -28 58 7 -35 17 -6 -28 48 9 -45 16 27 -43 6 59 -20 -48 18 4 -8 34 -25 -35 28 44 -37 1 28
5061 28 -35 -20 44 4 -26 7 -5 -4 42 10 -54 6 30 -15 -11 40 -11 -27 26 11 -10 24 -14 -37 40 46 -30 -21 21 1 -10 27
5093 27 1 -21 11 9 -9 27 28 -44 -11 48 -7 -21 3 -21 -13 23 5 -28 6 6 -25 25 39 -12 -13 18 8 7 18 -14 -20 21 15 -11
$$ packed form
4880F1j00J1J05o7q1R2Lp0P9mj03Q2N1r8J0Q9p6k9J08k8q0N9Rp4R1K1j17L3Q9
4909F6q3j7J04o0o2Q3Qp2O6rp7O0O8r9k5R7m4m4R3k8q4P2J2o1O3K9j16J7J14o7
4939Dm8P6l7n1Q9J1r4O3L1r8N3P9q7m9R2k1l8P7m1o2Q7Pq0L2O0q6j2J20n4o3O1
4970B1k5l9P2J3j01M5N9p9K8O1o6m0Q3j9m6O4j3q7Q7N4j14K2P3p6j4Q5m4m2O8
4999C0ro2Q4%j04M3P3o9j2O5m1l7P6j4n5O3k3p3P4N9r8j4Q0l3k6N8k9m2O8ro4
5030d1P2Lr0K8Q6n1m2N2k3k2P6l9n4O1J1p0M9N3p9k8O6j4j2M2n9j0O3J6q1L8K7
5061B8o3J5O4m0l0L3j2JM6l2o4O0K4m5MN1n1j6N3j5k1L4l8k3P7Op6RM2k0j1L7
5093B7k6k2L2kj8L6Jp2L3N9n5j4K4k4QL6j8l3L4%l1N0J4n1jL1j0jJ1l2oM1ok6
$$ plain form
5127 -11 -2 17 -28 -11 23 14 -13 -5 -21 -3 28 -3 -38 0 18 -11 -3 10 -10 -15 2 -2 5 6 -17 -24 15 23 -9 -11 -1 0 -6 11 11 -4 -19
5164 -19 -5 13 23 5 -41 -2 25 6 -16 8 1 -2 7 3 7 -1 -14 -19 10 25 -8 -29 5 23 1 -7 9 -7 -11 0 2 5 -6 -16 -5 22
5200 22 27 -16 -10 8 13 1 2 -3 8 1 -10 13 26 10 -21 3 29 3 -10 -11 -1 1 6 -6 -3 9 -2 -12 11 23 -12 -23 20 23 -7 -3
5236 -3 -7 -10 8 8 -12 6 9 -24 -3 33 1 -33 -4 7 0 15 12 -17 0 26 0 -7 20 -4 -26 16 17 -16 -2 -3 -20 8 22 -18 -21 18
5272 18 -8 -3 25 -2 -34 -2 15 -10 14 11 -20 -6 46 7 -24 6 3 -13 16 15 -29 5 13 -21 13 37 -10 -29 28 27 -19 14 5 -26
5306 -26 21 13 -19 1 25 -17 -4 55 9 -35 2 11 -7 16 22 -29 10 14 -19 -7 35 -23 -35 25 34 -25 1 7 -18 15 25 -22 -5
5339 -5 36 -26 -15 39 -2 -36 13 10 -14 11 9 -32 12 36 -17 -27 43 -16 -32 26 26 -26 -2 12 -22 16 30 -35 -13 43 -6 -27
5371 -27 26 9 -31 18 16 -18 8 15 -32 -1 53 -18 -30 34 12 -34 39 27 -22 1 20 -21 14 45 -29 -18 43 15 -35 11 -2
$$ packed form
5127a1RJ9m5J7L4rk7Qj6J8L1l1l5L8J8k9QJ3k0nJ7mPJk3pL9Ql2kJ0JoJ7%j5j5
5164a9J4J8J0j8m6L9K7j9k2K4plRmMqj3nK9J5l3k1L4J8k2qJ6j6mJ1KLj1j0J1K7
5200B2Nm3OJ8Nj2JnJ1pj1K3J3j6l1K4K6k6j3jJ0KNj2LJ2j1j0K3J2l5j1M3Ll0M
5236cmlJ8%k0J8Ll3K1L6l2l4K9J1pJ5lk9J7K6k6pK7k4k2M2Jl3J4jj7K8J4m0lL9
5272A8k6NK8k7l2L2J7k5K4ll1J4N2l9l1L0lj6K9jm4L4Ql4L4K4m7j9N7jm6L3rl1
5306b6M7ql2K0K4m2J3N9m6m4L7Rj8K3On1L9Ml3J2M2n8j2O0Rn9K6Ok5L3J0m7J7
5339eM1o2J1N4m1l4M9lk4K5km1M4K4n3j0P0n9j6N8%n2K4J4l4L8J4o5K2N6m9k1
5371b7N3j7m0M9kl4K6Pm7L1N4p1j2O4k2m6P3j2m9K3J9m1L5L1p4J1O1k8n0M6j3
$$ plain form
5402 -2 -34 27 12 -28 3 32 -37 -11 43 -9 -33 29 1 -17 25 -4 -32 10 39 -34 -10 59 -13 -20 35 12 -16 15 5 -25 33
5433 33 32 -44 -9 48 -18 -28 24 -5 -33 19 -3 -37 20 10 -46 9 47 -35 -35 33 3 -39 26 13 -36 15 8 -28 20 28 -48 -15
5465 -15 39 -11 -30 30 2 -32 30 14 -22 18 24 -55 11 43 -40 -42 21 12 -33 22 -2 -34 16 15 -45 10 26 -40 -18 46 2 -30
5497 -30 20 9 -24 20 14 -27 17 33 -43 -4 48 -12 -32 20 4 -22 17 15 -26 15 27 -27 7 35 -11 -20 30 4 -29 14 5 -25
5529 -25 17 7 -37 5 38 -29 -17 26 -18 -30 19 4 -27 16 6 -24 8 26 -21 -26 32 -11 -22 27 5 -27 33 3 -17 23 20
5560 20 -31 -8 37 -23 -18 13 -7 -26 25 13 -28 8 10 -26 1 18 -22 -19 18 -9 -17 13 0 -22 28 10 -25 -1 29 -35 -8 30
5592 30 -10 -19 14 15 -16 20 0 -35 9 19 -30 3 17 -23 -29 18 -7 -16 18 -2 -20 11 9 -16 -1 18 -15 -16 21 -6 -19 9 3 -17
5626 -17 12 6 -28 13 25 -14 -1 21 -1 -20 10 11 -13 15 13 -5 24 17 -23 2 14 -8 -17 9 2 -6 20 5 -13 5 3 -24 1 13
$$ packed form
5402bl2O1j5m0L1K9o9K6N4n2k4O2k8j8M2k9k8M2K9p3K4O9p2pN5k3k8L1j0l0N8
5433C3jp6L5N7o6j0N2k9k8N2k2l4N7j0n6N5L8q2%O8l0m2O5j3m9N1pl6M8Qp6L3
5465a5N4n0j9O0k8l4O2j6l6M0Op9O6L2q3kO3rm5N5k4l2N0jo0N5J6o6K2O4m4l2
5497c0N0j1l3M4om1M4J6p6L9N2o0k0N2j6k6L9km1M1J2n4L4K8m6rN0k6l3M3rl0
5529b5M2j0m4M2L3o7J2M3m4j2M9j5l1M3j0l0L2J8m7nN8m3j1M9k2l2O0l0k0M0l
5560B0n1K3M5o0NL1k0j9N1j2m1L6Kl6K7J7m0LL7k7qL0j3k2N0j8l5K4L0o4K7L8
5592C0m0rL3Jl1L6k0l5M4J0m9L3J4m0oM7k5rL4k0j8L1kk5J5J9l3jL7k7j3K8ok0
5626a7K9ol4M1J2l9J3K2k2j9L0Jk4K8kj8K9pm0K5J2k2rK6pqK6j5j8J8kk7K5J2
$$ plain form
5660 13 -20 -25 0 3 -17 -10 5 -8 4 11 -14 5 10 -18 -7 26 -3 -10 15 0 -13 6 11 -14 15 2 -7 3 11 -3 -12 11 14 4 2 5 -1
5697 -1 -4 5 -8 -3 5 -12 -9 8 5 -22 -13 5 -5 1 4 -14 -11 5 -12 -3 5 -3 -7 9 19 -9 -6 12 -9 3 18 -6 -10 7 4 -5 18 -2 5 2 9
5738 9 -4 -1 18 -4 -3 12 12 -5 -7 11 -4 -8 4 -6 1 9 -3 3 9 2 -16 -3 10 1 1 3 3 5 4 4 7 16 4 -8 20 14 -4 -3 10 17 0 6
5780 6 -2 -1 11 6 -6 7 8 -6 -16 23 15 -10 3 -2 -3 10 5 -12 9 21 -1 11 19 -8 -5 10 24 -5 -9 11 8 14 9 -3 6 22 5 -8
5818 -8 11 7 4 4 -2 -3 11 -4 -19 6 15 -6 -13 17 2 -4 6 9 -9 20 18 -10 13 12 -12 -4 13 -8 -7 13 -1 -17 16 12 -4 4 11 -3 2
5857 2 30 9 -17 16 3 -9 17 -2 -17 8 19 -2 3 16 -5 -8 21 12 -24 9 10 -6 16 17 -15 -5 20 -7 -7 24 3 -5 20 6
5891 6 -9 12 17 -9 10 27 -19 -13 13 -4 -16 8 12 -12 16 14 -3 7 12 -17 3 27 1 -8 10 -4 -13 12 5 -6 7 17 -16 0 34
5926 34 -5 -6 30 -2 -18 21 -4 -7 2 24 -13 9 23 -7 -10 34 10 -19 9 5 -17 7 19 -11 11 30 -18 -4 15 -5 -10 18 13 -17
$$ packed form
5660A3l3nK5Lk0PJ5j3J2Pk5J9Nk8J1L3k9pK5j5j3J9Nk5K9j3rJ0Qj4rK3Lj0kLo
5697alRj3NQj7LJ7lk7RJ8j0OLj8LJ6j7RQqmJ6J0k8LJ8k1J2J5k4mJ7lrK3k0PlP
5738Ij3LJ9k2JJ5%j7kJ8j5mJ2j0PQj2OOpj8J3J3r%K%Kj%LRj2j2K8oj8JJ3Pj7O
5780FqJJ2nj2J3Jj4j0L9qk5J3njJ3nj7K1J2k2J2Qk7LJ5J4k9mK0lOnj2RJ6j7j3
5818hJ9ml%ojJ4j5j5K5Rk1pL0j5oJ0Lj8K9kk8K3jk4QJ7k1JK0j4j6L3mj6QPj4N
5857BK8k1k6L3j3j2K6j9j5K5J1k1NJ3k1lK9rl6L3Jj6K2Jl2J0K5k7%L1k1qK5j4
5891Fj5K1Nk6J9J7m6OK6j7j2K4Mk4K8kj7J0Nk9K0K4k6rJ8j4rK5pj1J3J0l3J6L4
5926C4l9jL6l2j6L9k5lRK2l7K2J4l0lM4k4k9K8mk2K4J2l0K2J9m8J4J9k0nK8nl0
$$ plain form
5960 -17 5 13 -18 12 12 -25 -11 27 -6 -16 20 -2 -21 17 15 -8 16 21 -10 -2 33 -6 -4 34 1 -11 18 13 -10 7 3 -24 1 21
5994 21 -13 -21 19 -8 -10 9 -6 -17 11 -1 -23 5 18 -12 -15 14 -9 -15 8 -1 -14 17 3 -17 1 23 -17 -10 15 3 -4 7 -10 -10
6028 -10 21 9 -3 30 19 -16 5 29 -14 -19 10 6 -23 7 3 -15 8 3 -32 10 21 -15 -12 18 0 -10 5 1 -6 21 5 -18 19 16
6062 16 -15 -4 18 -10 -1 19 6 -6 15 6 -5 13 3 -16 -2 26 3 -14 16 13 -18 9 0 -22 9 10 -21 3 9 -25 -12 25 -2
6095 -2 -14 3 -9 -14 6 4 -14 1 21 -6 3 18 3 -9 14 3 -15 14 -1 -8 11 5 -15 1 23 -1 -20 20 0 -13 -9 1 -13 1
$$ packed form
5960a7K2Ql1L0%l7J4L8l3j0L6k2j9L8kk3K4Nl1QL5l9KL8l3j2K9nk3J7mk7K5K0
5994B1l4qM0k7kJ9j5j1K8j2k2K8J3l0lK9k3oK3rj3L1j4k0J8K2m0PK5j2pJ1j7%
6028a0L1j2j2L3j1l5K1K4m3nK9mk9L0mj8K3nl5M2J1l6LL0j8j0J5mpK7j6k3L7l
6062A6l1J1K2k8RK0j3j2K1rj1J8j0j9J4K8k3j7L0ll1K7rk2L1Jl1K4Ol4J3L7k7
6095bj2J7j2nK0kj8J5K0k7RJ5j5j2K3j1j8K9j5pJ9ok0J6K2k4j9M0k0j3MJ0j4J4
$$ [...]
8191@
##END NTUPLES=NMR FID
##END=
