##TITLE=1H_IPEM51
 CDCl3, 8 sc, 
 24.7.2019
##JCAMPDX= 6.0         $$ Bruker NMR JCAMP-DX V2.0
##DATA TYPE= NMR FID
##DATA CLASS= NTUPLES
##ORIGIN= UXNMR, Bruker Analytische Messtechnik GmbH
##OWNER= root
$$ XWIN-NMR		Version 3.5
$$ Wed Jul 24 14:54:55 2019 Russian Standard Time (UT+4h)  she@DPX200
##.OBSERVE FREQUENCY= 200.13155
##.OBSERVE NUCLEUS= ^1H
##.DELAY= (6, 6)
##.ACQUISITION MODE= SIMULTANEOUS
##.ACQUISITION SCHEME= undefined
##.AVERAGES= 8
##.DIGITISER RES= 18
##SPECTROMETER/DATA SYSTEM= spect
##.PULSE SEQUENCE= zg30
##.SOLVENT NAME= CDCl3
##.SHIFT REFERENCE= (INTERNAL, CDCl3, 0, 15.7039)
##AUDIT TRAIL= $$ (NUMBER, WHEN, WHO, WHERE, WHAT)
$$ ##TITLE= Audit trail, XWIN-NMR		Version 3.5
$$ ##JCAMPDX= 5.01
$$ ##ORIGIN= Bruker BioSpin GmbH
$$ ##OWNER= she
$$ F:/spectra/data/she/nmr/H-F/1/audita.txt
$$ ##AUDIT TRAIL=  $$ (NUMBER, WHEN, WHO, WHERE, WHAT)
(   1,<2019-07-24 14:53:58.93 +0400>,<she>,<DPX200>,
      <created by zg, POWCHK disabled, PULCHK disabled
       configuration hash MD5:
       00 E9 B6 7A A2 85 ED C7 34 08 36 98 17 FE 4E 26
       data hash MD5: 16K
       31 AC 1C 95 EE DB 32 24 03 4B FC AA D8 58 F1 BF>)
$$ ##END=
$$ 
$$ hash MD5
$$ 1D 08 D8 F6 79 10 F0 65 26 09 20 C3 16 D2 C3 51
##$RELAX= 
##$RELAX= 
##$RELAX= 
##$RELAX= 
##$RELAX= 
##$RELAX= 
$$ Bruker specific parameters
$$ --------------------------
##$DU= <F:/spectra>
##$EXPNO= 1
##$NAME= <H-F>
##$PROCNO= 1
##$TYPE= <nmr>
##$USER= <she>
##$AMP= (0..31)
100 100 100 100 100 100 100 100 100 100 100 100 100 100 100 100 100 100 
100 100 100 100 100 100 100 100 100 100 100 100 100 100 
##$AQSEQ= 0
##$AQ_mod= 1
##$AUNM= <au_zg>
##$AUTOPOS= <>
##$BF1= 200.13
##$BF2= 200.13
##$BF3= 200.13
##$BF4= 200.13
##$BF5= 200.13
##$BF6= 200.13
##$BF7= 200.13
##$BF8= 200.13
##$BYTORDA= 1
##$CFDGTYP= 0
##$CFRGTYP= 5
##$CHEMSTR= <none>
##$CNST= (0..31)
1 1 145 1 1 1 1 1 1 1 1 1 1 1 1 1 1 1 1 1 1 1 1 1 1 1 1 1 1 1 1 1 
##$CPDPRG= <>
##$CPDPRG1= <>
##$CPDPRG2= <>
##$CPDPRG3= <>
##$CPDPRG4= <mlev>
##$CPDPRG5= <mlev>
##$CPDPRG6= <mlev>
##$CPDPRG7= <mlev>
##$CPDPRG8= <mlev>
##$CPDPRGB= <>
##$CPDPRGT= <>
##$D= (0..31)
0 1.2 0 0 0 0 0 0 0 0 0 0.03 0 0 0 0 0 0 0 0 0 0 0 0 0 0 0 0 0 0 0 0 
##$DATE= 1563965638
##$DBL= (0..7)
120 120 120 120 120 120 120 120 
##$DBP= (0..7)
150 150 150 150 150 150 150 150 
##$DBP07= 0
##$DBPNAM0= <>
##$DBPNAM1= <>
##$DBPNAM2= <>
##$DBPNAM3= <>
##$DBPNAM4= <>
##$DBPNAM5= <>
##$DBPNAM6= <>
##$DBPNAM7= <>
##$DBPOAL= (0..7)
0.5 0.5 0.5 0.5 0.5 0.5 0.5 0.5 
##$DBPOFFS= (0..7)
0 0 0 0 0 0 0 0 
##$DE= 6
##$DECBNUC= <off>
##$DECIM= 24
##$DECNUC= <off>
##$DECSTAT= 4
##$DIGMOD= 1
##$DIGTYP= 9
##$DL= (0..7)
0 120 120 120 120 120 120 120 
##$DP= (0..7)
150 150 150 150 150 150 150 150 
##$DP07= 0
##$DPNAME0= <>
##$DPNAME1= <>
##$DPNAME2= <>
##$DPNAME3= <>
##$DPNAME4= <>
##$DPNAME5= <>
##$DPNAME6= <>
##$DPNAME7= <>
##$DPOAL= (0..7)
0.5 0.5 0.5 0.5 0.5 0.5 0.5 0.5 
##$DPOFFS= (0..7)
0 0 0 0 0 0 0 0 
##$DQDMODE= 0
##$DR= 18
##$DS= 0
##$DSLIST= <SSSSSSSSSSSSSSS>
##$DSPFIRM= 0
$$ [...]
##$SUBNAM2= <"">
##$SUBNAM3= <"">
##$SUBNAM4= <"">
##$SUBNAM5= <"">
##$SUBNAM6= <"">
##$SUBNAM7= <"">
##$SUBNAM8= <"">
##$SUBNAM9= <"">
##$SW= 24.9336996594482
##$SWIBOX= (0..15)
0 0 2 0 0 0 0 0 0 0 0 0 0 0 0 0 
##$SW_h= 4990.01996007984
##$TD= 16384
##$TD0= 1
##$TE= 0
##$TE2= 300
##$TE3= 300
##$TEG= 300
##$TL= (0..7)
0 120 120 120 120 120 120 120 
##$TP= (0..7)
150 150 150 150 150 150 150 150 
##$TP07= 0
##$TPNAME0= <>
##$TPNAME1= <>
##$TPNAME2= <>
##$TPNAME3= <>
##$TPNAME4= <>
##$TPNAME5= <>
##$TPNAME6= <>
##$TPNAME7= <>
##$TPOAL= (0..7)
0.5 0.5 0.5 0.5 0.5 0.5 0.5 0.5 
##$TPOFFS= (0..7)
0 0 0 0 0 0 0 0 
##$TUNHIN= 0
##$TUNHOUT= 0
##$TUNXOUT= 0
##$USERA1= <user>
##$USERA2= <user>
##$USERA3= <user>
##$USERA4= <user>
##$USERA5= <user>
##$V9= 5
##$VALIST= <valist>
##$VCLIST= <CCCCCCCCCCCCCCC>
##$VD= 0
##$VDLIST= <DDDDDDDDDDDDDDD>
##$VPLIST= <PPPPPPPPPPPPPPP>
##$VTLIST= <TTTTTTTTTTTTTTT>
##$WBST= 1024
##$WBSW= 4
##$XGAIN= (0..3)
0 0 0 0 
##$XL= 0
##$YL= 0
##$YMAX_a= 49954
##$YMIN_a= -58838
##$ZGOPTNS= <>
##$ZL1= 120
##$ZL2= 120
##$ZL3= 120
##$ZL4= 120
##$ABSF1= 10
##$ABSF2= 0
##$ABSG= 5
##$ABSL= 3
##$ALPHA= 0
##$AQORDER= 0
##$ASSFAC= 0
##$ASSFACI= 0
##$ASSFACX= 0
##$ASSWID= 0
##$AUNMP= <proc_1d>
##$AZFE= 0.1
##$AZFW= 0.1
##$BCFW= 1
##$BC_mod= 2
##$BYTORDP= 1
##$COROFFS= 0
##$CY= 11.3945322036743
##$DATMOD= 1
##$DC= 2
##$DFILT= <>
##$DTYPP= 0
##$F1P= 18.9103706918063
##$F2P= -1.10871071338519
##$FCOR= 0.5
##$FTSIZE= 0
##$FT_mod= 4
##$GAMMA= 1
##$GB= 0.15
##$INTBC= 1
##$INTSCL= 1
##$ISEN= 128
##$LB= 0.24
##$LEV0= 0
##$LPBIN= 0
##$MAXI= 10000
##$MC2= 0
##$MEAN= 0
##$ME_mod= 0
##$MI= 1.114404
##$NCOEF= 0
##$NC_proc= 0
##$NLEV= 6
##$NOISF1= 3.799351
##$NOISF2= 2.8
##$NSP= 1
##$NTH_PI= 0
##$NZP= 0
##$OFFSET= 15.70392
##$PC= 1
##$PHC0= -8935.44
##$PHC1= 7.00096
##$PH_mod= 1
##$PKNL= yes
##$PPARMOD= 0
##$PSCAL= 0
##$PSIGN= 0
##$REVERSE= no
##$SF= 200.130013532006
##$SI= 16384
##$SIGF1= 3
##$SIGF2= 2
##$SINO= 400
##$SIOLD= 16384
##$SREGLST= <1H.CDCl3>
##$SSB= 0
##$STSI= 0
##$STSR= 0
##$SW_p= 3612.71676300578
##$SYMM= 0
##$S_DEV= 0
##$TDeff= 0
##$TDoff= 0
##$TI= <>
##$TILT= no
##$TM1= 0
##$TM2= 0
##$TOPLEV= 0
##$USERP1= <user>
##$USERP2= <user>
##$USERP3= <user>
##$USERP4= <user>
##$USERP5= <user>
##$WDW= 1
##$XDIM= 8192
##$YMAX_p= 0
##$YMIN_p= 0
$$ End of Bruker specific parameters
$$ ---------------------------------
##NTUPLES= NMR FID
##VAR_NAME=  TIME,          FID/REAL,        FID/IMAG
##SYMBOL=    X,             R,               I
##VAR_TYPE=  INDEPENDENT,   DEPENDENT,       DEPENDENT
##VAR_FORM=  AFFN,          ASDF,            ASDF
##VAR_DIM=   8192,          8192,            8192
##UNITS=     SECONDS,       ARBITRARY UNITS, ARBITRARY UNITS
##FACTOR=    0.0002004,     1,               1
##FIRST=     0,             0,               0
##LAST=      1.6414764,     0,               0
##MIN=       0,             -58838,          0
##MAX=       1.6414764,     49954,           0
$$ Real data points
##PAGE= N=1
##DATA TABLE= (X++(R..R)), XYDATA
$$ [...]
503E504m053n339k606L845P374K199n290n900j122K852M996L868k352p621l775
518g420M689O675J716k808m755m018J111O969N079l218p214k973K823N127L727
533E510p77n752n332J171O498M827j302n732m668O09N284N018J57n029n862q25
549f205N609O258J89n375n011p57L573N684K596m375p106j397N051N075J211k254
565B766n031m008K570P243K749m302m954j400J194L927M851p19p152m207L691
580b782N197J304q84k604m627r24O284N455k910n955j457J515J915L591K013m584
596E47o251J241O402K582k016k423k724k048L048O367R25n962m475J365L369K734
612B681J592j977n668k664M449N916M93l777l599j476J286M404L646k028n961
$$ y = [5504, 1451, -3888, -6494, -2649, 4725, 6924, 1634, -4266, -5388, -2536, 2460, 6328, 3976, -3645, -7420, -2731, 3944, 5660, 2852, -1903, -5921, -4810, 2159, 7238, 4020, -3194, -6167, -3344, 1783, 5510, 4733, -1019, -6351, -5180, 1318, 6145, 4843, -889, -5557, -4948, 336, 5354, 5511, 482, -5380, -6205, -596, 5662, 5851, 476, -4535, -5292, -1719, 3965, 6561, 2186, -4920, -6317, -1266, 3809, 5020, 2766, -2265, -6273, -3703, 3540, 6289, 1987, -2967, -4367, -3173, 754, 5605, 4886, -2266, -6473, -2782, 2415, 3719, 2835, 231, -4396, -5320, 964, 6419, 3509, -2446, -3903, -2388, -473, 3118, 5131, 547, -5704, -4463, 1939, 4521, 2505, 82, -2642, -4690, -1642, 4725, 5650, -312, -4787, -3422, -53, 2681, 4273, 2296, -3372, -6036, -1587, 4329, 4822, 1045, -2554, -4030, -2744, 1660, 5306, 3278, -2683]
627b683k703L042M432J769j035l105l621l75M553M468j218m769k369J191K180
642b43K456J571k356m914q23M536L272j488k224q14j150J74L802K471l580m341
658c651J360L385K26m52O79j879l246J908N147j30m628j279J989J53L77K930j45
675B744n269k006M668L326j996j690J00j976j197M314L946l242m940N81K502J85
691E0J101K124k462m936P69N131J293k378o72l57k341L28M599J695l930k717J583
708a120J207l24J471J313k709l004J806L223m21j718L61J82j506J41K435M46k392
725f09q86J736O45j281o6J266l81j480O66J698q58k032P79K154n11j702O12R05
743F55j475n66K580R99k968j468K341R94j662N17J918j820k830J958L116j491
$$ y = [-2683, -5386, -2344, 2088, 3857, 2822, -283, -3904, -4279, 274, 4742, 3524, -1245, -3614, -2423, -243, 2213, 3784, 1428, -3486, -4309, 227, 3499, 2011, -213, -1027, -2177, -2003, 1799, 4270, 690, -3651, -2291, 1094, 1320, 868, 1547, -332, -3578, -1670, 3477, 3347, -1281, -2560, -571, -418, -41, 2889, 2744, -2525, -4531, 137, 3463, 1467, -223, -123, -2099, -3296, 1018, 4964, 1722, -3218, -2637, -135, 50, 1151, 3275, 813, -4123, -3354, 1777, 3070, 692, 20, -337, -2678, -2350, 2249, 3944, 14, -2703, -1120, 87, -237, 1234, 2547, -162, -3166, -1360, 1863, 1442, -276, 85, 267, -1239, -1098, 1337, 1783, -609, -1495, 241, 886, -395, -461, 805, 424, -1056, -390, 1308, 450, -1582, -803, 1351, 840, -862, -250, 655, -820, -1386, 1194, 2193, -775, -2243, 98, 1092, -570, -53, 1865, 45, -2785, -827, 2289, 798]
759G98k068J671N75k768J55L754l0l561J83K525j308j796K726J826l287j739K939
776E95P86k720O65L079j469l367J450K638j549j235K484L57l565n41L473P84k193
793c28R4J096j792j333K663K194j876k089N57N06m16J075J600j051k519k96J806
810a09J249j14n88p48q25r7J343J576l55k099q99J350J023l85J11L77j406j249
828a845J868K059j520j961J102R70j264K95K059j132k954J180L211q32k348Q83
844b29P43j932M68L486m93m222k26L217J66j228J516Q9l784o61M493J805l047
861A61j339R94j181n81L678K066l854l294J882K112j92R21P83l015k846K446L731
878B472k80k010p44q48n77K191K652j002l018r16J060J332J287K04j902j888M73
$$ y = [798, -1270, 401, 976, -1792, -1637, 2117, 2087, -1474, -1291, 1234, -74, -1870, 856, 2682, -605, -2344, 595, 1381, -1339, -674, 2405, 936, -2431, -981, 1657, 108, -1127, 1357, 1714, -1851, -2392, 1081, 1865, -328, -234, 862, -930, -2263, 400, 2594, 718, -1371, -814, -308, -724, 351, 1951, 900, -1619, -1915, -109, 1140, 1026, 438, -310, -1135, -1232, 111, 1687, 1332, -767, -1666, -316, 707, 322, 433, 810, -596, -1845, 23, 2082, 562, -1399, -297, 673, -591, -296, 1763, 631, -2323, -1143, 2068, 1236, -1112, -229, 514, -1418, -950, 2536, 2043, -2179, -2405, 812, 978, -250, 1266, 1355, -2429, -3090, 1403, 3208, 161, -1178, -184, -1365, -1946, 1732, 3798, -56, -3350, -1468, 644, 452, 1373, 2156, -859, -3705, -1259, 2472, 2192, 182, -562, -1410, -1987, 204, 2856, 1854, -1164, -2080, -1020, 312, 1599, 1803, -99, -1987, -1514]
895a514J818J251Q9j416k102j3K371J389q65j136q40q35J078K838K51l067j608
912b311J427J133L80J138n21l280j024L356K311j437j397l60j395J3L614J953
928C600l204l051J020J486M04J661O21l576k863K719L571m86j493k81j610j351
944b833K940L550j720l730k30J454L76J307J569k041l559N75L336J061j000q09
960B46j365j263J696L047p6k626j411K01R07J893J233j850k807O0K087J315L84
977A671n43k266j726J810L024J94j816j283q02R7K348K189j464l074n69J423J277
994D90J242L13k349k476J144K899O79r94r19j442q76K181K840q50k844p15Q09
1011h68N05J344J373j723l082L28K843R78p39n05j211j537J265L080K26k570j333
$$ y = [-1514, 304, 1555, 1644, 228, -1874, -1887, 484, 1873, 1008, -128, -968, -1803, -725, 2113, 2364, -703, -2311, -884, 249, 629, 1767, 1246, -2034, -3058, 298, 2609, 1172, -225, -585, -1980, -1967, 1647, 3600, 396, -2655, -1635, -149, 255, 1916, 2537, -1039, -3902, -1183, 2388, 1902, 409, 128, -1482, -2833, 107, 3657, 1937, -1793, -2023, -569, -193, 1114, 2683, 642, -2917, -2342, 994, 2055, 1055, 246, -1119, -2382, -686, 2361, 2285, -341, -1752, -1551, -644, 1249, 2482, 632, -2175, -2115, -28, 1287, 1671, 1128, -1138, -2864, -1054, 1970, 2164, 348, -935, -1737, -1640, 708, 2897, 1433, -1641, -2210, -787, 490, 1732, 2045, -304, -2780, -1636, 1263, 1942, 948, 29, -1413, -2289, -108, 2732, 1882, -962, -1677, -868, -363, 981, 2354, 631, -2451, -2123, 720, 1698, 959, 454, -757, -2294, -1029, 2051, 2277, -293, -1626]
1028a626M57N61J247J533r73k894o52K065J520Q8l79j381j729P00K709R36j561
1045F21j448n49J9J438K011l66k555j128J139J237P40L65j242k155P1K364J239
1062A801q23j036p76o59R28K122K63k034j335N64Q96Q28P46p23k047n27J712J356
1080A256k20p34r14q72O26J966O07j474j290k1M40R37J143m01j929p78J246J165
1098G53J64j74p82j316M1J849J045r38j168k66L7N94J247K41j520j204O00J110
1116C13M90N9n49j152l53J182J105k62q57o20k46N41J150L62j021r87Q9N58N76
1135C78M90l33j196m97R21R74k3m88m93n26R1J052O78o52r49j34M27M47M62k6
1155F03p90o62L34P91L32j72m80n18jO81N72k27n75l24j3L43O29J39o58n72J89
$$ y = [-1626, -1169, -608, 639, 2172, 1199, -1695, -2347, -282, 1238, 1326, 947, -434, -2163, -1463, 1246, 2182, 621, -827, -1376, -1357, 81, 2092, 1726, -829, -1957, -818, 419, 1159, 1524, 282, -1873, -1802, 562, 1801, 978, -58, -834, -1493, -565, 1557, 1820, -214, -1549, -985, -89, 739, 1485, 762, -1285, -1812, -100, 1256, 1036, 302, -612, -1484, -858, 1108, 1715, 241, -1049, -1070, -630, 307, 1450, 1049, -880, -1658, -412, 753, 917, 743, -39, -1355, -1314, 535, 1580, 642, -526, -792, -755, -161, 1086, 1327, -193, -1397, -797, 313, 803, 862, 313, -839, -1192, -10, 1095, 833, -24, -644, -890, -349, 801, 1163, 142, -845, -756, -198, 378, 868, 535, -661, -1158, -237, 737, 714, 226, -267, -793, -702, 350, 1028, 376, -573, -707, -280, 167, 629, 603, -187, -849, -515, 276, 608, 436, -44, -562, -563, 118, 690, 463, -112, -436, -449, -106, 523, 662, 4, -568, -379]
1176c79M77K28N1j69n40k61M84O19n3m65k44n0J03L47L25k62n37j04L62K84N4
1197B70j12k48k83J00M14K10k39l02m1J03J41J71L6k81k51J41L09K7j31l8m6j14
1219a64R6K82ll09q6J91P4q8Q0N1j67j10K04J39j62j21J02N3j00K8J07o8j04N7
1243a8Q5o0o3M7J8j6J7ro5J7P1Jl2mm0l8R2R4n6j13k8M0N9J07Rj82j11J11J30
1272F3J7M2n5k69n3L62K11k64j75J04q4r5L65L17m42n07K86L99j60k9K74k58n95
1295e46K61P82o8o11j1K09k28L2O25K4p78k36N26K44j65P6J8m57j61N39L71l18
1317A28k87Ml8M5M06J36m49l22K10K62N1Q6j06m20r3M65L10j72k77j15o2J47L84
1340B93J16l84l87N1L10K84J01k94m11l8K78L03J58j16n14l51M30O11m7l74j18
$$ y = [-379, 98, 326, 377, 208, -332, -593, -109, 510, 457, -8, -252, -302, -199, 148, 473, 211, -326, -430, -68, 216, 270, 158, -90, -373, -273, 141, 351, 112, -190, -231, -128, 13, 184, 220, -61, -312, -171, 138, 165, 34, -4, -50, -164, -68, 214, 211, -98, -184, 7, 81, -7, 73, 124, -43, -153, 51, 190, 28, -93, 9, 62, -38, -10, 97, 29, -75, -18, 67, 7, -56, -9, 9, -7, 10, 1, -64, -47, 24, 25, -7, -11, -51, -89, 3, 97, 41, -72, -100, -60, -1, 106, 115, -67, -178, -67, 63, 80, 122, 67, -202, -255, 107, 318, 54, -121, -17, -101, -196, 169, 486, 44, -463, -177, 222, 62, 33, 307, 49, -546, -285, 497, 429, -182, -193, 16, -212, -180, 445, 469, -309, -545, -19, 225, 60, 136, 154, -303, -464, 75, 446, 128, -159, -155, -193, -148, 258, 394, -55, -377, -167, 95, 146, 232, 126, -294, -387, 78, 388, 216, -61, -176, -238, -91, 293, 409, 25, -362, -311, -1, 283, 384, 90, -321, -359, -81, 222, 380, 264, -250, -601, -171, 440, 393, 19, -99]
1361i9j67j97M38P13k53q79j04N49J07n8L32r7q17j62Q90M37n15l04J42j88j16
1382c48O30L86o33n97L11L96j3Q8N7m58l40M56N20j67l15q4j29J2M52L01m39m76
1404c90J30K85Q5J22M8m27l96L35N84J5l73k18p4K2L15L52j28m87k64K05M32K22
1426C95j73l79j77R0K06K95J49l59n44Q6N81K05k40j15r6k96P6O38K25n90m21
1447d44K69K50l1J76J00m64l81L99N15j19k82m6j00r0L39L36k65m31L8K10N3J33
1469A65J10l29l72K58M15n3k18j7r3j62K72M10j43m82o2K70J06J0R9j25l42j9
1491c02L89K23j58k24q5nJ22K18P4j99k47k9K02K34J8k13j77JJ08J54J19q7k69
1514a33j21K14K14l2j12o9r5j7K20J70j50k17%P4P1P0L9j71j63R7J88K7o8n9q7
$$ y = [-99, -266, -463, -25, 688, 435, -444, -548, 1, 108, 50, 382, 285, -532, -694, 196, 633, 118, -186, -44, -232, -348, 282, 668, 35, -562, -251, 145, 132, 220, 277, -181, -521, -65, 455, 288, -27, -111, -240, -228, 224, 525, 86, -390, -260, 25, 110, 232, 280, -147, -543, -208, 376, 391, 18, -200, -274, -252, 63, 415, 287, -200, -464, -259, 173, 395, 222, -157, -334, -244, -38, 257, 406, 47, -497, -411, 170, 375, 135, 20, -76, -372, -296, 342, 567, -23, -444, -175, 75, 44, 220, 320, -144, -525, -126, 389, 270, -12, -58, -158, -248, 91, 427, 162, -269, -231, -21, 32, 165, 275, -54, -426, -168, 247, 194, -24, -41, -134, -296, -24, 386, 243, -239, -301, -31, 75, 85, 184, 59, -283, -302, 87, 310, 152, -72, -157, -162, -40, 178, 252, 53, -194, -223, -21, 213, 231, 18, -159, -158, -50, 104, 223, 136, -133, -254, -40, 174, 142, 30, -39, -134, -151, 69, 239, 89, -128, -128, -54, 17, 87, 126, -45, -208, -111, 77, 104, 36, -23, -110]
1539a10m5J68J53r9j81QP6L6M3P4j05j83M9J88M6r1l1ro7M4J54K5j43r7O1Q3O
1566E3K3j9r6m1P4J07pr5n6K0L0M3K9l8p8j3O4M7rl2m1l5K8O4J5m9m3J8J2K9K8
1597C2k0o5k9Q7O3n0l4J0j2j5N0M7o0n7M6M3rj1L7l7l9K9O2k3m9J6NpJ8K9k9n4
1629b6J8L5kmml1k3M6M4n1l0J1j2KK7L2n9m7M4L2j8PJ8n6j9N8M6l8k8K2k3nN8
1662B4K2n6n2M1L8j9L8J2p1k1R0J4m7j7M3l0m8Q0N2q9m5Q7Jp5M0O1o6q2R2M8o9
1693dn3Q5pq8N1P6n9o6M8N0o7j1N9j4o7L8O8p2l1Q7j4n4K1O7n4l2N9K8o5%O8k6
1725B1m4L8O0p9l0P7J8o7J2L6k5l7O7L9p4m6M8Rj2L7po9l9Q6J4k7J6j8p7J2J18
1756E7Qr2j7L4k3lJ08Lj39m7R4O1l4R%j04k9J37J01r2q7PLL0J01K8j17r8N1Q3
$$ y = [-110, -155, 13, 166, 67, -114, -106, -30, 6, 49, 123, 18, -165, -116, 72, 118, 27, -4, -13, -80, -36, 118, 143, 0, -97, -36, 47, 53, 76, 57, -39, -80, -6, 101, 94, -1, -57, -37, -7, 36, 65, 27, -51, -64, 0, 47, 38, 6, -35, -70, -42, 22, 37, -12, -55, -37, -25, 4, 32, 12, -53, -82, 5, 68, 18, -16, -6, -18, -33, 17, 64, 4, -53, -7, 36, 27, 16, 53, 16, -23, 6, 68, 45, -4, 12, 17, 10, 28, 57, 28, -26, -8, 27, 25, 21, 17, -14, -37, 9, 53, 2, -28, -17, -29, -27, 0, 32, -27, -74, -30, 2, -16, -9, 9, -47, -66, -8, 38, 0, -28, -6, -29, -34, 24, 46, -10, -62, -21, 17, -2, 36, 48, -23, -44, 46, 60, 13, -4, 39, 9, -39, 41, 93, 4, -41, 46, 47, -28, 12, 73, 7, -75, 17, 65, -4, -57, 28, 21, -67, -16, 60, 1, -65, -17, 33, -34, -45, 14, 0, -67, -29, 39, -33, -64, 23, 9, -45, -24, 43, -11, -43, 16, 44, -21, -21, 47, 21, -23, 15, 75, -4, -34, 43, 61, -6, 6, 42, 17, -20, 47, 86, 12, -34, 14, 23, 11, 48, 41, -28, -67, 19, 33, 6, 22, 4, -73, -61, 57, 65, -27, -44, -10, -33, -36, 72, 75, -64, -111, -17, 44, 10, 19, 19, -85, -114, 23, 124, 32, -55, -48, -45, -15, 86, 114, -3, -101, -50, 33]
1786C3M9J6l8j42j5J26J09l4p9o1m3M9J46N3j37j46J4J01N5P0m2j65r6J22J52
1811I7L3r7j07p9N4J52J09q8j73o7M9J47J32m9j88j25Q6J55J09l0j34j71J6K15
1835D6J54m3j86j33J2J49J87J2j81j79J0J72J49K6j34k20m4J99K04J6j44j98p5
1858b01J36K29R9j66k66o0J47K12R8j11k45j49J41K60J28j52k26j43J08K45J52
1879B36q2k51j86Q4K61J92p5k56j86N6K48K14k6k56k30L2K60K20%k30k60j8K71
1902A8K55Kk41k61l3K12K85R2k42l22m3K36K52Q4j58l03j72J90L74J23k36l02
1924a90q8J18K71K13j11l84k09J83L51J38j36k63k10N2L21K76r8l61k17R3K98
1945D7K27j9k72l03J6L43K78k6l09k61J5K57L01M8k89l24n2L15L01K4k17k92j42
$$ y = [33, 82, 98, 60, -82, -97, 29, 138, 104, 25, -36, -79, -30, 116, 169, 32, -114, -100, 1, 56, 126, 84, -81, -177, -55, 97, 130, 33, -74, -153, -99, 53, 162, 74, -99, -166, -117, 30, 162, 113, -75, -200, -114, 41, 150, 120, -14, -185, -169, 46, 200, 157, -29, -162, -150, -1, 186, 198, 17, -162, -152, 20, 169, 195, 61, -159, -203, -4, 200, 216, 72, -126, -201, -65, 164, 263, 97, -169, -229, -82, 130, 228, 117, -128, -277, -136, 124, 252, 100, -126, -269, -161, 84, 236, 154, -97, -283, -199, 62, 254, 179, -77, -263, -207, 41, 255, 229, -27, -257, -225, 35, 255, 255, 25, -235, -253, 18, 273, 275, 34, -227, -260, -48, 237, 329, 87, -235, -278, -42, 210, 294, 136, -167, -339, -149, 225, 348, 112, -190, -278, -160, 111, 324, 213, -171, -380, -197, 154, 292, 156, -107, -317, -265, 56, 332, 234, -127, -344, -251, 47, 274, 255, -17, -320, -304, 39, 317, 291, -18, -279, -264, -7, 294, 342, 53, -271, -323, -8, 293, 317, 100, -192, -334]
1968c34K21L87J21k89l59n1J98K70J81j35l93k30K28M18Q9k03k55j76L3L55L29
1989D05j34m74j89K14K74J56nk57l58J7M46L10j79l31j56J9J89L25J05l53m03
2010c79P2L71J98qj65k94j44K53M26N0l45k87QJ80K43J58j52l86j81K88L46M0
2032B92k02k17j33N0L20K55j72l96j37K14K43J08l3k24k89K9L88K61j78l16j10
2053b47P7J56K33J03l17l57O6L95J60j18j51j49j24J47L99R1l93k78J34K12P8
2074A17J02l1l43k18K91L97n8k79p4m2k9K09L09j40m39o7K91J54m6K4j00k79j2
2097b63L99J78k57k11L2K3J4K15J42l11k94J82K82j1q0Kj42j34J69L14n3k84r3
2120a81J31N5M2J18m4k62q7K48J92q2j64k2j5j9J45J52q8k57l2K11R1q7j6%j27
$$ y = [-334, -113, 274, 395, 106, -253, -304, -106, 164, 345, 210, -183, -413, -185, 233, 322, 119, -136, -312, -279, 76, 405, 271, -203, -392, -178, 96, 252, 247, -10, -368, -351, 95, 405, 226, -105, -261, -242, -53, 272, 377, 24, -379, -307, 64, 262, 254, 89, -205, -349, -96, 330, 380, 35, -252, -244, -64, 179, 337, 185, -201, -382, -94, 252, 292, 90, -127, -260, -210, 110, 365, 193, -203, -340, -126, 117, 225, 192, -32, -321, -292, 96, 357, 179, -137, -247, -170, -14, 219, 322, 5, -352, -286, 109, 269, 151, 0, -149, -273, -126, 273, 364, -29, -307, -173, 39, 117, 219, 188, -155, -373, -82, 315, 257, -22, -96, -138, -167, 42, 351, 211, -228, -295, -4, 150, 104, 128, 28, -251, -263, 136, 314, 57, -154, -122, -99, -85, 130, 272, -39, -333, -151, 131, 120, 40, 42, -100, -234, -65, 249, 196, -88, -181, -50, 5, 47, 165, 121, -141, -228, 20, 212, 130, -34, -56, -71, -90, 55, 207, 119, -138, -170, 41, 132, 45, 29, 29, -98]
2145i8p8K25J73j66k35J01J32o8jJ48n4k69M3K86Jk39M3J34j42r7K69R4l01j03
2169b02K68M5k32P0K26j65k15K10J84k19j39K46P1k66J8K53q5k37J52K15j92j67
2191a61J93J09j87m6J99n2k10J03K07q5j81P2J04q6l2J22qj52k4J51L7o3m0J4
2215a6k7PO8L4l9j25k7J34J09q1q8K1oo1J28J66j56k30P4K18l7o7J03n5k95Q9
2241a59L92ll19l1J40j05k0L28O5m68j58L68J76j96M4R0l05j89M23L25l18l12
2263b32J43O4j12K34K46l13m25K02L47j4r4M8j81k50K31M31o0l63p9N9K3J80K18
2286C03j73l84k3K71J78M2r0k37j85J70L25Q0j60k30j56Q9L27K00k30k82n8O1
2308a62J84K91k3m27k61K54L02M2j8j14l75j06M92L69k77l37j5jK5L94K48m76
$$ y = [-98, -176, 49, 222, 56, -179, -78, 54, -14, -15, 133, 79, -190, -147, 139, 140, -99, -56, 78, -64, -161, 108, 202, -99, -202, 66, 111, -121, -51, 175, 10, -205, 5, 189, -30, -169, 77, 148, -118, -100, 153, 68, -169, -17, 198, 6, -161, 32, 141, -46, -92, 107, 55, -155, -52, 155, 70, -111, -39, 65, -21, -53, 69, 61, -91, -115, 36, 73, 10, -30, -16, -43, -36, 32, 66, 27, -98, -125, 9, 118, 37, -51, -30, -36, -97, 31, 197, 41, -189, -115, 103, 66, -1, 102, 47, -248, -159, 233, 230, -89, -120, 20, -85, -105, 223, 288, -180, -338, 30, 206, 10, 54, 144, -161, -350, 73, 398, 80, -232, -89, -25, -137, 97, 343, 30, -395, -193, 154, 140, 46, 94, -87, -337, -106, 325, 265, -98, -177, -118, -95, 85, 303, 130, -254, -277, -6, 172, 214, 124, -113, -298, -128, 197, 277, 117, -113, -269, -180, 147, 347, 117, -165, -223, -162, 22, 313, 290, -137, -398, -144, 158, 200, 182, 68, -307, -413, 79, 448, 171, -166, -181, -182, -157, 237, 485, 9]
2330Im97K18L99N7nJ2l67l52L89N99j03m42j24K0l6L23M25k76o31k3M09K00K1
2353B25K5k96m21J70O08J32l55k31j15k5L09M34j19n55k08K41K79J71N8l04m64
2374d41P2M88K59j44k38k80j43L61M88l4m64k50M1J62L54K45l39n54JM25K41L2
2396B82q6l66l56L07O24N8m31k47n8J0L53M50k31o54j23L93K62P9L1l17m89J29
2418c80O49K16l29k97j13q4K75N42m4o14k90K59K85J63J31k63n50n3N75L49j80
2439B47k53k11j90K15N76J17m91l76P5K09K40K62j61n66j84M20L91rj48k73l03
2460d13J24N68K16l65l53p0Q1K80L71r4n60k42L10L16J04kk44m41J4N68K91k74
2482A85l12j12m8J93M61O2n12l55J80L06J50J13j79m69j25M58L78j22k39j82j64
$$ y = [9, -488, -270, 129, 186, 181, 193, -174, -526, -137, 462, 359, -83, -207, -187, -223, 100, 525, 249, -382, -405, 4, 204, 225, 250, -46, -467, -297, 311, 443, 88, -143, -258, -283, 26, 460, 341, -214, -422, -181, 98, 269, 327, 23, -441, -369, 119, 378, 234, -4, -284, -427, -66, 422, 388, -76, -326, -285, -123, 231, 476, 137, -417, -416, 9, 250, 282, 196, -170, -526, -219, 405, 463, 32, -215, -273, -263, 90, 540, 309, -345, -468, -75, 187, 266, 297, -20, -509, -380, 269, 485, 156, -141, -254, -338, -63, 479, 435, -179, -469, -210, 75, 238, 369, 106, -444, -497, 78, 427, 247, -6, -217, -407, -192, 384, 501, 10, -366, -291, -82, 158, 420, 259, -307, -491, -71, 320, 311, 163, -110, -413, -289, 279, 495, 130, -223, -293, -212, 68, 439, 345, -215, -457, -147, 169, 273, 271, 27, -414, -400, 168, 459, 185, -127, -239, -287, -94, 367, 429, -83, -438, -258, 48, 198, 311, 132, -337, -462, -4, 374, 252, 13, -169, -333]
2503c33J21M74J96m13l66O7J86J79K23m7m77k54L46L83k1j33j62k58rM45L11k85
2525A73l74j9R3J33K74L8l93l17J97L35P3l0j46k93o5L49L05j42k69j13l6J24
2547a03L22J01l42k88J06K18R9R7q2l16j57L02L05p0j94p9j10J4L02J96k36l15
2569b30M5J62Q0J17L2k81k17J88K80J4j26q3j18n1K49K27j46k59k0P6N6J37Q8
2592B20k20k43J08K36K4o5k2j15j29J55K47n7k26k9N3OR6J16j08k15K0J58O9q
2616G1l8q6q7Q8J50Pq4o3l2J7J14O8r9r4L3K8J6O5K6j19q5J14R1q2k8L8m7o5R3
2645A0J06j07j01R5O0q7RQ5m9j23Q1J10r6p3Q9L0q7J6R3n1j13N7J21p0p6O2L8
2672B9q9K8R0k9j31M0J32j9o7K6Lp2L0J14J9j36n1P6O2oOoq2n6R9J24k5j21p5
$$ y = [-333, -212, 262, 458, 45, -321, -254, -68, 111, 334, 287, -190, -444, -98, 285, 264, 131, -31, -289, -298, 147, 458, 173, -201, -220, -127, 6, 280, 318, -75, -392, -195, 140, 213, 183, 37, -256, -321, 28, 333, 191, -78, -191, -227, -103, 219, 320, -22, -310, -204, 14, 113, 210, 128, -188, -345, -43, 262, 192, -2, -81, -191, -177, 125, 321, 85, -230, -185, -23, 57, 174, 206, -75, -292, -104, 176, 190, 64, -19, -137, -188, 61, 288, 142, -117, -137, -61, -5, 132, 220, 0, -243, -135, 101, 125, 60, 38, -77, -206, -51, 196, 139, -87, -116, -63, -57, 39, 155, 47, -168, -148, 10, 79, 71, 33, -53, -140, -52, 98, 105, 21, -42, -74, -57, 57, 125, 26, -68, -35, -7, 9, 74, 100, -19, -104, 10, 101, 19, -9, 29, -18, -83, 10, 116, 9, -92, 3, 63, -24, -15, 70, 21, -102, -21, 89, -7, -80, 9, 39, -48, -32, 61, 10, -103, -46, 75, 5, -71, -9, 29, -60, -32, 58, 29, -102, -62, 70, 51, -16, 10, 13, -59, -29, 85, 104, -32, -83, -7, 55, 49, 55, 49, -33, -89, 10, 134, 109, -12, -87]
2701h7N6L7M7P4n9j70n4J58J43m0j24l3m8jJ57J39j25k29j3J69P8Nlq7k00O3K60
2728A13R9j78j48nK4Q6J54M8k51j82J23K29M2p6p3j29o0J93K40n1k72j19J02J32
2752D1R6N9j15k71o5K98K24r8k07q4l5P4K44J45k42l36K3K68J51k2m4k05k22J26
2776a97M02J26l08k44J6R7J43K28j6l82k57K34L56L5j43j17j89o9L06L63j31m03
2798a50j38J65J55J52Q4k05l75%M01K57j44k47j34m6J44L13J39l26l46M0L02J96
2820B37pj43k62j44J99L83R3l22l13RJ97K20J38j02l64k51K57M34O2k58k32j06
2842b75M6K93L50j39n04j90K82K95P8kj99l79m8M94L61k32l54j14L6J17L49J91
2864D56m16m59J07M24J56n3r0k81k51K67M93M7m15k62O7J22K06K31j34m79j66
$$ y = [-87, -31, 6, 53, 127, 68, -102, -156, 2, 145, 105, -19, -52, -100, -101, 56, 195, 70, -159, -172, -3, 75, 80, 77, -10, -210, -147, 113, 212, 34, -114, -119, -95, -9, 145, 193, -58, -240, -117, 112, 154, 78, 5, -124, -184, 9, 249, 198, -74, -193, -91, 41, 137, 196, 81, -190, -255, 43, 267, 169, -38, -122, -157, -83, 161, 306, 64, -272, -249, 19, 170, 148, 104, -101, -323, -197, 205, 331, 23, -221, -205, -108, 35, 263, 247, -135, -392, -158, 198, 233, 90, -27, -216, -285, 21, 384, 253, -150, -288, -123, 32, 184, 268, 63, -312, -312, 89, 346, 202, -45, -179, -225, -81, 232, 371, 45, -301, -261, 41, 237, 230, 87, -175, -319, -120, 263, 356, 34, -279, -270, -73, 147, 285, 183, -181, -432, -175, 259, 321, 63, -169, -275, -229, 64, 414, 275, -229, -419, -137, 158, 236, 234, 35, -344, -392, 102, 463, 231, -123, -237, -201, -84, 265, 456, 40, -419, -312, 112, 268, 215, 125, -156, -407, -140, 353, 400, -15, -277, -210, -88, 118, 349, 215, -264, -430]
2885d30L59L47j3j76k16j76Q4L75K48k24m18j10K23K76J41q0l26k57Q9M16K62
2906C94j68l84j67J19K59K45K0l30l66L7M31K89j34k68k09o9J95M24J07l93l99
2927c67J07K77J59J09q9l75k59L18M61ql28j61o1L0K71L25k00m89q9L20K07K2
2949A80Lk13l23O7M78J88k78k69l9N2J51K76K5l94k85J93L27R5p2j67k29n7K99
2972HL41p7l34k10P7K05K18O1k07l24n5K59L06Kk29k47k7J55K34J47j48l23j50
2995c18K38K83L4j57j62j52K4K99K25j68l41m7J50J39J06M2k10k93R7L40J10j65
3017G4j34p0m2J16K96Ll33j62J49J63M1M4p8k59m6K61K21j04j83o6k5N5K08J09
3041B38j94k35K1J89R3J7m6j69j33J41K17N2j55j38l2N6J34J06o5j76q1O6J56
$$ y = [-430, -71, 276, 263, 87, -129, -305, -221, 154, 402, 178, -240, -350, -127, 149, 290, 210, -116, -373, -284, 132, 394, 226, -158, -325, -206, 53, 298, 318, -12, -378, -341, 90, 379, 245, -23, -232, -301, -106, 318, 425, 32, -367, -260, 17, 176, 285, 196, -179, -438, -120, 341, 333, 5, -156, -217, -187, 84, 409, 209, -280, -369, -49, 158, 180, 183, -30, -353, -286, 192, 380, 102, -167, -206, -154, -3, 273, 298, -96, -381, -188, 139, 234, 162, -5, -234, -291, 8, 349, 272, -62, -272, -195, 10, 228, 289, 82, -242, -297, -38, 268, 270, 41, -206, -233, -78, 156, 303, 155, -168, -318, -80, 203, 237, 80, -82, -234, -210, 89, 314, 146, -195, -242, -92, 47, 153, 195, -15, -308, -211, 129, 239, 74, -60, -130, -172, -56, 240, 243, -90, -252, -103, 60, 101, 145, 67, -192, -238, 23, 244, 140, -43, -109, -134, -79, 129, 238, 44, -191, -170, 19, 112, 129, 83, -86, -219, -78, 139, 191, 36, -102, -134, -78, 56, 162, 97, -79, -160, -94, 62]
3064F2Q7o9j37p7L6J20Q7j4j18j21M8J39N1m5o0o6k1P5J23Mj57n4O4O6J9M0m0
3091D2j32j9J37P9q3m6Qk8j3J03O1j17r7O9N9k1J5K9o9p0Q2P9l0p6K7ok7M3O1
3120F0m0o7J7N5pk9Mkk1J5N1l0k1j6M4j1oJ0j0q%L9k2j3j2j7L4L8ql9l3K1M0K7
3154D3rm8n6K2P2L7k6n2k9lM4P4j4o8n8J9O4M1Qn9q6j5R5Q5j4p3n3k3N9R3L0r3
3186Gj09NO6J05K8m9j28n3R5J27K3r2r0m7N5J21P4p1j51o1P9J32N7n4j32r3O5
3213i1J42J08o9j51r6N5J39J11m5j51j11K9J54J24k8j51j46K4J69J40j0j47j42
3236a43j0J55J50K3j59j70k8J62J66K4j40j68m6J33J81O5j24k06q1J49J95Q1j17
3259I2k05r4R3K20J11r7k43j09J14J97J20n3k27j48N6K46J66q1k24j44M1J89J95
$$ y = [62, 149, 80, -57, -134, -98, 22, 109, 95, -23, -144, -96, 43, 94, 49, -11, -77, -98, -23, 100, 104, -53, -107, -43, 23, 42, 82, 42, -90, -109, 28, 107, 24, -22, -14, -42, -55, 48, 109, -8, -105, -36, 23, 2, 17, 46, -23, -93, -11, 68, 38, -38, -11, -17, -44, -1, 60, 20, -47, -30, 25, 18, -11, -7, -9, -30, -15, 36, 6, -15, -31, 13, 2, -4, 6, -4, -12, -12, 27, 5, -8, -20, -37, -3, 35, 27, -12, -45, -24, 16, 43, 34, -14, -70, -48, 24, 61, 35, -17, -46, -49, -5, 69, 55, -13, -71, -52, 12, 53, 61, 2, -84, -99, -4, 81, 67, -6, -59, -82, -23, 70, 100, 7, -102, -97, -31, 74, 102, 53, -75, -128, -33, 94, 117, 25, -65, -112, -57, 64, 138, 67, -84, -145, -66, 66, 123, 69, -63, -156, -91, 51, 159, 90, -61, -157, -102, 37, 148, 103, -48, -159, -130, 24, 148, 120, -31, -177, -153, 16, 156, 146, -1, -143, -153, 2, 152, 175, 16, -154, -182, -20, 146, 170, 30, -138, -184, -51, 130, 195, 71, -135, -216, -67, 128, 209, 92, -113, -207, -114, 106, 217, 120, -123, -232, -118, 79, 199, 146, -81, -229, -173, 73, 239, 158, -66, -210, -169, 20, 215]
3282B15k4k25k15N4K32J66k2j77j99l9K09K48nk26j74j1J63J98O7j59k74m9K07
3305d0K16M9j45k23q6J17K72J23j92k49p5J27K08J49r4k74j75J45K73J31j10k34
3327h7j61O7K45J90o6k66j95Q8K39J82m5k26k07kK50K43j7k49k22J0K14K25L8
3350B48j96k62n3K31K58L3k01k31p0J47K72J23j90k99p3J84K25R0j07k37j64J18
3372a54L00J39j72k44q6P3J98K01m5l04j92J32K50J18p1j73j88j0K47K55q0k77
3394h3j47N9J69J82M5j98k78k1K90K18m7j78j84o8J68K66Q2k24k58j4J89J82P2
3417B22j09k42j22J46K66J17j74k22p8P4K05J58q4k39j68J18K50Q5q7j48j46o
3439a84K02K11n5k51j29P8J59Q8L4j27k29k6K54J97r2j80q0k4Q9K07P9j93k39
$$ y = [215, 191, -34, -249, -195, 37, 203, 181, 4, -195, -234, -25, 223, 218, -8, -182, -193, -30, 168, 235, 76, -198, -247, -40, 176, 225, 80, -143, -229, -112, 160, 283, 91, -158, -233, -106, 102, 251, 157, -117, -292, -147, 126, 257, 147, -87, -248, -181, 64, 254, 188, -78, -273, -185, 54, 236, 191, -35, -242, -244, 6, 249, 232, -17, -239, -229, -15, 210, 248, 52, -210, -263, -32, 226, 259, 58, -173, -243, -96, 176, 299, 109, -190, -263, -79, 146, 236, 129, -108, -272, -154, 146, 285, 113, -131, -217, -144, 54, 255, 210, -94, -286, -154, 96, 214, 143, -30, -218, -228, 19, 274, 194, -83, -230, -171, -2, 180, 225, 27, -251, -272, 18, 236, 189, 11, -173, -241, -73, 193, 275, 51, -207, -221, -32, 150, 222, 113, -129, -251, -105, 161, 278, 104, -118, -196, -122, 83, 241, 157, -82, -250, -132, 118, 203, 116, -32, -178, -184, 18, 229, 174, -77, -206, -128, 31, 119, 153, 26, -203, -229, 25, 222, 130, -50, -130, -154, -65, 142, 221, 28, -211]
3462b11M3J98R3Mn8j64j31J48K77K6k21j41J5O4J26J38m8k78j25J84K01K2q8j01
3486b7j12j0J96J85r6k42m2Q2Q9Q4M5j27k09MK23J23q1j26n8k0M8J60O7j41j75
3511a60M1J45N1k3k3q0q8P2J81K4j55r4N6N1K3O2lj48q0J40J19k8r5k5j4k0J10
3538C9J09q6j61j8J30M2Jol7j18%J76P6j13j08K5J7%R2N1j19j28O7J33k0m6K9
3565B7l9q3K7J46Oj33j8Q5k0k6N9M8j11m9J00N0p4l4O9jp4L5O7l9q0M1Q3l3q0
3594e1M7M6n3MO8j2r5oP2L0o2J2K5n0l2P0O4o4p4M1M7k7j6N9m5p0L0P3J0p2j2
3625d3M4j4j8M2J3o7j9Q8K9o1k9L7Nm5O4N6q0j05O3J03qo0J7j1q0N3J39nj43m9
3655h4O6L5J1N6oj48o5J37J18n1q6rl0k1J02J14q5j55lJ00M0L2Mq4j03K6J41O2
$$ y = [-211, -168, 30, 123, 127, 69, -95, -226, -78, 199, 225, 4, -137, -122, -58, 68, 206, 158, -120, -245, -61, 140, 162, 74, -27, -139, -149, 47, 232, 136, -106, -148, -66, 23, 107, 152, 25, -184, -180, 43, 166, 85, -41, -99, -119, -71, 89, 156, 15, -160, -119, 26, 77, 54, 31, -49, -137, -65, 116, 140, -15, -109, -53, -2, 21, 83, 80, -68, -148, -8, 111, 83, -12, -37, -51, -71, 39, 148, 62, -99, -117, 13, 55, 56, 50, 13, -105, -105, 71, 147, 34, -74, -49, -32, -32, 60, 111, -8, -136, -69, 64, 44, -2, 27, -12, -95, -68, 78, 84, -49, -67, 18, -2, -28, 31, 79, -32, -81, 19, 69, -5, -39, 30, 29, -45, -10, 57, 18, -62, -21, 62, 29, -51, -4, 42, -11, -7, 61, 49, -46, -52, 20, 50, -12, 0, 25, -25, -57, 13, 77, 13, -61, -20, 27, 0, -16, 43, -2, -72, -42, 31, 41, -31, -43, 1, -13, -31, 11, 24, -43, -62, 26, 55, -6, -35, 2, 7, -38, 26, 82, 2, -103, -40, 63, 55, -5, 12, 1, -79, -26, 113, 108, -35, -84, -18, 17, 28, 84, 78, -70, -135, 2, 120, 69, -17, -26, -56, -77, 25, 139, 54, -101, -104, -4, 36, 68, 72, -12, -115, -89, 52, 114]
3683A14q9p5k4J5N4R4oj04j03M8J05O0l4n8p6j7J09R8oj32q5L0J08O2Kp4j01l3
3711a18J28J32k3j27r1K8M6J09N9r3j62m1J46J11ko7r0q8M8J81Q9j36j50k8Q3
3736e6Q1R0Jj66j47Q7J99M5q3q9q4j7J46J58l3j93q9N3J08J02J9j27j61J5J73
3761C2J16l1j13j03k1R9J50L6j53j34j2J16J29L4r4j52m7J00J64L4q6j54q2J18
3785e4J60N4q9j47q4O8J78R1j01j66o9O9J32J14m3j79j35O8J95Q7m9j27j14j8
3809a59J54J81l7j78j12M1J07J26M6j33j86jJ74J19j7q8j20q0J08K02M1j53j42
3832a07k4Q2J32Q1o7k03o7J25J62M5q4j38j06P0J78R3q9j55p5N1J43J17m5j70
3856e1j17N9J45J10k4j43j49L8J60J14k2j33j10k9J38J52J4j54j31J0J09J21M5
$$ y = [114, 25, -50, -74, -59, -5, 89, 83, -21, -124, -76, 29, 89, 55, -3, -79, -96, 13, 111, 105, -27, -112, -82, 26, 88, 90, 16, -85, -118, 10, 142, 119, -8, -99, -71, -25, 84, 143, 50, -112, -153, -7, 104, 102, 35, -55, -143, -95, 86, 175, 39, -111, -139, -56, 25, 115, 116, -50, -197, -110, 89, 134, 51, -38, -122, -139, 7, 165, 132, -61, -150, -97, 11, 113, 132, 5, -156, -141, 32, 148, 117, 4, -99, -120, -21, 129, 165, 12, -122, -134, -18, 111, 145, 51, -101, -148, -48, 116, 150, 64, -90, -172, -54, 106, 160, 71, -76, -160, -92, 86, 177, 76, -90, -159, -90, 42, 156, 113, -66, -201, -133, 62, 149, 100, -27, -141, -159, -5, 176, 139, -39, -151, -110, -3, 123, 169, 36, -150, -151, 23, 142, 125, 37, -83, -163, -55, 147, 188, 35, -107, -131, -49, 83, 164, 97, -106, -173, -48, 114, 159, 75, -63, -169, -99, 79, 172, 83, -72, -147, -96, 47, 164, 119, -51, -168, -109, 36, 146, 122, -21, -170, -132, 28, 142, 120, -13, -123, -152, -14, 138, 152, -2, -133, -123, -14, 107, 152]
3879A52j04j64l4J39J26J6p8j40n1Q6J68O0j30j42l3O0J27Q3l6j78p4Q0J38M3
3903A14m1j08j05L5J48J07p7j33m1OR9J22j7j39j12L9J27P8j0q4j10k4J15J29
3927A18j8r4r7k1P8J25L8r9j24pP9R8L7o9j15m0P1J31J8o5q6n7M8J23O0q2j11
3954f1j8K8Q5O8k9j08n6M3Q2M8j9q1p3LJ09Q2m5q8m0J2M8R2J0r1r8K4R2L7Lm2
3984A7q0k6Q6P5lp3l2k5M0P8L0n2r5JN8L6J1pp1l7L0P9K8n7m0j4K1M4L7k4n7k9
4016e1K5L1L4qo0j0J4L8K1j3l1m1ON4K6j2k4k5kJ9L2J5n2l5L5J4J9%%n3j9O3L8
4049D8l0l1MmJK5J8k6k0mM5j6j7J7j3k5PN3k1k7oL1k1JJ6J0m3J4K8Nk9j0J6%k
4084fJ4Lk2j6K5L6k4j9LoNK2K0k5l5rL2K7j5j5j1l%L3K3l7m6J0L8PQqj9l5RO7
$$ y = [152, 48, -116, -150, -11, 115, 131, 53, -87, -138, -52, 116, 176, 46, -96, -129, -69, 58, 141, 105, -73, -147, -67, 71, 114, 73, -35, -140, -105, 43, 150, 73, -60, -101, -95, 4, 126, 109, -30, -142, -103, 24, 102, 92, 8, -102, -126, -11, 118, 100, 6, -91, -112, -34, 91, 129, 30, -94, -101, -22, 76, 113, 44, -71, -111, -40, 91, 109, 44, -42, -99, -51, 72, 132, 50, -61, -79, -51, 34, 102, 73, -35, -91, -48, 34, 82, 63, -18, -91, -88, 21, 103, 58, -30, -70, -58, -10, 82, 92, 1, -97, -73, 19, 56, 59, 17, -63, -89, -3, 72, 69, -4, -36, -61, -21, 57, 87, 35, -60, -59, -1, 35, 46, 39, -32, -69, -39, 40, 68, 11, -29, -43, -22, 22, 59, 35, -22, -51, -26, 5, 39, 31, -29, -39, -25, 13, 34, 21, -10, -51, -45, 9, 35, 23, -1, -26, -28, -9, 23, 38, -14, -49, -14, 0, 19, 19, 19, -34, -53, 10, 48, 18, -13, -9, -13, -12, 13, 31, 5, -15, -19, 26, 10, -7, 10, -3, -28, -21, 32, 11, -16, -22, 9, -12, -11, 5, 15, -28, -14, 14, 19, -10, -20, -4, -4, -6, 8, 11, -11, -27, -2, 34, 10, -9, -6, -12, -7, 15, 35, 10, -25, -34, -2, 25, 10, -5, -16, -19, -19, 14, 37, 0, -46, -36, 2, 9, 17, 9, -10, -45, -36, 31]
4120C1Rm3k6RMJ9K6Ln9l0N3L9ml0nl3%N7L8l9p5J3L9J7PJ9m1o0NR7K1m6l5j1l
4155c4K3O7%q0o0M6M7L3ol1o0k4O2P0J2q6k6PK8L8L7l2q9k4O2O6%m2m0njP2M2
4188G2l8r7pP7K6J0rm4o2J7Q8M2n9n8pJ4M9M7%j08n3N1R2K0l5l6n4lO6R0j7j03
4220b9o1L1O9M8pl2j07j7R5R0k4n3n2k0J0J04N2p2r5k2Q1M6J6ro0r2M0J20O1p5
4250C6q3k3L6L9O4Pj01p8M9R2J8j8l8n2j5N8R0kj12n6M9O2K5K0n5q6j8J02P4k4
4280F0p1m9j6N4Q0M6q0r8j3P4O4K6m7o9m1J5J21L6o2r0k2L2P5N3j7r2p2M4R6M4
4310H1l6n1n1j6P3R3or9o8K9N7M8J2m7q1l0R0Q6j2q4m5J4K2O1L2m3j01j1Q6M8
4340E1rm0m3m3L3R2L7o1p7j2L7M8M8j6q2n1M7P8K4l1n9m4J7O4N8j0q5l5K4N7L2
$$ y = [31, 40, -3, -29, -20, -16, 3, 29, 32, -27, -57, -4, 35, 31, 1, -4, -37, -37, 20, 58, 19, -56, -43, -4, 13, 20, 39, -2, -62, -57, 40, 61, 15, -20, -31, -34, -11, 56, 56, -24, -84, -38, 9, 42, 36, 5, -55, -79, -17, 53, 65, -21, -47, -40, -12, 26, 63, 31, -58, -82, -20, 46, 46, 4, -36, -41, -42, 30, 72, 34, -63, -70, 7, 33, 43, 34, -10, -72, -55, 33, 75, 16, -42, -49, -35, 14, 61, 61, -47, -100, -49, 43, 63, 28, -8, -62, -65, 1, 91, 74, -29, -90, -59, 10, 58, 51, 19, -88, -105, -10, 80, 56, 3, -49, -69, -59, 45, 97, 25, -70, -92, -11, 35, 51, 42, -18, -110, -70, 50, 111, 36, -47, -70, -34, 5, 69, 76, -25, -103, -54, 38, 56, 38, 0, -52, -67, -9, 81, 79, -33, -89, -40, 22, 47, 67, 12, -74, -92, 10, 84, 60, -11, -60, -76, -22, 58, 104, 24, -74, -87, -13, 51, 77, 30, -39, -80, -65, 56, 92, 30, -60, -82, -50, 25, 78, 61, -31, -103, -59, 37, 81, 45, -6, -57, -73, 0, 93, 87, -12, -80, -51, 6, 54, 66, 19, -62, -92, -2, 84, 72, -12, -57, -43, -21, 40, 72, 29, -72, -83, 3, 51, 42, 2, -41, -84, -51, 41, 78, 17, -60, -72, -35, 13, 61, 45, -37, -88, -41, 37, 61, 30, -29, -73, -56, 8, 66, 56, -29, -64, -40, 17, 49]
4371D9Jm4p0lQ1O2k6n8m3kM5O2J5m9p3kM9M5Nl4m1k4K4P0K5l9p6oM6L5Pj5m3l7
4405f4K7O9J4m3k4l1QL8N5j5o4j9K8L3K2ol9k7rM8N1k6l8k4J7K4K9Ll0n0NN2K3
4438C7ok7k2k9L1N4Pn0k5KK7L1oKm6j1K4L1J3k6l2j3MK5K5k3k6j5J7L4Onk1j4
4472b7lK5K0Ml1j8J7QJ3Lj2k2ML3J4j5k2KnJ8K2j3rk5J5PJ4j0jk4nJ1K9Qk2j2
4508ijNJ3Ljpj7RPQj1kJj2K7j0rpKmmK0j0lLLJ0lqkRpLlPj5J9jJKj8PRPj2J1j1
4555alqJ7J6j2jj8MjK6j3j2j1ORJ1j2Lnj2J2J6ok6J1oJ7Mk1noPMK8j1pj3KJ6J4
4595A3kj9mklL2Jk2j2JJ9OPj6j3OJ4J4Kj2rj7K2L4rj1k4p%J8K0k0l6oJ8K5Pnk8
4634a8j1QK9Oj2k7kMK2J3kk0k1K1J8Qkj5j9nK9J9Ql9pNJ7J8j0j0j7lL2OJk1j7
$$ y = [49, 50, 6, -64, -67, 14, 76, 50, -8, -51, -53, -8, 54, 69, 20, -53, -55, -6, 39, 44, 10, -31, -55, -31, 39, 64, 25, -51, -57, -11, 24, 31, 16, -27, -64, -37, 32, 46, 3, -21, -52, -44, -6, 49, 34, -30, -49, -21, 12, 34, 28, -11, -38, -47, 1, 52, 26, -12, -36, -19, 5, 34, 37, 7, -43, -38, 14, 37, 31, 4, -18, -47, -16, 38, 45, -5, -30, -28, -1, 30, 24, 26, -20, -31, -7, 24, 37, 11, -21, -34, -30, -5, 20, -3, -29, -44, -27, 7, 13, 8, -13, -27, -30, -5, 15, 19, -12, -30, -13, -5, 8, 11, -1, -23, -19, 14, 28, 13, -9, -7, -12, 6, 28, 15, 6, -19, -4, 3, 17, 7, 6, -18, -23, -12, 17, 25, 3, -9, -10, -5, 8, 11, 10, 3, -14, -5, 2, 10, -1, -3, -2, -14, 13, 3, -6, -13, -11, -15, -19, 1, -9, -12, -9, -6, 4, 1, -7, -9, 0, -7, -4, -7, 0, -15, 4, 3, 4, 6, -12, -5, 4, 11, -1, 10, -1, -4, -12, 5, 21, 9, 8, -10, -6, -7, 19, 6, -6, -17, -11, -2, 9, -3, 0, -5, -17, -5, 11, 5, -21, -10, -16, 1, 5, -16, -21, -27, -20, -16, 12, 1, -6, -19, -17, -1, 13, 11, -8, -12, -14, -17, 15, 16, -6, -18, -17, 2, 8, 15, -1, -14, -8, 6, 20, 22, 10, 1, -16, 6, 40, 31, 20, -4, -11, -11, 7, 27, 7, -29, -35, -17, 8, 15, 10, -18, -29, -21, 8, 14, 2, -25, -27, -23, -1, 12, 10, -10, -31, -10, 8, 16, 14, -1, -20, -25, 4, 23, 31, -8, -15, -10, 7, 25, 15, 5, -12, -15, 17, 23, 24, 3, -14]
4671a4j3K6L4J0k5l2jJ0K7Qrl1k2J7L6J5j8k6k1J3L5Ool3k1J7J8K6j5k3k3J0K6
4704AK4k1k4j2OL2J5nj7k8j1L5K4Oj9k6qJ4L6Jk0k0j5K6K2J5j2l0mPL0J5k0l2
4738a5kJK2K6Lm6j6J0K9J4Jl7nj3L1J3Lk8k1NL0J9kl0k0NJ0L1Rm2pj0K8J5jQm1
4775b3J2RK5J3l0j4j2J3K1J8pk7j7RK9MKj6k7nL2K5j8k0j1qK6J3Nk3k3J5J3J1
4809A4Kj4j5rJ7K3Jj5k3lJ1K7Pj5l5oK0K6J2j5j8rJK6Pkk0qK0lJ8Jk3k6JM0K6
4846D1l5mmpK2J2Pl4j4MK7KPj6j7j0J0J3J7k3k1J8mPJ8j1j9j1K1K5oj1j2j8OK8
4882H%Kj9KJ2kJ4oj2k3K0J5Jjj7j9K0oK1J2l1lRJ2%Lj1j1pK0K4j8j0k1K3J0pQ
4920A2rj6pJ9LNrj2%NMRok0NNNOLj9klJ7J5lk1J1j0LL0lj5j8J0PK%Oj0jJ0jmq
$$ y = [-14, -27, -1, 33, 43, 18, -14, -15, -5, 22, 30, 21, -10, -32, -15, 21, 36, 18, -8, -29, -16, 19, 25, 19, -14, -35, -18, 0, 26, 11, -12, -35, -25, 1, 25, 4, -20, -32, -26, 6, 21, 16, -1, -29, -40, -5, 19, 25, 6, -20, -28, -14, 22, 23, 3, -17, -32, -6, 16, 31, 19, -11, -15, -8, 22, 37, 17, -15, -17, -16, 6, 32, 35, -11, -27, -17, 12, 26, 27, -10, -15, -28, 3, 16, 19, -9, -30, -25, 5, 24, 22, -8, -28, -23, -13, 18, 27, -15, -22, -32, -4, 11, 10, 18, -23, -11, -2, 23, 36, 6, -8, -20, -7, 14, 32, 25, -2, -19, -10, 19, 23, 25, 9, -18, -23, 9, 34, 16, -4, -15, -23, 3, 16, 21, -2, -25, -10, 3, 14, 16, 2, -13, -22, -5, 18, 19, 4, -19, -22, -11, 16, 23, 8, -27, -33, -13, 13, 25, 10, -8, -17, -16, 10, 17, 15, -5, -13, 7, 4, 22, 23, 0, -26, -25, 15, 41, 6, 2, -2, -9, 13, 25, 32, -2, -16, -12, 15, 17, 24, 8, -9, -19, -9, 4, 21, -2, -23, -5, -9, -2, 16, 5, -14, -25, -4, 21, 15, 4, -8, -26, -20, 8, 8, 10, -9, -7, 5, 3, 17, 11, -1, -24, -4, 11, 12, 11, -6, -25, -5, -11, 10, 22, -9, -12, -3, 9, 9, 12, 1, -10, -17, 3, 27, 9, -1, -22, 1, 11, 4, 12, 3, -13, -20, -1, 2, 7, -2, -14, -14, -9, -5, 4, -2, -22, -17, -12, -7, -1, 2, -17, -19, -22, -5, 10, 7, -14, -3, -13, -10, 20, 17, 2, -16, -6, 1, 3, 3, 9, -1, -2, 8, 7, 3, -5]
4964ej5K1JKRj0j1MJ5J8k7mmQqJ2Pj6JqJ0J4k4J7j1nJ1NQj2j6ML%mRJj9J0J3q
5005dKmMMoJ4ppJ4j0Mj5KJ2%j5J2%Lj4J5koMJ0ok2L4ooj9OJ1JoRnlmLJ2noQj2
5050foJ7Pj1j1OJ2nkKKk7K2RlLj6rJ2KNqnKNJ0j0J1j1kJJ0Pj7nJ0jJ4kJ0qk7J5
5093BJ3Nj4j8lJ3qK7mj5j1MJ4JPlk7J1MK2Oj5j8%J1Rl%j2rJ1KlKlj0KJ7Lmj6m
5135a4mK9okKolJ6J0j0oj5MJ6KNj5j3J1J6Njrk7PMJ1J1k6rLJ3J5Jpk4LJ6K2Nk2
5176Hk5RpK7Npk5qJ2K2J3j9kj5j0K3J4j4nl0K6QPJ4j4l1J1J5K2j2nj4LLJ8Pj8
5213Fk3PJ4J6lRl3j1K3J2kj4q%mK7J3k3j9jKJ7J5j0j9j1lK4J5%j2j8J4mJ7Mj7
5250@k0%K1J1oomj8PL4j1nj7oJ7K3pj9lpJ5J9Mk0kmJK1Rj7qj1J4RkLj7%NJ3K3
$$ y = [-5, -20, 1, 2, 4, 13, 3, -8, -4, 11, 29, 2, -2, -6, 2, -6, 6, 13, -3, -2, -10, 0, 14, -10, 7, -4, -9, 2, 7, 15, 3, -13, -9, -6, -6, -10, -1, 0, -19, -9, 4, -4, -2, -6, -2, 2, -4, 10, 3, -4, 10, 0, 4, -11, -9, 3, 3, -12, 0, 0, 3, -11, 4, 2, -4, 0, 10, 4, -18, 16, 10, 4, -15, -9, 2, 3, -3, 6, 1, -2, -6, -3, 9, 4, -2, 6, -6, -12, 5, 12, 1, -10, -4, 8, 3, 1, 3, 5, -22, 0, 9, 6, 9, -7, -16, -4, -2, 3, -5, -10, -8, -3, 7, -3, 8, -3, -5, -4, 6, 13, -4, -9, 1, 0, 14, 12, 22, 14, -13, 2, 15, 20, 6, -12, -15, -2, -10, 17, 13, -2, -13, -9, 5, 6, 13, 10, -17, -6, -2, 20, 26, 11, -7, -7, 4, 13, 10, 10, -2, -11, 0, 2, -1, 1, -2, -12, -10, 7, 10, 6, -10, -14, -18, 11, 5, 3, 5, -1, -4, 12, 22, 12, 6, -9, -5, 11, 13, 18, 3, -10, 1, 17, 22, 21, 12, -15, -8, -4, 7, 18, -8, -17, -14, -1, 14, 15, 8, -16, -13, 3, 25, 30, 8, -17, -8, -15, 12, 17, 10, -15, -23, -11, 11, 24, 5, 3, -12, -22, 1, 15, 1, -4, -34, -8, 0, 7, 21, 7, -24, -13, 2, 24, 12, 7, -7, -4, -1, 17, 24, 6, -17, -10, 4, 20, 17, 26, -7, -18, 5, 17, 15, 1, -7, -7, -11, 16, 29, 6, -13, -14, -12, 5, 20, 10, -9, -20, -23, 1, 16, 16, 4, -14, 0, -4, 13, 17, 0, -20, -20, 1, 12, 6, 0, -4, -22, -15, 19, 8, 3, -14, -20, -3, 20, 13, -6, -9, -16, -1, 18, 22, 2, 0, -4, -3, 18, 27, 10, 2, -9, 5, 14, 12, 15, -2, -2, 3, 16, 39]
5291C9j6k9j3J5MQ%j7j7J2J1K0j0j5qoK3J3Jj7nj3K2QLqk2MK3J0jj7j0j1J8J0
5327IJ2j4rj3OJ9Rj8lk1K7LJ0rrj4J3J0J4J2k6k0MK3Nlj3lj4J8PKj8j6JJ7KQn
5366Ck1nK2J2pLk0LrK2Oj1%lNOOj3kLLRkkj4oPJ0K0j7j1pJ1pK9j5Mj8PK2j5Pk0
5409emOKJ5j0J3j4rRR%j2j3K1j6LOmjj0J3Moj2J0KpKJ4j0l%J2pPJj7MJ1LKj1O
5452Dmk%J2Rj3m%J2j2OMkqLLOjj0kJ2lj6PjLoQj4NqJ1%rQnLj3J6%pjLOrLLooJ3
5502bNj2oJ7j1%J8k%qOkkJ2jj2JK1mLk0kQkJJ6j7j4j0J9J1nomnj3K6Jjj7mRK3
5545A5pNk2j2J2K2jpj5lnJ6K1%k5mkK0J2j2j1j5PJ3J2Nj9nJ9J0k1J3j3k6J7J0
5581DJ1Pk0j0JKJ8Lj2j7NK1Qj3prj9K8J6oj8k1K0JQJ3Ql5pJ8K0Jrj4qOLK2Lk4
$$ y = [39, 23, -6, -19, -4, 0, 8, 8, -9, -26, -14, -3, 17, 7, -8, -16, -22, 1, 14, 15, -2, -7, -20, 2, 10, 13, 5, -17, -13, 10, 20, 19, 2, -8, -19, -1, 9, 21, 7, -2, -15, -9, 10, 19, 1, -2, -23, 4, 7, 17, 8, -1, -15, -2, 8, 22, 34, 8, -12, -8, 15, 20, 17, 4, 1, -13, 5, 12, 14, -4, -20, -19, -2, 0, 8, 3, -18, -23, -1, 11, 4, 7, -13, -10, -19, 3, 9, -2, -2, -5, 0, 6, 12, -1, -3, 0, 3, 12, 10, 8, -6, -12, -5, 5, 25, 8, -3, -10, 1, -6, 23, 8, 12, -6, 1, 23, 8, 15, -5, -9, -3, -1, 14, 4, 17, 3, -6, 3, 12, 12, 0, -13, 8, -8, -5, 1, -3, -4, -14, -1, 3, -3, -15, -5, -3, -10, -8, 6, -4, -7, -7, 5, -2, 5, 6, -11, -7, 4, 7, 9, -2, 4, 0, -2, -2, 10, 19, 6, 2, 2, 14, 2, 8, 12, 10, 2, 5, 8, 14, 13, 3, 1, 13, 10, -6, 1, 0, 3, -3, 5, -9, -4, -12, -1, -1, -10, -2, -7, -4, -17, -1, -1, -8, -9, -6, 0, -9, -6, -3, -9, -15, -2, 3, -9, -15, 2, -9, -9, 9, 7, 7, -1, 5, 3, 1, 13, 12, 0, 1, 22, 18, 21, 1, -1, 7, 5, 6, 22, 5, -9, -19, 0, 11, 6, 0, -4, -9, -22, 4, 5, 4, -13, -17, -8, 15, 8, 13, -9, -21, -9, 13, 12, 5, -10, -13, -18, -2, 19, 19, -6, -10, -12, 8, 20, 8, -3, -18, -11, 2, 14, 19, 0, -5, 14, 24, 3, 16, 3, -23, -6, 4, 15, 22, 2, -8, -7, -5, 13, 16, 4, -13, -8, 13, 21, 8, 1, -8, -27, 1, 17, 11, -7, -28, -8, -7, 1, 14, 22, -13, -20, -2, 18, 19, 10, -4, -12, -6, -3, 19, 22, -2]
5621bj7J6RJ0Qql2%K7J4j4kk1J4oJ5Qj2l3RJ8K1Kj5j5JkK3Pj4j0j4PJ2J9j5l2
5658b4j7L4K2Ok6rj2J3J7J7j2l0mK1J6LPk2j3j4L9K0rl5LpK2PJ1j3k2lK6J5kj1
5694A4k0nQK2J5l2j5j0J9J8Nml1JK3J2%lj3j8NJ0K3mm2LJ3QK%mk2KK8PMk4j6K0
5733alK2j8J1k9JK2Rlqlj1K2J6Nk5j4RQQPkk9nOK5Qj9k1QlK6MKl5qJ3J5Lmnk4
5775b0J1K0J1j8j6nPJ5JL%k6jRJ7rlnj3K0J6Mk6j5J2K4nJ1j8rnJ1K5kj9pj4L2
5813A3qK1lk3oJ3J5oj1pnlK4%kk2LjJ1J3kk7lKOJ9pj9Qj9PL3j2j3pQNJ1mmj0j
5855a3PJ6Kj7qRONJ2qk0MOMJ3j3kJmJ0kjj5mK0lJ6k4Pj2J0J8pj6oPKMkkOj1pJ1
5899aPj%qNnMKpLLPj6J4Kj2jNMj%pJ4j1nJ8j4QMj4QLmMOlmOk1QOJoL%KjNJlql
$$ y = [-2, -19, -3, 6, 16, 24, 16, -16, -16, 11, 25, 11, 9, -12, 2, -4, 11, 19, 7, -26, -17, 1, 22, 24, 9, -6, -5, -7, 16, 23, 9, -1, -15, -8, 4, 23, 8, -24, -41, -7, 15, 21, -5, -14, -26, -13, 4, 21, 9, -21, -25, -4, 12, 15, 22, 0, -13, -27, 12, 32, 23, -12, -9, -16, 6, 13, 24, 11, -11, -14, 12, 27, 25, 14, -6, -11, -3, 19, 34, 2, -13, -23, -4, 14, 19, 15, -16, -15, 8, 20, 20, 17, 4, -14, -9, 1, 24, 20, -22, -19, -6, 2, 4, 4, 0, -22, -20, 8, 15, 19, -5, -21, -1, -4, 18, 0, 11, -18, -17, 5, 14, 11, 3, 0, -11, 11, 27, 32, 7, -7, 2, 10, 18, 25, 23, -6, -11, -5, 20, 28, 9, -12, -4, -7, 19, 23, 25, -10, -18, -5, 10, 13, 9, 4, -20, -9, 11, 22, 4, -12, -17, -10, 5, 6, 9, 9, -17, -18, -9, 8, -1, -4, -9, -22, -2, 14, 18, -8, -23, -11, 13, 8, 19, 1, -8, -13, -2, 23, 21, 2, -5, -19, 13, 5, 26, 23, 0, -6, 7, 22, 16, 5, -2, -7, -10, 14, 14, 12, -10, -7, -8, 3, 16, 14, -13, -16, -14, -8, 11, 4, -15, -7, -26, -19, 14, 2, -11, -18, -10, -5, 6, 2, -2, -12, -13, -6, 10, 12, -5, -13, -4, 2, 7, 19, 11, -9, -5, 1, 5, 18, 5, 3, 4, 0, 10, 8, 7, -8, -12, 8, 5, 21, -3, 4, -8, 2, 20, 13, -3, -9, -2, 0, 4, 2, 0, 6, -5, -12, -1, 6, 5, 5, -3, 2, -3, 1, 3, -4, -1, 2, 9, -7, 7, 9, -3, -4, 1, 5, 4, 4, -3, 11, 0, -5, 13, -1, 7, 11, -3, 5, 8, 4, 8, 14, 11, 7, 13, -8, 0, 6, 7, 1, 4, 4, 6, 5, 10, 11, 8, 0, -3]
5951cJJ1Nj5jMjmJ4j2Jj0KJ0OPk4LJK0%rr%j5J8QrpRNPmnjj3J0J1Klrj4J1J0N
5996A3Jlk5RJ6%oqjoJ1QJj7J3mMKm%lj5J1J4oJ1k4MOOlQk8LJ6Rjqk0KMKK1j3o
6041foK1jOJ2l8JOJ7Oj1j0OnJ8lRj4k4J2J2K8j7k7JKJ5pjrLj0J0J6pj5ljK2NL
6082A6j8pmJ0K2ppj8nJ8KOPk4jLJ2J3j7%j9RMK9rk8oQK0J8kj3k5RJ8J3j2j6%K
6122AJJ9kj5j8J1J3K0oj2k7%QK2jj3j8NNJ6J9k3lk1J4K2jnj6j7J1K2Roj7j0pK6
6160FK0j6j1j5JL0%%j9j0J0RJ6Oj5k7J2J2RLj9j3MJ1K3kj1k8J3JJ2J5j8k2NLJ0
6197ERqj2j2J0J2J7qk8j3L6LPojk3OK0Nrj8pLRK5Nk2j8oK4J7pnj6rJ2J4K2k7j5
6237inK2J9Lk3j7lJ7K6k2j0MjlJ7Rnk8KOPRj3kj3KJL0j3j6j1R%J4J2pk8K7%K%
$$ y = [-3, -2, 9, 14, -1, -2, 2, 1, -3, 11, -1, 0, -10, -8, 2, 8, 15, -9, -6, -5, 15, 15, 6, -3, -3, -18, 0, 8, -1, -8, 1, 6, 13, 9, 4, 3, -10, 0, 11, 13, 10, 1, -13, -2, 8, 13, 14, 11, -14, -5, 11, 11, 5, -3, -4, -10, 1, 9, 10, -7, 6, 2, 6, 8, 4, 4, 1, -14, -3, 11, 5, 16, -8, -4, 2, 8, 5, 13, -15, -12, 4, 13, 12, 4, -16, -14, -10, -8, 13, 0, -6, -12, 9, 8, 14, 26, -12, -11, -5, 12, 18, 7, -3, 3, -2, 16, 13, 22, 8, -16, -4, 8, 36, 19, -8, -7, -5, 10, 3, 2, -7, -4, -14, -4, 12, 5, -10, -13, -14, 8, 13, 16, -2, -9, -13, -3, 19, 12, 5, -13, -18, 0, 2, 8, 15, -9, -10, -7, 5, 18, 1, 1, -18, -9, -5, 24, 15, -13, -19, -11, 9, 27, 25, 12, -13, -4, 14, 27, 15, -1, -1, 1, 2, 21, 19, 4, -14, -3, 10, 30, 24, 12, -15, -15, -7, 15, 14, 1, -17, -12, -7, 9, 28, 5, 2, -19, -5, 17, 16, 11, -5, -22, -11, 11, 20, 14, -3, -13, -20, 6, 26, 10, -1, -16, -15, 15, 15, 15, -4, -14, -4, 5, 21, 27, 12, -15, -3, 9, 18, 21, 2, -11, -7, 4, 27, 25, 14, -14, -1, 0, 12, 27, 9, -13, -8, -5, 5, 14, 6, -6, -18, -8, 4, 21, 13, -15, -28, 8, 11, 18, 12, 11, -12, -6, 14, 19, 10, -8, -15, -12, -3, 22, 27, 5, -13, -19, 5, 22, 15, 10, -6, -15, -3, 11, 33, 6, -9, -14, 8, 27, 30, 7, -10, -13, 4, 30, 8, -2, 2, 1, -2, 15, 24, 19, -9, -7, -1, 6, 15, 2, 0, -13, -11, -10, 20, 7, -9, -20, -11, -11, 3, 15, 8, -20, 7, 7, 9, 9]
6278Ilj8LKK4Mk3j1J5Qj0K3Mm1KK3mJ2k4MmkJ3J1j8qMRJ0K%rj4JK7oqk0lJ5lJ4
6320A0mpj2J2QpoMKoMK0nok2PONR%nk5J8K5j7j0NkJ5KroKrJ5J3Mj1rRplOj1nJ5
6366A2mRpRk6J1mJ5mq%j1JJ4oljpJ6Qk1kK0oolJ1pj6QJ1%mLnKOjJ0j3M%MpJJ0
6412A3rmRNj3MPlj7J8JojJ0Mj3KQj4njJ8qnj5J2KLJ0mj9nK6oJ4j6pJ2rrJ4Lj3
6455gNQJ1qj1mpK1Llmj1J6jJ3rNmj3OJ7kj6LNjMJ3k1k2NJ9J8k3%Lj7KJ1%Kj4p
6498a5J3nJ9nj3j4J8J2Oj5mj4NJ5J4Oj8j5MK3NMk0j9OJ6J4Oj9j8J3OJNlj3oJ8
6536A3NKlk3J2%PJ2j5oqkL2roj5pjJ9J4j9lokJ0J0Jk5qMK8J1nj1k3jJ2L0j1j1
6576Bk2kK9Knnrj0L1QRj3j4KMJ4Jjl6J0jJ9Qk7rJLL0Qqj6j1%K5Ppl4J0JJ4jJ2
$$ y = [9, 6, -12, -9, -7, 17, 21, -2, -13, 2, 10, 0, 23, 27, -14, -12, 11, 7, 19, -5, -1, -5, -7, 6, 17, -1, -9, -5, 4, 14, 16, 16, 7, -7, -6, 21, 15, 7, -13, -16, -1, -4, 10, 6, -1, -13, -1, 7, 0, -6, -2, 0, -6, -2, 18, 13, 7, -15, -8, -2, 3, 12, 12, 7, -18, 0, 25, 8, -2, 3, 1, 16, 18, 9, 3, 5, -4, 11, 24, 28, 17, 8, 17, 10, 7, 13, 2, -3, 12, 8, 17, 10, 19, -7, 4, 0, 15, 11, 3, 3, -8, -7, 7, 1, -2, -3, -10, 6, 14, -7, -9, 11, 5, -1, -4, 7, 0, -16, -8, 3, 3, -1, 2, -3, -1, 5, 4, 14, 1, 5, 5, 9, 2, 3, 13, 4, 0, 9, 14, 1, 5, 12, 9, -8, 10, 11, 5, 4, 14, 18, 5, 7, 15, 1, -4, -5, 13, 5, 0, -15, -3, -1, 2, 12, 8, -11, -16, 10, 4, 18, 2, -5, 7, -2, -11, 3, 6, -7, -2, 6, 17, 9, -2, -6, -13, 8, 11, 8, 4, -7, 9, 8, 21, 12, 17, 13, 0, 6, 23, 21, 5, 8, 13, 12, 16, 29, 8, -14, -9, 10, 28, 5, 5, 8, -9, -7, 4, 4, 6, -8, -15, -2, -7, 12, 7, -6, -20, -2, 10, 16, 1, -3, -17, -12, 3, 17, 23, 5, -10, -6, 17, 22, 26, 6, -13, -7, 9, 23, 29, 10, -8, 5, 11, 12, 17, 14, 1, -5, 13, 18, 20, 17, -6, 6, 6, 13, 25, 10, 4, -4, -6, 26, 17, 11, -4, -11, -12, 7, 21, 2, -1, -7, -9, 1, 11, 12, -13, -21, -17, 11, 22, 17, 6, -17, -18, -6, 24, 13, 2, -20, -22, 7, 9, 4, -1, -10, -20, 11, 19, 28, 15, 1, 3, 7, 21, 22, 21, -15, -5, -6, 13, 21, -6, -15, -14, -11, 19, 27, 19, 3, -8, -8, 17, 24, 17, -17, -7, -6, 8, 7, 19]
6618A9j9j3j0K9J2nj1j5QJ3Pj4mj7OJ3J6Lk2rNPK8Oj9j8mQK5Nj4j2lpK3K0k3n
6656Ik8J9J0Plk0%PRJ7j8jj8OJ1K1nl3pKK1kJ6k3j3jJ7J1Oqk3mK9jRk2j6LJ1J4
6696ImQk3mJ0PJ7j8j0qK0OJ6pk5QQJ6prpk3J6J7MJj2j3JJ8k%plj1J6J1j2mmoJ9
6738IklplqK6%JnjlqOPjj5nMJ0J4j4nn%J5Jj0Kj0J6lQJ2j3j3%JJ5oLj2nJ5pJ5
6783A6j3JLJJJj1LlkRPoj7OnONpoKMJ1Jm%kJJ2j1KnOj0jPMooRPMj7RjMjpOllK
6835CKM%plJ5pJ9l0J1Qj8J5k5L1j6MjoPj0OqPJjkJQj4RoOKJKqQmqPLqMrJ0RMq
6884HkPj0LQlPj3MnmJ1j0moJ1mJ2j0mNJ5qmNJ%r%J3j0pNJlJ7oj1j4ONNLlj8J1
6930elJ8Lk0OlnPJ1j0%%MOQj1%Oj2J0Okrj3LJ1J9k1omJ1NJ3j3qqNK1Kmj8JjRM
$$ y = [19, 0, -13, -23, 6, 18, 13, 2, -13, -5, 8, 15, 1, -3, -20, -14, -1, 15, 18, -4, -13, -8, -1, 27, 33, 14, -4, -8, 0, 25, 30, 16, 4, 1, -6, 17, 37, 14, 9, -19, 0, 10, 17, 14, -6, -6, 1, 10, 27, 9, 8, -10, -4, 7, 28, 23, -10, -17, -15, 6, 4, 20, -3, -16, -17, 0, 11, 17, 9, -14, -18, 11, 10, 19, -3, -19, -16, -5, 9, 5, 13, -10, -14, -4, 3, 20, 2, -8, -16, 4, 10, 26, 19, -6, 2, 10, 26, 19, 10, 3, -20, -4, 13, 17, 18, 6, -7, -6, 12, 10, 10, 3, 0, -11, 5, 16, 4, 0, -4, -10, 9, 7, 4, -3, -6, -14, 12, 12, 13, 8, 7, 4, -4, 2, 9, 8, -7, -12, -8, 2, 16, 2, -3, -8, -8, 7, 8, -2, 0, -10, 6, 3, 11, 23, 10, -3, -3, -2, 13, 7, 10, -2, -7, 8, 1, 16, 3, 4, 7, 8, 9, 10, -1, 2, -1, -3, 6, 13, 7, -10, -4, -9, -3, 2, -5, -11, -9, -5, 6, 7, 3, 3, 1, 2, 14, 3, 5, 0, 6, -4, -5, 2, 6, 0, -6, 3, 10, 14, -3, 6, 5, 9, 8, 1, 7, 4, 1, 3, 5, 9, 9, 2, -1, 14, 7, 26, -4, 7, 15, -3, 12, -13, 18, 2, 6, 5, -1, 6, -4, 2, -6, 1, 2, 1, -1, 0, 8, -6, 3, -3, 3, 5, 6, 8, 0, 8, 4, -4, 3, 6, -2, 2, -7, 3, 12, 16, 8, 6, 13, 3, 6, 14, 11, 18, 5, 9, 4, 0, 11, 1, -3, -9, 2, -2, 10, 0, -4, 1, 16, 8, 4, 9, 10, 10, 1, 1, 14, 4, -3, 2, 3, 0, 17, 11, 0, -14, -8, -3, 2, 5, 2, -16, -5, -8, 10, 13, -7, -1, -4, -9, -2, 9, -1, -1, -1, 3, 9, 17, 6, 6, 12, 0, 10, 16, 14, 5, -8, -5, 6, 25, 4, -2, -6, 5, 10, 23, 10, 2, -6, -1, 20, 22, 18, 0, 1, 0, 9, 13]
6975A3Jj2qNKJ2Jj2k0J1J0JK2j7j3OKMPj7qMlJ4Pj1j8jK5mJkmj5NL7j0lj0LpJ3
7017A1J1j0j2j6J0J4J1kj5j1PJ6%Lk3j6QMK6knj9j2K2J1plj4kJ5PJ3j8j7NLKJ8
7055A3j1qk0J7L0qlk1KLJ6Rj0nrlJ2J4Ql8PjJ3J7j1qj2mK0MOk0kj8K2J5oKj3j4
7095a5J2J0J0j1j2pQNJ0oj0ONkJ0j1j0NkJ2J1qj8j1MJ9O%j2lkJ4kJ0j4KjNR%j1
7136Ej1J1JK3k0Mj4mK0nJ6k0llJ5Oj0lj4j0J9J0Kj3j9RJ5O%Oj8oKK4mnj3%oK3
7176A6ojlj9LRJ6Pk2LpJ8Oj3J1k9J1KJ5Ok1Pj7J0QJqKqNK4pj1mQPqoMonj3J7J4
7220A6k3%J2j5J9KmkkrMJ7j0%nKKkNrOJRj4J0PpJjmJ5rqKpJ1Qj1%mJOpOJj3jJ7
7268A3Kj4Mr%KJ6Jj1NmnJ4njonOLkrnOM%mjjLONoNo%jJ6j2Mj4NPOQj3pnMJ9pm
$$ y = [13, 14, 2, -6, -1, 1, 13, 14, 2, -18, -7, 3, 4, 26, 9, -4, 2, 4, 8, 15, -2, -10, -6, -9, 5, 12, 1, -17, -18, 7, 3, 4, 2, -2, -17, -12, 25, 15, 12, 2, 5, -2, 11, 22, 12, 0, -16, -6, 8, 19, 17, 2, -9, -2, 14, 14, 17, -6, -22, -14, -10, 16, 14, 9, -10, -22, 0, 11, 4, 1, -13, -15, 0, 7, 20, 2, -15, -10, -7, -5, 13, 2, -6, -26, -9, 21, 13, 10, -11, -9, -6, 10, 19, 9, 4, -5, -8, 4, 18, 26, -12, -5, -6, 7, 24, 13, 5, -7, -11, 9, 13, 19, -1, -3, -21, 1, 16, 10, 12, -1, -15, -3, 7, 17, 6, -6, -13, -5, 0, 10, 4, -6, 0, 5, 3, 13, 2, -8, -3, -5, 7, 18, 10, -8, -19, -15, 4, 10, 10, -2, -5, -7, 7, 5, 15, 1, 3, 2, 7, 16, 16, 5, -6, 5, 6, 29, 9, 13, -1, -5, 15, 10, 26, 6, 3, 0, 15, 21, 11, 8, -6, -16, 3, 13, 15, 2, -17, -8, 7, 13, 13, 19, 1, -5, -3, 21, 17, 12, -1, -1, -7, 16, 10, 9, 6, -13, -10, -1, 15, 22, 0, 3, -4, 14, 20, 7, 18, -11, 0, 2, 17, 23, 2, 9, -8, 2, 10, 11, 3, 5, -3, 2, 26, 19, 8, 4, 12, 19, 11, 5, 9, 3, -2, -15, 2, 16, -7, -7, 5, -10, 9, 11, 7, 5, 3, -6, -2, 15, 5, 5, 0, 2, 4, 2, 7, -2, 4, 5, 14, 0, 10, 17, 10, 11, 10, 6, 21, 12, 4, 6, -1, 10, 18, 7, 7, 3, 4, 10, 3, 9, 10, -3, -4, 13, 15, 1, 5, -4, -4, -2, 14, 15, 4, 9, 5, 0, 14, 9, 8, 2, -3, 3, 6, 4, -5, -10, -4, 0, 0, -4, -5, -6, -3, 3, 8, 2, 7, 1, 1, 0, 16, 4, 8, -6, -1, 6, 12, 20, 7, 0, -5, -1, 18, 11, 7]
7319GKqNLrJ9Lj3Jj1KJjKJj5QQkj3jJ4oJkOLprQpjK7j0rkOmnJ1j1NmQlKPJKjl
7370FJ1pj7JmK9rJ3j7rQQlpNrKJ2nLoOj3N%jmJ7j8J1%nj1JJ4Mj0KMj5MQQlroo
7417a2J3KJJ%Pj6J6JKj2pQNj6M%%J6Ljj0kO%J5j2kj3KOJ7jj0omjP%pj4JOQRmk2
7464a6J1PKpnRq%J4mKj4KLJ8oMlo%kJ2Nj3qkNJ4p%oLROkorjMJ7ppmkmJ4%%nkm
7515AJ1krk1jJ7J0Rnqk1PPJ7j9Oj2JJ9Pj3J2k6J4J1kJ5k5j7K3NMMj7OnkJ2oJ1
7555A8j3%KJ0j0lMomJ8j0noRj2K7j0j1%pJ0jJ8j9qmKJ0MQk6J5j0J3KMj1krNJ5
7596GpMj2LlJ3KqJlMJ9j0Pj1lj4K8ljk1POPJ8j5o%jJ2j0J0j4nKNkj2J0pkJ3qM
7640DoKpOJ2mqjqJ6oMJk3J5J4krj3R%jJ3OpjpLJ9%j1nkoK1Kj4jpOK1j9J5j4j4
$$ y = [7, 9, 1, 6, 9, 0, 19, 22, 9, 10, -1, 1, 2, 1, 3, 4, -11, -3, 5, 3, -10, -11, 3, -3, -2, -4, 2, 5, -2, -11, -3, -10, -11, 16, 6, -3, -5, 1, -3, -8, 3, -8, -3, -7, 1, -2, 0, 7, 8, 10, 9, 6, 17, 10, -7, -6, -10, 19, 10, 23, 6, -3, 5, 13, 10, 3, 8, -1, 1, 13, 8, 11, 5, 11, -2, 3, 3, 2, -2, 15, -3, 8, 8, 3, -8, -7, 7, 11, 1, 3, 7, -8, -4, 4, 12, 9, 0, -6, -12, 1, 3, 4, 5, 5, 12, -4, 12, 13, 15, 3, -4, 4, 9, -7, -3, -3, -3, 13, 16, 15, 5, 3, 9, 9, 24, 12, 10, -3, -1, 5, 22, 21, 11, 5, 1, 0, 7, 7, 0, -14, -13, -7, 1, 10, 6, -16, -5, 2, 4, -3, -8, 1, -7, -7, 7, 3, 5, -9, -7, -4, 14, 8, 12, 9, 3, 3, 1, 13, 18, 5, -3, -5, 0, 14, 7, 7, 1, 4, 13, 19, 17, 11, 2, 1, 5, 22, 15, 8, 4, 2, -2, 12, 12, 12, 7, 5, 1, 12, 10, 1, -20, -21, -4, 6, 15, 10, 2, -19, -12, -5, 12, -7, -1, -13, -12, 7, 14, 1, 13, -13, 1, 12, 10, 25, 0, -17, 6, 11, 15, 19, 2, 8, 3, 1, 13, 7, 18, 5, 5, 7, 17, 7, 4, 8, 2, -2, 16, 6, 1, -5, 4, -8, 19, 9, -2, -2, -9, 1, 0, 18, -1, -9, -13, -11, -1, 3, 11, -15, 0, -10, 3, 5, 9, -2, -4, -13, -8, 7, 0, 4, -8, -5, -8, 5, 7, -1, 0, -3, 1, 20, 10, 17, 6, 3, -11, 17, 14, 13, -8, -1, 5, 12, 30, 15, 9, 9, 8, 20, 10, 20, 6, 1, 3, 8, 6, -6, 4, -3, -5, 8, 0, 4, -2, 0, -7, -1, 11, 7, -1, -2, -10, 6, 0, 4, 5, -18, -3, 11, 9, 0, -13, -4, -4, -5, 8, 14, 7, 6, -1, 2, 21, 21, 10, 5, 3, -3, 18, 20, 6, 5, -2, 4, 25, 6, 21, 7, -7]
7685gJ2qQRk3NMnK2j5mlKRoJ%LrKJ8l%k9J2RNJkj8NRj5J3Qj1kJ1J0kKj7OoJ7n
7731A3kkmoOJ1qmrJ8JJ%kkk2J6Qj1J9k2Qj2LJ2oj2NNPlQj5%LJLkn%JKj3RlLRJ5
7779B2k3LmlMRQj0Kj1%PkPj4qK9j3LNj7RJ%jpOPPq%NMj6%nmJKrK1LroJ0j1JnK1
7828A1j9MJ7nlMnnlQQj9JJ5rQklRqJ7j1qMkmNjJ2rLjQnmooKJ5jjoQnmPlnOj2J
7879bJ3j1J1JpKJ1rj6LmMjmMK%nQLLqnJ2j1J2j4NPlQnjmRj1QQ%qjRqL%o%OoQj7
7930gPPj0MMNj2JOjOmkK%qJ2j0mRj7J6k%Rl9J2K0%mKj3OJ3%jlJ3k5J2LjNj0qJ2
7976EkQlJjoJQMj5oJ6J%jojPrPN%rKj4J0J0j5QqPRj0LOk3PQKmjrJ4j0J2Lj1Pp
8025@LRolrJ0moMRqqOMJ2j0lNkPlPkq%QLLk1%J1lKLj0lqJ2jPnMJNj0K%j0kJ2o
$$ y = [-7, 5, -3, 5, 14, -9, -4, 0, -5, 17, 2, -2, -5, -3, 6, 0, 1, 1, 4, -5, -3, 15, 12, 12, -17, -5, 4, 9, 10, 8, -10, -5, 4, -11, 2, 10, -1, -3, 8, 18, 16, 18, 1, 7, 1, 18, 13, 11, 9, 5, -1, 5, 16, 8, 4, -5, 13, 14, 15, 15, 13, 11, -11, 5, 13, 2, 21, -1, 7, -5, -2, 10, 4, -8, -3, 2, 9, 6, 14, -1, -1, 2, 3, 6, 4, -1, -1, 0, 2, -11, -2, -5, -2, 7, 22, -1, 2, -2, -5, -1, 8, 16, 6, 8, -3, -3, 4, 2, 9, -5, -13, 16, 3, 6, 11, -6, 3, 4, 4, 3, -4, 2, 9, 16, 8, 8, 13, 17, 1, 1, -4, -8, -7, -5, -14, 7, 10, 1, -5, 5, -6, -5, -10, 11, -8, -4, 13, 8, 5, 9, 4, -1, -4, 4, 12, -7, -6, 9, 0, 8, 6, 3, 12, 4, 21, 10, 2, 6, 4, 0, 5, 4, 16, 7, 10, 9, 17, 12, 8, 2, -4, -2, 13, 12, 11, 5, 13, 8, 4, 11, 8, 3, 9, -3, -2, 11, 0, 11, 12, 5, 7, 18, 9, -7, -4, -8, -4, -5, -9, -5, -3, -3, -8, 0, 3, 6, -2, -7, 5, -6, 6, -8, -3, 4, 1, 9, 4, 3, -1, 8, -3, 5, 13, 13, 5, 4, 13, 5, 8, 8, 2, 2, 8, 2, 10, -7, 0, 7, -3, 1, 5, 10, -2, -1, 5, 4, 10, 6, 4, 6, 6, -2, 10, 0, -4, 5, -12, 4, 2, 2, 11, -28, -16, 4, 4, 0, 2, -11, -5, 8, 8, 7, 4, 17, -8, 4, 7, 6, 11, 1, -7, 5, 3, 11, 8, 9, 8, 2, 3, 11, 15, 0, -6, 10, 11, 11, 10, 4, 3, 10, 1, 8, 13, 13, 4, 6, -8, 2, 12, -3, 5, -3, 4, 13, 3, 6, 12, -11, -4, 4, 6, 2, 1, -8, 6, -4, 8, 11, 0, 7, 0, 3, 12, 6, 3, -6, 4, 0, -6, -2, 7, -1, -9, -3, 1, 13, 3, 0, 5, 3, 10, 7, 14, 12, 4, 4, 12, 15, 18, -3, -3, 8, 5, 7, 10, 0, -3, -11, 1, 0, 7, 2, 6, 7, 12, 2, 4, 4, -6, -8, 4, -2]
8076bkMkPqJ0lPj9jJ1J2rj1kOLJ2lpRj2K1rPj1jpRJmNj4MLOMLlk7J8kMnqjNLJ3
8125A4j1pRolpJ4j1Nm%ONrJPMkRj0k3J8jJ4Oj5mlJJ0kJj1QOOnqK1onmNj3KnO%
8173CMj2OlQKqjkPKKnlNkj0q
$$ y = [-2, -4, 0, -2, 5, -3, 7, 4, 11, -8, -9, 2, 14, 5, -6, -8, -2, 1, 13, 10, 3, 12, 0, 21, 12, 19, 8, 7, 0, 9, 10, 6, 11, -3, 1, 4, 10, 14, 17, 14, -13, 5, 3, 7, 2, -6, -7, -2, 1, 14, 3, -4, 5, -1, -4, -11, 3, -8, -3, -7, -7, -1, 4, -5, -4, 3, 7, 5, 14, 4, -19, -1, -2, 12, 18, 3, -1, -4, -3, 7, 5, 6, -5, 3, 9, 15, 10, 2, 23, 17, 12, 8, 13, 0, 2, -3, 3, 3, 7, -5, 1, -2, 6, 8, 0, -1, -3, 4, 6, 8, 3, 0, 5, 3, -7, -15]
8191a5
$$ Imaginary data points
##PAGE= N=2
##DATA TABLE= (X++(I..I)), XYDATA
0@%%%%%%%%%%%%qJ6j6J6j6J9k7L2l2M0m8N6o4P2q8J00j09J21j37J57j80K01k25
35a20K52k77L08l43L81m21M64n13N69o33P04p82Q67r65J081j216J375j569J811
54I73k119K530l109L986n499Q811k7953J9989N2345m4368j6785K0292j1177l3417
68c5501L5377M3307k8766m6507J5397K1502q382O461K4673j6592l3740N651K3309
81F189j380j231N912j4786j6469K1598K2967j5049j6879Q698p01j1132J3609J6437
95A7783k0009j8640K0615J8701j3245q995N923q314r372J7520J5304j3532j2471
108h732M328p72J402J9437M403k8297j5045J6388R087l32J5755J225l6479j4355
122c1987L7564K1343k3194r714R776j7043j3803L6591K8476l2642k8780J9490
$$ y = [0, 0, 0, 0, 0, 0, 0, 0, 0, 0, 0, 0, 0, -8, 8, -8, 8, -8, 11, -16, 16, -16, 24, -24, 32, -32, 40, -48, 52, -57, 64, -73, 84, -96, 105, -120, 132, -145, 163, -180, 201, -220, 244, -269, 300, -333, 371, -411, 456, -509, 572, -644, 731, -838, 973, -1146, 1384, -1725, 2261, -3238, 5573, -22380, -2391, 49954, 5586, -11199, 9093, -2084, -35501, -124, 43183, 14417, -32090, -16693, 4809, -3573, 2888, 27561, 10969, -22771, -17120, 6189, 4809, 3578, 9490, -5296, -21765, -167, 22800, 7751, -9128, -430, -1131, -12263, 1346, 17783, -2226, -20866, -251, 18450, 5205, -3790, 2133, -6181, -15553, 1967, 17271, 3739, -8732, -4404, -5176, -3774, 15663, 20066, -8231, -23276, -6888, 2199, 1867, 17622, 18847, -17632, -31987, 5577, 26920, 3726, -5988, 3788, -13255, -27058, 9533, 38009, 5367, -23413, -3923]
134c923Q562j7858J4318K8155k4574l7241K0206L2089j2469j1018J6783r150l1152
147b7272J3816L7999r183l0359P279J4894j1960k60K1582n931k7918L767K2911
160I365k957j1087P835J282j4238L732J8087l515j5225J485M263n236O365J4050
174A4206q403j8567M277J3624q80j417L931j0268j3502J2066J9288m785j2243
187b673P46k047n928J1526J4193j1312j5942N815O720m829P336J2687j3851k0543
201a8102J0391J7531o669n175J0381o958j9557J1351K5893q469k1939O566R956
214E200j2106l2K0834k987k4451K771K0461m649j2271J0566N515j7573l335J9785
228G728K661j5669J060R447p550n094J3590L477j5960l154J3116J025p339M370
$$ y = [-3923, 4639, -13219, 1099, 29254, 4680, -32561, -12355, 19734, 7265, -3753, 13030, 3880, -27272, -13456, 24543, 15360, -14999, -7720, 7174, -4786, -5046, 16536, 10605, -17313, -13546, 9365, 6408, -4679, 3156, 4438, -9800, -6068, 12019, 8504, -6721, -5236, -973, -6209, 156, 14206, 5803, -12764, -8487, 5137, 4257, 2840, 6771, -3497, -16999, -4933, 14355, 9570, -2673, -1927, -3974, -9902, 1624, 15817, 4505, -11437, -5622, 1098, -3731, 3605, 16292, 2441, -18102, -7711, 9820, 3151, -2024, 8357, 1399, -18158, -6807, 19086, 10617, -11322, -4756, 5200, -6906, -6938, 13896, 10909, -13542, -10771, 9690, 5041, -7230, 3336, 8851, -8722, -12057, 7728, 10389, -5280, -4220, 5227, -2323, -7417, 6173, 9650, -6310, -9464, 3652, 4677, -2662, 1708]
242A708K947j0059j511J2596J358j0811q3O214l684k192Q320J026r861r95P287
257B260j107l249N296Q31q897p14Q962P21n308J913J012o594P44R721o33r071
273d113J306N755m055k365P577L81r463Q43Q747l077o715O210M962q537l355R095
289C196R77q352K303P267n496o178P542M585q234k050Q259p65p879K957O625m373
305C84m193N756J261p176Q24P867j612o757K060L834l341o06N375j188o671J338
321b845N766j393l009K717K78m764P32N682m68m281O48J307k579Q98N136p66n858
338b799n56L623N03M8J922k305n090J634O083M72l507p91n54j892K632N195j482
355C136n790o29K814M61J197K898k374o302J9N943K340j771j055k271l371K325
$$ y = [1708, 4655, -5404, -6915, 5681, 7039, -3772, -3855, 2359, -1325, -3517, 4803, 5829, -4032, -5027, 2260, 1153, -2096, 3200, 4031, -4866, -5580, 3382, 4103, -1205, 708, 1720, -4874, -4130, 5591, 4958, -4113, -2807, 2948, -1107, -3472, 4105, 4486, -4977, -4134, 4613, 1536, -5179, 1031, 5993, -2544, -5899, 3196, 4173, -4179, -1876, 5391, -105, -6283, 1259, 5844, -2390, -4440, 3819, 3054, -4825, -1868, 4757, 384, -3809, 1947, 3208, -3968, -3144, 4723, 3111, -3646, -1586, 2248, -1093, -1699, 3676, 2488, -4183, -2845, 2921, 1528, -1481, 1236, 1514, -3250, -2518, 3164, 2696, -1585, -937, 370, -2209, -1311, 3825, 3059, -2799, -3355, 268, 771, 819, 2741, 436, -4654, -3020, 3063, 3535, 28, -763, -1317, -3209, -577, 4618, 3136, -2654, -3283, -469, -8, 1189, 4087, 1713, -4589, -4570, 1373, 3713, 1942, 887, -1384, -4755, -2430]
371b430O971J134n893l828R08J867L041L211k153o457j743M593L891L15j300l409
387a282l776J539O179K620l279l954j709L40L662M818p21o475l829K760M859K583
403D335n42m060m942K69O104M559j839n153l419M90M285M845J92n118m953M6M437
420d64M842J087m181n868j342M689N758J342l857n836k584L653O779K746m169
435B595o478k364L475N936L027k733o209l689K565O347L780k398o032l734J876
450d036N545M159j055n657n011R13O136N055j049n830m965N73N642N351l13n691
466b33n467l6N526N926L55n825n882K7N168N139J101l989o385k409N065P236J297
483F614n050n567j873K813O265M116l622p967l006M528O219K622k189o017m886
$$ y = [-2430, 4541, 5675, -218, -4046, -3138, -1271, 1770, 4981, 2828, -3629, -5372, -779, 3112, 3427, 2127, -1282, -5058, -3519, 2660, 5280, 2001, -1953, -3662, -3322, 340, 5158, 4437, -2038, -5867, -3107, 1752, 4335, 3793, -267, -5209, -4940, 1164, 5723, 3884, -1269, -4688, -4198, 87, 4932, 5124, 6, -4947, -4901, -464, 4378, 5465, 1284, -4584, -5926, -1237, 4521, 5863, 2006, -3830, -6414, -2761, 4018, 6764, 2595, -3883, -6247, -2772, 3164, 6191, 3458, -2751, -6440, -3875, 2472, 6252, 3854, -2178, -5912, -4036, 1509, 5668, 4613, -1044, -6055, -5142, 994, 6049, 5000, -830, -5795, -5222, 420, 5771, 5458, -233, -5700, -5736, -210, 5716, 6071, 246, -5636, -5609, -441, 4698, 5799, 1810, -4575, -6984, -1919, 5317, 6614, 1564, -4003, -5876, -3063, 3202, 7318, 3696, -4271, -7277, -2749, 3470, 6092, 3903, -2114, -7000]
498g000K285P586L991l241n829l412R55N480N689j017p213m766K193N217L782
513D700M31m431o505o73O966N988j482n526m027o63L656O326K120n831o950j0
529e911N708M877O22l591n642k501M083O822K113m460o156k018L659N883K581
544F069l051n958l419K513O647M074l056o738l161K586N162L800p33n895n485
559f645J695O928L924k044m453l840q49M489O371J12o473m534J409L709L403J933
575E135k911o768j923N986N437j031l505k630k052J287O139L424n061o407M91
590d389M154K370J312k94m768m425L282O994R11m574l214o41N22L595M590j373
606D052o872l072L916M614J079j129l066m103j26N779M835k127n563k584J197
$$ y = [-7000, -4715, 2871, 6862, 3621, -2208, -5620, -4665, 815, 6504, 5487, -1726, -6492, -4299, 918, 4700, 5131, 700, -5805, -6478, 488, 6476, 4994, -532, -4559, -5222, -1566, 4760, 6880, 1049, -5901, -5911, -203, 4674, 5296, 1705, -3937, -6438, -2355, 4467, 6580, 2120, -4036, -6054, -2395, 3488, 6069, 3018, -2940, -6359, -3846, 2801, 6875, 3819, -2919, -6080, -3494, 1668, 5468, 4735, -1160, -6645, -4950, 1978, 5902, 3858, -595, -4435, -5284, -795, 5576, 5688, -785, -5319, -3910, -201, 3202, 5135, 2224, -4544, -6467, -481, 4956, 3925, 420, -2210, -4262, -2975, 3164, 6588, 1527, -4880, -4389, -235, 2135, 3447, 3153, -1615, -6040, -2758, 4236, 5147, 573, -2641, -3282, -2760, 835, 5425, 4052, -2820, -5892, -1976, 2638, 3717, 2588, -478, -4581, -4707, 1072, 5907, 3780, -1783, -4367, -3170]
621c170L051L568J160l796n429l73N048M213n12l204l123j492J761M754K669l191
637A934n233q41L269K851R27n37k959l559R09N252K379l124l192J2O46Q80K762
654B376J080m093l683K565M228k92k042r4r40j895K188M421j132n236p81L440
670A10J078n83J281n95m374q56N339K963l446k879P50q7k68L535K547m161m845
687d491J872M083K04o08P00k212l689J888N475M44l972j411P81p07P41L766O09
704C473m600k521K795K273o94J62N80k383k223K445L384j021k615J83Q46q72J38
721f50K064J20k545p40K081Q26j444l49J219j73j378N24J597p67j889Q52K150
738A498o31j991M68J315r68o44K067P11k883j327K754J398j924l02J651j279k362
$$ y = [-3170, -119, 3449, 4609, 813, -4616, -4989, 59, 4272, 3760, 556, -2567, -4059, -2298, 2456, 5125, 1934, -3299, -4140, -871, 1980, 2907, 2370, -589, -4148, -3239, 2013, 4392, 1268, -1924, -1912, -1266, -386, 2376, 3456, -637, -4320, -1755, 2473, 2181, 139, 45, -895, -2790, -602, 3819, 2687, -2549, -3330, 110, 1188, 605, 1886, 1291, -3083, -3939, 1400, 4363, 917, -1962, -1212, -1299, -1567, 1968, 4515, 354, -4491, -2619, 1464, 1668, 1060, 1760, -452, -4141, -2253, 3222, 3666, -306, -1717, -936, -1643, -902, 2864, 3473, -1127, -3648, -853, 1420, 726, 888, 1468, -915, -3138, -693, 2691, 1670, -945, -762, 84, -788, -650, 1414, 1534, -1011, -1751, 330, 1156, -288, -637, 582, 409, -969, -445, 1152, 385, -1504, -652, 1498, 867, -1124, -656, 659, -309, -953, 1114, 1825, -1058, -2385, 369, 1767, -157, -459, 1192, -87, -2449]
755b449K016L133j700k724J433J282k136q8L375j34l836PL080o57k059K061J750
772B354l136j874L160J382k752n1K832j192l300J496L140j396j954J932O44l092
788a807l52L705P55k922n13J539r46j059K433J789k434k348J163J418k68M04R31
805A488j311k202M53K388R45r65j123n19j36N06J293Q46r58k028l38J840J152
822A331q05n85K54q30p66J783J718j760k141J260J549j107l15J599p91k548J243
839i11L192j008k910P47J573j285j3K708o13m050J39L911M02k225M89M46k704
856b112j91M426J318l976j863J933K53m94K591J202m118k873L003L049q16o81
872F51J69k240j793L055L588j380l178n08N39L23J850J706j878l133k9K237J393
$$ y = [-2449, -433, 2700, 1000, -1724, -291, 991, -1145, -1233, 2142, 2008, -1828, -1821, 1259, 602, -1457, 604, 2354, -782, -2656, 504, 1886, -866, -917, 1915, 723, -2577, -1081, 2059, 663, -1291, 641, 1285, -1807, -2159, 1546, 2301, -621, -1134, 405, -541, -1600, 833, 2622, 188, -2160, -997, 421, 153, 557, 1488, 177, -2025, -1572, 816, 1761, 796, -327, -846, -982, -476, 817, 1663, 705, -1323, -1661, 179, 1331, 526, -59, 195, -635, -1401, 382, 2100, 340, -1801, -541, 1008, -99, -414, 1185, 394, -2154, -911, 2281, 1273, -1637, -890, 683, -602, -615, 2093, 1480, -2570, -2431, 1480, 1882, -343, 146, 592, -2112, -2303, 2123, 3441, -535, -2398, -465, -212, -706, 1885, 3087, -1031, -3904, -901, 2148, 1332, 651, 820, -1420, -3213, -158, 3430, 2050, -1128, -1636, -1097, -774, 1076, 2782, 904, -2229, -2258, -21, 1372]
889A372K25p15j901j169J348K147M73j000j590j229Q28K487Q38j762j518p9K79
906i66J203J942n23l217j069K405J644l99j08p35k368j47L657J853k538k194L83
923a177J02M96K752R09l750k807K210K597l2N0k00k935j759L476L552j589k836
940i41k25j00l11K626K540k579l982O30K841O26L8M13k010k723J480L779L77k324
958A55j214l58r8J842K341j031l136q61J548J466J028Q0k175k231J063K765Q20
975B004r29j232j547n44K351K647q51k721r91N22R67J851J063k197k937M39K529
992D24J222n6p18k110j494J986K996j57k158j089l38J95K127J990j696l162n5
1009b093J979Q82L95L37j813k397J162L263M68j933j014l76m49J508K509n93l105
$$ y = [1372, 1597, 882, -1019, -2188, -840, 1307, 1780, 780, -810, -2039, -1211, 1276, 2114, 352, -1166, -1245, -966, 237, 2179, 1656, -1561, -2630, -225, 1419, 1020, 912, 177, -2191, -2338, 1319, 3172, 634, -1560, -1177, -1075, -579, 2173, 3082, -668, -3475, -1265, 1332, 1300, 1350, 1150, -1785, -3544, -68, 3484, 1895, -941, -1166, -1266, -1577, 1049, 3589, 1010, -2972, -2342, 499, 1125, 1163, 1576, -434, -3157, -1677, 2102, 2479, 155, -1059, -1417, -1515, 327, 2668, 1637, -1499, -2360, -812, 654, 1682, 1762, -413, -2644, -1581, 1184, 2004, 1075, -157, -1704, -2248, 103, 2750, 1899, -822, -1813, -1291, -324, 1527, 2590, 393, -2544, -2105, 424, 1646, 1590, 872, -1238, -2732, -746, 2250, 2093, -65, -1154, -1492, -1297, 830, 2820, 1124, -2038, -2093, -114, 768, 1163, 1500, -313, -2710, -1548, 1715, 2183, 250, -764, -1140, -1589, -81, 2428, 1835, -1270]
1026a270r57J609J211N74M38j375k441K09K759J316j026j175r56o92J278K463
1042A965J45k390j445M83R60J242J066j101k556m45K029J416j26n82j244j363
1058a946Q02K501O98j732j390q1K93J082J498m20k315r20J399J330K51j48r79
1075g7j539J52K100J081j015j234m88l8R78J580l9j934j104P41J046O51L70q25
1093D06j715k01J771J129n43q12o35o14N51J788N34j514j297K80P08N91O80k81
1111H26j566p89J166J321L4o23o85o82J48J315P97p71j131k65L62P32P91j27j257
1130d04p62N92R03L27m8n74r20o7J176Q38m93q66l03l1M11Q87L12r39r19K58P61
1151A39M09M6l30p33l45O38Q57K5n64n05k11K87P03L21n26o48j06L33M32L51j35
$$ y = [-1270, -2227, -618, 593, 1167, 1605, 230, -2211, -2002, 757, 2073, 1047, -128, -1084, -1776, -498, 1965, 2110, -280, -1725, -1242, -282, 960, 2026, 925, -1631, -2076, -47, 1369, 1243, 661, -583, -1946, -1144, 1357, 2055, 323, -1067, -1148, -855, 227, 1725, 1305, -1010, -1930, -531, 799, 1050, 902, -77, -1616, -1464, 636, 1717, 702, -532, -1020, -1058, -80, 1500, 1461, -473, -1577, -836, 210, 861, 1231, 406, -1309, -1510, 261, 1390, 847, 35, -600, -1214, -663, 1125, 1659, 145, -1152, -872, -164, 427, 1107, 826, -740, -1529, -363, 958, 992, 369, -316, -998, -850, 465, 1262, 491, -640, -905, -543, 189, 980, 853, -404, -1166, -574, 329, 656, 608, 34, -886, -953, 223, 1061, 568, -298, -601, -632, -221, 666, 978, 39, -880, -622, 139, 548, 594, 264, -469, -814, -176, 681, 706, 142, -363, -574, -287, 416, 737, 211, -437, -543, -210, 222, 573, 438]
1172D38p33m00M59N91M8k17k69l37m3N90M90k94o10j48K15K29K43J16l48m77O8
1193c89N15K40j65k41j98q3K20L94O0l59k80R6K22J25N4q6k59j55K40L12n6k15
1215hm6Rk6J05J98p4l09n3K74P7j44J8N1j45q0K02J22j89j53J37J02r9qR5n8j06
1241a08P1R8p9n5N4L4k3jjm0J6P6po5pJ6j2O9O8o6j44L1R0N7K4k2j49p8J73J38
1271A58m5n2o9j74L1L43J44l35k17J57P8p8K40K03m62m29L85M88j95k52J71j30
1293d0m27K96P20j67p32j5M17p9l4M13l1p41j57P02K82l44j08O3k94o6N71K82
1315E11m76l62J45J41P2K59%m70k50L69L31n4j13j21k84M6M74K34l60l43QJ38
1337a05J75K45k7m50k72K43M00J42j25l53k83J39L95K16q4k65l92j14N44N32k30
$$ y = [438, -295, -695, -236, 355, 403, 186, -83, -420, -463, 127, 617, 323, -287, -435, -220, 9, 252, 368, 20, -457, -389, 126, 366, 201, -40, -238, -321, -101, 293, 353, -6, -286, -190, 32, 157, 211, 125, -134, -289, -49, 263, 207, -8, -54, -45, -71, 34, 232, 158, -151, -204, 70, 147, 3, 21, 72, -73, -153, 49, 171, -18, -171, -34, 68, -31, -39, 56, -2, -108, -37, 61, -18, -73, -19, 15, -8, -9, -10, -50, -34, 42, 35, -30, -37, -21, -33, 36, 104, 38, -106, -75, 15, 72, 96, 74, -75, -153, 20, 158, 113, 61, -8, -182, -151, 192, 336, 1, -216, -59, 19, -59, 181, 384, -78, -507, -122, 366, 171, -81, 90, -40, -467, -171, 549, 382, -350, -365, 52, -27, -61, 352, 321, -420, -577, 125, 407, 63, -45, 18, -276, -342, 229, 511, 35, -327, -182, -41, 31, 290, 290, -180, -430, -61, 270, 216, 103, -18, -302, -256, 218, 452, 92, -251, -243, -105, 70, 315, 288, -162, -434, -191, 209, 351, 226, -127, -410, -271, 124, 340, 256, -9, -401, -515, 29, 561, 331]
1358C31n67r5J26pL70M67l97q63P2P66J66k80P5r2n99J6R22L17p37m15L03P3o9
1381a17M48K24o94n18M87N62j39j68j9l02j80N01M62l31m74J3J27O9L23J56n09
1402g9m37K96M42oj00m2l20k16M26N40j77n28j56J69J45K47J75k72m73o6L91L99
1424C58J8l43l62pK82K44J19o5l77l68K43O20R8m36k19M4n4J14N20O2o87l60M59
1447i7L74j19l2K5l70k44M85M78k64m42J7R1j2K54K28l42m26J65L48K1l4K8k76
1470a44k56L21M15j34l36k0P2n8K12L01k38m87M9M02J09j24j0r7k27P2L85J38
1492C45k91k54K7J14J47J32m1k57j66Q2K72J43j05k49j19J15J79Q2nj34k13k6
1514b22K58J91j22j89m5oN7J91R5j96k25P0J66M2J0j5j52j10J50J96k2j49n2j4
$$ y = [331, -236, -331, -205, -212, 158, 625, 228, -635, -563, 203, 369, 89, 164, 72, -527, -511, 411, 728, -9, -424, -121, -48, -117, 331, 555, -139, -657, -170, 392, 253, 85, 66, -236, -416, 85, 547, 216, -258, -245, -118, -49, 274, 430, -79, -516, -220, 222, 216, 116, 74, -246, -462, -36, 504, 327, -201, -357, -188, -43, 204, 379, 107, -366, -432, -41, 358, 376, 33, -329, -336, -54, 190, 309, 244, -133, -501, -258, 362, 460, 24, -195, -151, -205, -91, 429, 491, -196, -556, -97, 277, 158, 126, 151, -219, -463, 22, 500, 236, -206, -189, -98, -110, 144, 372, 30, -396, -231, 117, 138, 104, 132, -144, -400, -79, 336, 202, -134, -154, -82, -140, 72, 373, 135, -352, -303, 99, 208, 84, 74, -23, -250, -178, 207, 345, 54, -200, -173, -59, 88, 220, 179, -78, -244, -162, 110, 253, 148, -101, -220, -105, 74, 156, 151, 17, -196, -222, 36, 227, 105, -84, -129, -135, -78, 113, 208, 12, -213, -143, 23, 65, 75, 60, -92, -202, -52, 144, 122, -27, -79, -93]
1538i3J5J37J15j48j78N5J40J3RJ1r2j32Q9J91J0j60m7L5rM6J08j3j58p9J07J11
1564H3k2l1n1n6LQ5R6n7j21k7O6N3K2j1n6m4J5P0K8l6m7j9MM5N8qo4m2M7K7J7
1595B7kj3n9rQ0N0m9o1L2JKL3L3o1o7O0N8l0k5K3k2l4K9N5k4o1K0K1j7K4J4m0
1627a2n2L4M7k0j6J9l3j2N8K2m2m7K2K5j6K6J5l2m2M5N4l3l3K3j8j4N5L0l4m2
1657b3K6JPK9J4o5l4N3L7k0jPo2rP3M4r8qN7l8k9O8L8p7m9O7L3q3J3P6n4p9O7
1690a9R1q6m4P3Qo9K3P6o7o8P4N1n3l0P0j2p3M3O0n1l0O2J1n7RO0k9n8O7J4o1
1721a5j3P5lp7M5L8o3k6O6L1p9lN8l2l8M4L1o3m4N1L1j9PJn8lP1K4m2j9Rm6K5
1754c6R4Kj12rM8J3rP1oj32k9J42O1o9k8Mn8%J28O6j26r3L4O2K5M8nj25o4Q3R9
$$ y = [-93, -78, 59, 174, 26, -152, -97, 43, 56, 65, 76, -16, -148, -59, 132, 142, -18, -65, -30, -39, 7, 115, 102, -56, -135, -28, 83, 61, 30, -21, -77, -74, 11, 107, 50, -71, -98, -32, 21, 43, 32, -24, -68, -53, 17, 45, 9, -38, -57, -53, -8, 50, 42, -22, -64, -17, 10, 27, 25, 12, -47, -56, 24, 74, 25, -36, -4, -3, -1, 32, 65, 4, -63, -3, 55, 25, 0, 23, 1, -33, -4, 51, 27, -34, -14, 7, -10, 14, 28, -12, -64, -30, 17, -3, -19, 0, -33, -45, 13, 35, -7, -54, -32, -7, -23, 3, 18, -14, -56, -11, 43, 10, -23, 0, -18, -32, 23, 53, 19, -23, 3, 4, 11, 40, 54, -11, -45, 8, 45, 25, 24, 31, -31, -40, 33, 77, -21, -29, 28, -10, -39, 29, 67, -10, -59, 8, 41, -42, -29, 47, -7, -86, -19, 72, -14, -58, 15, 23, -46, -23, 53, -14, -82, -8, 43, -10, -40, 30, 18, -55, -12, 48, -3, -33, 29, 40, -17, -8, 52, 23, -35, 32, 46, -15, -28, 47, 44, -33, 12, 50, -13, -39, 27, 58, -21, -24, 34, 2, -36, 8, 39, -24, -68, -17, 14, -5, 2, 3, -55, -58, 13, 37, -5, -24, -15, -61, -36, 58, 60, -52, -61, -13, 0, -9, 62, 56, -76, -105, 37, 98, 29, 1, 5, -53, -53, 75, 141, 15, -78, -44, 18, 43, 91, 86, -39, -103, -20, 79]
1785G9Pn0n1q3KJ56O7q9j06k8K0O8J26rj61j14P6J34M6k4p9j22l5J72J56o4j38
1812d4q5J1J01J37L0j47j57K2J33J35K8j12j74l8J35J68K5j11j50p5J04K02Q0
1835B18j54j75m9R8J61J15r1k26j22J32K18O5p7j72j56M7K45J52r7k26j27O4J89
1858C2J68j9k45j97P1K32J64m2j99j94j2K31K34pk22k14J4J85K34K8j92k38n6
1881b44K02K61N8j87k58q1J89K57R4j57k87j14J71K72J16j63k42j59J18K96J72
1902C14j55l01j46J17K57K05p8l11k36J20L13J84r7k50k16j1K88L14l3l62k37
1923c21P7K64K18L1k27l30n0L13L27nk79k49n4J97L16J15k48l54o2K62L11P9j98
1946A33l06j52J82L55J73k24l49j14J65L01J83j42l27k48J55L64K00j63l07k03
$$ y = [79, 86, 36, -15, -98, -96, 60, 127, 38, -68, -96, -76, -8, 118, 109, -52, -166, -90, 44, 90, 66, -13, -135, -170, 2, 158, 94, -44, -129, -118, -17, 120, 150, 3, -154, -132, 1, 136, 164, 52, -122, -160, -25, 143, 168, 57, -93, -168, -64, 138, 218, 64, -111, -160, -62, 99, 214, 123, -103, -225, -93, 125, 190, 113, -59, -215, -168, 77, 229, 132, -94, -221, -157, 32, 200, 181, -64, -261, -190, 42, 206, 164, -35, -229, -241, -10, 224, 217, -5, -219, -205, -20, 214, 242, 50, -188, -244, -42, 219, 277, 90, -168, -249, -60, 197, 291, 134, -153, -267, -96, 176, 292, 129, -113, -272, -154, 142, 314, 159, -142, -288, -171, 86, 291, 213, -98, -334, -214, 99, 283, 186, -64, -280, -291, -3, 311, 278, -84, -321, -244, 20, 238, 269, 42, -288, -338, -25, 302, 297, 18, -231, -285, -88, 228, 343, 95, -259, -321, -59, 252, 331, 133, -173, -325, -143, 212, 385, 161, -188, -302, -137, 164, 347, 205, -122, -370, -215, 149, 349, 186, -121, -324]
1966c24O4K95K86n1l83k74J30L21J96l5k05l29p3L82L63p3l61k06J6J79L04J55
1988C77k74m38l1L82K69k4j77k46j81J57M49J71l34l66j5K14K02J81p1l82k72
2009d09K34M31R2k23k35j63L5L08L11j14m22k16K02K55J59j7k37l26lL80L02j39
2031B05l13j57K2J83K70J10k94l72J6L40K48l9j81k08j41J75L70J33l21l22L3
2052b43K39J44J16n3l17k47J99M28O4k80j97l0J5J98K97o0m38k06K82K66On6r2
2075C5k48r8L58L33j97l63m7J33M7J60J62k11l97L5M06J27j66q3q2j48P8L67J17
2098C18l53k37J56J33QJ20L2k95k19K70L27r0k07j6l0p2J86K51j23l36l6K28Q9
2121A04k7J9o8j98j9K69J57j70j92J6P0K3J05O3j30k36M9K45P8j47q6K5k7k3J78
$$ y = [-324, -260, 35, 321, 270, -113, -387, -257, 64, 260, 225, 20, -309, -382, 0, 363, 290, -71, -277, -261, -82, 222, 377, 103, -335, -366, 16, 285, 261, 84, -162, -343, -186, 263, 434, 100, -266, -281, -67, 135, 316, 245, -137, -409, -175, 256, 348, 125, -110, -273, -238, 70, 381, 267, -155, -371, -169, 86, 245, 228, -9, -335, -338, 42, 344, 205, -108, -265, -243, -60, 210, 320, 26, -346, -330, 10, 258, 219, 38, -170, -311, -136, 234, 367, 46, -276, -243, -4, 140, 256, 203, -114, -361, -162, 266, 330, 50, -147, -177, -162, 36, 333, 273, -165, -371, -89, 177, 183, 127, 35, -213, -311, 47, 380, 183, -180, -227, -94, -47, 113, 275, 64, -333, -298, 108, 235, 69, -14, -96, -244, -166, 201, 318, -35, -272, -116, 17, 25, 145, 177, -118, -337, -67, 260, 170, -37, -53, -83, -155, 31, 282, 159, -177, -213, 15, 104, 77, 96, 28, -170, -189, 80, 237, 67, -125, -109, -39, -16, 89, 152, 22, -214, -165, 80, 158, 11, -75, -50, -77, -100, 78]
2146G8J14k05k26J29K07o3p1J04l7k32P4K92nk93K0J89r6j20K31R3k78j12K92
2169H5Q1k49K1K21j19k39K00K07k11j73K37J02k58j3K57o1k50J29K14j77j97K00
2191GJ32j96p2J97j4k07Q1K17j00k06J00J23p5m6J06Nj51pJ62L5j18m1K7L0J0
2216aM2K6q2q1J3J44O6j12r9L6N1k9P6R4j52k05J22K54n4j50N6j9j72P0L63l6
2242B21m02j4K32%q4K17J6m10j22M41J80k78p7J20j75j35L86K78l92l49K30J93
2264G6r7Q7J76l17l46K82M33j07k45J6o8j17K11L75j57m22m4K34R1Q7Q2k14l33
2287c17P4L73J45j47j62j75l0K41K77n0k81j75lJ94K65O5l19k66O1K06J80J09
2309B65j27m03j37L81L23j07j74j21j94L7M68K61m16m06J10K02O0K33P5m67m19
$$ y = [78, 192, -13, -239, -110, 97, 34, -37, 67, 30, -202, -128, 164, 159, -134, -114, 75, -21, -141, 90, 183, -95, -207, 85, 166, -83, -62, 159, 40, -199, 1, 208, -3, -176, 61, 163, -95, -108, 149, 88, -162, -33, 181, 4, -193, 7, 139, -57, -129, 68, 54, -153, -72, 145, 45, -161, -61, 62, -13, -59, 47, 52, -99, -106, 56, 91, -27, -68, -41, -11, -1, 41, 67, -15, -96, -83, 61, 127, 15, -84, -48, 3, -26, 50, 144, -8, -213, -91, 163, 109, -41, 15, -4, -176, -106, 257, 221, -181, -195, 37, 37, -47, 170, 186, -224, -346, 95, 275, -3, -80, 40, -135, -270, 116, 394, 2, -347, -117, 76, -21, 66, 242, -75, -421, -139, 294, 187, -58, -42, -110, -227, -16, 359, 202, -220, -264, -30, 61, 148, 230, 16, -317, -243, 130, 275, 128, -34, -209, -239, 2, 279, 229, -52, -227, -230, -36, 229, 294, -25, -291, -230, -24, 156, 265, 138, -265, -402, -21, 302, 195, 21, -100, -294, -257, 211, 472, 56, -350, -240, -38, 22, 255, 330, -137, -556]
2330e56L77N19n6k55m9k02j75M38N05k56n91m1K65P8J96K19l55n53J25N79J51
2351C63k02j39k01k35K87N66k0n19k45J17J42K51K51k42n55q0M48K92oj32l19
2372a78k72K29N42J12l53l10j01J00L57L48k24n30j40K75K78J88Lm01m34J88N38
2393B15J80k19k26k48j23M19N20j26n78k05J89J81K52K07l16o14L0N91K57j68
2413B18j56k52k88K76O29N0n32l05R6J39K53L35k06o37j41M64L52k4j10k71l71
2434d81J34O30K29m12l46n5N6K80M15o9n94k98L31L47J29pk61m52MN55L25k26
2456B34l10j84q6K65M74M7n18l19J39K52K26J58k25n28q8M86L31r6k06k15k36
2477c99J61N56J56m50l60O9J59K20K63j04n42k34L81L71K8j36k05l13L7N21K92
$$ y = [-556, -179, 340, 284, 29, -20, -222, -397, 41, 546, 290, -301, -342, -77, 1, 197, 416, 61, -492, -367, 212, 363, 161, 22, -179, -414, -127, 439, 419, -100, -345, -228, -86, 165, 416, 174, -381, -461, -13, 279, 273, 141, -178, -450, -221, 321, 433, 80, -230, -331, -231, 126, 474, 250, -280, -420, -145, 133, 321, 324, -77, -511, -323, 215, 395, 176, -50, -298, -421, -2, 518, 392, -186, -391, -202, -21, 231, 438, 122, -492, -462, 129, 386, 218, 62, -190, -478, -202, 427, 477, -55, -360, -264, -125, 128, 463, 257, -380, -521, -57, 295, 271, 161, -110, -481, -347, 283, 512, 100, -246, -301, -245, 35, 450, 381, -213, -511, -180, 167, 296, 289, 28, -424, -420, 135, 460, 234, -76, -260, -346, -81, 393, 440, -78, -397, -258, -6, 220, 378, 153, -375, -463, 23, 354, 258, 52, -163, -399, -238, 318, 474, 24, -336, -267, -108, 112, 375, 271, -271, -505, -124, 247, 275, 139, -66, -379, -342, 179, 471]
2498D71l17l59o4O5J90L70K4n00l14K34L44Q5J3j68l86r0M69L32j81k86j21o1
2520b50J21L85J43l82l86J27K50J34J00r1l80j79L25L66k9k26j68j26N1L78K08
2541C71k76l32j6J67J56J82l1l60k26K37L04K8q1j31k25m3L61K49j83k89l3M1
2563a30Q6K43Q6l05k97J60K61M3k2n8k06j33K48L05j10k29o3pK6K13J54k15k80
2586b30N7J94N5M1Rk04j88J89K54k4j61o4l4m3J85J83j15k50j3J47O0K2O0j17
2610A3j87O4J94N2q7q1m0k8J08J33m8j33n9M6M5P3L3j17r3N8Q3LRJ0j12n1J21
2637IQ8r3o5M6ln6Q3J02j21j08R7Q6p0l7Q9l0j07P0J08p3j13R2O5r3rR2j8j15
2665h4O3J17p8q7O6O4o8mQ0m0j19O3J23k8j05K3L1l5MR4Kj51k7J07O6l6l7k1m1
$$ y = [471, 154, -205, -269, -204, -14, 356, 380, -120, -434, -200, 144, 229, 242, 74, -312, -402, 67, 399, 218, -68, -189, -250, -129, 256, 399, 17, -369, -242, 8, 142, 242, 151, -229, -408, -83, 283, 254, 28, -140, -266, -215, 163, 371, 95, -237, -253, -86, 70, 252, 221, -139, -365, -128, 176, 204, 123, -8, -233, -276, 85, 334, 151, -138, -171, -130, -44, 199, 285, -20, -317, -157, 104, 147, 125, 67, -139, -272, -24, 281, 171, -58, -121, -128, -102, 111, 265, 50, -230, -173, 21, 76, 117, 126, -78, -266, -77, 177, 153, -8, -72, -106, -149, 36, 219, 104, -146, -159, -12, 48, 70, 130, 13, -174, -110, 84, 136, 49, -32, -72, -100, 8, 141, 93, -40, -99, -53, -8, 65, 98, -19, -112, -54, 29, 32, 41, 51, -61, -112, 9, 97, 4, -61, -15, -18, -74, 9, 111, -10, -118, -21, 65, -5, -42, 47, 17, -90, -20, 88, 15, -98, -6, 59, -34, -43, 49, 31, -84, -21, 96, 18, -69, -3, 61, -7, -11, 69, 29, -90, -27, 96, 68, -37, -14, 17, -18, -14, 80, 82, -69, -96, 11, 77, 41, 4, -17, -58]
2694e8k6J22R2p9j46j7R4O4KPp3j26RJ84J24j15j48j1L7L9J26N1j59j99O9K17
2720H0N6p6n7p4r5R4K44M2k52j48Q7J19N4P2j9k39j17K03K29k7j83p2l1NJ77J66
2746B38j27k87m2K02J39Ql7j41j86N0L13J36j92k53j3J06J12J60J5k67k63J39
2768a90L43Q4j45j37j17p4J89L53rl84k25J61K18Q5O8j00l50j28L56L41q9k81
2790c1j18l3N5K73K39k39m42k1L28J88Jo2k22k45J13M35J46k74k99l6J36J77K01
2813B70l9l64k46J82L74J10j80k11j58J8K75K97p6l98k22J63L08J51m3k01l02
2834b92n1L45L89j16l80j83Q9J67K50J60k61m70m9M41K93q2j90j92k16J18N06
2855B76K17m03m10L8K31J40J98lm20l62K87N02K6k52j71j46n2L25M00j10n29j77
$$ y = [-58, -84, 38, 130, 51, -95, -112, -18, 46, 48, 55, -18, -144, -135, 49, 173, 58, -90, -101, -64, -25, 101, 152, -7, -206, -137, 80, 136, 60, 3, -71, -166, -72, 172, 214, -38, -186, -99, 20, 74, 146, 127, -112, -229, -26, 203, 176, -7, -79, -110, -105, 72, 238, 111, -176, -218, -16, 123, 131, 94, -47, -233, -183, 130, 266, 74, -179, -192, -86, 26, 186, 201, -66, -329, -190, 153, 237, 92, -45, -162, -236, -47, 306, 297, -87, -312, -151, 67, 152, 220, 120, -230, -358, -2, 339, 250, -31, -149, -182, -127, 146, 385, 146, -296, -317, 11, 199, 200, 138, -84, -329, -216, 219, 365, 91, -208, -244, -108, 69, 270, 231, -133, -379, -197, 177, 287, 107, -104, -262, -244, 31, 328, 252, -146, -368, -205, 103, 254, 211, 10, -292, -343, 2, 391, 275, -105, -288, -199, -32, 218, 378, 117, -353, -402, 39, 332, 250, 60, -132, -348, -230, 276, 493, 90, -320, -282, -51, 89, 287, 284, -136, -498, -211, 291, 317, 65, -106, -252, -304, 21, 421, 311, -218, -395]
2877c95K63K21J13M2k02m00%M52L02j98l04j46K3J80L25Q2l52l65P5L35K56l9
2899B68k32k64j09K58L62J02l22l68rK84K72P3j56l38k18K17M62J31l25l08p0
2920b90J15K45K86o7m66k73K57L85O9j13j75k66p0L93M05j84m38j20J50J23K11
2941A77J66k86m57O3M43J88j51j34j51j53J70M34O3m02k62J18J84J43J27j15l80
2962b15j52L22L42k8k35j77q7Q0K92K11k03l75p0K02K59R3q6k69k12R2L31K10
2984C25j46l02j73J25K33J69j6k39k71PL30K49j01k64j37NJ45K49J01k65l20O3
3006b33K80J17k3n9j84j72J77L34L1k81j50M6M3J35J94r6l34r2K54J94n5n8r8
3029c0j64K7K81J62k04k48J8Q5Q4J39K4k24k10J34K29N3q1j12j17j5J56K04m9
$$ y = [-395, -132, 89, 202, 244, 42, -358, -358, 94, 396, 198, -106, -252, -229, -49, 276, 358, 6, -359, -284, 51, 307, 268, 36, -228, -337, -79, 283, 385, 63, -305, -314, -30, 242, 315, 159, -179, -397, -180, 282, 413, 88, -220, -290, -175, 70, 356, 289, -177, -450, -193, 192, 261, 148, -27, -293, -363, 30, 435, 251, -187, -307, -157, -34, 177, 343, 57, -400, -337, 106, 294, 143, 9, -142, -295, -125, 309, 372, -30, -292, -174, 10, 153, 280, 165, -215, -367, -45, 297, 269, 34, -143, -230, -150, 142, 353, 150, -225, -295, -93, 166, 259, 173, -96, -308, -216, 115, 325, 179, -123, -296, -171, 62, 231, 215, -24, -295, -288, 42, 291, 190, -74, -211, -206, -61, 188, 289, 24, -296, -233, 47, 164, 141, 82, -102, -274, -97, 237, 268, -13, -163, -117, -74, 61, 255, 159, -175, -267, -13, 181, 126, 68, -30, -194, -167, 114, 276, 72, -176, -158, -73, 11, 150, 174, -50, -260, -126, 103, 156, 75, -37, -154, -169, -13, 191, 142]
3052A42k08j07N5J03J31Qj07j64rJ50J43j9j07j22j0J02J26J0p5j17n4J00J37
3075A08J7j11o7pK8Q3Q3o7j41m7J28O2j2qm6j00OJ56N8j17q5M6J4nP6K9j30p5
3103a24R7Q8n0k1K2n1m7P6Q0n2p9K5M8k1K0L7m3p6L5P2j1m6K4%m0J8N0k3l7NL1
3134GJ9j5lk6lL6LNl9j7L2J9J8j8m1j9L4M0Qk4l7m2L4P1Rm3o7J0J4N9M0m8p4k3
3168h1N4P1K2m5n1n9L5J03N2o8p7n2M9O3Q3j7j29p3P1J02M2l6p7q4K4R8J13l2
3196A01j36p6L5Q1J03J6j19j41J8J28J16oj10j20l2J19J46J8j28j45j0J13J49
3219A20L0j27j57l4J08J64M6j10j57o0R7J74Q5j07j67r6R6J88P2o8j87j03R4J66
3243F7J17n7j84j29O1J74J54m9j85j53L2J86J54j9j83j73J6J70J85lj87j88qJ97
$$ y = [142, -66, -173, -118, -15, 116, 124, 17, -147, -156, -6, 137, 118, 11, -111, -121, -19, 107, 117, 42, -75, -129, -29, 108, 125, 14, -53, -60, -32, 51, 134, 67, -74, -121, 7, 69, 57, 49, 3, -97, -91, 65, 123, 6, -79, -33, -19, -24, 52, 81, -49, -124, -27, 61, 11, -10, 12, -39, -86, -10, 70, 18, -61, -36, 12, -9, 11, 48, 5, -71, -36, 36, 25, -21, 3, 3, -37, -19, 31, 8, -29, -24, 7, 26, 11, 8, -18, -21, 15, 18, 23, -16, -33, -1, 18, 36, 18, -23, -42, -8, 32, 40, 16, -21, -63, -29, 42, 51, 8, -59, -49, -35, 24, 64, 16, -58, -81, -27, 44, 66, 21, -30, -89, -54, 49, 101, 33, -44, -96, -47, 16, 99, 82, -47, -120, -49, 53, 95, 59, -18, -102, -78, 20, 133, 101, -35, -111, -76, 5, 108, 124, 5, -136, -118, 10, 126, 120, 10, -110, -142, -23, 123, 141, 13, -132, -142, -29, 120, 150, 23, -134, -168, -60, 104, 150, 40, -117, -177, -80, 94, 179, 72, -95, -191, -95, 93, 165, 97, -90, -193, -99, 67, 184, 127, -57, -186, -125, 49, 203, 154, -31, -184, -152, 34, 188, 169, -14, -187, -171, -1, 184, 181, -6, -194, -202, -5]
3267eJ92J4j84j80n0J50K50M2j72k36l3J49K00P2j14k41j16J64K51P1j48k05r1
3290b20R5K27J49j07k64j38J30K22J38p0k20j97O2K74J83r6k34j43L0J95K33j8
3312B31k55k25N3K22J72Rj83k26n0K19K68j4k11k09l2J64K39Q4j92k67o1J90K47
3335A73O8j55k48j06J41K72J36j56k75j12J41K47J29j14k51j59R3K86J77j22k77
3356a12j43Q8K11K05l4k53k36N9K81J73n6j92j86l7K02K76J5k65k35M8J82J72
3378A63P3j59k75q9K57K49mj98j72n5J00K53J45j95l00n2K05J94P6q1k24k05J44
3401a50L02J15j65k19j03Q5J97J95o1k77k02J27K53J33o6j82j88j1K36K40m7k53
3423d1j88M8J75J78L2j63k34p0K44K17%j88j71j7R9J99J10j42k57n4J86J77J3
$$ y = [-5, 187, 201, 17, -163, -213, -63, 187, 229, 57, -179, -212, -63, 137, 209, 95, -146, -262, -98, 153, 224, 76, -129, -220, -125, 102, 251, 144, -120, -258, -128, 94, 232, 162, -58, -255, -193, 81, 264, 168, -66, -209, -179, 16, 249, 231, -24, -249, -196, 26, 198, 207, 24, -202, -252, -33, 235, 221, 10, -199, -231, -67, 172, 256, 64, -203, -264, -74, 173, 241, 86, -162, -268, -127, 145, 281, 125, -150, -262, -121, 126, 255, 141, -110, -269, -176, 110, 287, 165, -112, -255, -167, 44, 249, 215, -38, -274, -215, 66, 239, 183, -9, -195, -232, -30, 246, 261, -4, -239, -191, -9, 163, 236, 77, -198, -287, -30, 219, 215, 17, -155, -210, -110, 143, 288, 93, -207, -259, -54, 140, 216, 135, -89, -294, -150, 152, 267, 102, -117, -220, -135, 62, 257, 196, -81, -283, -156, 97, 230, 164, -18, -206, -217, 19, 259, 212, -41, -229, -181, -6, 172, 204, 41, -193, -263, -19, 198, 198, 10, -161, -178, -79, 120, 230, 88, -169, -223, -37, 140, 153]
3446A53p2j38j62P3K74J16j79k04k6J00R8J36rk35j67J34K44L9j13r7j03l0J78
3469A0K21o5k60j16J23J42Q1J5j24k13k9K37J89p6j58q8k9O3J83J04j79k21J2
3492a78J73J12Jl7j31j30P1K21Q5j56j43JN9P3J09lj58j39J02J64K7r7m9m0l6
3517i9R3J44k4j75p9J08Q7JNl4j27k9J49J21r2j33RL7K1P2N8r7j55L4J65L1o5
3544B6l3l1o2L5J60M1j46j08P6M7jN6J2j27r0J02J37k3r9J0jm3K9J29k2j33k0
3571g9J01J5l9K8L1p6o1J13M7o3p2Q7J5q0PR8m3r8M9Q2m1q1N2M0m1j9P2j1q7j0
3601f4J07J0p9pM7k2l6O2M2o8p2O4N7k1k3J0no3M7O2k3o4MN6Jk9K1Ll5m1R3L5
3633F9q5m0N4L6m1K4M1p6p8R0Q8j9j03J5K4n2M6R8k1j59k3J07N3k8J2j8j02k8
$$ y = [153, 81, -57, -219, -146, 128, 244, 65, -139, -165, -65, 33, 169, 160, -75, -242, -108, 136, 175, 62, -35, -138, -168, 10, 231, 166, -94, -210, -87, 55, 136, 151, 27, -186, -215, 22, 211, 135, -23, -111, -140, -77, 106, 210, 31, -190, -178, -5, 107, 108, 71, -60, -190, -119, 102, 187, 31, -112, -111, -52, 21, 130, 127, -31, -170, -68, 96, 123, 26, -23, -63, -99, -6, 138, 114, -61, -140, -32, 55, 56, 61, 27, -100, -129, 20, 141, 49, -84, -75, -38, -17, 55, 113, 16, -139, -105, 60, 91, 26, -7, -38, -100, -65, 95, 136, -10, -118, -42, 5, 4, 60, 72, -55, -145, -43, 94, 71, -28, -18, -19, -62, -33, 96, 74, -59, -79, 22, 37, -2, 26, 57, -19, -80, 33, 80, 17, -55, 32, 47, -33, -26, 72, 29, -69, -20, 62, 21, -60, -8, 32, -9, -28, 44, 33, -54, -64, 43, 53, -26, -33, 14, -8, -44, 18, 60, -8, -80, -16, 41, 20, -3, 7, 2, -61, -14, 48, 25, -39, -35, 21, 22, -7, 14, 17, -18, -59, 34, 69, -16, -56, -2, 34, -7, 17, 58, -18, -96, -6, 82, 63, -40, -25, -1, -53, -7, 91, 70, -89, -112, -5, 48, 20, 32, 14, -88, -116]
3661a16J42J06j03j05J4K1pR5P1j07j52N0J28L8k0m9l9p5N7J58J3j26q4L0N3O0
3687E3N1n2j27l8Q7J17Qq2p9k1N0Q8O1o1j24n4Q3J14K1o0r0n6L5J25Q7o9j56l3
3715a22O4R8M8J7j20j49L8J83Q6q3j12n9lR1J59J6j75j39O3J40O6Oo3j58n9J54
3741a3J73nj68q0lM2J32J01j05j85l6J38J12K3n1j24j07N9J98P6j25j31n8M9J38
3766E0R6m7j69q7O7J54P1m2j33j19M2J51J10k8j52j12OJ56J33k4j47j16j6J45
3790a1J53J6j49j57PJ28J36L3j09j72m9J50J71J4j26j30l9N8J67J11j25j92m3
3813a58J15J31N4n1j45j32O9K17P8j15j35q2L3J44J33l9j93j05P8J36Q3mj28j57
3837a73K1J74J29n1j28j13pJ22J56J9j47j41RJ15J26M6j14j65k9J24J50M5j10
$$ y = [-116, 26, 132, 29, -76, -62, -41, -48, 47, 118, 11, -141, -91, 37, 75, 55, 6, -33, -108, -51, 107, 120, -6, -90, -60, -7, 53, 104, 52, -75, -113, -26, 91, 99, 17, -62, -83, -33, 55, 116, 55, -69, -123, -40, 74, 95, 35, -55, -111, -76, 49, 136, 67, -89, -122, -58, 40, 88, 105, -15, -164, -126, 57, 143, 60, -52, -111, -114, -23, 136, 152, -23, -162, -99, 41, 107, 113, 50, -108, -167, -13, 160, 155, -13, -93, -96, -54, 78, 179, 74, -111, -147, -9, 103, 126, 75, -49, -156, -97, 101, 177, 52, -79, -137, -88, 50, 146, 99, -70, -157, -90, 64, 135, 93, -40, -159, -117, 34, 144, 116, -36, -148, -142, 14, 147, 123, -24, -140, -156, -11, 142, 158, 9, -148, -141, -13, 123, 156, 47, -125, -174, -24, 147, 161, 35, -95, -134, -76, 91, 202, 77, -115, -158, -43, 88, 142, 91, -54, -186, -117, 100, 178, 63, -72, -154, -121, 23, 156, 117, -76, -181, -103, 33, 116, 112, -16, -173, -152, 22, 151, 100, -28, -141, -148, -26, 130, 149, 2, -139, -130, -15, 111, 157, 43, -122, -151, -27, 123, 168, 58]
3860E8j52n8J00J73M5j09j39n9P4J43R9o7j77q8R9J29Q3n1j39j23N0J69Q9o4j29
3885d4q3QJ21J36lj74j15M3J24Q5J3j04j48pJ47J21j9r5j04k9R0J50L7j28j36
3910a14NR2J07N5p9j46o0J17J27K2o7j02o5M1J37P8q3j22n8P3Q0Q2k3j42p4L6
3936h3J26O0l0r7q9J8J18Q2l4r6o9PP7Q2K2j08q9RQ8O7K3p1j09rQ2J04np4o0m0
3966i8N6R6M5n9j02j3O4O4M1l9q6o1N5J09Om4n4l7KR3N6l1r3m1M1M1M0J3p2p6
3996h4K6Q4K9k7l4m2j4O8N6j8o0l5%M9M0Km8l4k1O1L5Kl8l5nK5N5Nl7l7JK0L8
4029B7J3l2l5LJ5K7J4Lo3j6M5L3%j1k6j9NM1K4m1l7K8J1j1PK7l1m8L7L3k0j3J
4062iQk5J2L6qm1QJ9J1j9KK5l6LL1Qm5kK4J4npJ2k6rL9J6k7k3JK1J3Nqk3k2J6
$$ y = [58, -94, -152, -52, 121, 166, 57, -82, -141, -67, 76, 175, 108, -69, -157, -58, 71, 154, 103, -36, -159, -109, 60, 149, 85, -44, -127, -119, 2, 138, 135, -39, -154, -111, 13, 98, 111, 7, -141, -148, -1, 120, 101, 6, -98, -127, -37, 113, 150, 22, -114, -109, -17, 90, 145, 66, -80, -140, -23, 104, 126, 59, -43, -108, -67, 70, 148, 65, -57, -115, -42, 38, 120, 97, -45, -119, -83, 43, 103, 73, -24, -113, -95, 23, 105, 71, -25, -94, -87, -10, 72, 94, -14, -103, -94, -6, 61, 84, 13, -96, -105, -23, 81, 76, 2, -58, -98, -42, 54, 99, 40, -62, -75, -11, 53, 94, 55, -31, -92, -37, 72, 78, 34, -20, -57, -55, 38, 94, 63, -30, -71, -30, 11, 51, 64, -8, -84, -58, 26, 55, 28, -6, -48, -62, 6, 62, 44, -16, -51, -51, -2, 38, 40, -8, -42, -63, -2, 33, 35, -3, -38, -43, -18, 37, 42, 5, -32, -31, -11, 27, 40, 8, -27, -24, -9, 18, 32, 35, -28, -44, 1, 34, 34, 23, -3, -22, -17, 24, 48, 7, -30, -2, 9, -2, 5, 32, 1, -47, -10, 23, 3, -10, -9, -1, -26, -14, 22, 14, -27, -19, 0, 11, -8, -6, 19, -17, -14, 17, 25, -20, -22, 2, 16, 11, 4, 16, -10, -19, 20, 36, 9, -14, -13, 8, 21, 26, 18, -5, -27, -11]
4099a1M3Nk5k6jRnM4Ll8m1K6M2Lj8k1rk4L6N0j6n6kJ3K6%J1j6n1LN3L4l7l2Kn
4135c1K2L1L6o0o5L5N7J7k4j0k9j7L0P3J1p3m1PL6J7L2lr0l2O2O4ml9k9k3kO0
4167A8P5m8q4k8N7L6J0K2n9n4JP0O6m3o9j0NK5N6L4q7q0L0N9M7pl5m8k9L8J05
4198G3nq5m7J6M9M5K0k8q7l3P4R5k7n5m0j3K6N6O7n9j06j7P2N7K3k5p3o9K6J16
4228D6N1n1r2k2K4M8O5Rq5j01K7J03M4k0m5n7k4M6J16Rr8p4J7O2L5L0k1r5m5R3
4258eQ0j3o3n8NJ6P6O2n6j02k7Q0O4Rl8m6n9L4J02M6o5r7j4L5N8M7lj03o8L4J18
4289D9M5m5p2n1qP4Q9mj00p4K9O0O5J0m6q2l9Q4R1jp3o1j3L0O8N5m3r5m0P2P8
4320E2Lk5m5n9J4R4N1n7p5k8N1M0L5J0p2q8M8R4K8m0n6k4jN9O4qq4o3M4O1K6O
$$ y = [-11, 32, 37, 12, -14, -15, -6, -11, 33, 36, -2, -43, -17, 25, 28, 10, -11, -20, -44, -8, 42, 26, -30, -32, -19, 7, 7, 18, 2, -49, -46, 7, 41, 4, -28, -26, -31, -9, 22, 58, -2, -67, -32, 25, 42, 18, 8, -21, -38, -8, 65, 76, 3, -38, -31, 5, 22, 54, 51, -39, -71, -9, 55, 51, 12, -17, -40, -42, 18, 93, 45, -39, -67, -10, 26, 36, 58, -1, -55, -54, 16, 82, 39, -30, -40, -35, -10, 46, 80, -7, -87, -57, 2, 49, 42, 7, -41, -70, -32, 73, 68, -17, -64, -48, 1, 46, 66, 38, -49, -82, -8, 87, 60, 5, -35, -48, -22, 34, 101, 42, -64, -81, -9, 48, 71, 46, -27, -96, -70, 46, 97, 46, -46, -68, -44, 4, 69, 78, -7, -108, -81, 22, 66, 46, 1, -56, -80, -34, 82, 91, -7, -81, -64, -2, 33, 63, 42, -53, -98, -5, 75, 62, -1, -59, -54, -38, 38, 100, 44, -58, -85, -5, 59, 68, 30, -16, -75, -41, 61, 107, 42, -55, -69, -34, 24, 71, 68, -35, -103, -69, 49, 94, 49, -23, -74, -82, -8, 81, 77, -23, -97, -68, -8, 57, 67, 21, -61, -100, -16, 75, 74, 1, -60, -73, -43, 25, 80, 37, -58, -98, -26, 52, 55, 30, -15, -74, -60, 34, 85, 28, -47, -75, -24, 16, 51, 61, -11, -99, -51, 43, 71, 31, -25, -49, -50, 9, 73, 65, -19, -82, -38, 23, 49, 55]
4352E5n0o6j8P0Q5pq7l4j5M5O3L4n7p0qM5O3Mj9o3k9K3Q2M0m9q0k2M1M8J7om4
4384io0K2Q1J9k9m9l0J5L4M9Ln8n1K6N4K5j4k6m0k5O4L8J0n2m8K4K0M0J7k1p5
4415d6jM7M3pk8l1k1K3N5K7m2o5OL6K3J4nm8l4K4N2K2l5k5j9RL4L0km8l6K9M0
4448B1J3nl1k5j2L7M1j4k4l4J3K2K3jj7m1J3K9K9j0k4j4oJ5K8Pj8k5j0K9J1r%
4481A1j9j3J7M0jk3l3ROJ6K%k1j0OL7j2k0Jj5OJ1L0pl1j3K9mJ0Nj4k5J7J8Ok4
4517hLm%J1K2j6nqOJ1Mj1nqJ0LLJmrNJ6%j3kmkK3k0J1o%qJ1mOj9nJ1J5lj9jlJ7
4562BpK%j5LJ9J1j3qNqJ8ORj9j5lJ5J3Nj2j7NJ0NJ3j1k9KRJ9Qmk1PmKK4Jl2j0
4603a5J6J6Lpk2oJ1J5J3j0l4MOJ8J2j4k1nKJ0K4jl4j3J2K0K1j2ok7J0J4J9J1l1
$$ y = [55, 5, -61, -79, -9, 76, 69, -18, -52, -67, -22, 41, 75, 18, -52, -60, -15, 48, 52, 33, -30, -59, -36, 46, 86, 37, -43, -65, -24, 24, 41, 35, -9, -69, -47, 34, 53, 24, -25, -55, -40, -6, 43, 46, -12, -63, -37, 17, 42, 28, 2, -38, -63, 1, 39, 49, -3, -51, -27, -7, 33, 50, 29, -46, -47, 0, 43, 36, 8, -23, -44, -21, 34, 61, 19, -46, -40, -4, 19, 33, 28, -20, -54, -30, 22, 44, 9, -16, -35, -26, 8, 38, 36, -12, -48, -19, 21, 34, 29, -2, -27, -39, -2, 39, 25, 1, -33, -20, 2, 25, 24, 7, -34, -21, 8, 37, 27, 3, -11, -17, -2, 26, 33, 15, -10, -20, 9, 20, 11, 11, -8, -21, -4, 36, 35, 12, -21, -12, -6, 10, 12, 12, -9, -19, -13, 24, 12, -8, -7, -22, -16, -5, 25, 18, -13, -26, 3, -1, 9, 14, 0, -25, -8, 10, 16, -8, -5, -9, -9, 2, 24, 8, 3, -5, 1, 12, 16, 5, 0, -8, 2, 5, 8, 9, 5, -4, 1, 17, 17, 4, 2, -2, -4, 19, -1, 10, 4, 4, -4, 7, 3, 9, -10, -15, -4, 11, 8, -11, -12, -15, 2, -5, -3, -3, -18, -15, 4, 15, 2, -6, -1, -9, 9, 15, 24, 5, -10, -13, 2, 15, 20, 8, -9, -4, 6, 11, 24, 13, -16, -14, -5, 14, 22, 18, -3, 4, 0, 2, 26, 27, -5, -15, 1, 17, 20, 13, -9, -15, -4, 11, 24, 14, -20, -16, -10, 8, 20, 6, -15, -20, -18, -8, 16, 15, -19, -32, -20, 0, 21, 9, 3, -24, -14, 0, 19, 30, -1]
4638aj9%J9K3J5k9j1j4K2K7nj7j4j0J3K7Jj6j7k3K1L0Lkm6%J6K5Nj2j1k1pM7K1
4673D0k7k8rmK3K9Nl5k3KK7J3Nk4l1NL0K9ll5q%J8K2Mj6j7qQL7Rj0m3qK8K5J2
4710D2j5l1k1K2K0K0j2l4j4LL4QQl6k2RK5K7j2k6k3J2OL0mj7k6NJ8K5Kj6l8jK2
4745a0L1Mj8j4j3NK8J6j3m2MJ2L0J5k3j0k8J2L5K8k7j9k6QL1J2pk2j8JK7K1j4
4778A6j2k6J6J4K0Jk5l4oK7K5kpl4mPL7Jk2j7j4K1K3K3j9l4KK0J9Mk1Ql0J6QK5
4814B6j7k1j0J2OL3%k9k4J8OL0j3j1pj9J1M6j6j3k6RK5qK2j1k7j3jM0Lk2j6KJ3
4849bJ0Qj6j3k4L0QJ9k5onQQK0j4k1oRJ3J4%nl9OL4J3%k6Jj2K1J4J0k7qpJ4J5
4887A9KKl3KJ5Nkj0ppPK4qMj8njK5K%k9nLK2OJj8j8J2PPlj0j0J4LJ0k0NnPLmJ5
$$ y = [-1, -20, -20, -1, 22, 37, 8, -3, -17, 5, 32, 27, 10, -4, -14, -1, 26, 27, 11, -6, -29, -8, 22, 25, 23, -23, -23, -7, 18, 23, 11, 0, -21, -28, 19, 40, 13, -15, -24, -28, -5, 24, 29, -6, -29, -27, 0, 13, 18, -6, -37, -32, -2, 27, 24, -11, -19, -19, -1, 21, 25, 9, -8, -16, -8, 29, 38, 28, -15, -23, 5, 30, 42, 27, -4, -25, -3, 17, 37, 25, -9, -23, -20, 14, 22, 30, -6, -28, -19, 6, 33, 21, -5, -28, -16, -10, 20, 16, -1, -27, -22, -4, 21, 23, 7, -31, -32, -10, 21, 25, 7, -7, -20, -15, 13, 29, 16, -26, -22, -10, 20, 35, 12, 2, -26, -14, 21, 49, 22, 3, -23, -15, 16, 28, 21, -1, -19, -18, 9, 30, 16, 4, -22, -6, 8, 28, 29, 4, -30, -36, -9, 16, 14, 7, -27, -31, -24, 13, 14, -8, -25, -39, -18, 5, 28, 9, -25, -23, -3, 16, 20, -1, 7, -23, -7, 1, 26, 9, -12, -22, -10, -4, 29, 29, 0, -24, -6, 0, 30, 17, 6, -1, -20, -9, 37, 21, 8, -18, -9, 16, 8, 30, 19, -8, -21, -22, 18, 21, -1, -17, -15, -2, 8, 16, 0, -13, -37, -7, 1, 20, -5, -11, -16, -8, 0, 20, 6, -15, -21, -12, 1, 15, 15, 10, -29, -23, 11, 24, 24, -2, -1, -13, 8, 22, 32, 5, -3, -10, 4, 19, 21, 23, -10, -8, 7, 12, 10, 0, -7, -14, -7, 17, 9, 13, -5, -10, -11, 14, 16, 16, -13, -18, -15, 7, 13, 14, -4, -22, -10, -3, 4, 1, -9, -19, -5, -2, 8, -12, -7, -12, -5, -2, -6, 9]
4931IqkpJ5Mj2Ooj4J9J3Oj1rnOJ1KRk3j7J5J2jrqOoJ1L%j9QnJ0jlRj2J0Ojj3%
4975bnPNqJ6j1k7K1Qjj5PRpmJ2J8l4KK0j2RL%pkNJ3j1j1J1Jn%PrjjMmk%KQojn
5022cJmLR%j1pJ1rMJ1k1JLQkRkj5oJ0K3j4OrR%jjjj3JJ8%JjkOj1kK0Pk7qQJ0r
5069@J3%j7lJ4lLj0QmJJ3lj9j0OJ1%ljmnJ1J4Lj8j6J1NOn%j9J5KJ1J5j5qJ1oj
5111CJ6Jk4mJ0QPrmonJ9Kj3KpKkRJ2k3lOLJ2Nj2nj3NK4lk0J0j2NJ2J0qk3lJ5P
5154FLj7Nj1nJ5J4Kk2oOJ7K4j6j6nNJ9lKj2j4mK7kMj5j4MJ7J2Nj4j5j7J7K3Rj4
5193A4l1PJ0J4Kk0j4nJ8K1Nj2k0MlJ9K1j2k3j0OK1Mpj2k5J2K1J7j1j2nj0kL6m
5229A4j3j2MJ5NMoj8lJ2K2q%j3j6K7OQjj8k3J1J3J0qj1k4K4J0MLj3k1PK3J0j5
$$ y = [9, 1, -1, -8, 7, 11, -1, 5, -1, -15, 4, 17, 23, 12, 3, -2, 4, 15, 17, 26, 3, -14, 1, 13, 12, 3, -5, 1, -5, 6, 9, 9, -10, -2, -7, 3, 2, -1, 8, -4, 6, 12, 11, -2, -2, -7, 0, 5, -3, 13, 2, -25, -4, 4, 3, -12, -5, 4, -3, -7, 5, 23, -11, -9, 11, -1, 8, 11, 11, 4, 2, 7, 20, 9, -2, 9, 10, 5, 5, 12, 3, 2, 1, 5, 1, -1, -1, 1, 9, 3, 2, -3, -2, -6, -3, 6, 6, -5, -12, -1, -10, -6, 5, -16, -15, -12, -4, -6, 3, 1, -14, -20, -10, 13, -1, 5, -4, 5, 5, 4, 3, 2, -11, -10, 8, 8, 9, 8, 6, 12, 1, -1, 19, 26, -1, -9, -1, 9, 0, 13, 13, -4, -7, 7, 4, 7, -3, 5, 1, 2, 15, 12, -7, -17, -11, 0, 0, -3, -4, -8, -13, -2, 12, 15, -3, -19, -8, -3, 3, -2, -2, -21, -6, -4, 7, 22, 7, -1, 10, 4, 3, 19, 20, -4, -8, 2, 10, 17, 8, 4, -2, -7, 12, 14, 1, 3, -4, -2, -4, 5, 17, -6, -9, -3, 0, 12, 17, 5, 0, -13, -8, 16, 13, -7, 3, -9, -4, 8, 18, 10, -13, -16, -1, 6, 9, -8, -3, -14, -19, -4, 10, 12, -10, -16, -10, 7, 31, 15, -1, -6, -1, 18, 15, 17, 5, -9, -13, 14, 12, 16, 1, -13, -9, 8, 20, 25, 11, -4, -21, -4, 19, 28, 14, -17, -10, 0, 14, 16, -4, -18, -23, -5, 16, 21, 9, -11, -7, -10, 9, 30, 18, -5, -15, -9, 12, 16, 9, -3, -28, -16, 5, 22, 11, -1, -6, -16, -18, 18, 14, 1, -11, -7, 8, 13, 17, 11, -7, -10, 2, 24, 16, 16, 3, -13, 14, 20, 28, 27, 9, -14, -3, 10, 20, 12, 1, -23, 1, 11, 15, 18, 5, -16, -9, 14, 24, 9]
5266Iqmj3K0J5nj3k2OK1K2qk6j6OJ6J3J3k5Mj1RJ8orJprK1Rrj6rMK4LrqnOQJ5
5308B5j4j6kJ7J0Lrj9l%OK1j3j0j5J0POJ6k2k4J1K1J0rmk3MJ4J4Nj4j5MJ6P%n
5346A0k0KKK0okpkkNJ4rj5j1J8J8m%roJ1JNkqj0J3PJ3lk9mMPJ3j0Kjj9K0%Jk4
5389a7lJ4KMjOl2QPK8j9J2l0RJ0P%Nrk1J5J1Qj0Nj2j2K4J0k1krNPLOjj2%J5Rj2
5431Gj3LJ%J1prqJ8J4j3j1J2lj6J6OqmqJ3jj1J3j0jJmRrJ2rJ6k3K0%j1jK3j3N
5472GoQqLj4J8nJj3JJ4LkKJnjMJ0j8J0QqJnmpKJ5jj5pJ0KoJ4Jj0jjRj2lPmJ1m
5519BRok9J0NnK2%j6llJ4Lj3kQKnJ0J1k9QRJ6Pj1j4nJ1PJ6j0k4P%lK2j3oj0kM
5561fL1j9Pj1rJ3JK0j3k0lJ2NmNKl0NK6Nl1LnQMK1qj1k0LL2jpk5J1oK3J9Jj9j9
$$ y = [9, 1, -3, -16, 4, 19, 14, 1, -21, -15, 6, 28, 20, -6, -22, -16, 0, 13, 26, 1, 5, -6, 3, 21, 15, 6, 7, 0, -9, 12, 21, 12, -4, -13, -9, 15, 18, 9, 1, -4, 2, 10, 25, 11, -5, -7, 10, 20, 23, 14, -5, -8, -8, -2, 19, 6, -4, -19, -9, -2, 4, 20, -2, -26, -15, 6, 16, 7, 3, -20, -16, -2, 12, 17, 3, -12, -8, 8, 15, 15, 10, -10, -8, -6, 14, 8, 6, -1, -3, -5, 0, 14, 5, -10, -21, -3, 15, 11, 11, 2, -4, 7, 8, 13, 11, 3, -7, 6, 13, 26, 23, -6, -10, -6, 1, 14, 4, 6, 5, -14, 6, 6, 7, -17, -20, -6, -4, 0, -1, 5, -27, -19, -12, 16, -3, 9, -21, -12, -2, 5, 5, 10, 1, -20, -5, 6, 14, 4, 9, -3, -15, 9, 19, -2, -4, -13, -8, -1, 2, 8, 7, -5, -5, 10, 19, 7, -6, -3, -2, -2, 9, 2, -7, -15, 3, 17, 4, -7, 5, 2, -14, 2, 8, 0, -4, -12, 1, 0, -11, 2, -8, -9, -8, -12, -3, -12, 0, -9, 7, -16, 4, 4, -7, -8, 15, 2, 7, 1, 9, 1, 4, -10, 8, 3, 4, -9, -8, 6, 9, 7, 9, 10, 5, 4, 8, 18, 0, 10, 18, 10, 11, 6, 2, -5, -3, 12, 11, -4, -11, -1, 1, -5, 9, 10, 0, -1, -2, 7, -5, -8, -1, -5, 6, 2, 11, 5, -24, -14, -9, -14, 8, 8, -8, -11, -14, 0, 3, -10, -12, -4, -2, -7, 3, 14, -15, -7, 2, 18, 25, 14, 0, -5, 6, 13, 29, 19, -5, 2, 2, -1, 21, 8, 2, -8, -10, -6, 25, 6, 13, 2, -7, 6, 7, 27, 14, -6, -9, 3, 8, 4, 9, 11, -19, -14, 12, 17, -14, -11, -16, -8, -4, 17, 9, -2, -22, -19, 13, 12, 5, -20, -9, -15, 8, 27, 28, 9, -10]
5602a0J6J1Nrjj8%K5Pj1j5%kQJ9%mm2jJ9J9Kj9j1qJ5K1J1k9j6%PJ8lKrj5LJ7R
5642A1qj2r%L0Qjj8k4J7J2J1j1%j8kJ9K0lj9j1NJ6QLnk7NJ6K5mk2nj2nL6J4k8
5680A2k2LJ9j3K2oj8j6mL8lkk2kj4K6K9ol9J%J5J8qnk7LK4K0j6j9pJ2lJ3J9l1
5717ij1RJ2J3Rk6jqQK9Jkk9lJ2K0lmj6j9J5K5Qj9k0Oj2J6K0Ml5j4J5J8kKj1j5
5755a7qK8J7j5k1%mK4MJ5j7l0J2OK9poj3rOK3J4l0j2PJ8JJ5qk1plJ4J7j4j5K%
5793eL2qLl4LLK4pqKk3J0J4Nlj4lj0J7K4nk6k0J1J7K0j6j6jlJ4Ojj1mPP%Mj2L
5834dj0K0J4Rk4q%lK1Qj9jj0OK7j2nLj8kJ4MJj3qKJ8Joj0PoONJoj8J6Mjlmj7J8
5878cKOql%j0K2rJ4%j8QJKJJj6KK2ljkqqJ5J2ojqkJ6qoQj1NoJ5krpkQLj8J1mM
$$ y = [-10, 6, 17, 22, 13, 12, -6, -6, 19, 26, 15, 0, 0, -2, 6, 25, 25, 21, -21, -22, -3, 16, 18, -1, -12, -20, -5, 16, 27, -2, -18, -18, -11, 7, 4, 6, -3, -18, -15, 2, 11, 3, -9, -18, -18, 12, 20, 19, 1, -23, -6, 6, 17, 6, 6, -12, -14, 5, 25, 22, 3, -8, -3, 13, 21, 24, 19, -8, -3, 13, 38, 34, 12, 7, -5, -10, 26, 40, 12, -10, -7, 12, -1, 21, 15, -3, -19, -23, 15, 12, 10, -12, -14, -28, -2, 27, 21, -18, -17, -17, -2, 16, 8, 3, -24, -21, 3, 23, 7, -12, -19, -7, -10, 3, 22, -9, -20, -11, 1, 14, 23, -3, -4, -12, -4, 25, 26, 24, -5, -8, 4, 24, 21, 17, 1, -18, -3, 22, 30, 11, -9, -3, -15, 1, 21, 25, -10, -24, -9, 9, 7, 9, -2, -17, -25, 3, 20, 5, -16, -16, -20, 4, 8, 23, 6, -24, -12, -6, 23, 16, 10, -3, -12, -6, 17, 31, 1, -11, -4, 14, 15, 30, 22, 1, -6, -9, 5, 22, 8, -7, -5, -5, 27, 19, 22, -12, -9, -6, 18, 11, 3, 5, -18, -8, 6, 11, 8, -6, -9, -19, -2, 22, 17, -9, -29, -18, -1, 19, 3, -13, -14, -17, -3, 3, 2, -9, -13, -6, 1, 1, 5, -7, -4, -14, 6, 20, 29, 5, -3, -3, -6, 15, 23, 4, 3, -7, -1, 26, 14, 9, 12, -6, -8, 6, 10, 11, -2, -10, -8, 10, 11, 5, -5, 2, -4, 2, 7, 8, 2, -16, 0, 4, 3, 0, -4, -21, -3, -1, 5, -3, -6, -6, -16, 6, -3, 11, 11, -7, 1, 2, 4, 5, 6, -10, -8, 14, 11, 10, 8, 0, -8, 7, 19, 13, 12, 4, 2, 18, 10, 4, 12, 1, 6, 0, 15, 13, 4, -3, -5, 3, 6, -12, -1, -5, -1]
5926aj1J2nQj0%J8nplQpnJ3omLKKJPLk0NJ4Pj5oPl%QpjOjkMnOrLLJ3j1jlOkPo
5977A0Nj0%J3j6Rmoj1OJ8j1j1nMkK0mk3lLJ3Qj5jJ7pPKLlqj3J0K2%oj4%LK0qK
6020A4k6nNK8kMrj8PJ5J1pj6j3J1lK2pj4pOK0oMj8nnjK5Lk5j5J1J3J0J1k0j2p
6059b1J8RMkk6qK0J7NLj6k0K2OMKj8jqL3%j4oj5OJ8nJ8k7oRLK8j2j4k3lJ9RJ8
6099B6k9j0oJ2K4Jj5j1j3J1K0kpk4J1oL9nk2j0j2J6K0Mrj0j9K4K1mrk5lJ0J5K0
6135B3j5nk3J7J4M%j2qnK0K0j3rk2lJ7K1Pk0j5j2J6J8Kj1k8PK0K5j9j1j4QJ1O
6171A1Rj5k3mQK9J4k7rj1jL9lj1qk2J4K6J0j5j1j6%K2K1j6pnoJ2J3Oj4k0nK8J6
6208B9nj0pk4RJ9J1k4j2kJ5J4Qj3l2%J8K6%qk8KmK0J8j7k1jOJ2Mj1KlnL1kpkk1
$$ y = [-1, -12, 0, -5, 3, -7, -7, 11, 6, -1, -4, 4, -3, -8, 5, -1, -5, -2, 0, 2, 3, 10, 13, -7, -2, 12, 19, 4, -2, 5, 2, 2, 10, 3, 2, 8, 7, 5, 9, 4, 10, 1, 4, 7, 20, 9, 8, 5, 11, 9, 16, 10, 15, 5, 5, 18, 2, 11, 7, 1, -10, -4, 14, 3, -8, -13, -9, -11, 9, 5, -18, -21, -18, -5, 3, -12, -13, 4, -3, 4, 6, 9, 6, -2, -15, -5, 17, 17, 11, -3, -3, 0, 20, 12, 14, -12, -17, -12, 16, 14, 18, 9, -9, -2, 13, 24, 17, 1, -12, -1, -4, 18, 11, -3, -10, -4, 16, 10, 14, -4, -9, -14, -15, 10, 13, -12, -27, -16, -3, 7, 18, -2, -14, -21, -3, 6, 10, 8, -18, -26, -6, 11, 16, 19, 3, -17, 5, 11, 15, 17, -1, -2, -10, 23, 23, 9, 3, -12, -6, 12, 7, 25, -2, -8, 1, 4, 32, 20, 6, -17, -20, -1, 8, 26, -3, -13, -19, -7, 17, 18, 3, -8, -21, -10, 10, 8, 1, -23, -12, -18, 21, 16, -6, -16, -28, -12, 8, 12, 3, -7, -26, -2, 19, 15, 6, -19, -22, -12, 3, 23, 8, 3, -20, -3, 11, 15, 15, 3, -5, -10, 10, 30, 17, 8, -14, -17, 0, 21, 28, 8, -7, -19, -3, 15, 17, 6, -22, -15, 5, 30, 11, 0, -14, -6, 5, 11, 20, 5, -18, -22, -14, 15, 29, 2, -7, -18, -19, 20, 17, 6, -2, -24, -10, 16, 26, 11, 0, -16, -16, 6, 27, 11, 4, -1, -7, 5, 18, 24, 10, -10, -15, 13, 29, 24, 14, 7, -17, -8, 11, 22, -2, -14, -16, -1, 13, 21, 8, -24, -24, -6, 20, 20, 12, -16, -14, -18, 2, 20, 3, -18, -19, -13, -1, 3, -8, -6, -9, -14, 17, 15, 8, 6, -15]
6248a5%J3J6%l1%qJ0L8j2mj6pPJ8J0j4j1j4K5ORpj1r%L2Nl0j5RRJ0JPk2rJ2KJ
6288EJ0mj7KJ6kJl8J2J6LLRj4l2J6J5K3j8j5PmNK6nk5j0kJ8MOmpj5J7OPk3J0m
6328bNJK6j7j5MRKnpJ4j1nJ6Mnj4qJ2rNKLk7J0PPj8kJ0%j0J4%llJ5oMj6J1Lj3
6371a2PK0j4mQlKmJ0J1j8j4J6LKk2J5N%rLpMJ3jjj5J7pqKJ8qloOMj5Pj1Rj0K5
6414A5j5olRJmj6J5j2lK0KlmmqQLQLrj2K2kQj2oMNJ2Koj3MMLRj4mj8J1K1kj0o
6459c%J1ORpj9j2J1RMLj0nPmK0j0k0j0J5MlRpj0kJ9J3k0nlJJ7J5nk3lj2K8J3j4
6500GLj1pJ0J5Kj4j2KOK0rjk1pK3J6jrj4j2LK5Kqj2rPmK4j0j4j3MK6Ppk1LKJ2
6541CJ4%j6j2J1NJ4j0j4%qMJ8Nj3j6ORJ4Qj1k0jJ3J3Nmk1OJJ0J9ql7MJ0QK1k3
$$ y = [-15, -15, -2, 14, 14, -17, -17, -25, -15, 23, 11, 7, -9, -16, -9, 9, 19, 5, -6, -20, 5, 11, 20, 13, 2, -7, -7, 25, 30, 0, -15, -6, 3, 13, 14, 21, -1, -10, 2, 4, 5, 15, 11, -6, -4, 12, 10, 11, -27, -15, 1, 4, 7, 16, 2, -30, -14, 1, 24, 6, -9, -2, -6, -1, 25, 20, -5, -15, -17, 1, 5, 11, 7, 0, -15, 2, 8, 15, -8, 2, -2, 3, 4, 30, 13, -2, 2, 11, 13, 8, 1, 15, 4, -1, 15, 19, 14, 0, -8, 4, -5, 0, 2, 5, -22, -12, -5, 2, -16, -18, -8, -8, -18, -4, -4, -7, -10, 5, -1, 3, -13, -2, 1, -12, -5, 15, 1, -3, 5, 2, 4, 0, 10, 21, 3, -11, 5, 8, 10, -12, 3, 8, 8, -1, 2, -5, -1, 12, 11, 10, -5, 12, 5, -3, -1, 17, 9, 6, 0, 6, 10, -5, 2, -9, 0, -10, 15, 0, -6, -9, 0, 1, -3, -19, -4, -16, -19, 1, 3, 0, -4, -8, -16, -8, -5, 3, 6, -3, -15, 7, 5, 13, 1, -5, -1, 4, 16, 18, 12, -1, 3, 7, 10, 19, 5, 1, -17, -6, 15, 13, 3, -3, -3, 8, 14, 23, 16, -3, -15, -4, 5, 9, 12, 2, -3, 4, 0, 20, 10, -10, -20, -5, -1, -4, 5, -2, -12, -14, 5, 18, -2, -7, -10, -9, 8, 23, 18, -5, -8, -20, 8, 21, 7, 10, -1, -8, 2, 17, 19, 5, -7, -5, 1, 21, 12, 11, -10, -17, 6, 22, 21, 12, -2, -14, -11, 14, 16, 8, -4, -13, -6, -10, 14, 4, -10, -23, -19, 7, 14, 7, -14, -11, -9, 3, 17, 17, 1, -11, 0, 5, 19, 9, -5, -5, -13, -9, 9, 14, 1, -15, -9, 0, 14, 22, 11, -9, -10, 3, 16, 21, 17, -4, 2, 3, 13, 32, 24, -13, -9, 1, 9, 30, 7]
6580Gj9QqJ6J4pk5LJOJ9j3ok4PK1J2j3ppJJ4J2Jj5j1kJ9LJ3nk8lNL0lj9j0pQK6
6621A4J5k4j5nK3LJ0j6oj%OK2j2k1j4J3J6LJ3k3j3KJ4MRqk0%J2Roqmj2J5J2Oj4
6660aj9nJ9K3oj6pKJ2QJ5k8j4OJ0J1Rlj4rJ7NLnj4j5J4J9Jopj9lL0Omj0nqJ1K8
6701C1k0j1oN%J4Kj5rk0L3OJj5j3%J1J4jj1oqJ0J1J0jj7oMJ0RqomRQKnrj2OK0
6743A3J9k0KqlOJ0oj3j9K5oJ7kkk0lRK7k0j1J3j1mRJ2j2jpJ3jo%j1%J5lMJj2j2
6784a8K1KRKk7qK2pJ2Mk7PJ5rJ4Rrj0OQmQj3J0k1J8Mpj7RJkJJQj7oLJ7j9KJOo
6828gJ3pmj2%RLJ5j4KjnJ8j0RmKj3PJQk1RN%PkRj7J1LjmPMloJ1j3MLOqrQlJOk0
6877cJ4kqONknj4J1%oJ1j9JJ5j3J1pjRj3J6j1J4%j0qPjJ5njojNOlj3MJ7mk%nj2
$$ y = [7, -12, -4, -12, 4, 18, 11, -14, -11, -10, -4, 15, 2, -4, -28, -21, 0, 12, -1, -8, -15, -14, 0, 12, 13, -2, -13, -15, 4, 7, 20, 15, -13, -16, -11, 19, 16, -3, -13, -20, -12, 14, 29, 5, -10, -15, 8, 11, 21, 5, -1, -2, -2, 4, 26, 14, -7, -21, -8, 8, 11, 24, 1, -12, -10, 4, 8, 17, 9, -11, -11, 1, 10, 4, -4, -8, -20, -5, 7, 13, -1, -20, -25, -6, 17, 11, -5, -12, -10, 2, 10, 25, -3, -17, -11, -1, 10, 19, 16, 2, -7, 10, 15, 18, 13, -1, -16, -2, 17, 18, 12, 5, -14, -17, 13, 19, 15, 5, 0, -8, 3, 31, 11, 0, -6, -1, -1, 13, 15, 0, -9, -29, 4, 10, 11, -4, -17, -17, -6, 8, 7, -4, -10, -18, -8, 3, 13, 12, -5, -11, -7, 3, 12, 4, -2, -6, 3, 11, 13, 8, -1, -13, -7, 13, 32, 12, 14, 6, 3, 9, 19, 13, 0, -19, 6, 0, 17, 15, 13, -7, -10, -1, 26, 6, -5, 8, -3, -7, 2, 14, 2, 1, -6, 7, 6, 0, 0, -11, -11, 4, 1, 5, 6, -6, -18, 3, 5, 14, 16, -11, -19, 3, -4, 8, 12, -15, -8, 7, -2, 12, 21, 12, 2, 8, 16, 12, 20, 7, 17, -4, 14, 18, 11, -6, 3, 4, 2, 3, 4, 12, -5, -11, -8, 9, -10, -8, -7, -1, -7, 6, -1, -5, -17, -17, -8, -5, 10, -4, -2, -3, -8, 10, 0, 9, 5, 7, -6, 1, 2, 10, -11, -2, 3, 3, 10, 8, 17, 0, 11, 14, 13, 9, 16, 20, 17, 11, 22, 9, 13, 16, 22, 14, 5, 13, 10, 11, 17, -3, 11, 9, 1, 7, 12, 10, 5, -9, 2, 2, -4, 7, -12, -11, 4, -9, 2, -5, -6, 3, -10, 6, -5, 9, 9, -1, -9, -2, -3, 12, 7, 6, 0, -1, 4, 10, 7, -6, -2, 15, 11, 9, 9, 4, -8]
6922hlK8oj0Oj5LJ1J0j3MqQNLj2RrpJ2Onj0Njj1J2%jj5kJ7OlojoJJ2Rk4jqJ5L
6967@Pj1%kmL3plnokPK0pj3j5QOQmj2MOOJ0mk5kJJ3J8ok0poK5mp%jj1OK2Nk2j7
7013a8QjJ2JJj7mJ0J1Kokl%NPkj3j9K6J1Mj2kjnJ6NLj7mJ1kJ0Lj4j2kJ5MOj5k
7056brJ1J5pn%j5J3K1lj8oj%K1kj3jjMPRol0rRL5pj1kj7lK3K4k1j2j5K1OQJkk0
7099a0J0kJ3Kj0ojORJ4k5rpK2J2%j9%k3K1J6nj1rN%K3j6Qj6lNJ0J2kk4rQQK6j1
7140A2j6nJ1Q%Qj4j9RJ3J3j6%m%MJ4mj8MJjPOPk1kMK0jk2LrJ7j0K1j5j7J1jJ8
7181A6lj2j0kRJ3Mj1j8J0pJ0J6kk1pRJ5knj1pRNLMkj7mK2Opjj1kkJ6Rqj6NJ2%
$$ y = [-8, -11, 17, 11, 1, 7, -8, -5, 6, 16, 3, 7, -1, 7, 12, 15, 3, 12, 3, -4, 8, 14, 9, -1, 4, 3, -8, 4, 4, 3, -12, -14, 3, 9, 6, 0, -1, -7, -6, 6, 15, -9, -10, -18, -3, 0, 7, -4, -4, -6, -10, 23, 16, 13, 8, 2, 0, 7, 27, 20, 7, -8, 0, 6, 14, 10, -2, 2, 8, 14, 24, 20, -5, -7, -6, 7, 25, 19, -1, -8, -14, 11, 7, 0, 0, -1, -12, -6, 16, 21, -1, -18, -10, -11, 1, 2, 3, -14, -18, -8, 3, 5, -1, -3, -6, -6, -1, 6, 4, -9, -28, -2, 9, 13, 1, -1, -2, -7, 9, 14, 17, 0, -4, 7, 5, 15, 18, 4, -8, -10, 5, 9, 15, 0, -2, -11, 0, 15, 8, 3, 3, -12, 1, 22, 19, 1, -5, -6, -6, 15, 13, 0, -1, -2, 2, 9, 18, 12, -18, -27, -18, 17, 10, -1, -3, -20, -23, 0, 24, 3, -9, -24, -3, 3, 11, 12, 10, -10, 0, -2, 11, 13, 3, -3, -4, 2, 11, 25, 0, -9, -16, 6, 18, 18, -1, -1, -24, -3, 13, 8, -3, -12, -7, -7, 16, 0, 8, -8, -11, -6, 4, 16, 14, -10, -19, -11, -3, 23, 12, -4, -9, 2, 10, 10, 18, 4, -15, -6, 7, 20, 4, 4, 0, 0, 4, 18, 14, -4, 0, 1, 0, 7, 13, 20, -1, -3, 1, 21, 20, -2, 1, -8, 9, -1, 20, 5, -12, -1, -2, 16, 13, 1, -9, -11, -2, 11, 15, 4, -14, -4, -11, -1, 15, 13, -8, -15, -6, 9, 7, 2, -9, -16, -7, -2, 1, 5, 3, -14, -18, 4, 10, 3, 2, -9, -11, -13, 3, 12, 4, -12, -7, 5, 5]
$$ [...]
8191E
##END NTUPLES=NMR FID
##END=
