##TITLE=1H_IPEM41
 CDCl3, 8 sc, 
 25.7.2019
##JCAMPDX= 6.0         $$ Bruker NMR JCAMP-DX V2.0
##DATA TYPE= NMR FID
##DATA CLASS= NTUPLES
##ORIGIN= UXNMR, Bruker Analytische Messtechnik GmbH
##OWNER= root
$$ XWIN-NMR		Version 3.5
$$ Thu Jul 25 15:21:19 2019 Russian Standard Time (UT+4h)  she@DPX200
##.OBSERVE FREQUENCY= 200.13155
##.OBSERVE NUCLEUS= ^1H
##.DELAY= (6, 6)
##.ACQUISITION MODE= SIMULTANEOUS
##.ACQUISITION SCHEME= undefined
##.AVERAGES= 8
##.DIGITISER RES= 18
##SPECTROMETER/DATA SYSTEM= spect
##.PULSE SEQUENCE= zg30
##.SOLVENT NAME= D2O
##.SHIFT REFERENCE= (INTERNAL, D2O, 0, 15.7039)
##AUDIT TRAIL= $$ (NUMBER, WHEN, WHO, WHERE, WHAT)
$$ ##TITLE= Audit trail, XWIN-NMR		Version 3.5
$$ ##JCAMPDX= 5.01
$$ ##ORIGIN= Bruker BioSpin GmbH
$$ ##OWNER= she
$$ F:/spectra/data/she/nmr/H-F/1/audita.txt
$$ ##AUDIT TRAIL=  $$ (NUMBER, WHEN, WHO, WHERE, WHAT)
(   1,<2019-07-25 15:19:59.12 +0400>,<she>,<DPX200>,
      <created by zg, POWCHK disabled, PULCHK disabled
       configuration hash MD5:
       00 E9 B6 7A A2 85 ED C7 34 08 36 98 17 FE 4E 26
       data hash MD5: 16K
       B9 AA 61 BA DA 81 92 A2 33 5C 6D FD 4B BC 66 CB>)
$$ ##END=
$$ 
$$ hash MD5
$$ 41 03 F0 40 83 7F 78 FD 63 76 7D 8F 49 1C 3A 44
##$RELAX= 
##$RELAX= 
##$RELAX= 
##$RELAX= 
##$RELAX= 
##$RELAX= 
$$ Bruker specific parameters
$$ --------------------------
##$DU= <F:/spectra>
##$EXPNO= 1
##$NAME= <H-F>
##$PROCNO= 1
##$TYPE= <nmr>
##$USER= <she>
##$AMP= (0..31)
100 100 100 100 100 100 100 100 100 100 100 100 100 100 100 100 100 100 
100 100 100 100 100 100 100 100 100 100 100 100 100 100 
##$AQSEQ= 0
##$AQ_mod= 1
##$AUNM= <au_zg>
##$AUTOPOS= <>
##$BF1= 200.13
##$BF2= 200.13
##$BF3= 200.13
##$BF4= 200.13
##$BF5= 200.13
##$BF6= 200.13
##$BF7= 200.13
##$BF8= 200.13
##$BYTORDA= 1
##$CFDGTYP= 0
##$CFRGTYP= 5
##$CHEMSTR= <none>
##$CNST= (0..31)
1 1 145 1 1 1 1 1 1 1 1 1 1 1 1 1 1 1 1 1 1 1 1 1 1 1 1 1 1 1 1 1 
##$CPDPRG= <>
##$CPDPRG1= <>
##$CPDPRG2= <>
##$CPDPRG3= <>
##$CPDPRG4= <mlev>
##$CPDPRG5= <mlev>
##$CPDPRG6= <mlev>
##$CPDPRG7= <mlev>
##$CPDPRG8= <mlev>
##$CPDPRGB= <>
##$CPDPRGT= <>
##$D= (0..31)
0 1.2 0 0 0 0 0 0 0 0 0 0.03 0 0 0 0 0 0 0 0 0 0 0 0 0 0 0 0 0 0 0 0 
##$DATE= 1564053598
##$DBL= (0..7)
120 120 120 120 120 120 120 120 
##$DBP= (0..7)
150 150 150 150 150 150 150 150 
##$DBP07= 0
##$DBPNAM0= <>
##$DBPNAM1= <>
##$DBPNAM2= <>
##$DBPNAM3= <>
##$DBPNAM4= <>
##$DBPNAM5= <>
##$DBPNAM6= <>
##$DBPNAM7= <>
##$DBPOAL= (0..7)
0.5 0.5 0.5 0.5 0.5 0.5 0.5 0.5 
##$DBPOFFS= (0..7)
0 0 0 0 0 0 0 0 
##$DE= 6
##$DECBNUC= <off>
##$DECIM= 24
##$DECNUC= <off>
##$DECSTAT= 4
##$DIGMOD= 1
##$DIGTYP= 9
##$DL= (0..7)
0 120 120 120 120 120 120 120 
##$DP= (0..7)
150 150 150 150 150 150 150 150 
##$DP07= 0
##$DPNAME0= <>
##$DPNAME1= <>
##$DPNAME2= <>
##$DPNAME3= <>
##$DPNAME4= <>
##$DPNAME5= <>
##$DPNAME6= <>
##$DPNAME7= <>
##$DPOAL= (0..7)
0.5 0.5 0.5 0.5 0.5 0.5 0.5 0.5 
##$DPOFFS= (0..7)
0 0 0 0 0 0 0 0 
##$DQDMODE= 0
##$DR= 18
##$DS= 0
##$DSLIST= <SSSSSSSSSSSSSSS>
##$DSPFIRM= 0
$$ [...]
##$SUBNAM2= <"">
##$SUBNAM3= <"">
##$SUBNAM4= <"">
##$SUBNAM5= <"">
##$SUBNAM6= <"">
##$SUBNAM7= <"">
##$SUBNAM8= <"">
##$SUBNAM9= <"">
##$SW= 24.9336996594482
##$SWIBOX= (0..15)
0 0 2 0 0 0 0 0 0 0 0 0 0 0 0 0 
##$SW_h= 4990.01996007984
##$TD= 16384
##$TD0= 1
##$TE= 0
##$TE2= 300
##$TE3= 300
##$TEG= 300
##$TL= (0..7)
0 120 120 120 120 120 120 120 
##$TP= (0..7)
150 150 150 150 150 150 150 150 
##$TP07= 0
##$TPNAME0= <>
##$TPNAME1= <>
##$TPNAME2= <>
##$TPNAME3= <>
##$TPNAME4= <>
##$TPNAME5= <>
##$TPNAME6= <>
##$TPNAME7= <>
##$TPOAL= (0..7)
0.5 0.5 0.5 0.5 0.5 0.5 0.5 0.5 
##$TPOFFS= (0..7)
0 0 0 0 0 0 0 0 
##$TUNHIN= 0
##$TUNHOUT= 0
##$TUNXOUT= 0
##$USERA1= <user>
##$USERA2= <user>
##$USERA3= <user>
##$USERA4= <user>
##$USERA5= <user>
##$V9= 5
##$VALIST= <valist>
##$VCLIST= <CCCCCCCCCCCCCCC>
##$VD= 0
##$VDLIST= <DDDDDDDDDDDDDDD>
##$VPLIST= <PPPPPPPPPPPPPPP>
##$VTLIST= <TTTTTTTTTTTTTTT>
##$WBST= 1024
##$WBSW= 4
##$XGAIN= (0..3)
0 0 0 0 
##$XL= 0
##$YL= 0
##$YMAX_a= 83771
##$YMIN_a= -99018
##$ZGOPTNS= <>
##$ZL1= 120
##$ZL2= 120
##$ZL3= 120
##$ZL4= 120
##$ABSF1= 10
##$ABSF2= 0
##$ABSG= 5
##$ABSL= 3
##$ALPHA= 0
##$AQORDER= 0
##$ASSFAC= 0
##$ASSFACI= 0
##$ASSFACX= 0
##$ASSWID= 0
##$AUNMP= <proc_1d>
##$AZFE= 0.1
##$AZFW= 0.1
##$BCFW= 1
##$BC_mod= 2
##$BYTORDP= 1
##$COROFFS= 0
##$CY= 11.3945322036743
##$DATMOD= 1
##$DC= 2
##$DFILT= <>
##$DTYPP= 0
##$F1P= 18.9103706918063
##$F2P= -1.10871071338519
##$FCOR= 0.5
##$FTSIZE= 0
##$FT_mod= 4
##$GAMMA= 1
##$GB= 0.15
##$INTBC= 1
##$INTSCL= 1
##$ISEN= 128
##$LB= 0.24
##$LEV0= 0
##$LPBIN= 0
##$MAXI= 10000
##$MC2= 0
##$MEAN= 0
##$ME_mod= 0
##$MI= 1.114404
##$NCOEF= 0
##$NC_proc= 0
##$NLEV= 6
##$NOISF1= 3.799351
##$NOISF2= 2.8
##$NSP= 1
##$NTH_PI= 0
##$NZP= 0
##$OFFSET= 15.70392
##$PC= 1
##$PHC0= -8943.2
##$PHC1= 15.40097
##$PH_mod= 1
##$PKNL= yes
##$PPARMOD= 0
##$PSCAL= 0
##$PSIGN= 0
##$REVERSE= no
##$SF= 200.130013532006
##$SI= 16384
##$SIGF1= 3
##$SIGF2= 2
##$SINO= 400
##$SIOLD= 16384
##$SREGLST= <1H.CDCl3>
##$SSB= 0
##$STSI= 0
##$STSR= 0
##$SW_p= 3612.71676300578
##$SYMM= 0
##$S_DEV= 0
##$TDeff= 0
##$TDoff= 0
##$TI= <>
##$TILT= no
##$TM1= 0
##$TM2= 0
##$TOPLEV= 0
##$USERP1= <user>
##$USERP2= <user>
##$USERP3= <user>
##$USERP4= <user>
##$USERP5= <user>
##$WDW= 1
##$XDIM= 8192
##$YMAX_p= 0
##$YMIN_p= 0
$$ End of Bruker specific parameters
$$ ---------------------------------
##NTUPLES= NMR FID
##VAR_NAME=  TIME,          FID/REAL,        FID/IMAG
##SYMBOL=    X,             R,               I
##VAR_TYPE=  INDEPENDENT,   DEPENDENT,       DEPENDENT
##VAR_FORM=  AFFN,          ASDF,            ASDF
##VAR_DIM=   8192,          8192,            8192
##UNITS=     SECONDS,       ARBITRARY UNITS, ARBITRARY UNITS
##FACTOR=    0.0002004,     1,               1
##FIRST=     0,             0,               0
##LAST=      1.6414764,     0,               0
##MIN=       0,             -99018,          0
##MAX=       1.6414764,     83771,           0
$$ Real data points
##PAGE= N=1
##DATA TABLE= (X++(R..R)), XYDATA
0@%%%%%%%%%%%%%Lj1J6j6J6j6J6k4L2l2L2m0M8n6O4p0P8q8J02j11J21j36J52j70
37i0J92k12K33k60K87l16L50l90M33m82N36o00O78p65Q72j008J178j402J718k185
57a233K950m418Q151l3724p0744R4561N2801m9456l24L7290n7872m6649Q1291
70A2624O4915o2923n0466K6693K939j8363L8140K5869m7859k9021L4600J5780
82A2928q911J6502p82m3796m488M2963J689k8944R774J0213k5248O155M2456q863
96B1648m4007P293L1127p501j1127P165j6275j8517L0372L2099j8553k4045j03
109a0424l568J0313L7856k830n6217j5428L8026J1038n863K2047q951n6232M339
122c5894O9475P904m9291k053J2957l2808K564O4699L652o6927p939M2419n618
$$ y = [0, 0, 0, 0, 0, 0, 0, 0, 0, 0, 0, 0, 0, 0, 3, -8, 8, -8, 8, -8, 8, -16, 16, -16, 16, -24, 24, -32, 32, -38, 40, -48, 54, -57, 64, -72, 80, -90, 102, -110, 123, -137, 150, -166, 184, -206, 227, -255, 281, -319, 359, -406, 466, -542, 636, -766, 952, -1233, 1717, -2701, 5450, -28274, -99018, -4457, 48344, -1112, -1436, 35854, -22018, -68667, 12624, 77539, 14616, -35850, -9157, -6218, -24581, 13559, 39428, -8431, -37452, -2852, 12928, 4017, 20519, 19737, -24059, -28547, 14416, 16105, -12839, -3065, 7148, -18100, -11945, 30511, 21648, -22359, -15066, 16061, 8560, -2567, 4598, -11677, -30194, 178, 32277, 13724, -10321, -10424, -13992, -3679, 34177, 31347, -24870, -40298, -2272, 8766, 2903, 24950, 15999, -40233, -35894, 33581, 41485, -7806, -9859, 3098, -29710, -27146, 37553, 41205, -25722, -33661, 8758, 3140]
135C140r413L9867l835o7749m389O1912N073l4166J2854O749m0679O928O2969
148C9261k766n9334k48L4148j1901r256L0148o787m5798R653M7933m201l0228
161i376O269P803j5034P921K2746j5207k6444J0630J7441l828J385M644j5874
174f924q283K0967J0609j4127m794J069j3190K181K7328L350k5357m848J1542
187d77l150N061K1020j0805l5175L406K9373N97r115P543j0882k3626K0081L6927
201C0778j4421l1916P359R637j2636J1988K5037k2497l3370K1258K8385j6082
213C520r329J8719r508k6140J8581K7723k0615k0850J9372O220k0376Q969K4449
226B0735j5904k3433J6556J4787j5656j944J5502j1047j8040J6922J8204j4765
$$ y = [3140, -6273, 33594, 29759, -37990, -42379, 19533, 24606, -9560, 3294, 10043, -30636, -23708, 39261, 36495, -22839, -23087, 11061, -840, -10096, 20052, 13265, -32533, -22880, 25053, 20852, -9376, -3107, 4696, -10338, -2417, 20329, 5122, -21322, -10692, 6749, 2921, 4306, 8950, -6924, -15207, 5760, 16369, 2242, -2552, -1483, -14673, -12492, 14836, 18186, -7171, -12019, -477, -3627, 1434, 22454, 11649, -23526, -20120, 9253, 9850, 735, 8278, -2604, -26230, -6149, 30778, 16357, -15559, -8200, 1437, -11199, 789, 25826, 3329, -30041, -8783, 19602, 3520, -5809, 12910, 3402, -22738, -4157, 23566, 2951, -17899, 1473, 7693, -12683, -3714, 20735, 4831, -18602, -2046, 12741, -2915, -4859, 10643, -404, -18444, -1522, 16682, 1917]
238A917j1188J0845L07p762J0679P261j7533q808J5678O957q488k74J475q232
252g166K439J4920j508j4255lO477k713J652P350o562j0133P823Q685p055k411
267b460P745m158q993P677P501r121l082R552l279j0243Q641J0776j0008p599
281g051R155N84r017O756R490j1727r232J2813O156j1222j88R473n918p586J0298
296B784M952j2728j840J2790j450j0813M332P201o399k191Q181k709r823N599
310b114J0135n617p575L994J986l156M521M422q380o319P693N759m195j674J339
325H19l772p24P555J815p554k256M204l7r15L776k39n967k14N043M05j379J998
342B558j749n768J293O738O95l656j170j697j454N845O501m964q997K85N457K796
$$ y = [1917, -9271, 1574, 1881, -5881, 4798, 12059, -5474, -14282, 1396, 8353, -135, -409, 1066, -7166, -4727, 10193, 8685, -5570, -5573, 904, -1809, -157, 7193, 631, -9502, -1679, 7006, -49, -2460, 5285, 1127, -7866, -189, 7312, -1809, -4891, 4661, 1382, -8861, -220, 10556, 548, -7051, 2104, 2688, -6329, 427, 9917, -1810, -11042, 1771, 7927, -3295, -3483, 5990, 72, -7514, 2784, 7736, -4992, -6832, 5958, 4508, -6305, -1973, 5228, -1171, -3362, 4819, 2110, -7713, -2114, 8021, 2404, -5171, -1177, 809, -2347, 2174, 6596, -1784, -8103, -410, 5349, 1154, -520, 819, -2953, -3677, 3878, 5693, -1861, -4117, 87, 50, -865, 2911, 2672, -3295, -3509, 1534, 1939, 560, 2558, 809, -4959, -3666, 3072, 3767, 111, -1059, -2756, -4210, 1635, 8136, 3172, -5825, -5540, -83, 2713]
358B713J795j336q298m402R009R676k925p862l065k7L312P564J558r726p444M661
374d797P693K237q33l439n991o95P682N502l498o163l051P0M223O617J020o714
390a37n803J255N646N330N17o853q245M87Q705O460j727p041o174J167R512P836
406A0935m191j1532n341N188Q847M349m027r516n061O475J1349L377p542r511
420f201k381N885Q078K410n933q684k511O741R491K782o427q569k434N208P673
435E128L206n135r773m462O669J1158L964o662r861l408O255J0070L551p835j1860
450h995l234R245J1797J817r469r928k5R488R403j79j0303j0429N63J0975Q992
465I718k403r936o637K818R500P282k426j0093p513K357R108O579k323r163o729
$$ y = [2713, 4508, 3172, -5126, -9528, -519, 9157, 6232, -1630, -4695, -4722, -1410, 6154, 7712, -2014, -9458, -4797, 2896, 5133, 4300, 861, -5130, -5825, 1857, 7359, 3861, -2302, -5353, -5283, -1060, 5557, 6577, -137, -5940, -4685, 961, 6291, 6808, -45, -8290, -7803, 902, 7362, 5635, -1406, -7580, -6413, 3099, 10935, 6744, -4788, -10129, -4941, 3906, 8255, 4228, -5288, -10349, -3874, 7475, 10852, 3310, -6201, -8582, -2697, 5381, 7791, 1858, -6826, -9337, -2596, 6895, 9677, 3250, -5319, -7753, -2545, 5128, 8334, 3199, -6574, -11036, -4367, 6791, 10755, 4093, -5768, -9176, -2921, 7149, 10700, 2865, -8995, -12229, -2984, 8813, 10630, 1161, -8767, -8792, 696, 10099, 9920, -383, -10812, -10249, 726, 9718, 7315, -2621, -9258, -6440, 3060, 10342, 7916, -2177, -9690, -7333, 1775, 8354, 6031, -3132, -9861]
480i861L298J0136O807k535r151p998R30J0319Q837l672j2230o752M917J0666
494C711P545k131j1560r606M514J3848O126p862j1753m599N467J1376P140n788
508F428j3037m564Q667J0622J828p119r717m208O475J1284L268p859q887r05O367
523a357Q094L152o491j1082l148Q420R372Q20o411p648k977O474J1864L420j0551
538A951j1838M0R209Q091J107p280j0910k209J1894J2654j854j2397q138K093
552g587Q355Q132L9j0716j0528K884J2801P519l925q760n861J123Q117P868k085
567G376j0791p083L825Q974N280j456o629o793N00R205P665l577j0290n336L145
582e985P139O099k75q913q281M398J2134M083o906p761l258J763Q193P612n320
$$ y = [-9861, -6563, 3573, 10380, 7845, -1306, -9304, -8374, 1945, 10782, 7110, -5120, -11872, -6955, 3711, 11256, 9125, -2435, -12041, -7527, 6321, 12447, 4585, -7168, -11767, -6300, 5076, 12216, 6428, -6609, -11173, -2506, 8116, 9944, 2825, -6892, -11100, -4625, 6659, 9927, 2068, -6819, -7724, -1357, 6737, 9889, 3398, -7684, -10832, -2412, 6960, 7780, 1369, -6279, -9256, -2782, 9082, 12502, 1951, -9887, -9847, -638, 7453, 8560, 1280, -9630, -11839, 55, 12709, 10855, -1542, -9680, -7587, 768, 8900, 8939, -1777, -12305, -9421, 3380, 10899, 6974, -1786, -7647, -6524, 1593, 9461, 7376, -3415, -10498, -6673, 2301, 7581, 6125, -504, -7297, -6797, 2408, 10073, 6496, -3794, -9130, -5985, 1154, 7253, 6978, -1935, -10216, -5818, 6316, 10399, 3493, -4268, -7526, -5763, 2430, 10042, 4722]
597D722j3060j804J0677P063j328l480n921o088N010J2675P96j2159n820M627
611d090M008L358N088l582j2320j992J1729O149n007m219k454m582K929J2513
625G528L551j1453q048L911N327L120L400l622j1778l361J1300R243l139o984
639a005l803r78M502Q598J358r470p886K675P508L813j530m680l974O52N348M963
655F091j045o544m349L086N153L47k044r71k469j681N422O133m189p372J582M104
671A254j385Q93L851n187q433N707J1074k738p776J539Q68m367N155R692p044
686C103j3769M086J1259j537l111M142m100r817O654J3922m616j2198K127M606
700G51m373K332R641m352j2351L216J0202k310m139M722j133r150J852J0344o27
$$ y = [4722, -8338, -10142, 535, 7598, 6270, 2790, -3131, -9219, -4209, 8466, 9262, -2897, -8717, -4090, -82, 3276, 8364, 4782, -7538, -9530, 2199, 8348, 3341, -878, -3332, -7914, -4985, 7528, 11079, -374, -8422, -4511, 816, 3936, 7336, 3714, -8064, -11425, -125, 9118, 5979, -1005, -4808, -5786, -1284, 7314, 8672, -798, -8684, -6009, 1499, 5312, 3782, -898, -4872, -4220, 1128, 6091, 5046, -1498, -5847, -2761, 2392, 2739, 695, -276, -2745, -4426, 996, 7129, 2940, -4432, -2850, 1254, -131, 762, 4613, -574, -9007, -3300, 7774, 5036, -2740, -1201, -333, -4700, 455, 10147, 3103, -10666, -6580, 4679, 3142, 31, 4173, 73, -9744, -3090, 10832, 6216, -5982, -3855, 751, -3622, -1290, 8351, 3999, -8352, -5136, 5066, 2756, -1383, 3339, 2206, -6944, -5092, 5252, 4625]
715D625p154J103K388l705R89P009r12p575p35M474N51r11J122j137k676J276
731a268L174P8j799j192o8J772J104k544j795K600J343j975Q87J658l812j745
747c582O432K155p288j766O050j130m711N284M183q303l475R409J471q752K359
762a664P896o650p428Q992N625r435j594R474l359r632P341R339q988o875Q986
777B028J983r286L061R730o262q735P689N568q463j255R388k084r344L567O726
792D311m807k412P044r28r080J596Q540q05m470J344p25m222L204O915j791o208
808b494p59J720J174L058J074m458l040K044J793J218K207k205n486J180N290
823B316q45k152K937j278o316K791Q299k794o902L449K951n760J285Q676m055
$$ y = [4625, -2529, -1426, 962, -2743, -1754, 5255, 4343, -3232, -3967, 507, 1058, 147, 1269, 132, -2544, -1268, 1906, 1984, 185, -1007, -1075, 697, 1801, -743, -2538, 62, 1405, -570, 317, 1975, -1837, -3582, 2850, 5005, -2283, -4049, 2001, 871, -3840, 1444, 5627, -2676, -6151, 3258, 4729, -4023, -1664, 6232, -418, -7846, 1146, 6771, -2664, -4258, 5216, 1857, -7775, -434, 8905, -83, -6958, 2028, 4011, -5275, -2214, 7516, 1254, -7481, 208, 5776, -2687, -3942, 5446, 3362, -5982, -2415, 4311, -496, -2908, 4136, 3208, -5872, -4276, 4264, 3459, -1011, 333, -392, -4614, -1410, 5505, 3714, -2494, -3253, -1533, -359, 2699, 3773, -685, -3725, -1681, 112, 1330, 3537, 1332, -4154, -2974, 2316, 1471, -681, 2256, 978, -5338, -2547, 5752, 2958, -3944, -495, 2456, -3304, -2019, 6657, 2602]
838B602j0445N031R187n317m819O471q84q579N627J0738p826j0825P228O960o269
853a120o2P159o539r543R606J0903q333p847N582M48n495O819Q106r620r825P463
869b298O939l829M95L598p389o793Q750Q500n014n215Q97k159p86Q331M638q196
885D69o890K750L665K259L205k715q662r35P984M016j738k111m327l410N962P831
901G353l414p391k5J542J54N238L477q226o808O823O371l360j261J598n952l597
917g478R953O419q760n851M784O91j856P029K941j1881o247J0231O172m697n84
932H66O13p859j249J3485N342j1591o523M432J104R79P652q06j3555l390J1902
947A402N802m220j545k130o561K495J1877J258j0496m009L356J297L199N494l883
$$ y = [2602, -7843, -2812, 6375, 1058, -3761, 2710, 1826, -6753, -1126, 9612, 1786, -9039, -1811, 5149, -1120, -1182, 5977, -562, -10105, -499, 10404, 2071, -5776, -194, 254, -5241, 1578, 9684, 64, -9761, -2298, 4641, 812, 1307, 4905, -2484, -9277, -527, 7973, 2959, -2256, -1359, -3518, -4304, 4027, 8665, 469, -6421, -3671, -6, 2253, 5458, 2743, -5919, -6854, 1130, 5146, 3408, 1297, -3030, -6440, -478, 7353, 3939, -3452, -3477, -1935, -1781, 3457, 6934, -1292, -8100, -1277, 5094, 1734, 473, 2071, -3881, -7478, 2475, 8894, 134, -5717, -933, -242, -2098, 4931, 7872, -4009, -10256, -25, 6147, 1450, 866, 1479, -6380, -7629, 5856, 11198, -393, -6916, -2484, -1380, -401, 7251, 6445, -7110, -10500, 1402, 7204, 2984, 1439, -691, -7252, -4757, 7120, 8378, -2118, -6127, -2771, -1474, 1725, 7219, 3336]
962C336r922L45Q219K498j659j099m796m423N811Q517j817o581j952o0J736O776
978D929K778q486p236L964N934J574R23k839q319o42J0888N444o466n478n92r58
994d582L539Q653r89j1680l502P822M490k59Q84l928q256K060J1042J976p322
1009e2l198L4j074M680P865l195j0310r48O221K301R32J167n927p359M881J0084
1025F102j23n993k181j438m61O847O039o596r470J482O335K376J165r18o981l940
1041g755P393P704k576n964k400r23K292O829J911p348n425K901M496K425J369
1056D929l303p047m94P262L875k620l095k713j983M224P438p20p722l111K628
1071b452K665L046J903n131p172K212Q114K270l216k936k935r14N618N776l559
$$ y = [3336, -6586, -6241, 1978, 4476, 2817, 1718, -3078, -7501, -1690, 6827, 5010, -1571, -3523, -3583, -1847, 4929, 7707, -779, -8015, -4051, 1883, 3457, 4380, 1541, -6778, -7420, 3468, 8912, 2446, -3032, -3624, -4582, -1043, 7610, 6621, -5059, -8561, -739, 3751, 3492, 4376, 448, -7808, -5748, 5294, 7270, -52, -3250, -3216, -4290, 390, 8255, 5060, -5250, -6198, 23, 2324, 3256, 4423, -1504, -8863, -3982, 6102, 5979, -14, -2195, -3633, -4094, 2753, 8792, 2196, -7274, -5792, 543, 2919, 4084, 3166, -3815, -7755, -362, 7342, 4766, -1198, -3598, -4521, -2229, 4600, 6511, -837, -6262, -3361, 1135, 3560, 4929, 1626, -5421, -5915, 1347, 5222, 2602, -493, -3206, -5189, -965, 6473, 5753, -1969, -5080, -2452, 213, 3259, 5162, 31, -7141, -4929, 3185, 5455, 2239, -697, -3632, -4546, 1072, 6848, 3289]
1086C289p434j035L587L025K542k56n646l973M140N726L4k975k738k513R98N693
1102B464K749m229m263L56J933K477K906j418o076k162M505L826l64j571k584
1117a451k892K018O165J497n033l865N95K171K835J973k801n317l10N002L313
1132C900r27k744k907p65L345L868q85m090k127R35K490K784J92l501k866J450
1148a848L005J114m81j830k743k03L518K608j469k530r51J49J642K734J0l648
1164i23k410J660K648J027l96j895k365N83L585J763k110k659o32R59J924J607
1180B366j091k973q68K230K121L9j230j509q57R96K053M35j660j450J24J005J012
1197G43O04n83j488o37J017J245P4p88p93n12L02J353R43r02j550oJ072N49oj84
$$ y = [3289, -4145, -5180, -1593, 1432, 3974, 3718, -1928, -5901, -1761, 3965, 3999, 1024, -1714, -4227, -3229, 2464, 5213, 984, -3279, -2923, -990, 1487, 4393, 2975, -3101, -5263, -758, 3068, 2704, 1133, -1451, -4343, -2325, 3840, 5337, 304, -3561, -2966, -795, 2040, 4013, 1212, -4105, -4415, 587, 3900, 2973, 229, -2678, -3443, -98, 3770, 2885, -1205, -3332, -2397, 93, 2877, 3069, -432, -3298, -1848, 1157, 2271, 1790, -40, -2783, -2986, 532, 3140, 1671, -859, -1810, -1661, -19, 2715, 2725, -923, -3333, -1673, 975, 2002, 1606, -289, -2654, -2071, 1514, 3277, 1167, -1492, -2124, -1165, 759, 2366, 1275, -1698, -2566, -336, 1785, 1824, 594, -915, -1772, -776, 1277, 1712, 52, -1398, -1274, -269, 743, 1347, 764, -724, -1361, -344, 901, 975, 187, -606, -1118, -816, 537, 1480, 578, -972, -978, 94, 643, 637, 453]
1217D53r68r21R80J729l43j607o4R17K5o0N68m51j336M07J601k53j436K22J053
1236E16k98m98O00J02q65J01R83k69j106J89R93Ro45p3K79kK9L27l8o74l74O33
1258h1O98l25p04J50L22k83J69Q42k92j300J4J118N2m16N12k40j500K58K241K55
1278A490j849m59N63m18N67K061o61l322j61L053P71j294M1m99k134R37L967r
1296B644m022r52K233L67q2J792o32l927k65M206J322k517q33M21j320K34L477
1313B146Q10l782k002K031J548J3O60m54k866r43L181K571j344k497q80M03J408
1330CJ988K09k648k448J016L250J442j687k450q25R74K034J775q72l545j639K817
1347f06L141l63j941j292j164M60L655K053l498l857J194K667O59Q70K24l815
$$ y = [453, -515, -1436, -456, 1273, 930, -677, -741, 176, 201, 141, 709, 258, -1078, -671, 930, 677, -759, -537, 516, 218, -280, 320, 422, -443, -342, 641, 372, -734, -545, 448, 457, -188, -261, 18, 16, 45, 372, 334, -340, -714, -81, 617, 292, -412, -262, 60, -223, -54, 788, 496, -804, -790, 328, 380, -36, 476, 236, -1264, -1006, 1235, 1490, -359, -818, -255, -673, -106, 1955, 1294, -2028, -2189, 864, 1635, 341, 382, -117, -2251, -1314, 2653, 2644, -1378, -2330, -97, 270, 188, 1980, 1348, -2579, -2844, 1362, 2684, 167, -666, -245, -1565, -1331, 2146, 2956, -826, -2828, -797, 751, 764, 1424, 970, -1896, -2839, 342, 2913, 1569, -928, -1808, -1405, 3, 1991, 2200, -448, -2896, -1880, 1370, 2812, 1125, -1325, -2150, -1176, 858, 2633, 1761, -1784, -3423, -606, 2535, 2172, 231, -1061, -2225, -1765, 1890, 3943, 445, -3412, -2218, 449, 1108, 1978, 2202, -1613]
1363a613l042L811M969j399l639n74m02n54L795L904l769o142J125M812J004n22
1379A764R7l242l768L431O430p41n488j534J516Q26K284K615k881n616N16N314
1395A523J859k040j651j464j256K424M348l33m751k218K130K448J115M9k195l334
1411c346K21M368K837k137l726j126J357K346K288k13m053l564K209N258J360
1426D079l105k867r31N89L300L736j865o327j752M626L593n05j303k161l238J117
1442c014O290K329n253m264J367K114J290K443l42n635k881N056M820j507k940
1457a27j080j633J52M938L106m640n298J483L849J256N72n15m300k803M380N429
1473D769j503m768j394Q33J225L178K028l879n214J429N336J507k169j926j767
$$ y = [-1613, -4655, -844, 4125, 2726, -913, -1487, -1889, -2443, 1352, 5256, 1487, -4655, -3530, 1282, 2286, 1764, 1861, -1381, -5149, -1718, 4712, 3971, -1517, -3051, -1535, -709, 1575, 4190, 1309, -4307, -3791, 1523, 3382, 1342, -309, -1773, -3029, -605, 3743, 3410, -1341, -3559, -1429, 1019, 2134, 2183, -12, -3346, -3125, 1243, 4080, 1943, -1783, -2909, -1552, 794, 3082, 2869, -1184, -4748, -2539, 2719, 4079, 974, -1893, -2824, -2235, 1065, 4801, 2936, -3391, -5143, -517, 3076, 2571, 1268, -893, -4131, -3014, 3276, 5605, 352, -3912, -2545, -431, 859, 3302, 2960, -2675, -5556, -500, 4320, 2813, -127, -1207, -2840, -2688, 2250, 5356, 716, -4582, -3099, 750, 2006, 2578, 2063, -2237, -5040, -660, 4769, 3266, -1502, -2896, -2063, -838, 2340, 4368, 489, -4725, -3296, 2040, 3547, 1378, -548, -2315]
1488b315j002L040M519q67n385k007K874K740P29j33k204l630J95M966K907k839
1504A588l779n45J329K023K600L2m445l519K546M767Q39k420k388j571L93L858
1520A308L397k353n283j017L335K685N62r50l075k833K150N201R85l912k810M72
1536b138J286K003K225j519m799j198M215L030j237j778j049j542O85M200J718
1551D102m116l643J600K697O66N64l33l466j993L783M129j589l723p54O03O98
1567g75K561J669l305m076J553M177Q76j550j210j689j007K779L513j350m042
1582a876q76J994J505R97L72k244k856R62L586J084j965j805o34K45J859K190
1598B538o32l093j478J709K325O30j062j819j312O60K524J667j412k842p36J929
$$ y = [-2315, -3317, -277, 4242, 3375, -2010, -4017, -1143, 1597, 2326, 2193, -11, -3641, -3446, 1520, 4427, 1588, -2191, -2736, -1407, 616, 3216, 3248, -1197, -4716, -2170, 2597, 3436, 1016, -1372, -2943, -2550, 1308, 4705, 2352, -2931, -3948, -613, 2072, 2634, 1684, -1391, -4224, -2074, 3127, 4112, 200, -2610, -2138, -852, 1151, 3376, 1857, -2942, -4140, 75, 3105, 1868, 90, -959, -2501, -1816, 2384, 4102, -14, -3657, -2057, 640, 1306, 1870, 1537, -1929, -3922, -139, 3990, 2401, -1322, -2076, -1473, -775, 1786, 3455, 150, -3926, -2373, 1804, 2680, 1130, -80, -1769, -2776, 3, 3516, 2166, -1876, -2752, -758, 747, 1744, 2116, -128, -2984, -2022, 1564, 2648, 683, -1122, -1756, -1511, 348, 2538, 1906, -1187, -2665, -956, 1369, 1999, 937, -882, -2194, -1534, 990, 2657, 1245, -1597, -2333, -404]
1614d04J887K88r45j775j414J113K988P59k481j839O53J065Q32J098o34k806q20
1631b435K682J679j251r51J3r24J1K565J033k698j716J533R54m90P82M13k356
1648a156j169K650J822j667j199N41m60l27K014R44k498j648J694J372m55L9J
1665D98j561m35K168J110j594j144M30J53K35J115J0j628n03J156O18k42ml81
1683Aq10K44J045Q6n25j18j87k52O40O77n60o36K71J1k29O40M15j013n25R93L30
1704D98p14J93N54q28m40J176K56j315M6J192m00q89Q01M84j084L6J277n32j349
1723a038P85J134q77n88R32j66r90Q99J157j269j114J137O60q64J67P18j041p93
1741a151J512Q83j301n85P69k11m02J060M44j495o17J149M11l84L63p0j258m8
$$ y = [-404, 1483, 1771, 826, -949, -2363, -1250, 1738, 2497, 16, -1823, -1170, -105, 727, 1825, 1191, -1615, -2435, 247, 1926, 675, -276, -263, -1187, -1176, 1389, 2422, -276, -1992, -459, 495, 5, 787, 1200, -1156, -2325, 325, 2147, 480, -719, -178, -638, -965, 1049, 1993, -505, -2153, -459, 913, 458, 497, 498, -1063, -1498, 670, 1780, 186, -958, -528, -375, -140, 975, 985, -643, -1146, 10, 628, 386, 382, 1, -809, -565, 480, 566, 41, -77, -264, -516, 124, 801, 241, -395, -124, -113, -342, 298, 713, -300, -825, 168, 498, -216, -23, 531, -297, -737, 439, 695, -620, -574, 618, 218, -671, 130, 614, -470, -434, 843, 311, -1038, -253, 881, 4, -584, 348, 182, -808, 91, 1248, -21, -1135, 2, 662, -202, -35, 683, -358, -1151, 361, 1244, -57, -642, 127, -84, -486, 574, 1018, -477, -1094, 55, 466, 82, 445, 375, -883, -931]
1759i31J542L90r52l20r2m97P27J486m60j795j58R68L24M20M22j314j546J053
1777g33J992j42j109m03m95j24J652J268j515j855M42J085M19O03j87j878q79
1794a859J834J537o21q94m52p96L87K172O27k094j397P45Q02N83R39o87k424m23
1812b021K366J403p94r74q77q12J195K474l5k538j281Q58J177J141N09j753k321
1829b283O14K593R59r49j231j226k48K074K105j014k517p04R76J251J254K8k207
1846e25j882J163K394P00q88j463j399L44K451J567j370k242p43Q00J812J574
1862B293q55k819j149J814K122N20q95k007j550J361L045O81k296j999j32J144
1878g22J997J246j689k991k55K448J812q2j315k003r28J958K796m0k432j676J18
$$ y = [-931, 611, 1001, 49, -271, -363, -860, -133, 1353, 893, -902, -1060, -92, 232, 652, 1074, -240, -1786, -733, 1259, 1117, 8, -395, -890, -1014, 638, 1906, 391, -1464, -1022, 63, 482, 1085, 898, -980, -1859, -25, 1512, 891, -3, -455, -1251, -864, 1308, 1935, -159, -1556, -811, -9, 574, 1513, 826, -1598, -2021, 345, 1748, 954, -20, -897, -1709, -514, 1960, 1925, -613, -1894, -1036, 141, 1282, 1791, 38, -2283, -1669, 924, 1883, 934, -297, -1523, -1771, 303, 2408, 1394, -1123, -1827, -851, 400, 1654, 1682, -525, -2407, -1244, 1150, 1850, 962, -501, -1900, -1556, 895, 2462, 1092, -1150, -1893, -1093, 719, 2293, 1438, -1381, -2530, -716, 1406, 1926, 1031, -976, -2526, -1165, 1880, 2561, 265, -1734, -1866, -722, 1275, 2521, 832, -2159, -2414, 34, 1846, 1764, 449, -1554, -2482, -524, 2272, 2232, -200, -1876, -1758]
1895a758J401K079P52k185k712K30K496J678j75j584k125n26K385K677m26k696
1911d89j757M45J950K009N7k497k377O50K770J747p93k317j732N32K464J875q43
1928A694k627j625J032K531J444j051k370j364R20K393J519j102k710j246J460
1943a102K334R80j020k226j472J149K885J170j882k458n73J290K118J302j258
1958A237k989j068K273K608J66j741j946q90J369K856R28k446k675J81K156J725
1974A744L19j420k451q01K328K692k95k413j612J59J458K018O71k106k678K12
1990b175K613J639n53j597j592m86J893K655j70k850j704R90J785J180J45j742
2006C1k431K52L027J668j453k018o91L20J526K000l65k941j562J785K172K72p73
$$ y = [-1758, -357, 1722, 2474, 289, -2423, -2193, 303, 1981, 1806, 222, -1903, -2429, -44, 2633, 2207, -489, -2246, -1801, 149, 2158, 2215, -282, -2659, -2009, 761, 2508, 1715, -602, -2334, -1802, 662, 2537, 1694, -933, -2558, -1526, 1005, 2449, 1398, -972, -2336, -1416, 977, 2496, 1394, -1316, -2562, -1102, 1232, 2212, 1192, -1034, -2506, -1357, 1528, 2698, 816, -1642, -2215, -925, 1193, 2495, 1237, -1752, -2820, -547, 2061, 2227, 486, -1460, -2350, -981, 1875, 2803, 357, -2318, -2137, 19, 1744, 2063, 643, -1808, -2609, -281, 2411, 2116, -297, -1909, -1750, -292, 1726, 2397, 291, -2387, -2175, 438, 2077, 1524, -73, -1665, -2151, -258, 2397, 2227, -623, -2327, -1337, 448, 1628, 1773, 31, -2400, -2148, 879, 2547, 1094, -924, -1615, -1295, 231, 2231, 1866, -1075, -2637, -852, 1320, 1592, 819]
2023H19j290j440M02K643J431j824k265j23J156J207R56m41k260j344J600K429
2039A656K65j570j429n15O99J869J187j310k468n48J867J843P5j200j459p67R48
2056h57K295Q06k009k170L52J707R54K11n91j815j018J882K318o48k062m82M03
2073g24K28J226J170j530k384O97K283J88q94k2o88j202J241K375o69k455q2J305
2091F3M6K40J023j022k285O60K572J34j645k86J23n95Q48J910n91k511k60J773
2109A97O15l66J00o16j379M44K079M58j541r31L36L55M74P31k06j406o99J018
2127c37J215k1p71m93j35Q3O24Q56l38j401m05J171O59m95j24J01p47l10J416
2146E48P19j451q47J084L84q11M46Q01j186r17J544R03j508n76J316q2j166Q20
$$ y = [819, -471, -1911, -1509, 1134, 2565, 741, -1524, -1647, -491, 716, 1672, 1231, -1029, -2373, -773, 1656, 1921, 351, -1078, -1593, -894, 975, 2162, 852, -1616, -2164, -297, 1546, 1621, 421, -1038, -1805, -857, 1438, 2244, 235, -1935, -1583, 124, 1078, 1289, 698, -1117, -2135, -253, 2065, 1417, -645, -1127, -724, -496, 730, 1900, 370, -2014, -1317, 966, 1154, 260, 238, -450, -1652, -411, 1964, 1295, -1160, -1242, 63, 109, 349, 1372, 350, -1935, -1275, 1297, 1431, -214, -500, -377, -972, -124, 1786, 1195, -1316, -1576, 197, 812, 446, 546, -70, -1449, -1005, 1074, 1532, -9, -940, -604, -249, 225, 956, 750, -656, -1355, -337, 878, 857, 86, -407, -542, -459, 165, 1021, 683, -718, -1123, 48, 707, 212, 88, 189, -558, -868, 548, 1267, -184, -1031, 53, 437, -374, 72, 873, -313, -1230, 314, 1217, -291, -867, 449, 367, -799, 21]
2164B1J082j410r73J638P31j563j48J335n42j192J161J044j446q42J437L35j274
2181f06L29J184q38j118J082Q78j075m35J006q0r99M44R54n71p24O14M18o41k09
2200c87O27J16n15l7L05j45k08K97M00k49o16p6O21L22l16j89K7l97j27R69N90
2221A012j057r09O86O03l33K53M65j060r96J259J323r12r09N84o5p57R76J309
2239A472j269j602R62J148o60j06Q71q90j414J207J776r20j395N60L60o80P33
2256A53J263j199j790Q97J634l26o87K47n34q26J157J574q49j713N3R18K99L55
2274F26K10j094j154P38J584K59r48q52l06L80J056P36o24j348n90Q40J333M02
2292A248q76j130l33N41J116Q67o76j780n35J349J241k0o08q98r39N63K064O00
$$ y = [21, 1103, -307, -1280, 358, 1089, -474, -622, 713, 171, -1021, 140, 1184, -262, -1104, 333, 668, -606, -277, 907, 69, -1049, 33, 911, -164, -599, 407, 327, -672, -228, 726, 155, -569, 45, 463, -178, -387, 240, 356, -159, -196, 109, -36, -244, 53, 453, 204, -412, -488, 133, 455, 139, -50, -23, -420, -547, 422, 1012, -45, -954, -268, 335, 2, 255, 720, -340, -1336, -77, 1246, 334, -575, 9, -56, -813, 163, 1472, 203, -1399, -437, 711, 51, -55, 816, -74, -1488, -281, 1495, 575, -820, -260, 100, -580, 153, 1416, 217, -1573, -676, 958, 632, -55, 192, -342, -1168, -11, 1563, 714, -999, -946, -28, 271, 626, 836, -258, -1412, -674, 910, 1169, 221, -631, -937, -557, 499, 1235, 611, -737, -1327, -487, 846, 1248, 372, -758, -1091, -550, 566, 1433, 757, -1023, -1558, -209, 1032, 1012, 404, -494, -1433, -870, 1194, 1794]
2310A794j774j346M43P37O45Q53n45k111n48K049J366p90r33m38n91N55J978M31
2328A775k141j353R93J145L30K84o37j800k63K116J364j038j389m01M1Q82J572
2345A480L4k066j331J029J600N76l86j224j318L06J997J194j013j759o92P14J513
2362F54J044o92j852r41R45J760P88r32j719p30R79J640O85q61j675q61J049J853
2380A134N39j248j467m30Q03J582Q77j163j980l47J480J378J98q72j512p94J314
2397e08K050J59j732j349J05J038J404N36j435j968P2J921J272l68j240j245k15
2414a503J501J761k61j946j205N44J390J115n1j550j530M13J873J116o10j483
2430d26j065K96J568J321n13j806j065O78J589J005n11j642j123O33J752R84p72
$$ y = [1794, 20, -1326, -883, -146, 499, 1352, 807, -1304, -1852, 197, 1563, 773, -160, -598, -1189, -634, 1344, 1775, -366, -1719, -726, 419, 749, 1033, 396, -1404, -1667, 449, 1813, 775, -614, -1015, -974, -92, 1480, 1514, -552, -1883, -854, 746, 1322, 936, -288, -1606, -1300, 697, 1891, 878, -881, -1573, -859, 654, 1698, 1006, -846, -1787, -842, 918, 1706, 774, -945, -1675, -696, 944, 1629, 768, -907, -1768, -719, 1134, 1673, 425, -1042, -1472, -669, 913, 1790, 627, -1353, -1700, -220, 1158, 1356, 484, -1028, -1822, -508, 1542, 1701, -31, -1380, -1275, -237, 1167, 1703, 268, -1700, -1628, 293, 1565, 1197, -43, -1288, -1503, -2, 1759, 1498, -448, -1653, -1109, 281, 1396, 1345, -205, -1735, -1322, 551, 1667, 1057, -426, -1491, -1195, 373, 1694, 1181, -625, -1690, -1012, 577, 1582, 1071, -571, -1694, -1061, 691, 1675, 903]
2447I03j657r12P67J673Q71q15j688p95Q82J678P26r96j616n90R66J551O04r68
2465E84j603n39J129J538L54j088j391m18J046J503L77j221j441j71J180J281
2481A120K30j108j413k50J283J434K2j301j240k3J193J293P2j317j326P3J397
2498A39J161j84j281j110J29J313J146k15j377j040L34J303R15l11j228r66L49
2515i23J294Q83m20j234p72L88J186P95m39j236p13N30J155O34m44j138p09N31
2533f32J248N74o98j124m15N50J069N77o19j248m50Q45J115K26p19r61l75O76
2551c61J114L23q49j059j25P95Q86J58o91q99k14P26R05J51p65q44n5P35P32M9
2571G12n94p19j77O60Q25K0p66o25Q6N64N62R8n97p11N3P68N03k19n39m34K1N88
$$ y = [903, -754, -1666, -899, 774, 1645, 830, -858, -1653, -771, 907, 1633, 637, -979, -1569, -603, 948, 1552, 584, -1019, -1558, -429, 1109, 1463, 375, -1016, -1434, -388, 1115, 1492, 271, -1170, -1341, -161, 1120, 1350, 242, -1171, -1421, -138, 1296, 1318, 17, -1223, -1246, -53, 1240, 1312, -5, -1331, -1258, 139, 1300, 1116, -165, -1275, -1146, 167, 1313, 1098, -279, -1319, -985, 318, 1233, 922, -306, -1272, -923, 371, 1254, 834, -400, -1172, -784, 402, 1197, 758, -478, -1191, -661, 494, 1128, 684, -454, -1163, -632, 616, 1190, 492, -632, -1047, -497, 572, 1149, 530, -718, -1168, -323, 792, 1018, 299, -662, -1037, -361, 753, 1076, 227, -832, -957, -162, 724, 882, 191, -708, -922, -196, 709, 860, 95, -749, -804, -69, 663, 712, 118, -601, -778, -118, 707, 727, -39, -664, -578, -14, 548, 646, 49, -662, -609, 159, 662, 443, -96, -530, -509, 79]
2593G9O15k29p39l13L29M60K91n9o00n03L17P44J51m24l37j48L7M63M84l02p23
2614d07j24M69K91J9j4l21m42J94O62J61m53k82J8N9J94L44r7n13j73L72K82o1
2636A78j17j04j63M6L11J18k52k09R5J59Nl3K3o4q7Q7J43j06j63P8J88p1j85Q4
2660c9J11j06k9K19o6l21Q5L44n2k94P6J62k00l4L58lm63mM10J2k86J20J30l21
2684a91o9M90J11n08j32L61M5j64K02M8m63j28N88K79m67k70J73K2K1L83Q3o53
2706b39l61N37N19j75k70j01k45l6O41M59n65p28R7N11K13J02j6n84n27M72R03
2727F07L3o80l58RJ13M58N65l43j016k13Q18N55j56k75l30m53K22R99L51r03p37
2748g34K77N35K10K20j79q46l61Q90Q58l94p83j42J52J87N87K94q07r10M38J035
$$ y = [79, 694, 465, -274, -587, -258, 202, 493, 434, -166, -669, -352, 392, 543, 119, -218, -366, -329, 134, 618, 316, -407, -531, -62, 229, 248, 234, -87, -529, -335, 327, 488, 35, -247, -229, -170, 24, 368, 271, -242, -415, -43, 239, 178, 61, -43, -206, -160, 151, 269, 17, -192, -97, 62, 67, 34, 57, -7, -94, -7, 136, 30, -133, -55, 133, 62, -123, -39, 72, -34, -63, 156, 90, -231, -146, 198, 146, -148, -72, 90, -110, -144, 214, 211, -252, -256, 154, 166, -120, 0, 130, -191, -260, 230, 341, -167, -299, 62, 107, -57, 145, 193, -270, -398, 190, 469, 2, -268, -95, -73, -52, 331, 414, -239, -600, -63, 456, 281, 11, -90, -335, -371, 270, 729, 164, -564, -467, 44, 257, 359, 343, -241, -768, -296, 607, 640, -40, -398, -389, -276, 182, 747, 404, -612, -825, -7, 548, 392, 117, -213, -666, -444, 555, 906, 3, -734, -457, 78, 288, 508, 329, -517, -878, 12, 870, 476, -307, -449, -297, -110, 477, 771, -36, -946, -508, 527]
2768E27J46m84l13l34j74P13R42l95j258k83P58N51J61l1o58r45L20J437M89r50
2788B19q68n2K43O43Q95k48j537o89J091J126k7m93n75p33J76J459Q10j083j313
2807i56P7P25N30M70j36j220q40R80J377q5r27m84j69J82R27P35q25j352N6J092
2827A57N61j70l31o87n05P17J260j1j266o96M56O88M55J33o66j114oJ398Q87o82
2847E78j102l43K82O93R06Pj381j110P48J468L38o63p10o70j4J263J253o84j724
2866h65m17R48P92M16J9j070j304N28J822N40j106q81j96P0Q60J183l67j792n76
2885a396J187R59m1k40o59r26L31J589N27j224r79K04N04N01N70l58j350m16J218
2904AJ014l45p71m57j87M56J103K81j160j075L82J055N20j56o47q42j73J062J143
$$ y = [527, 673, 189, -124, -458, -632, 81, 1023, 628, -630, -913, -155, 396, 557, 526, -132, -1077, -757, 680, 1169, 219, -649, -701, -458, 185, 1080, 832, -705, -1394, -303, 823, 796, 303, -272, -1005, -829, 630, 1440, 357, -956, -879, -154, 376, 846, 710, -510, -1350, -370, 1007, 922, -5, -489, -658, -476, 451, 1186, 361, -991, -935, 157, 718, 548, 217, -470, -975, -258, 1002, 991, -275, -971, -515, 173, 628, 761, 95, -1019, -1025, 373, 1260, 578, -524, -867, -585, 108, 1014, 1021, -360, -1470, -722, 746, 1084, 421, -289, -959, -973, 290, 1543, 859, -865, -1282, -334, 458, 874, 893, -177, -1481, -953, 869, 1409, 303, -578, -774, -704, 156, 1339, 972, -820, -1396, -209, 750, 709, 469, -190, -1116, -785, 804, 1331, 107, -872, -668, -164, 337, 907, 549, -801, -1217, 1, 1015, 670, -101, -558, -745, -289, 814, 1095, -65, -1140, -758, 297, 817, 661, 14, -828, -1001, 61, 1204]
2923A204k75j309p25M52Q96O37rq97j118Q7J447R62o59j143m52K24P22J000O2
2942A106j415j117P49J332K56m51n49p42j76J238J145p22j385j45O40L97M75J99
2960H35j018j070O79J366N3p76l65k20r1Q34R08o46j313kQ91M01J5j11o91o82
2980a003O50J217j4r71n33J27L78O39L71o58j045J3R58O51j71o32o07q8O53Q15
3000G50K4q44p34J28Q04O04j31o45n93l3O50P99n5r03o06L17O36L36N5m78q05
3021g24j9R74O12n00o19j28K4K89P14P6r56n70O19O20q1j16j43n74j05R08N04
3042H05o99n94K12K08O6M11P3p84m26O68N78k37k97p3k75K1O50L13n89n12J77
3063c04L33J62J42j12n43j90N04M50j26l19k48r7K48M44M3l97l18K9K88L01K8
$$ y = [1204, 929, -380, -1105, -653, 243, 880, 871, -26, -1144, -1057, 390, 1352, 693, -450, -902, -678, 44, 1044, 1106, -309, -1426, -677, 655, 911, 460, -89, -831, -1007, 231, 1376, 654, -731, -876, -236, 161, 636, 835, -183, -1253, -574, 792, 845, 69, -296, -516, -607, 227, 1135, 489, -824, -826, 65, 466, 481, 370, -321, -1003, -353, 864, 850, -121, -654, -527, -149, 490, 861, 203, -842, -829, 129, 780, 609, -23, -630, -718, -65, 750, 774, -70, -804, -676, 128, 732, 601, -44, -637, -670, -20, 779, 724, -179, -785, -468, 168, 504, 559, 81, -724, -743, 231, 843, 343, -276, -404, -380, -91, 623, 699, -257, -827, -208, 412, 331, 215, 72, -502, -607, 301, 805, 106, -488, -276, -68, -2, 409, 482, -302, -728, -60, 518, 281, -16, -89, -364, -343, 307, 620, 31, -481, -304, 29, 191, 333, 221, -322, -512, -8, 442, 316, -3, -251, -348, -100, 344, 387, -10, -328, -299, -11, 290, 318]
3084C18l41k93Q7K57J99K7j91l38NL77J76j88j34m3j18J05L50nl97p1K58Ro8J75
3108A56l9l33J7L94kl17O0J54j81l1L18k9l76N6L21r6k06J70O5k39N3K94j03l06
3132b00J42K18j38r0J43m2j81J39J98j70j66J30R7q4J7N9j37o6K01R9j87o5M2
3155d1nN8J53o0k47j1J69Q3nj9j56j51J94K53m4j95q2m8N7K65J23k90k88J11K07
3180C1R4J02j14l70j16M13L08j70k35j12r2J67M27M9m88k90K24K76J30M2k35m22
3202c81K8N28K66k66l13j31K4K93L96j02n60k38K96L58J44q2l71l80J93N75K02
3223D79l11m04j75J66M54L27k87n88j64L47M44J87k60n33k45L95N63J06l73m79
3243c51j78L44O01J58m80n23o1L91N08J58m32o36n3N52M89%m23n11j25N22O39
$$ y = [318, -23, -316, -229, 28, 227, 254, 63, -275, -270, 107, 283, 95, -39, -82, -200, -95, 255, 250, -147, -218, 40, 49, -19, 156, 117, -216, -199, 195, 193, -124, -64, 90, -91, -122, 196, 167, -209, -153, 168, 72, -134, 36, 101, -138, -85, 209, 106, -200, -58, 160, 22, -68, 75, 33, -148, -9, 189, 19, -147, -17, 80, -4, 13, 72, -65, -131, 70, 169, -18, -83, -41, -46, 12, 165, 105, -142, -153, 16, 99, 94, 75, -81, -232, -38, 215, 171, -24, -106, -154, -97, 168, 291, 1, -287, -176, 31, 125, 227, 113, -257, -373, 40, 348, 178, -57, -169, -261, -94, 333, 382, -106, -396, -172, 104, 234, 276, 41, -381, -353, 175, 441, 175, -138, -269, -245, 48, 444, 342, -218, -456, -160, 198, 342, 260, -111, -491, -298, 277, 479, 168, -236, -411, -245, 209, 536, 249, -339, -503, -156, 288, 475, 215, -318, -563, -168, 395, 501, 128, -351, -529, -185, 416, 574, 94, -429, -490, -99, 409, 567, 135, -501, -554, -2, 487, 487, 64, -447, -572, -50, 589]
3264E89m0o09m60O6M53N07Q3n98o36J30O76M24j41n13m92j1O75O13k20p54l95
3285f53K62N49M41r2o99n65K84Q14L54l46o21l66J89P08M94l44q05l24M16O57
3305C53L15l10o89m09L86P84L09m48p15k71M32O92K92m23p50k89N14P66J85n44
3325A80o70j65M60O99K26n36p82j19O58O60K1n39o19j62N82P69N1p66o35J24O08
3346D5N27N8o02p44J6Q20O40k49o72m65N1O17O66l7q65o32L08P79L98j66o04o01
3368g12Q3Q60O40l72q37l74L08O09M90j24q05n98L56Q80L49m22o11l54K01P04
3388B71N30l63q61l15N06O36J92k84n94m18L36Q31K93n99o66m9M05M92K81l41
3408B83p78k64O70O87l7n33m57j31L57P19K13o78p60J06P01M20k7l95o20j68O58
$$ y = [589, 549, -60, -520, -454, -1, 506, 589, -9, -645, -515, 161, 585, 444, -69, -561, -572, 103, 716, 496, -258, -653, -391, 158, 599, 507, -192, -757, -473, 341, 695, 349, -272, -638, -449, 259, 753, 409, -396, -720, -304, 353, 668, 358, -331, -740, -354, 430, 739, 291, -424, -695, -263, 429, 721, 298, -452, -741, -227, 539, 724, 180, -490, -655, -195, 504, 730, 194, -588, -707, -49, 611, 632, 93, -526, -688, -106, 663, 714, -52, -687, -563, 45, 572, 630, 28, -716, -700, 120, 760, 511, -161, -626, -575, 42, 708, 671, -194, -826, -518, 261, 659, 493, -111, -712, -629, 231, 871, 499, -338, -712, -404, 205, 695, 571, -234, -832, -476, 404, 753, 331, -280, -634, -433, 271, 801, 438, -423, -738, -232, 404, 596, 312, -282, -700, -364, 467, 760, 161, -505, -554, -149, 343, 624, 283, -495, -759, -89, 598, 561, 28, -429, -560, -203, 516, 729, 51, -709, -603, 98, 518, 491, 96, -524, -692, -34]
3429c4P86j37p77m29J55M48M95J38o12p40J07Q04M57k54m97l66n9M85O91m0p91
3450a70m91L08N52K56m9l87n48j8P07N10l48o02j69K01L11L62J6o01m83L56O68
3471C81N9l46k80j66L6M93M11l64o84k6N03K95k2j18l64l45L33O89N3o10l53J62
3493b63K31K66K36k80o51q9O38M19k09l15k02j60J95N94J62n81n02K12M05J51
3513B57N8j43m64k30M98N24j73m72j20P5R5K87K07l24m98J08N00Q7k07o5r6j78
3535b74J73M15k8m76j02K93J18q3P2k9l15nM31J39l54j91J69P8m9J91M6l71j94
3558c46L78L00k31k04O5m2p0K77K35l27l69J88L03n9o0Q2j72k59K27L74j01l40
3580a51K4J33q3L7K47o5l55J0L04K6j92Q3R0k00r4K66J01k32o1J96l1k08J12K22
$$ y = [-34, 752, 615, -162, -591, -436, 12, 507, 645, 33, -707, -600, 204, 661, 407, -90, -456, -515, -30, 661, 621, -170, -661, -353, 199, 455, 406, 19, -529, -547, 160, 670, 322, -280, -449, -248, 63, 425, 441, -160, -643, -287, 381, 440, 94, -186, -352, -316, 177, 588, 224, -460, -486, 17, 312, 290, 172, -192, -537, -204, 485, 538, -72, -425, -263, -32, 234, 470, 190, -461, -550, 88, 507, 298, -17, -219, -379, -184, 410, 572, -9, -511, -299, 106, 257, 315, 172, -292, -522, -24, 500, 327, -145, -265, -190, -95, 192, 399, 75, -423, -315, 185, 272, 65, 0, -96, -274, -101, 314, 286, -190, -292, 1, 119, 36, 108, 79, -236, -241, 190, 329, -25, -216, -47, 31, -18, 173, 219, -152, -346, 32, 332, 101, -103, -38, -80, -150, 127, 362, 35, -334, -146, 157, 98, 38, 120, -52, -311, -84, 290, 189, -151, -127, 6, -77, -40, 207, 142, -213, -203, 101, 127, -65, 18, 108, -92, -186, 80, 181, -51, -112, 84, 53, -155, -43, 179]
3604A79j39j57J40P5j92j3K73mk70k0J91l5j03J79O6k97j05K79J55j67o8Q1j16
3627f8r9K40K05k45k48J47J65q1RJ13j49k25J69K96j16k47N0J10n8J6J84r8k85
3650b15P4L07lk29k6Q3p2M5K38l5l74m8L13J37j25l9n5j74M5L77J38l82k71J46
3674a45J93O6J16o2l90j74L85L83j30l08j16m3J02L49J96l66m61J14L76J57k9
3695B13j29k87j83L20M55n9m25k02J01J83K16J29k69m30L0M41K44j61k56j56l6
3716b61K51L49j1m51k87K16L67J23j16k49k63M9M35L13k66m55j12K58K78J86j00
3737B54m37k86K68N29J04l55l28q2J54M01K64k77n74j11M37L75K2k35l60k37K83
3758a91N79J08m81m19M9K84L47J80l14n53r0N16M21o7l57l44p2L12N09N1m92m31
$$ y = [179, 40, -117, 23, 98, -94, -107, 166, 162, -108, -128, 63, 28, -75, 104, 170, -127, -232, 47, 202, 35, -33, 48, -68, -167, 73, 278, 33, -215, -68, 97, 16, 25, 138, -11, -236, -67, 229, 113, -134, -84, 26, -32, -16, 168, 70, -215, -141, 166, 163, -66, -92, -9, -81, -36, 202, 167, -207, -255, 58, 195, 70, 31, -24, -198, -153, 224, 362, -20, -291, -145, 48, 114, 230, 168, -222, -396, -11, 372, 242, -66, -182, -225, -123, 226, 422, 56, -405, -291, 85, 242, 213, 84, -203, -386, -66, 389, 330, -95, -297, -196, -13, 203, 332, 63, -367, -337, 104, 348, 187, -69, -225, -261, -10, 339, 328, -123, -410, -194, 173, 296, 180, -69, -332, -283, 152, 465, 199, -256, -368, -110, 168, 354, 254, -183, -469, -201, 328, 432, 77, -251, -333, -179, 222, 486, 209, -365, -476, -39, 336, 358, 123, -237, -474, -191, 388, 496, 15, -404, -355, -71, 276, 456, 142, -411, -501, 15, 436, 369, 12, -332, -404, -92, 417, 468, -24, -455]
3780d55R0M14L22Ll72m19jM82M16j11m73l27J04M19L46p0m65l86J43N00L08j67
3802C01m72k85J56M53L40j65n33l11K65N11K23k46m42k66J77N45L00l12n55j71
3822d87L25M27J95k09n31k50L45N69R9l70m00j52K65M83K20l80n49o6M20L80Q0
3843D14k92m54j60M03N18K3m23l93l6L32M39R3m25m81J3M56L81k7l73m19j1M48
3865B6M31o2m61l61P4M22L79o9m71l53J06M36L54j14m55l35J41M71K82j52m20
3886a31k90J33M58K93k03m65k18J97L86K72j62m76k56K60M52J54k27l77k08J93
3906b15M74K03l20m24r6K56L47J69k16m70j53L40M23L6k74l25j15K28M26J23l48
3927F9m02LK94L13P4k40m10o6L52L47k0l06k84k9K80L44ml33k89L8L00K83k1l20
$$ y = [-455, -365, 49, 371, 374, 2, -417, -418, 64, 480, 369, -104, -431, -327, 92, 438, 368, -97, -483, -340, 160, 468, 301, -171, -456, -300, 153, 493, 328, -205, -516, -251, 260, 483, 237, -205, -471, -294, 251, 551, 239, -316, -487, -162, 265, 460, 251, -280, -530, -185, 384, 483, 113, -287, -439, -174, 309, 529, 149, -400, -466, -46, 334, 414, 122, -332, -492, -89, 429, 452, 29, -364, -400, -68, 371, 464, 39, -442, -429, 27, 408, 381, 8, -411, -422, 26, 457, 395, -66, -427, -353, 69, 448, 379, -92, -445, -339, 97, 451, 337, -118, -453, -312, 159, 441, 289, -131, -421, -288, 170, 463, 260, -205, -423, -226, 160, 432, 270, -206, -462, -202, 250, 404, 177, -200, -408, -215, 259, 462, 142, -282, -378, -122, 225, 394, 178, -292, -445, -105, 318, 354, 80, -245, -360, -132, 294, 417, 69, -333, -330, -36, 277, 351, 111, -299, -365, -13, 334, 314, 8, -276, -305, -25, 319, 315, -18, -307, -269, 31, 314, 293, -27]
3951b7k72L3L30K34n4l00k42N2L20K36r1k99k02Q9K64K43j13l21j70J36K76J30
3973B52q0k63k11J37L26J23j77k36r6P5K54J72j38k95r7K01K10M3p6k15j63J48
3995a06K95O1k14j93qJ02J87J13j39k76k9K30J42j3j04j51r5J51K26K0k13j32
4017a46K9J03J17L4j15j73qJ74J27l0j37o7j4J09J13j2j19j23N0J33O5n5q9l6
4041g0J1P3R2j8j42m3Q9P7qk2l5o8J8J01O3j14q0O6M2k0L3J4j05m5J23O8q5n0
4069c5M6j1m6Q0M8r6o9J01M7r2qP4l7n7O5N2r3m7J12L7r0k6O7k6k7O6M5j19p1
4098a10J05R0m6n2J8m3j7R2J06j04j42J8J06L6J5j2q9r5O5J91J2j62q4M0M1P0
4124D9R0n6j91n1J85J30q1r7k8n2M0J83O4j98j73J00J65oj2j7j48q1K11J85j10
$$ y = [-27, -299, -266, 64, 298, 244, -56, -298, -246, 74, 310, 219, -80, -282, -193, 71, 314, 201, -120, -290, -154, 122, 252, 172, -91, -302, -165, 161, 284, 107, -129, -225, -150, 104, 276, 138, -157, -254, -53, 157, 200, 124, -91, -254, -106, 189, 250, 36, -157, -165, -63, 124, 237, 98, -178, -207, 23, 165, 152, 48, -103, -198, -47, 179, 199, -14, -146, -117, -14, 103, 137, 22, -151, -159, 15, 142, 112, -25, -92, -106, 3, 116, 104, -15, -138, -88, 45, 110, 55, -34, -70, -59, 14, 106, 88, -54, -97, -8, 69, 61, 39, 4, -64, -46, 55, 118, 4, -76, -10, 32, 12, 45, 59, -46, -91, 32, 100, 15, -35, 11, 0, -46, 34, 82, -14, -83, 18, 65, -27, -35, 39, 2, -55, 10, 62, -31, -78, 34, 71, -19, -45, 22, -4, -31, 35, 80, -39, -110, -5, 85, 39, -13, 5, -38, -55, 37, 143, 39, -103, -85, 21, 57, 72, 60, -29, -124, -59, 132, 144, -18, -102, -62, -21, 49, 139, 83, -108, -159, 26, 156, 75, -22, -50, -102, -62, 121, 185, -13, -186, -86, 79, 73, 61, 44, -104, -185, 26, 211, 101]
4149A01k24%P7N7Q9O7k00k27J49K59M6j84p4n4j6K00K00j23l26m6K33J34J8m2
4173A14j66j94J04L54P9k71k00J7J05J50J44p6l51j28K87K77l9j81j39j01P6L00
4195A61J79k85l20M1K44J39L6j06k56j54K59L44k9l14j43N2J18J92J06k14l55
4216c05M5L56J64j24j83j22l7K04K99m2l73j94K06K47P6l9j95k53L0L93K20k28
4238A45l31n2J33J76K17m5l74k67K53L86O1k02k26j44O2L38K79k41m48n9K66K57
4260A84O8q1l14k44J99M63Q6l18k61j3J29K35K25j87m32r7L36L07n1k03j83j20
4282b72J46L94J04l56l25R6K54J74K8j56l19r0L55L26j17l29j49O3J82K58M7l34
4304b0l24J14L80J65j43k29j82qK98L08j10m17j80J98K86J21m9k76k82Q9M33K18
$$ y = [101, -123, -123, -46, 11, 100, 167, -33, -260, -111, 148, 194, 10, -64, -118, -134, 66, 266, 143, -183, -229, 4, 138, 156, 114, -52, -246, -142, 212, 291, 20, -180, -163, -58, 92, 236, 160, -191, -319, -32, 245, 206, 25, -114, -215, -139, 161, 340, 55, -265, -224, 20, 159, 195, 89, -167, -321, -62, 282, 253, -61, -204, -152, -34, 158, 264, 50, -305, -260, 96, 260, 136, -47, -169, -206, -2, 297, 255, -118, -312, -106, 141, 217, 178, -17, -270, -240, 153, 373, 145, -186, -238, -105, 71, 288, 243, -131, -398, -145, 241, 302, 100, -126, -270, -208, 130, 409, 168, -280, -339, -73, 184, 252, 171, -143, -387, -188, 275, 361, 43, -218, -231, -102, 133, 358, 171, -261, -358, -22, 285, 234, 31, -152, -272, -126, 268, 372, 16, -309, -213, 41, 215, 243, 87, -232, -322, 33, 359, 242, -87, -236, -173, 9, 267, 314, -20, -344, -230, 150, 315, 172, -57, -239, -247, 51, 359, 249, -168, -348, -150, 136, 257, 208, -68, -350, -261, 172, 390]
4326C90k41l40p5J14K35K36o7m14k23K54L69N4j80k12j73O4L71K40k63l74m6K34
4348d7K07R3p8l10k13K48L73K1k77j99j7J25K30J50j89l70k1K99K25n8j48j96
4370a52r8J89L27Kl07k24Q9K04J54K3j87k72qL15K50j13k66j44M4K00K18J1k91
4393c6k64J25K98J23q9k03j74K6K55K44r7l30j18J40K08J14m4k15k37J10L26J09
4415B71j80k08n7O6J76J75q3k86j31K03K15Qr5j43j24Q3K52R2j80k15nJ40J25
4438I9O5p4k22q9J86K15oj95r7j8R2J65O8j66j98K8J72J20l2j01j29m5J49J78
4462A65rj87j13N4J19R9Pj20j61L4J64J13p1j36o0K6R8J08jj61j08P1J44L1m6
4487F0p0p2jJ21J02p9j38j4P1N2L9kj02p0O3J11J1p4n8KOQ0M2l9j15LR5L3j9k9
$$ y = [390, 149, -191, -266, -152, 83, 319, 252, -162, -385, -131, 238, 292, 112, -100, -273, -209, 162, 402, 139, -235, -281, -47, 160, 253, 175, -135, -348, -100, 273, 294, 17, -182, -199, -74, 156, 306, 117, -253, -274, 25, 250, 192, 44, -152, -250, -61, 266, 268, -39, -263, -174, 30, 184, 207, 20, -252, -260, 55, 305, 192, -74, -218, -174, 26, 244, 255, -36, -300, -175, 123, 246, 157, -46, -220, -194, 61, 305, 208, -122, -240, -100, 108, 222, 178, -37, -274, -164, 162, 271, 91, -117, -174, -108, 68, 243, 160, -126, -257, -54, 161, 169, 74, -69, -193, -110, 142, 234, 54, -161, -166, -26, 99, 164, 90, -132, -221, -35, 180, 174, -21, -118, -136, -44, 121, 189, 23, -175, -147, 25, 145, 113, 12, -117, -162, -13, 165, 156, -31, -144, -90, 29, 128, 135, 15, -146, -112, 52, 165, 94, -42, -102, -76, 22, 130, 129, -32, -140, -69, 75, 106, 60, -10, -82, -83, 38, 140, 61, -77, -91, -20, 32, 71, 69, -33, -103, -40, 71, 82, 8, -50, -48, -42, 38, 80, 41, -74, -71, 24, 57, 38, 9]
4517Il4l3N1O9Rq7l8L2L9J3J8l3m2mN0M4m6l3LK5RM%m2j2K5L6rl5KJ4MKJ1k9k1
4553b9J3M2On4MRK1RJ1k6m2J6O7Mm6k3Rj2M8L0l8o9LO1M3k8m0k8qM6O4J5q5m3
4587e0J8M9M3J3o4p0pJ09N9l5q6m6K3P4P0k7r4p2N3J02L3l3r3n6L5J10O0o3j15
4616f0m9O2J19K9m1j15n3P1J21M7q1j33k4Q0J05N5j02j22m1J05J43J6j11j17k3
4641a19R8J40L6j42j39J3J30J15Nj22j33j7J46J50j2j65j04j1J42J46nj73j30
4664a51M1J65J09k9j56j30K9J69J49n0j95j30P7J60J13m8j94j17P1K10J01q4j90
4687h0j04Q6J89R8r7k01j00J33K00N5j05j66q9R3K11R1j39k04o7J60J77L8j06
4710G3k00p5J44K32M2j92j94RJ28J85N9j61k15k8J98J78kj66j70l0J68K31lk23
$$ y = [9, -25, -58, -7, 62, 71, -16, -54, -22, 17, 30, 48, 15, -27, -31, 19, 63, 17, -16, -13, 12, 21, 25, 25, -17, -29, -4, 32, 23, -12, -10, 4, 8, 10, 21, -8, -29, -16, 26, 32, -22, -18, -9, 12, 21, 32, 6, -36, -20, 47, 51, 5, -18, -9, -21, 27, 57, 19, -50, -47, 14, 57, 29, -11, -39, -47, -1, 63, 78, -7, -50, -32, 17, 60, 73, 9, -61, -68, 41, 100, 65, -21, -67, -44, 30, 100, 73, -21, -93, -40, 62, 95, 62, -31, -87, -52, 58, 118, 55, -60, -109, -47, 72, 101, 60, -55, -108, -37, 84, 131, 50, -83, -107, -27, 78, 133, 31, -91, -132, -27, 116, 132, 21, -96, -119, -21, 119, 155, 13, -126, -113, 17, 132, 137, 15, -118, -135, 11, 161, 149, -16, -120, -131, 11, 157, 152, -21, -151, -110, 55, 164, 135, -21, -151, -122, 47, 196, 146, -49, -179, -102, 58, 171, 123, -71, -188, -117, 93, 194, 110, -80, -184, -98, 91, 189, 92, -109, -209, -76, 124, 179, 74, -92, -181, -88, 123, 214, 75, -129, -196, -36, 141, 179, 73, -127, -202, -58, 174, 216, 24, -170, -161, -33, 152, 211, 50, -165, -193, 5, 183, 181, 15, -155, -185, -17, 214, 211, -12]
4734a2j88M3J87J51Kj77k11J2K26J92n8k16j40L2J79J92j8k52j70Q9K16J19o1
4757A37k03j32M1K34J62r4k39j19J08J96J16p3k21j38J01K53J09j40k18o8Q6K02
4779A00J25j03k60q8J74K12M9j37j73j03J32K39Q5k00k18k4J61J70O2j33k28o6
4801b24K00K31%j95j68pJ36J93M8j72k53L4K08J44j1j52j80k2J81K32l8k38j45
4824a98P4J54J40Nj77j98M2K41J24p5j92q5K1J60J74m4k34j27J05J75Q3n9j56
4847d7j16L9K15J40j31k12n3J15J31J02o8j96j33J34K31L9j53j30m3O8J54J06
4869A92j22k29k4J83J21%q3j40p8J15K15L0j84j36K8J00J02O7r6j93k6J90J49
4892A81p6j31q0kQ6J60K9j80j47P8J50N1j9p9j04l1J44J43p1j67m3O3P5N7K4j16
$$ y = [-12, -200, -157, 30, 181, 183, 6, -205, -193, 33, 225, 167, -49, -189, -157, 22, 214, 196, -56, -226, -137, 79, 198, 137, -66, -198, -157, 77, 239, 145, -94, -213, -105, 91, 207, 134, -87, -225, -124, 129, 238, 98, -120, -188, -102, 100, 225, 122, -138, -226, -52, 160, 209, 72, -101, -204, -72, 167, 252, 52, -166, -190, -29, 141, 203, 70, -158, -224, -24, 207, 207, 12, -156, -163, -27, 166, 214, 42, -211, -177, 31, 175, 164, 12, -168, -190, -9, 223, 185, -53, -198, -124, 30, 170, 175, -2, -200, -158, 83, 207, 132, -60, -145, -124, 36, 210, 166, -68, -195, -90, 85, 168, 109, -47, -163, -124, 91, 231, 100, -112, -165, -50, 81, 183, 115, -81, -214, -80, 151, 190, 37, -93, -136, -68, 86, 192, 70, -159, -183, 0, 121, 121, 38, -102, -180, -65, 150, 180, -4, -140, -112, -12, 90, 157, 61, -132, -158, 32, 181, 105, -26, -106, -108, -22, 138, 167, -13, -160, -82, 68, 119, 100, 21, -83, -114, 30, 173, 102, -65, -108, -45, 30, 87, 111, -5]
4918ej36O2J64M2q8q1m0J6R3J10m3j71n9J25Q6J5n0n7j02K9J67N3j13j13K0O0
4944a6N4M3k1j17p9J18J07k8p1l4lJ1R1N6q8j09K5J04J1j1jn5n4O7J09j7j42j2
4972f2O1J2J2M2l9r0RJ04L6q0k1J7k9J2O6J9j14k2O1M4l1qJ6m9j0O6M2o7m3N3
5002GJ4k9J2L8m7m2N0N3m7m9M6J7k6%L5j8m9L7M1j9n4L8K6l2nM4j7n1J8P0k1n8
5034a8NL3k2j2N5rp5J0P2J4o6J2J3l2mP8Mr5k2O5K6k5oQm8jQ3K7o7p3M9K9RK8
5068D5pr2k0P2Q5l0o2k5LJ3O9L8p7q8J2J10K7k9l4m1l6P0J01j3j03o6N7N0K7J7
5098G3n3j09J6J23P0o6q8k1oQ4P8mj37p6P8R4J6l6p0o2K8J15P9q9j17rP5P7K0
5127H3k0j23o3Q7J42Pj02q2j8O4J03N8r2j43j7J37R6j7o7j05l0Q7J38%j30r1K2
$$ y = [-5, -141, -79, 85, 127, 39, -42, -82, -66, 27, 137, 94, -77, -136, -11, 75, 90, 40, -17, -119, -90, 77, 130, 17, -96, -76, -16, 38, 81, 60, -57, -136, -18, 89, 61, -10, -44, -47, -36, 55, 111, 23, -86, -61, 43, 54, 43, 42, -13, -67, 0, 109, 92, -50, -62, -1, 11, 23, 65, 26, -64, -55, 49, 85, 5, -16, 1, -28, -16, 50, 69, -45, -67, -6, 38, 7, -1, 15, -34, -44, 22, 64, -3, -46, 7, 21, -8, 4, 42, -5, -47, 3, 56, 9, -40, 6, 23, -3, -3, 32, 14, -35, 2, 43, 24, -30, 8, 34, 2, -3, 41, 24, -27, -9, 61, 40, -18, -13, 20, -2, -14, 41, 32, -43, -33, 39, 53, -13, -1, 12, -20, -24, 54, 58, -37, -59, 6, 32, 7, 1, 9, -39, -40, 43, 70, 3, -70, -21, 8, 17, 45, 38, -54, -74, -2, 83, 53, -9, -34, -31, -18, 51, 89, 12, -76, -64, 46, 73, 44, 10, -31, -67, 3, 104, 91, -12, -78, -21, 29, 56, 73, 20, -89, -73, 50, 120, 54, -34, -55, -61, 23, 101, 97, -40, -116, -38, 56, 72, 36, -34, -96, -68, 47, 126, 37, -80, -89, -14, 63, 83, 63, -60, -123, -36, 106, 113, 11, -71, -89, -25, 78, 136, 44, -99, -116, 21, 117, 100, 33, -72, -102, -15, 123, 123, -7, -98, -76]
5154g6Q5Q8K6j04j26KJ18J29l9j17p4nJ00J25j8j39j07M4J40P0l5j11r7K4J21
5179B4J14m8j38q0O5J21O1k6j32r5N8J51Q3p9j52l0N3J20Q4p2j54p0R7J57L3q3
5205F2j15p4P5J51O3j15j58pJ05J06M2q2j55k9J24J29K0j24j14k2R6J36L5j24
5229B5j53J4J20J21oj09j17j7J28J28Kj56j10K7J17J10j0j31j23L6J28J19l9j33
5253b9j02L6J26J13k9j50j04N0J44R2n2j33q5M4J42J02p4j57o6O2J52N2p0j20
5277e6p9P4J43O5p8j41o1Q2J23Q1r1j48o1J12J25L0q7j19n1Q3J48M8j21j24j1
5302a14R2J09M3r1j35j9J07J16J5j10j02j7R4J21Nj09j05QR7R7J5j01j02mJ10
5327B0R8k0j02q6J4R8R6k0j15r6L2J17Q1k8j17o7M4R6O9k6j23o9N0R7N5m4r8n7
$$ y = [-76, 9, 97, 123, 19, -107, -105, 13, 142, 103, -14, -88, -93, 7, 132, 114, -25, -132, -88, 52, 122, 87, -24, -121, -97, 24, 138, 90, -48, -128, -63, 58, 119, 93, -39, -134, -76, 75, 158, 79, -73, -103, -50, 70, 154, 82, -72, -142, -45, 112, 145, 62, -53, -127, -52, 99, 162, 47, -111, -118, -13, 93, 135, 53, -102, -131, -7, 122, 142, 18, -96, -118, -22, 114, 149, 25, -128, -114, 6, 127, 121, 12, -105, -122, 6, 134, 136, -20, -130, -103, 14, 124, 114, -17, -140, -104, 24, 143, 104, -29, -131, -95, 31, 144, 115, -35, -139, -89, 55, 147, 95, -38, -123, -79, 63, 165, 91, -66, -132, -70, 82, 134, 64, -56, -135, -61, 82, 147, 69, -72, -133, -51, 72, 153, 62, -86, -147, -35, 90, 120, 33, -86, -137, -54, 94, 142, 21, -103, -114, -22, 87, 130, 39, -96, -115, -8, 108, 123, 13, -89, -106, -12, 109, 114, 5, -100, -92, 5, 102, 117, 16, -86, -90, 20, 118, 98, -4, -90, -76, 22, 118, 98, -17, -113, -81, 36, 117, 89, -28, -95, -51, 45, 114, 88, -35, -104, -54, 43, 98, 54, -44, -101]
5355a01L5J10N9n0j10l8N7R8L5m6r1o6P0J01L1o4p0m5N2R3L3n8j03j4P1Q5ll0
5383D1r0l3P9Q6qn3o2j8M7Q3On4p7mO7O9np7l7qN3N7no2m3MO3L4om7o5J7O3N3
5417F8j7p4k7K9M1L1j6n8l9M4N9K6m6m9pJ9L6M1l1n6j4L4M7j2j3j6l1J8N1Pm0
5448El6J2K7MK7j9m0nL1K5j5j8jNrL6Pl3l5K7L1j1lJk0%J6J8k2k7PK4JoOj9mK0
5486GRjk8LJ7OoPj9j8K5K4Km2NK5lQ%j6j7KM1Ll7j6K1JPJ4J0n4rN1K7l6j4oqK
5526a3N3J9o3m6L8M5lj3ml7j6M7N6m0m6pJ2K7K0J5m6o1L5O3ll2k2j3qN9M8k9r4
5559e9lM9N9jj1m8l7L3O9K8o4n1J1K9L0K0j8q2k6P9N8j0o1k0j6K7O5K7o2j01K7
5590e9Q7L3jn2n8k6P9Q4qj03l9K3M9N1J2o3j01K1J02O1n5p1k7mO3R0j1j20n8N8
$$ y = [-101, -66, 44, 103, 53, -57, -95, -38, 60, 95, 49, -42, -108, -38, 63, 94, 30, -40, -85, -33, 60, 93, 35, -68, -82, -11, 74, 71, 41, -49, -82, -3, 83, 75, 22, -40, -58, -11, 72, 78, 24, -53, -57, 10, 79, 74, -3, -40, -48, 5, 62, 57, -5, -48, -44, 19, 53, 47, 0, -65, -48, 15, 68, 51, -23, -50, -21, 20, 51, 35, -23, -62, -18, 41, 67, 21, -28, -35, -16, 20, 61, 30, -26, -40, -6, 41, 29, 16, 0, -31, -13, 38, 45, 5, -31, -19, 8, 12, 39, 20, -20, -25, 6, 31, 16, -2, -3, 2, -7, 29, 36, 3, -32, -5, 26, 15, 12, 13, -7, -7, 9, 27, 5, -22, -15, 9, 10, 4, 10, -9, -13, 7, 16, 15, -13, -10, 7, 13, 7, 14, -5, -23, 2, 26, 28, -14, -9, 16, 13, 21, 21, 5, -12, -10, 31, 34, -3, -19, 2, 3, 10, 24, 34, -20, -29, 22, 49, 13, -1, -7, -15, -13, 40, 59, -4, -50, -12, 33, 30, 17, 13, -24, -40, 7, 63, 23, -23, -30, -18, 9, 29, 44, -2, -63, -28, 35, 32, 0, -22, -35, -43, 16, 64, 35, -59, -62, -13, 46, 45, 34, -14, -51, -18, 51, 79, 15, -36, -25, 4, 34, 54, 36, -46, -72, 7, 65, 55, -6, -26, -42, -15, 50, 77, 15, -86, -59, 28, 61, 60, 8, -50, -76, 3, 87, 79, -24, -63, -40, 9, 60, 72, 9, -92, -71, 31, 92, 37, -34, -61, -65, -2, 88, 77, -43, -101, -43]
5620d3Q1L0po7q2K4J08P8p2r3k1M4N7M7k3r9n2O2J11Po0p4j8K2R5N6o4j21j8Q0
5650a2P4K8n6p8n3O8J16K0j08q2L2L4Q8K3o7j16j4J22Q7l1r3n5k4P3J14J7j17
5677a0j04N1R0N9qo8j00j2J15J05k6j19o6L8P4Q0pj08p7K5J24N6m8p3n3jR8R1
5705A26n6j24m7O8Q2L5j9q9q4M0J19O0q0r9j9O3P4M9m5j23n2R2J18Jq2o5l5M9
5733d3J10N5r8j18oR2Q4Nm6j03l8R0J19lj00r1K5N7Q5J4o7j18OJ17Q0k7p0r2J0
5762g1P3R6Nj17p1L0Q3N6rp4q9J2R3Q5m6r6n1L8O2O2kr6o1L2J03L2m7o6m5K8Q2
5793C1N4l3j10j8N1P0L6l8p9n5N3J01L2p8o7j8L7P8L9m2j07k2P9P9j0m5o2k7N2
5822a9R2K8p6r2J6O3N3Qn3p0j2O5O5k1n8l8nO5M4Mo3o5RO9M5j3o4k9lO4N6k3p1
$$ y = [-43, 38, 68, 61, -6, -88, -64, 44, 122, 50, -43, -64, -20, 37, 84, 61, -38, -90, -28, 83, 90, 30, -44, -62, -40, 55, 111, 47, -74, -92, -12, 62, 90, 34, -44, -97, -29, 87, 107, -1, -83, -51, -17, 71, 94, 27, -89, -103, 19, 106, 75, -18, -73, -97, -24, 90, 107, -10, -114, -63, 27, 86, 78, 10, -90, -102, 13, 118, 92, -27, -93, -55, 19, 99, 92, -16, -93, -68, 56, 112, 64, -9, -62, -63, 35, 126, 70, -54, -101, -33, 49, 84, 65, -24, -108, -68, 51, 111, 31, -68, -87, -24, 50, 99, 54, -69, -121, -29, 89, 90, 8, -57, -92, -43, 67, 122, 24, -94, -100, -8, 76, 81, 35, -68, -106, -16, 103, 100, 0, -91, -66, -9, 76, 90, 23, -95, -89, 28, 108, 81, 11, -81, -71, 2, 98, 103, -14, -85, -55, 28, 84, 75, 1, -88, -76, 17, 102, 56, -40, -91, -53, 9, 71, 69, -27, -88, -56, 47, 79, 32, -34, -79, -51, 31, 85, 52, -58, -76, -25, 45, 81, 43, -36, -91, -38, 63, 95, 17, -50, -68, -31, 47, 86, 44, -63, -85, -6, 73, 63, 18, -44, -71, -19, 73, 101, 25, -67, -51, 12, 65, 73, 20, -50, -62, 3, 68, 47, -11, -49, -54, 11, 55, 59, -4, -69, -60, 9, 54, 41, -23, -52, -55, 9, 65, 42, -29]
5855b9l9K7N5K8j0m6m9K3P6K6m1m0k8J9M6K8j4o0k3K6M3L4k6m5k6L1N1J7k3o1
5885c0LK9L8Jk2m1j4K7N3nl4m0OL1K1J5k4m0j0L6M0j8k5k4NPM2Jm5j7J9K4Omj1
5920@k8QL8Oj2k7J7j2L2oJk5k1L7OJ0j1j0lNJ0Rk6rJ2J8Jpqk3QNJ9j0j2J2lQr
5959@j4J1J2j0J4Lk3j0K5Lqj4rJ8oJ7Lj8j3J1J9Jnnj5%J9J5k1lj0NK8npj0j9J4
5997gL2Nj2k0j7J0L2K9k7m8K0J4J8%Jn1j5L0L4Nl2k1pK8K7J6l8l6NL4L4j5l0l0
6031c2mL2M1km2m1J9L6K9ll9l1J4M2L3j4n0k4QN4K2j1n0l5J5P0K0k6l4k9J5M4
6063B7L9k1o4k6K8N4J7k9n4k0K1O1K9m1o7j0M2N3K0k7o6k5N7M7J4m3n7j2M2O5
6093E4J3o4o2kN7N5J0n9n0j1O5O8j5n9n3LO6M5nn5n5jO8N2nn7n1J6O5N5j0q4n6
$$ y = [-29, -68, -41, 14, 42, 32, -14, -63, -40, 36, 62, 21, -19, -47, -28, 18, 46, 32, -28, -51, -25, 18, 52, 26, -19, -45, -14, 37, 54, 31, -30, -27, 2, 40, 41, 19, -22, -36, -9, 44, 39, 5, -35, -29, 2, 23, 38, 14, -26, -36, 0, 40, 22, -3, -27, -22, -15, 27, 28, -17, -34, -15, 9, 15, 11, 0, -28, -20, 18, 24, 12, -15, 2, -10, 22, 16, 17, -8, -29, 8, 14, 24, 13, 3, 0, 5, 15, 24, -2, -11, 1, 19, 20, 13, 5, -18, -10, -5, 14, 4, -8, 4, 1, 9, 0, -14, -3, 9, -1, 13, 16, -7, -17, 8, 11, 3, -11, -20, -2, -8, 9, 12, -6, -19, -8, 11, 12, 7, 2, -13, -13, 6, 21, 0, -3, -13, -8, 20, 15, 8, -2, -21, -7, 25, 30, 18, -2, -19, -9, 23, 52, 25, -23, -3, 11, 29, 29, 30, -21, -36, -6, 28, 33, 1, -20, -27, 1, 28, 44, 6, -30, -25, 9, 43, 28, -2, -32, -36, -4, 37, 35, -7, -48, -29, 7, 36, 33, -6, -37, -23, 19, 52, 38, -12, -36, -28, 26, 48, 37, -13, -48, -33, 37, 57, 31, -3, -32, -17, 27, 66, 45, -19, -45, -17, 37, 54, 25, -29, -49, -28, 33, 62, 21, -46, -56, -14, 39, 59, 32, -34, -59, -2, 45, 59, 16, -41, -53, -11, 54, 67, 3, -59, -61, -4, 51, 61, 2, -48, -59, 6, 74, 59, 0, -53, -50, 16, 61, 56, 1, -54, -55, 13, 65, 60, 3, -48, -32, 33, 88, 78, -6, -62]
6126f2J7Q0N5k4p1o1L5M9O1l4o8n4N0N4M5k9o8n5M6Q9K6n8n8l2L0Q2L2l9r2k4
6156g8O1O1K7m6o2m3N6Q6J3o4o5j0N1O7K4n5q3JM4Q5J0p2o3j6O8Q0Kp4p0KO9N8
6188F4J3o6o8j1Q1O5j1p7m0jP9M9Lp7o8jR0M3j9n8o9J5Q0L4Mq5n4L1P2M4j6o1
6220a5m9K8P4M3m0p0l2L3O4M1l7o7n0N8O8J9l9n8l4K1R2L4o2p5j0N0O2J6l8o9
6250d2l2O0Q4kn3o5PK3N6M2n2q0j2P7L4oj6o4j6L6P8oo0m9lN7L7J2m5o1jO0N8
6283E6qo2l4J5L9L9mn5n2K5P4J8k6m2j8j2P4M3l9n3k3M1K6J8on0l1L0O4K1n3m7
6315c2mK1L6K3j2o1j9N2M2j4k8j7l0J2O0K3n1m0JL3K9Jpm8k5N1L5j1l1qj0K5O
6348BL1l3n2J3M9O%k8k2LL7M2k4k6k6K4J8OMk7l0OL7J3j5k6MLK1J0mk9j7K8J8
$$ y = [-62, -45, 35, 90, 66, -5, -66, -31, 18, 79, 45, -23, -77, -27, 27, 72, 43, -25, -80, -34, 55, 81, 23, -35, -67, -37, 45, 77, 38, -54, -78, -17, 44, 71, 25, -37, -80, -24, 62, 75, 11, -54, -64, -13, 54, 78, 23, -60, -59, -15, 70, 80, 8, -55, -71, -3, 77, 79, 5, -65, -63, 6, 64, 77, 11, -57, -68, 13, 78, 67, -10, -50, -51, 28, 77, 80, 3, -65, -66, 24, 67, 48, -10, -79, -64, 16, 50, 54, -31, -85, -54, 18, 62, 46, -15, -64, -36, 38, 81, 41, -29, -61, -28, 36, 77, 40, -27, -77, -19, 49, 68, 29, -29, -63, -42, 50, 84, 22, -53, -63, -13, 49, 65, 27, -42, -74, -14, 70, 68, 15, -50, -43, -20, 36, 78, 26, -54, -66, 11, 45, 39, 23, -41, -57, -21, 57, 51, -9, -58, -61, -4, 33, 45, 0, -61, -62, -2, 56, 48, -14, -48, -33, 6, 45, 41, -14, -66, -41, 33, 51, 25, -17, -35, -47, 27, 70, 31, -22, -45, -4, 22, 40, 34, -16, -47, -17, 47, 68, 15, -32, -36, -15, 21, 44, 32, -29, -48, 4, 46, 32, 4, -13, -43, -31, 29, 52, 1, -39, -38, -5, 24, 25, 18, -30, -55, -4, 31, 20, -11, -19, -29, -4, 2, 33, 0, -52, -39, 10, 16, 16, -12, -34, -31, 6, 48, 24, -2, -28, -4, 14, 20, 24, -3, -33, -27, 10, 23, 8, -18, -14, -11, 10, 20, 16, -13, -30, -2, 16]
6383A6j3j3J2k7RK6J8j5m3J7J0MORk2k1J1L4nl8J9nL%K4rl1J7J1Jr%KqOJ6kk3
6421a3nK5Jj1LNoNJ1Lk8NJ3Mj6PQk8LK7J2k8%KNoPmk1jJ1K8rl6J1J3jRK0l9rJ6
6463gK1lj2nm%OJ7km4RK6KPoj6j6J4L9ok4j1J0J5OMj4k5kM0J7k9j6j5J7K2K2n
6501C2m2k4K5M1qmk9l0J7M0J5j6m4j3K9J4J1nk4l9L5M0Pk0l2lJ1L1K7k5m4j3K6
6534a4M0Lk4k5l2N2L6J2l4l9pM0J6J4k8m0j5M8M9k6k8m4J3M3L4Nl9o0J8N2K0n
6566C5l8l2oM0N9j7p0k6K6L6L4k1l6n1K1N7L4m0l8l5L0M2M7k5o6k0J9O0J3k3m2
6597c3k2K4O4K6k3p0k5M7N3J2l7m1k2L8N3J3l9m9k4M1N7J6m0n5j4M5O4j6l3m0
6627c0j8M8N9ro0n2J4M6M7Lm6m5k3P9L1rl9n5J3N4L4Mn2n3QN9M3k1l8n6J4P2M0
$$ y = [16, 3, -10, 2, -25, -16, 10, 28, 13, -30, -13, -3, 1, 7, 16, -6, -27, -16, 18, 13, -25, -6, -11, -8, -8, 16, 7, -24, -7, 4, 5, -4, -4, -2, -10, -4, 12, 10, -13, -18, 7, 8, -3, 0, 5, -1, 4, 15, 18, -10, -5, 8, 12, -4, 3, 11, -17, -14, 13, 25, -3, -3, -1, 4, -2, 5, 1, -20, -21, -10, 18, 9, -27, -16, -3, -4, 5, 25, -14, -23, -7, 14, 11, -1, -6, -10, -10, -4, 13, 11, -33, -24, 2, 4, 11, 5, -11, -27, -13, 26, 20, -4, -15, -5, 10, 16, 20, 6, -19, -21, 19, 36, 7, -9, -24, -7, 15, 37, 32, -10, -34, -9, 32, 24, 20, -9, -39, -22, 18, 33, 17, -27, -40, -11, 3, 14, 9, -15, -54, -19, 21, 28, 8, -24, -27, -16, 15, 42, 17, -27, -40, -14, 26, 29, 5, -20, -52, 0, 36, 48, 14, -25, -32, 8, 24, 38, 10, -30, -45, 3, 52, 26, -2, -46, -33, 10, 44, 49, 10, -50, -32, 20, 40, 35, -3, -35, -41, -1, 58, 41, -29, -55, -29, 7, 41, 20, -16, -67, -46, 11, 45, 5, -33, -68, -38, 4, 51, 26, -40, -60, -41, 19, 32, 9, -33, -55, -31, 33, 59, 36, -34, -59, -12, 41, 53, 16, -25, -47, -9, 44, 57, 18, -31, -55, -14, 43, 59, 19, -36, -50, -5, 59, 43, 10, -30, -48, 0, 59, 50, -10, -62, -48, -2, 45, 48, 2, -43, -66, 13, 44, 35, -4, -59, -46, 8, 42, 46, -6, -59, -51, 8, 51, 30, -8, -64, -50, 22, 62]
6660F2k6l6n5K5N9L5k9n2l4K6M3M6j9o8l5L4N6L8l8o5k1L2O1K3m0n9k1L6N4K3
6690E5l8n5oK1O2Pm1m9k0N5N0J0m4n5j0M8M1K4o3m2oN1M1ol1m6j5N7N0qm2l4k
6723d1N4L8j3l3n4K6M4L8j6m8k3JN0K6qn1m3K4L9M7j7n1l4PN8L2k3m6k8K7L4K7
6755D3k9l9j7J7N4J8l5l3qMN2J2k8l7k2K9L6J9k4l9k5M7L8Jm2j8pL1L2J3l7l3
6787b7KL4K4Mk2k6j7L9K1J0l7l0J2L1K1qk7l1PK3L9j8k7j4pK4K1j3j9k4RL3J7
6820B4j8qk3JK8J0nj8k1K3K6lqj9j2J0J8R%m2J1K1NK0jl3rJ3K0j0lj2jJ5kK1l1
6857dRj5K6Pqpmj3J5J8pj3rMjKOqqoK1kmmPKj0K4j1k0J4LJnQqqMJ2nKj3OK0j2
6902F%%Kj3RlJ2j7MJ0JlLMj2J0J1j5qnJ0jMpj3kJ6J5j4mj7KJ2J6j1j3kkK0J3l
$$ y = [62, 36, 0, -55, -30, 29, 64, 35, -17, -51, -25, 18, 64, 45, -23, -58, -24, 32, 70, 32, -33, -54, -22, 39, 62, 22, -37, -58, -22, 32, 55, 17, -38, -44, -23, 39, 46, 5, -44, -64, -9, 41, 51, 7, -48, -58, -10, 31, 55, -8, -50, -56, -5, 36, 30, -1, -47, -62, -5, 45, 37, -5, -39, -41, 13, 51, 38, 5, -49, -23, 21, 59, 43, -5, -28, -27, 23, 49, 41, -10, -53, -29, 10, 57, 40, -11, -45, -38, 20, 52, 29, -17, -45, -18, 16, 43, 14, -25, -42, -25, 29, 47, 12, -21, -29, -25, 27, 39, 11, -26, -48, -19, 17, 36, 12, -27, -52, -5, 33, 34, -8, -26, -33, -2, 30, 43, 6, -27, -25, 9, 33, 37, 15, -11, -28, 11, 32, 42, 5, -25, -13, 18, 39, 31, 4, -27, -20, 3, 42, 24, -3, -17, -24, 0, 21, 8, -11, -35, -26, 7, 24, 6, -2, -25, -24, 4, 14, 9, -9, -30, -7, 19, 16, 8, -11, -23, -13, 5, 14, 14, -28, -17, 4, 9, 29, 28, -5, -14, -1, 19, 9, 6, -6, -7, 8, 6, 27, -4, 5, -10, 16, 23, 15, 8, 4, -9, 6, 24, 17, 4, -5, -1, -2, 0, 6, -2, -10, -16, 5, 3, -1, -5, 2, 4, -6, 18, 7, -13, 1, 4, 5, 0, 8, 0, -8, -4, 8, 3, 5, -8, -2, 18, 6, 6, 6, 8, -5, 4, 1, 13, -4, 0, 10, 11, 8, 11, 15, 3, 13, 24, 9, 1, -4, 6, 5, 9, 2, -11, -13, 3, 18, 4, 0, -17, -15, -3, 13, 2, -11, -13, -15, 5, 18, 15]
6943A5k9%kJ5MQk4k2J8J7Kj0nj3JM0J5l4k3J1J0J8J4j4j8j3K2K2lk4j9LJ3J7J6
6978B8j4m1KL1K5j6ml2mK0L1Mk5l8J0L3LLj4l8lM9K7lm7k4%L8K7Pm3l2J4L4Nj0
7014Cj9j7QK5M0k9k6k7K5K2L1Km6k7J8M0J0j5l9nOK8L3j1n4k4L5M3oj4k1l5J9
7047b7N4J8m7k6j4L3K5K2k1l8k6M2N1kn1k0j8K6M1K7m5m2jL3L1kj8n0rM8M3nn0
7080a8l6L0K6L2Pm8l6J0L6K9%m4j6JL6L2km7l7L2M4J4j7k4l1NN2K1k5m8k5L4K4
7113A1L3j3o1k2K3N7J0j4n3lJ5K5M9m4m4k3L9M0J0l7l7j5L2N3K0m1o0RL1M1J0
7144D1j8p1lL9M5Jl3m8J3K4N2Pn0m4J9N2J8ll1l9ML0N0j0o0k0J5L9J6lm7k6RN0
7178A8K0k0k5k4J2L2K7j9m0k9K6L7J9j4l5l0K6N1J1k4l7k4K8K4M0j8o1KJ6L5J6
$$ y = [15, -14, -14, -16, -1, 3, 11, -13, -35, -17, 0, 2, -8, -13, -26, -25, 15, 30, -4, -27, -16, -6, 12, 26, 12, -6, -19, 3, 25, 22, -2, -21, -18, -5, 12, 28, 14, -27, -25, 6, 31, 15, 11, -21, -25, -5, 26, 30, 5, -33, -23, 10, 13, 16, 2, -36, -39, 10, 37, 34, -13, -37, -37, 1, 28, 35, -8, -40, -26, 8, 13, 3, -16, -33, -25, 0, 40, 11, -15, -42, -17, 5, 36, 38, -8, -35, -17, 23, 33, 18, -21, -26, -20, 8, 41, 30, -24, -48, -13, 30, 24, 10, -11, -46, -27, 27, 45, -2, -28, -42, -9, 16, 38, 17, -21, -47, -5, 46, 44, -7, -27, -45, -19, 22, 49, 4, -38, -39, -6, 25, 23, 5, -45, -54, -6, 37, 32, -18, -54, -24, 2, 34, 41, -7, -43, -33, 3, 32, 32, -12, -28, -27, 9, 41, 39, -8, -45, -13, 31, 45, 28, 4, -27, -22, 30, 51, 26, -22, -47, -13, 11, 44, 31, -30, -52, -29, 28, 38, 24, -29, -32, -17, 8, 57, 13, -31, -54, -15, 25, 35, -2, -39, -54, -22, 31, 51, 10, -50, -41, -10, 31, 41, 23, -48, -51, -12, 33, 34, 1, -47, -34, -10, 42, 49, -1, -45, -26, 26, 44, 41, 10, -29, -25, 5, 55, 45, -15, -35, -20, 19, 35, 32, -15, -41, -32, 18, 38, 18, -7, -31, -19, 13, 40, 21, -19, -48, -22, 15, 34, 20, -15, -45, -19, 32, 43, 19, -18, -42, -14, 10, 50, 32, -29, -27, -11, 24, 40]
7209D0l3k6k3L3M1Pk7m4JK3N1Lk5l2nMM9Nk7k8rK8K3J4m4k0k1N0K2rl6mlJ7L3
7244B8Jl8k3lM3Mmk0k5J4K8J8j5k9JkL3L1j6l3k7J1L8J7k7k6KML0J0j0l3jJ6K5
7279B2Lmk3j5J2K1J3k1k6MPJ7J7k3j2j3K4K7jk0qj5LK6J2j3l1JPK0nj5j5mK1K6
7315A9rj9rJJ4RRrj4j1K7J3j0j1okJ9qJ3k0nJ9j0nJ6ooJJ5mrlKOOkj3LNJLnpk
7359dMJ1j3kPrQMnLj0KRj0jRkqQoJ4k0J2NKpMoj1OJ4nnJ0qkJ5j0QqKJ4mMj6nL
7406AKJ5j2j3MkRQNj6j4NL0prKj9lK6Kj1j2jRNJ3j3j1k1J1L3j0ok9RL2Nmrk7P
7447a6J2K1ml1LOK3Qoj1k5J6J7NOk0j2RJ5J3j3l4j1J7K7Kjj9j3QK6J3k1k5kRK3
7484A5Rj7k2pJ1K2K2k5k0rJ3K9J5j9l6j1L4K5Mj9k2j6K3L1j0k8j8J1KL6Ql6k0
$$ y = [40, 7, -19, -42, -9, 32, 39, 12, -32, -31, -8, 43, 46, 21, -11, -16, -12, 37, 42, 15, -13, -22, 6, 29, 43, -1, -21, -42, 8, 30, 21, -15, -19, -22, -5, 28, 29, -9, -32, -35, 8, 12, 8, -12, -37, -23, 5, 23, 8, -21, -20, -22, 11, 42, 26, -7, -34, -23, 15, 32, 5, -21, -19, -15, 15, 25, 15, -18, -19, -3, 22, 25, 21, -2, -17, -5, 16, 29, 8, -18, -14, -7, 10, 27, 4, -8, -21, 3, 30, 29, 9, 1, -14, -11, 15, 27, 14, -17, -16, -9, 11, 6, -9, -24, -28, -7, 19, 10, -9, -18, -17, -3, 6, 15, 6, -8, -19, 8, 21, 11, 0, -6, -8, 11, 3, 16, -4, -9, 10, 0, -5, 11, 5, -1, 0, 15, 11, 2, -1, 1, 7, 13, 11, -2, 1, 6, 7, 10, 5, -2, -4, 0, 11, -2, -4, 3, -6, 2, 6, 1, 4, -6, -4, 5, -5, -6, 3, 1, -7, 1, -5, 9, -11, 1, 6, 8, 1, 5, -1, -12, -6, 8, 3, -2, 8, 0, -2, 13, 3, 11, 3, 5, 19, 15, 19, 3, -2, 1, 3, 18, 6, -7, -3, -5, 4, 12, 17, 1, -13, -8, 22, 15, 6, 8, -11, -14, 12, 14, 3, -9, -10, -1, 4, 17, 4, -7, -28, -17, 16, 6, 0, -29, -20, 12, 17, 13, 4, -23, -16, -4, 17, 13, -18, -15, -9, 14, 22, 16, 5, -20, -4, 13, 18, 24, 4, -8, 1, 16, 29, 16, -18, -29, -12, 15, 17, 16, -3, -16, -8, 18, 31, 10, -15, -17, -8, 15, 24, 7, -15, -22, -11, 11, 33, 8, -12, -21, -8, 21, 36, 17, -19, -30, 4, 29, 33, 14, -8, -24, -1, 30, 20, -8, -26, -15, -13, 23, 31, -5, -25]
7517b5J4J8K6J0l4l5J9J2L4%m0k0J2L4PPl2m0QM9Pj0k4k3J3J5L1Jm5j9J4K9Qq
7551A3k8k3J9K8K8k4k6k7K5L5J8j5l7j8L7J6Nj0m1rK0L5K1k4l8qK0L5Ok8j6k5
7583c6M1L2j9j5k8%L0K2J0l0l5nL5L6j5j8k2%J6L6ml0k8rL6L1j8j6l0%L1L7j4
7616B1k8j9PK7J8J2m8j9J3M1J0k0k5k5J2M0K9l0m1j4K5L9J3j5l0j9J3M1K1j7m6
7647a4j6K5L3J2k2m5lK4M3oj2l7jJ9L3J0l9j5oJ5K2jl2rj1L5L0j3k6j9kJ7L6m
7681B1k2k7j0L9J3Jk5k7J9J4L4rl0j8J1J6L1jk5k6RK8K1j2l2lJK6J5j4k0k1J2
7714a1K9J5rk6k0K5K6J3k2l2J0J4mJ0Kl1%NK9Jl9Rj8J8J3J7ql0j6L0K0j3Kk4%
7749a5J6OMj2j2J0PJ6Kk0pmK5J1ok0j1PJ0J9kk1j5PJ7mollrJ2J9nj7kJ5lJ0kj0
$$ y = [-25, -11, 7, 33, 43, 9, -26, -7, 5, 39, 39, -1, -21, -9, 25, 32, 39, 7, -33, -25, 24, 31, 21, -3, -26, -13, 2, 33, 34, -11, -30, -16, 13, 21, 13, -15, -38, -19, 9, 37, 13, -13, -40, -15, 20, 38, 23, -14, -32, 5, 21, 26, 16, -25, -34, -14, 21, 42, 18, -20, -28, -8, 27, 33, 5, -11, -36, 5, 37, 18, 3, -25, -25, 5, 27, 37, 7, -28, -33, 2, 38, 23, 5, -17, -17, -1, 35, 31, 1, -27, -36, 0, 31, 13, -3, -33, -33, -2, 35, 21, -7, -26, -19, 8, 26, 38, -10, -29, -16, 25, 35, 15, -10, -35, -23, 17, 46, 16, -25, -39, -14, 25, 38, 23, -7, -26, -13, 28, 49, 32, -14, -30, -5, 28, 40, 18, -27, -30, -6, 37, 31, 19, -18, -19, 0, 33, 43, 4, -11, -17, -2, 20, 19, -13, -22, -33, 2, 32, 19, -7, -26, -28, -11, 25, 21, -1, -28, -38, 1, 14, 15, -10, -37, -18, -4, 30, 21, -9, -27, -16, 0, 31, 30, 5, -21, -12, 16, 37, 25, -7, -10, -9, 17, 32, 18, -2, -23, -11, 18, 33, 24, -2, -22, 3, 29, 42, 20, -12, -2, 12, 8, 18, 20, -11, -11, -6, 23, 24, -15, -6, -24, -6, 7, 24, 16, -14, -30, 0, 20, 7, 9, -15, -15, 1, 7, 11, -1, -13, -3, 4, 20, 22, 2, -5, -9, 16, 27, 21, 1, -10, -3, 7, 26, 24, 3, -12, -5, 12, 8, 2, -1, -4, -13, -1, 18, 13, -4, -6, 9, 6, 16, 14, 4]
7789Dk6J9OJ4k9mQJ0NJ8k7lpJ9lKpnnmJ7%qMO%QrPj4RLNkklJNNj0mKLRqlMnLP
7839A5j2kj1J5OmJj5NmKJNj4J2PNj2mPkLJkJk6J8J1j6J0kj2RJJ1j0pONmkRoj0
7883a1J9NJj1j1PJ1Oj0Lk7J7J8J6j2j2j3mK5nJj1n%QJ1jj4k0KK6J5j8j9MJ5J4
7920B0nj2oj9K1K0lj5%k1J2K2Kj9j3jJ3J2MKm2QK4J1J0j9pqKL0nk2qnL4Rrlk0
7959fmK4J6nk7k0NK0K0kpl0KK9Qnk8j6MK9K6j5j9j6lL8lkk4j2NK1K4k0k4j5K3
7996iJ9K3k3k9lML9J1j8l2j0K0K9Qj6l1pK6K0J9k8k8oJ4L4%j5l2NJ8K8Pl0k2j1
8031b6K8K4Nm5j2KK5K1Qk9k7NK7J4kk5k1jL0L9k0l6k7K8L2J4j1k9j6K3J3K2j2
8064B1l2j6J8K6J3j0l2mLL2J8k1l3nPL9kj0l0jJ4K6J0j2l0j2J6L9kj7l9JL0J8
$$ y = [4, -22, -3, 3, 17, -12, -16, -8, 2, 7, 25, -2, -5, -12, 7, 4, 6, -1, -6, -11, -15, 2, 2, -6, -2, 4, 4, 12, 3, 10, -4, 5, 8, 13, 11, 9, 6, 7, 12, 17, 7, 3, 5, 8, 17, 9, 6, 10, 5, 8, 15, 3, 1, -10, 5, 11, 7, 8, -7, -2, -6, -4, -3, 2, -12, 0, 7, 12, 0, -4, 3, 1, 4, 5, 3, 4, -22, -4, 7, -9, 1, -1, -13, -4, -3, 8, -2, -9, -3, 2, -2, -4, 5, -1, -11, 8, 13, 14, 3, -8, -1, 10, 16, 6, 9, -18, -1, 17, 33, 21, 9, -4, -8, 17, 12, 13, 2, -3, -3, 5, 16, 15, 1, -19, -17, 9, 24, 6, -13, -9, 6, 20, 15, 3, -3, -22, -1, 19, 16, 1, 1, -20, -8, 14, 16, -3, -16, -17, -4, 8, 12, 14, -28, -20, 4, 15, 25, 6, -1, -9, -7, 23, 18, -4, -12, -17, 17, 26, 17, 14, -6, -10, 14, 30, 25, -2, -22, -17, 3, 23, 21, 14, -16, -14, 15, 23, 18, -10, -26, -22, 7, 33, 18, -1, -17, -20, 18, 15, 13, -11, -23, -18, 3, 27, 7, -17, -32, -9, 10, 33, 10, -19, -22, -18, 21, 32, 14, -18, -28, -8, 21, 29, 13, -18, -25, 1, 21, 40, 12, -16, -22, -8, 26, 26, 11, -21, -16, 2, 30, 37, 7, -15, -26, 2, 26, 31, -14, -26, -24, 1, 22, 30, 1, -26, -21, 6, 20, 18, -7, -28, -29, 1, 40, 20, -16, -43, -15, 17, 31, 20, -9, -25, -2, 11, 33, 21, -11, -27, -9, 17, 30, 20, -12, -16, -13, 19, 37, 16, -17, -22, -15, 24, 22, 12, -18, -19, -5, 21, 31, 19, -11, -23, -7, 32, 30, 13, -26, -25, 5, 23]
8098B3Rk5l9LM0J0Ml2k1kK6J3J2k7k5RJ6K7nk2k2%L2L1nk0l9QK8J6Ok9k3J7K1
8133A5J3Lk1k1jL3Qrk2k2PK7K1j9j6k2J6L3kj0k9rK3J2J4j6j7k3L1K5lj2l3jO
8168b1L4J2k2j6j2J3J7J1k1j5mJ8L5j5j5j3QkL5kj8k0m
$$ y = [23, 32, 7, -32, -29, 11, 21, 25, -7, -28, -30, -4, 9, 21, -6, -31, -22, -6, 21, 16, -6, -28, -28, 4, 35, 30, 10, -29, -21, 7, 23, 29, 0, -23, -6, 15, 28, 31, 10, -11, -12, 21, 29, 20, -2, -24, -17, 10, 31, 12, -4, -26, -10, 23, 21, 11, -18, -27, -4, 8, 22, 6, -11, -34, -3, 22, 19, 7, -26, -27, -21, 13, 25, 3, -13, -25, -12, 5, 16, -5, -20, -24, -6, 29, 14, -1, -14, -6, -8, 27, 25, 7, -13, -17]
8191a7
$$ Imaginary data points
##PAGE= N=2
##DATA TABLE= (X++(I..I)), XYDATA
0@%%%%%%%%%Qj6J6j6J6j6K4l2L6m4N3o1P2q8R7j06J25j48J68j88K12k40K72l04
33a60L40l80M23m72N25n83O47p14P88q74R69j074J190j320J470j640J834k062
51a093K333k661L068l588M281n256O736r279J4821m6441L6549Q4301q0080k2487
65a8796L4023k6753m3224P7982N4480p4769o5398M5216K7123j7104J9805K3008
77C5593m7544k7841M2946K5823k2309p11M22l2634k111M6848M414l6254L339K0368
91A0349j6959n12L4491q934m5973P803L8414p551k2306O781k443j0994K6636K6913
105C5715k6881l1261Q757J1897O785K0891r213n0984o904N1345J7694k1105L426
118A0162m362m0631Q557O6545K131o3520q961L0555j3046j399N1626o61o9808
$$ y = [0, 0, 0, 0, 0, 0, 0, 0, 0, 0, 8, -8, 8, -8, 8, -8, 16, -16, 20, -24, 29, -32, 40, -48, 49, -57, 68, -80, 88, -100, 112, -128, 144, -160, 180, -200, 223, -249, 276, -307, 340, -374, 414, -460, 509, -565, 625, -695, 775, -865, 969, -1093, 1240, -1421, 1647, -1941, 2340, -2916, 3820, -5459, 9362, -37079, -530, 83771, 3691, -18796, 15227, -11526, -54750, 23232, 77712, 2943, -62455, -17239, 9884, -7220, 12585, 35593, -11951, -39792, 3154, 28977, 6668, 5957, 6379, -26255, -28366, 18482, 22896, -13358, -10019, 10349, -6610, -7122, 27369, 18435, -27538, -19735, 18679, 11128, -11178, -4397, -6840, -17834, 8802, 35715, 8834, -22427, -13670, -1773, 5012, 25903, 16690, -34294, -41198, 10147, 27841, 6736, 10162, 5800, -34831, -26274, 40271, 42402, -21118, -30079, 476, -12570, -13969, 37657, 36996, -32812]
131c2812p237N7240M070k5197K1128q86n7086O98O9148P144m9116K003J9475k6222
145a7650K499N3968o368o4981m29M7940m229k0783K0925q2l8769J0054M9416o882
159B4629m0970L818J8452j0515R48J9141j2932k5593J4175K3906o521q302L421
172C657r734o474J9713R829j9115r383P313l298K325K1986L67k8298n105J9450
186C233K201k761J1277j0017k9935P908L4962J3k0035K077j628j5072J7400L1643
200C1266j8654l7297R821K1869q399K251J8705j8811l0346K3123L2984j8274j9956
213a1718J6169j119k2627J5221K7987k0229k5353K0115J4294j9272K021K2511
225A8000j3629k4990J6624J9843j6166q727J5290m955j6568J5231J8924j6470
$$ y = [-32812, -40049, 17191, 21261, -3936, 17192, 16306, -40780, -40082, 29066, 36210, -12906, -10903, 8572, -17650, -15151, 38817, 32449, -32532, -32961, 14979, 10750, -10033, 10892, 10810, -27959, -17905, 31511, 24629, -16341, -12523, 5929, -4586, -3638, 15503, 2571, -23022, -8847, 15059, 8538, 236, 3657, -6077, -12551, 7162, 16991, -2124, -11507, -4194, -7492, -5167, 16819, 17186, -11112, -16217, 3233, 5434, 2673, 13950, 3933, -26002, -18094, 16868, 16881, -3154, -1077, -2705, -17777, -377, 31266, 12612, -24685, -14864, 7005, -1394, 857, 19562, 751, -29595, -6472, 26512, 8238, -11718, 4451, 3332, -19295, -4074, 23913, 3684, -21669, -1554, 12740, -6532, -4511, 18000, 4371, -20619, -3995, 15848, -318, -9045, 6245, 1290, -15278, -47, 18877, 2407]
237B407j5499J2727N951r135N349P092j5046q082J7674Q604j2335m033M741l905
251c490J065J2123k471j5746L79J0867q16k110N080m565r115P630J0072p450n948
266d495P105j172q568O278Q684q566n622R394K6r791O363J0751r846r800R605
281C46M367q955L255R237r677r568J2766Q142j2137l411J0289k998q632Q344O363
296G731j1790l417J3045K02j2026L015R209n449m815P308m01r074M514J0241n932
311B361r275M859N101l350J374L536o986n464Q569O482o044m123K555j066p73
326b244O062J146q081k310O122J487k375J929P8n212J07N943M98l416M30n62l937
343d335J926O784k48n637j262J110K94M219L891o106q436K757P964J708k006k660
$$ y = [2407, -13092, -365, 5586, -3549, 1800, 8892, -6154, -14236, 3438, 12042, -293, -4326, 415, -3490, -2425, 9698, 7227, -8519, -8140, 2727, 1911, -199, 4881, 316, -8799, -1169, 8903, 1453, -4495, 2610, 1438, -7130, -852, 7832, -734, -6356, 3038, 3064, -6727, -364, 10387, 541, -9259, 346, 4713, -4242, -987, 8250, -1427, -10995, 1771, 9913, -2224, -5635, 4654, 1656, -6976, 1368, 7731, -4059, -7476, 5569, 5771, -6255, -3240, 5969, 520, -4295, 3013, 2612, -6462, -1948, 8293, 2361, -6914, -2055, 3046, -304, 1070, 4606, -2380, -7844, 725, 7207, 1163, -2960, -405, -1471, -2244, 3818, 4964, -3117, -5427, 695, 2182, -193, 1736, 1814, -3398, -3291, 2652, 3150, -266, 164, -398, -4335, -2409, 4375, 4127, -1510, -2772, -1662, -1368, 2851, 6742, 636, -7800, -5043, 2921, 4629, 2623, -37]
359c7n492j141R660P580o526r816n89M244M018M184j344r532m786P965Q614q41
375F161m801l764l030J734P594L293o245o669N1L772M672L803k034p574l860M404
391b493O479K216l243p118m787M390R682L548n755p647k461M788Q744L382p959
406A766j0923p47R377Q236k30p257p778l16R166R143j881j0780p609K600Q765
421A532O165j867p975o208K229Q984O927k327r287o803K036P890N863j274p478
436a593p262Q21R671Q970j528j0246q091J672R109P569j793j0318q575K887J2170
451C463Q664m028j1957o762N152J0910N222n741j1345n834O297J2262N031p276
465D058j0606k531P200R225K446p089j0163l071P123R630K633o396q882k335P284
$$ y = [-37, -5529, -6670, 2990, 10570, 4044, -5772, -6361, -2117, 1901, 6085, 4741, -4791, -9577, -1612, 7002, 6161, 1360, -2404, -5434, -3700, 3894, 7187, 942, -5727, -5676, -1904, 2768, 6571, 4537, -3037, -6897, -2493, 3986, 6202, 2959, -4159, -8946, -4556, 5126, 8674, 2919, -4728, -7189, -2401, 6343, 9725, 1766, -9157, -9904, -527, 7709, 7479, 222, -7556, -7872, 1294, 10437, 8556, -2224, -9833, -7233, 1532, 7697, 5830, -2145, -8353, -6124, 2860, 9787, 7460, -1827, -8630, -6594, 1296, 7159, 5885, -1593, -8855, -8034, 1637, 10607, 9079, -1167, -9258, -7586, 1523, 9092, 7299, -3019, -11594, -8707, 3463, 12127, 8099, -3858, -10620, -5468, 5442, 10664, 4923, -6422, -12256, -5959, 6303, 11334, 4058, -6548, -9079, -1879, 7346, 9792, 2703, -7460, -10531, -3408, 6222, 8855, 2459, -6423, -8758, -1474]
480a474R702J925p561r524l260N904J0438M352p885j1725j578R899J0240J571
494A1024p690j1153m211R025J2966Q60j2081j0147J803J0140R498R64r889j1435
508a0326N30J1946Q531l781j0237o823J808R588Q991j638j0700o999L716Q693
522C299N150k169q679q102K059J1127P342l989q967m937K205Q317Q148k233j2818
537d247q700N768J1962M960m516q895o605L382J2950Q150p805j4218m039P884
551c969R577L612m951j0700n650P914J3261K884r294r592j602N592Q094L661n992
566B845j0514k755Q351R432J288n957p123l148M223Q938L749p336j0176j145P708
581a620P551J941m391q513m208P452J1171k06j0698p100J755N772O776L073p573
$$ y = [-1474, 8228, 10153, 2592, -6932, -10192, -4288, 6150, 10502, 2617, -9108, -10686, -787, 9453, 11024, 3334, -7819, -12030, -3005, 9961, 10821, -1260, -11407, -9604, 536, 10034, 10998, 1109, -10326, -9796, 2150, 10681, 6900, -3337, -10160, -8352, 1236, 10227, 8589, -2111, -9110, -5394, 3299, 8449, 6280, -2399, -10501, -8442, 2685, 10027, 6038, -2929, -7866, -5661, 2656, 10804, 8571, -4247, -12947, -7179, 4783, 9743, 5227, -3668, -10273, -6891, 6059, 14209, 6404, -7814, -11853, -3969, 5608, 9220, 4269, -6431, -12081, -4167, 9094, 11978, 2684, -6908, -8510, -2918, 5176, 8837, 2845, -7669, -10424, -2073, 7359, 8647, 2690, -4433, -7581, -3358, 5580, 9329, 1993, -8183, -9328, -1620, 5931, 7872, 3481, -5032, -9240, -1788, 9383, 9177, -1521, -8621, -6866, -1094, 5682, 8755, 1182]
596A182j1117K019J2983N223o476o511l173j145O418J0140k376j3391l791R046
610i69O070m1Q5m597r548J040J3031M584q902o125Q75L85L857R375o3j3192o565
627a0700Q062P601O4j448m453q243O98J2889P127p636r145r20L335N069N247k211
643E336j0184n120O655Q714J138m815m971j538L097N387K279l773o532k006N165
658a168N419j100l876j049j85M7M399L970n294p399K722O155j112j688K319l338
674a178o006O064J0358m353j0153J627M435k511K488O886o783j2259N961J3501
688H077k288p513K205r48o905O038J2369o068j3974L025Q856k583o36P009l926
703B738j1568L987J1897k479p469L032J037p028K033J0381j193r140N97M748k184
$$ y = [1182, -9935, -7916, 5067, 10290, 3814, -2697, -5870, -7015, -597, 9543, 7167, -6224, -10015, -969, 5101, 5060, 5145, 548, -9000, -7960, 5071, 9655, 753, -5372, -4497, -4112, -255, 9120, 9057, -4135, -10700, -2638, 4963, 5027, 3579, -874, -9117, -8419, 4470, 11597, 3961, -5184, -6104, -2769, 2300, 7547, 5336, -4848, -9968, -3313, 5401, 6539, 1724, -3247, -4785, -1688, 3699, 5978, 2205, -4327, -6333, -1168, 4251, 3151, -725, -1774, -1959, -1912, 2487, 6457, 1163, -6236, -3514, 2641, 1529, -159, 2160, -1178, -7184, -1120, 9238, 4885, -5268, -3641, 794, -1717, 771, 7657, 874, -11385, -5424, 8077, 5789, -1724, 481, -467, -7372, -1334, 11035, 4967, -9007, -5982, 2874, 291, -345, 6664, 2738, -8830, -4843, 7054, 4575, -2894, 138, 1175, -5853, -3820, 6561, 5368, -3772, -3175, 1573, -611]
718f11l34N455j382p831KO355R37k573K40l55j975J467L139o96k677p53P75J490
736F73O36k159j495K718J806k288m07J762k323j670N237J937p169k204O844O31
752B529n284L266M373p018l928R113K695r240K52Q266m630p689Q146O794r359
767a714l833R444q96r527N586R621q477q469R057M642r045O68R596m916r511P142
783f32P387q084l412Q927o69r612K985Q379m105m620N830M46q236J595R267j224
799D222o856P27J778k594K493N868k910p108M22M278J382R12k47m317k298L564
815f84K901k63M3k075m164J785N855p55l939J592K91m606K306P683k882q033K921
832b024N107m447p27P261k927r836M736J0253n158p293N748J969p454L479R767
$$ y = [-611, -945, 4510, 3128, -4703, -4701, 1654, 2591, 18, 258, -97, -2072, -605, 2534, 1838, -839, -1592, -817, 673, 1309, -850, -2345, 373, 2179, -109, -516, 1246, -1077, -2747, 2490, 4427, -2742, -4946, 1898, 2529, -2755, 511, 4884, -2134, -6062, 3051, 5746, -3494, -3242, 5024, 394, -7295, 851, 7645, -1714, -5547, 3897, 3001, -6526, -940, 8681, 204, -8265, 792, 5434, -3611, -2943, 6653, 1737, -7774, -632, 6755, -1329, -4741, 4186, 3517, -6095, -3110, 5269, 1164, -3456, 2374, 2820, -5416, -3821, 5446, 4222, -2634, -1907, -129, -2723, -230, 5638, 2728, -4380, -3958, 320, 1702, 2614, 2367, -1950, -4248, -684, 2217, 1954, 1997, -78, -4242, -2457, 3398, 2643, -1296, 296, 587, -4019, -1713, 5970, 3088, -4945, -2024, 3083, -1364, -2091, 5170, 2243, -7593, -2857, 7396, 2238, -5055, 693, 2662, -4792, -1313, 8454]
847H454p126j1194P765R420o610l721O452l505q279Q650J0597r442j0040O825
861a754M501n109L560O659q918r337R031R062n472l587L177m443n022Q861Q157
876I366p248p538K669J759j89N831K486r160o346N802N995J37m00l161o456J188
892e265R213K919n240l798j660m71N751O058n073q357J499M958P16K066J404p366
908b646n452P987P165n145m353K067k418k171Q586N225r928o707O898L831k947
923hL106J855j0174m656J1840O909p597m030K217l566k61J1419L218j3549o717
938i994Q247M607j161L212j616j1327j073J3764N264q412m551M30k431L047R922
953G928q60j2092l102P322L472M39J927m300q393K353R845J437n302k516j928
$$ y = [8454, 1328, -9866, -2101, 7319, 709, -3012, 3440, -65, -8344, 306, 10903, 1461, -8579, -1754, 2747, -2362, 1198, 7857, -1061, -10398, -1367, 7695, 2223, -1364, 1813, -2630, -7652, 1209, 9366, 2118, -5420, -2751, -992, -1181, 4650, 7136, -2024, -8370, -2568, 3427, 3564, 3164, 3, -6453, -5265, 3948, 6867, 1627, -2171, -3831, -4302, 1449, 7507, 2434, -5923, -4424, 534, 1250, 3316, 4720, -2646, -8098, -111, 7054, 1909, -2444, -377, -2795, -4966, 3620, 8845, -1083, -7790, -892, 2939, -8, 3098, 4953, -5221, -9877, 1963, 8872, 1275, -2755, -538, -4104, -4365, 7054, 10272, -3277, -9994, -1747, 2860, 1699, 4911, 3295, -8032, -9105, 4659, 9923, 1511, -3040, -2610, -5041, -1994, 7928, 7068, -5024, -8126, -804, 2668, 3107, 5034, 734, -7659, -5306, 4539, 5976, 674, -1842, -3770]
968c770j387O129P054m146q318m09L582K460L751J26q501n427O786P448q79k900
984A599k891m904J575J0452L273r457o348K781K805K867N090k820j0977j335J0557
999B267M756m054k507k632m794L593J0492L1r912l174L755J702L035M614m631
1014B541r960J048Q940K190k689j149m035m274O195R520k553q811j593K321J404
1029i05M714L122p531q383M312Q782R88k724k272m642j310P956O273n440p673
1044d733l06K796L109M412m28p804m037N556N663j2j925l609m689J702P942K583
1060F220n340m127k43R37M171N089k932q413j566N602L539M18p26m741m745M211
1076b646Q429K20o202l277o5J386M892L478n151p238J256O152K651m47k084m690
$$ y = [-3770, -5157, 972, 8026, 3880, -4438, -4847, -1265, 1195, 4946, 5072, -3429, -8856, -2070, 5378, 4499, 1599, -1292, -6196, -4621, 5831, 9104, -353, -6701, -3920, -1115, 1752, 6842, 4022, -6955, -8290, 2267, 7023, 2969, 462, -2170, -6964, -3371, 7121, 7152, -2760, -5934, -2179, -477, 2558, 7172, 2541, -7419, -6371, 2569, 4759, 2070, 921, -3114, -7388, -1193, 8327, 5774, -3037, -4630, -2309, -905, 3809, 6931, -600, -8983, -4671, 4111, 5099, 2375, 103, -4539, -5849, 2107, 8380, 2940, -4733, -5039, -2243, 866, 5278, 4850, -2954, -6991, -1435, 4228, 4216, 2291, -1318, -6007, -4305, 3637, 6220, 880, -3247, -3490, -2553, 1618, 6707, 3775, -4638, -6204, -602, 2937, 3355, 2629, -2112, -6857, -2646, 5783, 6003, -199, -3476, -3541, -2155, 2737, 6215, 1064, -6174, -4918, 1234, 3885, 3438, 1354, -3336]
1092c336j962N401N351k151m962j849K69K405M703R26n461l967K385L567J423
1107B742M08k510n007l32N879L438k497l138j456n71K816M945m37o217l106K944
1123b099L528J482k09l304l942J495N722K098l218l584j299J154L577K562k364
1138A599m428p43K820K777J153j383l610j745K701L281n7j997j849j245J069L585
1154A928J581k722k925J23J551J584J376j057l573j321K925K917k02j738j748
1169a301j057J470L280N90l152k548P12K062J578L74j743k520J42K888J705j154
1185A326j935j021J82J467J634k92k044j081R78J424O21k39j006j202l6J380J078
1202A234m87j167n46J85P25J071L30j254j397M32J425L63n87m92n63l17J108J419
$$ y = [-3336, -5298, 103, 5454, 3303, -1659, -3508, -3239, -834, 3869, 4795, -666, -4633, -2248, 1319, 2742, 3150, 640, -4367, -4699, 1180, 4618, 2121, -1017, -2473, -3044, -228, 4717, 4280, -1937, -5043, -2099, 1429, 2911, 2702, -602, -4544, -3049, 2673, 4771, 1553, -2031, -3330, -2176, 1401, 3963, 1599, -2829, -3572, -752, 2025, 3178, 1795, -1815, -3560, -859, 2422, 2365, 368, -1481, -2726, -1657, 1928, 3509, 787, -2138, -2015, -464, 1120, 2496, 1439, -2134, -3455, -530, 2387, 2185, 447, -1301, -2358, -888, 2392, 2982, -170, -2718, -2006, 56, 1634, 2008, 265, -2255, -2113, 775, 2480, 1326, -609, -1630, -1448, 19, 1653, 1361, -683, -1764, -786, 638, 1259, 1020, 14, -1188, -1224, 156, 1234, 747, -420, -966, -781, -56, 1015, 1345, 91, -1306, -874, 551, 914, 327, -165, -728, -1045, 63, 1482]
1220A482o72j761P6J303R8m79K08k69r91M72J557l27j539K26J269k38p64M19K71
1239C41p68NR30k04j046K68J080o8q30o7M64N5j22J46q9n34j32P11N73m94p42
1260e23K14N43j56m4N17l00j134J62J303Q2q06J61O9j008L53J965l3k206m68J272
1280c7J58R2J213p73k838L13L425N79k295n68K99j022R42L181n66m274n98L301
1298E32Q97j064N93n17k999L18M353R09l539j329J379j08J77K526J37l907j523
1315c165L073K049r02n87m92j898q4L327J859k441k829J28J633J426R01q07k611
1332a420j397K077L117K68k732k236M06J991J690L89j740k921l28L478K672j655
1348A659k896p16M79J188K662P12l948l227K481L667Kj027n94k621j548M224M317
$$ y = [1482, 810, -951, -875, 428, 526, 47, 255, -14, -1005, -533, 1024, 697, -842, -616, 653, 415, -349, 70, 341, -427, -422, 508, 304, -742, -474, 606, 538, -292, -359, 105, 160, 38, 184, 95, -439, -571, 140, 713, 219, -523, -309, 234, 78, 34, 551, 251, -883, -721, 582, 664, -142, 19, 88, -920, -567, 1398, 1365, -841, -1309, -37, 121, 213, 1426, 653, -2185, -1872, 1553, 2132, -163, -731, -432, -1454, -512, 2669, 2103, -2171, -2769, 532, 1429, 365, 958, 441, -2558, -2240, 2113, 3022, -517, -1846, -467, -575, -398, 2128, 2265, -1642, -3165, -92, 1957, 1055, 468, -24, -1922, -2006, 1321, 3180, 739, -2090, -1962, -329, 1097, 1998, 1191, -1420, -2817, -740, 2377, 2645, -87, -2323, -1917, 74, 1764, 2153, 413, -2508, -2836, 642, 3314, 1659, -1237, -1953, -1474, -286, 2376, 3088, -860, -4087, -1606, 2061, 2063, 1036, 442, -2179, -3727, 497, 4814]
1365D814k761m786J42J790M50K433K106m238n366K612N970K10k836r33j673j795
1381c861L842N457k269o454o47L716J617O23P36l088m399J903N925Q83l903k164
1397b083J33M24K374K992j658m993j084L686K729l98j486k039j777J539M276J404
1413D039l596l712M30K873K147M95j667l578j683L535M888l98m620k570J119K172
1429a26K523J522l053n466P7O012L113k620k913j223r25K099N198N31o297l730
1445e278L392L715L42J14j266m446j173N840M233l434m416j31P50J045L680J382
1461D349n284m528L255N083J82j806j395k753r84M776M460l190n581j49L031J816
1477A282J438J73m037l873K933N726J85m061k169N2P80K909K918k264n378p03
$$ y = [4814, 2053, -2733, -2591, -801, -351, 2082, 4188, -50, -5416, -2804, 3166, 3376, 540, -393, -2066, -3861, -19, 5438, 3169, -3285, -3932, -216, 1401, 2024, 2760, -328, -4727, -2824, 3101, 3984, 81, -2083, -1950, -1526, 848, 3840, 2182, -2811, -3895, -209, 2520, 2122, 636, -1403, -3180, -1641, 2635, 4039, 443, -3269, -2839, 34, 2181, 2676, 1009, -2569, -4252, -717, 4171, 3773, -847, -3417, -2298, -126, 2397, 3919, 866, -4600, -4523, 1489, 4602, 1982, -931, -2154, -3079, -980, 4218, 4749, -1548, -5278, -1886, 1829, 2171, 2285, 1019, -3427, -4600, 1240, 5473, 2039, -2377, -2508, -1758, -713, 2967, 4349, -935, -5463, -2208, 2875, 3057, 1251, -144, -2897, -3881, 895, 5355, 2165, -3416, -3565, -534, 1282, 2720, 2893, -1144, -5017, -2084, 3642, 3827, -234, -2403, -2351, -1571, 1338, 4256, 1992, -3386, -4089]
1493d089M457K797j009j798j905j831J549M754J461m246l768J105K944J664O71
1508B756j394l973j830L876M596q18m003k008M42J785L148J488l537m795O52M745
1524A130K245j429k215k192q69L040M431o50n028k253K275K425J077L86k137l812
1540c576K64M937K408k819k792j76K27J204L130L76m549k909L005L584k26j206
1556H82q62k226o86L985L258k900m338K47K363J107J177L16l310l038K661M514
1572C150k39l134j418k06L20K615K380k304m112J70L283J515m25q19j961j710
1588b895J835L528R9l012j713O44J292J553J023j508k943m58K636K158n27j962
1604b50j462j28J519K200N09k223k499L47K633J526q54j698j244j98J715K427
$$ y = [-4089, 368, 3165, 2156, 358, -1547, -3378, -1829, 2925, 4386, 140, -3628, -2523, 421, 2085, 2756, 1362, -2611, -4441, -565, 4031, 3213, -790, -2798, -2356, -571, 2577, 4065, 528, -4267, -3615, 1130, 3375, 1946, -269, -2461, -3330, -290, 4141, 3491, -1537, -3790, -1515, 910, 1987, 2373, 236, -3576, -3312, 1625, 4033, 1214, -1578, -1754, -1527, -323, 2807, 3183, -1366, -4275, -1270, 2314, 2088, 882, 20, -2206, -2892, 1093, 4351, 1451, -2887, -2640, -277, 830, 2007, 2323, -987, -4025, -1364, 3150, 2911, -223, -1641, -1847, -1527, 1088, 3468, 1164, -2948, -2778, 505, 2020, 1595, 776, -1185, -2895, -1060, 2468, 2567, -445, -2158, -1514, -222, 1331, 2354, 846, -2097, -2555, 81, 2239, 1712, -250, -1712, -1840, -321, 1879, 2388, 165, -2334, -1987, 646, 2172, 1318, -380, -1624, -1822, -107, 2320]
1620B320k04k983j487J636J681K41n9r66k143n8K992J427k031j532N24R0J64J886
1638A498M44k850j524K200J510r22j30L11j688p02K691J603k269j690J028M40
1654e0l08J328N70k433j359K250J681j056p67J13q62j49K014Q13k042j243J025
1671d75P44K0N18j83j494k74J498O37p18l95j54m21M01J015n9q55j54J67n2M68
1691B34M94o57p44M01L83k16L37L16q67n00J043M92q91q2O09n28n11J049L69j273
1711e42j23J295k19j065O24O95r59k37J200k97j365O93J311q69q78R05K32r53
1729e52N69J072j144j200J257R52j020k79P59o14p24J341Q76j470q14J031K38
1746B78n50O62L87j393n27J409N94p72r7J07q41O1J507K21j331m41M14k2N17J039
$$ y = [2320, 2116, -867, -2354, -718, 963, 1204, 1145, 179, -1964, -2022, 970, 2397, 366, -1166, -642, -552, -388, 1498, 1942, -908, -2432, -232, 1278, 356, 226, 537, -1151, -1853, 838, 2441, 172, -1518, -490, -50, -358, 970, 1540, -893, -2252, -2, 1679, 623, -144, -31, -893, -1042, 972, 1785, -257, -1500, -475, 269, 289, 807, 624, -870, -1144, 354, 991, 273, -122, -276, -697, -296, 719, 660, -195, -349, -182, -234, 234, 728, 71, -673, -272, 111, -105, 232, 548, -319, -819, 224, 716, -175, -257, 352, -176, -687, 362, 731, -542, -665, 630, 411, -654, -30, 665, -294, -531, 669, 372, -993, -300, 1011, 142, -736, 169, 401, -552, 17, 1089, -55, -1255, 2, 954, -66, -345, 414, -200, -924, 417, 1293, -177, -991, 40, 278, -272, 390, 777, -616, -1143, 266, 860, 88, -9, 98, -743, -682, 825, 1046, -285, -726, -312, -334, 183, 1222]
1766A222o86j788J53J500L44k68n4j006r71J310J910o12j692k47L25K63J218O86
1784A607j764j685J009J666R3k92m47j366l30K053J344j296j421JR5N83J610P4
1802A534k344j139J521J280L3j2q41j800K09K646J002j685j395j58J83J264J773
1819B071p48k758p15J853J469K17m85j673j518J338K735K33j961j334j99O57J907
1836A089J270j753k564J10J965J202J94q13j992j004J909K386k05j848j309k99
1852a662J116K186O27k129k185L11J772J503L91j562k463j47K612J868o79j777
1868b18j503k97J949K535l87k961j546J147J862J289j7k143k341Q20L008J225
1884B422j394j857j132K92K295K066j121k930r88J409J851J122m49k465j904J369
$$ y = [1222, 536, -1252, -1099, 401, 745, 477, 423, -583, -1554, -244, 1666, 1054, -638, -885, -560, -297, 921, 1607, -157, -1842, -833, 833, 926, 634, 187, -1179, -1509, 544, 1888, 592, -829, -828, -733, -150, 1460, 1534, -810, -1949, -428, 852, 885, 873, 32, -1768, -1559, 1087, 2089, 404, -991, -1149, -966, 298, 2071, 1323, -1435, -2150, -297, 1172, 1389, 904, -769, -2287, -949, 1786, 2019, 58, -1276, -1475, -818, 1089, 2359, 606, -1958, -1848, 117, 1319, 1513, 700, -1292, -2296, -387, 1999, 1794, -54, -1363, -1662, -546, 1640, 2267, 138, -2047, -1736, 36, 1539, 1930, 368, -2095, -2242, 370, 2238, 1559, -218, -1721, -2018, -69, 2466, 2079, -882, -2428, -1281, 581, 1870, 1853, -290, -2631, -1811, 1197, 2422, 1028, -829, -1961, -1669, 626, 2692, 1571, -1359, -2347, -938, 913, 2035, 1586, -879, -2783, -1414]
1900a414K942Q85j503j952j117O89K594J730j585l010q16J761K187R05j133k581
1916a418j336J786K904O52k008k355n67J657K405P36j880k551m56K074K397K59
1932B299k053k203k05J921K133L34k017k391p3K348K087k42j953j868k24J971
1948a36K433k2k664k073O75K184J603k1j979k415J65K922K087j144k482j300N14
1965a653J965K095k91k960k038J438K730R81j033j902j604M46K718J919j441k872
1981a502q12J431J847J089n51k364j837J297K955Q53j739j896o60P00K062J728
1997B601j210l062r03K099K040K04j006j755j398J193L033Q11k442k116L11J347
2013b53J375Q83j141k744o38K576K128p24j679j006l46J052K269N02k475k072
$$ y = [-1414, 1528, 2413, 910, -1042, -2159, -1470, 1124, 2854, 1269, -1741, -2557, -796, 1391, 2296, 1163, -1418, -2754, -968, 1936, 2588, 580, -1775, -2342, -685, 1720, 2456, 576, -1975, -2431, -357, 2040, 2299, 246, -1957, -2162, -241, 1892, 2226, 209, -2182, -2255, 93, 2180, 1938, -15, -1883, -2107, -136, 2297, 2275, -389, -2462, -1787, 397, 2000, 1979, 0, -2415, -2250, 672, 2759, 1615, -867, -2167, -1653, 312, 2407, 2116, -844, -2882, -1444, 1286, 2267, 1234, -668, -2272, -1826, 892, 2811, 1370, -1502, -2314, -883, 964, 2053, 1502, -862, -2699, -1402, 1553, 2406, 667, -1229, -1889, -1189, 873, 2601, 1391, -1671, -2574, -475, 1565, 1769, 763, -992, -2390, -1197, 1836, 2647, 205, -1911, -1600, -253, 1122, 2005, 864, -1880, -2518, 58, 2186, 1462, -217, -1223, -1569, -517, 1752, 2254, -221, -2293]
2029b293Q61J956Q81j18j054j804m26K158K101p15k222j054N48J304J393K07j816
2046i3k037M32K428J388r56j775r50K55J456J715j49k387j646J270K170M62q35
2063G48j002j151j49K048J822j344k419m4J342N42N27M12j566j900J206K512j92
2080A392j684k60J9m97J109J902j064k602K67K000K00n01L79p86j680R40K599
2097A733k39k252l42Q90l2M95J282q58k382J89K279N73j088l84k73p03O74J867
2115A429kj967q14R44P61J94J83m70j203k24J347J056n25j093l52L26L87M75L73
2134H25n74j219m9J390O37q44m90K25k76j62J156N18j520q49J289O68r05K1P82
2153F23q41q66J402R71j573q09J435K63j219M55J103j134j038J587Q83j622m89
$$ y = [-2293, -1432, 524, 1405, 1287, 233, -1571, -1997, 161, 2262, 1547, -675, -1729, -1181, 123, 1516, 1723, -93, -2130, -1698, 730, 2118, 1162, -613, -1563, -1308, 148, 1863, 1714, -673, -2319, -1049, 1121, 1583, 748, -254, -1405, -1554, 494, 2316, 972, -1447, -1491, -149, 393, 920, 1332, -234, -2134, -928, 1584, 1392, -292, -552, -533, -1030, 79, 1981, 917, -1685, -1418, 582, 782, 281, 660, -126, -1806, -866, 1733, 1494, -758, -1100, -210, -242, 253, 1535, 677, -1705, -1516, 763, 1336, 248, -136, -409, -1112, -438, 1429, 1427, -540, -1354, -410, 351, 545, 728, 258, -945, -1169, 178, 1234, 709, -384, -736, -410, -23, 452, 825, 251, -968, -1017, 373, 1010, 166, -324, -99, -375, -537, 619, 1137, -383, -1232, 57, 725, -180, -159, 623, -218, -1084, 318, 1289, -284, -1093, 342, 605, -614, -159, 944, -190, -1228, 359, 1242, -380, -869]
2170h69J453j87j255Q67J143j352r81J482O10j346qJ239o25j177R99J025j089
2187g1o88J031J60r83K95R87n41q46N85N84o41l15O72J30n91o4L98m9k21K43K75
2208C50l02n22R6O77K14m90l10J32o7j7P40L24j072q16R22Q28m77j93L17p09p16
2229a091J255J234j130j203O93M56n96N80J025j212j546J169J470p65o82P07m33
2246f9j129J139J668j133j703P18R25n33K22R42j080j586J127J845o23j219J99
2263b90L5m57R42J233j094j775M68J427K13k61j62q38o99J048J526k81j401o53
2281a019L23P47Q08J70r82j164L3J236J087k16j286q91K91R93Q70J37j064j454
2299a381R4J729J038p37j086n62j60R06J647l0k106j087J149J227K28j9p61j610
$$ y = [-869, 584, 397, -858, 9, 1152, -200, -1181, 301, 911, -435, -443, 796, 171, -1006, -7, 1018, -71, -759, 272, 432, -551, -256, 731, 190, -656, -71, 513, -128, -443, 229, 359, -232, -296, 102, 53, -168, 75, 350, 48, -474, -378, 299, 513, 23, -287, -155, -222, -239, 501, 825, -247, -1063, -141, 687, 210, 17, 334, -375, -1091, 164, 1398, 268, -935, -242, 214, -382, 198, 1223, 11, -1535, -366, 1104, 339, -343, 364, -69, -1198, -59, 1609, 476, -1227, -509, 416, -117, 105, 1047, -33, -1619, -492, 1353, 730, -489, -290, -255, -712, 230, 1463, 369, -1406, -938, 489, 702, 441, 279, -559, -1258, -210, 1316, 1035, -366, -1019, -696, 51, 859, 1029, 47, -1117, -1084, 152, 1239, 1023, -263, -1154, -863, 130, 1000, 1137, 73, -1381, -1287, 442, 1480, 743, -343, -905, -1065, -159, 1488, 1458, -648, -1735, -586, 641, 869, 850, 89, -1521]
2317a521O4K272J062j504j321Q4K32O73J395j41k250r83J671J435k55n43o44j115
2335a389K89K146Q82j708j561K67Q65Q09Q32n56k030p34J722J666k10j159j073
2352i42n18R37J858M71j686j659J23J419J303J73j305j632j49J604J537o9j538
2369g3j468J14J557J368j64j445j377K9J568J543k88j765j180M48J334J180Kj574
2387a91j597M51J947J018o92j336j012J14J629J551o42k102q79R96J405P87l50
2404A097j643j371Q61K159P26j262j475n45O44J589J088j024k086n43J388J500
2420A103L79q75j547p98J109J912M21j412j509k70J046J518N66j195j783l07J404
2437b38J540J96j223j545l22J309J655J86j437j540o1J409J468N8j412j461QJ448
$$ y = [-1521, -1457, 815, 1877, 373, -948, -864, -632, 41, 1436, 1295, -955, -1938, -267, 1168, 913, 370, -274, -1389, -1100, 1046, 1928, 220, -1341, -1074, -209, 600, 1432, 876, -1154, -1888, -166, 1500, 1290, 131, -942, -1460, -523, 1335, 1806, 120, -1539, -1416, 3, 1306, 1479, 174, -1458, -1607, -3, 1534, 1465, -73, -1541, -1427, 130, 1498, 1334, -111, -1488, -1459, 109, 1652, 1364, -401, -1581, -1133, 201, 1381, 1383, -191, -1788, -1337, 610, 1628, 936, -400, -1412, -1298, 331, 1882, 1240, -862, -1741, -745, 660, 1447, 1097, -546, -1917, -1056, 1103, 1829, 567, -908, -1453, -809, 780, 1868, 844, -1242, -1785, -397, 1103, 1482, 607, -940, -1738, -629, 1283, 1704, 292, -1217, -1487, -441, 1077, 1643, 448, -1335, -1642, -238, 1302, 1498, 275, -1270, -1592, -283, 1372, 1558, 121, -1419, -1480, -71, 1397, 1455, 43, -1418, -1410, 38]
2455C8J435r3j525j339K17J486J233k16j432j266K54J548J183m36j494j016L91
2472a032J391J101l63j563j049N83J517Q46n56j387r41N09J537R36p12j536p52
2489a471P40J413P51o85j489p97Q20J541O18q74j412n44Q17J392N83q70j448m86
2507a401R76J351L54r27j244l60R00J289L16r78j205k20R37J111K42r20j169j62
2525a110R99J090N8r31j007j36R50J116K1j118r76J47R76Q64Mr75j032J03J185
2544B28Q90l43j058o81J91R26Q54j89j117p80L96J059N76l44r06o32K86R31O39
2563I26l29r43n81L92R10M70l76p73m66K63P80N65l58q89l83M67O99K78k68o68
2583b84m56L73Q38K57n53o02j36L46N82L25m66p54p1N94M73k8l17n00k37N01P04
$$ y = [38, 1473, 1380, -145, -1484, -1267, 219, 1452, 1236, -196, -1462, -1208, 340, 1523, 1087, -407, -1423, -1032, 359, 1460, 1097, -466, -1515, -932, 585, 1431, 875, -512, -1453, -944, 593, 1529, 817, -719, -1471, -731, 682, 1433, 748, -741, -1538, -718, 823, 1441, 567, -845, -1389, -572, 820, 1403, 533, -915, -1401, -425, 926, 1280, 353, -891, -1251, -351, 938, 1254, 276, -929, -1149, -212, 899, 1141, 221, -948, -1110, -111, 979, 1037, 106, -901, -1037, -87, 1029, 1050, -68, -1044, -897, 79, 943, 947, -28, -1060, -957, 228, 1118, 775, -283, -964, -773, 153, 1007, 818, -299, -1079, -683, 376, 952, 608, -298, -930, -644, 287, 926, 597, -346, -927, -535, 375, 845, 469, -304, -770, -507, 273, 838, 480, -409, -792, -325, 374, 652, 384, -284, -740, -367, 471, 728, 175, -427, -563, -217, 365, 690, 224, -530, -601, -7, 466, 438, 121, -379, -616, -115, 589]
2604E89q0o48l10J60K28L58K43m49o69Q8O62K37k19j84k36k01L10N92qo17k53
2625d07K37J89J41J58j95m56m0M69K59k07k19o8j4Q7K60O1l15j89J84K04m3q2
2647A4jl0o9Q9J26j02j62R0J89r4j89Q1J58r6n7J54n3k51Q1L53o9l36M0K35j26
2672b5p7K76Lm11j4M60Ml38L6J93k33o8M24Q5n41j11M47J06k59N3R2l29o7N48
2696B54K10n66k86L11J88n5J87j5n60k15O52M75l67m45k6M1Q9N03K18o47o53L55
2718c52O88R8k33j83l87k43N97P85k40q80k53L74L18K59K23m83q50Q2J000M58
2738G78n17m94j59o5L59P78N1j049n84O25P12K7j87k96n72n0R30O71o90q98P1
2759e59N23K46K56%p87o32O77J085j36q32l21O7J38O24N73o47j199N7J108N05
$$ y = [589, 509, -139, -449, -289, -61, 297, 540, 91, -578, -490, 172, 409, 190, 6, -230, -431, -121, 471, 463, -154, -407, -170, 19, 160, 318, 123, -333, -373, 96, 355, 148, -71, -139, -153, -66, 194, 255, -60, -249, -65, 139, 96, 14, 13, -17, -86, 3, 129, 27, -135, -45, 144, 50, -139, -58, 100, 4, -53, 101, 48, -203, -122, 231, 162, -174, -134, 101, -25, -102, 174, 177, -234, -248, 212, 216, -122, -86, 107, -126, -194, 230, 315, -226, -337, 110, 216, -43, 10, 102, -227, -294, 254, 464, -102, -388, -77, 111, 56, 243, 228, -332, -547, 105, 580, 213, -232, -258, -217, -128, 375, 593, -54, -707, -352, 336, 434, 201, 18, -369, -612, -15, 770, 530, -350, -603, -229, 89, 348, 571, 88, -762, -680, 320, 778, 261, -233, -392, -457, -98, 680, 731, -318, -902, -277, 435, 462, 275, -21, -593, -643, 287, 958, 268, -630, -559, -36, 210, 466, 466, -321, -953, -276, 809, 673, -159, -480, -413, -275, 349, 922, 275, -924, -867, 241, 746]
2779G46k92l84n09m69N88J304Q4j322p69M58O69M48L24n52j336k09J429J030n55
2798F83r53l82j32N22J209L08j410j166N84J148L27j41m43r57l51J240J211n52
2816G45j281k88M03M45O29K74r90j151M80J346L15o74n51l34j6Q06R39m13j386
2835g02l97R34Q21M0l53o76o77M31J349M99j122j123J28P98O55L25m43j270n82
2854a365J184J431j98j205o61k1M80J112O50j103j642J14J461P61k41n28q92o92
2872a355R36J727J7j605q42M34O21O44N86p44j638j06J628Q83o01p33m28l34N97
2891c13J400Q3j543q59P57Q54K29K4n44j057NJ415P77q15j007j23L44N71O91j40
2911G49j249p44Q54J185J34o95p12l86L18J068P14p70j354k74R83R57J31n64r11
$$ y = [746, 454, 70, -439, -908, -320, 984, 1068, -254, -1023, -565, 104, 552, 876, 324, -1012, -1221, 208, 1238, 683, -270, -652, -784, -262, 947, 1255, -155, -1321, -737, 411, 738, 597, 154, -803, -1154, 86, 1297, 745, -536, -824, -421, 24, 653, 927, -63, -1214, -734, 612, 927, 253, -298, -632, -648, 158, 1097, 684, -702, -1099, -165, 656, 696, 343, -333, -1010, -579, 770, 1269, 147, -976, -848, -50, 605, 930, 487, -783, -1365, -181, 1250, 1052, -153, -814, -835, -355, 757, 1407, 304, -1338, -1224, 237, 998, 757, 229, -663, -1355, -419, 1308, 1325, -280, -1122, -688, -67, 577, 1163, 419, -1219, -1325, 303, 1186, 585, -148, -576, -910, -313, 1087, 1170, -373, -1232, -475, 379, 608, 632, 88, -969, -964, 451, 1228, 413, -594, -717, -373, 198, 889, 749, -500, -1244, -390, 795, 929, 234, -478, -864, -546, 522, 1236, 466, -888, -1162, -179, 778, 909, 345, -566]
2930e66o03O01J442M82j171j215P7Q02P19M24m17j351o43J185J376k06j005n31
2948f00j76K72J128O95j083j389K61J133L87q4j90q38o68R44J326l08j162k96
2966f48K72K27O10N08q40j201L43J198K81m67l46m29k70P86J014l57j206l17N92
2985b50N37L14m4p59p70L87J121L66o30p23k80L22P52N16m03r29m40N45Q90K78
3005H00n20p36k73L66P34M61m12r59l16O71P27M4l37n10m56K71R81L53q03p04
3025f18J78L57K81L82j37r46l58Q83O56l33m25q3k54P0P99L18q58o17M50M80l2
3046A93Q4m8o28k60P80N55m76m85M1K0R0N08J59p02m53M08M81J8r6j92l89j3N83
3069A78L57l34m43q5J31L04K89j13m71k17K46L37J68j44l65j98K39L37O1j28k48
$$ y = [-566, -1169, -568, 874, 1356, 185, -1030, -953, -151, 568, 992, 575, -776, -1419, -234, 1142, 936, -69, -600, -776, -504, 624, 1319, 236, -1153, -892, 241, 628, 544, 354, -484, -1152, -208, 1118, 810, -352, -648, -376, -149, 461, 969, 129, -1072, -729, 469, 750, 283, -63, -492, -762, 24, 1038, 681, -525, -842, -250, 287, 601, 557, -202, -972, -585, 536, 902, 272, -451, -731, -409, 343, 859, 456, -473, -913, -368, 522, 800, 280, -456, -729, -363, 371, 832, 420, -539, -855, -184, 543, 587, 250, -260, -716, -445, 536, 889, 86, -618, -440, -83, 198, 580, 443, -503, -861, 22, 678, 345, -80, -163, -417, -347, 452, 770, -88, -705, -255, 225, 193, 277, 229, -399, -659, 121, 676, 200, -285, -244, -224, -134, 374, 533, -169, -622, -214, 267, 285, 189, -3, -392, -405, 178, 535, 201, -242, -327, -196, 108, 397, 284, -187, -404, -158, 179, 347, 203, -162, -360, -121, 216, 277, 149, -99]
3090i9j96J26L71J26l15j88M3L5R0K52n9m09m5L39O5j60O9J9k70K1L94pl59J2
3114a45K41j31p3K56%l53M0L46p9k63J25J55k10oK66n6l30J35K60j36j61J63L0
3137G4j80J08J76j48j96J70J33j24l8P8r8n7K00P9k06r7J07N4J2P4q4k12M9K24
3161I8M9j09o1r0n8K03K10j18k66l4Q4Q8J84L7l19k40K22K85K5q9j22k63J6M24
3185A56K29k81l19nJ01J85K66o5n05j97L80L53m6j52k29k41J56N36J33m41l43
3206c29O8K03K61K05k57n23o3M72L35q1k55l15j41L32N28pn08l54Q9L29L64P7
3228D30m40m87O9N21L68j02m16m23L0N35M48j53n26l54J14M93M26j09o12l98K47
3249c39N44L24j47n46m33K16O68L19l10n46k84J82N94M21l16o95k77L96N35K58
$$ y = [-99, -295, -169, 202, 328, 13, -175, -132, -97, -7, 245, 186, -223, -268, 71, 136, -24, 45, 64, -206, -185, 209, 202, -157, -145, 96, -35, -108, 148, 148, -205, -165, 181, 102, -161, -36, 119, -91, -97, 169, 113, -217, -82, 178, 42, -119, 44, 74, -106, 2, 178, 30, -166, 4, 137, 13, -25, 53, -45, -102, 98, 177, -29, -126, -19, 35, 47, 121, 37, -175, -126, 98, 147, 38, -23, -113, -171, 32, 242, 124, -142, -176, -92, -4, 180, 217, -102, -342, -120, 165, 190, 101, -21, -284, -268, 156, 385, 104, -215, -220, -119, 66, 332, 267, -238, -435, -55, 298, 252, 100, -129, -370, -214, 322, 455, 14, -329, -261, -58, 203, 408, 151, -372, -435, 37, 372, 291, 36, -279, -420, -88, 440, 433, -75, -429, -340, -11, 353, 430, -10, -497, -428, 93, 461, 359, -57, -480, -450, 85, 533, 380, -146, -500, -386, 107, 533, 424, -188, -586, -339, 205, 529, 382, -164, -597, -381, 287, 606, 296, -250, -534, -352, 242, 663, 347, -348, -625, -229, 306, 564]
3269E64k30o46l85M18P32J93m77n53j96L05O64L19m98p66r8N44N58J14l75o54
3289d67k68N78P69L9o41n68k2M62O34J60n90p43J1O76N86n1n63n74n5O11O66l4
3311F16p00n94J23O50N48p3o20o12P4P25N99j71p53n06K21O47M99j36p17n74K39
3332e15Q26M39l59o93l75K38O81N36l09q78l80M81P21K44l24o75m33L60Q78L53
3352H16n98p50j42M37O25L57l98q75l25O69P90O6n32o01k50M21Q28K96o81q16
$$ y = [564, 334, -312, -697, -279, 453, 646, 169, -384, -580, -275, 389, 708, 210, -556, -654, -110, 448, 562, 187, -467, -735, -157, 612, 651, 10, -558, -580, -118, 516, 676, 86, -657, -646, 30, 616, 565, 2, -572, -627, -16, 650, 616, -84, -678, -555, 95, 643, 570, -50, -662, -588, 137, 736, 565, -188, -694, -473, 174, 673, 537, -180, -754, -515, 311, 750, 391, -302, -677, -439, 242, 778, 469, -409, -789, -308, 413, 657, 333, -342, -775, -415, 463, 816, 218, -532, -674, -237, 388, 745, 347, -528, -853, -184, 606, 672, 140, -461, -711, -290, 538, 834, 153, -663]
$$ [...]
8191B5
##END NTUPLES=NMR FID
##END=
