##TITLE=1H_IPEM21
 CDCl3, 8 sc, 
 24.7.2019
##JCAMPDX= 6.0         $$ Bruker NMR JCAMP-DX V2.0
##DATA TYPE= NMR FID
##DATA CLASS= NTUPLES
##ORIGIN= UXNMR, Bruker Analytische Messtechnik GmbH
##OWNER= root
$$ XWIN-NMR		Version 3.5
$$ Wed Jul 24 14:26:58 2019 Russian Standard Time (UT+4h)  she@DPX200
##.OBSERVE FREQUENCY= 200.13155
##.OBSERVE NUCLEUS= ^1H
##.DELAY= (6, 6)
##.ACQUISITION MODE= SIMULTANEOUS
##.ACQUISITION SCHEME= undefined
##.AVERAGES= 8
##.DIGITISER RES= 18
##SPECTROMETER/DATA SYSTEM= spect
##.PULSE SEQUENCE= zg30
##.SOLVENT NAME= CDCl3
##.SHIFT REFERENCE= (INTERNAL, CDCl3, 0, 15.7039)
##AUDIT TRAIL= $$ (NUMBER, WHEN, WHO, WHERE, WHAT)
$$ ##TITLE= Audit trail, XWIN-NMR		Version 3.5
$$ ##JCAMPDX= 5.01
$$ ##ORIGIN= Bruker BioSpin GmbH
$$ ##OWNER= she
$$ F:/spectra/data/she/nmr/H-F/1/audita.txt
$$ ##AUDIT TRAIL=  $$ (NUMBER, WHEN, WHO, WHERE, WHAT)
(   1,<2019-07-24 14:25:59.23 +0400>,<she>,<DPX200>,
      <created by zg, POWCHK disabled, PULCHK disabled
       configuration hash MD5:
       00 E9 B6 7A A2 85 ED C7 34 08 36 98 17 FE 4E 26
       data hash MD5: 16K
       85 E6 3C E2 E9 37 63 EA 92 B9 1B FF E7 C4 49 6A>)
$$ ##END=
$$ 
$$ hash MD5
$$ 1A DB 3F 46 77 A8 1E 63 FB 58 0C 5D 83 13 C2 64
##$RELAX= 
##$RELAX= 
##$RELAX= 
##$RELAX= 
##$RELAX= 
##$RELAX= 
$$ Bruker specific parameters
$$ --------------------------
##$DU= <F:/spectra>
##$EXPNO= 1
##$NAME= <H-F>
##$PROCNO= 1
##$TYPE= <nmr>
##$USER= <she>
##$AMP= (0..31)
100 100 100 100 100 100 100 100 100 100 100 100 100 100 100 100 100 100 
100 100 100 100 100 100 100 100 100 100 100 100 100 100 
##$AQSEQ= 0
##$AQ_mod= 1
##$AUNM= <au_zg>
##$AUTOPOS= <>
##$BF1= 200.13
##$BF2= 200.13
##$BF3= 200.13
##$BF4= 200.13
##$BF5= 200.13
##$BF6= 200.13
##$BF7= 200.13
##$BF8= 200.13
##$BYTORDA= 1
##$CFDGTYP= 0
##$CFRGTYP= 5
##$CHEMSTR= <none>
##$CNST= (0..31)
1 1 145 1 1 1 1 1 1 1 1 1 1 1 1 1 1 1 1 1 1 1 1 1 1 1 1 1 1 1 1 1 
##$CPDPRG= <>
##$CPDPRG1= <>
##$CPDPRG2= <>
##$CPDPRG3= <>
##$CPDPRG4= <mlev>
##$CPDPRG5= <mlev>
##$CPDPRG6= <mlev>
##$CPDPRG7= <mlev>
##$CPDPRG8= <mlev>
##$CPDPRGB= <>
##$CPDPRGT= <>
##$D= (0..31)
0 1.2 0 0 0 0 0 0 0 0 0 0.03 0 0 0 0 0 0 0 0 0 0 0 0 0 0 0 0 0 0 0 0 
##$DATE= 1563963958
##$DBL= (0..7)
120 120 120 120 120 120 120 120 
##$DBP= (0..7)
150 150 150 150 150 150 150 150 
##$DBP07= 0
##$DBPNAM0= <>
##$DBPNAM1= <>
##$DBPNAM2= <>
##$DBPNAM3= <>
##$DBPNAM4= <>
##$DBPNAM5= <>
##$DBPNAM6= <>
##$DBPNAM7= <>
##$DBPOAL= (0..7)
0.5 0.5 0.5 0.5 0.5 0.5 0.5 0.5 
##$DBPOFFS= (0..7)
0 0 0 0 0 0 0 0 
##$DE= 6
##$DECBNUC= <off>
##$DECIM= 24
##$DECNUC= <off>
##$DECSTAT= 4
##$DIGMOD= 1
##$DIGTYP= 9
##$DL= (0..7)
0 120 120 120 120 120 120 120 
##$DP= (0..7)
150 150 150 150 150 150 150 150 
##$DP07= 0
##$DPNAME0= <>
##$DPNAME1= <>
##$DPNAME2= <>
##$DPNAME3= <>
##$DPNAME4= <>
##$DPNAME5= <>
##$DPNAME6= <>
##$DPNAME7= <>
##$DPOAL= (0..7)
0.5 0.5 0.5 0.5 0.5 0.5 0.5 0.5 
##$DPOFFS= (0..7)
0 0 0 0 0 0 0 0 
##$DQDMODE= 0
##$DR= 18
##$DS= 0
##$DSLIST= <SSSSSSSSSSSSSSS>
##$DSPFIRM= 0
$$ [...]
##$SUBNAM2= <"">
##$SUBNAM3= <"">
##$SUBNAM4= <"">
##$SUBNAM5= <"">
##$SUBNAM6= <"">
##$SUBNAM7= <"">
##$SUBNAM8= <"">
##$SUBNAM9= <"">
##$SW= 24.9336996594482
##$SWIBOX= (0..15)
0 0 2 0 0 0 0 0 0 0 0 0 0 0 0 0 
##$SW_h= 4990.01996007984
##$TD= 16384
##$TD0= 1
##$TE= 0
##$TE2= 300
##$TE3= 300
##$TEG= 300
##$TL= (0..7)
0 120 120 120 120 120 120 120 
##$TP= (0..7)
150 150 150 150 150 150 150 150 
##$TP07= 0
##$TPNAME0= <>
##$TPNAME1= <>
##$TPNAME2= <>
##$TPNAME3= <>
##$TPNAME4= <>
##$TPNAME5= <>
##$TPNAME6= <>
##$TPNAME7= <>
##$TPOAL= (0..7)
0.5 0.5 0.5 0.5 0.5 0.5 0.5 0.5 
##$TPOFFS= (0..7)
0 0 0 0 0 0 0 0 
##$TUNHIN= 0
##$TUNHOUT= 0
##$TUNXOUT= 0
##$USERA1= <user>
##$USERA2= <user>
##$USERA3= <user>
##$USERA4= <user>
##$USERA5= <user>
##$V9= 5
##$VALIST= <valist>
##$VCLIST= <CCCCCCCCCCCCCCC>
##$VD= 0
##$VDLIST= <DDDDDDDDDDDDDDD>
##$VPLIST= <PPPPPPPPPPPPPPP>
##$VTLIST= <TTTTTTTTTTTTTTT>
##$WBST= 1024
##$WBSW= 4
##$XGAIN= (0..3)
0 0 0 0 
##$XL= 0
##$YL= 0
##$YMAX_a= 62786
##$YMIN_a= -71216
##$ZGOPTNS= <>
##$ZL1= 120
##$ZL2= 120
##$ZL3= 120
##$ZL4= 120
##$ABSF1= 10
##$ABSF2= 0
##$ABSG= 5
##$ABSL= 3
##$ALPHA= 0
##$AQORDER= 0
##$ASSFAC= 0
##$ASSFACI= 0
##$ASSFACX= 0
##$ASSWID= 0
##$AUNMP= <proc_1d>
##$AZFE= 0.1
##$AZFW= 0.1
##$BCFW= 1
##$BC_mod= 2
##$BYTORDP= 1
##$COROFFS= 0
##$CY= 11.3945322036743
##$DATMOD= 1
##$DC= 2
##$DFILT= <>
##$DTYPP= 0
##$F1P= 18.9103706918063
##$F2P= -1.10871071338519
##$FCOR= 0.5
##$FTSIZE= 0
##$FT_mod= 4
##$GAMMA= 1
##$GB= 0.15
##$INTBC= 1
##$INTSCL= 1
##$ISEN= 128
##$LB= 0.24
##$LEV0= 0
##$LPBIN= 0
##$MAXI= 10000
##$MC2= 0
##$MEAN= 0
##$ME_mod= 0
##$MI= 1.114404
##$NCOEF= 0
##$NC_proc= 0
##$NLEV= 6
##$NOISF1= 3.799351
##$NOISF2= 2.8
##$NSP= 1
##$NTH_PI= 0
##$NZP= 0
##$OFFSET= 15.70392
##$PC= 1
##$PHC0= -8943.518
##$PHC1= 16.80096
##$PH_mod= 1
##$PKNL= yes
##$PPARMOD= 0
##$PSCAL= 0
##$PSIGN= 0
##$REVERSE= no
##$SF= 200.130013532006
##$SI= 16384
##$SIGF1= 3
##$SIGF2= 2
##$SINO= 400
##$SIOLD= 16384
##$SREGLST= <1H.CDCl3>
##$SSB= 0
##$STSI= 0
##$STSR= 0
##$SW_p= 3612.71676300578
##$SYMM= 0
##$S_DEV= 0
##$TDeff= 0
##$TDoff= 0
##$TI= <>
##$TILT= no
##$TM1= 0
##$TM2= 0
##$TOPLEV= 0
##$USERP1= <user>
##$USERP2= <user>
##$USERP3= <user>
##$USERP4= <user>
##$USERP5= <user>
##$WDW= 1
##$XDIM= 8192
##$YMAX_p= 0
##$YMIN_p= 0
$$ End of Bruker specific parameters
$$ ---------------------------------
##NTUPLES= NMR FID
##VAR_NAME=  TIME,          FID/REAL,        FID/IMAG
##SYMBOL=    X,             R,               I
##VAR_TYPE=  INDEPENDENT,   DEPENDENT,       DEPENDENT
##VAR_FORM=  AFFN,          ASDF,            ASDF
##VAR_DIM=   8192,          8192,            8192
##UNITS=     SECONDS,       ARBITRARY UNITS, ARBITRARY UNITS
##FACTOR=    0.0002004,     1,               1
##FIRST=     0,             0,               0
##LAST=      1.6414764,     0,               0
##MIN=       0,             -71216,          0
##MAX=       1.6414764,     62786,           0
$$ Real data points
##PAGE= N=1
##DATA TABLE= (X++(R..R)), XYDATA
$$ [...]
$$ plain form
550 2057 4242 1365 -1681 -2332 -1974 -169 3198 4061 115 -4039 -3308 606 2988 2446 548 -1745
566 -1745 -3214 -1763 2115 3924 1036 -2977 -3295 -638 1510 2218 1692 -935 -3793 -2535 2020 3610
582 3610 723 -1885 -2158 -1858 -279 3073 3569 -930 -4201 -1865 1522 1883 1387 819 -1698 -3352 -113
599 -113 3923 2760 -1097 -2301 -1405 -382 1694 3370 1042 -3016 -3059 445 2723 2431 955 -1606
615 -1606 -3422 -1537 2290 3386 1090 -1627 -2950 -2105 1028 3471 2069 -1380 -3039 -2256 7 2708
631 2708 2976 -627 -3604 -2081 771 1433 1538 1384 -1478 -4009 -1104 3441 2515 -1036 -1368 -802 -1753
648 -1753 -46 3701 2361 -2758 -2905 907 1231 -149 1502 1543 -2622 -2979 2411 3781 -883 -2275
664 -2275 534 104 -1488 1643 3708 -883 -4103 -287 2625 288 -409 1473 -551 -3510 -153 4162
$$ packed form
550B057K185k877l046o51L58J805L367Q63l946m154P31L914K382n42j898k293
566a745j469J451L878J809k888m013l18K657K148P08n26k627k858J258M555J590
582C610k887k608k73L00J579L352M96m499l271K336L387L61m96n68k517j654L239
599a13M036j163l857j204Q96J023K076J676k328m058m3L504K278k92j476k561
615a606j816J885L827J096k296k717j323Q45L133K443j402l449j659P83K263K701
631B708K68l603k977J523K852O62J05j54k862k531K905M545r26l551l32N66r51
648a753J707L747j340n119j47L812L24j380J651M1m165l57N390J370m664j392
664b275K809m30j592L131K065m591l220L816K912k337o97J882k024k959L357M315
$$ plain form
680 4162 1533 -2653 -1568 45 -1261 -48 3371 1590 -3325 -2864 1168 1438 -167 744 534 -2608
696 -2608 -2602 1670 3001 -63 -1474 -434 -763 -1104 1151 2464 71 -2030 -909 499 491 869 1158 -367
714 -367 -1626 -200 1496 879 -276 -102 105 -346 -11 884 557 -434 -403 202 107 -58 350 267 -552 -507
734 -507 567 600 -672 -1021 34 441 -90 32 382 -531 -1301 -140 1007 159 -665 -51 -109 -1032 -100
753 -100 1585 505 -1570 -617 1021 -170 -1013 1015 1531 -1096 -1490 1058 962 -1101 172 1958 -479
770 -479 -2237 873 2299 -1080 -1615 2074 1517 -2571 -1304 2746 1029 -2160 258 2156 -1478 -2495
786 -2495 2052 2670 -1797 -1781 1742 182 -2587 698 3338 -773 -3270 452 1769 -1366 -665 2540
802 2540 137 -3485 -595 2729 59 -1769 1063 969 -2685 -1435 2959 1563 -2408 -1087 1524 -243
$$ packed form
680D162k629m186J085J613j306J213L419j781m915M61M032K70j605R11k10l142
696b608OM272J331l064j411J040l29l41K255J313k393k101J121J408qL78K89j525
714c67j259J426J696o17j155J74K07m51L35Q95l27r91L1O05r5j65M08q3q19M5
734e07J074L3j272l49J055M07n31J22L50r13p70J161J147q48q24O14n8r23R32
753a00J685j080k075R53J638j191q43K028N16k627l94K548r6k063J273J786k437
770d79j758L110J426l379n35L689n57m088J267M050j717l189K418J898l634j017
786b495M547O18m467J6L523j560k769L285K640m111k497L722J317l135P01L205
802B540k403l622K890L324k670j828K832r4l654J250M394j396l971J321K611j767
$$ plain form
818 -243 -1288 1365 1496 -1637 -1382 1467 888 -956 351 1193 -954 -1194 1422 1472 -865 -789 601 80
836 80 -78 1311 592 -1638 -844 1302 599 -483 701 434 -1982 -1203 2083 1616 -1278 -1039 294 -942
854 -942 -937 1900 1754 -1880 -2220 609 625 -668 905 1411 -1914 -2759 1037 2391 -289 -794 598 -918
872 -918 -2163 1095 3142 -250 -2429 123 1175 -812 -8 2393 390 -2784 -833 2283 958 -839
888 -839 497 668 -1516 -871 2105 1521 -1498 -1224 835 410 -480 754 973 -1183 -1626 609 1422 34
906 34 -514 -200 -719 -750 707 1212 -279 -1253 -561 83 172 531 502 -647 -1386 -477 789 964 276 -543
926 -543 -1002 -581 384 860 560 -107 -722 -817 124 1111 776 -298 -631 -308 -90 433 1160 687 -794 -1051
946 -1051 179 811 390 223 223 -469 -802 293 1206 404 -707 -482 42 -118 -7 690 420 -857 -999
$$ packed form
818b43j045K653J31l133K55K849n79j844J307Q42k147k40K616N0k337P6J390n21
836H0j58J389p19k230P94K146p03j082J184k67k416P79L286m67k894K39J333j236
854i42NK837j46l634l40K829J6j293J573N06l325q45L796J354k680n05J392j516
872i18j245L258K047l392k179K552J052j987Q04K401k003l174J951L116j325j797
888h39J336J71k184O45K976n84l019K74K059m25q90J234K19k156m43K235Q13j388
906C4n48L14n19l1J457N05j491r74O92O44Q9L59k9j149p39R09J266J75o88q19
926e43m59M21R65M76l00o67o15r5R41R87l35j074l33L23K18N23P27m73j481k57
946a051J230O32m21j67%o92l33J095R13q02j111K25N24j60J11O97k70j277j42
$$ plain form
965 -999 275 736 -107 -422 93 -139 -803 -143 888 182 -1058 -532 548 86 -488 345 496 -967 -1073
984 -1073 811 1112 -544 -605 740 91 -1195 163 1684 49 -1497 185 1322 -379 -726 1289
1000 1289 901 -1577 -864 1757 902 -1284 -39 1450 -546 -1541 1082 1854 -1019 -1621 916 804 -1248
1017 -1248 -85 1864 -183 -2331 -156 1702 -250 -1169 818 645 -1793 -1039 1697 913 -1444 -650
1033 -650 842 -407 -1027 909 1204 -1049 -1360 612 819 -419 11 687 -514 -1120 511 1367 134
1050 134 -628 -114 -122 -294 587 1160 126 -784 -381 188 368 582 400 -448 -656 70 535 438 351 -181 -974
1071 -974 -531 836 874 -241 -464 -195 -602 -370 1003 1010 -832 -1386 -64 392 -82 454 692 -956 -1696
1090 -1696 249 1490 132 -729 49 -185 -1107 80 1701 501 -1447 -753 708 369 -34 692 266
$$ packed form
965i99J274M61q43l15N15k32o64O60J031p06j240N26J080m62n74Q33J51j463j06
984a073J884L01j656o1J345o49j286J358J521j635j546J682J137j701l47K015
1000A289l88k478P13K621q55k186J245J489j996r95K623P72k873o02K537j12k052
1017a248J163J949k047k148K175J858j952r19J987j73k438P54K736p84k357P94
1033f50J492j249o20J936K95k253l11J972K07j238M30O76j201o06J631Q56j233
1050A34p62N14qj72Q81N73j034r10M03N69J80K14j82q48k08P26M65r7q7n32p93
1071i74M43J367L8j115k23K69m07K32J373Pj842n54J322M56m74N36K38j648p40
1090a696J945J241j358q61P78k34r22J187J621j200j948O94J461l39m03P26m26
$$ plain form
1107 266 -1268 -840 1193 1398 -96 -508 -58 -406 -391 916 1350 -186 -1246 -357 656 557 297 211 -407
1126 -407 -964 -267 960 919 -236 -870 -527 -52 232 548 422 -484 -1184 -482 759 769 -200 -615 -455 -437
1146 -437 -102 820 824 -575 -1269 -248 587 260 180 403 -340 -1105 -63 1333 636 -739 -536 224 -25
1165 -25 12 938 727 -811 -1007 430 920 115 -19 299 -351 -760 408 1252 123 -959 -339 371 28
1184 28 -29 588 238 -909 -748 524 728 -162 -418 -99 -313 -445 285 698 -185 -871 -264 363 55 -175
1204 -175 167 44 -627 -447 490 574 -251 -445 68 142 -150 106 451 -11 -495 -56 502 203 -180 110 296
1225 296 -124 -224 340 485 -164 -368 225 398 -195 -274 339 342 -288 -214 417 144 -530 -183 526 45 -686
1246 -686 -112 547 -130 -615 205 509 -589 -773 448 597 -630 -630 456 158 -727 79 938 -253 -1191
$$ packed form
1107B66j534M28K033K05j494m12M50l48J5J307M34j536j060Q89J013r9k60q6o18
1126d07n57O97J227m1j155o34L43M75K84L16j26r06p00P02J241J0r69m15J60J8
1146d37L35R22Mj399o94J021Q35l27q0K23p43p65J042J396o97j375K03P60k49
1165b5L7R26k11j538j96J437M90q05j34L18o50m09J168Q44j129j082O20P10l43
1184B8n7O17l50j147J61J272K04q90k56L19k14j32P30M13q83o86O07O27l08k30
1204a75L42j23o71J80R37Q4q25j94N13P4k92K56L45m62m84M39N58k99l83K90J86
1225B96m20j00N64J45o49k04N93J73n93p9O13Lo30P4O31k73o74L47P09m81p31
1246f86N74O59o77m85Q20L04j098j84J221J49j227%J086k98q85Q06Q59j191r38
$$ plain form
1265 -1191 106 970 -209 -609 596 418 -1049 -431 1337 693 -1035 -461 796 85 -497 764 929
1282 929 -869 -1130 702 1027 -281 -216 582 -309 -1005 511 1522 -37 -1223 -269 359 -194 72 888
1300 888 66 -1244 -595 776 618 -137 -169 -355 -857 -282 869 734 -407 -802 -384 52 437 586 14
1319 14 -742 -748 -88 514 743 305 -622 -869 -2 761 572 152 -195 -745 -600 717 1331 193 -827 -446
1339 -446 -1 14 698 1158 -175 -1517 -536 1083 841 -18 -9 -389 -1195 -309 1524 1182 -759 -1151 -198
1358 -198 -9 86 908 600 -1230 -1658 132 1274 577 -100 -276 -905 -1024 417 1497 417 -1121 -1067
1376 -1067 -87 439 697 801 33 -1105 -1058 345 1307 698 -499 -869 -358 239 706 981 336 -977 -1159
1395 -1159 265 1260 592 -225 -316 -584 -624 721 1663 152 -1613 -822 625 371 122 837 107 -1809
$$ packed form
1265a191J297Q64j179m00J205j78j467O18J768o44j728N74J257p11n82J261J65
1282I29j798k61J832L25j308O5P98q91o96J516J011j559j186R54O28n53K66Q16
1300H88q22j310O49J371j58p55l2j86n02N75J151j35j141l95M18M36L85J49n72
1319A4p56oO60O02K29m38r27k47Q67P63j89m20l47n50J45J317O14j138j020L81
1339d46M45J5O84M60j333j342R81J619k42q59Rl80q06Q86J833l42j941l92R53
1358a98J89R5Q22l08j830m28J790J142o97o77j76o29j19J441J080j080j538N4
1376a067R80N26K58J04p68j138M7J403R62o09j197l70N11N97M67K75o45j313j82
1395a159J424R95o68q17r1k68m0J345R42j511j765P91J447k54k49P15p30j916
$$ plain form
1413 -1809 -1141 1431 1496 -627 -938 -60 -570 -608 1322 1633 -1020 -2063 -74 894 -29 322 959 -826
1431 -826 -2074 200 2192 567 -1083 -296 -35 -1003 4 1945 878 -1554 -1153 679 727 169 607
1448 607 175 -1296 -942 968 1271 61 -341 -220 -569 -147 1101 912 -633 -1081 -169 348 407 574 116
1467 116 -837 -816 180 682 449 -9 -747 -1040 -20 1047 525 -438 -461 -426 -663 199 1315 402 -1258 -855
1487 -855 406 293 75 733 171 -1428 -886 1159 1070 -355 -136 384 -705 -807 1213 1514 -760 -1359
1505 -1359 390 683 -296 394 1199 -374 -1559 62 1296 127 -512 293 -24 -923 71 1282 202
1522 202 -1048 -271 371 -295 -172 724 108 -1162 -514 788 415 -389 -110 -10 -617 -328 636 475 -408
1541 -408 -460 -103 -59 192 521 37 -566 -264 183 85 256 527 -116 -742 -33 688 161 -191 275 62 -597
$$ packed form
1413a809O68K572O5k123l11Q78n10l8J930L11k653j043J989R68r23L51O37j785
1431h26j248K274J992j625j650P87K61r68J007J941j067k432M01J832M8n58M38
1448F07m32j471L54J910L03j210m02J21l49M22J248j89j545m48R12N17N9J67m58
1467A16r53K1R96N02k33m58p38k93J020J067n22r63k3L5k37Q62J116r13j660M03
1487h55J261j13k18O58n62j599N42K045q9j425K19N20j089j02K020L01k274n99
1505a359J749K93r79O90Q05j573j185J621J234j169o39Q05l17q99R94J211j080
1522B02j250P77O42o66J23Q96o16j270O48J302l73q04K79J00o07K89R64j61q83
1541d08n2L57M4K51L29m84o03L02M47r8J71K71o43o26P09P21n27l52M66k13o59
$$ plain form
1562 -597 64 1051 276 -753 -147 426 -296 -278 872 544 -906 -584 741 322 -590 127 600 -591 -919
1581 -919 512 790 -486 -543 416 37 -715 80 748 -279 -898 90 487 -334 -297 482 123 -704 -189 634
1601 634 143 -485 -49 302 -155 -242 359 421 -172 -340 66 276 100 -1 105 133 -38 -117 186 376 -4
1622 -4 -347 34 361 9 -149 308 225 -482 -294 522 284 -499 -123 431 -247 -623 392 678 -566 -761
1642 -761 410 369 -677 -217 755 -103 -1032 30 847 -268 -708 411 394 -790 -349 910 222 -891
1660 -891 -50 778 -231 -614 614 679 -664 -494 769 405 -575 45 703 -178 -548 461 638 -363
1678 -363 -309 508 139 -476 150 569 -229 -463 302 301 -360 -93 407 -143 -500 167 347 -347 -293 325 -25
1699 -25 -515 50 400 -301 -478 254 174 -516 -139 526 -104 -626 192 510 -394 -426 505 279 -632 -115 697
$$ packed form
1562e97O61R87p75j029O06N73p22J8J150l28j450L22J325m19r12P17M73j191l28
1581i19J431K78j276n7R59l79p52P95O68j027o19R88L97q21L7P79l59q27N15Q23
1601F34m91o28M36L51m57q7O01O2n93j68M06K10j76j01J06K8j71p9L03J90l80
1622dl43L81L27l52j58M57q3p07J88Q16k38p83L76N54o78l76J015K86j244j95
1642g61J171m1j046M60R72q58r29J062Q17j115m40J119j7j184M41J259o88j113
1660h91Q41Q28j009l83J228O5j343J70J263l64r80O20O58q81l70J009J77j001
1678c63N4Q17l69o15O26M19p98k34P65jo61K67N00n50l57O67J80o94N4O18l50
1699b5m90N65L50p01j77P32q0o90L77O65o30n22Q18L18r04l2R31k26r11N17Q12
$$ plain form
1720 697 13 -557 298 591 -414 -443 623 422 -550 -73 746 -1 -647 293 756 -287 -547 418 393 -484
1740 -484 -146 673 74 -673 11 529 -172 -423 286 236 -548 -305 519 206 -496 -199 207 -153 -317 184
1760 184 242 -320 -395 65 135 -46 51 45 -235 -264 95 257 63 -71 -105 -125 43 255 169 -22 -92 -107 -55 268
1784 268 426 64 -283 -85 156 91 177 324 -68 -463 -46 510 268 -144 -16 -15 -357 -125 546 350 -457
1805 -457 -457 107 108 -53 254 173 -561 -634 227 487 -66 -243 -34 -262 -405 241 621 -48 -660 -301 163 124
1827 124 158 290 -120 -579 -209 467 450 3 -168 -204 -220 96 569 453 -181 -469 -173 269 435 315 -9
1848 -9 -342 -322 62 464 446 1 -437 -388 42 375 374 84 -328 -549 -186 436 491 -60 -446 -372 -202 83 451
1871 451 380 -362 -761 -251 362 351 99 -96 -443 -536 72 702 408 -342 -481 -175 20 282 557 173 -598
$$ packed form
1720F97o84n70Q55K93j005k9J066k01r72M77Q19p47o46R40M63j043k60R65k5q77
1740d84L38Q19n99p47O84N18p01k51P09n0p84K43Q24l13p02K97M06l60j64N01
1760A84N8n62p5M60P0j81R7ok80k9L59J62j94j34l4k0J68K12q6j91p0j5N2L23
1784B68J58l62l47J98K41o5Q6J47l92l95M17N56k42m12J28Jl42K32O71j96q07
1805d57%N64Jj61L07q1p34p3Q61K60n53j77K09k28j43O46L80o69o12L59M64l9
1827A24L4J32m10m59L70O76j7m47j71l6j6L16M73j16o34k88K96M42J66j20l24
1848il33K0L84M02j8m45m38M9M30L33jk90m12k21L63O22N5n51l86P4J70K85L68
1871D51p1p42l99N10O13j1k52j95l47r3O08O30k94p50j39L06J95K62K75l84p71
$$ plain form
1892 -598 -578 230 629 332 25 -164 -431 -273 472 799 128 -528 -375 45 252 423 426 -131 -695 -380 431
1913 431 619 148 -261 -418 -385 24 565 492 -251 -666 -355 115 322 349 61 -496 -698 -87 564 471 -109
1934 -109 -472 -435 -165 289 552 212 -433 -600 -153 355 498 242 -212 -503 -283 301 620 336 -207 -469
1954 -469 -266 205 533 419 -42 -429 -358 119 523 462 -38 -448 -385 19 380 474 131 -429 -578 -71 475
1975 475 414 -4 -293 -433 -339 152 574 268 -439 -600 -155 211 301 261 -86 -571 -479 202 542 189 -191 -271
1997 -271 -316 -141 402 596 -24 -587 -311 187 304 275 238 -142 -531 -165 535 535 -4 -217 -168 -147 73 481
2019 481 390 -264 -492 -42 295 219 151 37 -345 -427 118 511 175 -273 -259 -141 -119 130 416 88 -507 -456
2041 -456 122 312 82 -37 -124 -320 -246 239 421 34 -315 -224 -57 75 258 285 -122 -428 -146 287 295 87
$$ packed form
1892e98K0Q08L99k97l07j89k67J58P45L27o71o56J53M20K07J71Ln57n64L15Q11
1913D31J88m71m09j57L3M09N41p3p43m15L11M70K07K7k88n57k02O11O51r3n80
1934a09l63L7K70M54K63l40o45j67M47N08J43k56m54k91K20N84L19k84n43k62
1954d69K03M71L28j14m61l87P1M77M04o1n00m10O3M04L61R4l43n60j49N07N46
1975D75o1m18k89j40R4M91M22l06p07j61M45L66R0m0l47m85R2O81L40l53l80q0
1997b71m5J75N43J94o20n63K76M98J17k9l7l80l89L66P00%n39k13M9K1K20M08
2019D81r1o54k28M50L37p6o8j14l82q2N45L93l36m48J4J18K2K49K86l28n95N1
2041d56N78J90k30j19q7j96P4M85J82l87l49R1J67J32J83K7m07l06K82M33Qk08
$$ plain form
2063 87 17 -108 -264 -50 391 383 -76 -297 -105 82 157 235 161 -143 -270 -34 232 192 43 -83 -191 -130 86
2086 86 214 58 -158 -176 -80 18 103 101 -51 -212 -183 26 159 90 -102 -199 -72 33 50 56 61 -90 -211 -39 200
2111 200 133 -84 -83 -15 -35 11 189 131 -135 -130 86 109 45 127 109 -149 -176 157 266 -22 -91 76 10 -153 51
2136 51 275 14 -217 -28 107 -68 -66 148 39 -235 -121 121 24 -132 36 53 -181 -144 138 89 -155 -81 102
2159 102 -64 -187 65 177 -66 -137 68 54 -112 0 164 41 -112 17 101 10 0 126 54 -95 16 135
2181 135 41 -26 70 82 -71 -24 108 68 -65 -17 62 -31 -34 94 51 -109 -108 57 43 -46 -40 -14 -91 -86 37 56 -63 -99
2209 -99 -42 -24 -43 26 51 -57 -138 -57 65 69 43 -31 -73 -78 -7 103 137 24 -102 -85 19 98 121 91 -32 -121 -21
2236 -21 142 141 20 13 5 -116 -71 193 231 -73 -179 8 49 -36 78 165 -108 -286 -8 194 5 -102 18 -35
$$ packed form
2063H7p0j25j56K14M41qm59k21J92J87P5P8p4l04j27K36K66m0j49j26j08O1K16
2086H6J28j56k16j8R6R8Q5kj52j61K9K09J33o9j92r7J27J05J7ONj51j21J72K39
2111B00o7k17JO8k0M6J78n8k66NK16K3o4Q2j8k58k7L33J09k88o9J67o6j63K04
2136E1K24k61k31J89J35j75KK14j09k74J14K42r7j56J68J7k34L7K82m9k44P4J83
2159A02j66j23K52J12k43p1K05j4j66J12J64j23j53J29Q4r1j0J26p2j49J11J19
2181A35r4o7R6J2j53M7J32m0j33M8P9r3lJ28m3j60JJ65j4q9OK6p7NJ23J9j19l6
2209i9N7J8j9O9K5j08q1Q1J22Mk6p4m2nP1J10L4j13j26J7J04P9K3l0j23q9J00
2236b1J63jj21pqj21M5K64L8l04j06J87M1q5J14Q7k73j78K78K02j89j07J20n3
$$ plain form
2260 -35 -220 -24 228 42 -242 -81 62 -86 -43 192 29 -290 -115 216 77 -116 63 66 -233 -121 321
2281 321 217 -207 -122 132 -27 -76 263 255 -247 -267 213 232 -74 53 200 -158 -304 183 382 -30 -184 44
2303 44 -45 -176 162 358 -112 -380 -7 152 -84 11 245 -117 -457 -51 324 29 -197 32 -20 -316 -61
2324 -61 374 125 -344 -166 119 -34 -59 241 136 -316 -241 211 214 -41 10 57 -167 -107 253 269 -60 -133 25
2347 25 3 28 212 172 -150 -202 42 157 108 91 -9 -189 -143 120 208 52 -69 -134 -163 -6 184 113 -94 -148
2371 -148 -137 -122 96 244 -16 -302 -176 54 16 20 155 -33 -355 -166 256 174 -97 -27 0 -215 -100 366 268
2394 268 -219 -232 110 71 -32 220 249 -210 -298 164 323 10 -15 103 -134 -225 211 408 -30 -267 -3 67
2416 67 -76 96 281 -82 -381 -72 212 65 -39 49 -141 -327 -22 287 78 -194 -127 -85 -121 49 237 2
$$ packed form
2260c5j85J96K52j86k84J61J43j48M3K35j63l19J75L31j39j93J79Lk99J12M42
2281C21j04m24Q5K54j59m9L39qn02k0M80J9l06J27J47l58j46M87J99m12j54K28
2303D4q9j31L38J96m70k68L73J59k36R5K34l62l40M06L75k95k26K29n2k96K55
2324f1M35k49m69J78K85j53k5L00j05m52P5M52Lk55N1M7k24O0L60J6l29p3J58
2347B5k2K5J84m0l22n2K44J15m9j7j00j80M6K63Q8j56j21o5k9J57J90p1k07n4
2371a48J1J5K18J48k60k86J26K30l8MJ35j88l22J89M22q2k71P0K7k15J15M66r8
2394B68m87j3L42l9j03K52K9m59q8M62J59l13k5J18k37r1M36J97m38k37K64P0
2416F7j43J72J85l63k99L09K84j47j04Q8j90j86L05L09k09k72O7M2l6J70J88k35
$$ plain form
2438 2 -272 -168 36 25 87 147 -99 -320 -48 232 114 -35 36 -69 -210 69 350 122 -159 -51 40 -49 96
2461 96 332 61 -286 -101 226 114 -3 145 21 -293 -104 322 192 -161 -94 38 -141 -107 260 187 -291
2482 -291 -294 64 89 -67 58 79 -242 -286 117 207 -82 -135 -26 -147 -169 166 238 -81 -248 -39 53 5 115 128
2506 128 -103 -195 43 171 76 73 53 -129 -137 170 246 9 -60 28 -30 -49 183 225 -77 -192 53 86 -23 104 154
2531 154 -150 -270 74 219 -55 -113 60 -75 -260 36 279 -53 -294 -44 72 -155 -65 189 -10 -333 -106
2552 -106 220 31 -155 41 34 -222 -99 242 144 -179 -88 109 -23 -54 179 184 -141 -144 137 158 11 39 109 -51
2576 -51 -76 122 167 1 -38 20 -7 -17 101 114 -46 -89 -1 13 20 54 7 -106 -73 49 6 -53 15 -27 -152 -115 84
2603 84 41 -125 -66 21 -95 -114 64 84 -134 -114 100 42 -111 13 132 -51 -157 80 172 -39 -69 101 78 -91
$$ packed form
2438Bk74J04K04j1O2O0k46k21K72K80j18j49P1j05j41K79K81k28k81J08R1q9J45
2461I6K36k71l47J85L27j12j17J48j24l14J89M26j30l53O7J32j79L4L67p3m78
2482b91lL58K5j56J25K1l21m4M03R0k89n3J09j21k2L35P2l19j67K09R2m8J10J3
2506A28k31r2K38J28r5lk0j82qL07P6k37o9Q8n8j9K32M2l02j15K45L3j09J27N0
2531A54l04j20L44J45k74n8J73j35j85K96K43l32k41K50J16k27R0K54j99l23K27
2552a06L26j89j86J96pk56J23L41r8l23R1J97j32l1K33Nl25lK81K1j47K8P0j60
2576e1k5J98M5j66l9N8k7j0J18J3j60m3Q8J4PL4m7j13L3J22m3n9O8m2j25L7J99
2603H4m3j66N9Q7j16j9J78K0k18K0K14n8j53J24J19j83j06K37R2k11l0J70k3j69
$$ plain form
2627 -91 15 184 48 -109 52 140 -26 -37 133 121 -65 -45 104 68 -73 8 81 -20 -93 18 66 -22 -56 -11
2651 -11 -13 -85 -63 16 4 -90 -77 -23 -22 -43 -20 5 -43 -100 -61 39 23 -39 -35 -10 -30 -48 45 82 -10 -81 -2 82 30 2 50
2682 50 41 -56 -23 114 119 -4 -33 24 30 13 75 87 -26 -75 8 97 51 -10 11 -3 -80 -25 108 84 -83 -134 -28 40 -22
2711 -22 -9 35 -80 -190 -52 106 29 -127 -85 -39 -105 -35 137 77 -175 -183 46 89 -23 32 60 -104 -182 87 248
2736 248 33 -109 -12 24 -45 73 241 71 -196 -90 142 128 24 55 36 -116 -80 155 193 -13 -108 -59 -23 -9
2760 -9 112 117 -71 -198 -78 95 84 -8 -73 -89 -111 -52 74 115 -61 -219 -134 66 97 24 -26 -70 -157 -95 153 181
2786 181 -75 -194 -49 36 12 123 188 -85 -280 -10 270 143 -39 19 -27 -175 15 335 206 -195 -178 58
2808 58 64 20 185 142 -229 -277 105 264 45 -75 -24 -128 -179 88 264 7 -271 -142 39 23 28 114 -27 -240
$$ packed form
2627i1J06J69j36j57J61Q8j66j1J70j2j86K0J49l6j41Q1P3j01p3J11M8q8l4M5
2651a1kp2K2P9j2r4J3N4Jk1K3K5m8n7L9J00j6o2MK5k0j8R3L7r2p1P9Q4n2k8M8
2682E0rr7L3J37Nj23k9N7Oj7O2J2j13m9Q3Q9m6o1K1j4p7N5J33k4j67n1J06O8o2
2711b2J3M4j15j10J38J58p7j56M2M6o6P0J72o0k52qK29M3j12N5K8j64p8K69J61
2736B48k15j42R7L6o9J18J68j70k67J06K32j4j04L1j9j52L6K35L8k06r5M9L6J4
2760iJ21Nj88j27J20J73j1r2o5j6k2N9J26M1j76j58Q5K00L1p3n0m4q7O2K48K8
2786A81k56j19J45Q5k4J11O5k73j95K70K80j27j82N8m6j48J90L20j29m01J7K36
2808E8Om4J65m3l71m8L82J59k19j20N1j04n1K67J76k57k78J29J81j6NQ6j41k13
$$ plain form
2832 -240 -161 117 171 -23 -137 -88 -53 -13 112 167 -16 -226 -124 137 189 40 -44 -52 -107 -46 202 269 -31 -261
2856 -261 -67 126 83 84 153 -43 -310 -80 304 228 -87 -88 -18 -150 -66 308 254 -232 -326 43 130 -19 84 125
2880 125 -216 -348 66 311 32 -152 -41 -86 -178 87 309 6 -295 -115 98 28 35 139 -39 -268 -84 217
2902 217 142 -25 -39 -81 -106 69 232 90 -123 -98 -10 14 139 189 -48 -231 -56 131 82 83 79 -126 -256 37
2926 37 284 75 -139 -62 -49 -182 59 321 51 -330 -141 140 -1 -46 184 32 -362 -207 269 191 -159 -59
2948 -59 76 -159 -178 256 270 -204 -266 97 106 -93 104 222 -163 -319 112 290 -15 -101 85 -2 -177 78 305
2971 305 29 -219 -42 106 3 35 149 -15 -203 -63 175 101 -47 -25 -51 -114 1 142 63 -95 -111 -60 -20
2994 -20 86 89 -70 -133 -62 5 16 91 57 -137 -164 43 98 -15 -5 41 -98 -147 108 212 -28 -143 26 49 -70
$$ packed form
2832b40P9K78N4j94j14M9L5M0J25N5j83k10J02K61N2j49q4qn5O1K48O7l00k30
2856b61J94J93m3JO9j96k67K30L84p6l15jP0j32Q4L74n4m86r4L69Q7j49J03M1
2880A25l41j32M14K45k79j84J11m5r2K65K22l03l01J80K13p0PJ04j78k29J84L01
2902B17p5j67j4m2k5J75J63j42k13K5Q8K4J25N0k37j83J75J87m9Jmk05j30K93
2926C7K47k09k14P7J3j33K41K62k70l81J89K81j41m5K30j52l94J55M76p8l50J00
2948e9J35k35j9M34J4m74o2L63Rj99J97J18l85j56M31J78l05q6J86q7j75K55K27
2971C05k76k48J77J48j03L2J14j64j88J40K38p4j48K2k6o3J15J41p9j58j6N1M0
2994b0J06Lj59o3P1O7J1P5l4j94k7K07N5j13J0M6j39m9K55J04k40j15J69K3j19
$$ plain form
3019 -70 69 202 -15 -203 2 177 10 -52 117 40 -184 -53 220 74 -140 -24 94 -70 -78 136 81 -165
3041 -165 -115 101 31 -92 18 66 -126 -130 90 92 -93 -84 23 -37 -78 51 71 -54 -77 25 30 -20 35 48 -48 -55 63
3068 63 61 8 20 43 -35 -15 94 71 -35 9 62 -25 -44 92 91 -56 -53 75 17 -67 22 91 -61 -92 47 66 -69 -32
3096 -32 65 -23 -115 13 89 -53 -90 43 20 -88 -43 76 -23 -110 -2 57 -39 -69 49 43 -79 -39 57 19 -27 22 33
3123 33 -30 -9 63 42 -5 27 39 2 -1 56 37 -6 16 44 -3 18 68 14 -52 15 51 -24 -27 41 19 -78 -22 78 15 -86
3153 -86 4 37 -56 -65 53 12 -108 -42 63 -25 -109 23 82 -82 -102 62 62 -91 -41 79 -1 -107 34 100 -31 -75
3179 -75 62 62 -55 -18 99 37 -78 14 100 6 -29 64 78 -26 -11 70 39 -21 11 56 4 -36 28 39 -9 -18 3 10 -27
3208 -27 -6 10 -20 -33 -14 -21 -26 -13 -3 -27 -43 -20 -23 -18 2 -17 -34 -22 6 -10 -17 8 5 -38 -31 62 46 -10 -8 25 5 2 58 59 -8
$$ packed form
3019g0J39J33k17j88K05J75j67o2J69p7k24J31K73j46k14J16J18j64qK14n5k46
3041a65N0K16p0j23J10M8j92mK20Kj85RJ07o0m1J29K0j25k3J02Nn0N5J3r6pJ18
3068F3kn3J2K3p8K0J09k3j06M4N3q7j9J36jj47LJ28n8q4Q9O9j52l1J39J9j35L7
3096c2R7q8r2J28P6j42l7J33k3j08M5J19r9q7J08N9r6l0J18oj22M0R6l8m6M9J1
3123C3o3K1P2k1m7L2J2l7lN7j9m3K2K8m7K1N0n4o6O7L6p5lO8k2r7N6J00o3j01
3153h6R0L3r3rJ18m1j20O6J05q8q4J32N9j64k0J64%j53N0J20q0j06J41O6j31m4
3179g5J37%j17L7J17o2j15R2Q6r4l5R3J4j04J5Q1l1o0L2M5n2m0O4J1m8rK1Pl7
3208b7K1J6l0j3J9pnJ3J0k4j6K3lNK0j9j7J2K8j6pK5lm3PR3j6n6KL3k0lN6Jo7
$$ plain form
3243 -8 -33 36 48 17 41 55 -6 -37 20 82 36 -28 -3 -20 -11 24 47 -6 -53 -49 -1 21 28 -6 -42 -74 -53 17 38 -2 -79 -92
3275 -92 -30 11 16 6 -32 -73 -76 0 78 26 -58 -61 -33 -2 54 88 12 -79 -50 59 75 45 30 -19 -68 -6 109 130 11 -48
3305 -48 -33 3 46 105 86 -67 -113 -5 83 67 33 -25 -95 -96 13 115 61 -67 -116 -75 -6 63 56 -44 -147 -135 14
3332 14 77 50 -26 -108 -126 -45 68 91 -2 -116 -118 -44 84 118 21 -65 -107 -31 74 133 79 -69 -110 -36 75 133 90 -5
3360 -5 -122 -81 83 161 89 -32 -85 -67 23 123 137 0 -140 -94 22 94 89 27 -102 -158 -52 107 120 -17 -118
3385 -118 -122 -64 37 127 50 -113 -177 -73 60 100 49 -53 -143 -109 46 159 70 -65 -116 -77 29 108 134 3 -117
3410 -117 -104 53 141 124 10 -93 -110 -21 133 163 25 -109 -110 -2 119 124 56 -79 -139 -51 92 141 49 -92 -140
3435 -140 -87 29 120 67 -81 -174 -106 16 89 62 -45 -139 -131 -22 88 92 -24 -135 -129 -19 95 97 7 -90 -112 -20 86
$$ packed form
3243hk5O9J2l1K4J4o1l1N7O2m6o4K5j7RL5K3n3m7MM8K2Pl4l6l2K1P0K1m0p7j3
3275i2O2M1Nj0l8m1lP6P8n2q4lK8L1N6L4p6r1K9J09J6l0j5m9m9O2J15K1j19n9
3305d8J5L6M3N9j9j53m6J08Q8j6l4n8p0jJ09J02n4j28m9M1O9O9pj00j03J2J49
3332A4O3k7p6q2j8Q1J13K3r3j14kP4J28L4r7q6m2P6J05N9n4j48m1P4J11N8m3r5
3360ej17M1J64P8p2j21n3J8R0J00J4j37j40M6J16P2no2j29n6J06J59J3j37j01
3385a18mN8J01R0p7j63o4J04J33M0n1j02r0L4J55J13q9j35n1L9J06P9K6j31j20
3410a17J3J57Q8j7j14j03j7Q9J54L0j38j34jJ08J21No8j35o0Q8J43M9r2j41m8
3435a40N3J16R1n3j48r3O8J22P3k7j07r4QJ09J10Mj16j11OJ10J14Kr0r7k2R2J06
$$ plain form
3462 86 116 30 -67 -92 -26 90 134 80 -40 -97 -17 97 127 56 -21 -71 -60 55 134 96 -43 -95 -50 20 91 79 -9 -124
3490 -124 -98 16 81 60 -16 -89 -111 -35 74 79 -29 -75 -93 -49 6 83 34 -82 -120 -42 45 47 13 -23 -86 -89 21 78 33
3519 33 -33 -38 -40 -8 71 89 8 -69 -29 42 57 43 44 -6 -64 0 91 61 7 -21 -15 -17 25 65 32 -37 -56 -6 19 27 11 -14 -67
3552 -67 -53 10 10 -3 -39 -43 -55 -26 1 6 -27 -54 -47 -22 10 12 -11 -32 -29 -26 -6 25 13 -11 -33 -6 14 21 33 19 -13 -18 16 29 22
3587 22 24 36 3 -22 17 50 26 -1 5 1 -17 18 57 24 -28 -31 -5 -15 2 32 -3 -62 -44 10 -1 -8 -4 -14 -62 -46 14 24 -30
3620 -30 -44 -29 -53 -38 38 33 -53 -61 -8 15 3 32 19 -64 -49 38 45 4 -18 0 -35 -29 56 83 -13 -66 -2 14 15 47 61 -52
3652 -52 -91 11 73 32 8 -1 -52 -74 26 107 5 -78 -43 -29 -17 39 51 -34 -121 -74 38 35 -3 4 -38 -104 -33 85 50
3681 50 -54 -57 -36 -36 14 70 28 -96 -85 9 32 26 43 -6 -81 -41 61 84 -2 -30 -27 -25 17 89 53 -63 -69 3 22 29 42 -4
$$ packed form
3462H6L0q6r7k5O6J16M4n4j20n7Q0J14L0p1p7n0J1J15P9l8j39n2M5P0P1j2q8j15
3490a24K6J14O5k1p6p3k2P6J09Nj08m6j8M4N5P7m9j16l8P8Q7Kl4l6o3lJ10N7m5
3519C3o6nkL2P9J8q1p7M0P1J5j4Jn0n8O4R1l0n4k8OkM2M0l3o9j9N0K5Qj6k5n3
3552f7J4O3%j3l6mj2K9K7Nl3k7PK5L2Kk3k1LLK0L1j2k4k2K7K0PJ2j4l2nL4J3p
3587B2KJ2l3k5L9L3k4k7Omj8L5L9l3n2lK6j0J7L0l5n9J8N4j1pMj0m8J6O0J0n4
3620c0j4J5k4J5P6nq6qN3K3j2K9j3q3J5Q7Pm1k2J8l5OQ5K7r6n3O4J6JL2J4j13
3652e2l9J02O2m1k4rn1k2J00Q1j02q3L5J4J2N6J2q5q7M7J12ll8Pm2o6P1J18l5
3681E0j04lK1%N0N6m2j24J1R4K3oJ7m9p5M0J02K3q6k8LKM2P2l6j16oP2J9PJ3m6
$$ plain form
3713 -4 -85 -78 37 75 19 -14 -44 -98 -27 65 64 -47 -92 -43 -27 23 63 24 -96 -98 16 43 16 9 -16 -96 -54 70 87 -14
3743 -14 -60 -22 -26 -24 56 87 -49 -112 5 50 9 12 41 -55 -93 37 112 12 -49 -6 -6 -28 35 102 0 -103 -35 59 25
3772 25 4 33 -28 -93 -13 100 45 -64 -37 -3 -33 -2 66 24 -80 -66 21 29 -1 17 -12 -84 -51 56 58 -5 -44 -16 -29
3801 -29 -2 61 38 -49 -61 -4 35 19 20 -14 -61 -36 45 46 4 -29 -26 -37 6 55 27 -55 -56 -11 4 20 39 -7 -64 -41 39 39 -23
3834 -23 -20 -21 -45 -8 56 29 -50 -59 -6 -6 2 40 15 -69 -54 31 47 5 -7 -2 -31 -24 56 55 -7 -52 -10 11 11 44 33 -55 -55 18 59
3869 59 23 -10 -22 -41 -19 46 58 -15 -48 -29 -19 28 51 21 -68 -66 1 30 30 3 -17 -75 -64 53 69 -16 -46 -27 -18 -7 59
3900 59 59 -40 -91 -3 38 22 30 24 -49 -70 49 104 31 -29 -15 -22 -19 37 84 1 -90 -32 38 41 23 23 -35 -82 -19 82 50 -27 -45
3933 -45 -32 -25 18 65 21 -80 -77 -16 34 30 13 -27 -78 -65 23 66 12 -40 -67 -49 0 48 26 -22 -61 -44 0 53 64 -4 -66
$$ packed form
3713dq1PJ15L8n6l3l0n4P1R2jj11m5M9J6N0M0l9j20kJ14K7k7pk5q0M2J24J7j01
3743a4m6L8mKQ0L1j36o3J17M5m1LK9r6l8J30P5j00o1M3%k2O3O7j02j03O8R4l4
3772B5k1K9o1o5Q0J13n5j09K7L4l0L1O8m2j04J4Q7Ql0J8k9p2L3J07Ko3l9K8j3
3801b9K7O3k3q7j2N7L9j6Jl4m7K5Q1Jm2l3Lj1M3M9k8q2jM5J5J6J9m6n7K3Q0%o2
3834b3Ljk4L7O4k7p9rN3%QL8k5q4J5Q5J6m2j2Nk9PQ0jo2m5M2K1%L3j1q8%P3M1
3869E9l6l3j2j9K2O5J2p3l3J9J0M7K3l0q9KO7K9%k7k0n8J1J17J6q5l0J9RJ1O6
3900E9%r9n1Q8M1j6Qop3k1J19N5p3o0J4pLN6M7q3r1N8P0Lj8%n8m7O3J01l2p7j8
3933d5J3PM3M7m4j01LO1N0mj7m0n1J3Q8M3n4n2k7J8M9M8k2m8l9J7M4N3J1o8o2
$$ plain form
3964 -66 -44 45 68 37 31 -17 -55 -1 71 58 9 -44 -11 -9 37 92 40 -59 -55 14 35 39 32 -2 -66 -49 33 74 2 -43 -47 -40 -9 42
3998 42 44 -26 -84 -36 12 14 15 3 -43 -78 -16 54 29 -28 -36 -19 -26 11 48 8 -36 -34 -2 44 42 15 -10 -16 -7 20 46 38 3 -5 -5 16
4034 16 47 28 5 -4 -4 8 24 22 -14 -21 -11 -5 6 28 19 -30 -50 -13 16 7 -7 -6 -23 -48 -29 19 3 -44 -29 -12 -23 -9 17 2
4068 2 -18 -43 -1 12 4 11 15 -8 -26 -6 30 21 6 -2 5 -7 11 60 51 5 -19 9 32 31 31 30 15 -23 2 42 42 6 -13 -21 -4 8 39
4105 39 27 -13 -59 -33 15 24 7 -9 -45 -65 -29 36 30 -39 -68 -34 -6 -3 27 9 -57 -83 -10 50 30 -7 -25 -32 -32 24 74 38 -34
4138 -34 -58 -4 44 52 62 9 -56 -41 45 96 46 -15 -26 -27 3 79 91 17 -76 -71 23 64 50 22 -53 -73 -35 57 75 11 -74 -96
4170 -96 -37 33 61 23 -52 -118 -62 49 73 15 -46 -76 -58 9 75 73 -25 -90 -56 36 73 65 11 -62 -82 5 99 93 9 -63 -44
4201 -44 17 86 103 50 -67 -91 -1 115 95 35 -28 -77 -41 49 132 48 -81 -92 -33 47 77 57 -37 -118 -93 39 101 52
$$ packed form
3964f6K2Q9K3l1om8l8N4P2j3m9n3L3KM6N5n2r9MO9K1Mpl4o4J7Q2M1p2m5mPL1N1
3998D2Kp0n8M8M8KJj2m6l5O2P0k5n7qJ7pL7L7m0m4KL2M6kk7k5oRK7K6ql5q%K1
4034A6L1j9k3r%J2J6kl6pJ0OJ1K2rm9k0L7K9rj4Jj7k5J9M8j6m7J5J7j1J4K6j5
4068Bk0k5M2J3qPMk3j8K0L6rj5qPj2J8M9rm6k4K8K3j%jj5l8K5M0%l6j9qJ7J2L1
4105C9j2m0m6K6M8Rj7j6l6k0L6O5oo9k9L4K8LL0j8o6k6P3O0k0l7j8p%N6N0l6p2
4138c4k4N4M8QJ0n3o5J5Q6N1n0o1j1jL0P6J2p4r3NR4M1j4k8p5k0L8R2J8o4q5k2
4170i6N9P0K8l8p5o6N6J11K4n8o1l0J8O7O6kr8o5L4R2L7qn4p3k0Q7R4oq4p2J9
4201d4O1O9J7n3j17k4R0J16k0o0o3m9L6R0Q3q4j29j1N9Q0L0k0r4q1K5J32O2m9
$$ plain form
4229 52 -46 -94 -85 -20 76 86 -35 -130 -97 7 58 63 14 -70 -114 -45 87 96 -1 -83 -74 -11 59 97 62 -45 -97 -20 86 108
4259 108 51 -11 -70 -49 49 136 86 -29 -86 -29 43 82 88 2 -84 -76 35 99 49 -28 -72 -74 -13 72 91 -7 -107 -106 -12 68
4289 68 58 4 -78 -117 -45 41 88 15 -70 -93 -55 39 80 48 -36 -88 -49 53 108 53 -34 -50 -34 13 77 73 1 -83 -54 40
4319 40 84 51 13 -26 -61 -4 88 81 -12 -69 -36 17 40 49 39 -55 -88 -9 74 39 -23 -36 -56 -56 13 78 16 -79 -84 -13 16 21 23
4352 23 -16 -83 -62 30 67 16 -36 -38 -28 0 46 55 -12 -55 -18 40 43 45 28 -15 -27 2 63 55 2 -26 -7 22 36 42 31 -13 -31
4385 -31 7 37 51 -13 -24 -21 -9 11 21 22 -23 -54 -11 33 9 -16 -20 -35 -36 -8 33 7 -45 -43 2 -5 -10 13 -11 -61 -43 30 41 -16
4419 -16 -31 -1 -7 -5 36 38 -14 -40 15 40 2 9 22 1 -27 7 58 15 -29 -10 18 5 13 25 -3 -34 -11 30 15 -1 -11 -8 -25
4452 -25 -5 22 9 -22 -20 -10 6 -1 -2 -12 -28 -11 8 8 -2 1 -28 -30 -2 18 0 -28 -10 -11 -9 18 33 -3 -24 -6 14 6 4 12 2 -28
$$ packed form
4229E2r8m8RO5R6J0j21r5L3J04N1Nm9q4m4O9J32Rr7q2RO3P0L8l5j07n2P7J06K2
4259A08n7o2n9K1R8Q7n0j15n7N7P2L9Oq6q6QJ11O4n0p7m4kO1Q5J9r8j00JR4Q0
4289F8j0n4q2l9P2Q6M7p3q5k3L8R4M1l2q4n2L9J02N5n5q7j6J6M7O4mp2q4K9R4
4319D0M4l3l8l9l5N7R2pr3n7L3N3K3Rj0r4l3P9Q3l5o2j3k0%O9O5o2r5nP1K9NK
4352B3l9o7K1R2L7n1n2kJ0K8M6Ro7m3L7N8LKj7m3j2K9O1qn3k8J9K9J4Oj1m4j8
4385c1L8L0J4o4j1LJ2K0J0Jm5l1M3M4k4k5mj5jK8M1k6n2KM5pnK3k4n0J8P3J1n7
4419a6j5L0oKM1Kn2k6N5K5l8PJ3k1k8L4N1m3m4J9K8j3QJ2k8l1K3M1j5j6j0Lj7
4452b5K0K7j3l1KJ0J6pjj0j6J7J9%j0Lk9kK8K0j8k8J8jKK7J5l6k1J8K0qkQj0l0
$$ plain form
4488 -28 -1 49 28 -4 -6 6 -1 14 44 26 -23 -11 38 24 -4 19 23 -15 -17 15 29 -4 -27 -6 -12 -27 7 17 -23 -30 1 11 -5
4521 -5 -10 2 -13 -25 -8 15 -7 -16 -18 -5 -13 -5 5 -20 -20 9 -8 5 1 13 -3 -13 0 3 9 9 9 -11 7 12 19 0 2 21 4 -11 8 19
4559 19 -14 -12 28 6 -17 -1 21 -6 -12 8 21 -15 -26 12 13 -17 -5 9 1 -16 15 12 -18 -31 -4 2 -3 -3 -2 -6 -14 11 23 -10 -21 -11
4595 -11 -6 5 9 19 -11 -29 -4 22 27 7 -4 -32 -23 13 25 19 -8 -18 -24 3 20 20 -9 -26 -21 0 25 32 0 -40 -36 18 30 16 -6
4630 -6 -15 -36 -28 37 46 -5 -52 -27 -6 12 36 27 -33 -59 -16 26 38 4 -10 -52 -41 17 65 17 -43 -47 -20 4 40 64 -16 -70 -43
4663 -43 27 53 33 7 -44 -51 -6 59 58 -7 -62 -46 -12 46 59 25 -61 -62 -17 51 63 29 -35 -81 -28 56 66 21 -35 -63 -36 16
4695 16 73 49 -34 -74 -36 19 68 57 -8 -74 -65 31 79 46 -8 -59 -72 -13 76 78 -18 -70 -68 -2 47 73 19 -72 -93 -7 77 55
4727 55 10 -40 -86 -56 54 91 34 -49 -77 -39 32 76 53 -26 -94 -55 32 90 66 -4 -68 -57 12 79 79 -9 -70 -52 5 68
$$ packed form
4488b8K7N0k1l2kJ2pJ5L0j8m9J2M9j4k8K3Ml8kL2J4l3k3K1oj5L4J0m0pL1J0j6
4521enJ2j5j2J7K3k2rkJ3qQJ0k5%K9j7J3mJ2j6j0J3LO%%k0J8NPj9KJ9j7j5J9J1
4559A9l3KM0k2k3J6K2k7oK0J3l6j1L8Jl0J2J4qj7L1ll0j3K7On%JmqK5J2l3j1J0
4595a1NJ1MJ0l0j8K5K6Nk0j1k8RL6J2ok7j0oK7J7%k9j7NK1K5Pl2m0MN4J2j4k2
4630frk1QO5Rn1m7K5K1J8K4ro0k6M3M2J2l4j4m2J1N8M8m8o0mK7K4L6K4q0n4K7
4663d3P0K6k0k6n1pM5O5jo5n5J6L4N8J3l4q6jM5O8J2l4o4m6N3Q4J0m5n6k8K7N2
4695A6N7k4q3m0L8N5M9j1o5o6RR6M8l3n4n1j3N9Q9Kr6n2KO6M9K6n4r1k1Q6Q4k2
4727E5m5n0m6L0J10L7n7q3k8L8P1M4k3p9o8L9Q7N8k4p0o4J1O9O7%q8o1J8N7O3
$$ plain form
4757 68 91 14 -65 -84 -2 80 89 16 -60 -85 -16 69 86 26 -52 -88 -46 57 87 40 -46 -82 -54 34 88 36 -47 -86 -60 23
4787 23 70 56 -10 -100 -90 7 76 66 -12 -72 -61 2 64 90 19 -77 -68 5 59 71 26 -53 -77 -22 77 92 28 -53 -64 -36 43
4818 43 88 48 -38 -75 -27 45 64 45 -29 -77 -57 18 81 53 -20 -68 -57 4 59 54 -16 -61 -66 -2 52 61 -4 -59 -65 -20 46 64
4850 64 18 -60 -72 -21 48 58 14 -34 -52 -34 42 72 37 -29 -44 -19 34 69 49 2 -42 -29 39 86 41 1 -26 -20 4 50 54
4881 54 -3 -50 -29 12 38 35 4 -36 -56 -15 37 26 -9 -43 -30 -25 17 26 12 -34 -62 -21 10 17 0 -25 -44 -40 5 26 9 -22 -39
4914 -39 -9 1 20 25 2 -29 -18 13 33 18 2 -10 3 7 29 41 16 -16 -4 25 15 22 29 -6 -10 -8 26 24 9 1 -14 -1 3 18 -8
4949 -8 -18 -35 -13 -7 2 -8 -20 -19 -25 -13 -4 -12 -9 -17 1 -7 -2 -3 -7 -5 -4 -5 -6 13 6 10 15 3 12 20 8 11 11 15 4 1 8 9 23 3 4 9 17 13 13 15 7 -1
4997 -1 2 13 21 -4 -1 0 -17 -6 12 5 -24 -17 -3 -10 -15 1 -13 -22 -27 -5 0 -15 -15 -19 -14 -23 -3 4 -17 -38 -22 7 -7 8 11 4 -20 -6 9 15
$$ packed form
4757F8K3p7p9j9Q2Q2Rp3p6k5O9Q5J7o0p8l6M2J03L0m7q6l6K8Q8N4n2q3l9K6Q3
4787B3M7j4o6r0J0R7O9j0p8o0J1O3O2K6p1r6RP3N4J2m5p9k4N5R9J5o4q1j1K8P9
4818D3M5m0q6l7M8P2J9j9p4m8K0P5O3k8p3m8J1O1N5np0m5nO4N4Ro5n5oM5O6J8
4850F4m6p8j2N1O9J0m4m8j8J8P6L0l5o6j5K5N3L5k0m7m4J3O8M7m5m0k7OK4M6M
4881E4n7m7K1M1K6ll1m0k0M1N2j1l5l4J3NM2Rj4m6k8M1L1Pj7k5j9MM5K1j7l1j7
4914c9L0J0J9Nk3l1J1L1K0j5j6j2J3MK2J2k5l2J2K9j0PPl5mKL4kj5qj5J3MJ5k6
4949hj0j7K2ORj0j2JoJ2RqLqJ8qNjmKJjjJ9pMNj2RQj2L%Mj1lPJJ4k0JNQm%Kqq
4997aLJ1Qk5LJj7J1J8pk9PJ4pnJ6j4rnK2Nj5%mNrK0Pk1k1J6K9j4J5Lpk4J4J5O
$$ plain form
5037 15 -2 -1 10 1 8 30 36 -15 -18 10 17 22 27 -2 -7 -13 21 35 13 2 -10 2 -8 9 11 5 -24 -8 14 22 0 -5 -14 -26 -2 2 -6 -10 -32
5076 -32 -18 -17 -2 -5 -14 -28 -23 -11 16 1 -7 -11 -13 -10 20 22 10 -1 -12 10 24 32 20 8 -1 8 30 40 20 4 -4 17 15 23 17 12 -14 -3 8
5115 8 25 7 -17 -12 -5 -2 10 12 -12 -19 -14 2 9 -4 -16 -31 -25 -9 10 6 -23 -43 -26 -4 -1 6 -13 -32 -33 1 30 12 -1 -14 -13 -3 15
5152 15 24 6 -20 -12 12 29 22 7 -26 -15 20 35 31 -3 -21 -8 3 34 32 8 -17 -23 1 43 25 17 -20 -19 0 19 14 3 -22 -32 -17
5187 -17 10 21 1 -33 -42 -19 7 31 18 -22 -36 -24 14 31 11 -19 -44 -39 1 26 7 -22 -41 -23 14 45 47 -3 -35 -22 18 44
5219 44 35 14 -28 -33 22 46 38 16 -28 -37 0 34 47 19 -23 -41 -10 22 26 12 -22 -48 -27 27 29 12 -22 -56 -38 6 46 14 -46
5252 -46 -57 -37 3 30 32 -13 -59 -37 14 31 38 -12 -39 -47 -4 51 49 7 -32 -42 -4 46 57 17 -35 -41 -2 30 36 17 -25 -46 -9
5285 -9 44 57 29 -14 -32 -17 28 62 33 -18 -52 -17 16 40 36 -17 -50 -53 13 38 17 -11 -43 -40 -14 31 42 -3 -43 -52 4 31 30
$$ packed form
5037A5j7JJ1rPK2On1lK8PNNk9noL4J4k2j1j2J2j0J7Kok9J6K2Qk2nrj2K4Mqmk2
5076c2J4JJ5lrj4NJ2K7j5qmkLL0Kj2j1j1K2J4Qj2j2rRK2J0k0j6qK1kQonk6J1J1
5115HJ7j8k4NPLJ2Kk4pNJ6Pj3j2j5OJ6J9mk9k0J7K2LPj9j9jL4K9j8j3j3JJ0J8
5152A5Rj8k6QK4J7pj5l3J1L5J5ml4j8J3J1L1kk4k5oK4M2j8ql7JJ9J9nj1k5j0J5
5187a7K7J1k0l4rK3K6K4j3m0j4J2L8J7k0l0k5NM0K5j9k9j9J8L7L1Kn0l2J3M0K6
5219D4rk1m2nN5K4qk2m4rL7L4J3k8m2j8L1L2Mj4l4k6K1N4Kj7l4l4J8M4M0l2o0
5252d6j1K0M0K7Km5m6K2N1J7Pn0k7qM3N5km2l9j0L8N0J1m0n2oL9L2Oj9m2k1L7
5285iN3J3k8m3j8J5M5L4k9n1l4L5L3K4mn3l3lO6K5k1k8l2LK6M5J1m5m0rN6K7j
$$ plain form
5318 30 20 -34 -52 -14 28 50 8 -23 -40 -25 19 57 13 -31 -39 -16 29 49 36 -3 -36 -34 23 49 38 1 -34 -18 29 47 35
5349 35 5 -34 -36 4 43 51 0 -36 -41 -6 32 38 15 -33 -42 -5 26 33 0 -24 -34 -25 13 43 15 -30 -42 -14 -12 25 11 -14 -48 -39 11
5384 11 28 25 8 -26 -33 5 33 31 0 -25 -19 4 31 32 17 -18 -21 6 31 35 13 -3 -27 -8 33 26 6 -8 -21 -15 12 36 15 -10 -26
5419 -26 -8 -2 4 16 3 -26 -23 3 5 5 -2 -11 -24 -14 24 13 -10 -22 -10 -10 -1 12 17 -4 -24 -3 7 0 4 9 -13 -18 -1 12 -1 -8 13 3
5457 3 -3 6 24 14 -8 -3 4 10 12 15 2 1 -5 16 16 1 8 3 4 13 18 23 4 1 11 3 10 7 12 -6 -3 7 1 4 16 1 -6 -13 1 2 4 11 3 -8 -15 1
5503 1 1 -5 -2 -5 -19 -10 4 18 -5 -15 -12 -10 -20 8 15 -15 -23 1 12 -1 2 4 -15 -10 4 26 12 -2 -11 -4 13 17 24 2 -14 -22 23 21 -1 4
5543 4 -16 -13 7 22 26 9 -17 -13 -9 9 23 3 -11 -27 -15 6 16 14 -24 -24 -11 1 20 20 -3 -32 -29 4 23 7 -5 -21 -12 -7 10 15
5579 15 0 -27 -22 11 18 14 3 -4 -33 -2 24 26 5 -12 -9 3 17 37 18 -3 -35 -6 22 15 0 7 -16 -14 13 37 3 -25 -19 -12 -8 18
$$ packed form
5318C0j0n4j8L8M2K2m2l1j7J5M4L8m4m4qK3M5K0j3l9l3KN7K6j1l7l5J6M7J8j2
5349C5l0l9kM0L9Qn1l6nL5L8Ok3m8rL7L1Pl3k4j0RL8L0k8m5j2K8KL7j4k5l4RN0
5384A1J7lj7l4pL8K8kl1k5OK3K7Jj5l5lK7K5Mk2j6k4J9M1pk0j4j3OK7K4k1k5j6
5419b6J8OOJ2j3k9LK6K%prj3J0L8j1k3j2J2%RJ3Nk1k0K1J0pMNk2nJ7J3j3pK1j0
5457CoRJ8j0k2NPOKLj3joK1%j5PnJRNNj9lJ0qPlNj8LJ0oLJ2j5ppJ4JKPqj1pJ6
5503A%oLlj4RJ4J4k3j0LKj0K8Pl0qK4J1j3LKj9NJ4K2j4j4rPJ7MPk2j6qM5kk2N
5543Dk0LK0J5Mj7k6MMJ8J4k0j4j6J2K1J0kl8%J3J2J9%k3k9LL3J9j6j2j6RNJ7N
5579A5j5k7NL3Pmj1pk9L1K6Kk1j7LJ2J4K0j9k1l2K9K8pj5Pk3KK7K4l4k8OPMK6
$$ plain form
5615 18 16 -13 -35 -22 -3 9 2 -18 -24 -25 -20 7 18 -4 -32 -28 -5 10 -4 -6 -16 -32 -20 0 18 -5 -20 -11 3 4 19 13 -13 -24 -5
5650 -5 27 26 11 -15 0 5 3 30 25 6 -13 6 26 28 17 10 -2 -8 16 27 11 -14 -15 -10 2 11 9 4 -18 -26 -2 6 1 -15 -29 -16 -19 -8 11
5689 11 -19 -27 -15 -1 15 0 -7 -20 -14 -5 11 9 -10 -26 -3 3 8 13 13 -3 -16 9 33 12 3 -2 -9 13 13 32 4 -2 0 6 18 7 9 -5 -21
5728 -21 -2 12 24 -9 -27 -9 -7 0 -2 1 -16 -41 -11 1 4 -11 -21 -18 -14 -10 22 6 -16 -16 -12 -1 16 2 -13 -11 -20 7 13 8 -1 -12 -8 16
5766 16 25 24 9 0 -14 24 30 34 3 -9 -7 11 31 19 16 -10 -7 5 19 19 -10 -13 -15 5 26 23 -6 -22 -22 -14 8 2 3 -17 -41 -26 3 14
5804 14 -1 -27 -20 -30 -5 4 17 -25 -35 -16 6 16 17 2 -22 -14 21 24 5 -1 -15 -10 5 25 29 13 -20 -27 8 29 22 11 -3 -7 3 28
5840 28 29 16 -9 -27 0 15 21 18 -19 -23 -13 7 30 10 -7 -21 -21 -3 7 11 -8 -36 -21 -2 3 24 -13 -25 -33 -14 9 21 -5 -16
5874 -16 -23 -7 10 14 2 -19 -26 -5 18 26 10 -8 -6 9 17 29 10 3 -14 -1 3 26 17 1 -5 -16 2 8 14 -12 -5 -8 6 15 8 -8 -11 -21 4
$$ packed form
5615A8kk9k2J3J9J2pk0ojNK7J1k2k8MK3J5j4kj0j6J2K0J8k3j5RJ4JJ5ok6j1J9
5650eL2jj5k6J5NkK7nj9j9J9K0Kj1pj2oK4J1j6k5jNJ2Rknk2qK4Qnj6j4J3lJ1J9
5689A1l0qJ2J4J6j5pj3ORJ6kj9j6K3ONN%j6j3K5K4k1rnpK2%J9k8oKOJ2j1Kj4j6
5728b1J9J4J2l3j8J8KPkLj7k5L0J2Lj5j0LMML2j6k2%MJ1J7j4j5KrK7Onrj1MK4
5766A6Rjj5rj4L8OMl1j2KJ8K0j2lk6LJ2J4%k9lkK0K1lk9j6%QK2oJk0k4J5K9J1
5804A4j5k6Pj0K5RJ3m2j0J9K2J0Jj5k4QL5Lj9oj4NJ5K0Mj6l3pL5K1pj1j4mJ0K5
5840B8Jj3k5j8K7J5Oll7mJ0K0K3k0j7j4%J8J0Mj9k8J5J9NK1l7j2qJ9K3J2k6j1
5874a6pJ6J7Mj2k1pK1K3Qj6j8KJ5QJ2j9pj7J3MK3rj6oj1J8OOk6PlJ4Rpj6lj0K5
$$ plain form
5913 4 7 1 -4 -17 -6 -9 -6 0 -3 -26 -18 -14 -6 2 2 -3 -10 -18 -1 7 -1 -3 0 -5 -9 1 16 6 -16 5 7 9 -4 4 3 -3 3 27 18 6 -6 3 13 0 10
5958 10 13 4 3 12 14 -9 -1 7 -7 -6 -3 5 -6 -4 9 -9 -17 -13 10 10 -8 -13 -7 -10 -10 -5 -6 -15 -13 -9 -12 0 -6 9 -7 -5 -4 17 15 8 17 -1 7 12 20 14 3
6005 3 1 11 16 19 20 10 -1 5 14 22 14 6 -4 -9 -6 10 9 4 -13 -6 5 9 21 3 -1 -16 5 -1 8 8 -6 -20 -15 -1 7 -1 6 -8 -20 -3 -4 16 -3
6048 -3 -14 -24 -1 7 24 1 -19 -2 12 22 15 9 -3 -5 7 20 28 25 8 -8 6 17 30 19 11 -2 4 20 19 14 3 -10 -11 9 20 21 5
6085 5 -13 -15 -1 24 24 2 -15 -9 1 9 14 9 -14 -21 -23 5 11 -2 -10 -21 -11 11 16 2 -7 -7 -15 -2 15 17 0 -8 1 16 31 5 6 -14 -11 9
6125 9 32 20 4 5 -3 6 29 24 4 -3 1 13 12 32 22 -13 -17 -11 17 11 12 0 -21 -22 4 13 20 -8 -28 -17 -6 17 6 -11 -27 -18 -17 11 12
6164 12 -6 -22 -13 2 13 6 0 -7 -17 -6 8 1 -1 -2 -9 -7 11 20 5 -13 4 -2 14 18 15 -2 -10 -6 3 19 13 -1 -12 5 23 4 15 -2 -7
6203 -7 -17 -10 19 3 3 -11 -19 -11 -2 -1 -9 -18 -6 -8 -5 -5 3 -7 -15 -17 -5 -1 2 4 -7 -16 2 9 -2 -14 -1 -11 -5 4 2 7 4 4 1 23 2 2 -5 -5 8
$$ packed form
5913DLonj3J1lLOlk3QMQQ%npqJ7QqkLnmJ0J5j0k2K1KKj3QjoOK4rj2j2RJ0j3J0
5958A0LrjRKk3QQj4JLQj1KJ3j8qMK3%j8nOl%NjrKMlJ2oJ5j6KJK1kpRj8QNQoj1
6005CkJ0NLJj0j1ORQqqj0nLJ6jnj7PJ1MJ2j8mj5K1oR%j4j4NJ4QqPj4j2J7jK0j9
6048cj1j0K3QJ7k3k0J7J4J0poj2kJ2J3Qlj7j6J4J1J3j1qj3OJ6jnj1j3jK0J1Jj6
6085Ej8kJ4K5%k2j7OJ0QNnk3pkK8Oj3qj1J0K2Nj4r%qJ3J7Kj7qRJ5J5k6Jk0LK0
6125IK3j2j6JqRK3nk0pMJ2jK0j0l5mOK8oJj2k1jK6RPk8k0J1J1K3j1j7j6RJK8J
6164A2j8j6RJ5J1popj0J1J4pkjpKJ8Rj5j8J7oJ6Mlj7qMRJ6oj4j1J7J8j9J1j7n
6203gj0PK9j6%j4qQRJqrJ2kL%Qj0qkJ2MLKj1rJ8Pj1j2J3j0ORkNl%lK2k1%p%J3
$$ plain form
6248 8 -7 0 0 12 4 -2 -2 2 3 2 2 5 2 1 2 -10 -3 7 11 3 -7 6 11 -5 -3 -6 0 -7 11 8 -5 -12 -14 -1 -1 2 -1 -2 -7 7 9 -8 -16 0 -8 -8 6
6295 6 2 0 -7 4 12 7 6 13 5 -4 -15 17 10 13 8 -6 -5 19 2 14 2 -7 -1 0 12 14 -8 4 -2 -2 3 7 6 -3 2 5 3 5 -3 -15 -16 1 2 9 5 -12 1
6342 1 -5 5 -7 10 -6 -15 -3 3 -5 15 -13 -12 -7 -14 -5 3 -11 0 -4 -11 14 5 5 -6 -4 0 6 15 3 -13 4 1 19 15 12 -4 -2 7 8 10 7 3 -4 14
6386 14 10 15 10 -13 -3 -11 0 -4 8 -9 -10 -2 8 0 -1 -16 -18 -9 -13 -11 -11 -14 -13 0 -12 -7 -7 -6 -25 -28 -7 -3 -4 -1 -7 -4 -5 0 14 6 -12 -11 -8 -6 2 5 9
6433 9 -1 -6 -3 12 -2 -1 -5 -6 -2 7 7 -1 -14 -9 12 24 -8 6 0 -1 -1 1 3 -6 -11 -5 -4 5 -6 -10 -7 -9 -3 -2 8 -15 -11 1 -17 -6 -2 -4 -5 -19 -1
6478 -1 -12 -9 -17 -14 1 4 1 1 -1 -1 -1 8 6 9 4 -9 8 8 11 14 2 -9 1 8 4 3 12 -5 5 3 14 -1 -4 1 -1 -1 6 -4 -6 -11 -10 -5 -8 -14 -4 -4 -17
6525 -17 -9 -22 -7 -15 -19 -7 -9 -11 0 -11 -12 -16 7 -3 2 -4 -14 -2 2 12 14 1 -11 -6 2 19 0 -2 -2 -2 10 14 17 19 13 -1 13 6 5 7 -2 -7 18
6568 18 10 0 8 -3 -9 -4 -6 15 -10 -2 -18 -27 -4 -3 -6 -7 -18 -18 -10 -2 -2 -17 -17 -18 -1 0 -7 4 -17 -14 -5 -7 5 1 -6 -19 -10 1 13 12 -4 -13 -8 9
$$ packed form
6248Hj5P%J2qo%MJj%LljJj2PJ0Mqj0J3Nj6KlOpJ8lj3pkJ3%LljnJ4Kj7qJ6q%J4
6295FmkpJ1QnjPqrj1L2pLnj4JK4j7J2j2rOJJ2Kk2J2o%NMjrNLkKqj2jJ7JPmj7J3
6342AoJ0j2J7j6rJ2OqK0k8JNpRQj4J1mpK5r%j1KMORj2j6J7lJ8mlj6KRJKlmpJ8
6386A4mNnk3J0qJ1mJ2j7jQJ0qjj5kRmK%lJJ3j2N%Jj9lK1MjLoLjNJ4qj8JLKQLM
6433Ij0nLJ5j4JmjMR%qj3NK1J2l2J4oj%KKrnOJRj1mLkOJJ0k3MJ2j8J1Mkjj4J8
6478aj1LqLJ5Ll%k%%RkLnj3J7%LLj2j1J0PmjRj7J0kJ1j5lNk%Pj0knJNloJ0%j3
6525a7Qj3J5qmJ2kkJ1j1jmK3j0Noj0J2MJ0Kj3j2NQJ7j9k%%J2MLKoj4J4pjKrnK5
6568A8qj0Qj1oNkK1k5Qj6rK3Jljj1%QQ%j5%jJ7JpJ1k1LRkJ2mpj3RJ1J2jj6rNJ7
$$ plain form
6612 9 14 7 3 -8 -17 2 22 9 -1 -8 -14 2 7 18 12 -4 -3 6 6 12 -1 -10 -6 -16 7 8 -12 -7 -18 -16 -2 7 -3 -17 -27 -21 -1 2 9 -11 -23
6653 -23 -12 -15 -2 -4 -19 -13 -6 -11 4 8 11 2 -8 -2 8 2 -1 -1 2 13 11 15 -4 -1 -6 13 0 14 18 -9 -4 15 10 14 7 4 -13 -13 6 15 -8 -3 -16
6696 -16 -4 -7 7 -8 2 -14 -16 -9 -2 -6 -16 -16 -22 -20 8 -6 2 -12 -18 0 3 10 2 -3 -17 -14 -1 4 16 -6 -10 -10 8 9 8 11 -11 2 2 13 10 20
6738 20 9 -2 -3 3 16 3 -1 6 2 7 1 -9 -7 -11 3 4 -9 -7 -11 -2 -9 -8 -5 -4 6 -16 -10 -17 -8 1 -6 -8 -8 -2 -8 -1 -2 -1 -1 -15 -2 -14 -2 -3 -1 14
6784 14 0 5 7 -9 6 8 -8 12 11 13 11 3 10 12 5 5 -8 -3 0 6 3 6 5 -7 -5 10 16 2 5 2 -7 -14 2 -2 -8 -9 -18 -23 -13 -5 -9 -22 -19 4 -5 -16
6830 -16 1 -4 -24 -3 -2 3 -4 -3 1 3 8 0 2 -1 -3 -13 1 10 15 12 -2 6 0 12 12 -3 13 0 3 2 15 3 3 -7 4 19 4 2 -1 -8 4 -4 7
6873 7 0 -3 -3 -6 -11 4 -5 -14 -4 -7 -4 5 -9 -9 -16 -9 -25 -9 -7 -4 -8 -5 1 -3 -4 5 -7 -10 7 -14 1 -2 13 -1 -6 0 1 3 -1 1 10 4 -2 0 16 4 -3 4
6921 4 5 14 5 4 4 11 9 10 6 -5 -3 -5 -4 -5 -11 -9 -2 -1 5 -16 4 -9 -11 -16 -6 -14 -8 -10 -2 -9 -16 -4 -5 -1 -7 5 2 5 0 10 2 -8 4 8 -4 -5 14 -1
$$ packed form
6612INpmj1rJ9K0j3j0poJ6NJ1oj6JR%Oj3rMj0K3Jk0Nj1KJ4Rj0j4j0OK0LPk0j2
6653b3J1lJ3kj5OPnJ5MLrj0OJ0ol%LJ1kMj9LnJ9j3J4Mk7NJ9nMplj7%J9Rk3Nj3
6696a6J2lJ4j5J0j6kPPmj0%oKK8j4Qj4oJ8LPqnj4LJ3NJ2k2m%J8JjLk2J3%J1lJ0
6738B0j1j1jOJ3j3mPmNoj0KmJ4Jj3KmRpJLJJ0k2OpRRpk%OoPjJ%j4J3j2J2jKJ5
6784A4j4NKj6J5Kj6K0jKkqPKp%j3NLOlLjj2KJ5Oj4LlrpJ6mojrnJ0Qmj3LK3rj1
6830a6J7nk0K1JNpJMKNqKlkj0J4RNlj4QoJ2%j5J6j3LjJ3j2%j0J1J5j5klpJ2qJ1
6873Gpl%lnJ5rrJ0lLRj4%pPj6J6KLmLOmjRj2lJ7k1J5lJ5j4nOJKmKRooKJ6j2pP
6921DJRrj%PkJmj1KkJjoKPJOk1K0j3knJ0qOkQppJ2jMoJ2lLnJ0qj0J2Mj2jJ9j5
$$ plain form
6969 -1 0 -2 15 10 2 15 15 15 6 5 7 3 13 2 9 -5 6 -2 -4 14 14 0 9 -11 3 6 -2 8 3 -8 1 -3 8 -4 -11 4 -1 -5 -14 -4 -3 -18 -19 -16
7013 -16 1 2 -2 3 1 -4 -4 10 9 5 3 9 11 -12 4 5 7 -1 7 2 0 7 7 9 5 19 -2 18 -2 10 4 11 4 -4 0 -2 9 -6 0 -6 6 0 5 1 6 -3 9
7060 9 3 5 4 1 -9 -6 3 -13 -5 1 -1 -7 -5 -6 0 -2 5 7 0 -5 8 3 8 3 -1 -4 -3 -6 14 7 3 7 12 1 0 14 6 13 9 21 5 3 -12 2 1 -5 4 -5 4 7 -2
7111 -2 7 2 -6 -7 -2 9 9 0 -1 -8 -6 2 6 -10 10 -4 -5 2 4 -1 -2 1 2 3 8 4 1 -4 -9 -10 5 4 3 0 7 9 2 3 9 2 0 16 12 3 -8 7 8 11 15 22 19 1
7163 1 7 11 10 19 3 12 1 10 14 4 4 5 1 5 7 -2 -6 -2 2 1 7 5 -5 1 2 -1 -6 10 6 3 6 -7 -5 3 8 -1 -3 -3 9 19 11 6 13 13 2 18 8 16 4
7212 4 10 12 16 17 15 21 3 12 14 4 9 15 -3 1 12 15 12 9 14 -5 10 9 9 -8 6 0 -14 -12 -8 7 -11 -5 -6 -3 -3 -9 1 -16 -13 -2 10 -1 -4 -5 -14
7257 -14 -7 7 -6 0 2 4 -3 9 -2 1 -3 -2 -9 -1 9 13 9 -8 -4 21 3 12 12 3 5 8 5 18 6 3 0 7 8 10 14 7 -2 13 10 6 2 -9 -12 -14 -8 -12 -6 -10
7305 -10 -3 -1 -11 -10 -9 -15 -3 -17 -2 -5 -15 -3 -7 -17 -1 4 -1 -10 4 -1 8 9 16 0 10 6 9 7 10 9 9 11 13 13 6 6 13 20 3 11 12 5 9 9 19 2
$$ packed form
6969aJkJ7nqJ3%%rjKmJ0j1Pj4J1qkJ8%j4Rk0J4LqJ0nj1RmJ1j2pJ5nmrJ0Jj5jL
7013a6J7JmNkn%J4jmkOKk3J6JKqQnkP%KmJ4k1K0k0J2oPpqMkJ1j5OoJ2oNmNrJ2
7060IoKjlj0LRj6QOkoKjOkPKpnJ3nNnmlJlK0pmMNj1jJ4qPmJ2j6kj5J4joRrRLr
7111bRnqjNJ1%rjpKQMj6K0j4jPKnjLJJNmlnnjJ5jjlPKpJOpkJ6mrj1J5JLMPlj8
7163AOMjRj6Rj1RMj0%JmMKrmMMjOkj0OJlnJ6mlLj3KQNrk%J2J0qnP%j1J6j0Qj2
7212DOKMJkOj8RKj0NOj8MJ1LllNj9J5j%j7J4oj4KMJ5j8OjL%oJ0j7LJ1J2j1ljr
7257a4PJ4j3OKKpJ2j1LmJpQJ0Mmj7MK5j8R%rKLlJ3j2llPJKMprJ5lmmj1lkOmOm
7305a0PKj0JJoJ2j4J5lj0J2mj0J6NnrJ4nRJPj6J0mLkLj%KK%p%PPj7QJpM%J0j7
$$ plain form
7351 2 5 1 3 -4 11 -5 1 5 2 -4 7 4 -13 -1 -3 -8 -7 -7 -12 -6 -3 -6 -7 -2 -8 1 -1 -3 4 -1 8 4 4 -4 1 0 8 -3 0 -2 6 0 9 8 6 9 4 12 -5 15 4 6
7403 6 6 19 17 3 7 12 -2 15 3 12 4 6 16 11 -4 3 5 1 -2 -2 -3 -12 -3 -8 -8 -3 -4 -6 -10 -9 -11 -10 1 0 -2 -11 -7 -4 -13 -6 -14 2 1 -4 1 8 0 4 12 18 13 12
7455 12 17 24 14 21 20 31 19 16 20 15 18 2 8 3 10 10 13 11 18 -4 2 5 3 -1 -3 -8 -9 -8 -6 6 -11 -12 -16 -8 -5 -6 -2 -1 -8 -6 4 -14 -4 3 -11 0 6 0
7503 0 -4 3 -12 -4 4 9 9 -3 5 7 14 4 7 12 4 11 3 5 16 10 10 -3 7 3 15 12 11 5 9 4 -2 6 2 2 -1 -1 -1 -12 -5 5 -5 0 -8 -3 -5 -11 0 -1 -5 -6
7553 -6 -7 -11 -2 3 2 6 6 3 1 -5 -2 9 8 -7 4 -1 5 23 15 -1 7 10 8 9 21 10 4 2 8 2 16 10 5 8 3 15 6 1 7 5 6 -2 14 -2 -1 -1 -3 -2 -1 2
7603 2 4 -4 -3 -15 2 8 0 -11 -5 -21 -15 -3 -8 3 3 -13 -5 -5 -8 5 -3 -3 -3 11 18 -3 8 14 6 12 8 3 -1 13 2 -2 13 9 5 -7 17 10 -11 7
7647 7 0 1 8 20 4 -2 3 -7 4 2 13 -1 -1 4 3 2 0 -7 -8 -2 4 -1 -3 -11 -4 2 -10 -5 -3 6 -9 -4 4 2 3 -6 -6 -5 5 -5 11 1 4 0 9 7 -2 6 7
7696 7 5 13 -1 5 3 11 5 10 14 10 11 -3 7 -5 12 -5 4 -16 1 3 -5 5 -10 -7 -11 -8 -6 -14 -7 -5 4 -2 -9 -2 -6 -5 -1 -5 -7 -9 1 -1 -3 -5 -7 -6 -3 -13 0
$$ packed form
7351BLmKpJ5j6OMloJ1lj7J2knJ%nOLljNoRkkPnRm%qNjQj1LkQoRjkLnQj7K0j1K
7403F%J3kj4MNj4J7j2RqKJ0nj5PKml%jrRn%NjkmJkJJ1jkrMLrPqJ6jnNPqMQOnj
7455A2NPj0PjJ1j2lMnLj6OnP%LkPk2OLkmknjJKJ2j7jmQLjMJpKJ0j8J0Pj4J1Oo
7503@mPj5QQN%j2QKPj0LNqPqKJ1o%j3J0mJ2ljoMnoQm%l%%j1PJ0j0NqNkoJ1jmj
7553fjmRNjM%lkoLJ1jj5J1nOJ8qj6QLkJJ2j1okOoJ4onLnJ2rnOkJqJ6j6J%kJJL
7603BKqJj2J7Oqj1Oj6OJ2nJ1%j6Q%lJ3q%%J4Pk1J1OqOmnmJ4j1mJ5mmj2K4pk1J8
7647GpJPJ2j6oNj0J1kJ1j4%NjjkpjOOnkqPOj2NKRj5NQkJr%JJ0j0J6j0LmRkrQJ
7696GkQj4OkQoNMmJj4J0j2J7j7Rk0J7KqJ0j5LmLKqPKRopPmJMmkkJ0kkkkJLj0J3
$$ plain form
7745 0 -7 -5 -3 0 4 18 10 1 13 3 9 20 0 10 12 0 -4 10 -1 2 -3 9 3 6 6 9 9 14 4 10 4 -1 5 -5 10 -5 -6 -7 0 -6 -15 -13 -1 1 -10
7790 -10 4 -5 6 5 2 3 8 -3 1 -5 -6 1 -9 -4 3 3 0 1 -5 6 -5 7 2 4 10 12 18 7 -2 4 9 4 12 19 6 9 13 -2 9 9 6 1 -3 7 5 9 8 5
7838 5 0 -10 -6 -2 -1 0 -8 -9 -10 -13 -14 -3 -9 -2 -12 0 -9 -5 -7 -12 4 -9 1 5 -16 1 -3 -5 -1 -3 -2 -2 6 6 9 7 1 6 -5 6 1 11 2 6 8 10 9 13 10
7887 10 15 -3 1 1 7 -1 15 1 2 5 8 -4 8 -4 -7 -4 0 -6 3 -7 -11 -3 -7 -1 -14 -2 -6 -9 0 -5 -6 -10 -3 5 -3 -8 5 -12 4 2 14 4 -4 2 -2 6
7933 6 3 10 0 3 6 12 6 5 13 9 7 6 13 5 13 4 6 9 3 23 8 -1 -2 7 14 13 8 6 -2 -1 4 7 0 -5 -9 -1 0 6 -7 0 -8 -10 6 5 5 -6 -8 -7 0 5 4 -1 -9 14
7987 14 1 4 12 -5 2 11 2 13 2 -2 13 8 14 3 -5 13 12 11 7 13 4 0 13 10 -8 2 8 0 -2 1 -3 12 -1 -6 -2 0 -2 5 -1 -5 3 -10 -6 -6 6 0
8033 0 -2 -5 -6 -4 1 12 -8 -15 11 -1 -6 -10 -2 -16 -4 -7 3 4 7 -3 -9 -2 7 3 -1 4 4 6 8 4 11 -1 2 -3 0 11 17 7 11 9 14 13 0 4 1 6 1 1 10
8082 10 3 -6 -9 -3 3 -2 -2 -4 -11 -3 0 -5 -2 5 -6 1 -10 -1 -11 -9 -9 -11 -5 -3 -10 -10 2 -3 1 9 2 2 1 2 -2 15 7 -3 6 6 3 0 6 16 7 8 13 7 5 8 8 -2
$$ packed form
7745@pKKLMJ4qrJ2j0OJ1k0J0Kj2mJ4j1LnJ2oL%L%Nj0OonOj0J5j5jjPorKJ2Kj1
7790a0J4rJ1jlJNj1MojPj0NP%lJoJ1j1J2nKOKOj1rONnQPj3LMj5J1%lnmJ0kMjl
7838Enj0MMJJqjjljJ1oPj0J2rMknJ6j3J0Mk1J7mkMkJ%Q%LkoNj1J1nJ0rMKKjMl
7887A0Nj8M%OqJ6j4JLLj2J2j2lLMoRj0mQmOj3J2mlRnjmPQqnJ3j7J6kJ2j0qOmQ
7933FlPj0LLOojQmkjPqQrKLoK0j5rjRPjnkqJNLpnmQJOj3PqkJ6j%j1kJPNjnqK3
7987A4j3LQj7PRrJ1j1mJ5nOj1qJ8jjmOrmJ3lj8J0OqkLmJ5j3nMKkPomQj3M%J2o
8033@kljKNJ1k0pK6j2nmQj4J2lJ0JLj0oPRmmN%KKmPj2LnLJ1Oj0MkNjj3MlNn%R
8082A0prlOOn%kpQLnLPj1Pj1Rj0K%kOKp%J2nMQp%jJmJ7qj0R%llOJ0rJNokL%j0
$$ plain form
8134 -2 1 2 3 0 5 -7 -2 -13 -7 -9 -10 -8 -11 -5 -9 -2 6 -9 -7 3 -13 0 -1 -7 1 -4 -3 -7 2 -3 -1 -5 -10 9 5 8 5 11 13 -3 7 -6 -9 4 0 22 8 5
8182 5 12 19 8 10 2 10 3 2 5
$$ packed form
8134bLJJlNj2Nj1OkjKlOmPQj5KJ0j6J3joQnJmRnKmnJ9mLlOKj6J0j3lJ3mK2j4l
8182EPPj1KqQpjL
8191E
$$ Imaginary data points
##PAGE= N=2
##DATA TABLE= (X++(I..I)), XYDATA
$$ plain form
0 0 0 0 0 0 0 0 0 0 0 0 0 8 -8 8 -8 8 -16 16 -16 24 -24 32 -32 40 -44 48 -56 64 -72 84 -96 106 -120 136
34 136 -150 168 -185 205 -228 252 -282 310 -344 380 -421 469 -518 579 -646 724 -817 927 -1062
53 -1062 1232 -1453 1749 -2178 2852 -4072 6966 -27361 2757 62786 -11510 -28715 25627 20223
67 20223 -44587 -14808 46591 15097 -41499 -8650 23053 -9095 -15460 31530 22315 -31183 -22777
80 -22777 23751 11596 -17100 2428 16964 -13497 -18635 17371 21462 -11676 -14536 6394 3764
93 3764 -6123 5264 9209 -7462 -11448 3611 8608 2538 -99 -4410 -9383 -1076 9777 5353
107 5353 -2494 -2671 -6137 -7734 6819 15869 -942 -14493 -4627 695 -4452 8166 21182 -2553
121 -2553 -27622 -6523 19598 4837 -9269 7066 6368 -20814 -14400 22277 20557 -12117 -12497
$$ packed form
0@%%%%%%%%%%%Qj6J6j6J6k4L2l2M0m8N6o4P2q4R2j04J20j36J56j80K02k26K56
34A36k86L18l53L90m33M80n34N92o54P24q01Q90r87J097j225J370j541J744j989
53a062K294k685L202l927N030o924J1038l4327L0118O0029p4296j7205N4342n404
67B0223o4810K9779O1399l1494n6596L2849L1703l2148o365M6990r215n3498Q406
80b2777M6528j2155k8696J9528J4536l0461n138L6006M091l3138k860K0930k630
93C764r887J1387L945j6671l986J5059M997o070k637m311m973Q307J0853m424
107E353p847j77l466j597J4553R050j6811j3551R866N322n147J2618J3016k3735
121b553k5069K1099K6121j4761j4106J6335o98k7182O414L6677j720l2674l80
$$ plain form
134 -12497 6762 -959 -10152 9810 17281 -9588 -19835 3637 12492 -1467 330 10281 -3329
147 -3329 -16682 593 16509 1820 -12062 -1715 5818 -2222 -1932 8700 5189 -8646 -7799 4292
161 4292 5832 -1892 -3353 445 -388 -2710 1664 6784 1415 -8769 -7196 4482 7374 -785 -3513
176 -3513 285 -2675 -6092 3483 11089 -653 -11567 -2090 6738 -560 -1810 8835 3561 -14216
190 -14216 -8787 12125 9439 -7121 -2996 7131 -2990 -9355 7565 14114 -5535 -13373 2638
203 2638 6745 -4696 -311 11334 653 -13349 -1684 11439 736 -8159 2064 5113 -6493
216 -6493 -4818 8933 5619 -8233 -5072 5505 1169 -5447 1454 5772 -3015 -6593 2215 5366
230 5366 -1885 -4237 649 1524 -1349 -208 2397 662 -2429 -1786 1272 2375 40 -2277 -882 1391
$$ packed form
134a2497J9259p721r193J9962P471k6869j0247K3472Q855j3959J797R951j3610
147c329j3353J7275J5916j4689j3882J0347P533q040K90J0632l511j3835Q47J2091
161D292J540p724j461L798q33k322M374N120n369j0184J573J1678K892q159k728
176c513L798k960l417R575P606j1742j0914R477Q828p298j250J0645n274j7777
190a4216N429K0912k686j6560M125J0127j0121o365J6920O549j9649p838J6011
203B638M107j1441M385J1645j0681j4002J1665J3123j0703q895J0223L049j1606
216f493J675J3751l314j3852L161J0577m336o616O901M318q787l578Q808L151
230E366p251k352M886Q75k873J141K605j735l091O43L058J103k335k317J395K273
$$ plain form
246 1391 143 -692 2557 2861 -2884 -3825 2929 3977 -2506 -2104 3665 191 -5568 1288 8230 -82
262 -82 -7118 1201 5646 -3756 -5165 5812 4782 -7000 -3910 7392 2323 -7165 159 7039 -3102
277 -3102 -7901 4017 6763 -5516 -5587 6283 3355 -7651 -1925 7785 -19 -7882 1231 6520 -3468
292 -3468 -5939 4668 4861 -5304 -3402 5554 1713 -5579 -92 5580 -710 -4665 1721 3871 -1937
307 -1937 -2089 3059 1505 -3048 -598 3176 655 -1887 434 1612 -575 -900 861 741 -405 -409 -210
324 -210 101 936 408 -1102 -433 836 -586 -1405 1004 1279 -2034 -1741 2107 1158 -2705 -870 2474
341 2474 -641 -3403 1054 3444 -1698 -3368 1889 2318 -2805 -1494 3671 851 -4278 -482 4285
356 4285 131 -3398 1210 3146 -2206 -2841 3043 2983 -2570 -1744 2979 963 -2939 255 3621 -425
$$ packed form
246A391j248q35L249L04n745r41O754J048o483M02N769l474n759O856O942q312
262h2p036Q319M445r402j409J0977j030j1782L090J1302n069r488P324O880j0141
277c102m799J1918K746j2279p1J1870k928j1006N726R710p804p863R113N289r988
292c468k471J0607J93j0165J902Q956l841p292N487N672o290l955O386K150n808
307a937j52N148j554m553K450L774k521k542K321J178k187l25J761j20j146mJ99
324b10L11Q35n28j510O69J269j422q19K409K75l313K93L848r49l863J835L344
341B474l115k762M457K390n142j670N257M29n123J311N165k820n129L796M767
356D285m154l529M608J936n352o35N884o0n553Q26M723k016l902L194L366m046
$$ plain form
372 -425 -3459 799 3358 -657 -2310 1363 1759 -2154 -1755 2463 1971 -2067 -1699 1414 474 -1917 -7
389 -7 2313 -342 -3030 -361 2439 205 -1933 173 1132 -1738 -2023 1821 2291 -1689 -2238 1267 1298
406 1298 -1584 -389 2349 -146 -3471 -433 3539 1204 -1985 -10 1487 -1344 -1701 2324 2623 -1903
422 -1903 -2469 1580 2063 -673 180 2115 -772 -3623 -81 3844 1309 -2114 -513 1124 -1015 -1168
438 -1168 2267 2029 -2616 -3165 1237 2467 -306 -498 964 -1270 -3439 161 3872 890 -3136 -1446
454 -1446 1091 -316 -601 2196 1246 -3493 -3107 2305 3305 -476 -1234 299 -1382 -2414 1852 4564
470 4564 201 -3801 -1287 1682 645 483 2171 190 -3595 -1734 3392 3319 -717 -1770 -524 -957
486 -957 -477 2727 3203 -1381 -4153 -1109 2329 1924 617 295 -1363 -3285 -994 3432 3211 -1445 -3574
$$ packed form
372d25l034M258K559m015j653L673L96l913L99M218m92m038L68L113r40k391J910
389gK320k655k688K669K800k234k138K106R59k870k85L844M70l980n49L505L1
406A298k882J195K738k495l325L038L972k335l189J975J497k831l57M025K99m526
422a903n66M049M83k736Q53J935k887k851L542L925k535l423J601J637k139j53
438a168L435k38m645n49M402J230k773j92J462k234k169L600L711k982m026J690
454a446K537j407k85K797r50m739L86N412J000l781p58J533j681j032M266K712
470D564m363m002K514K969j037j62J688j981l785J861N126p3m036j053J246m33
486i57M80L204M76m584k772L044L438m05j307l22j658j922K291M426k21m656k129
$$ plain form
503 -3574 -1369 551 940 1978 1824 -1884 -4429 -1194 3157 2383 -687 -1205 -1045 -1771 233 3866 2309
520 2309 -3366 -4255 338 2669 1499 1456 843 -2940 -4077 1106 4891 1734 -2077 -1544 -605 -699 1780
537 1780 4068 476 -4536 -3038 2045 3157 1305 484 -1007 -3312 -1738 3112 3967 -359 -3424 -2356
553 -2356 -297 1431 3089 2254 -1999 -4731 -2130 2450 3575 1146 -1508 -2726 -2366 -2 2998 3108
569 3108 -734 -4000 -2628 1153 2783 1782 52 -1991 -3147 -824 3308 3512 -555 -3058 -1763
584 -1763 70 1439 3060 2192 -2218 -4255 -552 3257 2446 261 -604 -1779 -2140 1114 4109 1680
600 1680 -2723 -2951 -332 1173 1949 2115 -526 -3644 -2317 1891 3273 1169 -1167 -2638 -2692 -13
616 -13 3196 2738 -786 -3047 -2547 -374 2289 3149 514 -2916 -3112 -642 1790 2905 1660 -1926 -3732
$$ packed form
503c574K205J920L89J038j54l708k545L235M351p74l070n18J60p26K004L633j557
520B309n675q89M593K331j170m3o13l783j137N183L785l157l811N33R39r4K479
537A780K288l592n012J498N083J112j852q21j491k305J574M850Q55m326l065J068
553b356K059J728J658q35m253k732K601M580J125k429k654j218L60K364L000J10
569C108l842l266J372L781J630j001j730k043j156K323M132K04m067k503J295
584a763J833J369J621q68m410k037L703L809q11k185q65j175l61L254K995k429
600A680m403k28K619J505P76J66k641l118J327M208J382k104k336j471n4K679
616a3L209m58l524k261N00K173K663Q60k635l430j96K470K432J115j245l586j806
$$ plain form
633 -3732 -930 2454 2233 639 -140 -1835 -2921 377 4181 2172 -2233 -2216 -43 -5 836 3179 1346
650 1346 -3446 -2877 1870 2377 -207 261 739 -2224 -2283 2721 3597 -1662 -3270 484 1176 -845 949
667 949 2572 -1562 -4280 137 3484 427 -1550 339 -397 -2654 283 3989 755 -3808 -1995 1136
683 1136 270 257 2493 678 -3704 -2494 2297 2408 -455 -368 159 -1850 -1494 2491 3175 -723 -2357
700 -2357 -342 336 -80 1358 2081 -520 -2366 -505 1444 999 452 431 -691 -1459 143 1714 672
717 672 -881 -589 76 -178 -56 620 232 -800 -645 182 173 -221 12 19 -611 -530 422 417 -782 -950 286
738 286 739 -39 -260 105 -417 -922 232 1278 231 -829 -145 312 -366 176 1483 392 -1586 -568
756 -568 1385 424 -821 758 1380 -1041 -1528 1159 1385 -922 -309 1557 -356 -2142 702 2353 -914
$$ packed form
633c732K802L384k21j594p79j695j086L298L804k009m405J7K173L8Q41K343j833
650A346m792N69M747N07k584M68M78k963n9N004Q76n259j608L754O92k021J794
667I49J623m134k718M417L347l057j977J889p36k257K937L706l234m563J813L131
683A136q66j3K236j815m382J210M791J11k863Q7N27k009L56L985O84l898j634
700b357K015O78m16J438P23k601j846J861J949m45n47k1j122p68J602J571j042
717F72j553K92O65k54J22O76l88j032J55Q27rl94K33Po30Q1R52nj199j68J236
738B86M53p78k21L65n22n05J154J046j047j060O84M57o78N42J307j091j978J018
756e68J953r61j245J579O22k421m87K687K26k307O13J866j913j786K844J651l267
$$ plain form
773 -914 -1966 1535 1498 -2411 -1457 2687 1193 -2541 -540 1994 -1001 -2380 1814 2610 -2064 -2443 1594
790 1594 891 -2173 305 2959 -896 -3546 480 2557 -827 -1169 1901 245 -3167 -362 3257 466
806 466 -2221 445 1305 -1898 -1053 3056 1648 -2682 -1361 2029 563 -1202 994 1499 -1506 -1397
822 -1397 1696 1295 -1109 -201 1086 -666 -1148 1296 1398 -1189 -1195 708 453 -320 579 179 -1672 -836
840 -836 1457 739 -982 -148 199 -1550 -880 2078 1399 -1883 -1625 597 -7 -537 1526 1294 -2106 -2186
858 -2186 1234 1570 -450 223 965 -1540 -2098 1689 2895 -475 -1603 361 -74 -1218 1336 2938
874 2938 -579 -2854 152 1918 -252 -375 1684 128 -2709 -584 2708 1053 -1537 -332 599 -1108
890 -1108 -745 1884 1165 -1962 -1549 1066 803 -664 112 556 -1197 -1442 894 1564 -329 -1131 -329 -256
$$ packed form
773i14j052L501l7l909R54M144j494l734K001K534k995j379M194P96m674l79M037
790A594p03l064K478K654l855k650M026K077l384l42L070j656l412K805L619k791
806D66k687K666Q60l203Q45M109j408m330J321L390j466j765K196N05l005J09
822a397L093m01k404R08J287j752m82K444J02k587oJ903k55p73Q99m00j851Q36
840h36K293p18j721Q34L47j749O70K958o79l282K58K222o04n30K063k32l400q0
858b186L420L36k020O73P42k505n58L787J206l370j128J964m35j144K554J602
874B938l517k275L006J766k170j23K059j556k837K125L292j655k590J205R31j707
890a108L63K629p19l127M13K615k63j467P76M44j753k45K336O70j893q02Q02P3
$$ plain form
908 -256 -275 818 1023 -593 -1389 -213 710 490 315 141 -698 -1003 185 1293 911 -194 -827 -694 55
927 55 897 966 217 -498 -681 -314 587 1178 469 -719 -789 2 400 557 754 96 -1108 -1000 483 1041
947 1041 186 -333 -209 -478 -590 395 1005 -26 -1127 -634 237 133 -27 346 75 -956 -845 504 857
966 857 -211 -656 -8 55 -457 35 882 177 -1000 -356 871 412 -433 188 517 -629 -699 1057 1279
985 1279 -551 -806 682 414 -844 170 1579 5 -1572 101 1467 -182 -956 844 778 -1478
1001 -1478 -903 1709 916 -1559 -558 1257 -341 -1554 786 1645 -1202 -1915 854 1160 -1113 -480
1017 -480 1458 -221 -2266 -67 2028 -24 -1471 444 804 -1356 -822 1832 1045 -1577 -821 1152
1033 1152 185 -812 793 1200 -978 -1267 949 1240 -376 -313 586 -238 -825 676 1415 -127 -1030 -175
$$ packed form
908b56j9J093K05j616p96J176R23k20j75j74q39l05J188J108l82j105o33J33P49
927E5Q42O9p49p15j83L67R01N91p09j188p0P91L98J57J97o58j204J08J483N58
947A041q55n19J24k69j12R85O10j031j101M93Q71j04j60L73k71j031J11J349L53
966H57j068m45O48O3n12M92Q47p05j177O44J227m59q45O21L29j146p0J756K22
985A279j830k55J488k68j258J014J409j574j577J673J366j649p74J800o6k256
1001a478N75K612p93k475J001J815j598j213K340Q59k847p13K769L06k273O33
1017d80J938j679k045K199K095k052j447J915L60k160N34K654p87k622P56J973
1033A152r67r97J605M07k178k89K216K91j616O3Q99q24n87J501P39j542r03Q55
$$ plain form
1051 -175 269 17 515 814 -278 -1090 -323 500 418 214 -43 -652 -665 237 612 162 -201 -490 -835 -232
1071 -232 926 713 -625 -864 -139 -128 -64 856 655 -1057 -1351 347 976 117 99 335 -807 -1238 715
1090 715 1775 77 -1103 -96 261 -464 326 1588 286 -1584 -622 1194 738 -224 214 104 -997
1107 -997 -469 1416 1269 -621 -1074 -119 12 -84 763 897 -656 -1444 -178 963 503 -211 -322 -559 -735
1126 -735 66 1005 574 -727 -1091 -295 385 439 315 26 -668 -937 -2 1058 701 -495 -781 -198 135
1145 135 312 770 512 -759 -1114 197 1077 449 -79 86 -255 -709 261 1373 442 -1035 -633 510
1163 510 365 35 567 335 -968 -936 632 1052 -108 -517 -23 -271 -558 395 1010 -228 -1263 -378 613
1182 613 191 -212 207 -9 -900 -574 718 744 -386 -664 -72 -3 -152 354 604 -262 -830 -51 670 235
$$ packed form
1051a75M44k52M98K99j092q12P67Q23q2k04k57o09j3R02L75m50l63k89l45O03
1071b32J158k13j338k39P25J1O4R20k01j712k94J698O29q59j8K36j142m31J953
1090G15J060j698j180J007L57p25P90J262j302j870R62J816m56r62M38j10j101
1107i97N28J885j47j890m53R55J31r6Q47J34j553p88J266J141m60p14j11k37j76
1126g35Q01R39m31j301l64P96O80N4j24k89o94k69R35J060l57j196k86N83L33
1145A35J77M58k58j271l55J311Q80o28n28J65l41m54R70J112r31j477M02J143
1163E10j45l30N32k32j303L2J568M20j160m09M94k48k87R53O15j238j035Q85R91
1182F13m22m03M19k16q91L26J292K6j130k78N92O9j49N06K50q66n68P79P21m35
$$ plain form
1202 235 -203 86 100 -372 -161 683 633 -291 -475 202 365 -12 77 356 -31 -439 28 584 190 -285 -26
1223 -26 243 -117 -251 230 346 -273 -464 160 333 -248 -376 215 254 -386 -367 270 97 -553 -236 465 48
1244 48 -660 -128 580 -32 -617 126 527 -423 -655 532 714 -533 -608 576 454 -518 30 899 -136
1263 -136 -1053 243 1188 -61 -726 434 552 -761 -336 1309 628 -1177 -603 939 358 -562 348 670
1281 670 -891 -1083 795 1138 -482 -670 336 -139 -808 444 1257 -385 -1550 -264 760 75 -98
1298 -98 502 -131 -1197 -380 1040 622 -511 -524 -230 -375 116 985 581 -676 -849 3 510 539 332 -212
1318 -212 -736 -383 450 816 562 -58 -717 -601 404 974 399 -289 -439 -482 -123 889 1092 -258 -1192
1337 -1192 -425 431 344 426 545 -577 -1503 -239 1354 740 -609 -611 -388 -690 96 1459 741 -1286 -1389
$$ packed form
1202B35m38K89J4m72K11Q44n0r24j84O77J63l77Q9K79l87m08M67N56l94m75K59
1223b6K69l60j34M81J16o19j91O24J73n81j28N91L9o40J9O37j73o50L17P01m17
1244D8p08N32P08o12n85P43M01r50k32J187J82j247p5J184j22r72N48Q69j035
1263a36r17J296R45j249o65J160J18j313M25J645o81j805N74J542n81r20R10L22
1281F70j561j92J878L43j620j88J006m75o69J252Q13j642j165J286J024o85j73
1298i8O00o33j066Q17J420m18j133j3K94j45M91Q69m04j257j73Q52N07K9k07n44
1318b12n24L53Q33L66k54o20o59J16J005N70n75o88j50m3L59J012K03j350r34
1337a192P67Q56q7Q2J19j122r26J264J593o14j349kK23l02P86J363p18k027j03
$$ plain form
1356 -1389 153 575 232 467 150 -1230 -1231 770 1666 338 -733 -571 -526 -345 826 1432 44 -1384
1374 -1384 -793 611 972 631 261 -402 -1063 -530 877 1374 276 -949 -859 88 680 714 426 -290 -1141
1393 -1141 -845 663 1326 211 -831 -638 -283 -133 740 1169 -405 -1854 -657 1117 693 -183 155
1410 155 -200 -1509 -664 1729 1404 -1083 -1368 162 191 -151 1088 1133 -1309 -2010 454 1638 242 -158
1428 -158 461 -678 -1529 670 2354 299 -1703 -558 501 -238 244 1660 482 -1832 -1081 1193
1444 1193 1090 -149 -85 -144 -1098 -563 1264 1235 -444 -899 -285 -191 61 877 474 -1032 -1166 147 744
1463 744 357 107 -263 -889 -564 527 807 113 -459 -736 -573 416 1156 335 -810 -617 -50 -18 472 1131
1483 1131 123 -1370 -672 910 732 -29 280 15 -1118 -458 1476 1165 -672 -637 303 -295 -509 1083
$$ packed form
1356a389J542M22l43K35l17j380jK001Q96j328j071J62M5J81J171O06j388j428
1374a384N91J404L61l41l70o63o61N33J407M97j098j225R0R47N92L4k88p16q51
1393a141K96J508O63j115j042J93L55J50Q73M29j574j449J197J774m24q76L38
1410A55l55j309Q45K393l25k487k85J530K9l42J239M5k442p01K464J184j396m00
1428a58O19j139q51K199J684k055k002J145J059p39M82J416j178k314P51K274
1444A193j03j239O4n9r54N35J827k9j679m55O14R4K52Q16m03j506j34J313N97
1463G44l87k50l70o26L25J091K80o94n72k77J63R89P40q21j145J93N67L2M90O59
1483A131j008j493O98J582j78p61L09k65j133O60J934l11j837L5R40n98k14J592
$$ plain form
1501 1083 1231 -1039 -1522 575 1096 -230 -103 688 -537 -1523 193 1456 27 -989 -46 137 -658
1518 -658 56 1116 1 -1315 -370 637 -32 -271 498 71 -1029 -321 1020 521 -578 -306 135 -260
1536 -260 -92 732 479 -520 -483 194 296 274 379 -33 -551 -130 464 312 128 270 -189 -656 63 784 179
1557 179 -417 37 108 -430 42 859 77 -996 -318 538 -99 -349 570 354 -994 -661 767 417 -723
1576 -723 -177 497 -453 -812 552 869 -538 -723 402 256 -581 44 742 -202 -835 200 732 -151 -335
1595 -335 460 245 -578 -84 754 233 -521 -56 450 9 -179 336 391 -237 -358 164 372 70 -93 17
1615 17 65 -76 -107 133 220 -144 -406 -15 332 -21 -302 71 101 -467 -307 455 251 -580 -287 377 -103 -562
1637 -562 300 606 -535 -784 447 561 -541 -285 714 48 -902 97 986 -96 -738 374 589 -540
$$ packed form
1501A083J48k270m83K097N21j326J27P91j225r86J716J263j429j016R43J83p95
1518f58P14J060j115j316R45J007o69k39P69m27j100P08J341m99j099K72M41l95
1536b60J68Q24k53r99L7O77J02k2J05m12n18M21N94j52j84J42m59m67P19P21o05
1557A79n96M54P1n38M72Q17p82j073O78Q56o37k50R19k16j348L33J428l50j140
1576g23N46O74r50l59J364L17j407j85J125j46q37O25O98r44o33J035N32q83j84
1595c35P95k15q23M94Q38n21p54M65N06m41j88N15N5o28j21N22K08l02j63J10
1615A7M8j41l1K40Q7l64k62L91L47l53k81L73L0n68J60P62k04q31K93O64m80m59
1637e62Q62L06j141k49J231J14j102K56R99o66r50R99Q89j082o42J112K15j129
$$ plain form
1655 -540 -298 938 361 -862 -87 896 -21 -622 494 698 -622 -547 786 503 -648 -174 644 -112
1673 -112 -628 337 598 -442 -520 389 177 -527 -39 467 -265 -598 208 342 -388 -261 328 -91 -525 92
1693 92 393 -286 -372 300 116 -437 26 463 -172 -441 287 339 -363 -119 564 48 -528 204 615 -239 -423
1714 -423 497 411 -507 -126 734 135 -583 193 615 -331 -494 543 459 -564 -213 648 24 -711 128 691
1734 691 -321 -692 314 435 -503 -294 528 39 -740 -90 538 -141 -530 167 256 -479 -308 525 225 -562
1754 -562 -259 311 10 -264 182 279 -285 -316 214 315 -7 -24 62 -129 -118 247 347 47 -125 -43 30 140
1776 140 252 105 -129 -125 -10 74 254 277 -107 -396 -98 228 103 11 74 -186 -456 -35 496 146 -383 -244
1798 -244 -22 -226 -76 433 185 -600 -500 232 271 -78 28 41 -480 -432 409 602 -128 -378 -26 -10 -125
$$ packed form
1655e40K42J236n77j223P75R83r17o01J116K04j320P5J333k83j151M74Q18p56
1673a12n16R65K61j040p8R09k12p04M88N06p32l33Q06J34p30J27N89m19m34O17
1693I2L01o79q6O72j84n53M63M37o35k69P28N2p02K44O83n16n76P32M11q54j84
1714d23R20q6r18L81Q60n99p18P76M22r46j63J037q4j023L51Q61o24p35Q39N63
1734F91j012l71J006J21r38K09Q22m89p79O50O28o79l89O97Q9p35J71Q33l00p87
1754e62L03N70l01k74M46R7n64l1N30J01l22j7Q6j91J1L65J00l00j72Q2P3J10
1776A40J12j47k34MJ15Q4J80K3l84k89K98L26j25r2O3k60k70M21N31l50n29J39
1798b44K22k04J50N09k48p85J00P32L9l49J06J3n21M8Q41J93p30k50L52J6j15
$$ plain form
1819 -125 323 580 -141 -663 -98 491 321 85 117 -152 -415 26 625 427 -194 -322 -107 11 255 481
1839 481 199 -406 -505 0 411 365 29 -280 -413 -202 208 429 189 -316 -560 -281 222 405 151 -234 -468
1860 -468 -407 62 523 356 -297 -576 -239 112 285 385 143 -472 -627 58 652 392 -105 -254 -293 -192 356
1881 356 748 230 -539 -463 97 340 349 352 -44 -614 -379 488 728 116 -316 -315 -264 -27 543 597 -196 -758 -335
1904 -335 287 369 194 41 -390 -666 -165 589 522 -178 -545 -400 -111 235 538 218 -506 -684 -110 425 412
1925 412 139 -187 -505 -415 246 728 337 -360 -522 -183 211 478 445 -20 -520 -424 187 600 423 -23 -383
1946 -383 -406 -7 508 551 52 -463 -468 -40 405 491 140 -343 -506 -207 288 500 174 -364 -563 -232 243 414
1968 414 215 -206 -556 -435 165 566 254 -280 -467 -295 -32 325 493 39 -584 -504 131 467 297 34
$$ packed form
1819a25M48K57p21n22N65N89j70k36L2k69k63M41N99j98o21j28K15J18K44K26
1839D81k82o05r9N05M11m6l36l09j33K11M10K21k40n05k44K79N03J83k54l85k34
1860d68O1M69M61j67o53k79L37L51J73J00k42o15j55O85N94k60m97j49l9J01N48
1881C56L92n18p69P6N60K43RLl96n70K35Q67K40o12m32JN1K37N70N4p93n62M23
1904c35O22Q2j75j53m31k76N01P54o7p00l67J45K89L46L03l20p24j78N74N35j3
1925D12k73l26l18R0O61M82l91o97j62L39L94K67l3m65n00R6O11M13j77m46l60
1946c83k3L99N15M3m99n15nM28M45Q6l51m83j63K99M95K12l26n38j99L31M75J71
1968D14j99m21l50J21O00M01l12n34j87J72K63L57J68m54o23Q0O35L36j70k63
$$ plain form
1988 34 -228 -455 -197 483 617 44 -391 -263 -49 156 463 434 -213 -630 -147 439 410 101 -28 -268 -421
2009 -421 14 602 391 -278 -451 -145 28 148 342 142 -452 -521 69 397 151 -93 -177 -342 -275 235 498
2030 498 5 -463 -311 30 78 169 274 -58 -512 -310 331 419 21 -189 -142 -163 -23 343 395 -77 -389 -143
2052 -143 164 215 225 141 -200 -368 13 422 281 -69 -164 -138 -140 68 370 222 -277 -378 -40 184 151 97 -22
2075 -22 -247 -258 44 237 98 -128 -201 -165 -49 125 152 -43 -229 -161 11 94 102 14 -103 -196 -69 141 202 42
2099 42 -135 -150 39 159 108 37 19 -71 -121 61 257 125 -125 -104 63 57 64 150 62 -180 -137 117 155 -4 20 25
2125 25 -158 -159 158 237 -116 -220 10 17 -136 12 196 -44 -288 -70 129 -40 -95 86 31 -227 -106 175 67
2148 67 -117 -9 69 -113 -93 158 132 -136 -79 140 30 -116 90 208 -41 -137 100 123 -50 -6 165 48 -123
$$ packed form
1988C4k62k27K58O80J34n73m35J28K14K05L07k9o47m17M83N86k9l09j29k40j53
2009d21M35N88k11o69j73L06J73J20J94k00n94o9N90L28k46k44q4j65O7N10K63
2030D98m93m68J52L41M8R1J05l32m54K02O41Q8l98k10M7k1J40L66N2m72l12K46
2052a43L07N1J0q4l41j68L81M09j41l50r5K6kK08L02j48m99j01L38K24l3n4j19
2075b2k25j1L02J93j39k26p3L6J16J74K7j95j86O8J72Q3Qq8j17r3J27K10O1j60
2099D2j77j5J89J20n1p1j8r0n0J82J96j32k50K1J67oPQ6q8k42M3K54L8j59K4N
2125B5j83jL17P9l53j04K30Pj53J48J84k40k44K18J99j69n5J81n5k58J21K81j08
2148F7j84J08P8j82K0K51k6k68N7K19j10j46K06J18k49r6K37K3j73M4J71j17j71
$$ plain form
2171 -123 19 130 17 -40 72 40 -105 -15 119 1 -103 1 50 -102 -68 72 28 -112 -80 33 -47 -75 21
2194 21 12 -128 -100 57 54 -72 -60 -4 -59 -48 64 76 -59 -75 18 44 16 51 61 -29 -77 37 131 113 28 -29 -40 -8
2222 -8 62 135 110 -11 -104 -40 90 130 74 -5 -103 -113 13 146 87 -73 -84 -56 -84 -44 162 116 -176 -255 -10 94
2248 94 -34 1 64 -144 -273 20 245 14 -187 -26 -2 -137 -1 227 27 -245 -66 158 23 -24 156 50
2270 50 -244 -70 292 136 -138 1 102 -132 -52 327 203 -258 -169 189 84 -77 175 173 -275 -270 247 269 -130
2293 -130 -106 100 -138 -274 169 347 -132 -341 -14 13 -132 89 257 -187 -426 5 257 -41 -67 132 -110
2314 -110 -378 16 398 50 -267 -21 80 -156 -11 376 102 -346 -134 243 106 -41 182 113 -269 -159
2334 -159 313 280 -94 -91 47 -78 -49 257 218 -162 -215 27 81 22 107 55 -219 -218 65 179 28 -70 -110 -202 -99
$$ packed form
2171a23J42J11j13n7J12l2j45R0J34j18j04J04M9j52L4J40m4j40L2J13q0k8R6
2194B1rj40K8J57lj26J2N6n5J1J12J2j35j6R3K6k8L5J0r0m8J14R4j8q5n7j1L2
2222hP0P3k5j21r3O4J30M0n6p9r8j0J26J33n9j60j1K8k8M0K06m6k92p9K45J04
2248I4j28L5O3k08j29K93K25k31k01J61K4j35J36K28k00k72J79K24j35m7J80j06
2270E0k94J74L62j56k74J39J01k34Q0L79j24m61Q9L58j05j61K52km48NN17K2l99
2293a30K4K06k38j36M43J78m79k09L27K7j45K21J68m44k39M31K52k98k6J99k42
2314a10k68L94L82l48l17K46J01k36J45L87k74m48K12L77j37j47K23o9l82J10
2334a59M72l3l74LJ38j25K9L06l9l80n3K42N4n9Q5n2k74JK83J14j51r8m0r2J03
$$ plain form
2359 -99 137 168 -71 -196 -156 -75 55 179 42 -192 -185 -62 13 121 185 -63 -312 -96 205 134 12 64 -43
2382 -43 -253 -23 355 240 -138 -92 63 -66 13 353 233 -264 -245 190 214 -29 108 153 -225 -275 216 337
2404 337 -71 -182 19 -78 -172 179 316 -151 -400 -38 146 -53 15 142 -155 -393 -50 290 59 -139 -47
2425 -47 -94 -208 65 315 52 -276 -132 52 24 111 205 -16 -264 -67 205 149 72 82 -80 -216 60 324 139
2448 139 -92 -29 -13 -85 128 337 66 -261 -98 108 11 54 214 -20 -341 -99 256 114 -131 -23 -40 -274
2470 -274 -87 297 145 -293 -209 46 -64 -91 198 107 -327 -300 159 192 -70 -19 58 -188 -195 198 267 -88 -153 25
2494 25 6 -30 209 244 -98 -238 57 192 77 74 103 -85 -152 115 230 71 -36 -3 -100 -70 176 222 -71 -169
2518 -169 -8 17 -29 104 117 -172 -254 29 122 -49 -15 53 -190 -265 88 239 -92 -210 16 -26 -184 46 266
$$ packed form
2359i9K36L1k39j25M0Q1J30J24j37k34PJ23P5J08O4k48k49K16L01p1j22N2j07
2382d3k10K30L78j15l78M6J55j29P9L40j20m97J9M35K4k43J37M5l78n0M91J21
2404C37m08j11K01r7r4L51J37m67k49L62J84j99O8J27k97k38L43L40k31j98R2
2425d7m7j14K73K50k63l28J44J84k8Q7R4k21k48J97K72n6p7J0j62j36K76K64j85
2448A39k31O3J6p2K13K09k71l27J63K06r7M3J60k34l21K42L55j42k45J08j7k34
2470b74J87L84j52m38Q4K55j10k7K89r1m34K7M59L3k62N1P7k46pL93O9l55o5J78
2494B5j9l6K39L5l42j40K95J35j15lK9j88o7K67J15j59j07L3r7L0K46M6k93r8
2518a69J61K5m6J33J3k89q2K83R3j71L4O8k43p5L53J51l31j18K26m2j58K30K20
$$ plain form
2541 266 -77 -319 -5 182 -43 -60 186 30 -283 -30 311 108 -150 12 114 -89 -36 283 162 -197 -100
2562 -100 171 81 -47 131 145 -139 -146 149 187 -51 -52 33 -55 -84 75 117 -67 -124 -18 -3 -47 43 31 -115 -138 -14
2588 -14 33 -9 -1 -33 -126 -79 48 28 -66 -19 -3 -109 -54 114 82 -100 -50 71 4 -36 100 119 -77 -79 145 128 -60
2615 -60 18 146 3 -114 97 200 -21 -86 100 86 -79 1 143 27 -149 -2 117 -30 -96 71 72 -132 -111
2638 -111 65 35 -113 -69 36 -50 -121 -18 48 -56 -100 -15 0 -78 -50 32 23 -87 -59 6 25 -3 4 25 -7 -39 8 81
2666 81 64 -9 -9 38 42 24 71 90 -4 -70 33 108 51 -4 33 22 -42 -11 99 78 -52 -71 9 29 -5 20 23 -73 -114 -5
2696 -5 77 0 -83 -50 -28 -66 -30 62 31 -134 -146 16 74 -17 -39 1 -51 -115 20 165 45 -119 -70 48 9 22 140
2723 140 81 -128 -110 140 172 9 4 59 -53 -95 141 254 -1 -174 -19 83 9 49 154 -13 -226 -85 181
$$ packed form
2541B66l43k42L14J87k25j7K46j56l13K53L41k03k58J62J02k03N3L19j21l59R7
2562a00K71r0j28J78J4k84pK95L8k38jQ5q8k9J59M2j84n7J06J5m4R0j2j46k3J24
2588a4M7m2Ql2r3M7J27k0r4M7J6j06N5J68l2j82N0J21o7m0J36J9j96kK24j7j88
2615f0P8J28j43j17K11J03k21o5J86j4j65Q0J42j16j76J47J19j47o6J67Jk04K1
2638a11J76l0j48M4J05q6p1J03O6j04m4Q5J5p8K8Q2rj10K8O5J9k8PK1l2l2M7P3
2666H1j7p3%M7Mj8M7J9r4o6J03P5n7n5L7j1o4L1J10k1j30j9Q0K0l4K5Lr6m1J09
2696eQ2p7q3L3K2l8L6R2l1j65j2J62N8r1k2M0n2o4J35J45j20j64M9J18l9J3J18
2723A40n9k09J8K50L2j63nN5j12m2K36J13k55j73J55J02p4M0J05j67k13J41K66
$$ plain form
2746 181 109 -47 -43 -35 -129 -67 156 134 -106 -188 -54 12 -4 47 34 -130 -208 -30 134 72 -77 -111 -87 -27 23 106 77
2773 77 -83 -177 -37 156 135 6 -59 -42 -61 25 201 175 -109 -189 19 144 79 75 86 -106 -234 78 318 114
2797 114 -141 -80 -6 -96 34 274 104 -289 -228 106 127 -1 49 29 -244 -243 148 262 -43 -200 -72 -63 -87 100
2821 100 219 -65 -296 -102 135 100 7 37 -53 -192 -67 205 207 -63 -170 -49 47 82 115 115 -76 -192 -31 214
2845 214 206 -24 -113 -66 -24 26 194 188 -134 -289 -33 211 91 -18 29 -99 -266 -25 325 158 -232 -205 5
2868 5 -36 -11 238 150 -311 -339 116 233 -12 -30 49 -182 -256 152 354 -11 -246 -48 24 -53 117 265 -29 -310
2892 -310 -64 217 111 6 68 -43 -191 26 281 156 -111 -110 -25 -12 100 206 15 -196 -108 72 82 91 89 -111
2916 -111 -230 -12 188 81 -36 -23 -131 -186 82 281 12 -243 -100 18 -66 63 245 -22 -363 -124 227
$$ packed form
2746A81p2j56MQr4O2K23k2k40q2J34O6j6N1j3j64p8J78J64o2j49l4K4O0N0Q3k9
2773G7j60r4J40J93k1j29o5J7j9Q6J76k6k84q0K08J25o5mJ1j92j28L12K40k04
2797A14k55O1P4r0J30K40j70l93O1L34K1j28N0k0k73JL91J14l05j57J28Rk4J87
2821A00J19k84k31J94K37l5r3L0r0j39J25K72Kk70j07J21R6L5L3%j91j16J61K45
2845B14qk30q9M7M2N0J68ol22j55K56K44j20j09M7j28j67K41L50j67l90K7K10
2868Em1K5K49q8m61k8M55J17k45j8P9k31p4M08K02l65k35J98P2p7J70J48k94k81
2892c10K46K81j06j05O2j11j48K17K55j25k67JQ5J3J12J06j91k11Q8J80J0Rkk00
2916a11j19K18K00j07j17J3j08n5K68J99k69k55J43J18q4J29J82k67l41K39L51
$$ plain form
2937 227 78 -75 89 19 -286 -123 354 228 -212 -139 111 -63 -95 246 264 -225 -273 163 202 -75 29 163
2959 163 -141 -268 154 343 -58 -212 36 41 -133 65 254 -23 -291 -51 159 24 -42 59 -53 -206 -42
2980 -42 188 69 -122 -78 -26 -54 28 137 31 -144 -111 13 57 84 65 -82 -121 9 89 68 57 18 -103 -100 112
3005 112 162 -12 -39 31 -44 -76 126 207 -59 -177 33 103 -30 19 149 -37 -221 5 191 8 -133 35 24
3028 24 -181 -56 203 44 -204 -70 104 -35 -92 102 53 -174 -115 130 70 -105 -15 59 -93 -94 105 119 -80
3051 -80 -98 58 37 -28 53 78 -46 -83 56 67 -5 21 40 -32 -47 69 86 -3 1 36 -18 -22 79 51 -66 -41 47 -15
3079 -15 -40 70 62 -84 -72 61 24 -76 -16 62 -58 -114 49 68 -80 -74 58 -14 -108 15 101 -43 -103 38 48 -50
3105 -50 -27 98 28 -80 11 88 0 -43 75 65 -46 -14 95 38 -36 18 58 -10 -13 63 46 -19 12 30 -7 -9 33 10 -35
$$ packed form
2937B27j49j53J64p0l05J63M77j26m40P3K50j74l2L41J8m89m8M36L9k77J04J34
2959A63l04j27M22J89m01j54K48Nj74J98J89k77k68K40K10j35o6J01j12j53J64
2980d2K30j19j91M4N2k8Q2J09j06j75L3J24M4K7j9j47l9J30Q0k1j1l9j21LK12
3005A12N0j74k7P0p5l2K02Q1k66j18K10P0j33M9J30j86j84K26J86j83j41J68j1
3028B4k05J25K59j59k48J34J74j39n7J94m9k27N9K45o0j75R0P4j52jJ99J4j99
3051h0j8J56k1o5Q1K5j24l7J39J1p2K6J9p2j5J16J7q9ML5n4mJ01k8j17K5Q8o2
3079a5k5J10qj46J2J33l7j00O0P8j20n6J63J9j48OJ32p2r4J23Q6j44o0J41J0r8
3105e0K3J25p0j08R1P7q8m3J18j0j11L2J09n7p4N4M0o8lP6j7o5L1J8l7kM2k3m5
$$ plain form
3134 -35 -9 12 -23 -25 16 -3 -71 -27 37 -28 -60 13 11 -84 -70 67 -4 -100 -24 51 -40 -64 42 54 -92 -44 84 21 -82
3163 -82 32 90 -50 -84 86 107 -43 -37 94 38 -71 29 124 -17 -61 60 85 -36 -24 81 40 -86 -10 99
3187 99 -2 -62 24 42 -47 -37 50 12 -64 -29 20 -28 -60 -7 19 -40 -50 -17 -10 -37 -23 1 -18 -34 -12 -4 -9 0 4 -10 -17 3 4
3220 4 16 18 5 -20 9 48 30 6 20 21 -14 7 73 61 -4 -10 35 13 9 42 26 -28 -36 29 44 -4 -2 12 -38 -49 6 51 -13 -78
3254 -78 -54 -29 -7 19 -4 -52 -85 -47 6 15 -10 -34 -58 -59 -21 34 44 -26 -85 -53 31 54 49 5 -22 -32 -10 79 104 28 -48 -31
3286 -31 39 63 82 70 -1 -69 -13 84 99 31 -16 -33 -40 22 120 77 -54 -102 -33 36 45 57 -7 -103 -125 11 100 32 -58 -82
3316 -82 -94 -60 48 82 -6 -133 -111 -23 41 72 33 -66 -131 -51 74 120 27 -61 -84 -51 50 120 91 -18 -97 -58 70
3343 70 134 106 -22 -79 -58 39 130 126 18 -97 -91 18 130 103 16 -87 -122 -38 111 141 -11 -118 -114 -46 41 102 64
$$ packed form
3134c5K6K1l5kM1j9o8M4O4o5l2P3kr5J4J37p1r6P6P5r1k4J06J2j46M8J28o3j03
3163h2J14N8j40l4J70K1j50OJ31n6j09J00R5j41m4J21K5j21J2J05m1j26P6J09
3187I9j01o0Q6J8q9J0Q7l8p6L5M9m8l2N3K6n9j0L3Pk7J4K4j9j6K2QnRMj4pK0J
3220DJ2Kj3k5K9L9j8k4J4Jl5K1O6j2o5oM5k2mL3j6n4qO5J5m8KJ4n0j1N5M5o4o5
3254g8K4K5K2K6k3m8l3L8N3Rk5k4k4jL8N5J0p0n9L2Q4K3nm4k7j0K2Q9K5p6p6J7
3286c1P0K4J9j2p1o8N6R7J5o8m7j7pO2R8m3j31m8O9O9RJ2o4r6k2J36Q9o8r0k4
3316h2j2L4J08L4q8j27K2Q8O4L1l9r9o5Q0J25M6r3q8k3L3J01P0k9j09p9L9J28
3343G0O4k8j28n7K1R7R1mj08j15OJ09J12k7q7j03l5Q4J49L0j52j07MO8Q7O1l8
$$ plain form
3370 64 -100 -174 -77 75 89 17 -67 -131 -116 15 127 80 -88 -153 -79 20 103 107 5 -127 -125 23 147 113 14 -69 -99
3397 -99 -7 133 173 38 -93 -79 21 124 146 79 -47 -121 -31 112 172 70 -71 -103 -56 60 136 83 -65 -157 -88
3422 -88 60 116 73 -41 -145 -127 -1 119 99 -31 -147 -126 -13 81 99 -7 -137 -157 -23 99 101 25 -87 -125
3446 -125 -53 90 141 61 -60 -121 -45 81 136 85 -27 -84 -47 54 150 106 -10 -100 -57 43 123 107 11 -94 -92 22
3472 22 111 85 -2 -74 -93 -11 79 108 1 -109 -106 -19 47 82 31 -77 -137 -61 63 80 4 -73 -97 -64 28 96 57 -57
3500 -57 -104 -45 15 69 75 21 -84 -64 32 104 52 12 -18 -41 -3 85 118 19 -52 -33 16 52 94 74 -24 -74 0 78 54 2
3530 2 4 -27 -45 18 64 18 -48 -48 -24 2 11 51 -4 -75 -62 14 36 9 -20 -40 -53 -29 26 31 -27 -47 -22 -13 12 28 19 -14 -48 -20
3564 -20 25 38 20 -7 -9 -6 9 32 30 17 -17 -10 17 27 35 39 22 -13 -8 26 43 16 5 8 -5 -17 7 45 11 -21 -23 -7 -20 -8 27
$$ packed form
3370F4j64p4R7J52J4p2q4o4J5J31J12m7j68o5P4R9Q3Mj02j32KJ48J24l4r9q3l0
3397i9R2J40M0j35j31J4J00J03K2o7j26p4R0J43O0j02j41l2M7J16P6n3j48r2O9
3422h8J48N6m3j14j04J8J26J20k0j30j16K1J13R4J8j06j30k0J34J22Kp6j12l8
3446a25P2J43N1q0j21o1P6J26N5n1j12n7L7J01R6m4j16r0M3J00Q0j6r6j05KJ14
3472B2Q9k6q7p2j9Q2R0K9j07j10LQ7O6L5n1j08o0P6J24J7p6p7k4L3R2O8l9j14
3500e7m7N9O0N4On4j05K0R6P2n2m0l0k3L8Q8L3r9p1J9M9L6M2k0r8n0P4P8k4n2
3530BKl1j8O3M6m6o6%K4K6RM0n5p1J3P6K2k7k9k0j3K4N5Nn8k0K5RK5J6rl3l4K8
3564b0M5J3j8k7kLJ5K3kj3l4PK7J0QMj7l5NL4J7k7j1Lj3j2K4L8l4l2kJ6j3J2L5
$$ plain form
3599 27 -1 -53 -43 1 -13 -6 6 -20 -54 -31 22 25 -2 -13 -13 -39 1 47 37 -26 -35 8 4 3 55 44 -51 -41 42 48 29 27 8 -25
3633 -25 -30 55 74 -4 -22 11 0 -6 55 59 -47 -71 7 49 13 13 14 -61 -68 39 82 8 -41 -23 -25 -45 40 84 -16 -99 -40 30
3665 30 24 30 49 -28 -94 -25 86 49 -20 -22 -28 -56 15 111 54 -56 -59 4 27 47 71 21 -77 -54 61 75 24 7 -21 -46 3
3696 3 97 90 -29 -56 -19 -2 28 70 23 -80 -76 34 60 25 14 -29 -82 -45 71 81 -19 -57 -43 -40 13 83 54 -76 -83 -4
3726 -4 33 32 45 -3 -89 -74 60 90 7 -17 -22 -54 -19 85 95 -41 -82 1 28 -2 51 56 -76 -94 35 92 12 6 6 -42 -60
3757 -60 45 110 -13 -88 -17 20 -8 25 67 -20 -112 -13 82 37 -30 -3 -27 -60 12 106 35 -81 -49 24 4 10 71 16 -81
3786 -81 -34 71 67 7 8 -9 -48 -13 94 58 -24 -45 0 20 22 58 17 -42 -47 29 52 16 9 -15 -46 -18 59 43 -23 -33 -26 -6
3818 -6 21 47 5 -67 -42 6 20 5 15 -1 -50 -14 62 45 -23 -26 -2 -14 16 69 28 -45 -36 38 45 15 14 18 -59 -28 55 78 -2
$$ packed form
3599B7k8n2J0M4j4PJ2k6l4K3N3Lk7j1%k6M0M6j0o3rM3mjN2j1r5J0Q3Oj9kj9l3
3633b5nQ5J9p8j8L3j1oO1Mj06k4P8M2l6%Jp5pJ07M3p4m9J8kk0Q5M4j00q3N9P0
3665C0oOJ9p7o6O9J11l7o9kok8P1R6n7j10lO3K3K0K4n0r8K3J15J4n1j7k8k5M9
3696CR4pj19k7L7J7L0M2m7j03MJ10K6l5j1m3n3L7J16J0j00l8J4LN3P0k9j30pP9
3726dL7jJ3m8q6J5J34L0q3k4nl2L5J04J0j36m1Q3K7l0N3Nj32j8J29N7q0o%m8j8
3757f0J05O5j23p5P1L7k8L3M2q7r2R9R5m5o7K7k4l3P2R4p1j16L2P3k0OO1n5r7
3786h1M7J05mo0Jj7l9L5J07l6q2k1M5K0KL6m1n9nP6K3l6pk4l1K8P7j6o6j0PK0
3818fK7K6m2p2K5M8J4j5J0j6m9L6P6j7o8lK4j2L0N3m1p3RP4Pl0jMp7L1Q3K3q0
$$ plain form
3851 -2 -35 -1 5 5 67 39 -29 -47 3 44 20 13 -12 -45 -39 36 62 13 -44 -37 -39 3 30 31 -41 -71 -22 18 26 22 -3 -52 -58 16 60 17
3887 17 -13 -23 -56 -11 66 65 -21 -60 -1 12 31 42 43 -47 -59 28 88 38 1 -4 -54 -41 60 95 2 -73 -27 10 5 36 54 -36
3919 -36 -109 -13 72 47 -10 -23 -54 -68 7 76 23 -65 -67 -38 -8 26 49 -8 -93 -73 26 58 11 -5 -44 -60 -13 67 65 -13 -54
3950 -54 -37 4 40 71 20 -38 -44 9 49 53 39 -19 -70 -6 57 57 13 -15 -43 -44 20 76 22 -43 -53 -22 11 41 47 -11 -84 -62 24
3983 24 49 1 -27 -17 -75 -36 47 45 -38 -75 -38 0 9 40 33 -52 -63 -15 46 30 -1 -10 -38 -37 36 75 35 -29 -14 13 21 44 67
4016 67 19 -31 -32 37 61 37 10 -21 -12 16 42 32 7 -21 -31 3 21 34 9 -22 -33 -8 4 3 1 -31 -33 -17 -13 -13 -5 -1 -33 -48 -11
4051 -11 22 6 -32 -21 -7 -18 -2 34 11 -31 -23 13 9 1 24 25 -9 -9 9 30 17 18 25 1 -4 30 51 28 3 -2 11 11 11 30 32 -14
4087 -14 -31 -1 26 17 3 -13 -17 -33 -5 27 15 -22 -53 -29 -5 -2 6 -7 -51 -58 -24 22 7 -19 -35 -32 -34 13 56 22 -44 -65 -2 42
$$ packed form
3851bl3L4O%O2k8o8j8N0M1k4pk5l3OP5K6m9n7PkM2K7Jp2l0M9M0Qmk5m9oP4M4m3
3887A7l0j0l3M5P7jq6l9N9J3J9J1Jr0j2Q7O0n0l7nn0J3J01L5r3p5M6L7nL1J8r0
3919c6p3R6Q5k5n7j3l1j4P5O9n3q8kK9L0L4K3n7q5K0R9L2m7j6l9j6M7Q0kp8m1
3950e4J7M1L6L1n1n8oN3M0Mj4n8n1O4O3%m4k8k8jO4N6n4o5j0L1L3L0On8p3K2Q6
3983B4K5m8k8J0n8L9Q3kq3l7L7L8RL1pq5j1M8O1j6l1rk8JP3L9m0o4J5K7QK3K3
4016F7m8n0jO9K4k4k7l1RK8K6j0k5k8j0L4J8J3k5l1j1K5J2jkl2kJ6M%QMl2j5L7
4051a1L3j6l8J1J4j1J6L6k3m2QL6mqK3Jl4%J8K1j3JPk4nL4K1k3k5nJ3%%J9Km6
4087a4j7L0K7rj4j6mj6K8L2j2l7l1K4K4LQj3m4pL4M6j5k6j6LkM7M3l4o6k1O3M4
$$ plain form
4121 42 38 24 17 -38 -39 37 91 44 -16 -18 -8 16 56 85 24 -46 -53 29 66 44 23 -38 -59 -29 64 72 -3 -68 -60 -10 24 57 34 -55
4155 -55 -120 -55 43 69 1 -51 -85 -71 -8 56 42 -41 -93 -65 14 59 53 -6 -76 -85 11 83 78 0 -64 -62 5 62 108 53 -49 -89
4187 -89 -4 104 113 38 -32 -64 -33 61 125 71 -40 -85 -13 49 82 58 -16 -104 -87 37 104 44 -47 -93 -64 -24 73 74 -24 -128
4217 -128 -108 13 62 48 -5 -75 -121 -43 68 92 -14 -94 -94 -31 31 89 49 -62 -127 -43 78 104 35 -23 -64 -53 37 123
4245 123 98 -39 -96 -24 60 88 94 20 -74 -89 18 115 81 -4 -64 -59 -32 68 99 6 -94 -99 0 69 59 15 -56 -113 -63
4274 -63 55 94 8 -88 -106 -53 12 77 45 -65 -122 -61 47 88 45 -49 -99 -71 26 103 77 -6 -80 -50 22 80 83 16 -53
4303 -53 -57 10 81 107 13 -49 -50 17 56 78 45 -35 -74 -31 67 81 6 -37 -49 -39 17 72 40 -68 -107 -28 39 40 20 -25 -68
4334 -68 -95 0 80 20 -58 -65 -30 -22 46 70 -22 -100 -63 38 62 18 5 -20 -67 -12 61 73 -1 -44 -25 9 43 58 46 -27 -50
$$ packed form
4121D2mj4pn5jP6N4m7o0kJ0K4M0K9o1p0pQ2L7k2k1o1k1L0R3Qp5o5QN0L4L3k3q9
4155e5o5O5R8K6o8n2l4J4O3O4j4q3n2K8P9M5on9p0rR6P2np8o4KO7N7M6n5j02m0
4187h9Q5J08Rp5p0l2L1R4O4n4j11m5P2O2L3k4p4q8J7J24O7o0r1m6K9M0R7Jr8j04
4217a28K0J21M9j4n3p0m6P8J11K4j06q0%O3O2N8m0j11o5Q4J21K6o9n8m1J1R0Q6
4245A23k5j37n7P2Q4K8Op4r4j5J07R7l4q5o0NK7J00L1r3j00nR9O9j0m4p1n7N0
4274f3J18L9q6r6j8N3O5O5l2j10n7O1J08M1m3r4n0K8R7P7k6q3p4L0P2N8Lo7o9
4303e3mO7P1K6r4o2jO7L9K2l3q0l9M3R8J4p5m3j2J0N6N5l2j08l9P9O7Jk0m5m3
4334f8k7R5Q0o0p8pL5QO8K4r2p8L7J01K4m4j3k5m7N5P3J2p4m3J9L4L4J5j2p3k3
$$ plain form
4365 -50 2 61 56 13 -8 -13 -20 17 63 33 -21 -39 -4 31 42 22 -24 -41 -26 17 47 23 -37 -53 -34 21 19 13 7 -49 -43 4 43 8
4399 8 -36 -21 -12 -24 27 34 11 -60 -26 25 30 4 13 8 -36 -14 49 36 -19 -19 4 16 -3 36 25 -21 -42 19 48 8 -14 16 -9 -21
4433 -21 6 42 7 -45 -17 24 8 -1 10 -19 -43 -24 28 6 -22 -16 -12 -17 -3 23 -8 -40 -34 -7 0 21 -3 -14 -30 -8 0 18 15 5
4467 5 -19 -9 17 32 12 -12 -9 5 7 26 28 -10 -27 -3 37 9 6 26 -3 -16 4 52 13 -23 -12 0 6 8 34 7 -33 -27 20 25 -8
4502 -8 -7 0 -20 -26 19 24 -20 -36 -6 11 1 19 15 -22 -29 5 23 3 -6 -3 -16 -14 10 26 13 -28 -14 13 1 3 -3 -10 -10 -1 4 12 12 0 -10
4541 -10 -2 16 9 -8 -3 -3 -10 5 11 7 -15 -13 9 14 -3 6 18 -13 -9 10 8 -23 2 14 -6 -20 -4 18 -10 -23 16 10 -24 -8 16 -1 -4
4578 -4 3 8 -28 -30 34 19 -4 -22 8 -3 -13 12 12 -11 -32 -11 14 3 0 0 -19 -32 -3 14 11 3 -21 -20 -7 15 24 -10 -28 -12 -9 18
4614 18 22 11 -28 -38 -8 16 27 3 -8 -41 -26 26 55 7 -23 -19 -16 1 48 46 -27 -56 -17 19 19 23 11 -39 -48 3 49 17 -14 -42
$$ packed form
4365e0N2N9nm3k1npL7M6l0n4j8L5L5J1k0m6j7J5M3L0k4o0j6J9N5koon6OM7L9l5
4399Hm4J5Rj2N1Pk3p1L4N1Nk6Rnm4K2O3j3n5%K3J2j9L9j1m6k1O1K9m0k2L0k5j2
4433b1K7L6l5n2K8M1j6rJ1k9k4J9N2k2k8OMnJ4K6l1l2OK7PK1k4j1j6K2QJ8lj0
4467Ek4J0K6J5k0k4LJ4KJ9Kl8j7K4M0k8lK0k9j3K0M8l9l6J1J2OKK6k7m0OM7Nl3
4502hJPk0oM5Nm4j6L0J7j0J8ml7pL4J8k0rLj3KK4J6j3m1J4K7j2Kop%RNQ%j2j0
4541a0QJ8pj7N%pJ5Omk2KK2Nj7RJ2l1MJ9kl1K5J2k0j4J6K2k8j3L9ol4J6K4j7l
4578dPNl6kO4j5k3j8L0j1j0K5%k3k1K1K5j1l%j9j3K9J7lqk4JJ3K2Rl4j8J6LK7
4614A8Mj1l9j0L0K4J1k4j1l3J5N2K9m8l0MLJ7M7kp3k9L9L6%Mj2n0rN1M6l2l1k8
$$ plain form
4648 -42 -43 -12 33 43 -6 -69 -46 -4 20 24 15 -21 -62 -21 32 55 12 -44 -58 -41 20 63 39 -34 -70 -17 19 57 57 -28 -68 -44
4680 -44 25 62 34 -3 -55 -48 2 74 50 -11 -52 -38 2 58 57 14 -66 -72 -1 40 50 12 -46 -94 -44 64 73 -2 -61 -58 -42 13
4712 13 84 41 -54 -104 -24 15 50 30 -19 -84 -68 20 90 39 -23 -59 -61 -8 79 81 -17 -98 -67 22 60 65 26 -50 -97 -6 77 80
4744 80 8 -69 -72 -28 63 95 51 -57 -85 -26 38 75 41 -36 -83 -50 34 65 48 -44 -83 -64 30 73 51 -26 -92 -74 5 78
4774 78 71 -17 -82 -81 -15 68 58 1 -81 -84 -6 69 71 6 -52 -83 -39 59 101 36 -62 -59 -19 43 71 57 -29 -83 -45 51 84 48 -11
4807 -11 -73 -56 19 82 70 -16 -74 -62 -2 57 60 5 -72 -74 -3 56 56 -8 -59 -71 -38 40 72 11 -73 -80 -28 28 39 26 -50 -85
4839 -85 -41 39 59 28 -34 -71 -41 33 72 44 -22 -59 -36 22 67 44 -17 -54 -49 22 59 55 10 -52 -38 13 57 49 21 -46 -59 -20
4871 -20 34 59 5 -58 -55 -20 3 43 20 -30 -57 -39 25 33 -1 -30 -55 -59 -6 38 7 -41 -62 -22 -1 21 16 -2 -47 -45 3 37 24
$$ packed form
4648d2jL1M5J0m9o3K3M2K4Mrl6m1M1N3K3m3n6j4J7O1M3k4p3l6N3L6L8%q5m0K4
4680d4O9L7k8l7n2PN0P2k4o1m1J4M0N6jm3q0oP1M1J0l8n8m8N0J08Rp5n9LJ6N5
4712A3P1m3r5n0Q0L9L5k0m9o5J6Q8P0n1o2l6kN3Q7Kr8q1L1Q9L8Nl9p6m7R1Q3L
4744H0p2p7lM4R1L2m4j08k8N9O4L7l4p7m7L3Q4L1j7r2l9J9R4M3k2p7o6J8P9P3
4774G8pq8o5JO6Q3j0n7q2lP8P5Ko5n8l1M4R8M2o5r8LM0O2K8j4q6n4L8R6L3l6n9
4807a1o2J7P5O3j2q6n8J2O0N9Ln5p7kP1N9%o4n1j2L3P8L2o1q4pN2N6J1j3p6l5
4839h5M4Q0K0l1o2l7L0P4L9k8o6l7K3N8M5k3o1l7NP1L7mm5o2J4N1M4qk8o7j3L9
4871b0N4K5n4o3LL5K3M0k3n0k7J8O4Ql4k9k5mN3M4l1m8k1M0K1K2nj8m5KM8L4j3
$$ plain form
4904 24 -7 -21 -28 -12 24 52 2 -32 -21 13 35 25 15 -11 -32 2 43 28 15 -5 -25 -7 15 32 22 -12 -30 -9 10 9 1 -12
4936 -12 -28 -34 -3 6 -9 -23 -31 -9 -16 -6 -2 -3 -23 -26 -14 -11 -6 -16 -13 -27 -9 -9 4 -7 -6 -4 -13 -4 5 15 5 -7 9 22 16 15 8 26 9 12
4976 12 8 5 11 10 5 17 6 10 -5 8 13 2 3 2 -3 2 -7 14 -13 -8 -6 -6 4 -18 -13 -12 -7 -5 -9 -10 -19 -31 -6 -6 -15 -8 -2 -27 -15 5 20 -6 -18
5019 -18 1 1 -5 22 16 -11 -18 -4 18 23 17 19 5 -11 -2 26 30 17 -6 2 15 19 32 17 -22 -14 5 22 12 -3 -17 -7 -13 -5 13 -5 -19
5056 -19 -19 -7 -11 -4 5 -24 -38 -22 29 9 -13 -28 -25 -22 -14 17 -1 -17 -17 -20 3 24 10 -5 -18 -14 8 19 22 0 -9 1 16 22 32 11 -5
5093 -5 4 25 32 23 2 3 -5 9 23 33 14 -6 -3 4 18 15 -4 -17 -15 -14 6 13 -3 -33 -27 -11 -8 9 -17 -29 -33 -16 9 -3 -15 -31 -26 -9
5131 -9 11 15 10 -24 -27 3 9 17 -3 -7 -26 -2 28 28 -3 1 -13 10 17 40 20 -9 -10 -1 30 24 11 -7 -15 2 12 29 12 -20 -26 -20 15 22 -2
5170 -2 -18 -29 -15 3 22 17 -17 -44 -29 4 13 5 -8 -28 -27 4 20 15 -5 -49 -35 -10 26 23 2 -27 -30 -4 25 29 2 -26 -25 1 36
$$ packed form
4904B4l1j4pJ6L6K8n0l4J1L4K2j0j0k6k1L4M1j5j3k0k0J8K2J7j0l4j8K1J9jqj3
4936a2j6oL1Rj5j4qK2pJ0Mjk0lJ2LNj0Lj4J8%J3j1JKrRRJ0j0j2J6J3ojpJ8j7L
4976A2mlOjnJ2j1Mj5J3Nj1JjnNrK1k7NK%J0k2NJNKmjrj2K5%rPOk5J2K0J5k6j2
5019a8J9%oK7ok7pJ4K2NoKj4j6RK8Mj3k3QJ3MJ3j5l9QJ9J7j0j5j4J0oQJ8j8j4
5056a9%J2mPRk9j4J6N1k0k2j5LLQL1j8j6%lK3K1j4j5j3MK2J1Lk2rJ0J5OJ0k1j6
5093eRK1Prk1JqJ4J4J0j9k0LPJ4lj9j3KJK0Pj6l0OJ6LJ7k6j2mJ7K5j2j2j6NJ7
5131iK0Mnl4lL0OQk0mj9K4L0%l1Mj4K3PK3k0k9jRL1oj3j8qJ7J0J7j7l2oOL5Pk4
5170bj6j1J4J8J9nl4k7J5L3Rqj3k0JL1J6nk0m4J4K5L6lk1k9lK6K9Mk7k8JK6L5
$$ plain form
5205 36 46 6 -27 -29 0 37 59 21 -19 -30 -5 23 58 23 -3 -34 -31 35 45 26 -19 -47 -26 7 37 46 -31 -52 -34 -1 32 17
5237 17 -5 -43 -47 -6 25 17 -35 -44 -49 -9 26 42 -2 -51 -54 -7 18 37 7 -33 -49 -12 30 42 15 -18 -32 -30 35 60 34 -23 -46
5270 -46 -11 9 49 43 -6 -45 -39 33 49 20 -5 -37 -36 3 51 47 -13 -54 -48 -10 35 60 -1 -48 -60 -13 27 35 1 -39 -54 -26 31
5303 31 44 7 -54 -43 -24 6 30 23 -23 -56 -33 19 46 28 -15 -44 -36 7 52 32 -4 -38 -31 11 40 47 5 -57 -46 1 34 42 -3
5336 -3 -41 -43 -3 33 40 4 -22 -47 -23 29 38 7 -23 -48 -20 10 36 18 -14 -57 -22 11 18 12 -12 -48 -37 3 26 2 -14 -32 -43
5369 -43 -13 29 25 0 -54 -46 -4 24 23 5 -24 -45 -10 30 33 7 -19 -27 -16 14 41 24 -18 -31 -6 18 29 32 1 -38 -18 7 27
5402 27 18 7 -24 -20 -1 22 18 -6 -20 -8 -5 7 23 5 -19 -32 -15 3 5 1 -12 -32 -16 7 20 -5 -14 -21 -18 -7 7 8 -23 -28 3 12
5438 12 -10 2 3 -13 -23 -5 11 2 -3 7 -4 -15 10 5 -2 -20 -13 2 -4 3 2 1 -8 -12 -5 6 -1 6 -4 -14 -5 8 9 -15 -9 -5 -11 -21 8 5 -11
$$ packed form
5205C6J0m0l3kK9L7K2l8m0j1K5K8L5l5k6l1LO6J0j9m5k8K1L3L0Rp7k1J8L3L3j5
5237A7k2l8mM1L1qn2rnM0L5J6m4m9lM7K5J9l0m0j6L7M2J2k7l3j4KO5K5k6n7k3
5270d6L5K0M0om9l9OP2J6k9k5l2JL9M8mo0m1OL8M5K5o1m7j2M7M0Ql4m0j5K8N7
5303C1J3l7o1J1J9L0K4pm6l3K3N2K7j8m3k9QM3M5k0l6l4PM2K9Pm2o2J1M7L3Qm5
5336cl8kM0L6Pl6k6k5K4N2Rl1l0k5K8L0K6j8l2m3L5L3Pok4l6J1M0K3k4j6j8j1
5369d3L0M2mk5n4QM2K8jj8k9k1L5M0Lk6k6qJ1L0K7j7m2j3K5K4J1Ll1l9K0K5K0
5402B7rj1l1MJ9K3mk4j4J2LJ2J6j8k4j3J7J8Kmj3k0J6K3J3k5rpLJ1J4Jl1nL1R
5438A2k2J2Jj6j0J8J6rnJ0j1j1K5npj8PJ5oPjjrmPJ1pPj0j0RJ3Jk4OMoj0K9lj6
$$ plain form
5479 -11 -8 -7 7 0 2 -7 -8 -16 -4 -11 -17 2 -7 -16 -24 0 2 0 -7 -19 -29 -8 1 10 4 -6 -8 -8 6 29 6 -10 -5 1 11 1 9 11 -6 -23 0 16
5521 16 11 -10 -11 1 1 16 28 6 -11 -12 -1 11 11 9 -7 -35 -11 12 14 -7 -27 -22 -24 -9 12 7 -15 -36 -30 -1 8 3 -17 -29 -32 -17 7
5558 7 5 3 -35 -32 -3 -5 4 -9 -7 -35 -17 10 27 -3 -22 -19 -10 -1 23 18 -17 -35 -10 22 29 16 9 -6 -17 16 24 16 -3 -12 -9 -2 24 23 -3 -30
5598 -30 -41 6 19 2 -5 -20 -24 -28 7 21 -16 -46 -27 0 9 4 3 -22 -43 -31 10 17 -5 -26 -33 -23 -8 17 13 -7 -19 -4 10 21 14
5633 14 -15 -17 -19 15 24 30 -2 -22 -7 11 22 23 19 -8 -10 2 25 22 10 -5 -19 -5 -1 23 10 -22 -27 -10 3 -9 9 -22 -26 -18 6 6 -3
5670 -3 -25 -28 -13 9 0 -4 -19 -34 -22 0 17 -15 -33 -19 -18 0 -2 9 -4 -36 -8 27 18 11 -16 -9 -3 2 23 13 -14 -6 5 28 20 3 7
5707 7 -11 -13 12 41 12 -20 -2 8 -9 -5 13 -1 -28 -20 -2 16 -12 -16 -17 -18 -12 2 14 -27 -30 -21 -11 -18 -2 -7 -27 -37 -9 18 10 -24 -27
5744 -27 -20 -11 1 15 5 -12 -14 -4 16 5 4 -2 -5 -5 13 30 -6 -8 -10 8 7 24 14 -11 -25 -5 7 26 3 -17 -16 -8 6 10 15 -18 -35
$$ packed form
5479a1LJJ4pKrjqJ2poJ9rrqK4Kkpj2j0K1RRoj0k%J4K3k3j6NOJ0j0QKj7j7K3J6
5521A6nk1jJ2%J5J2k2j7jJ1J2%kj6k8K4K3Kk1k0NkJ5K1nk2k1OK9Rnk0j2lJ5K4
5558Gkkl8LK9kRj3Kk8J8K7J7l0j9LRRK4nl5j8K5L2Pj3pj5j1L3Qqj9rLPK6jk6k7
5598c0j1M7J3j7pj5mmL5J4l7l0J9K7Rnjk5k1J2M1Pk2k1pJ0J5K5mk0j2J5J4J1p
5633A4k9kkL4ROl2k0J5J8J1Jmk7kJ2K3lj2j5j4J4MK4j3l2nJ7J3j2J8l1mQK4%r
5670ck2lJ5K2rmj5j5J2K2J7l2j8J4JJ8kJ1j3l2K8L5rpk7PONK1j0k7QJ1K3qj7M
5707Gj8kK5K9k9l2J8J0j7MJ8j4k7QJ8J8k8mjjOJ4J2m1lRJ0pJ6nk0j0K8K7ql4l
5744b7PRJ2J4j0j7kJ0K0j1jol%J8J7l6kkJ8jJ7j0k5j4K0J2J9k3k0JQJ4MNl3j7
$$ plain form
5781 -35 -25 16 15 -4 -9 -36 -26 -13 -2 -2 -14 -35 -30 -11 -4 -2 3 -30 -44 -9 29 11 -17 -20 -26 -5 23 31 13 -17 -12 -1 33 19 12 -9
5817 -9 -25 -4 29 41 3 -14 -20 8 16 22 22 -2 -9 -9 7 30 5 -11 -22 -12 3 -4 9 -14 -29 -21 -4 13 3 -17 -28 -39 -17 -2 9
5852 9 -19 -28 -27 -27 -5 9 -6 -28 -24 -11 11 15 2 -14 -16 -10 11 20 6 -9 -22 -9 12 34 23 -1 -8 -4 19 19 23 -4 0 0 4 19 17 -3 -8
5891 -8 -12 2 14 15 3 -16 -11 -11 10 0 4 -23 -26 -8 -8 -4 -4 -22 -28 -18 -11 -5 -14 -24 -23 -11 -6 6 -3 -18 -26 -19 6 2 -2 0 -13 -5 0 21 -2 -11 -5
5934 -5 5 4 7 10 11 -2 -18 5 12 10 12 9 20 -4 5 8 1 -11 6 -14 -7 -12 -11 -11 -10 -19 -8 -4 -14 -13 11 -8 -20 -11 -11 -18 -14 -4 7 -16 -18 -9 -2 -5
5978 -5 -7 -9 0 -1 5 1 -3 9 -1 3 14 5 6 7 -9 9 11 15 5 2 -2 -6 17 17 14 4 -10 9 12 22 -4 0 -3 -7 8 12 0 -20 -24 -14 -1 16 5
6021 5 -5 -18 -5 -7 3 13 -12 -12 -22 -3 3 -10 -9 -16 -24 -11 -2 5 5 -8 -23 -15 -1 5 13 -11 -4 -2 9 13 19 5 -6 -10 12 29 20 8 -8 -14
6061 -14 2 25 28 2 -7 -3 -5 23 18 7 -12 -13 -11 6 20 -5 -7 -17 -2 -4 26 2 -15 -16 -10 12 16 -2 -16 -28 -10 -1 13 9 -15 -34 -19
$$ packed form
5781c5J0M1jj9nk7J0J3J1%j2k1NJ9PKNl3j4L5L8j8k8loK1K8Qj8l0NJ1L4j4pk1
5817ij6K1L3J2l8j7oK8QO%k4p%J6K3k5j6j1J0J5pJ3k3j5QJ7J7j0k0j1j1K2J5J1
5852Ik8rJ%K2J4j5k2MJ3K2Mj3j6kOK1Rj4j5j3J3K1K2j1k4pMK3%Mk7M%MJ5kk0n
5891hmJ4J2Jj2j9N%K1j0Mk7lJ8%M%j8oJ0POrj0JJ2NJ2rj5qPK5mmKj3QNK1k3rO
5934eJ0jLLJj3j6K3PkKlJ1k4RLpj2J7k0PnJ%JrJ1Mj0JK4j9j2R%pMJ0J1k3kRPl
5978ekkRjOmmJ2j0MJ1rJJj6J8KMj0lmmK3%lj0j4J9LJ0k6MlmJ5Mj2k0mJ0J3J7j1
6021Ej0j3J3kJ0J0k5%j0J9Oj3JpqJ3RP%j3j5QJ4OQk4PKJ1MOj4j1mK2J7rj2j6o
6061a4J6K3Lk6rMkK8nj1j9jKJ7J4k5kj0J5kL0k4j7jOK2Mj8j4j2J8RJ4mk4j9J5
$$ plain form
6098 -19 1 13 14 0 -24 -20 -4 11 17 10 -19 -15 5 20 18 10 -7 -9 11 18 16 6 -4 -29 -7 23 31 23 -12 -7 -1 2 14 16 -6 -23 -19 2 11
6137 11 -2 -8 -18 -35 -9 18 11 -3 -24 -19 -19 10 10 -3 -34 -34 -12 7 9 -7 -18 -25 -1 8 6 4 -12 -12 -7 12 14 4 3 -5 -6 2 7 10 7 -18 -10
6178 -10 5 9 31 10 1 -7 -7 21 10 -1 -9 -4 2 10 18 0 -20 -17 1 9 2 11 -5 -11 -5 1 3 5 -3 -10 7 10 8 -3 -3 -20 -6 4 -7 0 7 -19 -9
6221 -9 4 11 4 -5 -2 -12 10 2 6 1 -2 -2 1 15 1 9 12 3 4 8 13 13 3 -1 6 0 12 9 -10 -1 4 5 7 10 7 3 13 -1 -4 -9 5 1 0 3 7 -6 -5 -10 -10
6270 -10 -4 6 -5 -22 -13 -3 -11 -3 -12 0 1 -3 -1 0 -4 -9 1 10 16 2 7 -2 6 11 -2 6 -1 4 24 14 5 6 2 3 -4 13 13 5 4 -3 7 4 8 0 -13 -1
6316 -1 1 0 9 12 -16 -4 -8 -3 2 4 -12 -3 -16 -10 0 -5 -9 -13 -10 2 2 -8 -4 -19 -12 1 -2 -3 -11 -6 -13 -1 8 9 -5 -9 -2 -6 -5 7 8 -10 -7 5 12 7 5
6363 5 8 -21 0 13 15 2 -3 -15 8 -2 7 -5 -4 -14 -8 7 7 11 2 -21 -10 -9 7 0 -13 -19 -17 -5 -10 7 -14 -14 -22 -6 -7 -4 -9 -6 -5 -6 -4 1 7
6406 7 -3 -10 -5 -6 9 6 -3 3 -6 -2 13 21 4 5 7 7 12 15 9 0 -4 7 13 6 4 -1 7 2 13 9 0 -6 -11 -4 10 -1 -9 -3 -14 -4 -2 4 -17 -18 -19 -11 -4 -20 -3
$$ packed form
6098a9K0J2Jj4k4MJ6J5Opk9MK0J5kqj7kK0Pkj0j0k5K2L0Qql5NOLJ2Kk2j7MK1R
6137A1j3oj0j7K6K7pj4k1N%K9%j3l1%K2J9Kj6j1pK4Rkkj6%NJ9Kj0jqjQNLlk5Q
6178a0J5MK2k1rq%K8j1j1qNOQQj8k0LJ8QpRj6oOOKKqpJ7Lkj1%j7J4J0j1PPk6J0
6221iJ3PprLj0K2qMnl%LJ4j4QLrJMN%j0mPoJ2lj9RNJKLlmJ0j4lnJ4mjLMj3Jn%
6270a0OJ0j1j7RJ0qQrJ2JmKJmnJ0ROj4NrQNj3QpNK0j0rJmJpJ7%qjpJ0lMqj3J2
6316aKjRLk8J2mNNKj6Rj3OJ0nmmLJ2%j0Mj5PJ3ljqNpJ2RJj4mPmJJ2Jj8LJ2Pnk
6363ELk9K1J3Kj3nj2K3j0Rj2Jj0OJ5%Mrk3J1JJ6pj3oKJ2nJ7k1%qJ6jLnLJjKNO
6406Gj0pNjJ5lrOrMJ5Qj7JK%NLormJ1OpknQnJ1mronPJ4j1qOj1J0KOk1jjQPj6J7
$$ plain form
6455 -3 -12 -16 -16 -10 -20 -4 -4 -7 -3 -6 -9 -10 -5 -3 2 9 7 5 2 5 -12 5 8 8 3 5 9 6 10 4 5 2 4 20 15 3 6 4 19 13 14 -1 6 -6 9 4 10 11 2 3 8
6506 8 12 -13 4 -9 -6 3 -3 -6 -14 -13 -6 -17 -5 7 -5 -12 -8 -14 -1 2 -10 -7 -9 -3 -6 2 -4 4 -7 -3 5 2 5 -5 -3 4 7 8 7 1 -1 9 9 6 6 -2 -4 -4 2
6555 2 22 4 -3 -8 -10 2 -2 11 -12 -24 -13 0 -10 -1 -9 -9 -22 -16 1 -6 -9 -23 -11 -10 4 0 -2 -6 -17 -5 10 9 -1 3 1 -6 4 9 2 1 1 2
6597 2 6 10 20 -3 3 1 12 25 4 7 -4 -4 21 12 18 3 7 -8 -5 17 22 4 -11 -16 -1 3 8 3 -12 -9 -17 0 -8 -9 -19 -26 -12 -6 -4 -3 -17 -17 -19
6640 -19 -7 2 -2 -3 -14 -13 -14 6 16 11 -6 -8 -11 8 9 10 6 -2 -3 14 25 15 9 -4 15 21 15 12 -1 3 3 -3 13 14 -19 -8 -10 -1 12 6 8 -3 -12
6683 -12 13 9 -7 6 -9 -23 -14 -18 -4 -1 -21 -9 -1 -6 -3 -7 0 -23 -8 -5 -2 -1 -6 -10 -6 15 4 14 4 -10 1 13 14 14 13 -5 2 3 11 17 19 13
6725 13 2 3 9 12 -5 -3 4 2 4 14 15 1 8 -1 -3 12 1 -2 -10 -7 -2 -19 -1 -3 -18 -4 -12 -9 2 1 -9 -17 -7 -12 0 4 -13 -10 -7 -14 -6 1 -5 -14 1
6770 1 -2 13 19 11 5 -1 2 2 24 9 11 0 11 5 12 17 10 11 2 8 23 14 -6 1 2 4 -2 -14 7 -6 -5 -8 -4 -10 3 -3 -18 3 -6 -7 -5 -18 -14 -9 -11 -9 -8
$$ packed form
6455crm%Oj0J6%lMlljNKNPkklLj7J7L%nKMlMoJlKJ6nj2LkJ5oJj5Pj2J5nOJrJN
6506HMk5J7j3LRolqJPj1J2J2j2pMoJ3Lj2LkOlQoQj1MQlLj0KPLJjokJ0%l%qk%O
6555BK0j8pnkJ2mJ3k3j2J1J3j0Rq%j3OJ7plj4J2JJ4mkmj1J2J5jj0MkpJ0Npj%J
6597BMMJ0k3OkJ1J3k1Lj1%K5rOj5Mj5LK2Nj8j5nJ5MNnj5LqJ7qjj0pJ4OKJj4%k
6640a9J2Rmjj1JjK0J0nj7klJ9JJmqjJ7J1j0oj3J9Oolj3M%oJ6Jl3J1kRJ3oKj1r
6683a2K5mj6J3j5j4RmJ4Lk0J2QnLmPk3J5LLJnmMK1j1J0j0j4J1J2J%jj8PJQOKo
6725A3j1JOLj7KPkKJ0Jj4PrkJ5j1lqLNj7J8kj5J4qLJ1jj0qJ0nJ2Mj7LLpQPorJ5
6770AlJ5OqooL%K2j5Kj1J1oPNpJrOJ5rk0PJKoj2K1j3JlMoJ3oj5K1rjKj3MNkKJ
$$ plain form
6817 -8 -11 -6 -19 2 -2 -5 -5 -14 0 2 0 0 -3 -2 -3 4 11 12 -4 11 10 11 6 5 18 -7 9 9 9 5 14 12 8 0 -3 18 2 -1 -12 0 -12 -10 -1 3 -13 -7 -7
6864 -7 6 3 -9 -12 -17 -17 -7 -7 -7 -17 -19 -12 -5 -9 1 -2 -6 -9 -3 -13 -7 -8 7 1 7 9 3 9 -8 -3 3 0 11 18 5 0 14 -5 8 12 3 7 5 8 17 12 1
6911 1 5 -1 14 10 -1 6 -6 -7 2 7 -3 -4 -3 -2 -1 -16 0 -11 -18 -6 -13 -16 -13 -10 -17 -13 -9 -6 -7 -4 -13 -25 -14 2 1 -4 0 -3 -9 -4 -6 1 3 1 -1 -2 1 -2 -8 16
6961 16 6 5 15 7 8 4 4 5 -9 5 8 10 1 0 -2 -3 14 -13 0 -8 4 6 0 -11 0 -7 3 -7 -2 -7 3 -7 -1 -8 -10 -3 2 -12 0 -5 -3 -10 -5 -1
7005 -1 -3 -8 -3 -2 -8 -6 7 7 4 -2 5 9 -3 1 -3 -2 -1 3 -1 16 7 4 -3 6 11 -7 -5 -1 11 -3 8 -3 8 -13 1 -4 -9 4 -2 -4 -15 -12 -6 -14 -13 -8 -4 -12
7053 -12 -12 -5 -9 -21 -5 -15 -9 -4 -8 -16 -8 -4 -7 -5 -17 -4 0 -3 -9 12 7 2 -4 6 4 3 4 -7 2 4 13 -2 8 -1 9 9 -2 5 14 3 13 -6 4 -8
7097 -8 6 6 6 6 6 -1 6 0 -16 -15 -10 -8 -1 -6 -1 -20 -2 -1 -12 -8 -10 -12 -7 -5 -7 -4 -10 -16 -10 -8 7 1 -14 0 -5 -2 3 0 5 1 -11 2 1 3 11 8 15 11 10 20
7147 20 5 8 12 6 4 5 15 2 -3 -5 12 -2 -6 -8 -4 3 10 2 2 4 -4 -5 -3 -6 11 7 4 -9 -15 1 2 -3 -1 -11 -2 0 3 1 1 -11 -13 -2 3 1 -4 -3 3 -7
$$ packed form
6817hlNj3K1ml%rJ4Kk%lJjPPJj6J5jJnjJ3k5J6%%mRkmqlK1j6lj1J2j2KRMj6O%
6864gJ3lj2ln%J0%%j0kPPmJ0lmlOj0OjJ5oOKoOj7NOlJ1Pj3nJ4j9J3MrMkLRnj1
6911AMoJ5mj1Pj2jRNj0jJJJj5J6j1pJ2plLLpMMLjLrj2J1J6jnMloNkPKkkjLloK4
6961A6j0jJ0qJm%Jj4J4LKrjkjJ7k7J3qJ2Koj1J1pJ0j0NnJ0j0OpkPNj4J2nKpNM
7005aknNJoKJ3%loPMj2MmJJMmJ7rlpRNj8KMJ2j4J1j1J1k1J4nnJ3okj1LOqJNMq
7053a2%Pmj2J6j0ONmqQMlKj2J3MloK1nnoJ0kjJj1RKRj5J0rJ0%j1PRj1J0j9J0j2
7097hJ4%%%%pPoj6JNKPnNj9J8Jj1MkkNKkLooOKJ5oj5J4nLNlNmj2J3jKQlPmjJ0
7147B0j5LMokJJ0j3nkJ7j4mkMPPq%KqjKlJ7mlj3oJ6JnKj0RKLk%j2kJ1NknJOj0
$$ [...]
8191a
##END NTUPLES=NMR FID
##END=
