##TITLE=1H_IPEDP2511
 CDCl3, 8 sc, 
 26.11.2020
##JCAMPDX= 6.0         $$ Bruker NMR JCAMP-DX V2.0
##DATA TYPE= NMR FID
##DATA CLASS= NTUPLES
##ORIGIN= UXNMR, Bruker Analytische Messtechnik GmbH
##OWNER= root
$$ XWIN-NMR		Version 3.5
$$ Thu Nov 26 10:43:20 2020 Russian Standard Time (UT+4h)  she@DPX200
##.OBSERVE FREQUENCY= 200.1315066352
##.OBSERVE NUCLEUS= ^1H
##.DELAY= (6, 6)
##.ACQUISITION MODE= SIMULTANEOUS
##.ACQUISITION SCHEME= undefined
##.AVERAGES= 8
##.DIGITISER RES= 18
##SPECTROMETER/DATA SYSTEM= spect
##.PULSE SEQUENCE= zg30
##.SOLVENT NAME= CDCl3
##.SHIFT REFERENCE= (INTERNAL, CDCl3, 0, 15.7039)
##AUDIT TRAIL= $$ (NUMBER, WHEN, WHO, WHERE, WHAT)
$$ ##TITLE= Audit trail, XWIN-NMR		Version 3.5
$$ ##JCAMPDX= 5.01
$$ ##ORIGIN= Bruker BioSpin GmbH
$$ ##OWNER= she
$$ F:/spectra/data/she/nmr/H-F/1/audita.txt
$$ ##AUDIT TRAIL=  $$ (NUMBER, WHEN, WHO, WHERE, WHAT)
(   1,<2020-11-26 10:41:56.89 +0400>,<she>,<DPX200>,
      <created by zg, POWCHK disabled, PULCHK disabled
       configuration hash MD5:
       00 E9 B6 7A A2 85 ED C7 34 08 36 98 17 FE 4E 26
       data hash MD5: 16K
       9D 89 AC D7 D9 1A 6C B5 BE D3 92 D4 D7 B2 97 F2>)
$$ ##END=
$$ 
$$ hash MD5
$$ E5 3D E3 CC F2 AA 63 42 E5 44 71 6A FA 1A 89 A9
##$RELAX= 
##$RELAX= 
##$RELAX= 
##$RELAX= 
##$RELAX= 
##$RELAX= 
$$ Bruker specific parameters
$$ --------------------------
##$DU= <F:/spectra>
##$EXPNO= 1
##$NAME= <H-F>
##$PROCNO= 1
##$TYPE= <nmr>
##$USER= <she>
##$AMP= (0..31)
100 100 100 100 100 100 100 100 100 100 100 100 100 100 100 100 100 100 
100 100 100 100 100 100 100 100 100 100 100 100 100 100 
##$AQSEQ= 0
##$AQ_mod= 1
##$AUNM= <au_zg>
##$AUTOPOS= <>
##$BF1= 200.13
##$BF2= 200.13
##$BF3= 200.13
##$BF4= 200.13
##$BF5= 200.13
##$BF6= 200.13
##$BF7= 200.13
##$BF8= 200.13
##$BYTORDA= 1
##$CFDGTYP= 0
##$CFRGTYP= 5
##$CHEMSTR= <none>
##$CNST= (0..31)
1 1 145 1 1 1 1 1 1 1 1 1 1 1 1 1 1 1 1 1 1 1 1 1 1 1 1 1 1 1 1 1 
##$CPDPRG= <>
##$CPDPRG1= <>
##$CPDPRG2= <>
##$CPDPRG3= <>
##$CPDPRG4= <mlev>
##$CPDPRG5= <mlev>
##$CPDPRG6= <mlev>
##$CPDPRG7= <mlev>
##$CPDPRG8= <mlev>
##$CPDPRGB= <>
##$CPDPRGT= <>
##$D= (0..31)
0 1.2 0 0 0 0 0 0 0 0.06 0 0.03 0 0 0 0 0.0002 0 0 0 0 0 0 0 0 0 0 0 0 
0 0 0 
##$DATE= 1606372916
##$DBL= (0..7)
120 120 120 120 120 120 120 120 
##$DBP= (0..7)
150 150 150 150 150 150 150 150 
##$DBP07= 0
##$DBPNAM0= <>
##$DBPNAM1= <>
##$DBPNAM2= <>
##$DBPNAM3= <>
##$DBPNAM4= <>
##$DBPNAM5= <>
##$DBPNAM6= <>
##$DBPNAM7= <>
##$DBPOAL= (0..7)
0.5 0.5 0.5 0.5 0.5 0.5 0.5 0.5 
##$DBPOFFS= (0..7)
0 0 0 0 0 0 0 0 
##$DE= 6
##$DECBNUC= <off>
##$DECIM= 32
##$DECNUC= <off>
##$DECSTAT= 4
##$DIGMOD= 1
##$DIGTYP= 9
##$DL= (0..7)
0 120 120 120 120 120 120 120 
##$DP= (0..7)
150 150 150 150 150 150 150 150 
##$DP07= 0
##$DPNAME0= <>
##$DPNAME1= <>
##$DPNAME2= <>
##$DPNAME3= <>
##$DPNAME4= <>
##$DPNAME5= <>
##$DPNAME6= <>
##$DPNAME7= <>
##$DPOAL= (0..7)
0.5 0.5 0.5 0.5 0.5 0.5 0.5 0.5 
##$DPOFFS= (0..7)
0 0 0 0 0 0 0 0 
##$DQDMODE= 0
##$DR= 18
##$DS= 0
##$DSLIST= <SSSSSSSSSSSSSSS>
$$ [...]
##$SUBNAM2= <"">
##$SUBNAM3= <"">
##$SUBNAM4= <"">
##$SUBNAM5= <"">
##$SUBNAM6= <"">
##$SUBNAM7= <"">
##$SUBNAM8= <"">
##$SUBNAM9= <"">
##$SW= 16.9725356469052
##$SWIBOX= (0..15)
0 0 2 0 0 0 0 0 0 0 0 0 0 0 0 0 
##$SW_h= 3396.73913043478
##$TD= 16384
##$TD0= 1
##$TE= 0
##$TE2= 300
##$TE3= 300
##$TEG= 300
##$TL= (0..7)
0 120 120 120 120 120 120 120 
##$TP= (0..7)
150 150 150 150 150 150 150 150 
##$TP07= 0
##$TPNAME0= <>
##$TPNAME1= <>
##$TPNAME2= <>
##$TPNAME3= <>
##$TPNAME4= <>
##$TPNAME5= <>
##$TPNAME6= <>
##$TPNAME7= <>
##$TPOAL= (0..7)
0.5 0.5 0.5 0.5 0.5 0.5 0.5 0.5 
##$TPOFFS= (0..7)
0 0 0 0 0 0 0 0 
##$TUNHIN= 0
##$TUNHOUT= 0
##$TUNXOUT= 0
##$USERA1= <user>
##$USERA2= <user>
##$USERA3= <user>
##$USERA4= <user>
##$USERA5= <user>
##$V9= 5
##$VALIST= <valist>
##$VCLIST= <CCCCCCCCCCCCCCC>
##$VD= 0
##$VDLIST= <DDDDDDDDDDDDDDD>
##$VPLIST= <PPPPPPPPPPPPPPP>
##$VTLIST= <TTTTTTTTTTTTTTT>
##$WBST= 1024
##$WBSW= 4
##$XGAIN= (0..3)
0 0 0 0 
##$XL= 0
##$YL= 0
##$YMAX_a= 12122
##$YMIN_a= -29158
##$ZGOPTNS= <>
##$ZL1= 120
##$ZL2= 120
##$ZL3= 120
##$ZL4= 120
##$ABSF1= 10
##$ABSF2= 0
##$ABSG= 5
##$ABSL= 3
##$ALPHA= 0
##$AQORDER= 0
##$ASSFAC= 0
##$ASSFACI= 0
##$ASSFACX= 0
##$ASSWID= 0
##$AUNMP= <proc_1d>
##$AZFE= 0.1
##$AZFW= 0.1
##$BCFW= 1
##$BC_mod= 2
##$BYTORDP= 1
##$COROFFS= 0
##$CY= 11.3945322036743
##$DATMOD= 1
##$DC= 2
##$DFILT= <>
##$DTYPP= 0
##$F1P= 15.9154993809931
##$F2P= -4.1035820241983
##$FCOR= 0.5
##$FTSIZE= 0
##$FT_mod= 4
##$GAMMA= 1
##$GB= 0.15
##$INTBC= 1
##$INTSCL= 1
##$ISEN= 128
##$LB= 0.24
##$LEV0= 0
##$LPBIN= 0
##$MAXI= 10000
##$MC2= 0
##$MEAN= 0
##$ME_mod= 0
##$MI= 1.114404
##$NCOEF= 0
##$NC_proc= 0
##$NLEV= 6
##$NOISF1= 3.799351
##$NOISF2= 2.8
##$NSP= 1
##$NTH_PI= 0
##$NZP= 0
##$OFFSET= 15.70392
##$PC= 1
##$PHC0= -10958.1
##$PHC1= 8.40088
##$PH_mod= 1
##$PKNL= yes
##$PPARMOD= 0
##$PSCAL= 0
##$PSIGN= 0
##$REVERSE= no
##$SF= 200.130013532006
##$SI= 16384
##$SIGF1= 3
##$SIGF2= 2
##$SINO= 400
##$SIOLD= 16384
##$SREGLST= <1H.CDCl3>
##$SSB= 0
##$STSI= 0
##$STSR= 0
##$SW_p= 3612.71676300578
##$SYMM= 0
##$S_DEV= 0
##$TDeff= 0
##$TDoff= 0
##$TI= <>
##$TILT= no
##$TM1= 0
##$TM2= 0
##$TOPLEV= 0
##$USERP1= <user>
##$USERP2= <user>
##$USERP3= <user>
##$USERP4= <user>
##$USERP5= <user>
##$WDW= 1
##$XDIM= 8192
##$YMAX_p= 0
##$YMIN_p= 0
$$ End of Bruker specific parameters
$$ ---------------------------------
##NTUPLES= NMR FID
##VAR_NAME=  TIME,          FID/REAL,        FID/IMAG
##SYMBOL=    X,             R,               I
##VAR_TYPE=  INDEPENDENT,   DEPENDENT,       DEPENDENT
##VAR_FORM=  AFFN,          ASDF,            ASDF
##VAR_DIM=   8192,          8192,            8192
##UNITS=     SECONDS,       ARBITRARY UNITS, ARBITRARY UNITS
##FACTOR=    0.0002944,     1,               1
##FIRST=     0,             0,               0
##LAST=      2.4114304,     0,               0
##MIN=       0,             -29158,          0
##MAX=       2.4114304,     12122,           0
$$ Real data points
##PAGE= N=1
##DATA TABLE= (X++(R..R)), XYDATA
0 0 0 0 0 0 0 0 0 0 0 0 0 0 0 0 0 0 0 0 0 -8 8 -8 8 -8 8 -16 16 -16 16 -24 24 -29 32 -37 40 -48 50 -56 64 -72 80
41 80 -88 97 -109 120 -133 146 -161 177 -196 215 -237 261 -289 319 -355 393 -437 490 -552 627
61 627 -716 833 -984 1190 -1488 1958 -2819 4888 -20076 -19123 -257 -26385 7081 -17872 -17866
76 -17866 2505 -18681 -2897 -8155 -13239 6925 -13151 76 -3461 -10185 11282 -11748 -5582
89 -5582 3322 -10877 12122 -2631 -10441 2153 -9650 1109 -1792 -8939 -312 -7685 -2007 -8862
103 -8862 -12109 -1516 -12266 -4633 -8599 -16890 -734 -10985 -11095 -8398 -17780 -5635 -7165 -10011
117 -10011 -7747 -12540 -6118 -9586 -8710 -5828 -9589 128 -6779 -8445 -2025 -8415 1387 -2583 -6943
132 -6943 732 -4702 2596 -756 -5418 2164 -5069 2517 902 -6062 5785 -4487 -1261 2161 -9634
147 -9634 4891 -1579 -4889 3179 -9929 854 -390 -8039 1988 -8677 -1960 974 -9493 1369
161 1369 -6920 -4908 2022 -10259 724 -2910 -5991 3279 -8866 -1408 207 -5890 3704 -5215
175 -5215 -2138 2596 -5161 3031 -2491 -2464 4308 -3980 2476 -73 -2673 4738 -2931 935 1509 -2503
191 -2503 4289 -1349 -524 2070 -2411 2780 -469 -1297 2241 -1985 1680 -290 -1811 1936 -1664 913
207 913 -4 -1767 1629 -1190 251 199 -1543 1485 -695 11 563 -1395 1540 -486 -149 1000 -1233
224 -1233 1596 -215 -273 1128 -1031 1399 8 -400 1325 -905 1155 378 -817 1653 -746 708
240 708 953 -1176 1699 -364 282 1336 -951 1579 105 53 1536 -641 1447 859 -263 1905 -265
257 -265 918 1638 -365 1830 492 496 1786 87 1467 866 591 1390 339 1322 971 539 1430 174
275 174 891 1182 193 1453 379 404 1048 77 1063 539 462 737 84 824 525 409 930 7 461 761
295 761 41 1085 424 93 864 94 709 883 402 604 430 396 739 798 678 611 427 627 597 909 828 540
317 540 721 503 767 954 871 709 686 604 684 1093 843 825 746 591 720 1042 923 822 861 451 774 840 797
340 797 940 708 582 601 776 710 846 559 421 522 569 679 621 497 259 458 388 652 554 419 514 59 485
363 485 457 439 805 175 294 529 213 828 525 95 802 129 655 830 46 914 201 297 828 126 932
384 932 653 60 687 58 593 994 -11 737 209 288 1005 -80 604 440 185 856 84 370 749 174
404 174 534 257 144 963 451 450 358 97 796 610 370 507 448 563 734 175 408 804 267 785 209 118
426 118 1065 139 429 390 -322 1147 334 -140 822 -692 878 573 -932 1124 -545 499 960 -1399
444 -1399 1065 -67 -261 1331 -1464 705 818 -1006 1672 -1249 67 1638 -1416 1533 -516 -406
460 -406 2191 -1426 820 454 -1136 2187 -1054 -54 1261 -1460 2054 -568 -966 1882 -1445 1396
476 1396 113 -1629 1994 -976 350 726 -1878 1679 -273 -627 981 -1733 1204 335 -1175 1044
492 1044 -1289 702 683 -1429 792 -627 220 831 -1293 335 0 -70 576 -1018 66 223 -13 183
510 183 -908 87 95 54 -175 -908 308 -156 67 -416 -1025 576 -402 -62 -267 -1324 924 -500 -622
529 -622 291 -1728 1114 -159 -1396 905 -1729 832 345 -2040 1247 -1351 245 1038 -2595 1338
545 1338 -638 -761 1734 -2887 1000 431 -1797 2064 -2518 177 1443 -2489 1734 -1666 -782 2158
561 2158 -2717 1061 -565 -1661 2588 -2527 143 619 -2252 2483 -1856 -885 1596 -2281 1783 -865
577 -865 -1651 2021 -1801 831 26 -2060 2097 -1235 -59 703 -2164 1817 -600 -895 984 -1827
593 -1827 1136 -28 -1383 812 -1236 415 195 -1501 504 -822 47 98 -1495 333 -643 -159 -54
610 -54 -1350 252 -520 -211 -224 -1123 333 -476 -133 -221 -1070 668 -491 -200 193 -1197 991 -312 -489
629 -489 682 -1259 1037 -13 -794 1012 -1142 857 311 -1196 1279 -1004 342 849 -1744 1361
645 1361 -552 -436 1334 -1974 978 19 -1130 1441 -1760 372 530 -1624 1314 -1319 -309 1088
661 1088 -1936 994 -650 -985 1485 -1854 441 81 -1381 1411 -1381 -127 605 -1417 1105 -764
677 -764 -556 945 -1302 723 -258 -881 1147 -1083 338 176 -1021 1013 -698 -33 385 -897 725
694 725 -379 -296 483 -772 520 -185 -449 593 -703 337 -34 -536 573 -519 221 60 -486 460
712 460 -395 110 100 -456 450 -340 27 263 -557 489 -282 -157 394 -619 442 -174 -287 408 -587 296
732 296 -74 -409 455 -527 105 113 -605 449 -427 -143 306 -668 395 -256 -297 361 -614 252 -76 -398 357
753 357 -458 51 119 -453 368 -272 -87 295 -480 327 -148 -174 355 -366 227 0 -219 330 -245 86 130
774 130 -220 274 -141 0 219 -265 254 -79 -86 245 -238 190 -28 -105 201 -165 102 62 -114 170 -69 0
796 0 149 -159 172 -46 -44 196 -164 155 -14 -66 111 -61 27 67 -62 40 29 -44 63 -78 40 -12 -86 11
820 11 -90 1 -43 -59 -48 -45 -62 -71 -36 -123 -20 -49 -91 -14 -51 -101 -15 -69 -60 48 -123 26 -37 -50 64 -91 73 -1
848 -1 -26 90 -29 0 116 -55 51 31 -74 216 -60 36 94 -117 176 -31 70 100 -83 123 37 -131 208
871 208 -85 -11 216 -166 87 -52 -122 191 -135 -2 26 -226 101 -163 -87 205 -181 48 36 -284 225 -277
893 -277 1 85 -318 245 -126 -295 272 -308 100 61 -443 176 -213 -179 95 -335 144 1 -294 279 -330
914 -330 -33 287 -285 167 -49 -281 349 -307 73 131 -342 290 -105 -153 403 -359 152 128 -318 454 -126
935 -126 -83 448 -424 260 130 -301 513 -225 73 317 -442 464 -87 -250 536 -477 143 216 -527 597
955 597 -208 -172 462 -618 436 2 -484 570 -540 95 309 -643 506 -245 -316 546 -658 256 85
974 85 -589 567 -512 -31 357 -605 411 -192 -339 526 -471 109 188 -537 501 -216 -176 359 -430 292
994 292 36 -302 330 -181 35 244 -334 205 125 -134 326 -176 -9 301 -171 187 39 -189 353 -15 -107
1015 -107 308 -259 225 208 -391 402 -147 -16 408 -524 295 118 -305 533 -455 -8 434 -596 500 -257
1035 -257 -383 750 -695 287 138 -676 841 -497 -158 499 -777 679 -142 -608 790 -727 394
1052 394 248 -908 869 -477 -20 573 -976 687 -35 -469 755 -800 332 421 -761 721 -456
1069 -456 -25 693 -816 523 -127 -260 774 -657 225 198 -396 682 -399 -67 485 -428 450 -137
1087 -137 -248 531 -330 213 -1 -216 447 -125 29 47 -154 302 -34 -91 42 -74 174 -33 -58 -14 -29 142
1109 142 -143 -1 -82 8 158 -314 116 -113 -49 261 -394 83 29 -245 336 -369 -38 253 -433 357 -262
1130 -262 -196 449 -516 306 -110 -323 566 -481 152 144 -506 583 -340 -130 412 -606 472 -94 -381 582
1150 582 -551 289 117 -499 577 -379 80 294 -559 513 -152 -165 468 -579 357 64 -357 541 -429
1169 -429 178 223 -431 434 -247 26 300 -399 284 -90 -143 372 -382 177 42 -253 307 -301 9 79 -235
1190 -235 205 -143 -31 161 -50 128 -145 -20 251 -182 157 -81 -208 161 -227 265 -39 -160 272 -203
1210 -203 111 11 -124 224 -241 65 62 -142 271 -168 90 141 -190 181 -84 -21 219 -295 202 -26 -145
1231 -145 156 -167 55 -51 -80 321 -65 42 145 -183 238 -108 12 211 -201 202 -43 -76 215 -167 142
1252 142 41 -106 194 -124 63 130 -135 210 -58 -27 156 -156 183 -36 -72 163 -129 124 10 -88 130
1273 130 -90 28 56 -111 93 -82 -52 104 -169 73 -53 -82 70 -152 56 -55 -92 41 -92 -18 11 -113
1295 -113 39 -34 -58 41 -84 40 0 -43 39 -43 57 8 -16 48 7 40 55 55 34 62 55 49 35 67 57 67 37 23 73
1324 73 15 78 -3 16 97 -49 74 -12 -23 60 -30 -8 16 -102 52 -27 -97 22 -147 22 -21 -121 18 -149 -11
1349 -11 -13 -181 4 -58 -99 48 -185 -23 54 -147 85 -128 -18 135 -131 87 -43 -39 201 -61 5 116 -64
1372 -64 200 9 -68 185 -85 170 77 -119 217 -8 44 134 -185 142 117 -94 147 -150 53 189 -222 127
1394 127 -76 -32 257 -231 22 27 -116 216 -148 -131 199 -134 146 -47 -211 283 -97 19 40 -249 261 37
1416 37 -129 110 -180 130 173 -271 124 -79 10 252 -310 65 55 -104 228 -292 -76 224 -162 111 -134
1437 -134 -209 352 -157 -13 24 -252 355 -65 -148 176 -195 248 94 -313 233 -51 102 246 -378 224 129
1458 129 -59 282 -302 131 304 -161 220 -144 -21 401 -217 42 21 -158 419 -152 -130 169 -168 302 -50
1479 -50 -272 246 -78 118 91 -367 240 61 -99 134 -299 188 195 -196 135 -134 91 294 -223 17 60 -29
1501 -29 301 -175 -112 233 -75 209 -74 -233 299 -32 36 26 -273 274 98 -194 143 -223 156 238 -316 146
1523 146 -91 -3 308 -369 57 152 -120 321 -247 -76 365 -164 241 -93 -184 514 -155 93 132 -230 488
1544 488 -34 -124 264 -222 378 116 -318 358 -135 182 248 -418 310 -6 -40 265 -400 187 161 -193 250
1565 250 -314 33 279 -299 128 -139 -78 325 -285 31 -10 -130 277 -184 -98 113 -112 189 -74 -187 177
1586 177 -47 76 -16 -170 152 27 -2 2 -84 108 94 -35 17 46 73 140 -47 -48 103 69 94 30 -48 155 134 -33
1612 -33 96 -50 116 159 -132 126 -33 62 214 -160 94 45 -47 221 -164 5 161 -160 201 -132 -84 253
1634 253 -212 122 -41 -159 283 -167 32 53 -239 247 -107 -103 148 -223 182 -8 -169 209 -165 115 69
1655 69 -233 202 -93 29 146 -192 161 8 -62 163 -184 94 85 -96 187 -116 54 116 -132 154 -67 34
1677 34 119 -92 98 16 -18 141 -72 105 68 -27 156 -72 77 63 -25 127 -59 60 56 -33 124 -43 25 78
1701 78 -52 94 -21 8 76 -103 87 -22 -31 105 -104 51 -23 -49 72 -87 32 0 -83 81 -81 -9 54 -118
1725 -118 62 -53 -59 76 -141 56 -14 -51 114 -104 57 10 -76 108 -61 25 71 -94 104 -10 -2 105 -76
1748 -76 86 -17 -27 77 -62 50 -3 -54 91 -38 16 45 -86 73 -25 -23 81 -77 72 -1 -31 71 -64 75
1772 75 19 -25 60 -22 -7 46 -22 50 5 -38 70 -33 27 -1 -39 28 -27 4 -12 -30 -11 -33 -38 -5 -64 -38 -19 -82 -27 -59
1802 -59 -41 -36 -45 -36 -56 -10 -50 -25 -73 -21 -12 -38 7 -29 6 27 -22 2 22 -29 70 -18 2 40 -30 94 -18 -18 63 -25 69 9
1834 9 -69 84 -15 2 34 -96 49 10 -58 71 -95 40 55 -92 58 -62 -17 71 -104 -4 27 -44 88 -90
1858 -90 -22 96 -87 84 -70 -56 152 -80 31 -4 -107 111 -12 -73 60 -133 89 29 -162 85 -68 32
1880 32 66 -154 32 7 -44 75 -167 2 84 -125 79 -119 -62 164 -118 15 -36 -97 201 -84 -61 86 -60
1903 -60 163 11 -158 160 -38 72 75 -183 159 50 2 97 -168 122 143 -91 93 -91 56 216 -126 59
1925 59 13 -35 236 -139 -62 89 -53 163 -80 -143 165 -74 51 -6 -222 172 -26 -105 18 -207 171 74 -186
1948 -186 46 -137 60 139 -227 6 6 -33 183 -242 -27 117 -81 143 -139 -68 196 -57 44 -45 -142 265
1970 265 -18 -72 78 -125 209 42 -148 132 -48 145 89 -216 119 66 22 129 -220 59 148 -66 109 -151
1992 -151 4 212 -103 16 -46 -73 234 -75 -67 79 -53 174 -25 -170 161 -61 89 14 -205 167 38 -48
2014 -48 93 -175 98 132 -157 99 -124 -3 178 -185 52 -21 -55 198 -174 -38 90 -120 135 -100 -154 172
2036 172 -117 82 -16 -207 207 -44 16 83 -154 181 26 -116 127 -96 94 136 -167 133 -26 16 173 -162
2058 -162 91 75 -42 166 -110 44 138 -63 80 -29 -24 169 -73 47 24 -64 159 -35 -46 39 -46 106 27
2081 27 -82 72 -20 11 45 -117 38 45 -20 20 -80 22 24 -23 -13 11 -35 61 -5 -25 30 -52 55 -3 -84 38 -14
2108 -14 3 22 -73 38 44 -66 57 -53 14 78 -108 55 -31 -11 87 -66 32 40 -46 108 -22 9 123 -61 127
2133 127 7 -34 128 -74 88 28 -40 135 -25 10 82 -49 107 12 -46 95 -70 53 20 -82 94 -37 26
2156 26 23 -81 60 -42 -29 66 -69 31 8 -60 65 -38 37 -2 -62 67 -51 22 37 -21 51 -19 2 32 -26 15
2182 15 -3 -18 43 -32 34 0 -16 36 -42 22 -1 -25 42 -28 10 -6 -24 31 -37 13 12 -30 41 -5 15 37 -24 50 -2 10 66
2213 66 -13 48 8 28 71 7 63 35 -4 65 11 19 64 -35 57 2 -15 54 -57 51 -21 -31 39 -82 7 -4 -39 3 -51
2242 -51 -26 6 -73 20 -48 -24 27 -80 47 -12 -58 42 -63 10 25 -57 4 -25 -2 56 -40 55 -6 -28 74 -39 20
2269 20 19 -16 45 -9 8 4 -17 44 25 -15 26 -21 10 29 -18 26 -2 6 53 -4 16 10 15 37 21 -10 42 14 24 14 11 22 7
2302 7 -16 36 11 7 25 -22 -6 -7 -29 39 -55 -9 31 -32 8 -34 -40 42 -15 -11 9 -76 24 -39 -56 52 -99 35 -2 -64 41
2333 41 -30 -17 22 -60 46 15 -46 59 -31 44 62 -65 147 -92 39 49 -82 61 -11 10 101 -24 24 50 -53
2358 -53 148 109 7 162 38 29 -17 -140 117 21 48 3 18 25 -18 -60 127 -55 120 87 -157 99 -2 -18 81
2383 81 -125 37 -36 -68 134 -37 -60 70 -97 69 -12 -106 105 -120 -4 24 -140 16 -4 -56 71 -93 27
2406 27 -55 -136 22 -21 8 87 -147 33 14 -132 39 -37 3 77 -113 76 16 -122 151 -57 24 42 -64 135
2430 135 -5 -57 109 -130 73 105 -127 96 34 53 83 -111 26 -10 18 11 -54 35 165 -5 -30 -47 1 140 -104
2455 -104 147 143 7 155 -73 -147 167 102 25 -19 -88 128 -59 -97 42 -153 116 -66 -51 87 -49 90 -29
2478 -29 -147 -45 -94 -58 8 -200 -40 70 -92 95 -78 22 103 -67 136 -5 -12 112 0 140 141 -72 147
2501 147 -14 -37 111 -47 30 102 -123 75 -64 37 49 -158 65 -13 -2 167 -64 7 -10 -96 70 8 -92
2524 -92 95 12 76 -25 -86 102 3 -59 26 -56 86 -18 -92 50 -73 -32 66 -147 62 -12 -43 61 -110 -7
2548 -7 31 -82 31 -16 -38 61 -115 8 -1 -57 87 -47 -20 37 -66 44 -27 -53 43 -42 -6 50 -34 44 -1 -16 56
2575 56 -33 50 5 -36 49 -8 -26 57 -10 55 40 -23 46 -8 16 41 -33 42 10 -17 11 -41 7 5 -25 60 -6 -2 46 -18 55
2606 55 1 -38 46 25 5 11 -38 -19 1 -18 60 -33 -1 36 -90 58 -60 -9 20 -41 -20 -5 -37 5 -25 -61 20 -65 18
2635 18 -29 -19 31 -52 11 0 -24 27 -44 -11 23 -34 21 -6 -27 55 -11 8 41 -28 63 0 18 4 -29 41 14 8 33 -3 20
2666 20 25 1 42 -14 16 -11 6 39 -21 -3 -2 2 7 -19 6 1 -13 -6 -10 -10 2 -17 9 15 -20 19 -14 10 -41 28 -22 -12 4 -56 -23
2701 -23 27 -12 -55 30 33 2 -10 62 85 -39 -1 -12 -5 -5 -19 21 2 -4 16 -14 9 5 -7 34 -25 -6 42 -25 55 9 5 56 -1
2734 -1 60 17 17 67 14 22 34 -24 12 11 4 47 -23 39 3 -33 27 -15 18 -2 -32 17 -30 -14 6 -11 7 -6 -35 22 -44 -24 -18
2767 -18 -38 21 -35 5 13 -44 16 17 -10 14 -12 -9 11 -13 6 -1 -26 14 -28 4 5 -16 1 26 -29 30 -21 -3 22 -32 20 6 -3
2800 -3 9 -12 9 -3 -15 37 16 -34 43 -18 19 58 -17 68 14 21 55 -1 45 41 -20 56 -4 8 67 -43 34 17 -10 70 -64
2831 -64 16 27 -58 32 -60 -35 36 -56 15 7 -69 59 -38 0 42 -66 81 -24 -47 38 -52 39 34 -54 70 -17 -3 71 -70
2860 -70 47 29 -28 81 -42 9 47 -31 41 -29 -42 84 -35 7 31 -55 70 -19 -23 55 -65 71 7 -37 79 -33
2886 -33 11 59 -76 50 55 -8 71 -63 42 61 -32 64 8 9 48 -40 15 30 -32 95 -10 -64 51 -60 55 0 -87
2913 -87 74 -49 -3 -6 -112 19 9 -61 47 -86 1 51 -79 40 -46 -14 45 -56 34 3 -46 68 -31 -23 79 -41
2939 -41 56 15 -63 87 -43 42 33 -82 108 8 -55 2 -48 53 58 -76 58 -22 42 86 -74 31 -3 -16 66 -65
2965 -65 -11 70 -21 56 -34 -21 140 -50 41 14 -53 125 -13 1 65 -56 51 21 -70 63 -37 7 64 -110 7
2990 7 1 -3 59 -130 7 27 -59 53 -51 -26 51 -49 -18 -20 -62 104 -50 -14 35 -31 60 -20 -44 69 -19 13 19 -74 68
3019 68 0 7 44 -63 52 35 -31 53 1 42 36 -27 11 15 -14 64 -53 -16 36 -16 86 -3 -21 52 -29 37 7 2 56 11
3049 11 -17 7 -38 59 2 -23 33 -106 32 31 -18 15 0 11 -12 -42 9 46 -15 26 -13 -27 58 -68 31 41 -30 2 12
3078 12 21 54 35 -5 24 -95 -31 -50 44 69 -31 41 -42 -2 -46 3 6 2 -49 46 1 60 -25 -21 -36 -23 4 42 3 56 21
3109 21 -90 57 67 -79 -3 -7 11 -18 53 41 -10 -106 55 66 -62 15 -13 -115 63 76 103 59 69 33 -9 -22 31
3136 31 31 58 45 20 -29 -25 27 -50 -43 25 -80 -9 -44 58 -33 -40 21 -49 8 -18 -63 -14 -36 -4 -6 20 -35 -30 -32 -46 9 -16 24
3169 24 -2 21 14 9 0 -3 12 13 25 44 18 33 9 21 9 16 7 34 -2 21 19 11 8 16 12 11 24 3 10 -22 11 21 -1 6 -21 -8 33 -9
3207 -9 -3 11 -5 -9 -1 -6 27 6 23 21 -13 19 -8 10 13 -15 15 22 -20 5 -10 6 14 -34 -4 -10 -22 14 -25 38 -5 -21 25 -24 10
3242 10 16 -1 5 0 -12 28 -27 13 11 7 30 6 35 42 3 34 35 24 21 -1 3 33 15 18 -7 -2 47 -4 4 -3 -17 28 10 -1 10 -18 5
3279 5 27 -25 15 -37 11 23 -24 7 16 28 16 -32 1 26 -17 23 -8 -23 35 -2 10 -3 -21 50 9 -38 6 -24 14 14 -37 -1
3311 -1 6 -4 50 -62 28 7 -7 55 -41 0 22 -28 29 -12 -13 61 -27 20 24 -9 87 -12 8 42 -11 88 -6 -44 75 3 14
3342 14 47 -39 39 -7 6 33 -49 33 14 -47 24 -18 7 74 -58 -4 17 -48 67 -44 -27 13 -28 39 -17 -35 34 -16 -7
3371 -7 -6 -47 73 5 -7 20 -55 47 51 -37 37 -40 38 56 -47 -5 -4 -13 75 -51 0 41 -44 35 -40 -18 48 -47 37 -19 -26
3402 -26 53 1 8 1 -21 47 10 -35 49 -8 47 33 -46 51 20 20 65 -51 46 58 -14 58 -9 9 50 -29 32 0 -15 62 -38
3433 -38 -31 18 -45 48 5 -74 36 -21 21 14 -88 45 -3 12 33 -56 4 16 -29 31 -25 8 57 -45 29 17 1 72 -20
3462 -20 12 26 -12 57 -30 -23 45 -26 27 -1 -46 73 2 15 27 -62 48 1 -44 14 -28 38 31 -38 4 25 18 56 -52 17
3492 17 41 -17 55 -37 18 48 2 27 -4 -33 63 -9 10 17 -19 51 3 -26 20 -15 27 -9 -50 26 -14 -23 12 -63 -1 12 -37
3523 -37 11 -36 3 16 -17 14 -21 -7 16 -26 -5 2 -8 33 3 -23 28 -7 28 -3 -35 24 24 -4 17 -34 13 24 -6 24 -24
3554 -24 19 41 -39 20 -4 -2 47 -13 7 30 -13 9 -4 -6 30 -5 24 11 10 50 -3 21 -5 -1 36 35 3 13 4 7 20 -24 11 -1
3588 -1 -13 17 -35 -3 -4 -16 -20 -30 -30 5 -20 -25 -8 -23 10 1 -10 -15 -21 31 -13 3 29 0 1 -7 6 11 -2 1 13 -4 20 22 6 21 -2
3625 -2 10 0 30 -7 21 -3 13 2 -1 18 -15 -4 -5 -16 11 9 2 16 19 -7 12 10 17 11 7 22 -7 12 -7 25 8 10 15 3 6 18 17
3662 17 14 10 -3 18 16 -3 2 -11 11 -15 5 10 -19 1 -19 -15 -3 7 -8 1 -17 0 1 -1 11 -21 5 8 1 -16 5 6 11 -16 2 6 -10
3699 -10 14 12 21 25 -1 26 15 4 12 -3 -3 19 -9 5 9 -15 29 7 0 30 1 28 -7 5 -3 -20 15 18 9 19 2 3 23 -16 15 -5
3735 -5 -10 46 -15 15 6 -32 20 5 10 20 -1 -8 -2 -25 27 -31 -14 15 -19 6 -12 -5 13 -38 -6 1 -11 8 11 -20 9 -6 8 10 -22
3770 -22 24 15 17 26 0 10 25 9 47 5 12 27 -19 43 6 -15 32 -6 0 15 -11 14 3 -14 -1 -17 9 -19 -36 23 -7 -19 4
3803 4 -49 25 18 -31 19 -15 5 55 -32 33 13 -3 39 -41 -8 8 -10 26 -10 -11 14 -33 15 -4 -24 30 -1 -31 16 -24 24 -3
3835 -3 -37 17 -24 14 4 -46 2 -13 -6 42 -39 22 5 -12 56 -14 30 39 -13 24 12 6 50 -3 -2 17 2 52 10 -24 33 -30 40
3868 40 6 -48 32 19 6 31 -40 12 13 -44 5 -39 14 25 -37 28 -14 -3 33 -33 -3 29 -5 33 -13 -35 36 -28 49 -14 -32
3899 -32 37 -23 9 40 -31 31 13 -16 35 -24 28 9 -55 16 -20 14 31 -40 25 -3 -21 20 -19 -21 29 -8 23 -12 -26 55 -16
3930 -16 21 2 -21 59 6 5 45 -9 29 30 -21 55 11 15 41 -3 19 5 7 32 -5 7 18 -32 21 -2 -34 20 -37 7 1 -21 29
3963 29 -17 -24 1 -14 15 11 -13 -6 -11 -1 34 -9 26 21 -8 4 -21 2 12 -7 29 -6 0 13 -13 13 3 -24 37 -17 -15 31 -14 -5
3997 -5 -19 -40 6 -21 16 29 0 19 -43 6 18 -22 24 45 25 34 16 16 62 57 34 41 7 -14 -33 40 17 -25 22 7 8 39 31 31
4031 31 -40 -35 -22 -24 -35 3 -116 13 -10 -12 -44 -38 -64 -35 -52 -88 40 1 10 3 44 41 36 22 -13 23 89 -20 41 -100 8
4062 8 13 31 -2 -15 27 94 22 -40 61 -33 -9 -56 -39 -12 44 -86 8 -75 35 -30 -69 22 58 -19 12 -24 -3 -24 -25 69
4092 69 -59 56 3 34 3 33 48 38 26 23 32 -13 0 33 46 67 -12 24 45 -6 -5 30 -37 26 -5 17 -9 -23 -5 -50 -13
4123 -13 8 0 12 -13 11 3 -17 -5 8 16 14 -8 -14 29 4 18 -5 0 -6 9 2 7 12 5 8 14 18 8 -3 -4 -1 -4 -2 -5 -5 -8 -11 8 11 -1 -5 -5 4
4166 4 -14 -9 10 2 12 1 23 9 12 24 1 -18 28 -12 8 -3 -16 11 2 -11 -9 5 10 13 0 -7 -16 -6 -3 -19 1 -34 -16 -27 -35 -13
4202 -13 -28 -11 17 -27 36 -25 8 -6 12 -8 6 -21 40 18 5 18 36 -41 37 19 -5 -11 18 36 -1 8 -37 20 10 -15 17
4233 17 86 34 3 -41 -28 -53 -6 45 3 -45 41 18 38 38 9 34 15 -41 42 -19 27 -9 -15 -10 -19 9 31 43 -8 58 -44 -2
4265 -2 -12 -16 2 19 46 73 2 102 92 -39 87 14 -97 19 -22 51 24 67 -48 47 5 4 13 31 48 17 6 -77 -69 10
4295 10 3 46 -21 -15 106 -37 38 -13 21 33 61 -20 -32 -51 43 29 4 -29 -13 71 25 -43 -19 -5 -15 20 -32 8 5 -30 29
4326 29 0 8 37 -33 63 -6 -30 3 7 33 28 -35 23 -5 24 40 -16 19 7 -24 31 -8 -18 11 -39 20 8 -3 18 -30 1 29
4358 29 -36 -15 -17 4 24 -16 -20 -3 -21 24 -17 20 31 11 7 26 -11 35 -22 30 13 -15 13 35 8 29 -10 10 46 6 38 5
4390 5 22 55 -6 -19 39 -1 44 -21 37 19 -9 15 -14 -21 38 6 33 11 -34 18 1 11 27 0 14 10 -2 19 5 -7 14 -16
4422 -16 10 6 -27 15 -14 20 17 -16 18 -8 6 33 -22 1 2 -1 22 -11 -6 26 -5 -2 -10 -18 -3 -10 9 14 13 2 -14 15 29 16 21 19 -10
4459 -10 -5 0 11 2 4 31 4 -6 21 -1 -8 7 -7 21 -3 -17 18 -18 12 -6 -6 -4 -2 -1 11 -9 23 -4 -13 38 -9 14 0 -26 -5
4494 -5 -18 4 13 -17 13 4 7 6 8 -17 12 -13 -3 -6 -1 10 -28 1 -2 -22 8 -11 -23 12 -18 -8 11 -31 13 -11 -8 5 -45 14 -2
4529 -2 18 1 -2 0 21 -13 3 31 -8 21 5 8 -17 22 -1 11 29 7 44 0 -20 -21 5 19 -32 -14 2 51 -38 11 -40 18 -73
4562 -73 45 35 -45 7 -39 -46 19 85 10 -5 -78 -11 89 -3 57 38 -48 35 -36 25 -34 -54 -38 -65 -35 -48 -61 -24 13 -10
4592 -10 -8 36 -54 26 99 -32 -42 -16 37 -7 -58 -5 56 52 46 76 -13 176 -2 -110 9 -44 37 -17 21 16 31 33 -20 11
4622 11 -13 -23 -72 -82 43 81 -111 -47 -35 -100 -26 -67 -1 -100 82 -56 -24 65 84 61 -83 5 40 36 17 -2 -6 -16 -26
4651 -26 37 -1 11 28 -2 18 4 43 -43 38 -76 -38 108 45 -91 -14 87 13 -23 -172 13 -53 29 -30 27 -27 27
4678 27 0 -23 -45 -39 20 11 -40 14 -58 91 66 -157 11 56 -3 24 71 -1 61 39 19 51 2 53 32 20 94 -14 29
4707 29 -57 9 22 92 -63 -30 -64 56 18 12 -29 52 -33 -46 -20 -86 33 -31 51 28 -4 -98 74 -53 18 11 29 129
4735 129 -10 14 -12 39 -10 10 0 13 20 29 22 21 -1 8 2 10 17 -8 -5 -2 -19 21 -13 -7 12 -3 -4 -8 0 19 -10 11 -2 -16 18 7
4771 7 18 31 15 8 33 -17 -14 33 8 35 11 19 2 -10 16 -22 -17 0 -14 -11 -5 -21 0 3 -19 13 -18 24 -12 -6 3 -24 -4 -5 -26 11
4807 11 -2 -6 -1 -5 3 -11 7 44 13 28 30 16 33 21 11 9 -18 0 40 -11 27 -5 -8 28 2 -4 13 -23 19 -6 -1 21 -11 18 14
4842 14 -13 16 -4 24 12 -3 18 16 9 34 3 20 23 16 30 0 6 26 -2 13 16 5 35 -8 -3 13 -16 13 -6 -21 -5 -2 8 -15
4876 -15 -33 5 -21 -19 4 -34 -9 6 -25 -20 -30 28 25 -13 15 33 -2 40 -21 12 24 18 48 1 26 -23 -16 47 53 -13 48 -11 42
4909 42 10 -52 28 31 11 -2 54 82 50 -49 -14 -33 56 19 -70 -52 52 -17 0 -23 40 -11 -42 -29 32 9 58 -23 85 50
4939 50 1 -31 -27 70 89 -30 15 -76 -20 -9 -96 -38 -45 64 15 43 -21 5 -64 40 -22 -43 0 -123 43 -16 -39 -47 -12
4968 -12 0 9 38 28 32 26 13 -8 15 41 24 12 35 8 29 39 -8 18 24 1 14 -5 2 10 7 5 -10 10 2 -10 -16 2 -10 2 -7 7
5004 7 1 -17 22 -1 9 -6 0 4 -12 14 25 13 24 24 26 19 -3 13 7 -4 1 0 0 -17 -2 -5 6 -10 -2 -15 -40 -17 6 7 15 -3 1 -4 -11
5043 -11 0 -9 5 -13 8 1 10 12 12 25 12 25 19 14 21 16 24 25 16 10 14 3 8 -11 11 -10 14 -9 -3 10 7 -26 -4 3 14 -9 -13 -19 -6 1 -20
5084 -20 2 4 3 13 -7 -21 15 5 8 3 5 12 19 -5 -3 -8 1 17 14 3 -20 3 3 -14 -7 -3 -10 -23 -2 8 -7 4 -18 -5 -17 4 0 -14
5122 -14 -6 12 20 -4 -10 15 31 2 4 9 31 40 22 25 17 19 28 6 10 -12 14 8 7 17 -3 -9 12 12 -12 -6 -6 2 -3 18 11 -10 3 8 -18 -11 -1
5163 -1 7 -2 -19 14 -2 -5 7 6 14 20 2 -13 24 -18 -1 0 -11 20 13 18 9 -13 18 15 25 3 7 1 9 -13 -11 -2 -4 0 -27 -5 -2 4 8 -2 6 -3
5205 -3 19 24 0 8 23 17 32 9 2 38 -8 -1 25 15 9 -18 7 26 2 35 -1 9 7 6 4 21 0 6 15 24 5 -28 -2 8 -25 -16 4
5242 4 -8 0 7 -3 16 4 0 -7 3 -5 -8 25 10 3 16 4 16 10 -4 21 7 12 -7 10 31 8 -14 7 -9 -11 6 -10 -3 -4 23 8 -8
5279 -8 3 -17 16 20 -6 -2 4 3 2 5 -4 7 7 19 25 -13 8 8 15 25 24 36 -1 7 20 9 4 6 -22 23 7 -21 12 -14 -20 0 -10 -4 1 -5
5319 -5 11 -7 -3 5 -15 8 -13 -9 38 -6 20 5 10 23 9 16 37 -10 27 18 10 -2 -8 5 37 5 10 -20 13 -25 -9 -65 -55 -7 105
5354 105 44 -80 30 -53 -11 -6 12 18 -5 -3 99 113 90 22 -1 5 -23 2 19 14 27 16 14 25 -7 22 -7 -3 18 6 -3 18
5386 18 -2 10 7 -21 4 -13 10 -10 -32 18 -1 0 -13 -31 2 -19 -10 2 -3 -24 7 -18 25 22 -8 14 -3 0 17 -15 21 15 25 2
5420 2 35 12 17 -5 21 -18 9 -6 3 24 -17 -7 -5 -2 -26 -10 5 -2 -15 -18 -3 0 12 -4 1 9 14 7 7 -1 22 -5 5 22 17 3 21 25
5458 25 23 14 -15 7 16 -1 12 6 19 -2 17 -6 -13 -16 -2 7 -19 -18 5 -10 -13 17 -8 4 -13 -21 -4 -9 -8 11 26 -3 1 -16 17 7 -5
5495 -5 7 -14 21 7 14 20 12 4 -7 11 -3 10 -6 7 2 -4 -8 -6 7 -12 -16 -22 -12 -24 -8 11 1 -3 0 7 -1 12 16 11 -4 -10 16 8 17 -2
5535 -2 10 -15 17 0 18 0 1 -7 7 -12 -3 -17 10 -4 -37 -12 -11 -5 -14 -17 0 -8 6 13 -37 -11 -4 -2 10 -5 -11 10 11 -16 -15 -14 6 15 -6
5574 -6 3 12 9 46 47 26 23 3 24 19 8 -1 9 29 -16 31 6 19 1 -10 14 1 -11 -14 -1 -3 5 4 -4 3 -12 7 4 8 15 24 11 15 15 22 0
5615 0 24 8 10 -3 5 -10 8 11 5 -3 -14 23 47 -3 -20 0 -8 -7 -32 -16 5 -15 -11 -27 -14 29 -9 -12 -7 -9 6 0 -1 -18 -11 8 -4 3
5653 3 26 14 17 1 30 15 18 13 -18 20 -1 -10 -9 47 -3 3 2 -15 -2 31 0 -14 -5 16 -7 1 -14 -10 0 14 -2 -16 -7 -9 22 8 24
5690 24 -4 -2 0 -2 4 9 14 16 27 5 3 9 -5 25 -7 -16 2 6 -5 -11 -20 -28 -8 -1 -24 -44 -11 -23 -9 -6 -17 -18 -7 3 -2 -22 -4 3 0 25
5730 25 11 16 30 14 11 16 7 23 25 55 27 9 26 26 2 41 -3 19 17 -17 10 -4 -8 -16 -13 0 -3 -3 -12 -8 -13 20 -14 -6 1 19 3 12 13 -4
5770 -4 17 29 12 -20 13 -19 -8 5 -10 24 8 13 11 12 21 -11 -4 18 -5 9 -7 -12 -5 -13 -7 -18 -37 -11 -4 -14 26 -11 -9 -9 -14 7 -19
5807 -19 -23 16 8 19 16 4 0 14 11 20 26 5 3 6 -2 24 16 8 -4 -11 15 -8 13 13 -4 13 -3 -9 -9 8 0 -12 -8 -6 1 7 -2 -8 5 -17 20 -4
5849 -4 -14 -12 12 5 19 -7 12 22 1 9 -1 18 16 9 8 -1 -15 11 15 0 7 12 3 -14 8 7 -25 19 9 -24 7 13 -8 -9 -9 -10 8 3 21
5888 21 9 22 20 14 8 15 1 0 6 3 16 1 16 15 2 -2 11 -2 -3 -8 4 -7 -22 -5 -12 -10 -24 -31 9 -20 -39 0 -23 -14 0 -24 17 -27
5926 -27 -8 -16 4 21 -9 2 9 -22 6 17 28 6 16 20 -1 -13 7 -4 5 12 8 -61 -9 -17 -34 -22 -12 14 67 77 30 0 -8 29
5960 29 12 -54 36 -12 50 8 -38 -50 105 3 -11 -51 -103 19 18 21 63 76 -12 50 14 -23 7 6 13 -5 19 8 0 -16 -16 -32
5992 -32 -16 -19 -20 -3 -23 -26 30 -2 -20 -5 -3 -10 0 -9 3 25 21 -12 2 -4 16 18 1 -3 15 10 26 12 6 10 11 12 -2 10 12 -17 0 12
6030 12 -9 2 11 1 11 1 4 7 0 15 7 3 11 -4 6 -2 -10 2 -8 -11 23 7 9 2 7 -4 18 -15 -10 9 0 -9 16 -7 -1 8 14 -14 -5 15
6070 15 10 29 -62 16 -6 -57 -18 46 -28 3 -8 -91 26 -8 -27 -77 -44 50 -6 16 6 0 28 20 45 -11 22 16 17 3 15 -9
6102 -9 6 -2 -9 17 8 16 -1 -5 -1 -7 1 -11 -18 -3 -16 -10 17 -10 -22 14 -9 10 14 0 7 28 11 12 9 11 1 -4 18 6 -15 12 1 5 -12
6141 -12 19 6 23 15 -4 0 -8 -5 -14 0 -18 4 -13 -14 -2 -26 -2 0 -1 -7 -2 8 -25 0 -19 -19 -11 -7 -1 19 21 7 30 23 4 23 -19 10
6179 10 29 1 19 18 10 20 14 13 24 -8 12 -1 2 0 11 14 26 0 -2 -8 -4 7 12 8 22 0 0 4 0 -1 10 3 17 14 29 -13 4 15 18 48
6219 48 21 14 0 13 21 -11 9 -2 1 -15 11 -3 -6 5 -2 17 -13 -12 -15 -39 12 -14 -16 4 -7 10 5 22 8 6 26 17 -3 18 6 23
6255 23 -3 17 16 33 1 11 8 24 32 19 -18 0 -18 10 -3 2 4 -26 -13 -12 -12 -11 -25 -9 17 -22 5 25 -5 8 -1 8 9 -6 -3 25
6291 25 14 18 9 22 22 0 6 -4 12 4 -19 11 15 -5 7 11 -5 5 -5 -7 -10 7 7 -37 0 -17 -21 -11 -7 -7 -6 -10 13 17 1 7 3 -2 -3 5 6
6332 6 -4 10 23 7 23 -3 2 3 13 1 8 5 18 -6 7 -18 -21 -14 4 -2 -20 2 -23 5 -21 -6 -10 -12 3 13 -22 4 -20 -8 3
6367 3 14 9 -14 -12 3 5 15 19 16 27 -7 9 26 -11 29 17 -8 2 -12 1 -21 -14 16 5 -13 -2 -4 -5 -2 -5 -5 -23 -3 -15 -8 -14 13
6404 13 7 12 -1 6 23 18 2 31 34 18 3 14 -3 9 1 5 6 32 15 17 1 -4 35 -1 10 4 -3 -2 -10 -14 6 0 18 4 -7 12 -1 5 1
6443 1 -22 -5 -13 -20 13 9 -5 9 -15 0 11 5 31 12 10 -15 6 19 -4 4 0 -18 11 19 9 -3 -15 0 -1 -3 -3 -11 -28 -1 17 5 -5
6480 -5 -2 -9 2 15 19 11 6 15 -5 15 3 14 -16 -11 -44 25 -13 1 -1 5 12 2 30 9 1 7 -16 -23 -9 18 -10 -5 -10 1 -13 -9 -2 13 -11
6519 -11 5 11 -3 7 -1 9 -7 16 8 15 0 8 6 -7 0 6 -6 30 -2 3 36 11 26 8 0 0 -3 -17 11 11 22 3 2 3 -7 -1 -5 -18 -20
6558 -20 0 -24 -1 9 -11 -22 9 -11 16 -13 13 14 12 27 1 -7 5 30 27 12 3 24 23 9 8 -12 14 31 -3 -1 -27 -5 -4 3 2 -2
6594 -2 -1 -18 -14 -14 20 -36 -19 -2 1 -10 -17 -5 -8 3 -2 -17 2 10 18 16 12 21 13 14 25 20 18 37 17 20 1 -2 0 13 -9 -7 -17 -9 1 10 11 -2
6636 -2 -6 -21 -3 3 -15 -14 7 -15 -9 -16 19 3 11 5 7 21 24 25 -3 10 3 15 28 15 3 -2 6 18 -4 -2 -3 10 -4 -23 4 -27 -20 0 -30
6675 -30 -11 -2 -7 -24 -17 4 -4 -18 -2 16 11 17 -6 4 6 3 17 8 -1 13 19 13 22 14 -16 7 -4 -12 7 17 46 10 -49 -2 10 -3 20 19
6713 19 -3 -3 14 -1 1 13 -1 -4 -18 -2 25 3 -8 20 24 1 26 -8 5 16 -5 13 2 27 -11 7 1 -1 9 8 11 3 -1 9 15 11
6749 11 -8 -24 -13 -11 -25 -1 -6 -11 -8 -26 -14 -22 -13 24 5 -20 1 -4 0 -2 6 7 12 1 -12 2 20 6 12 12 12 13 8 14 14 5 11 -6 -16 6 8
6790 8 -10 -5 10 -2 5 1 11 -1 -5 2 -9 -14 -7 -5 17 2 14 2 9 3 2 7 30 15 6 11 6 17 -12 11 14 10 25 25 5 10 -3 -1 9 -20 -5
6831 -5 -3 6 8 -3 -25 -21 8 -21 17 14 -6 6 -7 6 -4 -8 3 11 13 -1 13 -4 23 10 19 37 22 12 7 17 39 75 0 17 7 29
6867 29 17 5 -12 3 37 24 -22 40 7 -14 0 12 -2 0 8 34 73 -3 2 23 -41 -50 -63 -60 -5 5 -38 35 140 -19 28 -22
6899 -22 12 -67 17 -6 23 -33 -11 126 -3 94 -63 9 -49 -31 26 -21 -78 -26 -30 -14 -2 -75 15 2 -47 -4 45 52 -44 90
6929 90 30 -118 -19 6 18 23 30 60 1 -17 57 29 -20 -5 11 -8 3 1 26 -3 39 6 10 -19 -12 1 -12 3 2 -6 -4 0 -10 0
6963 0 7 31 -7 20 10 3 7 -9 -1 8 -11 -2 3 16 12 28 6 19 16 10 13 3 -12 22 -8 10 -9 -24 -5 -2 -10 -10 -30 -36 -1 7 30 26 12
7002 12 41 1 27 22 42 37 -21 -6 6 16 13 20 -13 -2 24 17 4 31 13 1 2 13 11 7 6 3 -19 -12 10 -3 5 -6 3 -28 -4 -3 -11 -8
7040 -8 6 12 -15 5 3 -7 19 -14 18 -3 45 4 42 -31 38 -17 49 90 45 11 -10 15 -14 45 -22 18 -5 10 -11 -9 -11 0 35
7073 35 5 -10 5 -25 -13 0 4 -19 -15 -1 1 -10 15 21 8 2 3 -9 21 17 0 20 29 22 18 21 4 -20 9 13 -7 23 -9 21 0 3 16
7110 16 -9 3 0 -3 -2 7 2 1 -2 -15 16 5 10 3 -22 -4 3 -3 -9 28 2 19 13 28 18 4 16 13 13 18 16 22 -5 1 6 -5 -22 -15 -1 5 -11
7151 -11 18 3 -13 -1 -20 10 -5 -11 17 6 5 12 3 -11 8 -6 6 11 10 -6 37 7 -1 -3 29 8 -11 32 16 23 42 -13 12 -11 19
7186 19 33 64 1 5 -60 -11 6 -62 36 -41 56 -6 -11 -79 -45 39 -63 -17 -44 18 10 35 19 6 -13 13 6 11 10 6 -25 7 53
7219 53 -6 17 -13 60 -57 27 8 30 -51 -63 8 -49 -43 25 -10 -131 71 111 9 -34 -33 -49 32 -44 -23 -22 21 -12 27 -18
7249 -18 40 51 43 4 14 31 20 23 6 -7 11 15 1 -9 34 15 9 -13 -1 -3 11 -5 -21 -11 7 -2 -13 -3 -19 -9 0 -2 8 2 10
7284 10 -7 -16 3 -2 22 15 14 22 8 -6 21 16 2 -9 1 -1 -2 -5 -12 -4 -4 -16 7 11 -14 -3 12 -6 12 -3 20 -12 -9 39 -1 -3 -6 4
7322 4 24 27 32 45 29 6 15 -16 106 -15 43 27 21 -69 105 14 50 -36 -50 45 -1 -22 -34 -37 -44 129 -56 -55 66 -122 -39
7353 -39 -43 -44 -40 -51 28 20 19 -187 66 -69 -41 -32 135 5 33 170 70 -7 -35 9 15 36 57 36 53 49 -23 -60 -18 58 -45
7384 -45 28 -22 34 -11 14 -52 -69 34 41 50 -8 90 10 -35 -14 30 17 3 8 -44 28 37 24 -15 47 27 -10 4 1 -3 -31 18 -18
7417 -18 9 7 6 2 9 5 46 -9 9 13 6 10 -2 2 -14 14 -7 11 -17 -7 -7 7 -5 0 -6 -9 17 4 15 -12 -2 2 -2 8 12 24 37 15
7455 15 -4 -15 3 7 42 43 2 15 -12 3 5 5 3 -3 0 3 -18 9 -6 -2 1 -3 -10 4 -8 18 18 -19 0 -12 -27 13 2 -13 12 18 18 9
7493 9 -3 18 6 9 -4 24 15 10 6 10 18 15 4 -7 19 -21 6 -24 11 -2 -1 -2 -10 1 -30 -5 -28 10 -1 -7 -15 -6 -8 -21 6 9 20 39
7531 39 16 19 -1 -3 -5 17 19 2 1 -5 -17 -26 -30 -6 24 30 42 -32 -71 -31 28 36 9 16 -1 26 3 -23 17 31 -15 -33 -22 11 38 -38
7567 -38 -1 -32 -21 19 15 -32 42 44 33 35 10 10 15 -3 44 59 -45 -23 -4 24 49 42 60 -63 16 10 -54 5 -73 -29 -30 -54 45
7600 45 -5 18 -75 -5 -11 34 154 16 102 16 -66 137 -59 -38 46 -49 -5 52 14 63 -3 36 -30 32 -65 14 -65 112
7628 112 0 -24 26 -59 37 2 -1 -57 -32 0 -11 5 83 8 -3 -55 -63 -5 -18 -12 23 47 -72 58 -29 46 98 77 6 -8
7658 -8 -24 18 39 41 24 9 -5 -11 -13 -18 -2 -6 -4 -5 -2 6 15 -3 5 5 7 -10 6 10 -4 5 7 -7 6 -3 -1 -4 25 3 17 -1 23 20 19 15 0 13
7700 13 4 25 -4 -4 -5 5 -8 -12 2 -12 -7 -2 -3 -17 -23 -21 -6 -14 9 -9 10 -14 -2 7 2 0 -15 12 13 -13 20 11 10 22 18 18 12 13 4 -6 -24
7741 -24 10 13 -4 20 16 7 -11 -16 -27 -24 0 -2 4 -9 -10 -28 7 -4 -1 -13 -3 19 11 0 16 7 9 -4 27 3 0 5 41 3 -9 15 -7
7778 -7 25 33 10 16 -22 0 -11 8 -20 -12 2 -5 18 -14 -14 -22 9 -1 2 -2 4 -2 -6 -13 -29 -6 -3 -4 10 -3 6 -18 7 26 -3 11 11 4 9 -1
7818 -1 18 -19 43 49 4 6 -12 -13 -10 -3 -6 -1 -19 -12 15 -16 -10 15 4 8 -19 -13 10 -3 -18 17 7 8 12 19 14 18 8 18 15 17 15 7 5 9 14 29
7860 29 10 10 30 8 8 -7 -1 2 -24 -8 -21 -10 8 9 -1 11 2 -9 3 -14 -12 -28 4 2 -3 2 -5 0 13 -3 -4 0 7 3 -3 5 -1 16 11 31
7900 31 -5 8 -5 20 30 -3 6 3 -10 -9 4 -3 10 9 -12 20 10 3 -16 1 -4 -9 -2 22 -7 16 14 1 29 -3 23 24 -16 -9 -5 -25 37
7937 37 -10 -12 26 -51 -66 109 -46 -128 133 -51 13 -35 -54 9 -19 24 5 -4 -6 -6 1 -2 7 -10 -15 -4 6 -9 0 11 14 19 0 -3
7971 -3 15 19 12 -2 14 1 15 -6 10 14 16 -11 -16 7 -9 -20 -3 12 -3 -13 -19 -4 -6 5 -1 -3 10 2 1 7 -15 -6 11 -18 15 1 6 12
8009 12 27 4 -3 20 4 -4 9 -10 -3 -4 -3 -1 -14 1 5 4 -17 0 -29 -28 -6 -3 -6 -25 -1 -24 -22 -23 -18 4 -19 14 12 2 5 3 25 13 3
8048 3 1 14 9 21 28 -4 -15 5 16 4 5 -14 -11 -11 -10 -1 11 -1 -14 0 -5 -26 0 -42 -6 0 -3 -15 -39 -17 -15 -2 4 -1 13 -12 -20 -6
8086 -6 3 -7 4 -5 5 1 3 10 5 -6 5 16 9 -7 -4 -2 -11 -11 -5 -10 -17 5 -17 -15 -3 -9 -19 -2 -1 2 -7 16 0 -2 -24 0 -7 -10 -4 13 -7 18
8128 18 1 0 14 4 20 6 6 7 29 29 33 32 21 3 -2 16 0 -12 13 -1 -3 10 -88 -32 6 -28 -10 -16 17 -10 5 -16 -27 0 5
8163 5 -9 2 23 7 16 2 10 4 20 -8 6 21 9 -5 4 13 21 26 -6 -7 12 -10 -11 0 0 -11 -7 10
8191A0
$$ Imaginary data points
##PAGE= N=2
##DATA TABLE= (X++(I..I)), XYDATA
0 0 0 0 0 0 0 0 0 0 0 0 0 0 0 0 0 0 0 0 0 0 0 0 0 -8 8 -8 8 -8 8 -8 16 -16 16 -16 24 -24 26 -32 32 -40 42 -48 54 -58
44 -58 66 -72 80 -90 98 -106 118 -130 144 -158 174 -192 214 -235 261 -291 326 -366 417 -480 557
65 557 -662 807 -1028 1439 -4951 9944 -16278 -5040 -3323 -29158 3952 -14950 -14130 -2865
79 -2865 -19558 363 -10491 -14672 -223 -17385 2403 -7479 -16795 6835 -8937 2554 3702
92 3702 -16378 4312 -1109 29 7561 -5104 4881 2619 1034 3917 -4317 8401 2490 131
106 131 6433 -6316 6786 4307 -6627 3125 -5495 838 4812 -5646 -1802 -5731 -3184 -2191 -6993
121 -6993 -1484 -6272 -2121 -3223 -11633 -1690 -6257 -3734 -791 -10696 -1412 -3482 -3379 -95 -8848
136 -8848 -20 -2125 -2272 3816 -6787 3029 1225 -5110 6267 -4750 3034 7145 -5538 6225
150 6225 -1678 -79 8678 -4866 4383 1382 -1934 8373 -4517 1592 2750 -4809 6813 -3943
164 -3943 -1086 4827 -6268 3848 -3115 -4542 5116 -5435 1281 -937 -5951 4028 -4421 -1144
178 -1144 671 -5784 3604 -2788 -2410 2065 -5113 2734 -1154 -3199 3037 -3316 1735 541 -3465
193 -3465 2674 -1758 552 1576 -2883 2289 -725 -399 1516 -2626 1773 -207 -841 1317 -2239 1074
209 1074 -72 -1306 844 -1787 542 87 -1546 675 -1599 150 218 -1766 835 -1364 5 406
225 406 -1796 874 -1023 -115 562 -1629 864 -651 -390 833 -1638 799 -126 -948 1196 -1587 381
242 381 328 -1365 1159 -1285 -50 439 -1499 831 -906 -443 764 -1614 452 -333 -1108 1052 -1275
259 -1275 -79 307 -1301 759 -655 -355 371 -866 385 -325 -156 413 -671 329 -212 -398 787
276 787 -529 249 219 -749 611 -276 66 369 -492 249 -308 29 248 -354 246 -289 -371 476 -405 115
296 115 215 -805 269 -161 -184 442 -342 -185 -55 -161 139 193 -34 -94 -194 12 152 167 231 -185 31
317 31 43 104 400 166 -2 12 123 99 439 250 12 110 -3 239 453 374 37 209 -30 163 512 220 330
340 330 137 26 134 309 268 266 160 -59 182 256 302 189 31 -81 83 183 173 252 -126 64 -205 -44 280
363 280 -45 259 -145 -321 239 -53 150 294 -447 239 102 -91 643 -355 216 283 -282 661 38 280 571
384 571 -365 325 322 133 967 -113 180 507 -82 898 57 89 678 -83 573 237 -13 653 45 68 284
405 284 -97 610 304 -238 148 -171 366 383 -167 42 102 76 212 -119 -202 464 -58 48 97 -409 621 72
427 72 -419 312 -426 440 554 -860 474 -226 -133 916 -1182 432 220 -669 1059 -1310 17 843
445 843 -1246 921 -850 -526 1513 -1486 510 -128 -1309 1928 -1318 -139 784 -1626 1853 -771
461 -771 -840 1408 -1490 1325 -18 -1609 1831 -1142 534 876 -2095 1958 -457 -347 1379 -2147
477 -2147 1458 379 -1178 1489 -1578 644 1042 -1699 1108 -896 -46 1371 -1849 627 -308 -565
493 -565 1264 -1703 112 261 -751 887 -1264 -405 604 -666 341 -803 -487 629 -441 -2
509 -2 -699 -173 492 -293 -48 -691 214 359 -287 14 -780 569 335 -511 332 -865 687 617 -1112 795
529 795 -737 361 1187 -1740 1005 -254 -228 1679 -1982 872 541 -883 1954 -1814 365 1531
545 1531 -1627 1990 -1201 -468 2557 -2021 1548 -187 -1342 3041 -1880 587 907 -1858 2922 -1293
561 -1293 -527 1844 -2091 2343 -512 -1636 2487 -1949 1369 452 -2404 2589 -1290 150 1172 -2517
577 -2517 2123 -318 -867 1557 -2174 1490 510 -1553 1708 -1554 852 1179 -1808 1574 -639 269
593 269 1540 -1550 1086 202 -101 1385 -1075 712 711 -170 1131 -793 555 796 -219 903 -654
610 -654 495 698 -239 578 -536 517 500 -327 488 -605 601 443 -624 678 -681 501 697 -1086
628 -1086 905 -578 170 992 -1297 982 -231 -147 1256 -1378 914 320 -654 1585 -1279 569 1040
645 1040 -1213 1695 -906 -63 1668 -1481 1367 -258 -680 1863 -1417 742 384 -1198 1818 -1175
661 -1175 4 1012 -1556 1609 -643 -738 1427 -1515 1011 -62 -1176 1441 -1098 381 464 -1255
677 -1255 1259 -643 -145 852 -1233 1109 -175 -524 1072 -994 751 233 -667 992 -594 372 478
694 478 -652 783 -312 110 585 -650 685 -133 -118 605 -640 550 -4 -194 492 -542 361 18
712 18 -255 446 -472 260 80 -381 457 -455 131 194 -542 524 -399 -9 299 -590 470 -303 -151 370
732 370 -600 342 -151 -341 456 -577 192 108 -543 503 -498 2 241 -598 448 -317 -151 309 -514
751 -514 283 -115 -281 408 -409 170 117 -364 435 -307 23 283 -391 422 -133 -42 325 -277 288 3 -94
772 -94 352 -202 177 141 -173 314 -175 73 185 -248 287 -155 -33 162 -262 174 -89 -113 102 -202 -6
793 -6 -64 -218 63 -214 -95 -17 -284 85 -201 -127 17 -262 37 -112 -139 -17 -149 -89 -30 -136 -9 -79 -119 -6
817 -6 -127 17 -82 -38 17 -82 2 -42 6 -34 15 -35 -27 30 -32 18 2 -39 15 12 -30 87 -32 -30 79 -62 111 -27 11
846 11 80 -68 96 29 -16 122 -12 14 91 -114 83 54 -97 141 -136 45 52 -149 66 -48 -43 49 -213 62
870 62 -70 -209 210 -121 -65 33 -263 244 -93 -142 175 -206 -16 -32 -306 186 -133 -105 177 -222 160 77 -178
893 -178 292 -294 26 55 -235 143 -68 -56 219 -194 90 183 -324 298 -70 -80 351 -264 239 29 -158 407
915 407 -78 174 295 -236 293 53 -201 332 -146 132 330 -330 403 13 14 323 -318 188 136 -284 477
936 477 -188 -49 351 -450 288 -85 -311 455 -361 108 233 -442 393 -131 -273 565 -497 171 194 -565
956 -565 617 -370 -60 472 -613 411 -43 -340 621 -492 175 326 -573 604 -219 -206 609 -608 409
975 409 57 -474 679 -445 60 324 -533 526 -75 -253 503 -419 266 245 -474 488 -232 -23 381 -406
995 -406 285 87 -178 329 -219 4 328 -199 202 -3 -234 363 -118 -34 200 -229 191 121 -284 251 -63
1016 -63 -81 356 -440 130 178 -336 402 -355 -99 413 -474 263 -103 -442 614 -480 -29 281 -733 657
1036 657 -293 -403 604 -773 448 85 -758 716 -529 28 457 -958 631 -156 -399 752 -960
1053 -960 432 262 -721 815 -726 62 642 -877 627 -261 -363 878 -819 240 219 -598 856
1070 856 -580 -66 511 -645 667 -304 -345 635 -565 350 1 -555 633 -346 -33 207 -556 481
1088 481 -163 -255 225 -417 255 -54 -319 141 -235 94 -27 -293 -7 -139 -18 -60 -251 -23 -98 22 -167
1109 -167 -178 -27 -191 122 -298 -141 65 -251 171 -317 -196 224 -335 182 -109 -345 412 -360 18 119
1129 119 -458 502 -271 -127 311 -533 468 -134 -319 488 -524 307 145 -531 569 -375 40 388 -666
1148 -666 497 -162 -228 497 -630 353 44 -420 506 -516 126 277 -529 460 -300 -132 430 -575 333
1167 333 -103 -315 473 -498 139 52 -368 374 -361 -9 182 -393 299 -211 -174 286 -412 199 -56 -248 313
1188 313 -303 123 -24 -260 257 -186 24 46 -224 250 -114 10 75 -182 243 -148 -181 123 -195 219 -79
1209 -79 -65 209 -251 232 0 -57 211 -194 42 105 -204 213 -126 117 94 -305 129 -107 34 175 -296 223
1231 223 -130 -154 242 -310 172 77 -128 216 -269 91 130 -240 187 -211 -52 103 -271 146 -145 -110 93
1252 93 -248 71 -69 -161 132 -220 -15 -2 -205 129 -179 -54 52 -229 127 -153 -59 94 -165 95 16 -64
1274 -64 139 -96 12 72 -113 163 -25 28 116 -60 173 -7 27 111 -58 106 19 -17 112 -8 54 58 -49 70
1298 70 -16 12 70 -85 61 -36 -16 4 -73 11 -41 -43 -6 -35 -16 -18 -15 -32 -39 -9 1 -35 -21 -29 21 -9 -3 15 -39 69 -35
1329 -35 29 39 -43 89 1 -2 65 -36 45 79 -48 99 -12 12 97 -101 69 0 -26 100 -112 42 74 -72 74
1354 74 -29 -61 142 -101 34 30 -106 179 -61 -7 101 -65 171 19 -88 161 -26 103 140 -125 216 67
1376 67 46 193 -156 189 151 -44 170 -82 96 246 -110 104 26 -35 311 -125 22 162 -102 244 -103 -108
1398 -108 214 -101 118 18 -237 214 -33 -64 109 -274 206 63 -176 132 -202 125 168 -260 97 -24 -5
1419 -5 274 -261 22 129 -78 277 -175 -87 307 -102 160 -34 -145 374 -23 -1 142 -193 350 98 -185
1440 -185 221 -168 228 175 -308 235 23 70 259 -325 141 194 -99 255 -236 20 411 -184 182 -117 -107
1461 -107 456 -202 18 95 -160 413 -102 -200 226 -165 258 34 -331 278 -59 93 103 -378 224 85 -129
1482 -129 133 -300 93 228 -243 82 -154 -25 308 -295 -35 6 -89 289 -183 -152 175 -82 176 -33 -268
1503 -268 301 7 25 100 -239 259 150 -128 144 -141 165 312 -239 132 41 7 362 -267 22 239 -133
1524 -133 317 -192 -126 355 -139 155 -25 -298 415 -114 -94 135 -349 360 -21 -284 234 -276 207 136 -433
1545 -433 246 -128 -7 246 -480 188 67 -174 294 -406 78 250 -286 246 -258 -57 363 -288 96 -34
1565 -34 -149 407 -223 -41 146 -192 342 -152 -154 198 -160 215 -43 -233 201 -47 51 59 -250 170 56 -78
1587 -78 71 -172 123 89 -119 13 -57 95 122 -55 -27 35 44 56 -37 -69 104 73 29 -3 -54 74 115 -87 43
1612 43 -18 -18 173 -150 -11 61 -78 173 -140 -30 130 -120 136 -64 -174 209 -136 8 30 -250 248 -114
1634 -114 -72 114 -262 197 -39 -171 179 -196 119 72 -246 191 -118 -15 157 -282 175 -33 -73 207 -243
1655 -243 120 57 -140 163 -157 16 146 -169 154 -55 -48 190 -173 107 -6 -53 181 -151 45 56 -85 128
1677 128 -91 -9 79 -108 125 -43 -32 103 -105 85 -42 -70 87 -109 55 -55 -60 55 -97 24 -38 -83 33
1700 33 -95 -44 -9 -116 34 -86 -39 8 -126 36 -116 -87 45 -135 37 -69 -63 29 -110 24 -29 -96 83 -111
1724 -111 -21 42 -117 115 -67 -4 51 -103 80 -33 -11 84 -70 87 -9 -71 84 -80 39 54 -65 103 -60
1747 -60 23 93 -81 105 -35 -15 90 -64 63 -15 -60 84 -61 -3 28 -67 60 -69 -52 19 -116 40 -49 -51 32
1772 32 -96 19 -26 -87 4 -83 -24 4 -91 20 -54 -66 10 -81 18 -28 -60 15 -51 5 9 -32 6 0 13 11 -23 20 6 1 25
1803 25 -6 11 7 19 -13 3 -2 -11 57 -24 38 3 17 50 -12 2 20 -16 40 -8 -51 71 -5 22 37 -42 76 9 16 54 -56
1834 -56 76 29 -35 65 -54 27 96 -74 61 1 -24 111 -107 5 -2 -84 84 -81 -75 65 -79 19 -36 -145 95
1859 95 -66 -16 7 -143 84 -19 -94 36 -105 61 47 -143 72 -11 -5 108 -125 73 52 -32 133 -123 22
1882 22 151 -64 117 1 -18 208 -49 26 55 -69 217 -50 -77 98 -84 157 35 -146 118 -39 36 68
1904 68 -215 98 56 -62 101 -188 46 140 -130 79 -113 3 206 -151 -18 30 -66 213 -135 -86 130 -85
1926 -85 159 -51 -161 181 -41 28 1 -202 169 51 -76 96 -155 108 109 -188 67 -109 53 157 -222 7
1948 7 29 -20 149 -200 -46 171 -89 125 -89 -146 235 -50 35 -2 -137 234 7 -75 91 -112 161 98 -196
1971 -196 135 -29 118 167 -243 118 53 0 150 -182 14 168 -94 106 -115 -75 277 -103 -4 -23 -105 213
1993 213 -126 -115 63 -116 145 -27 -214 111 -51 36 36 -232 120 38 -77 80 -196 52 112 -148 31 -101
2015 -101 -9 188 -169 4 28 -67 228 -126 -77 117 -94 155 -79 -157 191 -56 55 36 -181 199 31 -56
2037 -56 102 -165 143 103 -144 124 -98 74 138 -170 77 26 -11 183 -156 32 101 -102 147 -133 -46 159
2059 159 -108 82 -17 -106 152 -73 -34 44 -109 130 -38 -86 87 -111 83 17 -150 46 -44 7 9 -123 3
2082 3 34 -57 21 -83 -11 45 -65 11 -15 -17 46 -53 -29 12 -25 36 -13 -63 42 -20 -20 6 -92 35 7 -29 31 -54 7 87
2112 87 -60 29 27 -42 107 -65 34 23 -52 102 -47 -22 87 -43 73 13 -64 110 -9 2 39 -108 117 -14
2136 -14 -39 70 -95 69 20 -63 78 -59 5 52 -123 53 -44 -45 57 -135 35 -18 -73 68 -91 -11 21 -65 17
2161 17 -47 -21 31 -99 48 -27 -39 48 -46 3 -8 -38 43 -58 -6 15 -7 50 -33 8 31 -12 43 13 4 59 -18 32 3
2190 3 5 47 -31 60 7 -13 43 -13 38 17 -26 10 -20 16 18 -28 50 -19 -21 29 -44 40 -36 -4 17 -69 19 -37 -42 12 -54 10 -4
2223 -4 -38 39 -40 12 19 -65 42 -33 8 20 -44 38 -5 -14 36 -32 19 -2 -34 50 -45 -8 22 -46 73 -33 9 40 -30 46
2253 46 -23 -32 30 -39 12 20 -50 33 -14 -1 25 -34 50 -19 -1 31 -46 24 6 -2 65 -2 34 32 -2 35 22 -8 30 -24 19 2
2285 2 -24 38 3 2 10 -16 1 11 -24 19 14 -32 -13 -18 -9 -8 -4 1 -19 -24 -1 -31 -25 22 -54 9 -2 -48 43 -10 11 9 -50 53 -26 -28
2321 -28 38 -53 -25 23 -65 46 -15 0 48 -103 61 12 30 81 -60 11 53 -43 63 -8 -1 120 -35 37 32 -22 99
2348 99 -25 -25 18 -53 152 -2 -13 75 -88 -4 56 -113 44 20 -8 107 -53 82 41 -106 -33 -101 -23 144 -114
2373 -114 13 -20 -94 161 -150 -28 59 -114 73 -25 -25 22 -167 61 -27 -151 176 -58 -36 45 -122 121 3
2396 3 -124 127 -110 37 78 -68 40 22 -67 99 -34 37 81 -64 74 -45 -38 97 -38 25 -27 -77 112 -47
2420 -47 -16 60 -75 138 -68 -154 121 -178 34 46 -71 79 35 -54 76 -52 -1 65 -52 105 -31 -38 149 -86
2444 -86 -8 81 -128 141 -87 -52 50 -177 97 -39 -129 46 -59 -17 -1 -157 278 -173 15 30 -147 51 19
2467 19 4 215 -142 -12 75 -83 82 -121 -113 142 -176 8 43 -44 93 -59 59 116 -96 88 -26 -98 143
2490 143 -126 28 4 -85 82 -3 -19 83 -69 -25 -53 -85 129 -82 -6 72 -112 -6 37 -33 68 -115 58 84
2514 84 -134 87 -10 -40 44 -29 13 14 -124 72 -92 -57 132 -80 -22 11 -181 78 -40 -39 57 -99 85 -44 -96
2539 -96 95 -106 -30 35 -138 56 -48 -19 57 -74 9 41 -68 78 -30 -14 119 -38 55 -15 -55 84 -16 45
2563 45 61 -48 76 15 -40 35 -25 48 63 -26 53 -11 21 31 -30 9 23 -36 14 -23 -14 52 -68 35 -21 -49 14 -32 8
2592 8 9 -23 -9 10 -71 42 -3 -20 15 -53 78 -14 15 11 0 26 33 -57 -3 -37 -87 54 -65 -2 19 31 5 -43 -63 -14
2622 -14 -54 7 -30 -19 46 -27 -6 16 -36 31 -14 -4 41 -51 48 11 -7 64 -23 46 9 -19 63 0 2 47 -51 39 8 -25 39
2653 39 -38 14 0 -9 32 -13 -17 12 0 -17 -6 -10 17 -33 -8 5 -25 10 -39 -7 -22 -12 11 -17 -27 -4 -8 -19 -8 7 -12 -3 -4
2686 -4 -18 -22 11 -36 1 -29 -21 -2 -19 0 -34 -5 -4 -40 21 21 22 -12 2 31 -76 49 80 -36 -43 15 5 45 -19 13 14 -36 42
2719 42 -2 10 17 1 4 26 1 29 15 10 16 -34 29 1 -12 25 -18 25 -40 -34 4 -17 9 3 -42 4 -34 -29 7 -39 6 -39 -33 29
2753 29 -48 16 10 -23 25 -21 3 13 -17 -5 -10 -27 29 -7 24 12 -30 9 -20 5 15 -15 15 9 -15 3 25 3 3 -17 22 -21
2785 -21 5 7 -3 11 36 -2 21 21 -23 41 -13 10 51 -28 45 3 -31 39 14 30 17 -29 38 9 -39 36 -53 22 11 -44 32
2816 32 -28 -27 11 -43 12 1 -34 44 -38 -25 40 -65 24 -37 -66 52 -64 -18 5 -64 51 -12 -22 19 -49 28 18 -56 51
2845 51 -23 22 25 -85 43 -17 -22 53 -75 18 39 -42 53 -26 -18 81 -39 62 -10 -37 87 -69 -7 30 -39 63 7 -32
2873 -32 68 -56 22 51 -78 86 -14 -5 42 -82 35 18 -38 57 -42 -22 48 -60 24 -30 -73 67 -60 -5 -1 -68
2899 -68 60 -76 -43 5 -66 51 3 -128 56 -20 7 30 -133 37 22 -50 21 -73 19 32 -90 41 -33 -25 109 -74
2925 -74 -12 -6 -30 104 -48 -20 72 -19 47 7 -88 89 -47 13 48 -98 68 17 -71 48 -53 18 48 -47 48 -1 8
2952 8 99 -64 35 47 -42 88 -52 -33 61 -39 42 -43 -77 97 -14 17 -15 -76 72 -1 -30 48 -76 73 11 -90
2978 -90 52 -40 8 56 -145 21 -1 -44 116 -92 -14 34 -49 -10 -79 -27 95 -68 18 -3 -18 83 -16 -51 59 -51
3004 -51 53 1 -58 69 -2 33 37 -73 64 22 -25 55 -53 29 52 -55 42 -36 -35 74 -37 58 -8 -24 71 -27 -1
3031 -1 38 -39 46 -9 -52 66 1 50 -3 -69 42 -10 -3 40 -10 31 31 -65 -10 7 -27 30 6 21 -25 -49 -5 -84 -18 25 -40
3062 -40 1 -13 -37 25 -10 2 29 -12 56 10 -18 24 -45 59 20 -17 74 -41 -11 33 -5 12 10 -42 -3 6 -51 103 0
3091 0 68 -32 21 41 11 -65 50 37 -18 38 -69 -5 -44 54 -50 -6 44 11 29 -48 -23 9 21 18 -3 -27 18 34 -21
3120 -21 -41 39 -27 57 3 -68 13 32 104 -53 97 23 -51 -7 88 -67 3 -4 -93 72 23 -57 44 50 -77 -96 -86 12
3148 12 -72 -9 22 10 -37 -22 -60 -41 2 47 10 -1 0 5 -14 -15 -21 -6 18 24 4 -5 10 1 14 -15 2 11 14 -12 -4 -1 13 8 -1 6 -3 15
3186 15 -13 -1 4 -5 -12 -21 -18 -24 -27 5 -5 27 -33 10 25 -16 -4 -14 10 -11 -4 -15 -5 -12 -12 -22 10 -6 -1 7 -18 30 -17 -27 29 -12
3222 -12 9 11 -18 4 2 -17 10 -25 26 19 -17 21 -8 9 21 -15 26 13 -3 30 14 15 48 -6 39 9 16 77 -15 35 34 -20 7
3255 7 9 11 21 -1 17 -2 -26 18 -20 -6 -13 -25 13 -21 0 21 -21 12 0 -31 3 -14 -14 23 -15 -18 -10 -7 23 -25 -26 20 -4 5 -18
3290 -18 -19 44 -4 7 23 -22 52 -6 -30 -3 6 22 9 -31 2 0 7 35 -43 14 16 -3 54 -33 1 53 -4 45 -20 9 59 5 12
3323 12 -1 -12 66 -3 -26 35 -38 18 -3 -37 44 -8 8 43 -49 0 11 -21 30 -58 -4 53 -58 14 -19 -16 56 -45 -7 -7
3353 -7 -44 34 -12 -23 24 -25 44 -18 -38 71 -6 26 2 -45 60 14 -11 17 -41 30 48 -48 36 -18 6 78 -59 14 -13
3382 -13 -23 52 -52 -12 81 -27 36 -24 -30 58 -8 24 14 -29 85 -29 -25 47 -28 63 13 -37 42 -20 16 59 -59 28 -3
3411 -3 1 55 -73 3 56 -37 30 -24 -24 49 -63 -6 -14 -50 59 -38 -37 21 -32 65 -14 -71 20 -6 7 9 -66 51 13 -16 28
3442 28 -68 9 51 -25 48 -34 26 74 -26 7 24 -5 79 -11 -4 25 -25 38 -7 -23 48 -10 15 -10 -49 64 7 -13 19 -51
3472 -51 49 31 -33 43 -27 22 54 -38 8 -5 -21 49 -40 -20 31 -25 33 -34 -10 32 -41 5 -20 -27 48 -10 -10 -2 -50 25 -1
3503 -1 -56 40 -16 23 -3 -63 16 -13 -2 2 -32 21 30 9 18 -30 11 62 -12 19 10 -22 58 -8 15 18 -27 44 -6 -20 16 -24 -1
3536 -1 29 -14 45 -26 24 26 -25 17 5 -16 8 -20 3 26 -27 26 2 -9 32 -13 3 20 -3 13 -2 -12 17 -3 -1 31 -10 22
3568 22 3 -9 11 -31 8 -12 -33 -2 -17 -10 -5 -33 -16 -23 -19 35 0 -24 -2 -17 -6 -8 5 21 8 11 5 -3 20 2 -18 9 -13 27
3602 27 6 1 19 -3 33 18 -3 7 6 23 14 16 21 18 -10 4 0 -4 31 7 19 12 17 -1 -3 18 11 3 35 21 -3 21 9 22 21 1 25
3639 25 -7 10 7 -9 -2 16 -5 14 0 -16 -7 -22 -7 6 -14 3 -21 -12 -17 1 -4 -6 3 2 3 0 13 -27 -4 -3 -12 -7 10 11 -4 6 4 15
3677 15 -28 27 -8 10 19 8 32 -8 13 19 7 -4 10 18 5 3 7 12 -14 -6 10 3 20 -11 24 11 10 10 -4 10 15 -35 24 -2 -28 11
3713 11 7 11 13 3 36 -9 20 6 2 34 -2 0 13 8 7 25 -14 19 -13 3 27 -36 11 -16 -25 21 -7 -16 17 -6 15 -5 -6 18 -7
3748 -7 7 -1 6 28 -37 -3 -20 7 17 8 -26 12 7 -8 4 -10 16 8 5 27 -13 29 16 3 44 3 0 30 -6 24 -3 -21 21 -23
3782 -23 -15 11 -12 24 -6 2 24 2 3 -12 -20 16 -7 3 42 -26 40 16 -37 10 -19 -5 4 -32 26 8 -18 22 -43 -1 9 -7 34
3815 34 -9 -27 49 -12 5 -14 -25 26 -6 -18 5 -22 11 17 -38 29 -16 29 38 -34 37 -9 2 43 -16 21 42 -1 65 -38 -3
3846 -3 70 -15 37 -9 -27 55 -23 8 16 -6 41 23 -43 30 -26 29 3 -28 29 -22 0 22 -28 20 13 -22 14 -38 1 39 -62
3877 -62 -6 -10 -21 50 -23 8 35 -13 23 -24 -39 17 -19 12 -3 -16 23 -19 -13 14 -23 14 6 -28 7 -35 19 27 -34 32 3 -7
3909 -7 33 -37 -3 10 -1 23 -6 3 45 -5 13 39 -25 61 -4 12 34 -25 56 14 15 42 -7 32 35 -32 19 -5 -5 6 -42 1 14
3942 14 -41 9 -23 3 38 -29 35 4 -20 24 -11 -2 20 -24 9 -24 0 33 -54 9 -6 -6 23 -27 13 6 -23 26 -6 -15 36 -12
3974 -12 4 18 -31 49 -5 -10 35 -23 11 7 -26 30 1 3 37 -11 17 -5 -9 45 -15 16 -3 -6 39 15 -20 64 9 38 24 -53 28
4007 28 21 -9 8 -27 -2 -21 -17 6 -16 -1 46 26 -47 71 32 30 13 -16 -21 -22 40 -5 33 30 -6 51 -33 43 -42 -65 72 1
4039 1 10 24 -37 57 38 48 72 -30 36 -21 -9 -2 -2 43 -12 37 18 45 -28 -27 -47 4 -37 -1 25 70 3 59 -1 29 103 62
4071 62 69 -6 72 18 -72 56 114 171 -11 106 31 109 45 -40 73 30 -35 28 14 10 -13 21 5 -44 50 24 5 70 3
4100 3 -12 -31 56 -44 30 59 13 24 22 -33 21 42 8 -5 -39 22 29 -27 -21 9 -2 -2 20 -13 8 17 36 -8 21 -47 -22 19 -8
4133 -8 3 -17 13 -8 14 8 -23 19 14 16 3 -4 -14 8 -24 16 -11 -12 2 7 18 20 -8 11 13 -1 24 12 -19 -12 11 -5 -19 6 -11
4168 -11 -36 -23 -9 -28 8 -14 -14 -14 4 4 0 -14 -12 -19 -9 -6 -19 -4 -16 18 1 1 -11 5 -7 -2 23 5 11 -2 18 1 6 17 15 19 -6
4205 -6 23 41 2 27 17 -62 -8 22 -9 29 21 -13 36 56 21 0 36 58 21 -59 -41 -7 45 0 14 -1 49 25 -11 22 28 47
4237 47 12 -17 39 -54 40 37 0 28 63 7 12 -12 -87 -55 -10 -93 -1 -27 -27 73 -79 -3 -36 -77 -53 13 -54 43 -22 -6 14
4268 14 12 -46 30 -65 38 4 -6 -84 41 74 34 48 42 -54 -99 -72 -113 -13 29 -22 107 5 7 -5 -14 0 39 -76 -23
4297 -23 -36 -34 -1 22 60 20 13 9 -7 -10 28 66 21 10 91 -54 1 46 26 46 29 2 -47 3 -1 -35 18 -47 -26 3 1 -20 -15
4330 -15 8 -2 13 -18 -23 -17 -2 17 -3 -33 4 -14 -4 3 -15 16 17 -17 26 -33 2 2 -10 22 -15 7 16 -2 0 8 -11 36 11 21
4364 21 39 3 32 13 -13 10 -11 15 23 -7 28 -15 -15 32 -11 8 28 -28 32 -19 2 10 -14 19 -10 -16 10 -28 11 31 -30 16
4396 16 3 -7 18 -43 34 -1 -30 29 -9 -7 12 1 -16 18 -60 10 -19 4 9 -26 -12 -7 -40 16 -18 -3 22 -5 -4 2 -14 12 -16
4429 -16 22 -3 -21 17 -16 16 16 0 24 20 -21 25 -4 6 11 -9 26 14 18 26 4 -8 17 1 38 -9 19 2 -24 -9 -23 -31 7
4462 7 -18 -6 -5 -23 -5 17 -7 -2 -14 9 8 -18 39 -12 -18 13 22 11 13 -4 1 5 2 -11 -23 6 0 -7 30 5 -8 -23 5 7 -21 -14 -6 1
4500 1 14 -10 -28 1 12 -8 -19 -26 -12 -5 -22 4 -13 31 5 15 26 29 -11 0 22 5 9 -2 54 3 23 14 -15 3 -9 13 -9
4533 -9 -15 0 7 -10 13 10 -5 3 -19 -51 -56 -4 4 -9 3 56 -10 -22 -7 -38 10 -6 -54 -5 8 -20 -25 37 0 -19 -8 -36 65 51
4567 51 20 -41 48 9 43 -17 13 52 -75 -12 -32 -32 20 9 13 30 -66 3 30 10 27 65 0 4 -75 -60 -97 43 -58 -36
4597 -36 -25 50 81 22 48 -19 -15 99 -41 -33 68 -53 30 63 -15 0 25 -3 -9 -4 -11 18 15 28 64 -60 -38 45 -5 1 -51
4628 -51 46 79 -54 118 7 -16 2 0 -21 -4 82 3 17 -62 -149 -90 53 -38 11 1 19 -27 -27 -10 3 12 -1 17 12 1
4658 1 -30 -59 9 1 35 23 -24 -13 -73 -7 -41 115 33 34 44 -11 80 45 -31 42 57 -52 51 32 35 13 -6 58 -29 -20 -19 -34
4690 -34 52 24 -31 -25 12 -22 -34 2 -24 -21 -8 15 -29 -28 -82 -9 -47 4 -31 50 21 16 93 1 18 -84 44 -4 126 40 -143
4721 -143 -86 37 87 -6 -5 -7 -10 -42 -11 17 36 -68 63 -45 -16 4 9 36 -1 22 -4 -1 9 31 28 17 16 12 0 3 -3 2 15
4754 15 -7 7 6 -6 26 1 16 31 20 23 0 -4 28 -8 9 21 -11 0 -6 -19 -2 -32 3 6 -13 8 -5 -6 25 -18 -2 -2 -33 20
4788 20 11 -16 -8 7 -2 -10 -17 4 0 -7 -1 -5 21 15 2 33 15 14 8 -8 35 1 14 13 -36 12 -6 -15 4 -5 15 22 -17 -2 -31 -15 2 -33
4826 -33 10 -11 -4 32 7 -12 7 11 23 -8 -39 -6 -5 12 6 -23 -5 13 -13 8 -20 -14 12 -24 19 -21 7 -11 -17 -15 -19 -14 -16 -6 -13 -13
4862 -13 -17 2 -20 -8 4 -10 8 12 -25 27 23 -16 16 -4 31 16 3 18 -7 13 36 7 18 21 36 7 1 3 4 -18 0 -1 -9 -15 -11 55
4898 55 39 -23 29 -32 -14 -13 -28 7 32 -22 17 6 -24 -16 -74 -26 -6 -1 -61 -31 64 -9 -113 -16 18 98 -36 -32 -78 -44 -52 17
4930 17 22 9 -32 11 34 -60 80 -1 32 -11 -9 3 28 76 23 -43 -62 -40 -36 49 55 13 -80 -54 14 -19 46 -31 2 -74 -49 44
4962 44 -41 30 -27 13 -6 10 -22 20 -3 9 12 -1 11 -10 -8 6 -8 2 -18 -2 17 -11 3 4 -21 -21 -21 -12 13 -18 -2 -8 7 7
4996 7 18 -7 0 -8 -10 2 0 11 -11 6 5 0 44 4 -1 -7 -21 13 -15 -1 16 7 -6 14 -22 0 -7 -2 9 -9 1 -15 -5 -5 -2 8 5 -3
5034 -3 32 22 23 18 -1 28 12 3 -3 3 -1 -2 2 -10 12 14 -5 -13 0 1 -7 -9 3 1 20 7 30 -1 -13 4 -6 -14 14 -21 6 -10 -14 15 -11
5073 -11 1 -16 1 27 9 9 -12 -15 8 11 25 -4 7 4 2 -9 -5 -14 14 -17 -33 -7 -25 6 7 0 9 16 9 -11 20 7 7 -7 -21 11 4
5110 4 -14 -15 -5 15 -6 -5 0 8 12 19 15 7 -1 21 -8 -7 19 0 18 -5 -1 -12 -3 -1 6 -3 -15 14 -5 -28 -20 -6 -4 -4 -5 18 -17 -4 -11 -19 5
5151 5 -12 28 -1 -11 -3 -10 14 -3 -6 -9 -16 -10 -3 19 5 -3 6 -21 -1 -27 6 14 -15 6 -17 -3 2 0 -9 -13 -3 4 -13 -4 -15 -2 11 6 9 7
5191 7 -11 12 21 13 10 7 5 1 24 21 10 25 10 3 -11 -9 -6 15 -5 6 -6 -15 6 -8 5 9 1 -9 10 -11 24 -23 -12 0 -5 -12 -18 6 10
5230 10 -19 -5 4 1 6 -21 19 20 -26 11 8 -6 -7 3 -4 21 12 11 -16 -13 20 2 6 8 -28 4 -14 -18 5 -21 18 -9 -10 4 14 11 11 -12
5268 -12 2 8 0 3 -9 7 12 30 9 -3 7 21 17 9 10 -1 21 -11 -2 42 -3 7 9 -15 21 2 -2 -6 -32 0 -6 -1 3 -13 -3 -28 -11
5305 -11 5 0 -13 -4 12 21 8 -14 33 -5 13 4 -10 13 -23 2 19 9 -2 15 -4 8 12 16 13 0 23 13 -4 -3 -12 19 10 -1 6 8
5341 8 1 21 -9 19 -40 25 5 16 59 16 45 18 -14 0 57 -8 41 -15 21 16 45 -63 -29 -12 1 75 -57 23 -75 -2 23
5372 23 7 10 3 -16 -11 -31 -5 26 3 5 -12 -14 1 1 -4 -13 -10 -5 -22 -17 18 1 -12 7 -16 29 12 30 19 18 17 20 7 10 5 4 17 0 3
5411 3 -6 1 9 -10 11 4 14 1 -11 7 18 -9 9 6 -18 -3 -10 -6 1 -1 5 -13 6 0 7 1 22 -12 25 14 -27 19 9 7 8 -6 10 -25
5449 -25 -6 2 -17 -7 -24 -13 17 3 -20 -8 -11 -6 0 -23 -8 -11 6 11 -9 1 -3 1 5 10 -15 14 -13 3 -13 6 -2 -12 -10 -11 -10 16 6
5486 6 17 16 -1 -8 -4 -2 10 13 10 4 15 18 7 6 21 6 0 -1 0 -5 4 -2 -16 -21 8 -2 19 1 3 -5 11 2 -4 15 -12 -18 -21 9 11 16 3 2 -13
5529 -13 -3 -13 -9 -7 0 -24 -18 8 10 -13 -3 -3 -18 -7 -1 0 -9 2 -23 4 -4 -19 -2 14 18 26 5 -12 14 2 -3 25 -5 17 -1 12 7
5566 7 14 17 -2 3 -12 -1 6 -13 3 -4 8 28 2 -5 -6 2 10 -14 26 -13 -19 0 -13 5 -17 8 10 -26 3 3 -10 13 -10 -17 7 5 16 -3
5604 -3 2 26 -18 14 2 -2 -2 -33 -9 9 -30 -5 -26 -2 11 -23 -7 12 -8 10 11 -17 2 10 -5 -8 31 10 1 -6 10 0 19 12 8 1
5640 1 -4 16 5 10 14 -5 30 19 9 22 23 11 -5 -2 -10 14 -11 17 -3 -2 3 -13 7 -18 -19 -4 -17 4 0 -10 -5 -4 -21 10 5 7 -4 13
5678 13 2 3 -8 12 -12 -6 6 -5 -15 9 -8 8 8 -5 -2 -5 9 14 13 9 -19 -16 -2 -6 -3 -7 2 -15 -8 7 -10 -6 -3 9 -3 -1 -18 8 4
5717 4 -12 10 8 20 -2 5 16 7 -14 -2 -30 -9 -6 -21 -2 4 -18 -10 -11 -5 -26 14 -11 -22 -21 6 0 -1 -16 -24 19 -8 -7 1 -32 11 -16 14
5755 14 -1 -16 16 8 -8 6 2 5 13 10 14 13 -7 12 -7 -18 -2 -29 7 14 -1 -8 -7 -12 -7 -3 15 -7 3 13 -3 7 -1 -2 24 -5 -40 -5
5793 -5 -7 -15 4 -4 12 -1 21 18 -3 3 5 12 1 -2 28 9 -1 11 -7 -1 -3 -31 -14 -16 -7 0 -20 4 16 -8 -11 4 -11 10 -3 -2 0 9 17 -5
5833 -5 28 8 6 33 3 6 6 -19 11 9 -10 14 1 -15 13 -18 -8 -4 2 -20 12 17 -4 -1 -3 12 -22 -19 -15 9 2 -26 14 -14 -16 4 -23
5870 -23 -2 6 13 18 0 5 11 2 15 3 -22 11 33 -12 26 2 0 -7 -26 -5 9 12 -1 15 11 -23 9 -4 -9 22 -11 10 6 12 9 2 -17 3
5908 3 -33 -12 -1 -24 9 -17 0 -4 -11 2 19 -17 11 15 5 26 -6 4 -3 -22 -8 8 -1 7 0 2 -3 -13 -10 14 -17 -4 -29 6 14 12 73
5945 73 14 74 26 -66 65 24 28 28 -35 14 -22 -2 9 -39 3 40 -6 -15 80 15 -12 2 108 33 27 40 -82 6 116 28
5975 28 -4 34 -52 -20 -50 -13 5 -38 1 5 -8 -18 0 0 -2 -10 -9 -9 -5 -18 -2 -19 -2 -4 2 9 -5 -8 6 -12 6 6 -2 0 1 26 5 0
6013 0 -14 16 -8 6 8 -13 2 -6 7 -30 -5 8 -10 9 -14 6 20 -10 13 -15 7 4 -1 -7 1 16 25 25 1 17 5 -9 -14 8 -6
6048 -6 -22 -9 6 -6 -1 -8 -11 -1 -14 13 -4 -15 -7 -12 -11 -19 6 0 -23 -60 -16 -37 -2 -31 -24 -3 18 14 27 -17 90 -25 98 -11
6082 -11 -91 92 26 -11 -50 -12 -29 25 -22 27 9 -2 -3 2 1 25 -3 8 -19 -1 -7 -2 -13 28 -6 10 18 4 2 1 -8 14 1 13
6116 13 8 8 -1 3 21 -16 14 13 5 1 16 4 -9 4 -3 -15 -1 -13 -4 -15 1 -13 -15 -4 0 7 -20 -9 -24 -9 -20 8 -16 -6 3 -9 5
6153 5 -2 11 6 -20 1 -5 14 19 -2 10 23 -8 24 9 19 30 -1 4 -10 -9 6 -4 -5 24 -1 -11 6 -3 -13 -13 2 2 -11 17 -8 18
6189 18 7 -2 29 17 -9 2 -12 -4 -2 14 0 -19 -13 -4 -5 6 -15 -3 9 -3 2 2 7 -3 6 -5 12 -8 -19 -14 -4 -2 13 -2 3 -5 -16
6226 -16 -28 2 19 -3 10 27 -3 23 20 7 -2 0 17 17 9 11 8 6 -1 7 5 3 11 6 -13 2 0 -23 -15 8 9 -14 3 10 2 -17 14 2 -17 1
6266 1 -19 22 -17 -17 -8 -4 -1 1 -13 5 3 -1 -5 -17 -2 14 8 -2 16 -7 -9 17 17 -33 1 -4 -12 -10 5 8 8 -21 -8 -9 -24 24 -7 -14 1 20
6306 20 -10 -4 7 27 -10 1 26 24 5 24 -1 -6 -6 6 17 -10 13 12 9 13 12 13 -5 -10 13 -1 -8 12 -1 1 -3 -3 -1 -13 5 -12 -9 3
6344 3 -5 -32 -1 -15 0 11 9 11 7 -21 -6 6 17 -3 20 7 12 -7 13 -1 10 6 -15 9 15 5 -10 -5 -13 4 -3 -26 -5 4 -8 -19
6380 -19 2 -16 -15 0 -5 -12 22 10 15 0 -8 -1 -7 37 13 6 42 17 15 11 10 26 -16 -4 14 -4 -9 15 4 5 -6 11 -3 -1 3 -26 -23 -18 8
6419 8 3 -17 -16 -27 14 4 1 -5 5 2 4 -5 17 -3 2 4 12 -2 10 5 8 5 4 9 23 13 -15 11 -10 -7 0 5 -5 -16 -2 10 -8 -22 -1 8
6459 8 -31 5 -4 0 9 0 1 -5 -9 -2 6 7 14 -10 -8 -14 -7 -1 27 18 14 0 4 24 -6 6 1 2 21 2 15 1 5 87 -6 -34 -3 6 7 -4 -12 18 -9
6502 -9 2 -9 -14 -8 11 -6 -12 3 -2 19 -16 -6 7 6 6 1 3 -2 -7 6 4 9 -23 12 9 11 -4 -25 1 -16 22 10 18 -14 -4 0 -4 -13 -4 14
6542 14 12 2 1 -17 -2 -3 -24 18 -12 16 16 10 25 28 26 18 19 6 10 11 11 7 11 13 -2 6 -1 15 0 17 11 -8 6 -1 -17 -1 -23 -8 1 6 -17
6583 -17 1 -14 -15 -20 -15 3 -5 13 -15 -6 13 -2 10 14 13 12 24 15 14 3 -11 6 -24 -3 -16 -2 6 -13 8 -8 -16 -2 -5 -6 -3 -7 14 18 -13
6622 -13 13 -3 -3 10 3 9 -2 -3 0 10 -7 7 -11 1 22 -4 29 0 7 17 15 -9 -7 -1 19 23 -7 7 10 1 -3 -22 -11 -12 -5 -19 -15 -8 -20
6661 -20 -16 -15 16 -6 7 4 5 -1 4 -4 4 8 1 -5 -2 11 6 0 7 2 3 7 23 13 -10 -2 1 -27 15 26 -6 3 -18 11 -20 17 -30 -7 -1 13 -11
6702 -11 -12 -7 21 -41 0 -10 -64 19 1 7 4 6 -12 25 9 4 5 -11 14 5 6 -5 0 -7 10 -21 0 2 -5 -8 -2 0 -14 8 11 -3 -5 -12 -9 12
6742 12 6 -9 -17 -2 3 -2 5 12 -19 -2 2 -17 34 -11 7 12 7 17 28 2 16 -10 0 5 5 -3 -2 2 -21 -13 -4 14 17 18 0 9 14 1 10 3 -10
6783 -10 12 -14 12 2 -1 9 -4 2 -12 -8 6 -1 12 17 2 19 24 10 24 7 7 11 13 10 -1 -18 -3 -31 16 -22 -23 13 6 1 9 -2 -17
6820 -17 -12 1 -2 -16 -19 -15 -10 -5 4 -27 12 2 14 11 28 21 7 6 12 13 1 8 8 6 12 0 17 9 21 -19 2 13 12 13 15 -14 -9 -16 3 -24 -7
6861 -7 -2 -2 -37 -19 -11 -9 0 -20 12 6 -5 1 0 33 -15 -18 10 -6 21 -37 45 68 -10 -7 -6 -4 24 0 59 -20 -12 49 1 36 18 30 -56
6898 -56 -39 -1 -103 81 69 -63 54 -33 23 25 4 -68 15 -67 47 -13 24 50 -35 63 -18 -148 30 -5 -41 74 -12
6925 -12 49 -40 44 -75 83 106 94 47 -17 85 85 93 -15 46 -31 27 1 29 -5 45 3 11 -6 -3 -1 -3 4 -25 0 -7 1 0 8 6
6959 6 18 5 -8 22 -5 9 -7 15 -16 7 -18 -5 -32 2 -11 -10 -12 -18 -23 -4 -16 4 -7 -15 5 -7 -6 -17 7 -8 3 6 -1 -3 -15
6994 -15 7 -3 5 -4 7 42 28 33 18 19 39 9 58 -55 19 54 -40 18 6 2 15 -21 -11 -22 -26 -18 -12 -19 -24 10 5 -5 -17 14 -6
7029 -6 -9 8 -6 9 9 26 5 2 16 13 -11 4 -7 9 7 5 -14 12 1 -15 0 -1 -7 12 18 39 -68 -25 44 -75 -63 4 -15 -11 2
7064 2 -4 -4 -1 11 7 -18 13 5 15 8 7 9 6 9 30 12 0 -5 -8 -14 -5 6 5 -9 -5 -37 9 -13 0 -10 11 -3 -4 16 -2 3 -14 -8 -12 -28 -7
7105 -7 -31 0 -24 -4 -10 -16 3 -30 -1 0 18 11 18 0 -21 14 -5 4 5 15 18 14 13 -9 -9 -8 10 -29 -10 -5 -19 1 -14 6 10 -14 -10 2
7143 2 -20 8 -2 9 6 -11 7 10 21 -7 9 8 10 5 5 -12 16 4 13 11 -1 17 8 12 17 21 0 -3 -10 4 5 -4 -5 -10 -10 -33 -7 -6 3 -34 -13
7184 -13 6 -14 16 37 20 -34 -20 -13 20 -20 -8 -19 -59 22 44 111 31 -60 -113 -41 -3 -25 -10 2 18 2 11 3 -11 -31 -1 -16
7216 -16 -21 -9 10 -26 -32 -31 -40 -14 -9 -32 -19 18 -32 38 -49 26 14 -3 55 16 140 56 -51 32 -60 -30 -4 55 -26 -47 35 46
7248 46 35 9 -16 -16 6 4 -7 -19 -5 -24 9 0 -13 -13 -25 3 10 -10 -15 1 -24 -22 -23 -8 23 -30 4 29 20 27 3 -5 5 -15 0 0
7284 0 13 4 15 5 -6 11 -11 21 14 -9 -8 9 -1 -22 -8 22 -11 -23 55 -3 -16 -7 10 -2 -11 10 12 -8 3 4 -5 -13 7 49 4
7319 4 34 -1 17 -17 25 -11 34 -21 -28 4 -24 -65 -37 75 36 -65 84 6 -74 -17 46 -44 9 -31 -112 -39 147 -60 -133
7348 -133 25 -9 15 -7 -118 70 24 29 90 51 13 2 -19 -66 -9 -139 -90 -39 35 -34 1 -1 3 -80 121 8 22 99
7376 99 1 15 -4 -54 84 -40 -38 32 36 8 5 -38 50 24 37 -4 -75 23 -49 47 36 -48 -2 18 -73 -54 64 5 -67 -37
7406 -37 32 -26 47 -25 -36 15 -30 23 -44 -16 -16 -8 5 -6 -7 -43 -38 -18 19 -8 -13 -8 -7 3 -11 3 -21 12 -5 -6 20 -6 23 -1
7440 -1 26 18 9 14 -10 4 -1 18 -15 5 -9 -7 1 -1 46 9 -5 -23 -5 8 -21 11 -32 26 -13 -44 -7 -45 -18 -14 11 10 3 -25 3 -4
7476 -4 16 4 22 14 -1 7 13 -11 0 12 -8 4 -5 -8 -6 -5 0 -7 -20 -26 -11 -11 -4 -27 -2 -7 -19 -24 -4 -24 6 7 -3 -8 -14 7 1 8 -16 7
7516 7 13 18 14 17 3 0 22 2 22 15 37 36 8 32 22 7 33 35 -1 -13 -5 11 1 9 -7 -50 -39 -11 -4 -10 0 -15 46 17 6 8 -18
7553 -18 -15 -2 2 -19 8 84 11 -49 9 4 -44 -58 -2 34 -27 1 -34 -42 -20 6 -6 -28 -4 -17 8 -31 -80 14 35 -26 22 -39
7585 -39 -76 -26 -16 6 29 -5 65 31 -61 -21 69 -61 -70 24 61 61 16 -19 22 -41 17 -16 29 52 65 -80 -83 41 109 4
7615 4 87 51 -41 11 39 102 -10 -148 -44 29 50 70 -59 31 15 23 -56 -44 -34 37 5 14 125 32 -16 -39 -46 44 -1 -34
7645 -34 -3 -39 -71 -30 -23 76 38 -46 -59 -109 16 21 16 -66 19 10 25 -26 34 26 -10 4 20 7 5 9 26 10 17 -7 18 13 -9 12
7679 12 18 17 4 -10 15 -13 10 28 6 6 -7 -14 -10 1 -7 -13 -12 -12 -17 28 -7 -10 -3 -30 -21 -20 -9 23 -17 17 -5 6 6 8 1 29 12 -4 1
7718 1 -4 23 -26 10 -9 8 -4 16 -1 1 7 -3 13 -7 6 -3 8 -11 -6 -14 -12 -14 -3 -4 -6 8 -11 -15 -4 3 7 -13 10 -5 15 -4 12
7755 12 9 14 18 8 -7 13 10 13 -1 3 18 4 -12 0 -14 8 5 1 1 -9 0 5 -2 3 -3 -10 6 -15 -5 -10 6 -17 -2 -9 -1 1 -6 -6 1 -6 -3 8
7797 8 -2 -3 17 2 -2 6 34 15 11 5 7 -1 -11 20 -19 -15 -15 -10 -5 19 -21 -13 -8 22 -50 -12 1 3 -14 -12 -11 -19 3 15 -12 -6 -13 10 22 -8
7837 -8 17 1 6 13 -9 27 31 20 36 15 20 3 16 -2 7 3 -1 -8 -7 1 -18 -1 10 -7 -12 3 10 20 -2 -2 -39 -7 1 11 19 28 19 -2 20
7876 20 -1 11 -3 13 23 7 29 -10 15 -1 17 -8 24 4 18 -2 2 2 -3 18 -33 -1 -8 -19 7 8 -18 12 -10 -18 4 1 2 10 -16
7911 -16 10 23 30 24 11 22 20 20 9 8 2 28 1 3 3 25 -3 6 6 -1 -1 -5 -24 36 -2 13 0 41 -11 29 -138 109 -47 -123 -77
7946 -77 62 92 10 6 11 -10 17 8 -9 -6 42 22 -8 12 17 7 -1 20 -20 20 -9 -15 23 -15 -1 -19 2 -7 -10 -4 0 -4 -19 14 -12 -1
7982 -1 -19 -3 -9 -18 15 11 10 9 -7 10 15 -15 12 2 9 6 10 4 -15 7 19 11 -4 0 5 -2 3 -1 15 -1 6 -5 12 -28 -20 -7 -10 -33 -11 -14 -17
8023 -17 -16 25 1 5 17 14 5 13 18 -14 14 -6 -5 8 10 15 3 23 4 -2 10 14 12 -8 19 1 3 0 0 -10 7 9 1 -12 17 -15 2 -20 3
8062 3 -8 1 -4 15 11 5 10 12 7 -6 4 -1 -4 -2 7 16 22 16 21 12 0 -7 0 -2 -1 -8 7 3 6 -6 -3 5 11 -3 -10 16 24 -16 -20 -7 -19 1 -19 -5 3 8
8108 8 -8 -20 10 -6 -12 16 -7 4 -2 14 18 20 10 9 8 6 9 21 8 -11 -4 -4 -5 13 14 -5 4 -11 4 -7 -17 1 -15 2 -9 -6 -1 -24
8146 -24 -27 -13 6 14 29 -123 9 3 -21 13 3 26 27 2 25 4 -1 6 13 -19 -16 2 -3 6 5 0 14 -1 -2 -14 -12 -10 -18 -43 -13 4 5 10
8184 10 -4 11 9 15 9 3 -9
8191i
##END NTUPLES=NMR FID
##END=
