##TITLE=1H_IPEDM8
 CDCl3, 8 sc, 
 22.7.2019
##JCAMPDX= 6.0         $$ Bruker NMR JCAMP-DX V2.0
##DATA TYPE= NMR FID
##DATA CLASS= NTUPLES
##ORIGIN= UXNMR, Bruker Analytische Messtechnik GmbH
##OWNER= root
$$ XWIN-NMR		Version 3.5
$$ Mon Jul 22 14:10:42 2019 Russian Standard Time (UT+4h)  she@DPX200
##.OBSERVE FREQUENCY= 200.13155
##.OBSERVE NUCLEUS= ^1H
##.DELAY= (6, 6)
##.ACQUISITION MODE= SIMULTANEOUS
##.ACQUISITION SCHEME= undefined
##.AVERAGES= 8
##.DIGITISER RES= 18
##SPECTROMETER/DATA SYSTEM= spect
##.PULSE SEQUENCE= zg30
##.SOLVENT NAME= CDCl3
##.SHIFT REFERENCE= (INTERNAL, CDCl3, 0, 15.7039)
##AUDIT TRAIL= $$ (NUMBER, WHEN, WHO, WHERE, WHAT)
$$ ##TITLE= Audit trail, XWIN-NMR		Version 3.5
$$ ##JCAMPDX= 5.01
$$ ##ORIGIN= Bruker BioSpin GmbH
$$ ##OWNER= she
$$ F:/spectra/data/she/nmr/H-F/1/audita.txt
$$ ##AUDIT TRAIL=  $$ (NUMBER, WHEN, WHO, WHERE, WHAT)
(   1,<2019-07-22 14:09:51.43 +0400>,<she>,<DPX200>,
      <created by zg, POWCHK disabled, PULCHK disabled
       configuration hash MD5:
       00 E9 B6 7A A2 85 ED C7 34 08 36 98 17 FE 4E 26
       data hash MD5: 16K
       7A AD 70 DF 2C B3 38 2A DD EC C6 A1 90 0B C1 C6>)
$$ ##END=
$$ 
$$ hash MD5
$$ F4 2C 1C F8 53 93 08 DB 2D 3A 98 90 FF D8 D9 B3
##$RELAX= 
##$RELAX= 
##$RELAX= 
##$RELAX= 
##$RELAX= 
##$RELAX= 
$$ Bruker specific parameters
$$ --------------------------
##$DU= <F:/spectra>
##$EXPNO= 1
##$NAME= <H-F>
##$PROCNO= 1
##$TYPE= <nmr>
##$USER= <she>
##$AMP= (0..31)
100 100 100 100 100 100 100 100 100 100 100 100 100 100 100 100 100 100 
100 100 100 100 100 100 100 100 100 100 100 100 100 100 
##$AQSEQ= 0
##$AQ_mod= 1
##$AUNM= <au_zg>
##$AUTOPOS= <>
##$BF1= 200.13
##$BF2= 200.13
##$BF3= 200.13
##$BF4= 200.13
##$BF5= 200.13
##$BF6= 200.13
##$BF7= 200.13
##$BF8= 200.13
##$BYTORDA= 1
##$CFDGTYP= 0
##$CFRGTYP= 5
##$CHEMSTR= <none>
##$CNST= (0..31)
1 1 145 1 1 1 1 1 1 1 1 1 1 1 1 1 1 1 1 1 1 1 1 1 1 1 1 1 1 1 1 1 
##$CPDPRG= <>
##$CPDPRG1= <>
##$CPDPRG2= <>
##$CPDPRG3= <>
##$CPDPRG4= <mlev>
##$CPDPRG5= <mlev>
##$CPDPRG6= <mlev>
##$CPDPRG7= <mlev>
##$CPDPRG8= <mlev>
##$CPDPRGB= <>
##$CPDPRGT= <>
##$D= (0..31)
0 1.2 0 0 0 0 0 0 0 0 0 0.03 0 0 0 0 0 0 0 0 0 0 0 0 0 0 0 0 0 0 0 0 
##$DATE= 1563790190
##$DBL= (0..7)
120 120 120 120 120 120 120 120 
##$DBP= (0..7)
150 150 150 150 150 150 150 150 
##$DBP07= 0
##$DBPNAM0= <>
##$DBPNAM1= <>
##$DBPNAM2= <>
##$DBPNAM3= <>
##$DBPNAM4= <>
##$DBPNAM5= <>
##$DBPNAM6= <>
##$DBPNAM7= <>
##$DBPOAL= (0..7)
0.5 0.5 0.5 0.5 0.5 0.5 0.5 0.5 
##$DBPOFFS= (0..7)
0 0 0 0 0 0 0 0 
##$DE= 6
##$DECBNUC= <off>
##$DECIM= 24
##$DECNUC= <off>
##$DECSTAT= 4
##$DIGMOD= 1
##$DIGTYP= 9
##$DL= (0..7)
0 120 120 120 120 120 120 120 
##$DP= (0..7)
150 150 150 150 150 150 150 150 
##$DP07= 0
##$DPNAME0= <>
##$DPNAME1= <>
##$DPNAME2= <>
##$DPNAME3= <>
##$DPNAME4= <>
##$DPNAME5= <>
##$DPNAME6= <>
##$DPNAME7= <>
##$DPOAL= (0..7)
0.5 0.5 0.5 0.5 0.5 0.5 0.5 0.5 
##$DPOFFS= (0..7)
0 0 0 0 0 0 0 0 
##$DQDMODE= 0
##$DR= 18
##$DS= 0
##$DSLIST= <SSSSSSSSSSSSSSS>
##$DSPFIRM= 0
$$ [...]
##$SUBNAM2= <"">
##$SUBNAM3= <"">
##$SUBNAM4= <"">
##$SUBNAM5= <"">
##$SUBNAM6= <"">
##$SUBNAM7= <"">
##$SUBNAM8= <"">
##$SUBNAM9= <"">
##$SW= 24.9336996594482
##$SWIBOX= (0..15)
0 0 2 0 0 0 0 0 0 0 0 0 0 0 0 0 
##$SW_h= 4990.01996007984
##$TD= 16384
##$TD0= 1
##$TE= 0
##$TE2= 300
##$TE3= 300
##$TEG= 300
##$TL= (0..7)
0 120 120 120 120 120 120 120 
##$TP= (0..7)
150 150 150 150 150 150 150 150 
##$TP07= 0
##$TPNAME0= <>
##$TPNAME1= <>
##$TPNAME2= <>
##$TPNAME3= <>
##$TPNAME4= <>
##$TPNAME5= <>
##$TPNAME6= <>
##$TPNAME7= <>
##$TPOAL= (0..7)
0.5 0.5 0.5 0.5 0.5 0.5 0.5 0.5 
##$TPOFFS= (0..7)
0 0 0 0 0 0 0 0 
##$TUNHIN= 0
##$TUNHOUT= 0
##$TUNXOUT= 0
##$USERA1= <user>
##$USERA2= <user>
##$USERA3= <user>
##$USERA4= <user>
##$USERA5= <user>
##$V9= 5
##$VALIST= <valist>
##$VCLIST= <CCCCCCCCCCCCCCC>
##$VD= 0
##$VDLIST= <DDDDDDDDDDDDDDD>
##$VPLIST= <PPPPPPPPPPPPPPP>
##$VTLIST= <TTTTTTTTTTTTTTT>
##$WBST= 1024
##$WBSW= 4
##$XGAIN= (0..3)
0 0 0 0 
##$XL= 0
##$YL= 0
##$YMAX_a= 211090
##$YMIN_a= -163692
##$ZGOPTNS= <>
##$ZL1= 120
##$ZL2= 120
##$ZL3= 120
##$ZL4= 120
##$ABSF1= 10
##$ABSF2= 0
##$ABSG= 5
##$ABSL= 3
##$ALPHA= 0
##$AQORDER= 0
##$ASSFAC= 0
##$ASSFACI= 0
##$ASSFACX= 0
##$ASSWID= 0
##$AUNMP= <proc_1d>
##$AZFE= 0.1
##$AZFW= 0.1
##$BCFW= 1
##$BC_mod= 2
##$BYTORDP= 1
##$COROFFS= 0
##$CY= 11.3945322036743
##$DATMOD= 1
##$DC= 2
##$DFILT= <>
##$DTYPP= 0
##$F1P= 18.9103706918063
##$F2P= -1.10871071338519
##$FCOR= 0.5
##$FTSIZE= 0
##$FT_mod= 4
##$GAMMA= 1
##$GB= 0.15
##$INTBC= 1
##$INTSCL= 1
##$ISEN= 128
##$LB= 0.24
##$LEV0= 0
##$LPBIN= 0
##$MAXI= 10000
##$MC2= 0
##$MEAN= 0
##$ME_mod= 0
##$MI= 1.114404
##$NCOEF= 0
##$NC_proc= 0
##$NLEV= 6
##$NOISF1= 3.799351
##$NOISF2= 2.8
##$NSP= 1
##$NTH_PI= 0
##$NZP= 0
##$OFFSET= 15.70392
##$PC= 1
##$PHC0= -9017.731
##$PHC1= 11.60096
##$PH_mod= 1
##$PKNL= yes
##$PPARMOD= 0
##$PSCAL= 0
##$PSIGN= 0
##$REVERSE= no
##$SF= 200.130013532006
##$SI= 16384
##$SIGF1= 3
##$SIGF2= 2
##$SINO= 400
##$SIOLD= 16384
##$SREGLST= <1H.CDCl3>
##$SSB= 0
##$STSI= 0
##$STSR= 0
##$SW_p= 3612.71676300578
##$SYMM= 0
##$S_DEV= 0
##$TDeff= 0
##$TDoff= 0
##$TI= <>
##$TILT= no
##$TM1= 0
##$TM2= 0
##$TOPLEV= 0
##$USERP1= <user>
##$USERP2= <user>
##$USERP3= <user>
##$USERP4= <user>
##$USERP5= <user>
##$WDW= 1
##$XDIM= 8192
##$YMAX_p= 0
##$YMIN_p= 0
$$ End of Bruker specific parameters
$$ ---------------------------------
##NTUPLES= NMR FID
##VAR_NAME=  TIME,          FID/REAL,        FID/IMAG
##SYMBOL=    X,             R,               I
##VAR_TYPE=  INDEPENDENT,   DEPENDENT,       DEPENDENT
##VAR_FORM=  AFFN,          ASDF,            ASDF
##VAR_DIM=   8192,          8192,            8192
##UNITS=     SECONDS,       ARBITRARY UNITS, ARBITRARY UNITS
##FACTOR=    0.0002004,     1,               1
##FIRST=     0,             0,               0
##LAST=      1.6414764,     0,               0
##MIN=       0,             -163692,         0
##MAX=       1.6414764,     211090,          0
$$ Real data points
##PAGE= N=1
##DATA TABLE= (X++(R..R)), XYDATA
0@%%%%%%%Qj6J6j6K4l2M0m9N7p2Q8j04J21j40J64j94K26k59K95l36L82m36M94
30B61n56O27p03P86q78R79j090J212j346J493j654J831k028K245k487K758l061
47a611L405l800M255m783N414o184P139q360R993j2300J5826k1950L5509j15125
61i2572O3396K33465j97799j35822J37383R1279j67131k2002J73246K2485j77919
72g1991j8942J22022J3541o7368L7224K8410p8400l8920R3785N4662n7995n6424
84d0396J1826K4253K0146P033j8779j2148J4532k0852l2213N9197P8307p3760
96A7146j20322N6775J27834l8447r6993M5622N7923p9882l9584J10556M3753j10294
108b5913m2650Q0553J2611n1980L9147M7676q1596o2559R1302O9687p2487m7681
$$ y = [0, 0, 0, 0, 0, 0, 0, 0, 8, -8, 8, -8, 16, -16, 24, -25, 32, -40, 48, -56, 65, -75, 89, -105, 121, -138, 157, -179, 203, -233, 261, -295, 332, -371, 415, -463, 516, -574, 638, -708, 785, -869, 962, -1066, 1179, -1308, 1450, -1611, 1794, -2006, 2249, -2534, 2880, -3304, 3835, -4525, 5468, -6832, 8994, -12956, 22553, -92572, -29176, 204289, 6490, -129332, 8051, 99330, -67801, -89803, 83443, 105928, -71991, -90933, 31089, 44630, -22738, 14486, 42896, -35504, -74424, 19361, 74023, 16028, -40396, -28570, -4317, 15829, 22862, 4083, -8065, 6467, -14385, -46598, 12599, 90906, 17146, -103176, -46401, 81433, 42986, -54007, -8385, 49538, -30344, -69928, 40628, 84381, -25913, -68563, 11990, 24601, -27379, 11768, 59444, -22152, -84711, 6591, 76278, 3791, -43890]
120d3890N2361M313n1866L2118O4238m1258o4291L0657L6192k4222J0874L9408
132D4634m8939o7323N8919Q1467m8857o6016M3906L2486n7453n653P9666P67q6888
145c9284r004O6303P058l0320J5825M373m7175r23O2620R143n1630q006K5676
158D656j2274p641L8650P928m9258j5158L4434P830q780K0183n517n3919R29P0742
172C2805R124o3624n150M6814j8578m0202M5476M9764n5051n9065M3923N0141
184C6377k7780k1908K4716q175l6628K2519M8559j7385m3004Q717J9974j2454
196f472L537K8218j0978l9711L117L2191M870p541J583j7032k0570K5896L4631
209C1739k1165l0538J8506J2216l0038L602N0056n244o2664k937N6582N306l8255
$$ y = [-43890, 8471, 12784, -39082, -6964, 57274, 16016, -48275, -17618, 18574, -5648, 5226, 44634, -4305, -71628, -12709, 68758, 19901, -46115, -2209, 30277, -27176, -32829, 46837, 47604, -39284, -48288, 18015, 25073, -5247, 10578, 14951, -32224, -33147, 29473, 38616, -13014, -21020, 4656, -7618, -15259, 23391, 31319, -17939, -33097, 1337, 9167, 387, 20570, 15053, -38866, -37937, 32805, 41929, -21695, -26845, 19969, 1391, -38811, 6665, 56429, 1378, -57687, -13764, 36377, 8597, -13311, 11405, 3230, -33398, -10879, 37680, 20295, -22709, -13992, 5982, -6472, -2935, 25283, 14305, -25406, -22289, 9902, 14772, 7231, 8814, -8218, -28788, -2892, 31739, 10574, -19964, -1458, 10758, -19280, -15678, 34378, 29134, -33530, -36467, 20115, 25421, -12834]
222a2834P214K3473k7890k1708M1119K6999l8853k5748K7574J1524k0643Q294
234a479K5261j9878l4053J6759L4709n936k1758O44L719n649P171J4010n569j4097
248f146q72K469J101J2624Q082j9180j8145J4692J8649p198p979O196n474j3591
262a4772J1661K1382r114k0513N258J0187q323N96J8244m575k6994P44K6963L124
276A3868j8114l63Q206r185m759J7295P123j7501q295J1061K530m934Q070N129
290A0131j6664r797J7385J2615j2028q346P722k16q511O737J2407o992j3433L641
304e349Q703j819o22N049m854j0754M695J3457j303j0479j88M784k420j291O531
319D140J998p767m799M213M988Q24r75l403l855J631N332J343l225j802o00p32
$$ y = [-12834, -5620, 17853, -10037, -31745, 9374, 36373, -2480, -28228, -654, 10870, -9773, -1479, 23782, 3904, -30149, -13390, 21319, 15383, -6375, -5731, -2012, -7661, -490, 13520, 7951, -6146, -7018, -4549, -3448, 9176, 17258, -1922, -20067, -5375, 13274, 6076, -1903, 4293, -1181, -14772, -3111, 18271, 9157, -11356, -6098, 4089, -4234, -3638, 14606, 10031, -16963, -16219, 10744, 13868, -4246, -4609, 3597, -5588, -10347, 6948, 14071, -3430, -11725, -664, 1866, -3068, 5002, 10131, -6533, -16330, 1055, 13670, 1642, -6704, 1018, 802, -7709, -972, 11435, 4443, -8990, -5349, 3354, 1535, 913, 5962, 1108, -9646, -4951, 8506, 7203, -3276, -3464, 1320, -1100, -2391, 4140, 6138, -1629, -6428, -2215, 2773, 3597, 2622, -781, -4636, -3005, 2327, 3670, 445, -1357, -1957, -2689]
335b689K024L583m86l678j331M91O08K900K756l833n998K433O697o86m716J214
351g11K562l718k005N835L361n651l967L855K655k209M17K305k805l829L381M840
367D316k378m062J795K282k599j200L990J384m549k481L759K729k219j913J199
382E3M28j525K89K121n8k489l73J822J95j047N98Q70j665j665K103K479j795k507
400b166J516J958j675j460K415J277k885j323K901J179k286m18K160o52k291J474
416b76K688j735k575J909K112k229j485K932J129l572j071L547R90l014m10K449
432A389n61k206J202K155j581k034J532J324j772l92K179l53k854N09K895m32
448A000k431M14J744r99j181J590R89j666r40J207N31n10L69K85j253k67J564
$$ y = [-2689, -665, 2918, 2432, -1246, -2577, -2086, -1478, 1422, 4178, 345, -5653, -3220, 3477, 2791, -1925, -711, 1851, -1867, -3872, 1963, 5324, -327, -4294, -439, 2216, 7, 424, 2729, -76, -3905, -524, 4316, 1938, -2124, -329, 1953, -646, -1846, 2144, 3528, -1021, -3502, 257, 2986, 767, -1146, 53, 481, -1044, -755, 1366, 1308, -1181, -1554, 268, 463, -584, 14, 884, -781, -2446, -343, 2136, 341, -2166, -650, 1308, -367, -1827, 588, 1865, -1020, -2343, 558, 1737, -549, -967, 1193, 541, -1750, -276, 2412, 677, -1898, 11, 2123, -106, -1591, 1341, 2470, -1102, -2173, 1374, 2364, -650, -1060, 1389, 828, -1378, -176, 1979, 398, -1636, -104, 1220, -552, -944, 1235, 882, -1972, -1463, 1432, 1000, -1431, -1017, 727, -272, -1453, 137, 1126, -540, -1480, -273, 258, -252, 117, 402, -851, -1118, 446]
465D46N45j186l71P39m21p9J173M7j455J08J133p51m50J996J12l231j94M039K18
484B418l978L24L470j546l294L038L239m098l234M507K265m501o42M636j390n392
500d178L058N803l940n635M425M176n065k233O239L06p275P26P614j599o380K902
516a056M283m822k537P082J589q218p39P730n51o238L204N027n982m454P656L999
532E973p525k390O543o74n754M154N805o389n937O753M715o169j602N942k227
547A218o745M626P425n132o286M597K666n072J559O649m307p989M873O896m809
562A69l366O161j120q704L829J0899m871r965N282O446p499k116J1522o56j4837
577h826J669J4961k492j1970N804Q218j0956o151J5435N889j6214m964J3969Q95
$$ y = [446, 991, -195, -566, 173, -248, -327, 846, 893, -562, -454, 679, -72, -522, 1474, 1586, -1645, -1839, 2200, 2418, -1560, -1236, 2234, 688, -2606, 432, 3671, -427, -3661, 846, 3111, -1390, -2032, 2604, 1214, -4178, -1120, 4683, 743, -4892, -467, 3709, -1356, -3589, 2650, 2956, -4319, -3593, 4021, 2422, -3958, -1056, 3227, -1595, -4132, 2950, 4539, -3679, -4418, 3312, 2761, -3477, -273, 4754, -1228, -5682, 1974, 5973, -1552, -3942, 2601, 1927, -3827, 327, 6132, -257, -6194, 559, 5274, -895, -2497, 3445, 1218, -5527, -901, 6524, 1392, -4894, -297, 2369, -2703, -1144, 5505, 1198, -6791, -1918, 4978, 169, -3197, 2964, 1844, -6860, -3031, 7868, 2997, -6968, -1686, 4760, -2739, -4855, 6667, 6011, -8826, -7157, 7804, 5312, -6658, -854, 7364, -3592, -9743, 5692, 11581, -4633, -9597, 4372, 5267]
591E267j1035N492J0057j0805j0772J2457J0053j0931n672R235j215r934P131
604f72J1834r279j1844Q307P295p638j86R654n874j3007P989J3711p361r679P710
619I60K457j1159L338J5738n017j7236M507J3061n606n867J0459M41j6226J075
633i075J8168q16j4195L296P597r943k799J7219K199k0419k198J7611j244j2108
647f707R149R101j7745r798K1815J0634j9941p051J6068j658j5009J0759J7617
660A7234j5077j9681J3570J6241j0752p529J1487j551j5744N320J8453m023j4882
673f934K285N693m664L135J0294o771j3649N897J0183n533j341R941p121j7403
687a5988J0527K1977r718j9300J0618J1145j6821l722K6285J608l2267k817L0592
$$ y = [5267, -5768, -276, 9781, -1024, -11796, 661, 10714, -217, -5889, 3346, 2131, -7803, -672, 11162, 1883, -9961, -1654, 5641, -1997, -2183, 7471, 1597, -11410, -3421, 10290, 2929, -6750, 960, 3417, -7742, -4404, 11334, 6317, -10919, -6412, 6649, 1043, -4824, 5635, 6076, -10150, -9075, 9093, 8277, -5918, -2622, 4975, -4968, -7767, 9452, 11651, -8768, -10966, 6645, 5401, -6707, 2442, 11543, -6202, -16000, 5815, 16449, -3492, -10543, 5525, 3867, -11142, -383, 17234, 2157, -17524, -3954, 12287, 1535, -5994, 5493, 3942, -11802, -6482, 11971, 7948, -6934, -4649, 1044, -3620, -485, 9809, 3038, -10611, -4714, 5469, -64, -1405, 8536, 1415, -15988, -5461, 16516, 6798, -12502, -1884, 9261, -7560, -11282, 15003, 16611, -15656, -18473, 12119]
700A2119J407k3580O260J8182j6981j8029K3572K0319k2402j8615J6727J0234
712I213j3443R63J5164p622j8495O814J6942k643q390J273k642m939Q987R225
726A0407q338q129M957l40n188J0996J0469j6958j5852J6198J4795j3570o305
739f858J5322l783k2393Q993K8773p975k7874O387J9632j0262j0065J9136N968
752A5001k6651o980K6646P586j9590j848J1794q722r356J7532J1748j8829j2117
765a3786J3145N787p585N528P558j4811j1535J6253J2721j1631o411P932m836
778a671j0115J3181J5610j3987j7345R713J0860p366p8J0976p521j7129P655J8591
792A1374m005j1911L277J432q352N482J5310n560j6966K625J0813l491j062J0394
$$ y = [12119, 13526, -10054, -3794, 14388, -2593, -20622, 2950, 23269, 867, -17748, -1021, 9213, -4230, -3267, 11897, 4275, -14220, -7406, 9536, 6893, -1497, -224, -2866, -7805, 1182, 10407, 2069, -6060, -1103, -1443, -6631, 4365, 14834, -2124, -17976, -1778, 13017, -553, -6858, 8464, 4681, -17712, -8719, 20054, 12079, -15795, -9408, 10224, -38, -10103, 9033, 15001, -11650, -18630, 8016, 15602, -3988, -5836, 5958, -2764, -12120, 5412, 17160, -1669, -13786, -641, 5146, -2439, 3089, 10647, -4164, -15699, 554, 13275, 1644, -4767, 3165, -1671, -11786, 1395, 17005, 3018, -14327, -4614, 6246, -1120, -1198, 9778, 2257, -14872, -7217, 11374, 7369, -4542, -1265, 167, -8185, -2703, 12607, 7047, -9919, -7294, 3519, 28, -1034, 9360]
806I360m786j8430M285K0740j785j5108L961O688j2127k567K1228M325k3919o828
820a4963J9054L793j2262N336R936j4542j3062J7447J5720j3468j2211Q249K682
833A709p741O332J2032r162j5306N847J1764k046k619L331o056q986Q391J2817
847A0307n238r538K465P88n279O943J1976q400j5916N112J2733l311m554P437
861E525k015j4531K455J8611O46j5371j334P890l546k712J1314K937j5341n979
875a1451J2570N959o087k78K326p883l700J2076P077r750o718M218M99j843P663
890D678M505j1553q461R195P668m641j371L733o348p567R678J1700p316j1027
904g127L802M733m172K317Q747m821j3181K550J2677Q9o804J333O81o811J217
$$ y = [9360, 4574, -13856, -9571, 11169, 9384, -5724, -1763, 4925, -7202, -9769, 11459, 15784, -8135, -14963, 4091, 7884, -4378, 958, 10894, -3648, -16710, 737, 16457, 2989, -9222, -973, 1709, -6032, 300, 12332, 3170, -12136, -6289, 5475, 3429, 810, 4141, -1915, -10901, -2510, 10307, 5069, -4469, -2004, -1216, -6495, 448, 12424, 4024, -11892, -6780, 5953, 2642, -1912, 5525, 3510, -11021, -8566, 10045, 10691, -4680, -6014, 1876, -1670, -4382, 6932, 9869, -5472, -11451, 1119, 7078, 991, 713, 3039, -4844, -8544, 3532, 10609, 859, -5859, -1641, -1142, -2985, 4678, 9183, -2370, -10831, -1636, 6032, 1391, 20, 3753, -2595, -10162, -484, 11216, 3900, -7127, -3325, 1408, -2764, -447, 8300, 3479, -9702, -7152, 5525, 5614, -1190, 143, 824, -5987, -4770]
919d770J1460J473j1020l629N725J577o67M200J05q880k876Q193M773l441j993
934B30o14l837L43P922K738p139m090K918R61P0M674Q81q421m133P655N010l996
951A172j826J969l610l659O981P017o132q094L059M900j913K76M373l221p913
966f621K063Q861P38n717j302J170j628J033N396M79o247k842L226K813P54M49
982B625k186l932N05M749J583k109j182j193k112J950N546o1o122j843L683J173
998A074j139K152Q09n197l024N557M704l264l799J018P39j560J970L764j942n293
1014c431r1M194J718j358r55q91j346P09K798J077j535k334r50J270K763R86k327
1031B97k160M67J110N06J217P24k477k928J854L888j82k678m67N93q02L10K890
$$ y = [-4770, 6690, 8163, -2857, -6486, -761, 816, 149, 4349, 4454, -4426, -7302, 891, 5664, 2223, 230, -384, -4221, -3878, 4044, 6782, -357, -4447, -1529, -568, -498, 4176, 5057, -3364, -7497, 158, 5168, 1172, -654, 1315, -2295, -5954, 1027, 8044, 1912, -6182, -3123, 1777, -136, 140, 4513, 1292, -6621, -4558, 4303, 5041, -676, -1978, -808, -2436, -1403, 3993, 4472, -1775, -4617, -1391, 1422, 2176, 2625, 439, -3493, -2988, 1761, 3344, 1235, 53, -1140, -3252, -1302, 4244, 4183, -1939, -3782, -99, 1074, -65, 2087, 2896, -2301, -5325, 232, 4936, 1672, -2127, -1109, -370, -1930, 40, 3804, 1862, -3431, -3522, 672, 2390, 1032, 77, -814, -2160, -1451, 1347, 2424, 889, -1445, -2395, -1125, 1638, 2624, 297, -1863, -1396, -286, 220, 1437, 2161, -316, -3244, -1390, 2498, 2316, -362, -829, -236, -1038, -728, 2162]
1048B162M48l463k077K296K365n89r09r7r54p30J306K118l82k187j114Q25J329
1065C47P88k35j188q22Q4Q12J025L24j017j626j1J791R94p58r26rk50m6J147J039
1085A463j103j738K69J530N24n08l92k62m29K44R44P23p27j230j49R77P57k04
1103F89o81k02L2k22M31R88j45j516m77J330P63q12m51N69l94r03Q24J444o46
1122F21j649K97J217l14o01O31L49j183l83J337N94j157l50O14r8l91N44O50q09
1141h1o41O07M47k65n2L11l87l97M86N38m95k31M56k23n06N35P07o83o21O55K81
1162D41p25J08R19m81j035N94R62p76o97J005L15j263k3J361k02j378M32J175
1180G32q62r03J400N33j540m62J689J5j649N45J522j055j359J472J223j675p07
$$ y = [2162, 2610, -853, -2930, -634, 1731, 1142, 233, 136, -818, -1548, -242, 1876, 1494, -693, -1807, -982, 347, 1135, 900, -288, -1110, -1026, -214, 811, 1135, 118, -1508, -1519, 272, 1266, 508, -418, -427, -677, -723, 424, 1463, 360, -1378, -1109, 421, 945, 437, 45, -217, -646, -402, 542, 1265, 538, -692, -841, 136, 893, 689, 8, -194, -162, -384, 47, 1035, 890, -626, -1103, 227, 990, 178, -273, 296, -98, -1001, -177, 1267, 621, -1028, -731, 486, 172, -429, 202, 551, -632, -1015, 322, 916, -241, -591, 23, -75, -466, 78, 728, -81, -722, -115, 332, 67, 15, 326, -61, -458, 28, 566, 71, -160, 296, 73, -433, 102, 809, 126, -495, 160, 441, -284, -176, 743, 262, -773, -179, 783, 7, -690, 315, 630, -633, -656, 705, 503, -875, -443, 732, -130, -1033, 367, 900, -640, -1102, 587, 602, -1047, -502, 1020, -35, -1394, 78, 1301, -374, -1081]
1197a081J726P5j815O24J761r62j656J335J307j606p04J877J20k143M30K146q04
1214F30j833J290J300j799p51K193K72k456K09K376q27j959J450J485k179j012
1230a611K508N11k591N7K440q81k072J597J786k353j338K636P68k689Q8K582j072
1247C66k300J775K185k303j692K595Q01k658K17K745j076k682J758K349k114j646
1263a680K461O23k842N05K983j262k833J829K152k288j131K827J0l317Q65L421
1279B323j505l026K298K087l169j080L894L58m580M89M398j406l686K351L037
1294B783l720k304M528J717m741q87M491l90m021J889L565l043l152L489K560
1309B764l461j296L323l36l181J596L205k272k585K354J457k547L32K814j709
$$ y = [-1081, 645, 720, -1095, -471, 1290, 328, -1328, 7, 1314, -292, -996, 881, 1001, -1142, -712, 1434, 630, -1203, 87, 1387, -412, -1163, 1030, 1302, -1154, -945, 1431, 604, -1355, 95, 1580, -599, -1611, 897, 1408, -1183, -1126, 1314, 433, -1639, -42, 1744, -609, -1947, 689, 1457, -1232, -1144, 1438, 366, -1934, -159, 2026, -277, -1969, 626, 1427, -1231, -1014, 1731, 655, -2027, -269, 2080, -34, -1680, 781, 1404, -1438, -933, 2050, 788, -2045, -216, 1936, -352, -1483, 1344, 1354, -1963, -1098, 2323, 818, -2208, 90, 2177, -992, -2072, 1822, 2180, -2400, -1911, 2487, 1081, -2605, -254, 2783, -937, -3241, 1287, 3004, -1737, -2624, 1867, 1477, -2544, -655, 2910, -133, -3285, 204, 2764, -697, -1993, 1330, 994, -2187, -591, 2614, 342, -2243, 111, 1568, -979, -647, 2167, 458]
1324D58l102K566K740k927j501L167j24l863J647M479k569m438L011L444l687
1339f99j844M808J87n770O30O046j124n343K082L855l584k672N078K028n752j502
1355c576N278M08m151J407L373l327l044M313K649m016j590L393m28l075K608
1370B22L152l555l230L653K144l170j58L338k098l856L297M155l407l213L269
1385E43J068l808J151M856k285n444K432M590k755k392L657L80n243P55O177j127
1401B555n532J565L750l105j922N142J015o403j012O191L14m567J362L270l847
1416a224k800N508K979n472k409M261M16l271K172L445l863l840L813L268k802
1431A81j225K405j450k941L132L691l268l235K684J033k588J698L494l290m632
$$ y = [458, -2644, -78, 2662, -265, -1766, 1401, 1277, -2586, -939, 3540, 971, -3467, -456, 2988, -699, -2543, 2265, 2452, -3318, -2688, 3358, 2234, -3109, -1027, 2828, -756, -3428, 1650, 3678, -2074, -3576, 1702, 2110, -2041, -634, 2739, -588, -3632, 681, 3330, -686, -2276, 1117, 689, -2386, 222, 3374, -181, -3411, 242, 2386, -784, -942, 2396, 298, -3558, -261, 3894, 487, -2726, 543, 1611, -2197, -1046, 3810, 1525, -3919, -1487, 3103, 348, -2044, 1613, 1993, -3250, -2495, 3682, 2555, -2977, -1412, 2338, -767, -2689, 2453, 3468, -2935, -3947, 2244, 2558, -2009, -647, 2623, -1224, -4024, 1484, 4463, -1009, -3418, 843, 1259, -2012, 160, 3605, -258, -4098, -285, 2983, 181, -1044, 1361, -89, -3030, 102, 3793, 525, -2710, -26, 1007, -1581, 117, 3611, 321, -4311]
1446d311L532M325l175k250L455k72n057J849O565k043o547J863M691k755k387
1461b517M832J089o667j162O863J231n253K5L238k456k426M589K729m972k850
1476c707L684J539k074J075J834l516k460M005K717k833j298J732j512j861L881
1491A206K957m287l407L271J915k480R21L169l183m557L486N087k712l490K216
1506A12P64l359J322N090j580n612O93M219q21j572K412l20m513L25N327L91l940
1523a062r2J654k087j58M565L34n370j177M227O75k168J588J314m236k078N322
1539A251K916m166k275K593k07k241K814L399l776m301K752L617j361j292J527
1554A250j281k954K045M147j047l521jJ168n95J199K305j808l595P68K905N6n65
$$ y = [-4311, -779, 3546, 371, -1879, 1576, 1304, -3753, -1904, 4661, 2618, -3929, -2066, 2625, -130, -2517, 2315, 3404, -3263, -4425, 2438, 3669, -1584, -1559, 1679, -777, -3203, 1386, 4115, -857, -3707, -23, 1516, -558, 517, 2351, -1165, -3625, 380, 3097, 264, -1034, 698, -814, -2675, 1206, 4163, -124, -3531, -260, 1655, -825, 96, 3265, 82, -4475, -989, 4098, 1386, -2104, 112, 876, -2483, -1161, 3929, 2349, -3263, -2570, 1649, 828, -744, 1668, 1348, -3165, -2840, 2487, 2878, -1062, -1154, 500, -1587, -1745, 2820, 3154, -2216, -3393, 834, 1509, -659, 929, 2243, -1993, -4071, 1251, 4167, 1, -2274, 319, 112, -2129, 685, 4084, 308, -3993, -1241, 2376, 1015, -277, 1250, -31, -2985, -940, 3207, 2160, -1361, -1362, -194, -789, 410, 2715, 907, -2688, -1920, 985, 1041, 476]
1571D76Q53j599k818J822M090p75l351K17J163j401N34L608n34m943n19M232P72
1588A827k175P14Q32l155j041M522K197l781k429K105P24j147J774J818l027l226
1604c468K498L308r70j626M34q12j521K025L015j198l236j06J513K07P14J122
1620A899j511k833P52K776M96j165l81q12j243J514K698m89k758n31J204R2O82
1637C90J530j050l067L1K952R03j324l65j44j544K49L047R01k868j588J369Q06
1654B28j32J184K67k566j501K338K228r90j335K0n73m69J905J758j525k474L19
1671a318J542M03J73M05j349j804Q49K453K31j435p65k32k10J163J594n11k113
1688i24o40J147Q73L54J20r78j490K34J840R46j048r30l71j24Q36J474m9j842
$$ y = [476, 1329, -270, -3088, -1266, 2824, 2049, -1302, -1085, 78, -1323, -789, 2819, 2285, -2658, -3177, 1055, 1827, -348, 366, 1198, -1957, -2998, 1524, 3721, -60, -2489, -384, 340, -807, 967, 2785, -242, -3468, -970, 2338, 1368, -258, 176, -636, -2157, -132, 2883, 1685, -1551, -1657, -144, 63, 777, 1899, 388, -2445, -1693, 1083, 1579, 414, 33, -779, -2022, -508, 2190, 1701, -1057, -1588, -384, -292, 390, 1920, 870, -2197, -2166, 786, 1689, 365, 0, -144, -1688, -1439, 1608, 2509, -359, -1947, -578, 228, 96, 1280, 1547, -1019, -2520, -182, 2046, 1056, -279, -259, -832, -1301, 604, 2362, 837, -1637, -1318, 224, 627, 800, 1205, -144, -1948, -1099, 1354, 1585, 150, -615, -847, -1057, 106, 1700, 1189, -924, -1564, -417, 456, 810, 930, -48, -1538, -1304, 536, 1482, 434, -496, -867, -991, -155, 1319, 1270, -572]
1706e72q78R22Q33L51K71n31j517l27J741J211p59j079k44j37L44J223O81j333
1724B00j520M65J216L59q3j82r63p94R54J510l4j242o83J17L39P93O33p09j207
1743h31k77Q76Q72J18l95q81o25O25J156K60q28o32j73J63Q38Q01n12j280k74
1762i99P63O46J24j39m54q64K12J241N59p62p58n2J68M31N79J26j004p64N06Q12
1782C71L21k51m06m93j20O97O77k48o76m36O4M73N46P3o53n14J22M45L65N4k86
1803A25o12k89P35O03k32l59l17p6N0O75L77n81p59K45N66O4K6Q3m23o03M30Q42
1825E70o0p07o6K06j19J71O44j41r47n7O42K48k36k0Q3n76j27P84L24n76m33L12
1847h1L1o7M06J26n75k94L43L02p9n2L4l80j98N94K54m27k15K82j04k84M90M44
$$ y = [-572, -1450, -528, 305, 656, 927, 396, -1121, -1448, 293, 1504, 745, -334, -578, -715, -371, 852, 1533, 200, -1320, -855, 361, 720, 637, 455, -508, -1302, -348, 1162, 1128, -114, -797, -680, -341, 452, 1085, 376, -831, -1108, -232, 640, 758, 363, -518, -1143, -518, 638, 898, 70, -562, -735, -572, 266, 1067, 555, -725, -999, -236, 410, 534, 395, -59, -923, -711, 530, 1089, 327, -431, -483, -315, 116, 695, 821, -183, -947, -441, 371, 692, 441, 35, -458, -578, 119, 796, 548, -128, -564, -500, -27, 519, 592, -61, -575, -453, -8, 357, 411, 125, -487, -776, -41, 562, 330, -29, -346, -422, -372, 303, 680, 99, -660, -415, 151, 215, 241, 324, -99, -702, -272, 570, 510, -197, -263, -57, -176, -5, 639, 498, -449, -506, 136, 384, 148, 128, 211, -365, -492, 292, 616, 40, -393, -81, -50, -117, 289, 415, -160, -454, -111, 191, 112, 60, 94, -286, -484, 110, 364, -63, -278, 4, -100, -384, 106, 550]
1869E50n64n86N07M90n00j44O24l17o77M36Q43l66p42L71M39o00j17Q35P1j058
1889e05R2Q58j24o95M55M22p40l03P89K45p72L8N97l49n15O61L71p36k90P77P0
1910C46p39K52P05n84o73P04N71p22m32R02L8j018L39J022n98p89N75P35q64l81
1930f11J025Q9j049J29J033l10q99N89O67q68m22J098J20j013j9J045l81p33N86
1949G6O33r20m48J040J93j006K02Q69o40q03Q74P25j017n47J132J23j192M97J002
1968G93o46j112Q90Q59j083m51J203M6j331L53J443o35j365Q80R68j051n19J291
1986E33K13j517M1J550l81j270P27R92j062p33J363L92j377p1J276k70j125P84
2004F5Q11j037o72J254L24j184OJ099m50j023R00Q83j193o89J277K59j261L03
$$ y = [550, -14, -600, -93, 397, -103, -247, 377, 60, -617, -181, 662, 296, -446, -75, 364, -236, -353, 482, 553, -505, -413, 445, 321, -374, 81, 503, -237, -540, 249, 494, -278, -240, 357, 8, -507, 154, 525, -211, -501, 276, 346, -393, -141, 564, -20, -693, 11, 582, -140, -572, 330, 368, -650, -311, 711, 113, -676, -101, 634, -230, -611, 414, 503, -546, -417, 616, 306, -593, -4, 663, -205, -627, 471, 591, -422, -441, 604, 223, -510, 76, 709, -211, -659, 381, 574, -432, -230, 639, -1, -804, 70, 795, -222, -769, 363, 486, -706, -209, 793, 147, -965, -75, 784, -299, -750, 453, 499, -832, -479, 964, 329, -1036, -156, 812, -239, -758, 533, 746, -771, -730, 820, 439, -831, -104, 888, -174, -907, 456, 848, -529, -600, 676, 406, -719, 65, 876, -161, -833, 421, 745, -439, -433, 666, 216, -807, 93, 976, -217, -906, 371, 630, -631, -328]
2022c28J239p82j223J037J121j190q04J281K32j408L08J460n85j484R21J147j104
2039a62p35J411K05j556Q8J706m46j465P72J101j112o96J446L66j682JJ557k72
2057E27j294P02R92j227o20J478M61j546j76J403l46j221R23J001j299q70J520
2074D08M92j343p9J281n87j192J067J041j252q41J203N02j308J90J300o91j408
2091a217J002J264j107q90J246L15j373K06J675n78j663P54J294r12p34J303K10
2108G95j713P4J802j40j632M92J107q99o51J353M06j634k59J429L6j024M77P47
2126G66j168n31J457M93j471j71J063l53q64J069P49j353q61J408N95j305M4J251
2144H18q32j248J216J389j291j221J266N46j245J21J517n24j774P32J636o19j138
$$ y = [-328, 911, 129, -1094, -57, 1064, -126, -930, 351, 583, -825, -517, 943, 358, -1126, -205, 942, -162, -897, 514, 719, -837, -749, 957, 511, -954, -182, 919, -193, -889, 557, 923, -759, -758, 799, 527, -767, -65, 927, -300, -920, 558, 1019, -527, -703, 700, 354, -867, 56, 1057, -242, -1112, 408, 900, -443, -522, 759, 172, -1020, 47, 1088, -164, -1005, 198, 700, -608, -418, 882, 191, -1217, -215, 1049, -58, -948, 298, 613, -760, -554, 1121, 543, -1120, -366, 928, 16, -718, 585, 795, -918, -844, 958, 818, -814, -322, 785, -114, -765, 588, 994, -640, -899, 530, 566, -458, 19, 766, -402, -933, 524, 1017, -454, -625, 438, 85, -779, 290, 1039, -314, -1175, 233, 828, -477, -433, 818, -14, -1262, -46, 1343, 52, -1169, 97, 643, -602, -481, 1036, 512, -1262, -530, 1106, 487, -651]
2161f51P75L59j175J07J500o4j472M9R56l58k92Q40L3j401j3J394K2q95L18L75
2181D07j008j75J586K29j565l80J260n8q26P71P77j428r96J573J008j229n55R19
2199C10k40r59R13J181r48j363O99R06m88l8O41n65j104O21J240l48o96K20p6
2218i4o22O74J190p03j365N28R06m64k09R67l77j590K91J855o7j432J03P78o38
2237b69m60J400N56j608q57J260P19p11n2M60p84o59R71J014o37q39Q2K03p2O89
2257D06L81r02p53N55N92q4Q9J27q32o31R67J165o95q84K67K81m91L99J097o09
2277D45j468K47J352o6n02J85r1q15N2J287L39j072m69L54R3J24O79j41j100k65
2297h32Q28N21l84J24r3r14j6J283N33j124o19N30Q9k30O28N62j091j042Q94J167
$$ y = [-651, 124, 483, -692, -585, 915, 851, -621, -572, 384, 26, -266, 574, 607, -794, -807, 587, 609, -286, 32, 407, -601, -776, 810, 1039, -526, -906, 354, 296, -530, 241, 1018, -410, -1406, 167, 1175, -54, -609, 310, 70, -889, 24, 1205, 257, -1106, -407, 499, 11, -27, 614, 49, -1055, -434, 806, 458, -238, -18, -94, -716, -42, 1148, 445, -920, -392, 514, 50, -159, 808, 431, -1159, -868, 987, 920, -512, -409, 369, -269, -729, 671, 1227, -381, -1238, 22, 741, 30, -22, 438, -346, -1005, -34, 980, 343, -496, -414, -211, -283, 406, 787, -115, -868, -313, 279, 195, 284, 411, -421, -1052, -85, 1080, 385, -499, -232, 49, -442, -43, 1054, 445, -1023, -776, 576, 510, 8, 193, 102, -713, -661, 626, 965, -107, -576, -222, -129, -5, 674, 533, -567, -832, -4, 517, 133, 257, 164, -750, -766, 517, 1050, -74, -693, -163, -74, -304, 324, 886, -205, -1247, -353, 814]
2317H14l35o42R4o1n33M30J138j23j214l81O29M66J01J9l98n70j0P01M57p4m20
2338H8n88k10Q27P36m27p19o7J81m3L93P18m98j227nJ333K62o96j64J00m65j31
2359f02J053N73r67r91N07P05j8l5P4n04o17M92Q86N6o05m05l6J30N96L71m90
2380A73o85N2K92M17K25p8o65n84N79Q67qn32k00j29r3M19O96j52r76l60O79M82
2402D19L5k24k08m69q0P29N34l31o32k90K29M05M42j26n99m04K85L19K34J79m15
2423C2o02J4P55M28n08l57j8q7P4O07L94o38q71K92P51J23j92p3l47l32L46O78
2445D69J39n94m98R5M68K36P7k56l72k10L50L54K33k12n59k11M17M85l0m11j50
2466a80o5J4K88N17k10p15j88M80L46q6l1k13l77j9N71L92l26n58J3J32K93K07
$$ y = [814, 479, -163, -69, -130, -663, -233, 905, 782, -432, -813, -184, 282, 383, 402, 4, -566, -576, 125, 582, 508, 88, -500, -710, 117, 853, 426, -293, -360, -179, -222, 171, 889, 391, -836, -841, 492, 754, 58, -106, -6, -471, -602, 451, 1024, 57, -934, -427, 278, 260, 225, 299, -205, -822, -330, 556, 612, 7, -398, -434, -304, 292, 663, 173, -512, -460, -168, 249, 474, 396, -269, -853, -274, 593, 585, 53, -147, -276, -369, 50, 746, 594, -382, -742, -63, 419, 454, 230, 22, -447, -527, 202, 736, 405, -227, -517, -288, 117, 559, 433, -166, -570, -285, 34, 268, 447, 32, -570, -556, 199, 627, 119, -238, -256, -343, -269, 338, 732, 94, -777, -485, 266, 389, 197, 124, -223, -555, -209, 469, 608, 14, -484, -389, 79, 315, 392, 136, -236, -446, -96, 258, 491, 279, -280, -491, -74, 411, 381, -30, -180, -245, -231, 57, 574, 364, -351, -539, -59, 287, 201, 170, -43, -420, -439, 132, 524, 198, -360, -347, -215, 78, 285]
2488B85jl79l27J12L69L04p8m27k96K15K98L30k01k02j31r2J22M46J32n73l42
2509d36K52L76LPn3k58l62L66N87j79m82l4J35J5J68L03k47m59j27M54K46j01
2531A74j65j16k20J23M17J07k99k67M6J28J74J83j65l64mJ86J90n7N4j65l10J41
2553b09M77J05m47p6R5q1M8L14J22m74k46L33K83j75j17J31j94k14L04M26l07
2574I8k87M4K00j22R5K37j88l87Q7M01o0q6o3Ok46J90L94k10l19J11J50j97J52
2597@K36j13m64Q9M34j01k02J68J11l96l0M75P0l98j16L19L3k59K22J48k66l07
2619c47L49K66k16o9J27o4j69J29J87j83k09J68J22k36J80J95j64l65L23K07k94
2640f3q0K92o8l83J41M31k37l83L29K41l87m9M69m0m51L9L50o4k74J21K49l19
$$ y = [285, 284, -95, -422, -310, 59, 363, 285, -142, -438, -223, 75, 405, 204, 2, -129, -221, -99, 347, 479, -94, -436, -184, 192, 195, 202, 149, -109, -471, -105, 482, 303, -179, -213, -78, -63, 105, 408, 161, -298, -425, 29, 275, 174, 9, -107, -327, -204, 213, 320, 21, -246, -200, -72, 102, 285, 120, -244, -248, -62, 128, 71, 125, -40, -350, -209, 268, 373, -74, -150, -55, -136, -88, 226, 348, -126, -372, -39, 244, 69, -48, 83, -111, -325, -21, 405, 98, -189, -145, 55, -67, 28, 265, 77, -310, -223, 178, 118, 32, -31, -25, -271, -81, 313, 103, -216, -105, 45, -152, 0, 236, 123, -341, -252, 182, 81, -121, 47, 158, -238, -268, 207, 277, -121, -237, 82, 115, -144, 78, 226, -40, -347, 2, 268, 52, -17, 110, 46, -123, 6, 193, 10, -199, -31, 91, -145, 35, 230, 66, -299, 24, 231, -63, -143, 149, 81, -302, -161, 270, 33, -350, -21, 220, -167, -216, 253, 213, -238, -199, 151, 87, -187, -66, 183, -136]
2662a36j37L91J56l83j01L41j47j70J70L27l32k66L68J40l75J00K36p9l36K58
2682B5K28k65j84K36O3l10J16L81j70l65K52K66l31j35M01m7m78J22M47k05m07
2703c60L59K81m12j96M89J76n45J1M36p8l84K23K75k94l45M13K32m01o9L20o1
2724G0k88K40K28j98k90L04R8k71R2K13j35l37L42K07k67j89K76O4l66J28L60
2745B81k04l72K63K68l19j86M49J0m83N8N13j30m33K33L13m00j59M20K00o14l1
2766c23N14p0m61K41L75l33l34M56K01l59r1L38p3l20K30L38k67k95K93J93l06
2787e3OK60j93k19J85L48l15k14L19k1k93J07M41l11m02K86M01l09k42L62K4m68
2809c01J00N04j26m92J09M36k87k29M40J10n05l5N18m2l93NL49j59k51M01J50
$$ y = [-136, -273, 118, 274, -109, -210, 131, -16, -186, -16, 311, -21, -287, 81, 221, -154, -54, 182, 103, -233, 25, 253, -12, -196, 40, 103, -207, -91, 290, 120, -245, 7, 273, -58, -193, 208, 161, -317, -195, 252, 47, -360, -1, 280, -132, -328, 161, 337, -208, -197, 239, 161, -223, 0, 275, -19, -364, 49, 281, -120, -189, 131, 70, -218, 22, 250, 52, -238, 66, 164, -107, -15, 198, 63, -274, 68, 275, 8, -181, 95, 159, -207, -79, 281, 77, -295, -32, 236, -83, -269, 180, 190, -293, -235, 278, 148, -285, -52, 261, -139, -298, 122, 322, -292, -323, 191, 121, -340, -99, 276, -57, -391, 65, 266, -93, -184, 154, 81, -239, -9, 329, 62, -233, 60, 253, -53, -47, 213, 20, -199, -14, 334, 19, -195, 124, 103, -190, -83, 358, 47, -355, -69, 332, 23, -219, 143, 167, -301, -201, 303, 177, -315, -206, 230, -57, -286, 154, 264, -241, -276, 242, 200, -193, -188, 161, 2, -249, 152, 302]
2830C02m08j43L91j6k86J90K23k68k71L92J99m07q2K68J8l53J93L84l26k81K57
2851b4K43k77OK85j75k90J96L00j62l07K23P2k24J5L85j59m39J82L81k23j90K64
2873H2J6l66J2N00j8m46M7L23j69k34L76J71m75j40M73N6k80r5K58j78r8K42J95
2896B52k04k41J92R5j47J38J07k95j54K93J43j44o7J02j57j64L40K21k64l35L31
2917D2J18k78O6L42j64m74J93N53k73l93K43J14k22k7M81n7m81p7L98n8q6J44
2939A04m9j89j04L53R1k70m6N1p4QL19L9m19l8L06L0k16K37L7k64k53M06K49k73
2963C5k07J11J13j54J48L08k77l70J72L51n2k26Q5j15j30Q7L29m7k69qN2m0J66
2986F2K66k53l40M1L15p2k1J0M6l39N2N35j6m83O6J04N3j09K79L3l97j54L75J70
$$ y = [302, -106, -249, 142, 126, -160, 30, 253, -15, -286, 106, 305, -102, -184, 84, 102, -251, -58, 326, 0, -281, -24, 219, -58, -52, 233, 58, -232, -36, 264, 102, -205, 18, 90, -134, -119, 266, 107, -332, -150, 231, 8, -182, 82, 98, -268, -256, 244, 226, -220, -173, 150, -19, -253, 123, 294, -181, -321, 152, 208, -72, -167, 91, -87, -185, 57, 252, 48, -193, -1, 94, -53, 85, 192, -103, -257, 36, 179, 35, -32, 70, -87, -251, 89, 310, 46, -289, 42, 160, -118, -52, 290, 126, -348, -155, 398, 125, -268, -25, 89, -133, -160, 321, 264, -217, -294, 104, 46, -40, 104, 55, -134, -238, 115, 206, -64, -110, -59, -133, -125, 194, 233, -186, -224, 82, 112, -104, 133, 170, -94, -347, 59, 308, 35, -172, -61, 52, -102, 46, 354, 77, -293, -121, 230, 178, -48, 37, -78, -208, -121, 208, 161, -108, -116, -64, -104, 62, 328, 75, -265, -224, 91, 19, -2, 8, 54, -285, -233, 302, 286, -197, -131, -27, 26, -83, 196, 229, -168, -322, 53, 223]
3010B23j36j34N0j13j26L09K40j97k70M4P3L4J58O0k71k02K57J73n7j07k0j56
3032a68j20L10L19k03l78J2K37QPJ53j28l70Q2L55J21j82j75M0n8O4K88n2k66
3055a04r7K9J45J45K7n6l22NK90J67j18q8r2j40P5L81J29m16k80K42J47L3L9N7
3079A98k65k66K50L56o3j92j57N5M6J25J94j38k70j63K19J84J13j52j86j68J43
3100a37K60Q6j50j82r2P0K21K34q6m57k8K21O8R1L0j17k98O4L15K43k82k04k5
3123a55L8J39K07l2k04k55J50K01P9lj94j26k8K53J43o0j23j69p4J74K03O6k64
3146c4k19J55J71L1mmk60j33K27L46o8k63p4J8Q9P4J69j02l15k0J65L09j22j44
3170hq0jK4J57J16j21j64r2Q7J99M7p3j95j9J18J24O2j03k16j19J62L03k4j46
$$ y = [223, 87, -47, 3, -110, -236, 73, 313, 116, -154, -110, -37, -3, 155, 215, -56, -258, -1, 172, 115, 8, -12, -168, -288, 22, 341, 138, -240, -228, 9, 17, 24, 177, 49, -321, -239, 116, 237, 55, -120, -80, -138, -74, 214, 162, -104, -201, -172, -27, 118, 145, 89, -233, -228, 62, 229, 111, 23, -69, -209, -134, 247, 376, -40, -320, -78, 69, 102, 141, 198, -67, -333, -83, 273, 210, 18, -139, -84, -38, 87, 281, 143, -127, -290, -71, 113, 226, 74, -112, -280, -137, 123, 209, 59, -123, -215, -145, 76, 310, 224, -233, -261, -40, 28, 119, 149, 32, -266, -202, 113, 356, 74, -130, -155, -117, 22, 229, 197, -7, -262, -112, 89, 168, 165, -29, -155, -183, 70, 213, 153, 30, -139, -213, -39, 164, 230, -34, -253, -98, 73, 104, 100, 96, -164, -297, -70, 276, 208, -55, -129, -111, -22, 52, 221, 119, -196, -216, -51, 258, 136, -8, -88, -89, -65, 92, 208, 87, -77, -169, -82, 117, 164, 91, -104, -123, -5, 119, 181, 78, -138, -257, -95, 208, 184, 38]
3194C8r0n6K5Q7J66Rk89j13J49K08L0j27k4j53p4K59K04j61k38n7Q4O9J26R6j54
3219A4k81L8K95R0o7p6j55k0K00J45r7p4j32j1J08J06M2j32j27K3J19R9K2o6j12
3244d9j12R7K51k1j78j05M7L6O7J95j64j60r4J28J57m0p2J5o1l6J75O8r4k25O3
3269a12J17L1O6l0r6j13Q2J33P4j11p9p1pJ50O2o9j19L1mM1J2J17o7j81kK71J7
3296A43q0n7p9M3k9J44Q9k97l4J49L9m1J49l6k04k5K43n1r7J9j0j3m6J67L5k03
3322h2o0J15Nr6J71J8j05j07J23J90r6j42K4j4m5J77Q4j81r7l5J66p8J17Nj03
3347d6j06J29J14J2j02N7n5q8O7R1J9j91N1O3j0j8Q4Jj29m8R9R4j18rQ5n0o4J41
3375G3l8n3r5J29J3p5Q3J9q8q5J49K4p5lR1r5j10J70M9n7j70K06K5r6j4Q4k2j53
$$ y = [38, -52, -108, -83, 4, 170, 179, -110, -223, -74, 134, 164, 37, 13, -140, -214, 45, 249, 88, -150, -207, -123, -54, 72, 168, 14, -267, -229, 66, 156, 89, 13, -142, -162, 38, 183, 86, 12, -120, -131, -23, 83, 125, -7, -134, -111, 8, 107, 129, 63, -49, -161, -64, 187, 166, -12, -117, -70, -34, 33, 228, 64, -96, -190, -62, 95, 55, -17, -2, -63, -99, 76, 144, 50, -175, -112, 5, 36, 102, 72, -24, -137, -55, 78, 152, 41, -38, -109, -116, 34, 96, 27, -92, -61, -65, -24, -12, 105, 38, -143, -145, 126, 143, 63, 6, -73, -30, -59, 85, 174, -123, -157, -8, 31, -10, 139, 103, -101, -126, 117, 66, -31, -12, -22, -35, -81, 86, 121, -82, -142, -27, -22, -118, 53, 71, -34, -141, -18, 172, 76, -66, -42, -56, -101, 76, 160, -21, -118, -153, 13, -65, 52, 57, -46, -152, -23, 91, 103, 1, 58, 3, -85, -18, 73, 92, -99, -48, 15, 5, -13, 71, 72, -57, -105, -6, 88, -30, -39, 46, -4, -68, 73, 35, -18, -113, 16, 29, -46, 37, 56, -32, -117, 32, 56, -19, -22, 69, -26, -136, 34, 83, 26, -144, 62, 87, -9, -23, 61, 39, -114]
3403a14J07J01j16j10K10n2j16J4J92j4j85O2Q0o7r6Q8N7j37o5K58n7j34J14O9
3427H9j04p7J77j3j13jO6nj17J26O1q2j20J21P5j28kR4o7j02J03J70j79j28J98
3452D2M2j55l1K37o4k19Q1J58j02l7P6L3j04j03K26P5k10K3P1k7o5P3Q5o4j17
3477g6J07K0k9m7Q7p2j07J27L5p2k4Q4J0j57J34N9j36j08J61O2j21M4J46j00j44
3502a17J18J29j85q3J46R7k48j1K53k8k15M6J15P7j83J06Q4j46n0J70J4j88L6
3525f3J28l7n1K0M6m1p5J43Or5j5R0j56J2J65l9q5m4J50j08LN8J01j10k13K76
3551F6K1j84l0J94o4j43J14J40j31j61K12N5j56M3O9L5j67N3J45o3j70J01P3j35
3575h3M7J11N8j49KM4%j3l2Q3o4o5J08Nm4k9P4n8o5J39k5r0jJ26r6L3m8J20j44
$$ y = [-114, -7, 94, -22, -132, 78, 26, -90, -76, 116, 102, -83, -21, 59, -8, -104, -16, 41, -96, -161, 97, 40, -94, 20, 89, -15, -92, 85, 72, -41, -42, 24, 19, -98, 28, 89, 7, -113, 8, 83, -45, -47, 47, -20, -122, -19, 151, -28, -156, 42, 84, -71, -102, 135, 71, -148, -67, 91, -11, -48, 28, 61, -43, -146, 80, 155, -55, -32, 39, 12, -53, 20, 105, 41, -76, 31, 51, 22, -25, 62, -10, -117, 10, 45, -27, -51, 33, 43, -114, 20, 79, -57, -165, -4, 58, -63, -19, 127, 27, -117, 1, 130, -55, -138, 8, 105, -143, -154, 99, 71, -144, -98, 17, 94, -89, 17, 101, -45, -95, 75, 89, -99, -63, 65, 28, -23, -3, 43, 2, -73, 70, 76, -19, -34, 56, -100, -88, 77, 38, -47, -91, 59, -49, -46, 12, 113, 3, -210, 66, 87, -97, -127, 67, 3, -140, -26, 114, -17, -178, 34, 89, -67, -24, 45, 80, -87, -34, 111, 48, -122, -21, 52, -83, -36, 75, 133, -16, -14, 30, 30, 17, -15, 68, 4, -61, 47, 52, 8, -21, 53, -5, -70, 69, 44, -46, -47, 79, -17, 16, -32, 88, -56]
3604e6k7J17L5j21j0P8J9j37M7J80j17j36J17J08o0j75K44p6j89R6J77n0j53M7
3628d2J33o7p6J27%j62O2P8M6j63P7Pj18P7J00N6k03m0J10L9mm1J15j41nM9J05
3655A19j45m8O5m7L7P8rj58R6K6p5M0N3O0j44r2J69J26j96o8J59K1j60O5J87j63
3681dj24N0J58j5j29L7Q7j32m8K04P1j63n3J9P0j9R5l8j46O9pQ0k9J4p4r3N5R0
3709B5Oq7LP2m3L9J9L9j71o5K48L8q2k4qn6l6J18P3j38r2L5J03n3Q5k5m8p5K9
3738g1J50J0m2n8k0o2P9J02p2j12Q2J4nj1O2J7j21oK08m6j08l0P8l4k6L0O9j29
3766e2l9M3J25r3M5m6p5L2J2J41m0n6k3r1P3K26p6j91J5Q7j2K3M6Jj23j30K49
3793G1Q5m2k04R9L2j67J11J94p9k55L1J85O6r9K5p9p1oJ45R1j41r4KP2P3J5m2
$$ y = [-56, -83, 34, 69, -52, -62, 16, 35, -102, -55, 125, 8, -128, -11, 97, 37, -138, 106, 30, -159, -63, 114, 64, -89, -42, 91, 24, -52, 75, 75, -87, -25, 53, 99, -64, 13, 20, -98, -21, 79, 135, -68, -108, 2, 41, 37, -4, 111, -30, -35, 14, 119, -26, -74, -9, -56, -19, 59, 50, -108, -12, 14, -61, -21, 32, 92, -52, -144, 25, 151, -45, -113, 46, 67, -93, -28, 159, -4, -128, -78, 80, 65, -64, -27, 60, -72, -120, 84, 155, -8, -61, -42, 28, 9, 104, 66, -80, -11, -18, 62, 33, 47, -27, -120, -65, 25, 31, -56, -53, 19, -24, 15, 34, 73, -98, -163, 85, 123, 41, 17, 9, -47, -83, 35, 108, -30, -122, -87, 16, -37, 48, 23, -25, -100, -71, 79, 89, 47, -11, -31, -93, -14, 88, 16, -96, -14, 0, -5, -16, 46, 63, -58, -64, 144, 98, -10, -40, 38, 4, -22, 8, 77, -52, -91, -48, 77, -16, 29, -17, -92, -60, -48, 93, 53, -3, -26, -117, -44, 182, 106, -85, -70, 17, 5, 28, 74, 75, -48, -178, 71, 156, 114, -90, 9, 41, -126, -15, 179, 100, -155, -124, 61, 127, 28, 53, -26, -97, -103, 42, 133, -8, -102, -100, -28, 45, 60, 18]
3820A8p7lJ5O3O9k0j96p5J16J27nn0M7n7l6N8R9N0k25l0J25L9j3Nm6p6MO6J60
3849A52p6j71P8J6M3k9J3qj10L4M6J39k8r0r7K4J2N9J39k21MN9k5N8O3j02q9Q
3877i9J31O8m9k2n9o6Q9K5J3p6m1NM7M8L2o4m8k6M6O2L3k6p2j5M6Q1j7m2n6R6
3907D4j05M3P4Kj30p8J72J21o5r2qK2j02R0J46p1j35l0J01O3o1RK0p6j9J34M1
3934A10k1j26r9J39l5Q1m1p7j5M6N6M8J9j37p2Q4R4o5J5J6n0o9M0J48Oj52l3R4
3962Dl1K8P2k8j32%R3J27p4j04J0K9J2l0J25l8q4o7J00j9P9q1n8%k2J34L3o0j3
3991Ej04Q0M3M6n7n0K2j8O0m5K4l5k7KJ52m5o5k0Nq7J03K9L8r6n8Q0Q4o2K3kq4
4022e9K2M2P1m3q0K4k2L4M0om1jJ6M3M2m3n0mq6J50J1r1J4%l2lO9L7j01n7M6R6
$$ y = [18, -59, -62, -47, 16, 85, 65, -131, -206, -90, 37, 32, -18, 29, -28, -64, -6, 93, 143, -82, -112, 13, 52, 39, 44, -2, -78, -74, -8, 152, 76, -95, -17, -1, 42, 13, 26, 18, -92, -58, -12, 127, 99, 9, -88, -64, -52, 7, 146, -75, -71, -12, -37, 21, 84, -18, -107, -99, 32, 100, 51, 29, -30, -96, -7, 18, 31, -45, -86, -81, -34, 14, 46, -18, -66, -92, -46, 16, 49, 23, -49, -64, -18, 63, 46, 4, -52, 44, -61, -18, 56, 58, -72, -150, 22, 143, 78, -14, -22, 0, -102, -12, 134, 63, -72, -102, -1, 62, 1, 10, 30, -46, -65, 69, 110, 89, -37, -136, 3, -32, 49, 8, -69, -84, -38, 18, 66, 85, -52, -124, -40, 54, -11, 4, 20, -30, -99, -59, 89, 95, -57, -90, 4, -27, 1, 73, 45, -87, -87, 6, 133, 59, -45, -35, -6, 6, -24, 101, 63, -21, -88, 12, -7, 72, -9, -67, -67, -89, 45, 78, 18, 5, -99, -19, 24, 70, 13, -37, -15, -33, 27, -18, 6, -29, -56, -54, 98, 53, -12, -32, -27, -114, -11, 18, 56, -40, -98, -18, 66, 4, 27, 25, -59, -37, 5, 76, 33, -47, -23, -45, -11, 29, 23, -18, -19, -3, 40, 82, 39, -11, -15, -101, 49, 60, -31, -17, -17, -49, -52, 17, 54, -47, -104, -58, 38]
4054C8q3K6L6L3j39kR6L5n0Rk0JjQ9n0n8J8J7M9q6J9N2q9J4K1J02p9%k3M0m2%
4086b7N0l5pk3J03p5Mpj1KO7Om9k1J6J9jJ8p8J2M1L1j9J9l2J1L5r5j2P6J4j12
4118h0O9m3M9k3O5%j04M5kKnNN0n1q4R5M1p3kQ8k0k8L1J9m0k8ML3j10M3O6j7n8
4151f3R1N4n1j05Q8k4M0l0N1j2j10J0K4L6n5P1j3p7R1N3kj54R3m0J6L1M6l4m0
4180a5k7R7Pj10K9k4j4K0K7N3j7j9Rjk6L6M2q7oJ1P4m6r8R0q3P8M9Rk0q5M1O4
4212E8p9j4P4n6l8ON7kl1K5K4q6L5P1k1q2Q0n6k5J6K9QQl2M9j9m0P5l8oj4J3j4
4245b5N4q8R5q7m1J39K4p5p6J12Lm1j5P7j7j8l2J6j7jO8k4o6J9M6rn6J8M6qk1
4276@N5J5q2J1Nk6m7M6K4m9n6J20K7m8mrP9r9N9qn7n5P2J5k6k9J13q1m9Q5J2l2
$$ y = [38, -45, -19, 17, 50, -89, -91, 5, 40, -10, -1, -21, -20, -21, 68, 18, -40, -22, -5, 44, -42, -23, 29, -60, -46, -25, 77, -2, -2, -25, 15, -27, -27, 23, -12, -19, -42, 61, -14, -10, -17, -28, -26, 41, 47, -2, -23, -7, 12, 11, 29, -49, -37, 4, 35, 16, 35, 3, 14, 49, -46, -58, 18, 32, -80, -11, -54, -5, -28, 37, 37, -67, -22, -24, -22, -27, -22, 28, -23, -107, -12, 29, -44, -46, 42, 22, -6, 25, 44, 4, -24, -20, 13, -97, -54, 12, -5, -63, 28, 82, 31, -74, 14, -10, 30, 0, 51, 39, -71, -61, -37, -1, -56, 15, 2, -75, 16, 69, 67, -87, 6, -34, -18, 13, 59, 25, -15, -42, 55, 62, -48, -19, -43, -57, -37, -10, 43, 26, 7, 16, 15, -11, 25, 67, -20, -26, -15, 59, 13, -85, 5, -78, 0, 49, 58, 38, -47, -6, 58, -21, -35, 39, -17, -55, -49, 8, 6, -25, 0, 24, -62, -27, 44, 23, -59, 21, -35, -60, -44, -15, -7, 1, -31, 18, -1, -41, 34, -4, -10, -24, -11, -25, 29, -59, 36, -51, -92, 47, 71, -4, -80, 32, 35, -6, -21, 56, 39, 21, -11, 5, -12, -13, 55, 31, -35, -16, 30, 21, -35, -17, 29, 21, 0, 55, 70, -12, -1, 4, -22, -69, -23, 1, -48, -104, 16, 43, -5, -9, -18, 61, -38, 21, 13, -44, -99, -27, -12, -38, -67, 46, -35, -84, 1, 13, -19]
4308a9m8M1M2r2P4M8m6j7L5N9k9j04Q4l9o4Q4j3M1r5K6M9m8J2k4P4o8L9kkJ3k4
4339a3K6Mj8K4j4o2M6K3n4M6K0k0q9R6J1Lq6L0J30j28l6J09m5o5M0K4L6k1q1N4
4369a0J2n3K5P7j7o0kO8n9j6J13m6q3N9QM3o1Lk2j1Q4l6k6J4j3k5M5k2k1nJ3k3
4401d7N0P3j00j9M6l4P2joj26O3M7J5p6N2L7o4OK8j3j0Oj0k1pK3Krj5R9Km0qN4
4435F9p2n1j0P8m2p3N8Q5n2K0K0k5r9L9P1M6o0k8M7m8J6N5J6q8jL3J9L1n8m9M7
4466fM6p2L8oP2k5o0L6QK8n2l1M9m6PJ0O3r7l7J44p0k7L7Qk4J9oQ7q7pK1J3j5
4499A8m9L7J4k0l7J32j14Qk1k3N5K9k7q0L7L6N3p4J2N1j9n1J5J35j14Mn9J4N2
4528A4k1J4J7q2M2J7J2L7o2Q9o3l9RP8p0n6M9J6rJ03j4j18M6l7N3k6j9K9J3j04
$$ y = [-19, -67, -26, 16, -76, -2, 46, 0, -17, 18, 77, 48, -56, 28, -11, -75, 9, -4, 37, -58, -32, 17, -31, -19, -43, 31, -37, 2, 0, -2, 11, -13, 13, 17, -1, 23, 9, -53, -7, 16, -38, 8, 28, 8, -81, 15, 26, 29, -57, -27, 103, -25, -61, 48, 3, -62, -22, 2, 38, 17, -64, -10, 2, -51, -26, 51, 34, -26, -28, 40, -19, -35, 78, 32, -51, 8, 16, 59, -2, 1, -21, -32, 52, 16, -10, 4, -9, -34, 11, -11, -32, -37, -24, -47, 3, 76, -24, -43, 3, -31, 41, 40, 34, -92, -29, 18, 33, -43, 9, 46, -18, -12, 16, 3, -7, -1, -11, -32, -39, -16, -14, -23, -38, 61, 63, 23, 15, 69, -3, -54, -64, 14, -28, -101, -43, 42, -10, 10, 30, 5, -94, -55, 16, 62, 2, -26, 21, -27, -11, 44, 60, -28, -29, 4, 23, 54, -4, -53, -6, 40, -32, 6, 0, 72, 47, -13, 23, 31, 59, 7, -24, 25, -21, -14, -4, 59, -38, -75, 69, -1, -28, 9, 17, -7, 12, 6, 93, 6, -1, 20, 33, 18, -31, 6, 20, 0, -37, 95, -19, -11, -32, -55, 0, 29, 2, -78, -41, -5, 48, -26, -14, 37, 18, -33, -18, 117, 3, 7, -52, -38, 14, -7, 7, 24, -58, -16, 1, 13, 50, -12, 77, 14, -25, -16, 62, -8, -64, -15, 1, -8, 95, 81, -37, 9, -28, 25, -1, -20, 9, 22, -82]
4558h2R2j8L9j7k1Q7j16k3L8M1J7p0O9pNn5mk5P3K0Nmp0k5O5N8l2m6l1RL2RNj4
4592Dk8k1J20l8k6o7P1Lr0P0N0n2K4j10J00N8r1J8M0m5k9L3L9l1kn1P8N0l1p6
4622c0K0j4k6J14l6oJ3m9%Ok4pL8k9j9P7lJ2r6J9QN2j9pJ0j4qk2O7p5rJ9K6N3
4656D1Ml9K5r1l2Q8N4o8L1k1O0r0J8K9m8j5K3L2%M2Ln5l2J4J07j24P1o8J4k9j
4687e7J15p0j1OJ3J8%l8k1P4n8N1o0Q5j2p4M6O1m9l2J4j2n0N8l2L8rj5j4M7JJ6
4719B9m9L4j7J4mj5L1j7q%K7Pq9L8Nk0J17r9N5p7N8L5m7j1J9o9M9o2QQ7l2K1o2
4752d4J8L2p0J1J02q9M2o3J31j00k1K9L9n9O9o4R4o9j5P0o1J7j03P5L0rP2n8K2
4781B8m3K5N4k5k3j7o3P9m2QN5k8n3kPO5o1oj6Q0KM9n9J7r0L8J0R5q0j1O3m0j5
$$ y = [-82, 10, -8, 31, 14, -7, 80, -36, -59, -21, 20, 37, -33, 36, 29, 34, -21, -25, -50, 23, 43, 48, 44, -26, -51, 14, 72, 40, -6, -37, -28, 4, 13, 18, 4, -24, -45, 75, 37, 11, -56, 15, 18, -72, -2, 48, -4, 20, -90, 10, 68, -23, -5, 35, -10, -39, -6, 33, 2, 0, -51, 27, 77, 46, -30, -10, -24, -50, 64, 28, 22, 35, -14, -14, -8, -32, -39, -1, -30, -49, 28, 25, 37, -59, -40, -32, 20, 1, -6, 4, -10, -18, -40, 27, -48, -57, -38, -12, 41, 45, 6, 31, -60, -92, -4, 50, -18, 13, -8, 52, -38, -20, 9, -39, -54, -31, 1, 1, 43, 46, -9, -41, -27, 80, -44, 27, -41, -27, -56, -57, 58, -12, -23, -17, -4, 14, 14, -24, -45, 29, -29, 22, -38, 47, 35, -39, 7, 68, 19, -13, 1, -11, -61, -3, -35, 3, -6, -21, -35, 12, 13, 29, -20, 14, -3, 11, 7, -8, 23, 6, -2, -2, 25, 32, -57, -19, -14, -34, 83, -16, 39, -38, 20, 55, 8, -3, 16, -53, -4, -66, -58, 29, -3, 18, -44, -26, 6, -64, -53, 49, -40, 2, -61, 70, -30, -51, -22, 17, -42, 27, -37, 57, -12, -27, 43, -18, -1, -104, -29, 1, -8, 64, 6, 28, -15, 10, 64, 39, 16, -1, -64, 15, -27, -19, 36, 8, -45, -47, -40, 25, -36, -42, -58, 22, 24, 73, 14, 31, -59, -21, -11, 84, 4, -7, 56, 16, 1]
4814AM2j6K4j09M9L6j9m9O1k2N6k9o2P9n7o5Q1j6%N8J6l8jK6p9P4r0M9n2O2M2
4845E2l0Pnm6j1P5p2M0j8PM0l9j1j5kO4l1j3prL7p1J06k6r4O1j7K3j07J05O3p4
4877a8l6N0j0MRL0m8J3j8L9n0N2o0MQ0p3J5M4k9J8l8L3qK2j4Pj0J3n7LQ7p6N0
4910B8k1Lj4J9K1rj0j4K8M5n7j1l6J9n6R9Lro1R4o9j7P7m2l4M7kl7l9L8J1l9L4
4943a1Qj3j1K4M4j6o2P9m4K2m2L1l1J0QoJ2n0R7l3k7M5l8L3p4QP1j6m4k3O2l9
4975b6J4K0L0m1o2J03j2r5N8L6l5L8l5Qm1O0m6KNM0kp9K8K3l4O6p5N4m1kO9l8
5007a0j1k1R5m7o2R1J4j04M4O0o8k6P4m2NnK1N0m2p0N4J4Q4j20J1M9o4J2L7K1
5037D4k8p5R8L2q4N6J4k3p5N3k5N3r3P8mn3M7K1j5p7P1n2J5K6m8J1RO3O6j36k8
$$ y = [1, 43, 27, 51, -58, -9, 27, 8, -41, 20, -2, 54, 25, -37, 42, -15, -80, 1, -15, -15, 43, 59, 21, 20, 46, -33, 41, -49, 0, -52, 10, 52, 22, 29, 24, -22, -33, 42, -30, 10, -8, -1, 39, 0, -11, -26, -28, 36, 5, -8, -15, -24, 13, -58, 48, 22, -72, -11, -28, -5, -112, -7, 56, -18, -54, -4, -14, -10, -1, 29, -19, -6, -24, 15, -35, 17, -43, -39, 41, -32, -17, 27, -2, 16, -22, 11, 3, 25, 11, 18, 8, 21, -36, -33, 54, -22, 28, 7, 10, -4, 15, 36, 27, 17, 3, 31, 76, 19, 8, -28, -9, -65, 34, 37, 28, -33, 61, -8, -25, 52, 10, -24, 23, 21, -16, -55, -17, -6, -45, -11, -3, -16, -27, -3, 41, 25, -37, 42, -2, 20, -22, 9, -22, -12, -4, -10, 2, -48, 49, 16, -11, 34, -4, 29, -45, -37, 34, 18, -26, -49, 13, -26, -12, 8, 38, -3, -65, 38, 26, -69, -11, 25, -10, 28, -7, 1, -40, 20, -26, -24, -19, 21, 19, -60, -32, -9, -43, 23, -52, 2, -39, -41, 28, -10, -21, -42, 53, 6, -56, 35, 49, -55, -11, 49, -19, -45, 29, -13, -8, -13, 8, 58, 16, -54, 0, 14, 98, -22, -11, 38, -26, -14, 23, 44, 16, -59, 39, 71, -13, 43, 57, 34, -41, 12, -13, 40, -53, 25, 21, -32, 15, 36, 21, -56, 15, -37, -22, 4, -44, -33, -24, 39, 105, -31, -59]
5068e9L6L1j4J9L9p5k2P4j8j9l2L6l7N5k8K2M6o7J7K0m2j9O3j9k2k3N9J4kk9l5
5099c1N7n2J1N7k2l7L1j4j5n7P7oL3n0K0Pk0K9l6QLk8N1q1K3M9o7M2L8l5L5p4
5131e4O3m4L8m2N5J3m0M4m8J1J8Pj5j3M2n0l4L0L8j6%L5o0j4P2m7M5J5n6l9P8
5162C2j2k5k1nn5R7j5o5M0M0l3J4j0LPJ1L7j04L3J0RJ6%M5qk7rn3N1mj3J4MK8
5196C2q2NK3L9L2q4%RL5L0p9j4P1rL7r1O2M9n3Rm1p2R1Rm1M6Rk4J5j8Noj5L4R
5231B2r5N3N9o6j0K9L3J3m8Nm7jM7P7l5Kn7K8j2m5k9Q4L8ll9O6r9N7Oo3OmJ8K3
5265A3p6N4OJ7Kj0k3L3p6K3kO3k6k6N9J5Lqq1J8M1m8J0J1L2j8j6L9k2K0l3P2k7
5298C9l5N1j4j05L7l5L6P4l4N1m3rol5R5Ql5j0j1k6J4lJ1n8N5L1o4MK4l0L9j5
$$ y = [-59, -23, 8, -6, 13, 52, -23, -45, 29, 11, -8, -40, -4, -41, 14, -14, 8, 54, -13, 4, 24, -18, -37, 26, 7, -15, -38, 21, 35, 33, 4, -31, 26, -26, -15, 42, 20, -17, 14, 0, -15, -72, 5, -1, 32, -18, 2, 9, -11, 18, -18, -10, -7, -35, 16, -65, -42, 7, -60, -18, 20, -15, 20, -54, 9, -35, 3, -39, 16, 29, -11, 33, -15, -4, 14, 21, 6, -7, 35, -15, -49, -19, 19, 3, 3, 38, -22, -36, 36, -11, 34, 49, -7, -46, 32, 20, -5, -26, -31, -86, 11, -4, -69, -29, 11, -22, -8, -18, -15, -8, 3, 40, -64, -31, -21, -12, 4, 4, 49, 41, 14, 5, -48, 3, -1, -14, 0, 4, 32, -50, -45, -22, 17, 49, -35, -35, -26, 9, 39, -40, -54, 17, 8, 45, -46, 16, 65, 12, 21, -20, -92, -1, 8, -33, 13, 22, -2, 13, -5, 0, -6, -21, 13, 22, -73, -20, 39, -27, -37, -8, 25, 38, -10, -5, -52, -53, -6, 71, 36, 38, -19, 9, -3, -48, -77, 7, 45, 42, 3, 69, -30, 27, 33, -30, -24, -28, -10, 13, -63, -9, -3, 14, 16, 6, -17, 16, -60, -37, -39, 24, -2, -28, 31, 46, 49, 41, -40, -22, 19, -29, -19, -8, 24, 6, -10, 29, 7, 27, -6, 66, 39, 4, 55, 41, -64, -27, -62, -26, 48, 14, 65, 22, 13, 7, -28, 67, 75, 40, 30, 19, -7, 7, 4, 15, -43, 12, 43, -21, -17, 7, -23, 16, 1]
5330AK6j2l1K0Mj2M2k9MJj0k2L7oLl7O9m6j1j5M5k5k8PJ8k5M8l4Q4o5K1J3k9k
5364Dm8J1L5Pok3M9L0j3K7l0k4o2kJ25r6k9M2L0p5K8J7R9j40L7L0p0P8j7k1Jj9
5396b5JO8m1K7pk9k4P6or4K9Q5o5LL2Jn6N5j4k1K6l5M5l2M2k4%m9Q1l2o8J00p9
5429c0j1P6l0L7p8N3m3L1J2j2j6L2l5l5l4J18q9P0l9M1j5n0L3m3O7J0o0JM5N8
5459F4j5o7P8j35L5N2M0n7J1k0pj5O8r5O1RM5r4P5o1J0KJ1L7n9K7oK0k1k8rk3
5491f7J19o3P0lr2OjP7j06Q5lmOJ6m0kJ0m6N0J4r5L4M8rJ1k4J0Nq4J04k5%N6m6
5525A1p6J22o5O0o4k5M2k6kO2m2j9RL0Km0K9p0J20n9MPn9Q7j2m1N9m0m9K2k5L0
5557a8L2K6n2M6k2kj0m1L8rj4J6J4m2K0j2R8o6Qlm0Q4j7l9j3Ok4O0p0K3N5j26
$$ y = [1, 27, 15, -16, 4, 8, -4, 38, 9, 13, 14, 4, -18, 19, 13, 16, -21, 48, 2, -9, -24, 21, -4, -32, -25, -7, -32, 16, -18, 66, 1, 22, 35, 6, 4, -44, -33, 2, 9, 3, -20, 29, 59, 46, 73, 43, 19, -43, -45, 80, -16, -45, -3, 27, -48, -20, -3, 96, -44, -7, 23, -47, 31, 14, -7, -6, -25, -24, 44, 3, 30, 23, -6, -30, 46, 40, -54, -25, 60, -5, -2, 30, 31, -25, 30, 16, -5, 21, -14, 31, -1, 41, 17, 17, -32, 49, 17, -51, 49, -30, -41, 35, 5, 42, -36, 17, -26, 5, 17, 5, -11, 21, -14, -49, -83, 35, -54, 16, -23, 18, 3, -47, -14, -57, 10, 20, -40, -39, 6, 64, 49, -18, 60, -75, -40, 12, 52, -5, 6, -14, -21, -36, 32, -63, -2, 7, 52, -42, 33, -28, -18, -16, -5, 32, -27, 0, -6, 14, -7, -35, -44, -67, 52, -11, 59, 56, -36, -30, -31, 46, -60, 25, 22, 18, 24, 40, 0, -2, 8, -38, 12, 26, -69, -35, 13, 4, 15, -9, 1, 6, -78, 26, 1, 1, 57, 11, -65, 57, -8, 52, -12, -37, 5, -21, -23, 39, -3, -22, -13, 17, 19, -21, 8, -62, 58, -1, 3, 10, -49, 38, 26, -15, 44, 4, -45, -23, -48, -18, 14, 40, -12, 34, 12, 10, 0, -41, -3, -12, -26, -10, 4, -38, -18, -30, 68, 2, 10, 7, -33, 51, 34, -5, -18, -12, -36, 24, -46, -23, 32, -94]
5589i4J20L%J3l1qk2l2Q8l8k0M3K9n1J0Ql0M3J8l7l5mJ3J8j9Q1o1qM0m5k7J0l2
5622e7J14r2K9m3Q8n3K7jm3L9m8j0L9l9L6rK6K1on6L9k2j3k9Q0o8O9k7K4j3nK9
5654B6j4JK0Ok9%m8O7nK3r1K0N3n5J0oL1LL7j4p0P7k1j9j8R4j15pO7j6p1MJ19
5687E9p8j5Q1k3jJ3k7j1l7kmk5M8m5P5k0Jk6L8oJ5m2J4pL8m8M7K7r8M8L1M0r5
5720c5J3j1N6m1qL0J3J9o7J7NQN3j3K5n1k3L0oo8N5P7n7Ok6j6k7Q5q1O2n2K7k2
5753b3L9m6L9j4%o1M7kL9J1j0n9O4%nn9J2M4j4O1o2l4N9l1l9kL5J2k7K0j6P4q
5786D4p8kL0P1l6K0o0O8r0OM1%m4L9L2K0q1jN2n9N1o1L5kj1Jk0pK8M0o0P0r1M7
5820hK2k3l7N5j7K5M8j29J47r1L1n1%K1m2R7K9p0L1J6n0J0l5k7L7m5K8R9j18L7
$$ y = [-94, 26, 29, 29, 42, 11, 3, -19, -51, 37, -1, -21, 22, 51, 0, 10, 18, -12, 31, 49, 12, -23, -27, -14, 4, -15, 66, 5, -3, 37, -8, -35, -25, -57, 57, -35, -6, -49, 39, -14, 13, 12, -31, 8, -40, -50, -11, -50, -14, -23, 3, 24, 18, -38, 1, -21, -34, -63, 17, -51, 18, -9, 15, 2, -3, 26, 12, 13, 33, 39, 10, 10, -38, 29, 24, 47, -44, -24, 29, -26, -16, -22, 9, 12, 49, 35, -35, 42, 21, 2, -16, 78, -37, -44, 23, 7, -64, -60, 59, -19, -34, 47, 24, 23, 36, 9, -2, -39, -41, -45, -70, -22, -67, 8, -12, -11, -37, 1, -5, 10, -32, -18, -25, 13, -35, 12, 39, -59, -11, 20, 60, -35, -22, -33, 23, -18, -26, 4, 17, 36, -31, -14, -9, -1, 52, 39, 64, 13, -10, 20, 14, -54, 1, 78, 21, 27, 1, -15, -42, 43, -38, 24, -28, -1, -23, 16, -30, 9, -5, -5, -66, -19, -21, 18, 29, 19, -40, 24, 24, 19, -40, -28, 16, 2, 63, 1, -33, 26, -5, -44, -46, -11, 1, -26, -6, -22, 52, 44, -34, -36, -6, 65, 29, 49, -11, 57, -33, -27, 14, 14, -30, 9, 41, 61, -20, -21, 31, -28, 23, -38, -3, -5, -16, -15, -35, -42, -14, 26, -34, 36, -55, -8, 14, -9, -46, 9, -8, 17, 65, -64, 83, -8, 23, -28, -28, -7, -49, 48, 77, 7, 38, 54, 4, 14, -21, -48, -11, -56, -28, 71, -47, -10]
5850a0Lml0J9Nk1L5Jj5P3m8j1qM8Pm6k7l8P2J4j6oo3K0M7J7K8k1n9J5j3M8nj2
5884aj0ML8Qo0O4j12J33q2K1Qr3P4L4l3M0l6j3L7n8J5L1lj2%Jpk1M6j1n8L8k3
5917d1L8rR9j10kO5Rj8q6O4J6l6j6J8R9j49K3O9qn3MK4j2K3j9L1k8Nl2R4r5N1
5949A8M0l7n6M6p3L4J8L2k5lO6p7J3J6M7p8M4n7N9k2N2k5LKL9q3moK4K5k7n9Q7
5982C3l9j7k9J1O7K8j05O0k1k6O7Nrm5Lj4K9k0Ql3J0M8k8J6L2o6J3K1lM2Ml0o3
6015e1R9q2L0Q7k3r5jL1L7j0L1l1r1P2kL1m8n5M8qM5J0L1q2K5l9N8l8N9k3k7O5
6047E3j72J86Mj45R3KOj0l9K6M4n4j7L6l6L8j6J0j7L3ro3L0Q5q9lL3K3p1L6J8
6078A5Joj7l7J03n1n1N2p1Q1L2j4K9n9lK6Nn0m6P8j7rJ0llPL2j12M1O8mMl2K9
$$ y = [-10, -7, -11, -41, -22, -17, -38, -3, -2, -17, 56, 8, -3, -11, 37, 44, -2, -29, -67, 5, 19, 3, -3, -66, -46, 1, 18, 46, 25, -34, -19, -32, 16, 11, -1, -11, -7, 31, 39, -21, 43, -69, 64, -18, 3, 11, -82, -8, 26, -7, 33, -3, -16, 21, -37, -22, 9, 6, -6, -6, -5, -12, -33, 13, 2, -56, -18, -41, -3, -12, 87, -23, -25, 40, 49, 31, -55, 9, 25, -11, -27, -9, 90, -59, -36, 33, 25, -28, -24, 0, -12, 11, -8, 23, -5, 0, -32, 62, -33, 18, 58, 21, -35, 11, -62, -28, -10, 22, -3, -6, 60, -17, -4, 12, 59, -19, 25, -32, 27, 5, 57, 32, 35, 37, 76, -7, -11, -17, 7, 32, 5, -54, 33, -6, -23, -52, -41, 26, 54, -51, 9, -12, -38, 29, 34, 25, -20, -17, -31, -2, -22, -14, -47, -37, 11, -17, -1, 31, -35, -22, -1, -4, 38, 42, 12, -51, 48, -34, -4, 83, 60, -35, -36, -5, 32, 22, 53, 22, -69, 3, 1, 32, -16, -71, -23, -31, 14, 24, 55, -27, -2, -41, 17, -21, 38, 15, -12, 53, -119, 67, 71, -74, 19, 21, 27, 17, -22, 4, 48, -6, -23, 13, -23, 15, -1, 9, -8, 25, 16, -47, -17, 68, -21, -24, 9, 32, -39, -3, 15, 16, 10, -7, -44, 59, 8, -43, 9, -62, 19, 51, 37, 66, 7, 4, 30, 35, -15, -61, 17, 0, -9, 1, -2, -5, 2, 34, -78, -37, 31, 27, 31, -1, 28]
6112B8r2P5j5mK5P2q5l7K7K2M2j57P6J1J4M3k8K8n2Nj4PNL1r5J63j28N3m6N4o6
6143c8N4K5o0L8J7l0l0Kk9J30j6o6J7K0j06J10p5rM4J1M7JMn1q9P4ppN1k6K2k
6175B6m5rL2L5n8L9r6O2l1J02l8l5K1J6l9LQJ4j0K9o4J4R2K7q6J2n7M4l7J1k5
6206d3N1p5K9P3n6L7J4m1Q1p3M6o2jN9k5K0j15N0M4m5J02j10Q0j26Q4K5j0k4Q
6235c%l1K3k5JK3K1NJ3k4l4J05n7l4M4O1j12L0M3q1M8K4k3l2j4K0RQo8L4K0q1
6267h7R8M2q0M7r6R0l0MK1j4M0m2m1O5k9oN9k2j9j2N9m6K9j1LpOK7o0OK9Rn0O1
6301D3o1j1M2J1Kk8l2J0M5j14J13q6J12p6MQ9o5Rn2R8l9p2pJ05l7n3Q9q3K7J2
6331eM5Jj4k7l1K4K4O2j39K7P1m0k5K3R4q7KKp7J18n7M0l5n2O0K9m6JM7p3L2j6
$$ y = [28, -64, 11, -4, -8, 17, 89, 4, -33, -6, 16, 58, -99, -23, -12, 2, 45, 17, 45, -7, -2, -16, -9, -4, 27, -68, 95, -33, 20, -26, 28, -38, 16, 41, -19, 19, 36, 6, -24, -22, -51, 79, 63, -3, 14, 34, -72, 38, -37, -46, -2, 9, 56, 57, 61, 10, -79, -5, -12, -19, 32, 6, 28, 26, -19, -28, 4, 39, -19, 20, -76, -14, -45, 57, 19, -16, 5, 21, -18, -15, -7, 7, -3, 26, -38, -24, 68, 95, 9, 21, -36, 8, -29, -18, -43, 8, -67, -38, 35, -21, 16, 30, -11, 70, -3, 43, -19, -20, 39, 14, 34, -81, -31, 13, -32, 70, -40, 40, -86, -2, 23, 13, -11, -3, -3, -34, -11, -36, -35, -12, 9, 14, 27, 3, -31, 74, 17, -17, 27, 88, -24, 6, 49, -32, 16, 40, 17, -15, -29, -9, 0, 8, -60, -26, -6, -87, 11, 53, -27, 20, -76, 14, -16, -12, 9, -5, 35, -7, -48, 17, -12, -18, 41, 19, 0, -12, 47, 1, 30, 19, 22, 15, 21, 48, -12, -6, 23, 32, -18, 43, -18, -29, 13, 24, 26, -2, -34, -24, 21, -93, 20, -66, 46, -30, -26, 63, -2, 7, -45, 53, 14, -58, -65, 40, 3, -50, 39, -44, -17, -5, 40, 41, 27, 0, -31, -7, 17, 79, -60, -33, 38, -2, -27, -4, 90, 3, 5, 7, -70, 48, -9, 31, -4, -56, 4, 33, -13, -12, 35, -38, -6, -22]
6363b2K2M6l5J3j9l4nJ9P4j6m1Q6n5k6K9k9j0j7k4N3l1n7J46j07m6N5l0P4n3l1
6393g1K7LM4jj3J00j51PN4jQK1j9Kj5l5J0P9l6Jjj7k3J3l7L7PKk0M1qk8M9k3m3
6428c7J5J9k3N4k7l4O9l3m9O4k0o1L5Q6r0K8Ml8M2NN1l1k8OK9pj9k4L1J4o7j1
6460d7K6k4N5Oj9l2P6m9N3j0M5j06k7O3nl0kL3k5KK6llJ1qO1o0O2n4Km5O8rMr8
6495f3O9Om1M2m3j3N0j0j3M0m9M5l6l0k5J11l8N5j3l4l9K7pM8k3k3L8p8lM9K6
6526B5K6r5J7j3R4p9L3K2j6J2m9K7K8j6l9K7j6Nj8K6L8p1k0P7m1O1k3j6nj2L4
6557B3j5o0N3k1L2n3lO1k5m9M5M8l3l8P1p7M5l1K6k1L9ol7K3m3J9M7n0J4M1J8
6588D3k6jmK9o0M1K1o4K0L1k3pJ1l1%m5Q0o3j5L2L0P4j05N2j3oN8j12P1l3k9N5
$$ y = [-22, 0, 46, 11, 24, 5, -29, -34, -15, 59, 43, 2, 88, 33, 7, 36, 7, -3, -20, -44, 9, -22, -79, 67, -40, -86, -31, -61, 13, -40, -71, -44, -41, 3, 2, -11, 89, -62, -55, -1, -2, 6, 27, 8, 10, -5, -40, -30, 49, 13, 14, 13, -4, -27, -14, -51, -14, -7, -5, -25, 16, 8, -20, 29, 6, -37, -22, -3, -26, 28, 1, -33, 36, 3, -46, 18, -2, -63, -28, 58, -32, -4, 0, -38, 4, 9, 60, 29, 1, 7, 36, 29, 10, -14, 17, 31, -36, -47, -21, -45, 10, 16, -3, -35, 41, -8, 45, 35, 80, -26, -53, 10, 5, -25, -27, 6, -19, -17, 9, 6, 3, 14, 6, 67, 7, 69, 15, 17, -28, 40, 31, 35, -63, 6, 12, -29, 13, -30, -43, 7, -3, -16, 24, -25, 20, -16, -46, -71, 40, 2, 57, 44, 10, -29, -2, -9, 39, 16, -7, 31, -47, -50, -1, 25, 51, -44, -27, -40, 54, -25, 8, 30, 14, 26, -23, 4, 32, 16, -23, 4, -12, -7, -25, 1, 39, -32, -52, 25, -16, 45, 22, 6, 1, -11, 23, 8, -52, 1, -20, 12, -41, -44, 17, -8, -57, -12, 36, 3, -35, 36, -41, 4, -27, -1, -22, 17, 11, -26, -3, -46, -27, 20, -30, -16, 25, 43, 17, 16, 12, 41, -19, 22, 43, -21, -1, 30, 7, 0, 11, -20, -20, -65, 15, -48, -63, -31, -1, 73, -32, 20, 7, 1, 59, -53, 18, -15, -44, 11]
6620A1j8l3J9L2m3JJ5R6p8K8q6J9Q7NJj0J9o2Kj0Jm3N5j6o0N2L4k2rK3l3j0J7
6653a6L1n1J1M3n7O3m5J8J2m9M7lL6j0mk5K2j5J7l4L8j6mk1j6k7J3K0j0L9Mn6
6685d5K6oO8o1MR6r5j7L0N2oo8k7J9jP1p1K5K7n7L9l5m0N0kR9q3K8m2J1J7j2l2
6718c8N6N9j30P5j04Q9j7Lj0K%l5J7L5k0k7m6N4KO2l6L4m9l4K1K0lm8J5LN0J7
6750A7k8n0J00nn1N3m2k6j0J08p7L4J6j8n6J6Q6j01L5Mj4l6J5NK8L%Pm3L6nKp6
6783g3J33l6j08R0J5J9l9l4P6j4k1LNl2l9L6mJ3JK2J3l1L3k9Pk1L0l3K4J0q1K4
6815d1M4l1N6K3o5n2R1j5l5Q3p8pK1j0m7J5O4j8m2l7M3L8j4KK1J2j00N3L1n2K3
6846b4L2Qm1N3l5k5J7j1L9m7m2J04K1m9N9n5l5l5J02l8l0M0m1M9%Jo0K9n6J8M2
$$ y = [11, -7, -40, -21, 11, -32, -31, -16, 80, 2, 30, -56, -37, 50, 55, 56, 46, 65, 3, 5, -5, -4, -47, 8, -8, -68, -16, 18, -4, -13, 10, -23, -33, -16, 15, -36, -25, 18, -39, 24, -21, -3, 9, -40, 7, 4, 40, 30, 26, 1, 23, 8, 25, -9, 29, 13, 9, -12, -28, -55, -42, -22, -32, 7, 11, -45, -19, -25, 43, -18, -14, 82, -13, -30, 0, 52, 46, -22, -49, -30, -31, 40, -31, -6, 21, -36, 3, -32, -72, -22, -24, 75, -8, 20, -22, -11, 6, -6, -38, 18, 77, -53, 22, -82, 7, -10, -7, -17, -15, -15, -50, -33, 2, -18, -45, -91, -37, -35, 27, -9, 25, -24, -58, -37, -17, -20, -68, -53, -50, 0, 17, -11, -61, 39, 34, -17, 36, -6, -32, -42, 66, -11, 23, 39, 21, -35, -19, 67, -34, 1, 5, -9, -45, -30, -25, 3, 6, 6, 13, -30, 6, 1, 3, -73, 60, 24, -84, 6, 21, 40, 1, -33, 43, 29, 8, 11, 16, -16, -55, -19, -23, -10, -9, 13, 26, -5, 28, -1, 6, -15, 15, -18, 6, 16, -65, -41, 3, -28, 28, 51, -14, -66, 25, 10, -25, 58, -20, -27, -6, -16, -63, -48, 16, -2, -44, -81, -38, 0, -14, -12, 9, 21, -79, -26, 5, -47, -24, 8, 16, -25, 28, -7, -32, -15, -26, 13, -34, -76, 28, 49, 0, 59, 4, -31, -66, 36, -2, -32, 8, -33, 16, 16, 17, -43, -14, -70, -52, -10]
6877a0N2j2l0nk3P7l8m6L3k4L2N3m7M4n4m7Q3n8Nl2P6l0K0o9M6l0J3lOM7Rn2j1
6910b5On4J04oKk3j6Ln7K9J17j52O2J6J7qrK3K8o9J4L0l8j3jM8mKJ3j11N7K3M6
6943E4n6O7j04P0k3n8P0j1n1RL3j8qJ3PO7q0PN8l8L2J3n5M9p2N9l5QK4m9J2L5
6975B9l1l1K5K9M5j23N3JJ1n4J1JL6l3O1J7p5K8j5L9l3N3r0J2O2l4N5p5O9k1j2
7006A0q8P8l9M2K4K8p0l4M0j8O%J5P7q9N3J3o8K9o5O2l3l8J15j16M1L0JL3m4j8
7037b3J9k4K4K4k1K7k9rj7O1j8K4p4N6p5P9qj7o1J17oj3k1k2j1K8J3l7qQJ8n9
7069e5J4O2l4K4l6M7q1N6rj3M4Lk9J5K3j6Kl5K3l2J6jpMQ0o2Jm7P7o1m8J21n8
7102a2M0k3qj0K6m1MkK8J4qL0j1j7j5qOj8Q0n8j4n5J5nO9m9N1J4J1p5O5l0J6q3
$$ y = [-10, 42, 30, 0, -5, -28, 49, 11, -35, -2, -26, 6, 59, 12, 56, 2, -45, 38, -20, -15, -47, 29, -1, 19, -50, -4, -34, -21, -24, -18, 29, 38, -14, -25, -19, -73, 31, 25, 27, 4, -12, -9, -66, -37, 80, -72, -10, 6, 23, 15, 6, 29, 57, -12, 2, 32, -6, -19, -20, 28, 24, 26, 39, -72, -15, 8, 54, -2, 65, -39, 31, 8, -50, 20, 9, -42, -33, 0, -18, -26, -13, -6, 61, -19, -12, 46, 8, 40, 53, -2, 47, -25, 34, -1, 7, 31, -18, -6, 29, -2, -33, -8, 21, 66, -57, -4, -3, 8, -46, -35, -34, 2, -31, 30, 47, -28, 0, -15, 24, -9, 44, -46, -34, 28, -6, 49, -26, 43, 22, 10, -78, 0, -39, 3, 27, 55, -15, -49, -9, -27, -21, -21, -6, 71, -18, 35, 48, -20, 9, -56, 6, -27, -65, 50, -66, -25, 5, 6, 39, -5, -23, -4, -28, -4, 20, -1, 26, -3, -12, -29, 32, 14, 38, -36, 20, -55, 24, 16, -1, -62, 55, 49, 36, 15, -7, -18, 10, 23, -14, -22, -14, 4, -55, -41, 21, -13, 11, -25, 22, -59, -3, -12, -25, 19, 22, -7, 8, 31, 15, 17, -18, 5, -27, -11, -12, -19, -15, 65, 3, 4, -43, 34, -27, -75, 46, -12, 28, 5, -3, -13, 13, -28, -24, -26, 2, 16, 8, 38, 27, 10, -5, -13, -7, -25, 55, -3, -17, -72, -57, -62, 7, -42, 9, 23, 34, -41, 24, -6, 10, -73]
7136g3Q8l8k5M3L6r7J5L0%J5j0M2l8K3p8O8n8R2j9qk1M6j4mm8QM3o9P0mK1j0J
7169B7k3L0n7nO8n7K5OM4j0k9J5o9N9n0J4J1o0J27j08J20k5r7O7q7R0j7jJ3Jk8
7200fOOP5q8K8KK5n3oK8L9n6L8p4L7k4N8J0l2n6ML6J9m1Q6j37O5j4K1O8p2rJ3
7233dJ5j4kM3q2J05m3p4J01j3ln3K8o2O2k2pJ4J8K0J2l0M1q0j7P8k9J8k6J5l0
7264b1K1mK5Ll8k0L9k1N8K1p4n4M3j8K2k1P0p7R4j2q1M5Qj7k3J13p0nnl5M8Nk4
7297ePm3jk7R9m2J7K3m6J4N8j03J7j0M9J9q6N3j7m3J5PL6L1q6L7K3j3m0L3N0p
7329A9qj1J6m8M3nQk4j2pK2kP4l2r0P2k8j6N9krK7q3M2KPlL5m3L8m6J1k3M9j4
7364A8%q7P8l0k5J4k7Q3R3r3J4l8LK7l1m9j0P8q4N9k1O9j4j2n4P4k7k5N3jl8K2
$$ y = [-73, 15, -23, -48, -5, 31, -66, -51, -21, -21, -6, -16, 26, -12, 11, -67, 1, -57, 35, 16, 8, -13, 33, 19, 15, -33, -25, 18, -51, 19, 15, 36, 26, 27, 4, 34, -23, -28, 40, -17, 8, 14, 58, 48, 19, 34, -35, 24, -26, -12, -1, -61, 66, -42, 78, 53, -44, 23, -64, 26, 9, 8, 21, 22, -6, 0, 6, 81, -7, 21, 23, 48, -5, -11, 17, 56, 0, 38, -36, 1, -23, 35, 45, 13, -43, -39, -3, 16, -25, 61, -76, -11, -25, -4, 64, -8, -17, -4, 11, -3, -5, 38, -44, 61, 18, -56, 45, 32, 29, -24, 4, -58, 4, -18, -25, -11, 7, 27, 39, 9, 50, -30, -47, 31, 2, 20, -6, 9, -21, 0, -4, 21, 24, -14, -34, 5, -16, 42, 63, -11, -65, -22, -40, -18, -39, 31, -46, 48, 36, -45, 0, 8, -9, -32, 81, 11, 6, 1, -34, 14, 19, -5, 2, -41, -42, -69, 30, -12, 5, 28, -18, -4, 54, -49, -32, -42, 7, 26, -60, -7, -24, -67, -52, -45, -9, 22, -64, -27, -4, -17, -57, -24, 26, 19, 11, 0, 16, -32, 11, 6, 14, -10, -22, -29, -7, -9, 65, 33, -57, 15, -13, -29, 30, 28, 19, 46, -37, 5, 7, 14, 11, 46, 3, 41, -5, 6, -17, 32, 18, 18, -69, 9, -21, -46, -32, -59, 24, 117, 24, 38, 0, 3, 30, -1, -50, -60, 18, -66, -7, -28, 41, 27, 15, -39, 35, 8, -17, 36, 35, -3, 19]
7396A9k1K4k6L0K3n8m0P3k9jM2%m5k7K9k1M8n1K0M7l8m2J0J6k7L2J1lJ3j2l1J4
7428b1J6JMm3K5J2j5N3n4J5J5J3j3j1k9N8n6O1j9l3N6j6J5o0On5J09Rj02Q0m8
7459b7O9p9J1M4o9K3OR4o1J0p4M6N7l2K7p4K6m2K8J3J2Rl0N7j4kk5l6Q4l7j06
7490i2P5N0o6M4k7mJ0j4mk4K5Q3j05N0OPl5K8N7o4k4N5l6l7j4P5m2j0L3pM0rn1
7523b7mM3J9o3LoM6Kn9J6l8M2J42o5p2M3k6o2j1O8M9o3OK0n4M5pL2KJm2qL7J5
7557B4l6J4j3J5oj3L3o6O9l7j8N3l1J5nK0o1K3L5j2J1o5K5L5l9M9oJJ7k8m4J9
7589b2L5k8k7J05j16N4L5p6k1P6ml2J7pK8n4L1k0k7K9O4p1K1O5p7L5Km7J3L9o4
7620d4L8J6l2NL4rk3nKJ5L0l2PnO6r1N7k7j9Q1m5M5qj05R4l0K1p7N3M5j07j3K9
$$ y = [19, -2, 22, -4, 26, 49, -9, -49, 24, -5, -6, 36, 36, -9, -36, -7, -28, 20, -31, -11, 36, -2, -44, -34, -18, -45, -13, -2, -5, 8, -4, -35, -21, -5, -4, 0, -43, -18, -6, -21, 32, -22, -7, 8, 21, 8, -3, -32, 26, -30, 31, 12, -21, 35, 19, 34, -26, -20, -75, 34, 43, -59, 21, -27, 42, -37, -26, 18, -51, -28, -22, 72, 11, 21, -53, -7, 50, 18, 45, -29, -3, -45, -17, -4, 8, 17, -13, 44, 30, 28, 3, -33, 51, 14, -92, -17, 33, -33, 11, -16, -20, -10, -24, -28, -52, -27, 56, -49, 1, 7, 14, -21, 7, 64, 0, -24, 31, -5, -42, -56, 19, -23, -33, 0, -7, 33, 24, -27, -31, 12, 31, -32, -29, -35, 11, 13, -46, -30, -68, -26, 116, 51, -21, 22, -4, -66, -77, -9, 40, -23, -17, 3, -51, -6, -13, 19, 21, 22, -20, -28, 9, 24, -12, 2, -11, 4, -2, -15, 18, -48, 21, -16, -34, 19, -12, 3, -2, 18, -43, -20, 15, 3, 14, -51, -26, 9, -30, 19, 13, 14, 31, 3, -41, -22, 13, -15, -42, 63, -53, 1, 36, -40, -61, 15, 11, -21, -4, -11, 17, -37, -6, -26, -53, -24, 40, -31, -10, 55, -22, 13, 15, -32, -19, 20, -44, -6, 10, -22, -17, 17, 8, -15, -20, -18, -3, 27, -5, 2, -3, 63, -28, 29, 2, -17, 64, 19, 64, 56, -49, 45, 15, 36, -41, 12, 57, -50, -63, -34]
7653c4L3j9K4j5M3o7K8J4m7l7J06o4RP4m7m3J8n7Q9k4M6j16P8k9R1o4oK8m6O1
7683B7L4p9k6Qk0M3K2J5o6K9l9kJ28j08OP5l7j6N1k8N5r2rom2J31p0k0N6j5k8
7714b3KM1K0L2l3k9k1J5O5m6q7R9k9j4N5j00R2r4K0P5J7p4lJ2K1N7j12K5j2N2
7744B3O5q4pOk9J1n0O0J3O4o6J6k0K9m0L6op2J00j1m5LO8j22J8J00o4k7L7rK9
7775B6Jn1lQ7r6N1m2Oj7M4j8k9N8Jk7M4lO2j17q9J21m1M2m3L9j3K2j9p9O3L3L
7807A6KJ1k7k1PpM2K4o3O5M2j35O1n7J5L5K5o3mj5K3P4q9L1N4p2M3o4R0n0L8o3
7839c2L0k4MM9m1P0q4L1j1Rk1M2n6M0k6K8m6P7K9q7K5l3k1jO7m9l4M6k5J29p0
7870A5j1K2pk3j2L9K2q0%J03m2k3o1Q5m7M7Mo8J4k0L5k4J05n1nK2rl4j8Jm5J03
$$ y = [-34, -1, -20, 4, -11, 32, -35, -7, 7, -40, -77, 29, -35, -26, 48, 1, -42, -24, -81, 8, -16, 30, -86, -8, -37, 54, -10, -16, 12, -34, 27, 61, -18, -44, -36, -56, -13, 9, 24, -42, -13, -52, -54, 74, -34, -28, 47, 10, -6, 45, 17, 72, -20, -29, -35, -77, 54, -16, -36, 20, 5, -23, -21, 20, 40, 72, 39, 10, -11, 4, 69, 23, -64, 35, 6, -8, 47, -53, 39, -55, -35, 40, 57, -17, -20, -8, 13, 70, -42, -17, -29, 23, 88, 4, -3, 3, -26, -15, -65, -5, 8, 72, 6, 22, 2, 31, -9, 27, 21, -51, 49, 38, -7, -4, 64, -58, -40, 60, -4, -31, 6, -3, 26, 27, -24, -27, 60, -36, 15, -27, -21, -38, 6, -12, -41, 17, 18, -9, 35, 32, 94, -23, -112, 9, -32, 10, -33, 6, -7, 15, -4, -83, -20, 13, 16, 18, 29, 2, -19, -12, -19, 23, 47, -16, 49, 91, -44, 17, -40, -25, 10, 35, -28, -32, -47, -24, 50, -39, -8, 46, -26, 17, -47, 43, -7, 31, -32, -2, -26, -22, 27, -14, 56, -28, 3, -8, 1, -20, 22, -34, 6, -20, 8, -38, 39, 68, -19, 6, -27, -48, -49, 18, -31, -65, -19, -44, 85, 15, 4, 26, 19, -4, -16, 23, 45, -35, -35, 68, 26, 3, -58, 27, -20, 27, 31, -37, -23, -43, -8, -32, 73, 22, 17, 39, 30, -4, -22, -21, -66, 37]
7902C7k9On3M3J6n1k1J5K2J7j6j1J6j4k5Q1m6K1j3j7K3Nl4M7L0m5N2j12j7P0L1
7933B8o7Kj4O2Jn2M6k4J6J3j5NM9lm7j9J9ok4J0O3k8l3N0r4J02m8J8L0n7j4j0
7965d1J01j06N4m0O5p1J3K9M7k2k4j1K2m5%J2qM1l2l0l6O0N1Lr2L1M8QRo1j2M1
7997DmOroKK8o3O0j07R2k4P5p7k5Q6j5m0L0l5rL1rk8O5N0p0N9m8n2L3k9L8k6L7
8031B0j7pJpK8l0K3l5j6K6j9L4L1m6l1K8qKK6l8j1P9K1p6K6n6N2j4j0K1J0p9P6
8064DJ5k9j5O9l0j01J18n4NJ2J9M5l1j3km8qN8M7k5j2L4j20R6l7K3o1N6K0J1j02
8095e6J8O2j5o7P1j9LrKk4N6j4J3m5M1J8j21Q1j9J2OK3m9L5l3J6%nk3J3K1LK4
8128A9k8k2lL6k0k9M4lK2j1l8O6n1M8Ln4m8Q4Ko4j2M8j4K6jpj0o8J06m7M6N3m6
$$ y = [37, 8, 14, -39, 4, 20, -31, -52, -37, -15, 2, -14, -25, -9, -23, -48, 33, -13, 8, -5, -22, 1, 6, -28, 19, 49, 4, 56, -56, -73, -3, 28, -39, -37, -51, 11, 12, -40, 6, -18, -2, 11, -4, 1, 50, 47, 0, -19, 0, -6, -30, -20, 43, 15, -18, 32, -62, 40, -8, 10, 40, -17, -31, -41, 60, -46, 8, -32, 33, -38, -25, 4, 51, 29, 5, -6, 16, -29, -29, -17, -25, 16, -16, -46, -82, -22, 29, 32, -60, -29, 19, 27, 36, -25, -37, 4, 0, 6, -3, -9, -7, 21, -42, 18, -89, 3, -21, 54, -23, -48, 38, 23, -17, 13, -22, -31, 0, -9, -37, 28, 78, 8, 67, 19, -33, 0, -29, 9, -17, 20, 3, -4, -3, -10, 18, -12, 11, -24, -40, -14, -33, 1, 32, -14, -45, -17, -25, -23, 3, -35, -46, 33, 54, -22, 4, -52, 0, -14, -24, -3, 7, -72, 4, 19, -10, -25, 44, 14, -87, 31, -23, -18, -6, 13, 58, 27, 14, 12, -36, -44, 14, 61, 36, 24, 58, -62, 34, -3, 20, -41, 15, 35, 46, -56, -38, 24, 9, -58, 13, -6, -3, -12, -10, -34, 22, 8, 21, -24, 17, 35, -86, -5, -24, -12, -6, 17, -32, 3, -30, -14, -14, -19, -42, -29, -8, -5, 19, -9, -31, -34, 2, -18, -47, -3, -6, 16, 5, -33, 33, -18, 30, 33, -21, -69, 15, 17, -47, -59, -11, -25, 1, 0, -7, -17, -85, 21, -26, 20, 73, 27]
8161B7j7j7O0j21J03l6j5J7k7M8j6j2l1P0m7N1o2L5k5J8k4n6J01m5L8l3Nl1K6
8190a6J7
$$ y = [27, 10, -7, 53, -68, 35, -1, -16, 1, -26, 22, 6, -6, -37, 33, -14, 37, -25, 10, -15, 3, -21, -77, 24, -21, 17, -16, -11, -42, -16, 1]
8191A
$$ Imaginary data points
##PAGE= N=2
##DATA TABLE= (X++(I..I)), XYDATA
0@%%%%%%%%%%%%%%Nj3J6j6J6j6J8k3K8l1L7m2M5n3N8o3P1q0Q8r7J11j25J36j47
38g7J65j84K01k21K46k73L02l38L79m25M79n41O18p15Q40j006J234j567K094l017
58a806M924j0267M9617J68622j93130j81652J58882J16604j50483n0459J69997
69H0849J8922j81815k0025J53761K0937r4045R383M2327n9932l0150R2268M7195
81G9675q0094n9861L4642M2723Q116o772k2316j4695J5252j357j9167M1369N3251
94G0766p1008j02000O7718J29515m5725j15585L7795P6278o0864m5104R7770M0251
106G9807j15043m5925R7597L1577o4107J2323M6345o3463n4040R1155O8835q3990
118A071o2560O0755K7101m9280J6606N7949m0281o7325L7110N3827k5353j3463
$$ y = [0, 0, 0, 0, 0, 0, 0, 0, 0, 0, 0, 0, 0, 0, 0, 5, -8, 8, -8, 8, -8, 10, -13, 15, -16, 21, -21, 24, -29, 29, -34, 37, -43, 45, -52, 59, -66, 70, -77, 88, -96, 105, -116, 130, -143, 159, -179, 200, -225, 254, -287, 331, -384, 456, -550, 684, -883, 1211, -1806, 3118, -7149, 42468, 211090, 17960, -163692, -4810, 111794, -38689, -89148, 80849, 99771, -82044, -102069, 51692, 72629, -21416, -12033, 30294, -29638, -59788, 32480, 79675, -419, -60280, -25638, 17085, 25201, 18429, -3887, -18582, -3330, -4687, -23854, 17515, 70766, -242, -102242, -34524, 94991, 49266, -66319, -28524, 47754, -13110, -58214, 39556, 79807, -35236, -81161, 16436, 48013, -16094, -3771, 42574, -20889, -74929, 16226, 85061, 1071, -61489, -734, 26367, -22913, -6307, 51642, 11361, -55964, -18854, 34973, 9620, -3843]
130c843K8996l2805n3341N7664P7599n4879p7382M4309M9963m8366j6850O8827
142C9892M95q6619m702P9919J0448m8661J943J4765l2119o5N8117M887o0241j0852
156c2793L9025Rj4595K6034N840m7156j2035M4576J4298k1405M072p21l7773N208
170b7416O5389M859o9704r625N5108m886m1276L3129M3749n3283n5692N1490N7401
183D9243l4973l7657K3979N854k9497J8135M3832k1698m8490J2165L2770q555
195E108o912J9588r791l5723Q209L8643J998k1168l934o056j0462K3791K9357
208C2648k4317l5233J8484K2231k2388k937L9863o312n8303J466O1907N885m8002
221a5008q69K9502j7474k0912L6327K4358m1797k7855L3574K0132k2821j437K1640
$$ y = [-3843, 25153, -7652, -60993, -3329, 74270, 19391, -57991, -13682, 36281, -12085, -28935, 39892, 40387, -46232, -50934, 28985, 39433, -9228, -7285, 7480, -24639, -24704, 33413, 38300, -21941, -32793, 6232, 6241, -8354, 17680, 23520, -23636, -35671, 8905, 23203, 1798, 5870, 5149, -32624, -27416, 37973, 42832, -26872, -36497, 18611, 13725, -27551, 5578, 49327, -3956, -59648, -8158, 49243, 14270, -23387, 592, 6446, -23051, -4916, 38916, 17218, -31272, -19107, 13663, 5108, -1804, 17784, 7993, -27730, -19521, 19122, 21120, -48, -3982, -10038, -20500, 3291, 32648, 8331, -26902, -8418, 13813, -8575, -11512, 28351, 22039, -36264, -34798, 27109, 32994, -15008, -15877, 13625, -3849, -24761, 11566, 35924, -5873, -33728, -154, 19978, -2843, -4280, 17360]
234A7360j5751k9885J9960L6102j1477k9666K056J2585k063L139J0202p714j5630
247a0782K208R465K245N424K622j7491j3752J7872J9949j0595j4369N305R02r150
261a0147R860J8082j1305k2324O734J6028n693m324J2864l802k3297L247K8343
274A4266J772k3247k820J2733l954n462J3907N661j8524q292J4771O365p405K649
288B420M051j2982p248J8163J1916j5084j1413R396M305p525M180J0389p513j3664
302a0609N432J1730k193m747K906k846q046N499J2717l072j2616J6P590o31k537
317a407M550R69p719l386O478N314j545l360k773j538K889N252j84m560j982J149
333a853R05J734K419j463m139n57K440J396J342Q94l665m533L389O759j454n870
$$ y = [17360, 1609, -28276, -8316, 27786, 16309, -13357, -11301, 1284, -779, 2360, 12562, 4848, -10782, -8574, 891, 3136, 8560, 11182, -6309, -20061, -2189, 17760, 7165, -7204, -1899, -997, -10147, -287, 17795, 6490, -15834, -9100, 6928, 1235, -3089, 9775, 5973, -17324, -14077, 14266, 16038, -7209, -10029, 2704, -1250, -6712, 7195, 12856, -5668, -13960, 811, 7176, -229, 2420, 6471, -6511, -13759, 4404, 16320, 1236, -10177, -781, 3524, -4001, 179, 10568, 3055, -10609, -5177, 6553, 4360, -387, 2519, -327, -8373, -2874, 9843, 6771, -5845, -5829, 1761, 1130, -1407, 3143, 4112, -3607, -6993, -515, 4799, 3254, -106, -2879, -4417, -1528, 3724, 3540, -1020, -3002, -1853, -948, 786, 3205, 1742, -2397, -2954, -514, 882, 2224, 3118, -547, -5080, -1691, 5068, 3614, -2256]
349b256O36L561k406j922N004K619o075l919M865L494k848j217K027j813l042
364c292L206M540k916m786J989L209k160j642L349J063m479j874M165K809k963
379B18k468J551J096j279J42J869l36k360j32K199M10j301O1Q54j192j142K015
396B05K198j949k599J583K367j516j630K057J268k595j292K873J427k648r14K153
412I88o3k140J092K478j708k709J843K336k074j768K576J143l299j004L473R85
428B149l204q22K636k9k361R46K164j460k133J657J647j564r02J888lk524N15
445a400K930m05k764M70K082o08j437J373J048j641r85J513Q40r05LL15q23k58
463f52J522N21j471n42R95j1l46Q54mj415%J288l61q47J306L31k727j99L717J85
$$ y = [-2256, -1620, 1941, -465, -2387, 2617, 5236, -839, -4758, 107, 3601, 753, -464, 1563, -250, -3292, -86, 4454, 1538, -3248, -1259, 1950, -210, -1852, 1497, 2560, -1919, -3793, 372, 3181, 218, -2250, -699, 397, -882, -740, 1129, 793, -1567, -1699, 500, 910, -391, -330, 524, -668, -1810, 205, 2403, 454, -2145, -562, 1805, 289, -1341, 716, 1984, -611, -1903, 970, 2397, -251, -1165, 988, 925, -1215, -123, 2355, 647, -2062, -219, 2117, 43, -1725, 851, 1994, -1305, -2309, 1164, 2149, -1055, -1877, 759, 730, -1631, -685, 1479, 19, -2114, -457, 1190, -374, -1276, 612, 609, -1915, -1400, 1530, 1125, -1639, -1169, 913, 305, -1132, 241, 1289, -352, -1337, 176, 1016, 111, 114, 429, -394, -652, 870, 1391, -80, -622, 373, 362, 16, 870, 866, -549, -549, 739, 378, -469, 837, 1168, -1559, -1758, 1959, 2144]
483B144l988j25L660q96l344K344L191l674l306M372K865m473j560M489m02m927
499c630K326N647l534n847M230M982m592l266N625J206o774L47P595j127p119
514c931K143N498l886l292O103K007p907j218Q210J98o978J748N595m686m654
529e050O954M229p725l425P024R91o047K452N685n595n933O733N530o466l432
544d075N937l68o267L714P155n127p108M769M766m602n38N746l177p534M846P902
560F039m810n423N372R94p251K739J0045m444j0846M961Q525o182m114R481L93
575E479j3502J341J5403j862j3783L838R960q276o898J3555N849j6364n677J5368
589D431L295j2368K174J0159q473j0455J2168J0840j2004q382R889K291r277M586
$$ y = [2144, -1844, -1969, 1691, 795, -2549, -205, 2986, -688, -3994, 378, 3243, -1230, -2790, 1699, 1297, -3630, -1304, 4343, 809, -5038, -808, 4174, -418, -3684, 1941, 3147, -3627, -3280, 4315, 3188, -3931, -1788, 3710, -176, -3468, 2635, 4642, -3265, -4483, 3727, 3925, -3053, -1305, 4290, -396, -5050, 1904, 6133, -1592, -5017, 2007, 2998, -3049, -597, 5088, -507, -6440, 293, 5823, -643, -4075, 1862, 1494, -4773, -1059, 6096, 969, -6139, -1370, 3396, -1206, -1744, 4002, 825, -6709, -1863, 6039, 1229, -4194, 1178, 2172, -5079, -2340, 7705, 3261, -7585, -2624, 5901, -281, -4395, 5086, 5479, -8023, -6682, 8721, 6859, -6924, -3086, 6874, -1402, -8300, 5255, 11104, -5260, -10937, 4431, 7726, -4642, -2468, 7691, -782, -11237, 931, 11771, -233, -8615, 1274, 3565, -5712, -1126]
603a126J0825q708j2229Q918J0147p815l805Q422l294j1403P432J3910p827j2289
617h842P271O166r035R21J3568m748j7055M912J5826m599r580P682K655j3482
631h340P64J7906q45j6838J581J0976o341m639J3727K171j9584k384J9571J088
645H813j4763M704J0083j3670r219K0600J0438k1535r555J7930L128j5050O516
658a580J6020j3727j9092J4837J8750j1988j2238J0515K547j3445M238J7836n119
671G554j7553K779J0678k758r13P461n715j2673O714J2838n228o138P079l264
685H61j3584R427K0513j0217k1598R563J5563j2973o900K1472J966l0122k184
698a8213L2317K970k7412J645K0319j1712j7487K1163J9330k3992k0365J9651
$$ y = [-1126, 9699, 991, -11238, -2320, 7827, 12, -3793, 4629, 1335, -10068, -2636, 11274, 3447, -8842, -1571, 4595, -4440, -3519, 10049, 5301, -11754, -6842, 8984, 4385, -5195, 2487, 5142, -8340, -7576, 10330, 9485, -7353, -5772, 5204, -1137, -5776, 7951, 10122, -9462, -11846, 7725, 8813, -5950, -1246, 8837, -4833, -14052, 6548, 16986, -4549, -14104, 3826, 6954, -8096, -1580, 14440, 713, -18379, -3542, 15208, 3220, -9018, 1497, 4044, -9401, -5163, 12673, 7554, -9999, -7220, 3458, 700, -213, 7248, 1533, -11140, -4426, 8412, 3184, -2954, 4125, 861, -12723, -3296, 17217, 7000, -14598, -5035, 10528, -2445, -9345, 12127, 14093, -16029, -18213, 14104, 17074, -10338, -8693, 11626, -86, -17573, 3590, 22920, -1072, -21437, -1786]
710a786J5185j4496m433J3657n162j7166Q022J8722m804j3359J359K638k581O560
724B356P481r329r631O617M503m309O007P353j4860j3672J7242J6468j4634j1313
738i721J3671R78j8331P310K6068q954k9419O842K4409p532j4432J4332P195k3597
752a1181o127K7790P837k3717n523J5192l258r771J3880J0266j9255j2622J6409
765h0R930r933l67O716j0873r493J6622J2890j4291j0596R155R93q228R819J2922
780A5186j4642j7437J2156J5007p812n606Q562m428j4327Q556J8788n871j6131
793g999K903O745n133K760J2119o271j7130M116J4682k297n805O391k772j4685
807a2376N129K0701k796j8838K043J0804p529l850J7074K869k3607o042K2190
$$ y = [-1786, 13399, -1097, -5530, 8127, 2965, -14201, -6179, 12543, 7739, -5620, -4261, -1623, -4204, 2356, 9837, 508, -9123, -2506, 1997, -2312, 3695, 11048, -3812, -17484, -242, 16226, 1592, -9721, 3950, 4928, -13403, -6093, 19975, 11021, -18398, -11556, 12853, 5321, -9111, 5221, 12416, -11181, -17308, 10482, 18319, -5398, -10921, 4271, 1013, -8758, 5122, 15388, -3867, -16489, -80, 9850, -83, -450, 6266, -4607, -14100, 2522, 15412, 1121, -9475, -320, 673, -7555, 2264, 15186, 544, -16893, -4737, 10270, 2458, -3148, 5414, 986, -13341, -4785, 14003, 8132, -7999, -5096, 1649, -3484, -724, 11395, 5124, -12006, -7890, 6792, 4495, -1310, 5081, 2309, -12376, -7247, 13454, 10658, -8180, -6137, 4667, -2862, -6712, 10362, 13231, -10376, -16418, 5772]
820E772O284j5422J94J0296j0423j1095J7044J4826j5949j5033J0473P949p222
833b306K280R700q740j4329Q018J4539l481p667J908k190n914Q146J1582p187
847D359j2068L318N509l194L730Q528q444j4726O928J5348l606q864M562O94j0948
862h874K952J7347r40j7805j662J1837m79m725P479K077j4147m411J4775O627
876A0051r526l678L568m037k270J0706N446j1590p621O871M211k347L750K603
890F137j0351o752J1027Q842o719n222L639k655n302Q811R975q993j2110N331
904d342Q308l234r42O104m260j1406M238J3636r87j0099j0L422l742R90R470r4
920G052j2041k879Q719L133k792J182m06o985j275R272M239o096m024J022q32
$$ y = [5772, 12056, -3366, -3172, 7124, -3299, -14394, 2650, 17476, 1527, -13506, -3033, 4916, -2306, -26, 9674, 934, -13395, -5377, 9162, 5681, -1986, -78, -2268, -8182, -36, 11546, 4359, -7709, -4391, 1118, -2076, 1654, 10182, 1738, -12988, -6060, 9288, 5682, -3182, 1380, 2074, -8874, -5922, 11425, 10485, -7320, -8982, 2855, 2376, -2349, 5130, 7207, -6940, -11351, 3424, 10051, 525, -3153, 415, -3622, -5892, 4814, 10260, -1330, -8951, -2080, 2131, -216, 3534, 6137, -4214, -10966, 61, 8903, 2184, -3038, 601, -2054, -7356, 1455, 11430, 2437, -9673, -4342, 3966, 732, -210, 5894, 1634, -9772, -5534, 8102, 7115, -2984, -2994, 428, -3314, -2324, 7146, 7052, -4989, -7868, 851, 3984, 1192, 2374, 1968, -5017, -6292, 2980, 7219, 1123, -2901, -1879, -2711]
935b711R91O363J171q184l858N147L086j021J735j14p014k495Q572N157n893l989
951c057K589q56k484N814N434p049q066M761O927k076k256K764k219o259L085
966b948Q935o43p675j427L425J89L04L675o15o297j781N123L249j190j447j841
982i64k532J638M881N40l562j923L80l48J944M157j306o309j113N140J911k245
998B89K64O33l917j707N804M115m598m815J985K506j025R91K461k278m804J131
1014b965N132J126k867j690L2j69J077K411K07k511j913K75K144K066k19k746
1030f10j793J340J950K08J49j39k192j828K391L657r84l492m77J714l9J51J889
1047A895k12l420j371L084K445j410j742o9m7j47J338J493j002k387m15J662J382
$$ y = [-2711, -1720, 4643, 5814, -2370, -6228, -1081, 2005, 984, 2719, 2605, -4409, -6904, 1668, 6825, 932, -3057, -468, -1324, -3808, 2006, 7440, 391, -7675, -2914, 4013, 1937, -319, 2445, 226, -6033, -2948, 5987, 5344, -2331, -3758, -333, -144, 160, 3835, 3220, -3077, -4858, 265, 3514, 2324, 877, -964, -3496, -1858, 3023, 3563, 1, -1922, -1542, -1890, 54, 4211, 2905, -3404, -4517, 623, 2534, 289, 553, 1186, -2731, -4438, 1366, 5481, 883, -3932, -1947, 559, -466, 525, 2986, 708, -4096, -2965, 2167, 3293, 426, -1264, -1232, -1401, -324, 2087, 2294, -217, -2130, -1855, 289, 2355, 2136, -610, -2403, -1063, 887, 1095, 1244, 1105, -1087, -2915, -524, 3133, 2149, -1343, -1820, -106, -145, 6, 1895, 1683, -1737, -3108, -24, 2421, 1011, -731, -800, -847, -994, 344, 1837, 835, -1552, -1967, -305, 1077]
1064A077J10r36j136m18Q34R80M90l12j116j049N94J902O87j454j148L22L94J48
1082c1Q20M90j291j446P07J803K09j089n51j6K1L34Q21K39r95r71J62J231N44
1101I91o74p45j53L23J24L03N01l71j240k15J435O17r90n97O49m4p00O75J166
1120A055p41j583M30J521j99r33M68L86r31k54J273N17j246m92Q24K05n04M03
1138A99N47p90o94P43N73m77k71M04k69l63O14M40n90l86M38Km81L48O07o08o84
1159f98O85M64o74j57P78k57r72M65J068n88r25Q49M48j094q3J316j28j416L52
1178e67J324o96j017J157P76j573m49J732J66j600J93J625q14j380J217J335j602
1195a73q82J700L05j691K81J807q29j774J112J576j525r61J757L39k020J52K192
$$ y = [1077, 1187, 251, -885, -1303, -469, 511, 1001, 689, -427, -1476, -882, 1020, 1707, 253, -895, -573, -179, -31, 789, 1279, -12, -1458, -751, 1052, 1261, 172, -379, -395, -374, -40, 781, 1020, 25, -946, -784, 447, 991, 317, -428, -581, -258, -134, 169, 670, 299, -941, -1156, 279, 896, -94, -691, -42, -86, -786, -111, 1055, 314, -1269, -839, 682, 483, -450, 18, 404, -527, -781, 492, 1009, -237, -729, 95, 300, -204, 199, 746, -44, -738, 5, 578, 101, -170, 234, -35, -398, 216, 656, 66, -320, 118, 120, -361, -13, 594, -14, -698, -13, 451, -223, -380, 398, 141, -831, -366, 702, 114, -811, 38, 486, -608, -691, 625, 497, -919, -567, 757, 61, -956, 201, 977, -596, -1045, 687, 853, -747, -554, 1071, 257, -1123, 94, 1429, -173, -1055, 645, 950, -741, -460, 1347, 518, -1256, -144, 1432, -93, -1054, 703, 1042, -978, -826, 1366]
1212A366o32k068J028J558j533j005K023M04k283l0K469o19k126J151J679j852
1228d70j204K365P69k623k11K588n17k229J320J879k060j538K599J060k724k66
1244a262K639o06k438J416K372k145j979K489J342k688l67K766o36k717J418K604
1260B208k033j988K242J148k726O6K866r50k896J505K502k019j657K607M55l110
1276a780M45L460j217l330J903K643k763j607L594P05m292M0M512q11m131J920
1292g09L401l089k629M116K090m780j269M651K62m170J112L821k452l517L357
1307A95L035l580j948L295N06l197R51L271k015k940K356K047k445n94K661j041
1323E57k970K150L075k855k181L013P96l666R31M199k044m594K716M053l319k601
$$ y = [1366, 734, -1334, -306, 1252, -281, -1286, 737, 1141, -1142, -1172, 1297, 678, -1448, -297, 1382, -470, -1674, 691, 1460, -1163, -1374, 1214, 697, -1532, -212, 1667, -393, -1931, 668, 1728, -996, -1262, 1377, 771, -1667, -251, 2121, -24, -2003, 486, 1828, -860, -1227, 1539, 903, -1814, -396, 2208, 175, -1813, 429, 1577, -1149, -1083, 1783, 833, -2063, -558, 1944, -75, -1732, 875, 1330, -1780, -1335, 2125, 908, -2422, -519, 2124, -639, -2246, 1348, 2053, -2239, -2199, 2313, 1502, -2629, -709, 2692, -397, -3026, 1090, 3180, -1600, -2869, 1782, 2044, -2126, -1014, 2807, 355, -3162, 195, 3230, -350, -2298, 997, 1503, -1694, -743, 2528, 513, -2427, -71, 1976, -469, -1063, 1598, 557, -2413, -263, 2812, -43, -2224, 789, 1585, -2081, -1150, 3049, 1005, -3589, -873, 3180, -139, -2740]
1339b740M123R85n298J91O087q07n888J584M630k761l207M412K291n584j799N629
1355A848J100m648M06L695k484l117L943K929m275k283L814O32l161J526L098
1370C023l265l295L734K885l390j260L159j158l437K787M104l420l883L276K286
1385B146l427O0M274j824n314K484N204k621l553L077J299m437L02N913r42o130
1401c489J141M800k129k670M014J385n978r50O486Q61n499L27L943k679k911M900
1417A552K940n675k838M834J648l664P97L299l187l734M063L799l438k447K567
1432E16j44k570K439L378l377l635K973K187k447L65K964k685m248L652M649l216
1448H01l607L294R51m340J379N959k199o762J962N741k161l416L729J491n904
$$ y = [-2740, 1383, 2368, -2930, -2739, 3348, 2541, -3347, -1763, 2867, 106, -3101, 1311, 3602, -1982, -3781, 1848, 2948, -1700, -1294, 2401, -83, -3200, 743, 3672, -603, -2886, 928, 1560, -1601, -75, 3023, -242, -3537, 197, 3082, -308, -1568, 1591, 433, -3004, -217, 3887, 467, -3416, -140, 2146, -1281, -1221, 3053, 1229, -4085, -1601, 3603, 982, -2571, 506, 1805, -2632, -2330, 3583, 2641, -3489, -2348, 2452, 323, -2347, 1667, 3052, -2926, -3876, 2610, 3471, -2028, -1701, 2242, -437, -3348, 1552, 4492, -1183, -4021, 813, 2461, -1203, -406, 2893, -294, -4028, 35, 3834, 396, -2051, 516, 372, -2198, 241, 3619, 242, -3393, -420, 1767, -680, -315, 2649, -36, -4284, -632, 4017, 801, -2806, 488, 1439, -2901, -1522, 4437, 2238, -4524, -2562, 3179, 1018, -2398, 1331, 2822, -3082]
1463c082r95P049J312o190q70M224j054k722L605K569n023k903M383K503k818
1478a2k52J681k405k052L917K800l529k287K182K5j639K876K336m313l386L836
1494b22K917k686n92K544k194l834L557N015l163m538K338K137k631M53M321j709
1510A713n594J220N079n16l010J467N69l598N32N132rm715l83K735q97n65L208
1527B368J68n209q46M991J239l203K74J565l039j517N054K559m870k916L333J193
1543A144k130J618K572l600l883L367M323j992k685J281j30k085J788L717j691
1558A614m066M29K390k1K23J243j706l144J340L589k08j828J30o61j839J995L704
1575C184j336l993K66K316o13q9K560q42m413R7M795P75l223k22J388k034p16
$$ y = [-3082, -4077, 2972, 4284, -1906, -2776, 1448, 394, -2328, 1277, 3846, -1177, -4080, 303, 2806, -12, -264, 1417, -988, -3040, 877, 3677, 148, -2139, 43, 68, -1571, 1305, 3641, -672, -4058, -222, 2695, 9, -583, 1961, -233, -4067, -510, 4505, 1342, -3196, -858, 1279, -1352, -899, 3422, 1713, -3881, -2661, 2418, 1902, -1108, 359, 928, -2670, -2138, 2994, 2985, -1730, -2113, 622, -275, -840, 2368, 2536, -2673, -3519, 1472, 2711, -492, -218, 1347, -1692, -3209, 1845, 4404, -466, -3382, -49, 1144, -986, 632, 3204, -396, -4279, -912, 3411, 1419, -1266, 15, -115, -2200, -412, 3305, 1614, -2452, -2023, 367, 346, 569, 1812, 106, -3038, -1698, 1891, 1683, -145, -15, -676, -2515, -520, 3184, 1848, -2145, -1879, 437, -176, -265, 2295, 1453, -2960, -2863, 1932, 2707, -516, -738, 650, -1384, -2100]
1592b100M101J660m488k499L105J723j494N21J468k757k586L004L478j706k600
1607a170M92L35r11J649K353j773l435N69K542L38k95K92j330k141J271L051K5
1624A862k185o01J7l01J408K109j125l018o7K035O78j54N23j040k476O60L346
1641A671N62k285q71M60n13N24K387J64l123j356K125J448n79J05n5j955r10K651
1659D50J999j621j946J92N30q4J284J140j885k263R27K225J97p38j53r42j136
1676a824J369K231l44k119o62O56M99P49Q80q89k023j95J853R90m33n25p85q10
1694a382O91J924K86j506j086K29O01O77R29n79j868l51J403J014j88m57o08r25
1712a196J99J850Q24j365j347K13N43M03Q14R5j388j269J015J520M2q13m04m81
$$ y = [-2100, 2001, 3661, -827, -3326, -221, 1502, 8, 529, 1997, -760, -3346, -342, 3136, 1430, -1170, -678, -343, -1254, 395, 2748, 975, -2460, -1891, 651, 989, 694, 986, -344, -2485, -1214, 1837, 1862, -323, -924, -907, -1208, 200, 2309, 1184, -1834, -1901, 134, 812, 658, 1181, 141, -2335, -1675, 1671, 2233, -52, -923, -463, -976, -452, 1935, 2099, -1024, -2380, -255, 1193, 614, 719, 664, -1291, -2201, 450, 2449, 828, -1118, -926, -396, -480, 804, 1944, 59, -2204, -1277, 948, 1145, 407, 254, -688, -1824, -455, 1776, 1432, -687, -1349, -693, -194, 555, 1435, 546, -1477, -1672, 181, 1171, 738, 213, -572, -1382, -691, 1233, 1519, 13, -1073, -844, -243, 434, 1363, 784, -1084, -1435, -32, 982, 794, 337, -271, -1196, -997, 853, 1677, 312, -1035, -822, -279, 124, 938, 1033, -355, -1624, -609, 911, 953, 140, -264, -745]
1730g45k60J067J170n19j452m26P71O46M47Q6q92j001K63J170O40m44o79o43m8
1749h49Q67R82j68j123n13K66N21O45L53p79j173J97J047N87l51l94m42m73N25
1768b75J078K48j089o79K04N45L74J57r0r94m02O92R18j02n72l77k17J83Q04L19
1788G25m69q21r5M92M15K57k18o42m26M77O24J78k97l25n08J21P84M41n19n37
1808c43o0O0L12M62J47o85o02M08P40q1k47Kl48k90M65P80l11p68p5M36J3K8L96
1831D39j52q13n2Q18L15n56j24R8k93o0P19K36p65l93L86K53j06K52R9n05l65
1852e69N06M12k08k59J9j00r3M73K65m53l67L89J24l32L34L39n86m35N52N29n02
1873C8k73N16j55o27L44Q82m18q71L95O48n45k78P07N8r19J8Q98K2p84J84O00
$$ y = [-745, -1005, 62, 1232, 713, -739, -1165, -394, 252, 699, 785, -107, -1108, -845, 325, 965, 521, -158, -801, -849, 18, 1000, 832, -291, -804, -538, -17, 628, 981, 202, -971, -774, 273, 860, 509, 115, -327, -800, -275, 803, 1051, -38, -717, -513, 32, 406, 563, 473, -521, -923, -231, 687, 585, 13, -364, -581, -398, 406, 725, 256, -565, -660, -168, 247, 504, 286, -356, -782, -305, 319, 497, 200, -125, -633, -512, 272, 713, 194, -343, -403, -343, -31, 431, 578, -107, -709, -301, 439, 358, 111, 113, -235, -525, -60, 720, 409, -359, -434, 2, 15, 43, 439, 287, -526, -578, 240, 555, -1, -125, -27, -320, -380, 339, 575, -190, -583, -197, 56, -50, 202, 301, -204, -569, -63, 349, 141, -118, -99, -199, -292, 181, 446, -7, -374, 15, 139, -193, 141, 480, -106, -541, 11, 540, 38, -235, 281, 126, -501, -157, 725, 307, -564, -169, 479, -66, -344, 363, 421, -498, -480, 418, 440, -344, -160, 440]
1894D40n49m33P38L30q17j76P28j51m93M16L98o44l66P94J99q18J37O57l55o79
1914f44O54N88p03m13P73J05q31J96R74m36r03N56P53p48n01R86J17j060L8J162
1934F63k44j007N16P39p09n64R31L26j008k18J096k15q62N05O62q00n30J005K69
1953E55r55l2R10l34q55O37Q88r94n87J039K74j133K35J041n05j101P59J054j003
1972a07o85J126L49j313J47J299l78j314P02J142j024p28J258L29j361j49J493
1989G86j45j402N43J078q33q26J216M50j349l45J429p4j173M23J020r62p13J206
2007C29M99j263j97J182j96j176P05J020j026q29J270M51j294M2J225m92j239
2024i89R16J195j144r14J255M03j292JJ560n43j475P28J434j050r85J278M40j489
$$ y = [440, -109, -542, 196, 526, -291, -467, 261, 110, -383, 33, 431, -213, -579, 215, 414, -404, -267, 390, 35, -644, 10, 598, -105, -518, 255, 360, -471, -275, 699, 263, -640, -84, 669, -79, -580, 406, 523, -537, -499, 663, 419, -588, -72, 667, -42, -606, 325, 651, -357, -575, 521, 306, -556, -51, 611, -189, -719, 286, 555, -400, -432, 478, 144, -711, -74, 814, -180, -767, 272, 546, -587, -352, 689, 184, -917, -158, 896, -107, -792, 334, 683, -630, -483, 816, 438, -876, -174, 968, -56, -784, 474, 803, -558, -707, 786, 641, -761, -218, 860, 27, -799, 417, 867, -482, -827, 602, 528, -645, -222, 798, -164, -877, 329, 828, -435, -632, 550, 354, -822, -117, 903, -123, -952, 318, 769, -525, -483, 742, 250, -989, -73, 1122, -22, -936, 319, 722, -570, -569, 991, 448, -1027, -299, 1135, 85, -900, 378, 818, -671]
2042f71l9J683k27j726O11J351r87q85J302N56j625k46J720o2j531M29J193r78
2060a32p63J345N17j572k49J489j18j268O05J002j072q84J368P23j413l44J325
2077E59k00j267P98J172j117j081J305O51j250j25J327m48j404Q78J432j137j134
2094a041J246N70j329PJ583m80j665O00J653r20j054J081O12j539j30J836j80
2111H50j683K56J330o17q47J110N00j613k93J598K22j337K54Q25p52o65J273O03
2129A014j503m07J286j1r59O64P91j229q53J536O60j295k76J224m89j227J101
2146B7J449j416j324J261Q89j194j32J317l46j742O74J779p04j342O27P58r51
2163c70k02J432j19j523O1J237j15p03O08J49j269Q7J419J09j266N9O76o12k41
$$ y = [-671, -710, 973, 746, -980, -369, 982, -5, -890, 412, 968, -657, -903, 817, 755, -776, -347, 846, -132, -895, 450, 967, -605, -854, 635, 517, -751, -146, 856, -216, -1100, 268, 991, -422, -766, 559, 359, -908, -110, 1062, -55, -1136, 169, 820, -430, -555, 772, 324, -1080, -202, 1230, 93, -1041, 205, 775, -554, -547, 1036, 556, -1109, -509, 1144, 224, -830, 251, 863, -676, -806, 1030, 850, -833, -577, 753, 136, -711, 399, 899, -714, -1007, 591, 813, -524, -270, 555, -197, -862, 411, 1014, -489, -896, 390, 379, -580, 84, 875, -354, -1207, 329, 989, -306, -582, 642, 153, -1074, 27, 1476, 60, -1264, -3, 886, -308, -440, 877, 531, -1211, -537, 1242, 538, -804, -177, 581, -370, -572, 860, 741, -782, -721, 516, 401, -302, 306, 455, -814, -727, 692, 801, -465, -406, 270, -342, -583]
2182e83J305J91j630l53J487J41j024N16P19j226q52J609R84j351q52J067R1p91
2200e52N54J098r72j357Q44J174m57n29N47l63q33P23J196n65j007K69L62m69
2218c37M12R76p64j369N94J197l69o05O80r6j363L30J899j98j700p7J154l59n17
2237e12J032M22j543p63J544Q00r15m10M76m53m70J008Q47q72j069L69O02L9K17
2256C49K32q65o06P60P52l18k71J29n29m25J013R70r19j061M14N39k76K33P05
2275H26n98j295L84J459Lr21q6K37m81R8J183P5j292m27P10M06j45K66j96r79
2295g73rJ080L93n69k86N5n19J37J178K94j326n92Q20M19k87K85L38r76q37J126
2315d9J222o30j038J16L75l46L54R01m16j155j93R92O14k97l01l64l34L20P37
$$ y = [-583, 722, 913, -717, -1070, 417, 558, -466, 50, 769, -457, -1309, 300, 1284, -67, -919, 148, 239, -552, 2, 1100, 128, -1229, -385, 789, 332, -197, 350, -13, -846, -123, 1073, 508, -499, -230, 132, -337, 75, 1051, 287, -1082, -488, 709, 340, -265, 415, 319, -1044, -714, 1185, 987, -713, -790, 364, 5, -512, 520, 942, -601, -1364, 180, 980, 65, -345, 131, -322, -792, 216, 1063, 191, -878, -509, 93, 132, 349, 581, -284, -890, -130, 622, 304, 33, 162, -367, -792, 221, 1191, 272, -789, -375, 164, -112, 121, 826, 228, -1067, -683, 776, 779, -142, -228, 9, -472, -374, 809, 884, -408, -835, -125, 281, 136, 402, 206, -773, -782, 298, 691, 122, -164, -109, -628, -491, 687, 981, -345, -937, -117, 302, 15, 300, 638, -338, -1175, -49, 1173, 543, -495, -379, -4, -350, 4, 905, 489, -666, -859, 133, 747, 450, 149, -215, -549, -229, 508]
2334E08J75m81n15k69K15P46M76o53q32J43N39Q2J74K40m94j049K83J386K12j032
2354a46m04M15n5j37Q52L64j152p96O81J030k26l77n1l29k13M47Q17j71q31l04
2374e86K91M22L93%n69o14K61O16J99k0k43o47j76P45P39l08q26j01K11P7L37
2395B01M63m22q67n7Q26N04l52l86j71j98J68O59K49n36o15J3M11L97K13l46o03
2416d49m8L88M46J17j83m91m37K39R03J97p15l82J21K23J12L65J78p88n99N09
2436b94Q12J14n61k39p0RK25O43j09p35l34L47M90J46j71l73l44J01M50L32q7
2457C52m60l46K5N05M58k00n54p9P2K07K72K17l66n95J7O30K93l33k27j1k00L6
2479b87N78L02n75n25K02M51J58l4j32l23k30K96N00M3l19l77l4J65M53Q2l30
$$ y = [508, 683, 202, -313, -582, -367, 379, 855, 202, -630, -487, 52, 134, 308, 548, 54, -995, -712, 674, 886, -146, -550, -135, -190, -327, 525, 889, -263, -1059, -378, 652, 426, 49, -2, -331, -544, -97, 720, 549, -282, -586, -295, 127, 520, 520, -49, -663, -402, 214, 413, 393, 150, -497, -673, 72, 811, 503, -323, -424, -213, -136, 201, 664, 242, -625, -682, 144, 648, 296, -90, -261, -459, -291, 368, 617, 81, -534, -521, -110, 287, 500, 154, -449, -497, -109, 337, 454, 271, -220, -657, -418, 485, 682, -33, -415, -294, -71, 41, 406, 584, -204, -803, -294, 518, 632, 71, -168, -238, -229, -4, 639, 530, -205, -539, -192, 298, 444, 273, -100, -444, -343, 107, 439, 352, -108, -454, -429, 76, 534, 334, -220, -299, -227, -20, 252, 469, 103, -492, -475, 155, 448, 115, -112, -123, -323, -287, 291, 593, 18, -507, -305, 146, 304, 270, 138, -185, -415, -119, 381, 424, 105, -272, -306, -141, 312, 394, 64]
2500F4k27o1J67J57L30j23n93j73M34L19n8j90n4k42p5L94M16k40n90J1L77P9
2522A22n8K04k58l59N1M80J99l08k19qJR1K73R3l97k30J67K29J32Q2k95k45N0
2545b03L20J01j59j2j38j40Q5N01m2m11j33J84J73j07J94J8m12k16M19L43k73
2566I2j79J13q1j56K93L01l86l03J45K91j06l0J46j62k24R6L77p4k47mK0q7J19
2589d6K87j61l15J80J32m0l5J48q0l15L8N06r6l01O0J60k39K3L85k0m22j13M14
2612A50j0k08J34J85l69k19L93K55l33p6J46l5j76J92K71l20j85J74J90k06l6
2633h3K69j38l48K60K95k70j57K73Ql17R7M36k12m20K73K96k95j91L93R9m91O4
2655a59L97r1l47J24L70k87k14L40J37l71j00L98p2k45Q9L23l11k14L25J49k95
$$ y = [64, -163, -224, -57, 100, 430, 307, -286, -459, -25, 294, 236, 46, -8, -250, -325, 69, 485, 245, -345, -334, 43, 122, 64, 268, 10, -349, -298, 182, 381, 73, -146, -154, -153, -62, 211, 304, -93, -323, -156, 73, 205, 287, -8, -253, -203, 117, 218, 59, 47, -91, -231, -146, 355, 313, -98, -231, -47, 126, 19, 213, 231, -181, -397, 22, 365, 92, -87, 26, -55, -211, 82, 383, -3, -306, -161, 130, 24, -6, 140, -22, -246, -150, 227, 153, -94, -98, -78, -165, -46, 241, 80, -235, -55, 77, 37, 2, 150, 70, -245, -207, 299, 203, -98, -38, 122, -117, -94, 291, 271, -151, -264, 150, 140, -68, 66, 251, -118, -337, 56, 311, -22, -98, 48, 13, -163, 29, 300, -20, -205, -31, 159, -47, -83, 186, 48, -300, -40, 255, -15, -172, 101, 109, -208, -111, 325, 113, -307, -34, 262, -33, -224, 169, 268, -223, -159, 238, 147, -200, -76, 294, 7, -207, 133, 270, -101, -201, 197, 125, -120, -31, 292, -19, -233, 92, 241, -54]
2676e4j05K66Kl62K30K99k95k30L97j1l29J04L16j88l03K24L66l07k99M48M4n57
2698c44J10N09j23m17K03L65l85j77M06K05n93K9L93J05m99J27L30k34l09L77
2718G8L25m87j20L29M0l15J31L40k60l00K77J60k43k7L38k38k71K16L14k75k09
2739a97K50R8k99PM07k09l80K27M13l28k29L90J04n21M5N28j34n58K96L86l16
2760b0k34L32L40o10j70N50M0m26J69L41l04l46L80K50l39j90M10L3l58J11K80
2781B39k71k86K56K55k34j18K45l6k29J74K95l03k19K88J22l57K7L79j69m25K70
2802i7M08k69l11L19J30l80K4L62%m57R7M42k56k64L45J36m06r4M79N0m83R9L40
2825B14k11k51L16K29m49j17M35Q6l88O8L09k45k88L14L38m38j68L92j2l22J59
$$ y = [-54, -159, 107, 109, -253, -23, 276, -19, -249, 148, 137, -192, -88, 228, 40, -263, -39, 327, 20, -279, 169, 213, -344, -234, 275, 152, -265, -62, 303, -82, -259, 147, 352, -241, -212, 181, 286, -213, -86, 244, 10, -299, 78, 403, -84, -204, 125, 165, -150, -19, 321, 61, -239, 38, 198, -45, -72, 266, 28, -243, -27, 287, 12, -197, 53, 151, -148, -141, 266, 57, -323, -96, 317, -11, -240, 150, 254, -267, -222, 306, 172, -386, -90, 296, -20, -254, 78, 418, -192, -362, 188, 228, -198, -29, 312, 8, -338, 42, 292, -47, -237, 173, 206, -152, -41, 239, -32, -318, -62, 193, -41, -159, 86, 50, -179, -5, 290, -13, -232, 56, 178, -179, -152, 227, 58, -367, -97, 311, 42, -269, 50, 180, -200, -176, 186, 186, -271, -174, 268, 12, -252, 93, 229, -177, -271, 208, 258, -225, -126, 214, 3, -248, 68, 297, -152, -269, 166, 252, -136, -68, 241, -4, -292, 22, 360, -78, -246, 146, 134, -188, -29]
2846b9L25k90l51L43K21k52j38K39J4l27J80L43k84k88K52J50j88m7L40k02l08
2867b97J29M01k10j87K04J24l42L3N09j78m40Q7L92j72j91J91K19m23j29M31J87
2888C38m01q9K49k1k14J93K34l60k07K58J45r0LJ09k84o9K57J98k28j76K24o2
2910Gj66K79J71l59k72K87K23k65l8K63k0m13J69N33l06l48J15K46j43p3L40k8
2932B02m55mL64J03k34j0J16k50K6K98J07l24j23J30R5r1K41j0m14n1K96J75j94
2955glM6j70r0L70K28l68l45K83K09k46P0J77k42k43K17L55j12k21%Kn8J32K79
2979B63j56k39p8K78j02O2J70k11l19K39L02k9k41J5N9k53J48M17r8m28r1L66
3001G4R3j44J17L8l46j00K91L63l13j90N2Ql0K60R1k96j86P3J96J2N8n4k45p7
$$ y = [-29, 296, 6, -345, -2, 219, -33, -171, 68, 82, -245, -65, 278, -6, -294, -42, 108, -80, -127, 213, 11, -297, -168, 233, 23, -164, 40, 164, -178, -145, 364, 186, -254, -167, 225, 53, -138, 53, 272, -151, -280, 151, 338, -63, -152, 97, 76, -138, 55, 289, -71, -278, -20, 125, 35, 38, 147, -137, -206, 51, 249, 21, -155, 69, 7, -159, 120, 291, -68, -340, -53, 170, -95, -133, 130, 110, -303, -134, 399, 93, -255, -140, 106, -37, -110, 230, 202, -253, -257, 107, 210, -24, -34, 82, -168, -142, 156, 263, -61, -184, -54, 41, -50, 191, 181, -233, -284, 12, 187, -7, -10, 36, -134, -224, 146, 374, 6, -339, -56, 153, -93, -23, 154, -88, -331, -114, 241, 129, -92, -92, -90, -148, -16, 263, 107, -132, -210, 68, -34, 28, 198, -13, -332, -93, 209, 180, -61, -46, 13, -240, -92, 325, 227, -201, -292, 74, 167, 23, 140, 178, -168, -268, 23, 386, 73, -117, -65, -57, -87, 173, 264, -32, -218, -145, 51, 63, 121, 67, -178, -255]
3025b55K48K70j38k08j3j05J04K12K02k91l63J00L00L4o6J9q7k55J39L79K1k86
3047c9j38M8O6J40J39o2l18q0K15J08R0n5j67j59J17K90M0k13r9k0j0J03K59j5
3071B40l92j84K97K21q9k4n9j58j27K85L80j85l96mK00pO0J06q9l20K5L10J42
3094B32j20j43j38n2J93K36n2k33p4L3P6K03N8j77l18L8L44N7m0j00r5j19J33
3117e8K72Q2l50j97J33R9J97j3j5k44j32K19K06Nj87j14j08J52K28J6j75j88k2
3140a94N6K43J03l6l40j47K93K24j35m3j12j48P3J86K23j50l55M5K03J9J03N5
3162A66j48k86R2L04J94k54j99Qj5J20K35l8j92j53O2J32K08qk28k47J58K01M4
3185A56j7o3k25OJ62J83j6k63q9J00K9L1J93p3k75r6K66J58m2k06Om0J6J72J60
$$ y = [-255, -7, 263, 125, -83, -96, -201, -97, 115, 317, 26, -337, -237, 63, 97, 31, 50, -37, -292, -153, 226, 247, -39, -177, -129, -63, 77, 216, 154, -164, -244, -29, 79, 169, 114, -53, -212, -95, 195, 235, 22, -77, -97, -107, -4, 255, 240, -152, -336, -39, 182, 93, 69, 10, -148, -275, 10, 390, 205, -191, -195, 5, -2, 58, 164, 75, -245, -220, 90, 232, 112, -31, -169, -221, -28, 208, 156, -77, -151, -118, -42, 161, 219, 42, -276, -238, 106, 163, 123, 23, -72, -191, -58, 214, 296, -54, -251, -118, -19, 178, 165, 150, -94, -226, -7, 199, 204, 17, -97, -205, -53, 175, 191, 16, -172, -194, -138, 105, 208, 172, -168, -315, -22, 202, 67, 24, -88, -236, -163, 23, 246, 96, -259, -214, -11, 8, 111, 166, 18, -268, -176, 128, 322, 68, -131, -123, -138, -18, 217, 179, -13, -166, -104, 28, 236, 228, 0, -247, -89, 112, 156, 139, 76, -149, -143, 19, 202, 186, -77, -166, -66, -37, -6, 187, 114, -161, -257, 9, 167, 125, -81, -75, -115, -99, 73, 233]
3210B33j75k66N8J76O7%L0k18q2K5L31L2j76j35QN6J55L5j09j17q6J55L2R9rk10
3236i1q4J50J43nj06l0n6p1J82J94m8l35K6O8J17J3Qo4j12q5K13J36j80o2j3K9
3262f3J6J27N6j55j39J28K6J16n4n8o5r3J17J58o0m1o6j9K0J33N5j62j09L7J17
3287B2O7n1Q2j36o8P4J94j2k92L9L8K9M8J50o6k13p0J69M8K4j4j18n0j5J70J04
3313A53j67r5O6l8M5M2J26j67j52K00J4rN1l0r1r1J51J11J0k65J09l4K2L9N5j16
3339f1l3N3J07qj14J12j20p1J05Q4Nr6L4L9j86J32J02L4k00j1J81q2p0J51k5j69
3365a07K9J30k7q9l7J24Kj21J71j6j03o9J77p0KJ1O4q2p5J42L0j50K2RJ0n7J65
3392H5O5j31j38J69M9j45n8J77j06o3Q7J71j02j20M7J35j89J9K28m3j97lJ11J5
$$ y = [233, 58, -208, -150, 26, 93, 93, 123, -95, -177, -152, 179, 211, 35, -100, -92, -36, 119, 154, 45, -72, -158, -3, 29, 128, 119, -91, -175, -25, 118, 113, 7, -23, -79, -150, 32, 226, 178, -157, -131, -63, 54, 67, 75, 11, -101, -186, 27, 163, -17, -79, -92, -63, -47, 80, 136, -19, -158, -30, -4, 112, 58, 0, -65, -158, -41, 117, 57, 16, -50, -69, -49, 84, 139, -23, -132, -95, 22, 89, 38, 120, -16, -84, -10, 184, 172, -120, -81, -43, -14, 34, 184, 118, -95, -165, 4, 52, 76, 62, -56, -106, -121, 49, 153, -14, -109, -43, -81, -36, 6, 132, -35, -187, 13, 27, 18, 69, 39, -52, -143, 8, 119, 129, -136, -27, -61, -39, 0, 55, -61, -94, -41, 66, 58, -56, 56, -64, -135, -30, 54, 59, -37, -3, 36, -150, -18, 84, 118, -82, -93, 88, 6, -64, 87, 62, -107, -78, 52, 25, -64, -101, 23, 25, -96, 75, 59, -44, -113, 64, -6, -4, 7, 71, -11, -86, 56, 86, -64, -42, -33, -23, -80, 85, 150, 19, -119, 50, 99, -46, -104, 73, -33, -96, -9, 162, 60, -60, -13, 122, -67, -48, 180, 137, -60, -63, 48, 63]
3416F3j10L5J03j34n6J81J7j35%K4M3o4R3N1j02p9M2J17j52N4J19j13j00J16P1
3441H4m8j10J36l9j38J51J01j36k40J94J09p7o9J98n2j73J0J78m0j26R9Q8j59
3464e9l1J43O5j16j06J39Pq0RR8p1n6J03R9k05N4R8j42m2J26K4l0j25K06m4o9
3490eJ1O2j33j30K15J13j47j22J86p3p7Q5J03j22j32J85L4r6K0J23K0k31MK31
3514A24lk32Q4P5m2o5J01L5j09k0Q7N6q9K4O8j58n1J48N0j17J0N2m4l6J21K1k00
3541a10%J76k3j15R6P8n9j65J69R0j45r6K19n9j56R8J39j27j73J61J51j29j04
3564h4J61J4j41k7J72J1k23K2J63j03r8J85Jj36l1J58rp3mR5r1m4J28j4q9m6J43
3591D0k6l9K7M2r1mJ10k2j52R5J01j48l0J36J03j88o4K26m7j90J14R3k7k23J61
$$ y = [63, -47, -12, 91, -43, -99, 82, 99, -36, -36, -12, 31, -33, 60, 111, 9, -70, -28, 89, -63, -9, 110, -3, -103, 13, 84, 36, -74, 62, 23, -115, 36, 137, 1, -239, -45, 64, -13, -82, 116, 64, -109, -99, 79, 39, -87, 12, 100, -59, -90, 53, 118, 2, -104, 35, 42, -38, -29, 69, -2, -58, 45, 144, -61, -7, 91, -51, -93, 33, 57, 27, -98, 108, 64, -5, 6, 68, -65, -195, 20, 133, -14, -136, 50, -23, -100, -15, 88, -34, -166, 19, 53, -43, -23, 100, 120, -111, -107, 124, 121, -111, -27, 48, 6, -59, 42, 77, -32, -52, 35, 91, 2, 26, 94, -64, -115, 33, 83, -34, -24, 28, -16, -52, 69, 90, -110, -110, 66, 43, -72, 24, 102, 43, -122, 47, 137, -8, -104, 115, 56, -100, -2, 137, 10, -163, -2, 149, 20, -84, 77, 91, -50, -77, 95, 106, -117, -95, 68, -35, -133, 52, 53, -83, -114, 44, 35, -38, -42, 53, -38, -82, 46, 32, -57, -103, 40, 14, -25, 2, 44, -47, -51, 59, 37, -115, -20, 81, -67, -97, 39, 142, -46, -110, 116, 69, -121, -7, 86, 59, -164, -3]
3616cJ22r2j17J47Qj25L7J39j6j78N9R2J1k02J87K4j95M0J93p6j31J5J19j02l2
3641g6J31Mj28m5J65O6j08k8L1m3K0L4N1j32k0N0k3QJ36l4j27r9J69K3n0J06L1
3668A12k05m6K10L9m2k55J87J22j72O4J05j10j88J35J95j22n5N2P9j26l2J71j7
3691A01j54p0J08L0K2m8M5l4r5R3K8j7oK0j95J23J48j3j55qP6j0o3J28K1k21j
3718a47J63J39j94j8P7p3k9J41O5j17j25Q5J55m8q7M1q0o3J53Q0Qj66L4K1l4j5
3744c4K08j33r8L1R4o7K4Kj6r3N9J59l7j60m1J05K6q9J37K3j51q5P4J15Q2j46
3770a1n6k6P6OJ00j6j40oM0L3J11q3j52N7M1O4k0L2L2k52R0K16rr0j26J21j9K4
3798C7JM8r2j35N2K34l5q4l0n3%j9J25M9j13j63J11Q1N2m7p7K7o9N5O8PJ1j47
$$ y = [-3, 119, 27, -90, 57, 65, -60, -23, 116, 100, -78, -19, 73, 84, -118, 69, 93, -102, -62, 131, 55, -76, -61, 58, -44, -76, 55, 59, -69, -114, 51, 117, 9, -19, 12, -31, -11, 23, 74, -58, -78, -28, -51, -43, 93, 59, -68, -167, 2, 25, -25, 81, 112, -93, -139, 71, 110, 68, -187, 0, 122, -50, 14, 119, 9, -179, -44, 151, 29, -26, 26, 105, -21, -53, 118, 101, -53, -123, -15, 15, 37, -11, 34, 0, -95, -2, 26, 9, 3, 23, -172, -49, 99, 86, -69, -77, -1, -11, -74, 54, 75, -146, -147, 16, 155, -39, -57, 20, -53, -82, 59, 124, 7, -118, -33, 122, 74, -13, 28, -52, -115, 38, 118, 126, -40, -6, 15, -19, -34, 174, 41, -57, -26, 68, 1, 25, 27, 11, -82, -23, 136, 99, -61, -102, 3, 29, -60, 77, 100, -51, -136, -62, 53, 135, -11, -67, -93, -17, -11, 89, 73, -67, -73, -33, 0, 111, 28, -124, -67, -26, 38, 18, 50, 82, -170, -80, 136, 127, 37, -89, 32, 13, 37, 38, 86, -6, -141, -89, 145, 110, 26, -4, -57, -57, -76, 49, 98, -15, -178, -67, 14, 66, 19, -58, -31, -100, -45, 23, 30, 41, -106]
3826a06m8J93R7j33l2j1M9n2Q6Q5j26p4k6J31J15j27j02L2j1M1O2J44j62j14O6
3851b3j2R0m6l1J3r7P3J57%j61K3Oo2J11P6r7q9LL4JN2j4l6n6n3J89L9j12l7j8
3881g7M3N9J3K3j19l8L2J09l9L5n4p4P3M6K7j8Or6l9R6J21q1o6m4P1K9j1O5n7
3910C5j16qJ26J40q9j55L3N4p2O4L8qj73J6J63M6r2p2R0q5J5O1J52j40j38R9J0
3937fK3Rl8k6N9l5OJ31n8j77l7J99O2j21J5o9L2o3J11J06n9j47l2J40L3n2QM0
3965E4j35kQ0J64o6k28O7L1J10n4M8o0r6l8R3J60m8j66L6K9J0R3r9Jj5o9Q4RM4
3994C7j00p1J26QLrN1j08o9J12O3K0q5o7J30n7OM6K8j61L7L3Q5l9r1J07J0o8P2
4023D9L1p3k3j1N3RK9j8p9J2m4J13j5J5j03K6J9O3Kn8jj1j0M9R7j42J3q2Q1N3
$$ y = [-106, -154, 39, 136, 3, -29, -40, 9, -43, 43, 128, 2, -72, -98, 33, 148, 21, -81, -49, -60, -19, 43, 187, 25, -89, -23, -35, 55, 9, -22, -9, -106, -33, 124, 124, -37, -14, -8, -70, 41, 117, 20, -69, -66, -32, -31, 21, 7, -29, -85, -138, 51, 90, -22, -59, -77, -34, 25, 38, 61, -58, -96, -64, 45, 6, 41, -13, -87, -14, 32, 59, 41, 47, -49, -88, 8, 129, 48, -18, -62, 9, 38, 27, 92, 35, -81, -89, 37, 177, 88, -67, -34, 20, -52, 12, 50, 42, -131, -115, 48, 94, 2, -70, 20, -65, -50, 11, 163, 23, -115, -16, -6, 17, 26, -12, -38, 21, -14, -8, 123, 65, -112, -149, 50, 112, -9, 6, -63, -31, -94, 17, 123, 64, -83, -115, 25, 58, 6, 14, 54, -81, -83, -3, 161, 95, -133, -66, -35, 75, 21, 69, 9, -87, -125, -32, 128, 80, -86, -50, -21, -11, 82, -17, -16, -31, -100, -16, -7, 37, -63, -134, -8, 0, 3, -6, 45, -63, -132, -20, 43, 63, -22, -89, 41, -16, -10, 36, 64, -97, -60, -27, 58, 19, -72, 35, 45, -23, 49, 80, 7, -16, -27, 26, 35, 64, 46, -33, -21, -65, 48, 33, 48, -55, -29, -10, 53, 55, -3, -4, -15, -25, 24, 121, -21, -8, -90, -9, 44]
$$ [...]
8191e
##END NTUPLES=NMR FID
##END=
