##TITLE=1H_IPEDM2907
 CDCl3, 8 sc, 
 29.7.2019
##JCAMPDX= 6.0         $$ Bruker NMR JCAMP-DX V2.0
##DATA TYPE= NMR FID
##DATA CLASS= NTUPLES
##ORIGIN= UXNMR, Bruker Analytische Messtechnik GmbH
##OWNER= root
$$ XWIN-NMR		Version 3.5
$$ Mon Jul 29 16:07:00 2019 Russian Standard Time (UT+4h)  she@DPX200
##.OBSERVE FREQUENCY= 200.13155
##.OBSERVE NUCLEUS= ^1H
##.DELAY= (6, 6)
##.ACQUISITION MODE= SIMULTANEOUS
##.ACQUISITION SCHEME= undefined
##.AVERAGES= 8
##.DIGITISER RES= 18
##SPECTROMETER/DATA SYSTEM= spect
##.PULSE SEQUENCE= zg30
##.SOLVENT NAME= CDCl3
##.SHIFT REFERENCE= (INTERNAL, CDCl3, 0, 15.7039)
##AUDIT TRAIL= $$ (NUMBER, WHEN, WHO, WHERE, WHAT)
$$ ##TITLE= Audit trail, XWIN-NMR		Version 3.5
$$ ##JCAMPDX= 5.01
$$ ##ORIGIN= Bruker BioSpin GmbH
$$ ##OWNER= she
$$ F:/spectra/data/she/nmr/H-F/1/audita.txt
$$ ##AUDIT TRAIL=  $$ (NUMBER, WHEN, WHO, WHERE, WHAT)
(   1,<2019-07-29 16:05:40.12 +0400>,<she>,<DPX200>,
      <created by zg, POWCHK disabled, PULCHK disabled
       configuration hash MD5:
       00 E9 B6 7A A2 85 ED C7 34 08 36 98 17 FE 4E 26
       data hash MD5: 16K
       4F 6F 51 D7 A5 60 05 2F 72 3B 77 CD 03 35 10 59>)
$$ ##END=
$$ 
$$ hash MD5
$$ 08 F6 E6 FA 72 F2 8F 49 34 EF 4D 5B 8D 88 70 8C
##$RELAX= 
##$RELAX= 
##$RELAX= 
##$RELAX= 
##$RELAX= 
##$RELAX= 
$$ Bruker specific parameters
$$ --------------------------
##$DU= <F:/spectra>
##$EXPNO= 1
##$NAME= <H-F>
##$PROCNO= 1
##$TYPE= <nmr>
##$USER= <she>
##$AMP= (0..31)
100 100 100 100 100 100 100 100 100 100 100 100 100 100 100 100 100 100 
100 100 100 100 100 100 100 100 100 100 100 100 100 100 
##$AQSEQ= 0
##$AQ_mod= 1
##$AUNM= <au_zg>
##$AUTOPOS= <>
##$BF1= 200.13
##$BF2= 200.13
##$BF3= 200.13
##$BF4= 200.13
##$BF5= 200.13
##$BF6= 200.13
##$BF7= 200.13
##$BF8= 200.13
##$BYTORDA= 1
##$CFDGTYP= 0
##$CFRGTYP= 5
##$CHEMSTR= <none>
##$CNST= (0..31)
1 1 145 1 1 1 1 1 1 1 1 1 1 1 1 1 1 1 1 1 1 1 1 1 1 1 1 1 1 1 1 1 
##$CPDPRG= <>
##$CPDPRG1= <>
##$CPDPRG2= <>
##$CPDPRG3= <>
##$CPDPRG4= <mlev>
##$CPDPRG5= <mlev>
##$CPDPRG6= <mlev>
##$CPDPRG7= <mlev>
##$CPDPRG8= <mlev>
##$CPDPRGB= <>
##$CPDPRGT= <>
##$D= (0..31)
0 1.2 0 0 0 0 0 0 0 0 0 0.03 0 0 0 0 0 0 0 0 0 0 0 0 0 0 0 0 0 0 0 0 
##$DATE= 1564401939
##$DBL= (0..7)
120 120 120 120 120 120 120 120 
##$DBP= (0..7)
150 150 150 150 150 150 150 150 
##$DBP07= 0
##$DBPNAM0= <>
##$DBPNAM1= <>
##$DBPNAM2= <>
##$DBPNAM3= <>
##$DBPNAM4= <>
##$DBPNAM5= <>
##$DBPNAM6= <>
##$DBPNAM7= <>
##$DBPOAL= (0..7)
0.5 0.5 0.5 0.5 0.5 0.5 0.5 0.5 
##$DBPOFFS= (0..7)
0 0 0 0 0 0 0 0 
##$DE= 6
##$DECBNUC= <off>
##$DECIM= 24
##$DECNUC= <off>
##$DECSTAT= 4
##$DIGMOD= 1
##$DIGTYP= 9
##$DL= (0..7)
0 120 120 120 120 120 120 120 
##$DP= (0..7)
150 150 150 150 150 150 150 150 
##$DP07= 0
##$DPNAME0= <>
##$DPNAME1= <>
##$DPNAME2= <>
##$DPNAME3= <>
##$DPNAME4= <>
##$DPNAME5= <>
##$DPNAME6= <>
##$DPNAME7= <>
##$DPOAL= (0..7)
0.5 0.5 0.5 0.5 0.5 0.5 0.5 0.5 
##$DPOFFS= (0..7)
0 0 0 0 0 0 0 0 
##$DQDMODE= 0
##$DR= 18
##$DS= 0
##$DSLIST= <SSSSSSSSSSSSSSS>
##$DSPFIRM= 0
$$ [...]
##$SUBNAM2= <"">
##$SUBNAM3= <"">
##$SUBNAM4= <"">
##$SUBNAM5= <"">
##$SUBNAM6= <"">
##$SUBNAM7= <"">
##$SUBNAM8= <"">
##$SUBNAM9= <"">
##$SW= 24.9336996594482
##$SWIBOX= (0..15)
0 0 2 0 0 0 0 0 0 0 0 0 0 0 0 0 
##$SW_h= 4990.01996007984
##$TD= 16384
##$TD0= 1
##$TE= 0
##$TE2= 300
##$TE3= 300
##$TEG= 300
##$TL= (0..7)
0 120 120 120 120 120 120 120 
##$TP= (0..7)
150 150 150 150 150 150 150 150 
##$TP07= 0
##$TPNAME0= <>
##$TPNAME1= <>
##$TPNAME2= <>
##$TPNAME3= <>
##$TPNAME4= <>
##$TPNAME5= <>
##$TPNAME6= <>
##$TPNAME7= <>
##$TPOAL= (0..7)
0.5 0.5 0.5 0.5 0.5 0.5 0.5 0.5 
##$TPOFFS= (0..7)
0 0 0 0 0 0 0 0 
##$TUNHIN= 0
##$TUNHOUT= 0
##$TUNXOUT= 0
##$USERA1= <user>
##$USERA2= <user>
##$USERA3= <user>
##$USERA4= <user>
##$USERA5= <user>
##$V9= 5
##$VALIST= <valist>
##$VCLIST= <CCCCCCCCCCCCCCC>
##$VD= 0
##$VDLIST= <DDDDDDDDDDDDDDD>
##$VPLIST= <PPPPPPPPPPPPPPP>
##$VTLIST= <TTTTTTTTTTTTTTT>
##$WBST= 1024
##$WBSW= 4
##$XGAIN= (0..3)
0 0 0 0 
##$XL= 0
##$YL= 0
##$YMAX_a= 733150
##$YMIN_a= -483496
##$ZGOPTNS= <>
##$ZL1= 120
##$ZL2= 120
##$ZL3= 120
##$ZL4= 120
##$ABSF1= 10
##$ABSF2= 0
##$ABSG= 5
##$ABSL= 3
##$ALPHA= 0
##$AQORDER= 0
##$ASSFAC= 0
##$ASSFACI= 0
##$ASSFACX= 0
##$ASSWID= 0
##$AUNMP= <proc_1d>
##$AZFE= 0.1
##$AZFW= 0.1
##$BCFW= 1
##$BC_mod= 2
##$BYTORDP= 1
##$COROFFS= 0
##$CY= 11.3945322036743
##$DATMOD= 1
##$DC= 2
##$DFILT= <>
##$DTYPP= 0
##$F1P= 20.1537800932815
##$F2P= 0.134698688090026
##$FCOR= 0.5
##$FTSIZE= 0
##$FT_mod= 4
##$GAMMA= 1
##$GB= 0.15
##$INTBC= 1
##$INTSCL= 1
##$ISEN= 128
##$LB= 0.24
##$LEV0= 0
##$LPBIN= 0
##$MAXI= 10000
##$MC2= 0
##$MEAN= 0
##$ME_mod= 0
##$MI= 1.114404
##$NCOEF= 0
##$NC_proc= 0
##$NLEV= 6
##$NOISF1= 3.799351
##$NOISF2= 2.8
##$NSP= 1
##$NTH_PI= 0
##$NZP= 0
##$OFFSET= 15.70392
##$PC= 1
##$PHC0= -9375.619
##$PHC1= 9.00097
##$PH_mod= 1
##$PKNL= yes
##$PPARMOD= 0
##$PSCAL= 0
##$PSIGN= 0
##$REVERSE= no
##$SF= 200.130013532006
##$SI= 16384
##$SIGF1= 3
##$SIGF2= 2
##$SINO= 400
##$SIOLD= 16384
##$SREGLST= <1H.CDCl3>
##$SSB= 0
##$STSI= 0
##$STSR= 0
##$SW_p= 3612.71676300578
##$SYMM= 0
##$S_DEV= 0
##$TDeff= 0
##$TDoff= 0
##$TI= <>
##$TILT= no
##$TM1= 0
##$TM2= 0
##$TOPLEV= 0
##$USERP1= <user>
##$USERP2= <user>
##$USERP3= <user>
##$USERP4= <user>
##$USERP5= <user>
##$WDW= 1
##$XDIM= 8192
##$YMAX_p= 0
##$YMIN_p= 0
$$ End of Bruker specific parameters
$$ ---------------------------------
##NTUPLES= NMR FID
##VAR_NAME=  TIME,          FID/REAL,        FID/IMAG
##SYMBOL=    X,             R,               I
##VAR_TYPE=  INDEPENDENT,   DEPENDENT,       DEPENDENT
##VAR_FORM=  AFFN,          ASDF,            ASDF
##VAR_DIM=   8192,          8192,            8192
##UNITS=     SECONDS,       ARBITRARY UNITS, ARBITRARY UNITS
##FACTOR=    0.0002004,     1,               1
##FIRST=     0,             0,               0
##LAST=      1.6414764,     0,               0
##MIN=       0,             -483496,         0
##MAX=       1.6414764,     733150,          0
$$ Real data points
##PAGE= N=1
##DATA TABLE= (X++(R..R)), XYDATA
0@%%%Qj6J6j6K4m0N6p2Q8j12J44j72K04k48K97l54M18m88N73o69P70q85J016j162
27f20J325j502J696j915K156k418K708l028L377l759M179m637N143n702O314o989
43c672P736q568R500j0546J1729j3084J4653j6484J8666k1315K4604k8831L4480
56A8868m2465N4711p6047J23613m04821J33944Q03732m70623k87821K79486m9758
67H2819n66315K67027P03922j20571o66989K4933L12867o8257r010L59200n9669
78B59957m92800r6720L35801Q1597m9645J09389o1298k92234O9935L28574m6274
89A46282k63029O0617R9283j57246K7879L09785l5810l55651n406K71783j1331
100H7156j33358P7211p876k04342O3433L14193K7147k31061r1048k8293n8615
$$ plain form
0 0 0 0 0 8 -8 8 -8 16 -24 32 -40 48 -64 80 -92 112 -136 161 -193 225 -263 310 -359 411 -474 542 -620
27 -620 705 -797 899 -1016 1140 -1278 1430 -1598 1779 -1980 2199 -2438 2705 -2997 3317 -3672
43 -3672 4064 -4504 4996 -5550 6179 -6905 7748 -8736 9930 -11385 13219 -15612 18868
56 18868 -23597 31114 -44933 78680 -326141 -192197 611535 140912 -146909 132577 82819
67 82819 -483496 -216469 487453 366882 -300107 -275174 37693 -30564 -39574 319626 259957
78 259957 -232843 -329563 6238 87835 38190 147579 86281 -205953 -136018 192556 146282
89 146282 -116747 -56130 43153 -114093 -86214 223571 187761 -167890 -173296 98487 87156
100 87156 -46202 31009 23133 -181209 -117776 196417 223564 -7497 -98545 -126838 -185453
111a85453J86196K84882j24674l28765J3121J47641m7809R6575K64750j92353
121A14111m94043P1700M73952L6204j96247J32905j0963m55258m5367N95955J77216
132D00165m65415j29324K61781j16842j84336L90877K76835m78457l68431L47220
142f5927K46951k20298L8136K75424k32445l99241K39594M06254j75245k73053
152a59850J50414P6799k09133P2980L10072r4778l29913M2488K07546n1657m7917
163c2949J33575m7960k11091O9191K28893m0122j52086K4292k971j01082J08372
174b3938K19540q3214k35501J6772J19890k5371K5239J19354r3926k18269N4373
185a25051K13528J9160o5516J4185r2510j55715J11808K40067l3043j60370J3738
$$ plain form
111 -185453 743 285625 160951 -167814 -154693 -7052 -54861 41714 306464 114111
121 114111 -379932 -308232 165720 201924 5677 138582 127619 -327639 -373006 222949 400165
132 400165 -65250 -194574 67207 -49635 -233971 156906 433741 -44716 -413147 -65927
142 -65927 181024 -39274 -1138 274286 41841 -357400 -117806 288448 113203 -159850
152 -159850 -9436 67363 -141770 -68790 241282 146504 -183409 -140921 66625 14968 -32949
163 -32949 100626 52666 -158425 -89234 139659 99537 -52549 -28257 -31228 -132310 -23938
174 -23938 195602 112388 -123113 -106341 13549 -11822 13417 132771 38845 -179424 -125051
185 -125051 88477 107637 42121 56306 -36204 -191919 -80111 159956 126913 -33457 -19719
196a9719K83j08664J06808K42427j02090k91348M5538J94758o8749m4891K08341
207A62694j2046l35954k7474L30510L5606k32770N1184J47309j87740j28425K83784
218H6678J50993k82882j37168K10840L4115j65848R7673J81139j67048j94853
228a86361J65469J53578j42424o5796J32731l3918j48478J00947J69795j06823
238C8720j43972Q8160O3673r3673K1257J23833o8041j40663P6648J22365o4543
249B3764n8885O8476j7910j03404N5038J29207m4299r8418L4970K8789n8484K8577
261a2579R4489m8079j06174L9371P0264l8760n777O8022m1631j02994M8382R6750
273F1284m8980n1223P1914K563j07223K4918J24097l9773j10797N8361P5027r0207
$$ plain form
196 -19719 -19436 -128100 -21292 221135 119045 -172303 -126765 67993 -756 -45647 162694
207 162694 150648 -185306 -212780 117730 153336 -79434 -28250 119059 -68681 -197106 86678
218 86678 237671 -45211 -182379 28461 62576 -103272 -5599 175540 8492 -186361
228 -186361 -20892 132686 -9738 -75534 57197 23279 -125199 -24252 145543 38720
238 38720 -105252 -17092 46581 -47092 -25835 97998 29957 -110706 -34058 88307 23764
249 23764 -35121 33355 15445 -87959 -32921 96286 51987 -46431 -11461 17328 -41156 -12579
261 -12579 81910 33831 -72343 -32972 37292 -1468 -7245 60777 19146 -83848 -35466 61284
273 61284 12304 -38919 32995 35558 -71665 -46747 77350 37577 -73220 -14859 60168 -30039
285c0039l9568J22373J6017j33233Q169J21432m2419j02932P8048Q4816r8628
296a5964n8734J08059K2909j11072J4831J11253m2166r9277N9881P2133p4250
307a2397l5198R1722N247j03030J1082R4758k2459o4448M3401L0186p3265j2906
319d7307R0226R559p8943o99M7502k6648k1615N9177J4189p6454j9869O0925J2689
332B2732k6816K0194O010o0060j4237O9886K6404m4674j3647J1068k5702K019
344b6823O5528J3555p2218l1507L9017J4263j923L8227L856p6583l2488O8230
356A134M5010k8279j3773O35m2460j3218P9031N2459n9143o2513R873J4355O080
369a0809M9765K9872o8455p0181L4622O4266P076r194q300n1253m0709N7397Q4065
$$ plain form
285 -30039 -69607 52766 68783 -64450 -56281 65151 22732 -80200 -2152 82664 -15964
296 -15964 -74698 33361 56270 -54802 -39971 71282 29116 -70161 -10280 61853 -12397
307 -12397 -47595 44127 49374 -53656 -42574 52184 29725 -34723 8678 38864 -34401 -47307
319 -47307 42919 52478 -26465 -27164 20338 -6310 -27925 31252 45441 -31013 -50882 10043 22732
332 22732 -4084 16110 22120 -37940 -52177 17709 44113 -561 -14208 -3140 -28842 -26823
344 -26823 38705 52260 -19958 -51465 -12448 1815 -108 38119 41975 -34608 -67096 1134
356 1134 46144 17865 4092 4727 -37733 -50951 28080 80539 21396 -41117 -31244 -16889 -10809
369 -10809 38956 68828 373 -69808 -35186 29080 36156 26962 18662 -32591 -73300 -15903 68162
382F8162q034o3651l0716o275O264N1972N1965l7177q2944j3417N2391M0629J5153
395D4322o290n2886o1014J9080Q3413M1025l2710n0579l2754j800M7561O2941
407F0309j339p1322n5608J4059N7304N2679J0517n0162p1387j6900N5155O6558
419D9863J7441m0966o5283l0979M1654P6202L0342m3612p0703l7556K5252P2995
431B4650N7225k0672p9912n4765K0705O5580N0499n092o0723o5482k148O9873
443b62P1358J590o6214o9814j3155N3062P2129K5100m7210p5197k8786M7766P6051
456D6418K8477m5505p4958l6087L6130P8918M9401k9266p9849n2087K2558P2220
468A6370N6344j2228p4409o3245J6301P7500N9002p844o2551p1179j8058O7147
$$ plain form
382 68162 60128 -3523 -34239 -40514 -34250 17722 69687 32510 -50434 -63851 -11460 29169 44322
395 44322 38032 -14854 -75868 -56788 26625 67650 34940 -15639 -48393 -50193 -2632 60309
407 60309 58970 -12352 -67960 -53901 3403 56082 66599 16437 -54950 -71850 -16695 49863
419 49863 67304 26338 -38945 -69924 -28270 47932 78274 34662 -36041 -73597 -48345 24650
431 24650 81875 61203 -18709 -73474 -52769 12811 63310 58218 -2505 -67987 -70135 -262
443 -262 71096 72686 6472 -63342 -76497 -23435 48694 73794 26584 -48613 -77399 -29633 46418
456 46418 74895 29390 -45568 -81655 -45525 33393 82794 53528 -26321 -78408 -55850 16370
468 16370 72714 60486 -13923 -77168 -60867 16633 75635 67791 5240 -65939 -83997 -16850
480a6850R0974J2107p3708o9123o724M1175O2165M2547l7719r9431m2988O6794
492c0781Q6705K0209l4352n8117n9596K088Q9243P5974l4226q8940l8321K3055
504d7059N0234N8194J5005p3431r0185N880Q4532O0407j035m1836o5695l8233
516h3222N0955R3025J8310o8857o4727j0493L3737O5875N2491l3809r8422m5800
528i0937N1851P5181L0945j8999n8154n9505Q910Q2251O2967k5855p7673n3553
540g2571R699O5945O8616M414o6474p0724j1654N4592P4538K2598o0639p9193
552f0853j1250N5805N9741K6082k4626p7804o1853L9420R8708L5495m7167n2927
564b1229k9561o506N0493Q0376k698r6192n6815L9288N5122K7165J7657k6354
$$ plain form
480 -16850 74124 86231 12523 -56600 -63324 -22149 40016 82563 44844 -54587 -97575 -30781
492 -30781 55924 76133 41781 -16336 -75932 -73844 15399 91373 57147 -31793 -70114 -47059
504 -47059 3175 61369 76374 2943 -87242 -81362 3170 63577 62542 20706 -44989 -83222
516 -83222 -32267 60758 79068 10211 -54516 -65009 -31272 34603 87094 53285 -45137 -90937
528 -90937 -39086 36095 67040 48041 -10113 -69618 -60708 21543 84510 58655 -19018 -72571
540 -72571 -62872 3073 71689 76103 9629 -61095 -72749 -18157 56381 78979 18340 -60853
552 -60853 -72103 -16298 43443 69525 44899 -32905 -94758 -55338 43370 78865 31698 -21229
564 -21229 -50790 -57296 -6803 73573 70875 -25317 -82132 -42844 12278 39443 57100 30746
576C0746q4186l4032P8072P6587j9416n0445k1549j8384M870P0619N3098n9740
588B6240q8936L841N5983K6732J6779R070n4786p1254K9618R3802K0500n5338
600A2251l6769j0453p593L8162P4247M88r0340n7053L5993N5306K4570O524k5884
613A9449o3726k7937N8096P3588J724n6635m9831j1766K8664N4397L6587k2086
625D0524o4610m2897K3614O4813L5767k4936m8187k6456L356L2453N1081J5733
637F0255n5952o2188J2300N3538K2155k494m293l3201m2357K5314P0586O847n6935
650f425k2924J7213Q0Q787M4829K264o9718l0778N5510L7150k4702j0470R105
663I921l1432k3027N6682N1441m6945o0944J6936K9752q222J6292L6403l5377
$$ plain form
576 30746 -53440 -87472 -9400 67187 47771 -2674 -24223 -42607 -37737 32882 85980 26240
588 26240 -62696 -58855 -2872 23860 40639 49709 -5077 -76331 -46713 47089 67589 12251
600 12251 -24518 -34971 -42564 -4402 69845 70333 -20007 -77060 -41067 14239 38809 45333 19449
613 19449 -44277 -72214 -14118 59470 61194 4559 -45272 -57038 -28374 26023 62610 40524
625 40524 -24086 -66983 -43369 21444 57211 32275 -15912 -42368 -39012 -6559 44522 60255
637 60255 4303 -57885 -45585 7953 30108 27614 23321 -9880 -52237 -26923 43663 50510 -6425
650 -6425 -29349 -12136 -12056 -3269 41560 43824 -25894 -56672 -1162 35988 11286 816 9921
663 9921 -21511 -44538 12144 63585 16640 -44304 -27368 2384 -5838 10454 46857 11480
675A1480p1822J6162P5082R452l9605m692j285l5132O755P2341K4191o5352m5245
688d7670K4978K2327o08K4050J8583m5066n1539K5660N8149O477k6867j0422r196
701a1144j8878J2361M6406J4936l9000l3503R738K0693N459N350O620j6265k7996
714b5223M729L5001J1541k3565j3501R421r43r877J4755J9457j7943k6446J5667
727f927K5240j5316k0325J7149J2126k1962l660L0783j391l8667R93L9195m09
740A6829l0468P528J9810k3393j7672L8496K4976l8296k7080K8116J2655k3694
752a2193Q913L3987j8527m4876J4002M1327r698k3947J8908J0294l5492j0586
764b7888M2743J5630l5178r545K5585p076k7352J8246L3968j7052l2020J3277
$$ plain form
675 11480 -60342 -44180 30902 40354 749 -3943 -5228 -40360 -33605 38736 62927 -2425 -47670
688 -47670 -22692 -365 -973 23077 41660 -3406 -54945 -29285 28864 35341 8474 -1948 -11144
701 -11144 -30022 -17661 28745 43681 4681 -28822 -19084 1609 7068 12418 19038 2773 -25223
714 -25223 -20494 14507 26048 2483 -11018 -1597 -2540 -12417 2338 21795 3852 -22594 -6927
727 -6927 18313 2997 -17328 -179 11947 -10015 -13675 17108 15717 -22950 -21957 17238 16829
740 16829 -13639 -6111 13699 -9694 -27366 11130 36106 -2190 -29270 -1154 11501 -12193
752 -12193 -3280 30707 12180 -32696 -18694 22633 12935 -11012 7896 18190 -17302 -27888
764 -27888 14855 30485 -4693 -14238 11347 4271 -23081 -4835 29133 12081 -19939 -6662
776f662J9558j9652j0500L0069J2414l2343j6463K2862Q991j5841N922K2066j2421
789H000l3046L688L0444N774j4141Q90K987j8738j0180K6479K5462j4163k6408
802a2952r01R098r45P667J9290m650l2070j0805K4776J7923p152m869J396j4556
816h750j2828K0729K6901j1575k6323K289J2388n578M49J8856l101l0604k968
829b0115L1656P448k3845l136J4576r771j2862K3443J8636l0175k6416K5170K5709
842B0318j5525j1115J4086q925k8012J6255M4693n653m3600o696K2574J66j590
855c024K5235K659m5058k2134L7777L3078j0903j4478k304j8535j3642L2048L9334
868D0053j3783m0854j0683J3067J0261J6537J6640j7449l9678p137L1465K4268
$$ plain form
776 -6662 12896 -6756 -17256 12813 25227 -7116 -23579 -717 8274 -7567 -1645 20421 8000
789 8000 -25046 -21358 9086 14860 719 1609 4596 -14142 -24322 2157 27619 13456 -12952
802 -12952 -13853 -4755 -5700 1967 21257 16607 -15463 -26268 -1492 16431 9279 4410 5806 -8750
816 -8750 -21578 -849 26052 14477 -11846 -9557 2831 -2747 -2298 16558 13457 -17147 -20115
829 -20115 11541 18989 -4856 -7992 6584 -3187 -16049 7394 26030 -4145 -30561 -5391 20318
842 20318 4793 -6322 7764 -1161 -29173 -12918 31775 26122 -17478 -24174 -1600 -1434 -3024
855 -3024 22211 24870 -20188 -42322 -4545 28533 17630 3152 848 -17687 -31329 719 40053
868 40053 26270 -14584 -25267 -12200 -1939 14598 31238 13789 -25889 -33026 -1561 22707
880B2707r47j1279j7640j8463O248L2167J8058j7791k6490p980Q849J6871J5853
893B0163q72k2885k1813N095K5509J7241p141k1110j3352L352J4683J6987N512
906B1369j8704k8366j221L0718K1680r483j8216j0303q470N677L1844K0401k8269
919H657l9026L989K8386J2035L873K671k3659l5079J1547M9149J5836k8645k1652
932a1918l817m406J3135L6743P544m2426l1482J6884K7237R516N222p531l3420
945a8719j9394K9726L6953l189k4046j4178q546L012K8716K4141j9412l7151o114
958b8201J9306J6817J1981J178k5284k8514R693L5208J4855j3300j8964j5325
970b0550l835K2153L0376j87l0752k3187L377J9534K2662Q790j9348l0187o895
$$ plain form
880 22707 21760 10481 -7159 -25622 -19374 12793 30851 13060 -13430 -21410 -12561 4310 20163
893 20163 19291 -3594 -25407 -20312 5197 22438 15297 -5813 -19165 -15813 -1130 15857 21369
906 21369 2665 -25701 -26922 3796 25476 15993 -2223 -12526 -20996 -15319 16525 36926 8657
919 8657 -30369 -26380 2006 14041 17914 20585 -3074 -38153 -26606 22543 38379 9734 -11918
932 -11918 -15735 -20141 -7006 29737 37281 -5145 -36627 -19743 7494 17010 22232 14701 -18719
945 -18719 -38113 -8387 28566 25377 1331 -12847 -21393 -18381 10335 34476 15064 -22087 -28201
958 -28201 -8895 7922 19903 21081 -4203 -32717 -23024 12184 27039 13739 -5225 -20550
970 -20550 -24385 -2232 28144 27957 -2795 -25982 -22605 -3071 19591 28381 9033 -21154 -28049
983b8049K1473K4832R014j2732k8595j7436J7353L1912R951j4541j9298j6277
995b2393p73K6998K8374r611l4567j3286J2723J4276J3526R284j7510l4261k571
1008b9791L3750K1091j0004j5158j1321j1005Q792L1582J1973k6380k6697K200
1020b0968J5714J4824J2855o077k9786j7321J8759K6970O406r158j6394j9043
1032b3219Q59K9767K2751j2819k5858j0528K324J2693K3643R566k5096k9416L542
1045b1791K3956J3973K026p586k1370j6285J5761L0085N957j8286j7117p286M060
1058a3903J9272J8229q397k5492j0616R884J5289J1958M49j9168k0210N519K2982
1071E796J1054n442j0794j3718p295J5686K4203m40k2497j2993M174Q222J2077
$$ plain form
983 -28049 -6576 18256 27270 14538 -14057 -31493 -14140 17772 27723 13182 -6116 -22393
995 -22393 -23166 3832 32206 22595 -11972 -25258 -12535 1741 15267 24551 7041 -27220 -29791
1008 -29791 3959 25050 15046 -112 -11433 -22438 -13646 17936 29909 3529 -23168 -20968
1020 -20968 -5254 9570 22425 16348 -13438 -30759 -12000 14970 21376 12218 -4176 -23219
1032 -23219 -22360 7407 30158 17339 -8519 -19047 -16723 -4030 19613 29179 4083 -25333 -21791
1045 -21791 2165 16138 18164 10578 -10792 -27077 -11316 18769 24726 6440 -10677 -17963 -13903
1058 -13903 5369 23598 15201 -10291 -20907 -11023 4266 16224 16673 -2495 -22705 -17186 5796
1071 5796 16850 11408 614 -13104 -20399 -4713 19490 19050 -3447 -16440 -12266 -4044 8033
1084H033J1923r248k5929p861J9687J7501k8p048j0672j3176K441K2573J4119
1097B2315j1879j8566o050M367J1086J4507J325j8288j5714M317J4560R920J681
1110A3581r428j6470m239J5015J5018j000j0229r565o450M866J6946R335j2295
1123E085j6393j083Q077P437P137j10j4053j2829O939J6845N172o647q094o881
1137i398j579J0151J3157j163j3230q726K308P974Q902K741q620j1791p19Q972
1151a021Q144K489m260j0101o414O960J2140J906p234n845k907J59P454R308k918
1166G860j2445m975O117O167K218N89m196q352j652R257P364k908o708l714l42
1181e720L381O696K435n664o908n10M499M635K426k547o412k847M166N672J011
$$ plain form
1084 8033 19956 10708 -15221 -23082 -3395 14106 14078 7030 -3642 -16818 -14377 8196 22315
1097 22315 10436 -8130 -14180 -9813 1273 15780 17105 -1183 -16897 -12580 1980 11900 13581
1110 13581 4153 -12317 -16556 -1541 13477 12477 2248 -7317 -13767 -8901 8045 17380 5085
1123 5085 -11308 -12391 -4314 3123 10260 10150 -3903 -16732 -9793 7052 12224 5577 -2517 -9398
1137 -9398 -10977 -826 12331 11168 -2062 -10788 -8480 -506 8396 11137 2517 -9274 -9993 -1021
1151 -1021 7123 9612 5352 -4749 -11163 -4203 7937 9843 2609 -3236 -6143 -5984 1470 10778 7860
1166 7860 -4585 -9560 -3443 2724 4942 5531 1335 -7017 -8669 588 7952 5044 -1664 -5378 -5720
1181 -5720 -2339 4357 6792 1128 -5780 -6290 -1791 2844 5270 2723 -3689 -6536 -2370 3302 4313
1196D313k007l236l520j39N662M843k417n524j509K334J718J405J890j870n014
1211c071q85N083L165k257k586J75l03r30K410K801j866m280L12L637J08j718
1227b05N11L48k228m33L176R31k780j307J722N07j205N49J110j423j204J703J414
1244A186j578r34J128M49q13L33P13q14q19J248J227r51j173K07O47N17N87l97
1262G63q70p98L15J428J438q8l012j773K262K310j93m13k72k842k180M236M977
1279E288k525n058L2J394j027K482N228k984q592j4P174J781k629J213o87p086
1295f010p18J0107M133p457m258K739r72j384P300M816r121p880N852O464k309
1310A302j68L219n520p415O135J0537l006p948O91K188l175K778Q192k668j0981
$$ plain form
1196 4313 2306 -930 -4450 -4589 1073 5916 3499 -2025 -3534 -1200 518 1923 3813 1943 -3071
1211 -3071 -3956 1127 4292 2035 -551 -376 -679 -1609 801 3602 1736 -2544 -2232 1405 1513 -205
1227 -205 306 654 -1574 -2007 1169 2100 -680 -1987 -265 242 -963 -414 696 -727 -1931 -228 1186
1244 1186 -392 -1326 -198 251 -562 -229 484 -330 -1149 99 1326 375 -798 -591 56 573 1160 763
1262 763 -107 -905 -590 838 2276 2188 -824 -2597 -335 1975 1782 1369 1097 -1745 -3925 311 5288
1279 5288 2763 -2295 -2263 -869 -1896 586 5814 2830 -5762 -5776 1398 3179 550 1763 1076 -6010
1295 -6010 -6728 3379 7512 55 -4203 -1464 -2436 -3820 3480 8296 -825 -8705 -2853 3611 1302
1310 1302 1134 4353 -1167 -8582 -2447 8090 5084 -2864 -2173 15 -3160 -382 7810 5142 -5839
1325e839q02Q476K501k594P53j633o505L00R190M082o264n576k48J427L447N124
1341E839o41p069n221K202N741N007K17o847o874J441O727M095Q53k532q140n136
1357a0338P297J0738n84p127l039j994j603P275J0451l990j3482k155P414K751
1371A614J244M817l651j3075r85J4065N321p253k655P01o245n41J3365N539j3049
1386g88q421O890M035k455M919M223j1233r823J0451J1901n337o870K251k014
1400b271n559P499J1928o007j3960N27Q246J357N12M004m870j1217J345J2395
1414C929M674n457m722l295k235N106R652Q82q573o411m57M364P786M267o212
1429C298r558j127N304M989M411j28r357q459N547J0569J398l496k304n593m590
$$ plain form
1325 -5839 -6641 1835 4336 1742 2495 862 -5643 -5343 3847 7929 1665 -3911 -4159 -2732 715 5839
1341 5839 5198 -1871 -7092 -4890 851 5858 6075 -772 -7646 -6205 522 4617 5470 2938 -5202 -10338
1357 -10338 -3041 7697 7113 -14 -3053 -5047 -6650 625 11076 7086 -6396 -8551 -1137 1614
1371 1614 2858 7675 4024 -9051 -10036 4029 9350 2097 -558 143 -6102 -6643 6722 12261 -788
1386 -788 -9209 -2319 1716 -739 4180 8403 -2830 -12653 -2202 9699 4362 -2508 -257 -2271
1400 -2271 -7830 -331 11597 5590 -8370 -7843 403 1760 2272 6276 1406 -9811 -8466 3929
1414 3929 8603 3146 -1576 -4871 -7106 -2000 7652 8534 -39 -6450 -6907 -2543 5243 9510 3298
1429 3298 -6260 -7387 -2083 2906 7317 7189 -2168 -10627 -5080 5489 6887 3391 1087 -4506 -9096
1444i096P934J1594l031j1111j722L007l13M310Q072n039j3768L25J1688K196
1458E046m472K274j364j0233P37J5055L114j2612m200O029j002j918R542L452
1472I448j3699p908J1367Q108n248j807K732o731n981J0372J0946o963j0393J534
1486d223K980j004N449O235p135j1100K190R112K066o18m05n849o296M986R916
1501F304Q58n792l948k392l64O617O804l447q300k033K512K734M869K231o776
1516a23p381K834O325J481j70k90n903m938O650Q292k786o002K57l61k461N275
1532F99P893n401j0230K103P456j014j096M357l069r550K420J1881K09q447l98
1547b187K712m119M94R917Q65j1691l414P887K288k790L226J052q628l705R510
$$ plain form
1444 -9096 -1162 10432 7401 -3710 -5432 -2425 -2738 1572 9644 4605 -9163 -8838 2850 5046
1458 5046 574 2848 1484 -8749 -8012 7043 10157 -2455 -6655 -626 -1628 -3546 5996 9448
1472 9448 -4251 -12159 -792 7316 2068 261 2993 -3738 -9719 653 11599 4636 -5757 -4223
1486 -4223 -1243 -2247 3202 9437 2302 -8798 -6608 2504 4570 3952 3547 -2302 -8598 -3612 6304
1501 6304 7162 1370 -2578 -4970 -5334 1283 8087 4640 -3660 -5693 -3181 -447 4422 6653 -123
1516 -123 -7504 -4670 1655 3136 2966 2676 -3227 -8165 -1515 6777 3991 -2011 -1754 -2115 -4576 699
1532 699 8592 3191 -7039 -4936 2520 1506 410 4767 1698 -7852 -5432 6449 6658 -1789 -2187
1547 -2187 525 -3594 -3100 6817 7682 -4009 -7423 464 2752 -38 3188 4240 -4388 -8093 1417
1562A417N858n652l482J483k506j827P085N219o816o602K791L278m96K793K136
1577D679o133n298M387N848r22j610l14l390k275N278N113k981m183j89M1J66
1593a783M266K574m833m653K558K814j15J421Q93m819l527N058M492k693k359
1608g06J189j747k619M918M770m691n316K828K615k383J432M023l678o477L577
1623b265O478k331l646K543j83m969K123P147j612o762O98L996j862p79M819n79
1639B816o698k18N916O64l177J301Q83m360m22N836J338m818r34K414j189r88
1655a636L879J123m726j815L659Q86j772J365J191l545j533L942J538k874n43
1670h61J824j618j418L207J573l455j509K773N2j859J732J549l192j460L358J151
$$ plain form
1562 1417 7275 1623 -1859 -376 -2882 -4709 2376 7595 779 -5823 -3032 246 -250 2543 4679
1577 4679 -1454 -6752 -2365 3483 2561 951 637 -2753 -5028 250 5363 2382 -1801 -1990 -1949 -1783
1593 -1783 2483 5057 224 -4429 -1871 943 828 2249 3142 -1677 -5204 -146 4346 1653 -706
1608 -706 483 -1264 -3883 1035 5805 1114 -4202 -1374 1241 -1142 290 4313 635 -5842 -2265
1623 -2265 4213 1882 -1764 779 596 -4373 -2250 4897 3285 -3477 -2779 1217 -645 -1424 3395 2816
1639 2816 -3882 -4100 1816 2480 -697 604 1487 -2873 -3295 2541 3879 -939 -1873 541 -648 -1636
1655 -1636 2243 3366 -1360 -3175 484 1370 -402 963 2154 -1391 -2924 1018 2556 -318 -861
1670 -861 963 -655 -2073 1134 2707 -748 -2257 516 568 -1291 441 1990 -1202 -2662 696 1847
1686A847k971J54K348j870j927K967J950l297j433L195O4k775J538K721k735k504
1702b728L264J870l406l96L201q98l197K016K927k715k094L086J008l127j7L218
1718B012j152k935K077K272k674j515K821N06k550M92K337j706k068K436J719
1733B072k570r51K217n48j960J976J854k457j839K303J051k168O34K009j952k418
1749b747K507K286j802j357J705m91k001J709K637j743k536J236J328j051L46
1764B6K020j776k512J500K324o27j049J043j133k004J754L016j261k573O82N24
1780d6j011J177K642j608l625N97K920k02p57J052r20k864O18L981L83k805p13
1797a181N97p64O35L056l25l480j139K066J073J40J101j080l061k34L589J348
$$ plain form
1686 1847 -1124 -970 1378 -492 -2419 548 2498 -799 -2232 963 1027 -1748 -210 2511 -224 -2728
1702 -2728 536 2406 -1000 -1396 1805 907 -2290 -274 2653 -62 -2156 930 1938 -1189 -1206 2012
1718 2012 860 -2075 2 2274 -400 -1915 906 1412 -1138 -646 1691 -15 -2083 353 2072
1733 2072 -498 -1449 768 220 -1740 236 2090 -367 -2206 97 1148 -1020 -386 1623 -329 -2747
1749 -2747 -240 2046 244 -1113 592 101 -1900 -191 2446 703 -1833 -597 731 -320 26
1764 26 2046 270 -2242 -742 1582 955 -94 949 -184 -2188 -434 2582 1321 -1252 -570 -46
1780 -46 -1057 120 2762 1154 -2471 -1874 1046 844 87 1139 219 -2645 -2027 1954 2337 -468 -1181
1797 -1181 -584 -1348 -713 2343 2018 -1462 -2601 -535 538 678 1779 699 -2362 -2596 993 2341
1813B341j464q72n01j766R46L754O71l444j866J132Q73O89K007k47l928j753L028
1830d00K718o54q82p12k201l53L354K520j920k876n26M32J273K441N57l150k782
1847c161R49K698J132M00j262l052j184L165L149o46k251j236j131N70L441K165
1863C746k601l790J06J910J568J301J87l052l014J624L981J186j719j865j748
1878b180l47K708L432p19l765k117R16K041K377Q74k598l697j63L269K659k1j606
1895A063k989j723K110M019J092k708k960q70J139K889K346r75m084k214J702
1910b163L331J932q16k764k830K36L381K913l20k956k928j54K906L359l2k707
1926C88k741p18K051L492J331k596l888o08K583K823Q41j139l087k585J664M356
$$ plain form
1813 2341 877 5 -496 -2262 -1316 2438 3109 -335 -2201 -1069 -196 493 2500 2253 -1675 -3428 -400
1830 -400 2318 1664 782 70 -2131 -2484 870 3390 1470 -1406 -1932 -1500 -227 2214 2771 -379 -3161
1847 -3161 -2212 486 1618 2018 756 -2296 -3480 -315 2834 2188 -63 -1299 -2430 -1860 1581 3746
1863 3746 1145 -2645 -2539 -629 939 2240 2427 -625 -3639 -2015 1966 3152 1433 -432 -2180
1878 -2180 -2527 181 3613 2894 -871 -2988 -2072 -31 2346 3220 622 -3075 -3238 31 2690 2669 1063
1895 1063 -1926 -3649 -1539 2480 3572 864 -2096 -2966 -1827 1062 3408 2433 -1651 -3865 -2163
1910 -2163 1168 3100 2284 -480 -3310 -3074 307 3220 2900 -56 -2984 -3138 -232 3127 3095 388
1926 388 -2353 -3071 -1020 2472 3803 1207 -2681 -3289 -706 2117 2958 1819 -1268 -3853 -2189 2167
1942B167J828k495l094j432Q69K602K994l23m102l035J369L601K082l58k543l082
1958b952p86L388L749Ml288l069l00K172L214J606k284l999j399K663L502J232
1974C453j779l013k291J132L786K755j515m010j941J416K738K089K49k856l600
1989c387Q8L874L222j280k757j959n86J605L597J724l319m261J04L248K174M03
2005B490r25k801k759J559M984J501l248k951l89P40J997L115k14m186l201J917
2021b371L760J314p85j858k542q49K904L853j84l413k634N11J928K334J040j597
2037A411l495j320K405L506P00k334k336j157J168K479K286r01l781k192K039
2052a522L068R08r07j590k223r24L158L651j164l713j259J068R16J624J954j701
$$ plain form
1942 2167 3995 1500 -1594 -3026 -2157 445 3439 3116 -986 -4021 -2652 949 3031 2673 130 -2952
1958 -2952 -3738 -350 3399 3403 115 -2954 -3254 -1082 2132 3738 1454 -2545 -3944 -1281 2221 3453
1974 3453 1674 -1339 -3630 -2498 1288 4043 2528 -1482 -3423 -2007 731 2820 3069 213 -3387
1989 -3387 -3299 575 3797 2517 -240 -2199 -2785 -1180 2417 4141 822 -3439 -3335 -87 2087 2490
2005 2490 1565 -1236 -3995 -2436 2548 4049 801 -2150 -2539 -1799 198 3313 3099 -1087 -4288 -2371
2021 -2371 1389 2703 1918 60 -2482 -3331 -427 3426 3242 -171 -2805 -2294 -366 1968 3008 1411
2037 1411 -2084 -3404 -999 2507 3207 873 -1463 -2620 -1452 1027 3313 2412 -1369 -3561 -1522
2052 -1522 1546 2454 1547 -43 -2266 -3190 -32 3619 2455 -1258 -2517 -1449 -533 1091 3045 1344
2068A344m412o87M083K346j437j010m16k231k39M192K610l344l514J001J737j20
2084i7J375J620k692m013J720M318J46k218l33k10j684J004L705M62m023j682
2100b602J979J282n7R13Jk885j527K388K801n54j891p15k79N3J562J690q13k787
2118a441p55J410J910L05q10r13j124l13J583K040l36k432j163J366J049j1N04
2135H69J14j998j465K400K299j348j814P98M00j474P14K837o94l673M45K928n18
2152H20j614J418R58k816j057L403J287k901j104K575k14k379J413K524j982k838
2168b507K116K406k164j288K027M42k425J59K795m66k687O35J954p00j443J178
2184C2J202j879o76J746P55j717m68J314J80j026L84R15n99j059O87J108l04r40
$$ plain form
2068 1344 -3068 -3755 328 2674 1237 227 -189 -2420 -2659 1533 4143 799 -2715 -1714 23 -97
2084 -97 1278 2898 206 -3807 -2087 2231 2377 159 -174 -384 -2068 -1064 2641 3103 -920 -2602
2100 -2602 -623 659 602 1515 1516 -1369 -2896 -508 2293 1739 -152 -867 -1146 -1093 469 2159 1346 -1441
2118 -1441 -2196 -786 1124 1429 619 -294 -1418 -1731 -148 1892 1556 -876 -2039 -673 376 365 869
2135 869 983 -1015 -2480 -80 2219 871 -943 -145 255 -1219 -505 2332 1638 -2035 -1590 1338 820
2152 820 -794 624 1582 -1234 -2291 1112 2399 -502 -1606 969 755 -1624 -211 2313 331 -2507
2168 -2507 -391 2015 -149 -1437 590 1032 -1393 -1234 1561 1095 -1592 -957 997 297 -1146 32
2184 32 1234 -645 -1321 425 1180 -537 -1005 309 489 -537 -153 762 163 -896 -209 899 595 -345
2202c45j70R49J2n32J79N47q30p08R57J314q30j511N82R44o35j64J212j26k258
2221a413j02K656L62j960k25J060q74j070K231J794k676k338J919J735j288l0
2237b19J700j357l035J584L681o99k685K63J031j480J51L249L73l935j395K787
2253A4J300j079N58N97k409j966L109K855j448k566J26M66l90J306K165j423l167
2270a952l29K442J413k78n55j100j687M99K676J365j560k237p50J049J556J100
2286A652j52j844k061K22K577J958p93k260j164J60J357J979Q55j977l040j99
2302b730K874J860k56j164j539j662Q40L524J865k768k992J3J522J200J645N47
2318B779l260l281J812L881J053j811j530j216j214K178L992J8m159k542J514
$$ plain form
2202 -345 -515 434 446 -86 93 640 -190 -898 59 1373 543 -968 -386 558 -77 -241 971 845 -1413
2221 -1413 -1515 1141 1503 -457 -682 378 -496 -1566 665 2459 -217 -2555 -636 1099 -189 -219
2237 -219 1481 124 -2911 -1327 2354 1655 -1030 -767 264 -1216 -1065 2184 2557 -1378 -2773 14
2253 14 1314 235 793 1390 -1019 -2985 124 2979 1531 -1035 -909 -443 -833 473 2638 1215 -1952
2270 -1952 -2281 161 1574 1296 741 -359 -2046 -1547 1129 2494 934 -1303 -2053 -1004 552 1652
2286 1652 1500 -344 -2405 -2183 394 2352 1559 -701 -1865 -1705 -348 1631 2486 509 -2531 -2730
2302 -2730 144 2004 1748 584 -955 -2617 -1777 1747 3612 844 -2148 -2135 -613 587 2232 2779
2318 2779 -481 -3762 -1950 1931 2984 1173 -357 -1573 -2787 -609 3383 3401 -758 -3300 -1786
2333a786K057J058J192r36l753j920L333L565j78k451j605j118L54L187K787j858
2349A928m203j088K107K416J087Pk483l121L95L838K510j332k811j730m0K030
2365d90L186P12l180l140L5K739K629O44k007l099j303K060L533J250k121l365
2381a917j286J694L057J786j348l036k239P93L539K435j023l497k136O66K443
2396f9K900K06l027l541K66L290K728J4k313k844j190K128M036J150k938l514
2412b718l21J744K696J926q81m109k437K222L841J242j354k263k335j48L463L319
2428C887q98l802k139Q83K040K535R41k525l846n72L263K937K05k030k494j532
2444c147J432L755J602k503l292p83J249K575K177q49l695k114J479L234J547
$$ plain form
2333 -1786 271 1329 2521 1585 -2168 -4088 -755 2810 2632 181 -1424 -2542 -2188 999 3786 1928
2349 1928 -2275 -3363 -1256 1160 2247 2254 -229 -3350 -2955 883 3393 2061 -750 -2480 -2520 -490
2365 -490 2696 3408 228 -2912 -2877 -138 2491 3135 1128 -1971 -3274 -1214 2319 3569 1448 -1917
2381 -1917 -3203 -1509 1548 3334 1986 -1050 -3289 -2496 1043 3478 2455 -1042 -3178 -2512 -69
2396 -69 2831 3037 10 -3531 -3265 25 2753 2767 454 -2390 -3580 -1452 2584 3734 796 -2718
2412 -2718 -3039 -1295 1401 3327 2446 -1663 -4100 -1878 1963 3205 1851 -412 -2747 -2895 568 3887
2428 3887 2989 -813 -2952 -2069 -29 2506 3447 922 -2924 -3496 -233 2704 2909 879 -1615 -3147
2444 -3147 -1715 2040 3642 1139 -2153 -2936 -1687 888 3065 2216 -1479 -3593 -2114 1120 2667
2459B667n71k634k620K05L466K636p63k803k063m21K161L201Q79k955l149j51
2475b915K538K354R70j427l201j672K027L373J115j705k489j613P19K990K199
2490C263j220l165j500P99K131K249J87k865k878O90K832J555j40j325k460j294
2506c141K303L353J64k730j906j29R74J943J994j162l578j152K107K268P58p30
2522A336j891k090L45L047J970j287k136j171j5J794K327K23k684k104O92J767
2538A23J545N69j239k689q23K319K261j48j335j273r95L73K433J494j587k460
2554a432m19J242J166R90k4j915j834Q22K085R98n34j373j325k53J843J525o3
2571A499j806j047p4P09J740R67j695k037L52J389O61L82J7j564j488J062K235
$$ plain form
2459 2667 2096 -538 -3158 -2953 513 3149 2386 -417 -2480 -2901 -740 2461 3340 385 -2764 -2915
2475 -2915 -377 1977 2947 1520 -1681 -3353 -1326 2047 3162 1457 -1032 -2645 -1926 1064 3263
2490 3263 2043 -1122 -2622 -1823 308 2557 2744 -121 -2999 -2309 523 2078 1938 613 -1847 -3141
2506 -3141 -838 2515 2679 -51 -1957 -2086 -1112 831 2825 1663 -1915 -3067 -960 1308 2066 1336
2522 1336 -555 -2645 -2300 747 2717 1430 -706 -1877 -1892 -98 2229 2452 -232 -2336 -1644 123
2538 123 1668 2237 998 -1691 -2514 -195 2066 1918 583 -690 -1685 -1312 1121 2615 1028 -1432
2554 -1432 -1851 -609 557 1547 1523 -392 -2226 -1404 681 1679 1145 -228 -1553 -1806 37 1562 1499
2571 1499 -307 -1354 -1428 -719 1021 1988 293 -1744 -1392 -3 658 1040 1057 -507 -1995 -933 1302
2588A302K04j308n79k90m14J105J794l54k029p78J020O78L76L44n51j673o6J650
2606D31R39p00p29k63m56J44J405O35j567r05M11P36m6N12K01j195r68J040J179
2625H04l82n50j6l20j72N02Q21k22j003k30M31M57K64qm25l82Q2N23J45K20m72
2646F7o07K90P14J43n55q1K05k09j67O86J37r14k80Q77K20o29J52M94o53o19R68
2667B39N56q20p08P89M53q82J39P34n71r15O11J286q06q91O35M10q42J70J218
2686H05m24j536L28J309K3r50M32K07r11j95J649N48j517o95O04N79k83N49M50
2705I72r03j267O01J684%r24l39o6l78M30J298K15j460j116P10J032J51o1j62
2724D17r51p78Q70J540N6j297q71L34M51K90Q01q1j456j016J211J500k26q95l10
$$ plain form
2588 1302 1506 198 -381 -671 -1085 20 1814 1460 -569 -1347 -327 351 727 1071 520 -1153 -1219 431
2606 431 1370 670 -59 -322 -778 -634 771 1406 -161 -1066 -655 81 35 547 748 -447 -1415 -375 804
2625 804 422 -128 -144 -464 -636 -134 687 465 -538 -768 -337 120 384 376 -49 -431 -349 174 319 539 67
2646 67 -540 -250 464 607 52 -29 176 -33 -200 486 623 -291 -571 306 526 -103 49 543 -110 -729 239
2667 239 795 -25 -733 56 509 -373 -234 500 -71 -986 -375 911 105 -786 -151 259 -583 -413 805
2686 805 381 -1155 -827 482 505 -445 -13 194 -717 -912 737 1285 -232 -927 -323 256 -27 522 972
2705 972 69 -1198 -597 1087 1087 163 -176 -242 -620 -190 1108 1323 -137 -1253 -543 489 640 579 417
2724 417 -534 -1312 -442 1098 1154 -143 -1014 -680 -229 61 862 781 -675 -1691 -480 1020 794 -101 -411
2743d11l23l19J017J570n08k033m12J051P45K45L11n63j636l36K034J438r11j437
2761d78l93K10K40J211J240j300k403P7J859J089m14j54p85j684K07K542J459
2778B523j901j933K09P28J47J340R11j907k569O82K679O29j043l84p97j074Q15
2795i45K460Q25k623j589Q29J024K99P21J91j957j714J584K512Q3j551q08k78
2812i37l53J406K022m36k720j081J626J365L54k01r11j614l20K023K052o71k126
2829e22q24J86R23J333Q69j092k406o81J970J986j6j388j145j032L13K181J714
2846B369r78k685r84J428J424N42J68j044k142n94K950J938j306j693m26j88Q0
2863a141K078J616j779l031K95K498P44n42K15r51k205O56L331Q59k662j361P13
$$ plain form
2743 -411 -734 -1053 -36 1534 1026 -1007 -1419 -368 377 622 933 370 -1266 -1602 432 1870 959 -478
2761 -478 -871 -661 -421 790 2030 730 -1673 -1596 263 1352 938 784 -1 -1685 -1478 1064 2523
2778 2523 622 -1311 -1102 -374 -227 1113 2024 117 -2452 -1770 909 1538 495 111 -686 -1760 -945
2795 -945 1515 2340 -283 -1872 -1043 -19 280 1001 1192 -765 -2479 -895 1617 1700 149 -659 -937
2812 -937 -1290 116 2138 1702 -1018 -2099 -473 892 1246 1045 134 -1480 -1800 223 2275 1604 -522
2829 -522 -1346 -1160 -237 1096 1965 873 -1533 -2214 -244 1742 1726 338 -807 -1839 -1526 655 2369
2846 2369 1391 -1294 -2278 -850 574 1116 1284 240 -1902 -2496 454 2392 1086 -607 -1033 -1221 -1141
2863 -1141 937 2553 774 -2257 -1962 536 1280 738 953 2 -2203 -1547 1784 2643 -19 -1380 -667
2880f67K28K86J843M57k679k073J760K310j62p49l17j257j073J818K679p40k527
2897h63p77O18Q37J016J015j033k533n30J921J771N3r83j200j117M17K057J225
2914A894p74j978j083O76J656J139k63j388j266k20J562J865j38j907j234L42
2930a117R54R61P57n59k260p81J979J822n22j105l25o66l99J707J856j358k444
2947a500J41J527K75N9P73r47k408K76L118N07j964m04J52o66J44K205Q33k754
2965f33j592J596J136j86M61J85j857j462J776K348n79j306l05l86l44J336J737
2982A925q57k153k41R59O97O72J52r90j381R2J547Q32l11r75q65k40J140J043
3000A046J9r37p58l49N52J287L11j050r10J14M21L22O31J21j340j092J277J126
$$ plain form
2880 -667 -439 -153 1690 2147 -532 -2605 -845 1465 1303 554 237 -1020 -2093 -275 2404 1664 -863
2897 -863 -1640 -1022 -185 831 1846 813 -1720 -2250 -329 1442 1495 512 -688 -1805 -1388 669 1894
2914 1894 1120 -858 -1941 -1265 391 1530 1267 -121 -1387 -1607 -45 1820 1682 -225 -1459 -1117
2930 -1117 -163 798 1555 996 -1264 -2045 -66 1756 1234 129 -196 -862 -1261 446 2302 944 -1500
2947 -1500 -1359 168 443 502 1275 328 -2080 -1804 1314 1821 -143 -547 -395 -1061 -917 1288 2121 -633
2965 -633 -2225 -629 507 321 782 967 -890 -2352 -576 1772 1193 -113 -418 -804 -1148 188 1925
2982 1925 1068 -1085 -1326 -367 330 1002 1154 164 -1217 -1125 422 1254 943 -32 -897 -1137 3 1046
3000 1046 1065 128 -630 -979 -427 860 1171 121 -789 -675 -254 68 699 820 -520 -1612 -335 791
3018G91k81n52j3n21o99J236J511r19j573L36P23k70K41J121p36j749K13J948
3036H07M9r01K56Oj129R4J898K61j522n80O55J12l15J023N23j705q41J285Q37
3055H13m37l31M25q18o37J068J038q05o82R7K97m51O25N94p80q68L63P47j32n1
3075G5R5n28m20O28P29m07m58K48k80m8O20M58n82p18M86L21l10K90M64q16o58
3096h11P12P18n05k33L26k21n69N95Q57o43p24N45L19n87J53P67n64r08M00R60
3116E87l64o22N93J32p85R3R95k67r89K67N61l51k04N82J28r49J10R28k24o49
3136d28K60K86m00k27Q43j0p61n0P49q1l28L51N2n76o4Q13j1n35m5L23k87j5O56
3159E15J5r06M3N17Q5k86L50J6p56j3P08K01o21mK13m19j3P66M5o65k85M02J18
$$ plain form
3018 791 510 -42 -55 -576 -1275 -39 1472 553 -1020 -684 39 -231 10 1131 395 -1354 -1141 807
3036 807 856 -45 211 217 -912 -818 1080 1341 -181 -761 -106 6 -309 714 1237 -468 -1309 -24 813
3055 813 376 45 470 -348 -985 83 1121 316 -366 -269 28 -423 202 796 16 -852 -489 258 126 75
3075 75 170 -358 -778 -150 579 172 -286 -38 -318 -366 254 712 130 -588 -102 219 -91 199 663 -153 -811
3096 -811 -99 619 114 -119 207 -14 -583 12 869 226 -498 47 366 -221 -68 699 135 -773 -373 587
3116 587 223 -399 194 326 -459 -366 629 362 -627 -360 201 -150 -354 228 356 -593 -483 445 221 -428
3136 -428 -168 118 -282 -509 334 324 -437 -487 262 181 -147 204 256 -320 -384 429 418 -117 -162 161 -126 -141 515
3159 515 530 -376 -333 184 269 -17 333 349 -407 -420 288 489 -132 -136 77 -342 -355 411 456 -209 -494 -92 26
3182B6j81N62k5q03k79O37N96n48j35K09l03l92Q97N23q39m95L06L71j42K36M54
3203F75q54n67N93P37k99k53J27l27n15O90Q70l09r69J83J90k6K81N24n85q03
3223f37K53P45m1Mmm69o60M39R87L2p90j70J05k51M64O24j76j073j89N72L15Q5
3245A65K09m31p96K24R23K81n26k13j82j55L93Q85q6p83n03L57J95L14N22l77
3265D16r23j91Q74L72k04j03k34o48R8J083L77p42n22P2N1J74O57J11r02p41N09
3286d16P56O7l4k25o85k84P74P97k72o39l93Q1J82O40L49n15q18q0O38M60M3p6
3308C50n04n46L72P57K00m05l24l25J5N77M88p7p22k83J47M25L43J48n71o12L7
3329e10N87L85K02n13n46k75M86P04m7k89m54k49J25P63M53m58q81j60M92K87
$$ plain form
3182 26 -155 407 382 -421 -700 -63 533 -15 -150 59 -244 -636 261 784 -55 -550 -244 127 -15 221 675
3203 675 -179 -746 -153 584 285 32 159 -168 -683 7 877 568 -401 -218 -28 -54 227 751 166 -637
3223 -637 -384 361 320 324 320 -149 -809 -370 617 649 -141 -311 -206 -457 7 631 455 -618 -807 -235 80 165
3245 165 374 -57 -853 -629 294 575 49 -164 -346 -501 -108 777 691 -92 -595 -238 -43 271 793 416
3265 416 -507 -698 176 548 344 241 7 -641 -543 540 917 175 -347 -275 -224 -50 607 718 -184 -925 -416
3286 -416 340 407 373 148 -537 -821 -47 750 478 -161 -554 -473 -291 349 698 183 -635 -715 -77 383 426 350
3308 350 -154 -700 -328 429 629 224 -100 -425 -410 167 655 578 -144 -427 -280 145 488 636 65 -547 -510
3329 -510 77 462 664 151 -395 -670 -184 520 473 184 -270 -519 -394 369 822 364 -517 -677 -185 102
3349A02K82j0m68o85K04R42J47l17l35j74m25N01Q33L3q38l81J58M28K21J67k07
3370A78m27m29O19P31j23m49j71l45L6O38M72l77o65k38L46L65K54M9l61o45J30
3391d12P09K29k32m69k23k9M12M06K6k80p00k6N61M47j13l16l52j91K35O21K32
3412E35l37n70k38M67L14N8R3l74m58N7O92L58l48m14R2l3J5M38J78m19n99K76
3434b17L34P5r1J54k63l87K40O93j9o07j74J38J67o5K94J05n55k82L96L85n7k58
3456Fj0k31j16L24M75o5q05p9K68K80K08j10n8m19k35P58K31k58k35o6j5J1L30
3479A89J40p2o09Q7K61K05k5N7j58k74j38N80J89l40j76L2O3r6K52K15j88o95
3501e01L13N39j97k23J42j27j53J32M45m2n18l6J40K04k04P4L3j13k16L11L65
$$ plain form
3349 102 384 374 -94 -779 -575 367 514 197 -138 -312 -737 -236 597 630 -208 -589 -431 -3 218 385 178
3370 178 -249 -678 -59 672 549 100 -71 -416 -380 258 730 353 -312 -550 -204 161 415 464 103 -542 -412
3391 -412 297 526 294 -175 -398 -427 -15 391 417 137 -563 -589 -28 419 306 -10 -362 -553 -318 303 535
3412 535 198 -372 -610 -143 171 229 322 -52 -510 -453 239 597 249 -165 -73 -106 -91 347 525 106 -493 -217
3434 -217 117 192 101 255 -8 -395 -155 538 519 -88 -262 -124 43 -22 272 377 -178 -460 -64 321 264 6
3456 6 -4 -235 -351 -27 448 383 -422 -501 -233 47 255 145 87 -332 -567 191 422 164 -71 -137 -152 -141 189
3479 189 329 257 -352 -265 -4 201 176 233 75 -199 -337 243 432 92 -84 -52 11 -85 167 382 194 -501
3501 -501 -188 351 154 -69 73 -54 -207 -75 370 328 -190 -226 -86 118 -86 -12 21 -92 -308 3 368
3522C68k21m18J23J38j13J34P8M5l03o1K47K19k31oJ2j08j81L60K51j89m16J59
3544a13J07K4R7J54n3m27J1L67K49m73P9K6q8n8J86K56k01l99J43L52l20j26L28
3567A21m6l71K41K38j02k97J03K79k69j86K52J52l00j88M26K59l09k24J66J43
3587H8k24J60J74j98k61L9K45J4r1J51N2j43j75L20Q6k24n5J9R3m9J10L4q3k43
3611a61lK85R1l06L0J36j29L6J38K1l11pO1K39j00j50J96n8j33J5K09l4k40OK69
3636A00j73K5J33k5l74K10J23J31k32l5K98j41j41L88j6l77p9N8L30k09OJ38j68
3659c0j87J07L36k7k38n8K9Q4p8L90k53j54k17J94J94j04j0p1P4j10J54K49j19
3682A55k64p9J13Q9M0%j97M2PJ26J51j13k5j96j3R4R8P4j80j6l7J57R2l1j70O3
$$ plain form
3522 368 147 -271 -148 -10 -123 11 89 134 -169 -230 17 236 5 -1 11 -97 -278 82 333 144 -272 -113
3544 -113 -6 18 115 269 216 -211 -200 167 416 -57 22 48 -40 -98 88 344 143 -256 -113 239 -81 -207 121
3567 121 75 -296 -55 183 81 -216 -113 166 -103 -289 -37 115 -185 -373 53 312 3 -221 -55 88
3587 88 -136 24 198 0 -261 -222 23 37 -54 97 149 6 -169 151 237 13 -42 -23 70 21 131 165 82 -161
3611 -161 -164 121 212 -94 -64 72 -57 -21 117 138 -173 -180 -119 120 20 -130 66 8 -125 -110 99 65 -175 -169 100
3636 100 -73 -48 85 60 -314 -104 19 150 -82 -117 181 40 -101 287 271 -106 -185 -127 203 -6 0 138 -30
3659 -30 -217 -110 226 199 -39 -97 -68 16 -62 328 75 -79 -296 -102 92 -12 -22 -93 -19 -129 25 274 155
3682 155 -109 -188 -75 14 54 54 -143 -101 -94 32 183 70 45 -151 -164 -70 28 102 -78 -94 -131 26 118 87 -83 -20
3708b0K1j38M15M8l07j30K0N9Q2N1J01k73k03J97L03M2k34r6L7j77Q6K64P7k66
3732d1k07R4J90K3J20r9k05l4J38J04n2k26j0Q1L0J07J00q8k41p2K73Q1j6J25
3756A75l13m3J20J67J24k43j09n9Q4J41J57m1j97j30k4L12O1m1j07j67R7M7J33
3779A44J02j77j68j25K34J77p1m0j51j48M7K09K08k82j13L5O1K5J35n5k29j10
3801b92J82J33J19j40n7j40N4M4K32J2k44q7N1J39K14j7j08k95M5K47J46p3r2
3824G3j74k7J53J63N4j54p0j55O7K25l5n7j54n2P9P7K65j15j26j94J27oP4L5j32
3849e9o1q5J85J23k5q4k08J17P8J54M5j61j94R8J1J46k3R7k96K3k2L00qq4j56
3874h9jk8K54Q0r1p4k68J69k5K44n4r3k42J75J37P6j3k18P6j81K48O3o2rk31J87
$$ plain form
3708 -20 1 -137 278 326 19 -111 -91 -32 50 101 202 -71 -274 -77 226 268 34 -62 -25 -202 -116 148 225 -41
3732 -41 -248 -154 36 59 179 80 -125 -159 -21 83 31 -195 -205 -124 -94 13 113 25 -216 -288 -15 66 50 175
3756 175 -138 -181 -61 106 230 -13 -122 -181 -97 44 201 160 -37 -167 -191 121 182 141 34 -133 -36 11 144
3779 144 246 69 -99 -224 10 187 116 76 -75 -223 -176 33 241 -41 -154 -119 -58 -33 102 47 -182 -292
3801 -292 -110 23 142 2 -55 -195 -141 -97 135 147 -97 -184 -133 6 220 203 95 -200 -155 92 238 165 73
3824 73 -101 -128 25 188 242 88 18 -137 -70 155 120 63 -91 -143 -64 13 278 163 37 -157 -30 -36 38 73 -59
3849 -59 -120 -205 -20 103 78 -6 -214 -97 -19 135 180 19 -175 -77 -66 80 57 154 -142 -119 -141 159 151 67 -89
3874 -89 -90 -118 136 216 125 51 -217 -48 -73 171 117 24 -218 -43 94 170 157 -61 15 -166 82 145 83 74 -157 30
3900C0q1J39J68k34p6k14R3J58L2o8J7k06K52L8L1j0j96M3m5K49l5P5j44p2j8
3925g4N1K2J23p3j65N8J07M9p9J8j29m6R0J63rjk16mJ26N5LP5n5k40J45N6r9K8
3953b1m9o0N0J26P1j06l9Pj28J35L2M9j86L8o5K14Nm6j32K5m1Q4J30P8j65r1o4
3980a49J89P3m3ok05Q5N7R6mj07j9k3P7l9J06N5j49r4L9P1J32n3j72R3jmM7m3
4008Io1j35J58J10p0q7O9r4lJ21k6l1q8OJ8J28j05J95r6j72J50K4q5n0J69L0n5
4035B9j34K40n5j77LQ3J8N6n2O2L2j2j08J30j8q6o6Q0l7J16m1j09J25k07J29J30
4061A31p5r4R1jq5M2Pm6Nj05J89qm7j08R1l1M6O4rJ1k10J11q2J08q2K35q2k37
4089a71J44P7M5O3p1K8j91J03K41j34k08l1J70o6Q4p5J06k88R0J64P6n7p4n1o1
$$ plain form
3900 30 -51 88 256 22 -54 -268 -175 -17 15 -53 -36 -242 10 48 79 69 -127 -84 -129 120 85 160 16 -56 -74
3925 -74 -23 -1 122 49 -116 -58 49 98 19 37 -92 -138 -48 115 106 105 -111 -115 11 66 69 144 89 -151 -6 50 -49 -21
3953 -21 -70 -130 -80 46 117 11 -28 -21 -149 -14 18 67 -119 -81 -146 68 73 27 -105 -80 -121 -37 93 171 6 -85 -149
3980 -149 40 113 70 64 -141 -56 1 97 93 -14 -33 -56 21 -18 88 143 -6 -100 -61 10 142 89 -83 10 9 5 52 9
4008 9 -52 -187 -29 81 11 -76 -7 -101 -104 17 -9 -40 -128 -122 -104 24 -81 114 18 -154 -4 20 -65 -115 54 84 29
4035 29 -105 135 80 -97 -94 -11 7 63 11 73 105 93 -15 115 97 11 -55 25 -12 104 63 -46 79 -128 1 131
4061 131 56 -38 53 52 -33 9 16 -30 -25 -130 59 51 4 -104 -13 -44 2 66 57 68 -142 -31 -113 -5 -87 148 66 -171
4089 -171 -27 50 95 158 87 115 -76 27 268 134 -74 -105 65 -1 83 8 114 -174 -84 80 156 99 25 -26 -87
4114h7J2M3J76n1k69QK71o1j14J06Jj18o2J29J28k5j57q5J11O6n0L5r4j52J41
4139i8P8J81r9j36J4q8Q7Q9J34k02j64Q1K41N8j87K00j09j21j05L71M4j21j16
4162C2m4R3j44K89o9j61k22J52K06j19j18J68K5l42J92K67j23j90n7J67j6mJ11
4185I3Rk81j8Q4J48r2J29N5k37K2J32J71k22o8p5J37k4J56j34ln4n7K28J36k29
4210Fo9j38J54KK60L7j21l72O9L13n3J03p6l07n8J81J75J19j27k85J10J02j35
4233a10K85j9k02k81J03L23J7N7k44R8l14P6L48J72l37j94K07J13o6n2J22j82
4255h0j21K56O4J0j78%J20o6l9J74J3k77j38L06P7n6M4n6j29n8K04N2J07l49K5
4280i5J42K0m4J20k12n6P1J54Lj2j64Qk03J06J85J02j66k10O1J58J56rn4j68j63
$$ plain form
4114 -87 -75 -32 144 93 -176 -168 103 42 -72 34 35 -83 -145 -16 112 87 -70 -155 -44 22 -28 7 -87 -239 -98
4139 -98 -20 161 62 -74 -60 -148 -61 28 162 -40 -204 -123 118 176 -11 189 80 -41 -146 225 269 148 32
4162 32 -12 81 -63 226 157 -4 -226 -74 132 13 -105 63 88 -254 -62 205 82 -108 -165 2 -14 -18 93
4185 93 102 -179 -197 -113 35 -57 72 127 -110 -88 44 215 -7 -75 -150 -13 -37 119 -15 -18 -72 -129 99 235 6
4210 6 -63 -201 -47 -45 215 252 131 -241 -172 141 88 191 115 -192 -250 -69 106 225 98 -187 -77 25 -110
4233 -110 175 156 -46 -327 -224 99 116 173 -71 27 -287 -211 137 309 -28 -222 -15 98 32 -20 102 -80
4255 -80 -201 55 119 129 -49 -49 71 5 -34 140 153 -124 -262 44 121 65 109 53 -76 -134 70 122 229 -120 -95
4280 -95 47 67 23 143 -69 -125 -54 100 103 91 -73 -65 -268 -162 23 125 -41 -251 -190 -32 124 115 61 -107 -270
4305b70LK02K69k99n1M1KO7R9J39j37l09K38J24o3Q9k0q1j54k5M42q7k26O1n5
4330ak7l4K01M5l10q0K83M7p8m3p9J8r4J19K15j18j60j68L07j1l3j18K03l21O4
4355a73J76Q6j13j42P8K9m5Q3O0j2j10m4J95k7n6M9r4Qn7L70j23m3j61L5J08p9
4381bQ9K9J4k56M4J61J18j48p8m7N6p4J21J04n0k28K04M3j91K0J75n8j37J76N3
4406A38j95L6M7j32k1j1lJ06l9J8J01K6j50J52j8l7k0j43L63j87j24O0RJ15j03
4431a2L7O2p1j58K52q6M7p4m5O0l4R4J51j80M6j91N4J8J0J4j5Q2k31J70m3P4o2
4458c1J55j00j6j12J57p4m2J59q1o8N1J9p2Rj49J51L8j22J32L6j5o5l8k6J88Q3
4484A67q7j51J27r2P1O0j74Q6P8K4j33O1L6L3j21J1P3J67j84m1o9j1J02n9J68
$$ plain form
4305 -270 -267 -65 204 -95 -146 -105 -103 -36 63 202 65 -244 -6 118 55 144 124 43 -111 -136 306 219 -7 54 -1
4330 -1 -28 -62 139 184 -126 -206 77 124 46 3 -76 -58 -152 -33 182 64 -96 -264 43 32 -1 -119 84 -237 -173
4355 -173 3 89 -24 -166 -88 -59 -104 -21 39 27 -83 -127 68 41 -15 34 -60 -52 -109 261 138 95 -66 -31 77 -2
4381 -2 87 116 130 -126 -82 79 197 49 -29 -76 -20 -94 27 131 81 -147 57 100 -91 -71 104 46 -91 85 138
4406 138 -57 -21 26 -106 -127 -138 -141 -35 -74 -56 45 71 -79 73 55 18 -2 -145 218 31 -93 -33 -24 91 -12
4431 -12 25 87 16 -142 110 24 71 -3 -48 12 -22 72 223 43 89 -102 -48 -30 -20 -6 -21 61 -170 0 -43 31 -31
4458 -31 124 24 8 -104 53 -21 -63 96 15 -53 -2 17 -55 -46 -195 -44 -6 -128 4 40 25 -40 -78 -104 84 167
4484 167 80 -71 56 -36 35 95 -79 7 85 109 -24 37 73 106 -15 -4 69 236 52 11 -58 -69 33 -26 142
4509A42k08K9n6OJ33r5Q3k4m8o7J47j3l8lk8o2qK67j7j69j33n0R1K27q8nj06n3
4537a46J14J68m4O3j42M8r1K1J66Oj24j1j40K50K4Pq3j41k1J20J58l4j16r7j62
4562b07K55P8p2L7r7j08m0J70O0J21k80P2j43J94R0J1j60p1q1O9K09K9j53j80
4586a97J5J92O7M6j91p6N0j6J69N3qk08k4J05J47n2n9K9k08m5K12R9m1o7j53Q8
4612g3J71J32N6j05k63k6J10J18L3r3j70N9K3M7P8p3j26l3K0K50j9p7j06j86J52
4637a01Q4J04L0k33PlR2K31j94j50j23N9J84J03n6k8j69Q7J1K11Po3j48j15R4
4662g9J72J73j45q1j53NK57R6k7k38j19J40l7K53p0k09j52Q3J39O7K66m13k21
4685b93N6K44l1K08k34p6k1j6K69Q7L9k08n3%KJ51Q9k56j25j0J77RJ58j51k02
$$ plain form
4509 142 -66 -37 -93 -87 46 -49 34 10 -38 -105 42 29 -9 -12 -40 -102 -110 157 140 -29 -162 -212 -121 106 18 13 -93 -146
4537 -146 -32 136 92 155 13 61 -30 -9 157 163 39 28 -112 138 162 169 86 -55 -76 44 202 168 52 -45 -207
4562 -207 48 126 54 91 -6 -114 -154 16 76 197 -83 -11 -154 40 130 141 -19 -90 -171 -102 107 136 -17 -197
4586 -197 -182 10 77 123 -68 -144 -94 -110 59 112 104 -104 -128 -23 124 72 13 42 -166 -211 1 100 59 -8 -161 -73
4612 -73 98 230 286 181 -82 -108 2 120 153 60 -110 -51 -28 19 97 24 -102 -135 -115 135 116 39 -67 -253 -101
4637 -101 -17 87 117 -116 -109 -112 -20 211 17 -133 -256 -197 -13 90 34 6 -163 -76 -65 146 153 90 -58 -173 -79
4662 -79 93 266 121 40 -113 -108 149 245 218 -20 -139 1 -36 217 147 -62 -214 -131 8 75 341 -72 -293
4685 -293 -237 7 -24 184 -50 -126 -147 -163 106 193 232 24 -29 -29 -27 124 213 -43 -168 -178 -1 8 166 15 -187
4710a87l8J02L94jk88l6o6Q8O4M5K7j69j75J80J31K40j74j24j71L0J64R0R0k97
4734h1k25J67K02QJ07j10j57j31J02L22J4j18j53q0Q1J07K17k15j54j42J49J45
4756E5M8j18n1r5j8L8L25Lk57j67J31J59N6Q0k7l31m0K23K11j46j3k21N4k4K67
4781A42Q1j90k35J27ON4K26q1j52j82P4J48J10K0p8k78o6J66L07M6k05k01Q8j9
4805i2J88K3L4k67o4N5R9K86k19j00J4r2K43l6J05k30q2K8J6K58j01mj09j74J67
4830e4K12J36l20l5J07j2N6M5j6k05kM2K52m4j86k4k1J7N4J65j23j13q5J63R6
4855A05K3n7k5k45LJ98J02q8j80oK2l9K98L3k4k24m6K19K6q4n0Q9j79Q1J60O7
4881A79j41r7m1o4M5J60N0N2k53j8J79Kk5PJ3j36jJ37R2mk86K38j9l6j3J58l14
$$ plain form
4710 -187 -225 -123 271 270 -18 -54 -120 -32 32 77 104 -65 -240 -60 71 311 137 13 -158 -128 36 126 216 -81
4734 -81 -306 -139 63 71 178 68 -89 -220 -118 204 218 100 -53 -133 -52 55 272 57 -97 -239 -90 55
4756 55 103 -15 -66 -161 -179 -141 184 187 -70 -237 -106 53 109 189 162 -169 -209 14 225 79 66 -155 -101 -125 142
4781 142 223 33 -202 -75 -69 -15 211 130 -22 -204 -130 18 128 148 70 -208 -274 -108 199 245 40 -161 -73 -92
4805 -92 96 119 153 -114 -178 -123 -24 262 43 -57 -43 -135 108 72 177 -53 -135 -107 -91 167 66 62 -47 -221 -54
4830 -54 158 294 -26 -61 46 34 90 135 119 -86 -88 -46 206 162 -24 -48 -69 -52 2 167 44 -69 -154 9 105
4855 105 128 71 46 -199 -196 2 104 16 -164 -170 -148 -187 111 144 120 -104 -150 69 95 11 -39 50 -129 -48 112 179
4881 179 38 -59 -100 -164 -119 41 91 143 -110 -128 51 53 28 35 48 -88 -89 48 140 136 -150 88 69 33 20 178 -136
4908a36l6J14n3K19j96N8K3j8l5J58O7k20n6J33k0q6l7J45p6k05J24K74k7j18
4932dQK2o0OK08K0l34m0J93M6j13J47n2k9j40J33Q4q2O6p7m7N3J06n3J33k14j19
4959a39J34p1J34m0QK6j41J6K49m0j60n0N5MoM6P5j07j16J24O1j04L8P6m1j12
4985h1L5M9J8l2q5J46j23j2M8J80l7j20q5K63j85j0J46j45mP0q6R2nj5Q4o1%J21
5013A66j21r0j38J31J61r6jM4o3q7O2J81k39rM1R3r2J9M7J05k74J01pJ83q4m1
5039hokp4R1J11q1P8j83O1j19J69J26o1j81l5P0J69j05j3m6Kj55K51J14p3j29
5065b9KK9Q4m8N2j01p8l4J80K7Qk18J5oJ23J39j1k05mN8N6j0Q3j46l1jj4K13M3
5094A76j67j36lJ23J23qO6j55j75M2K98nm4m5j14j24K11J03M8j43j60J36l6N7
$$ plain form
4908 -136 -172 -58 -111 108 -88 -30 -7 -25 -60 98 165 -55 -111 22 2 -84 -121 24 -52 -257 -133 141 114 -4
4932 -4 4 26 -34 -28 180 200 -134 -174 19 65 -48 99 47 18 -122 11 95 13 79 2 -45 8 114 61 194 -20 -139
4959 -139 -5 -76 58 18 26 52 -89 -73 176 136 -24 -74 -19 -15 -21 25 100 -7 -123 1 62 -42 -4 72 31 -81
4985 -81 -46 3 21 -11 -96 50 -73 -85 -37 143 106 -14 -99 164 -21 -31 115 -30 -34 36 -50 42 37 22 106 45 45 166
5013 166 45 -45 -183 -52 109 13 12 56 -7 -94 -32 149 -90 -99 -58 35 -57 -38 9 114 -160 -59 -66 117 33 -8
5039 -8 -14 -16 -90 1 112 31 109 -74 -13 -132 37 163 102 -79 -114 -44 125 20 7 -39 -37 -192 59 173 100 -29
5065 -29 -27 2 86 38 90 -11 -89 -123 57 84 92 -126 -111 -117 6 145 134 -71 -75 -17 39 29 112 -34 -65 -66 -80 133 176
5094 176 9 -127 -130 -7 116 108 174 19 -156 -114 184 179 135 90 -24 -148 63 166 214 71 -89 47 11 68
5118F8J40j74n3k24J50L59k27O5r5j25J11K9J77l9j49l03J62K21J9J3q8k04j9
5141a86J62J50L8k02K0q6M2N4J69kk64N9j0Q5R6l8m4j09j01Q5K59j9m6k61K42
5166I3J7j01J42m3k83OK52LJ47k52k08J02L1K08J25n8l92l7J84J49O1Pk33j35
5190b15J1L06M4j47n0mr0J17K28j0r2j92P4p9J31J63q4j81q4J74J22J63j95j30
5214b0o5L5J27N1L0k14m4N6J56J33j95j41N2j08J43J76m7j87n2l8nL33P4k43j50
5239a43o0J44J44J1l5l09J61k2K80M8o9j16k30q3K28J87o3p2j59N3J24K64j49
5262A34j16j31NO6R0K31k07k72RJ70K22J8j44j85o0l6K67J14j63n9q3K0J95N3
5286A38nj09j64P7P2OJ65j11j21j26J37J79k4j04l07J56L4J78k7l7j99o2J10J61
$$ plain form
5118 68 208 34 -19 -243 -93 266 39 104 9 -116 -5 24 201 162 13 -290 -128 93 112 125 37 -167 -186
5141 -186 -24 126 164 -38 -18 -104 -62 -8 161 159 -105 -46 -56 29 125 87 43 -66 -167 -82 177 158 112 -149 93
5166 93 110 9 151 108 -175 -169 83 86 233 -19 -227 -125 -94 114 239 181 -211 -248 -64 85 146 153 -80 -215
5190 -215 -204 102 146 -1 -51 -55 -145 -28 200 190 98 -94 -20 -99 32 195 111 -70 -154 20 142 305 110 -20
5214 -20 -85 -50 77 128 158 -56 -100 -44 112 245 50 -91 -39 -147 -4 172 125 -62 -114 -152 -157 176 250 7 -143
5239 -143 -203 -59 85 96 61 -248 -87 -109 171 219 150 34 -196 -279 -51 136 73 1 -158 -105 19 283 134
5262 134 18 -113 -108 -42 48 279 72 -200 -191 -21 201 219 75 -110 -170 -206 61 175 12 -47 -130 -110 85 138
5286 138 133 24 -140 -63 9 15 180 69 -52 -178 -41 138 114 10 -297 -141 -107 71 44 7 -192 -254 -144 17
5310A7J49o0j76r8O1J16K55j07k27j06J2J96L1J20k63j5j22J62J37J73k38j47
5332a30n2J21J01J7R0j84j37R3J76J16j05j33p4L1Q9Q8K7j68l8o8J20J08J8J9
5356A25k73oK50On8j4l2n3j91K81K0j00J6k6k7N4K12Lj30j79n3J28J24L7j88R6
5382B2k3L4L7J16j84p6N3n4J28R5j23q7l4J39jK0k2j99J06J38r2K55k19k8p3r
5408h1J51J0k1r3L4r6K9J72j1L0j45j4n6R9j2k1mm9rJ31j8J9Pq9R8k12L11k3j21
5437A6j08J02n1P6Q8m6j43M1P2J3o0K16j87n2j0N2R2j29j6N9L8n4J00l1p1r3J68
5464H2j00j6R5j08o3m8OK25j6qn1n0oK3Mj8P0o7m4J7R5N5j34K5p9M3o8K24P9k40
5494g3J13MN1m9p1J09n0Kr9J44K6j40Q0m6n9M7J06j04l5n2O5PJ14j3lr7r9K15
$$ plain form
5310 17 166 106 -70 -168 -107 9 264 157 -70 -176 -164 32 63 183 -80 -95 -217 -55 82 255 17 -130
5332 -130 -182 -61 40 57 147 -37 -174 -81 95 211 106 -27 -101 -70 19 107 134 -34 -72 -140 -20 88 106 125
5356 125 -148 -154 96 102 44 30 -2 -55 -246 35 55 -45 -29 -55 -82 -28 184 187 57 -122 -175 -47 77 114 -74 22
5382 22 -1 33 70 186 2 -74 -21 -75 53 148 25 -62 -96 43 42 62 40 -159 -53 85 -7 248 29 1 -72 -81
5408 -81 70 80 59 -34 0 -96 -67 105 94 124 -21 -35 -91 8 -4 -25 -29 -78 -87 44 26 45 52 -37 61 -151 160 137 16
5437 16 -92 10 -41 35 123 77 -66 -25 47 60 0 216 29 -23 -33 19 111 -18 -34 25 63 9 109 78 7 -86 82
5464 82 -18 -34 61 -47 -110 -158 -152 73 57 49 -2 -52 -58 -35 -31 -49 21 -46 -90 -73 22 77 -57 -32 -111 -68 -136 88 167 -73
5494 -73 40 44 95 46 -25 84 34 36 -63 81 107 -33 47 1 -58 -11 95 -9 -44 -96 -31 -24 90 77 74 -23 -122 93
5522I3Lj63J29N4k37k0K34lj65r8J54j76J07J76M9j45r0%K18j03Q2m4j49m5J50
5547A1Q4k9J8j91O0J59K0j5Lj81K7M6J75j06O5r9j01K6J48J30o5l17J07n6R3J1
5573B3R7N4k88J43j58L33j25m4k56R4J45J6R4k5q9j84J26J33kl4j32j56J7K30
5597A2J87n5j63n5O6L9K1J08j65m2j30N2J98N7p8r8n1M5Q1J74o7j76r9J20R1M3
5623A15M8j13j66J9J15P6k7Nk18Q2L9Q5Ro4k02nJ19mL08k18jj12OQ5J67k9k49
5650a30K8K3J16Q1R1k18k12mR6K90l3j61j92R6J48J03o5K8k74LK54k4Q5J9j49
5675ak59J46L09k7j36q0j5n7J32L08k22j9j89j3J46M4Q8j30j60l9J47J53P8k07
5699ck29P9J03J79R8j10k52j28J84J82L3m7j24q7N2K16N3n4k59j21P0K25Q8J57
$$ plain form
5522 93 96 -67 62 116 -121 -141 93 90 -75 -173 -19 -195 -88 88 137 -8 -98 -98 120 17 99 55 -94 -139 11
5547 11 95 66 84 -107 -47 112 132 117 120 -61 -34 12 187 81 146 47 -54 -28 120 250 185 -132 -25 -81 12 23
5573 23 120 174 -114 29 -129 204 79 35 -221 -127 18 34 128 103 14 -170 -44 89 87 53 -79 -235 -218 12
5597 12 199 144 -19 -74 -8 31 52 160 -5 -47 -177 -125 73 130 52 -46 -97 -52 29 203 136 -40 -139 -19 72 115
5623 115 163 50 -116 -97 18 94 67 72 -146 -64 -25 60 69 5 -197 -202 -83 -87 221 3 2 -110 -104 -19 148 119 -130
5650 -130 -102 -79 37 118 209 -9 -221 -225 -129 161 128 -33 -225 -129 19 122 57 85 -189 -186 68 44 129 148 -1
5675 -1 -260 -114 195 168 32 -48 -63 -120 12 320 98 79 -110 -123 23 67 155 25 -135 -174 -27 126 204 -3
5699 -3 -232 -153 -50 129 227 117 -135 -263 -79 103 136 89 -35 -122 -70 146 199 145 -114 -235 -165 60 148 305
5723C05l24j54J9Q5K40r9rj43j0P7J37P9n0m58J19J08K15k8qj69j18J9K88M1K9
5748A91l21k6L7K46O6nj79k20J23J58P2M2j55J2k78J65K69l9j66q6k4J47j8J48
5772A59P0k61j10O0J50J03M3j85j50R2J00N4j23Jj04J02LM4M7q2j54O8J9K33j22
5797E7r7k3j84K47p7K85k9j76p3n1K12O5j28r9l7J5K23L3M6k96mq3J11J61M3k3
5823A18k43q8K48J19o2m6jj31N1P9qj0j39n4M2K12r9K9J4j43L5J51p7J24j49J8
5849a0k0J8J9PNj04LP4L3R6j53j0K2L9M8n2O1j02K6o2N1J36j09o1k6oJ16l7O0
5878F2Q2k40L7J67l5j03j1r5jJ70l0q8J43r7q6P4J02M2r6J0J25j52P3k1j37j2
5904a17J03R7q7JJ7k7k1p1J88o2l8j7J33j46n5J9K25j96K4rm1K29r3p1J23k08
$$ plain form
5723 305 -19 -173 -154 -69 171 72 63 -80 -90 -13 124 203 153 -305 -186 -78 137 109 101 -68 -186 -167 121 162 191
5748 191 -130 -156 -119 127 193 188 9 -211 -88 70 142 184 29 41 -237 -72 197 158 -8 -94 -118 29 11 159
5772 159 229 -32 -142 -82 68 171 214 29 -121 -29 71 125 2 3 -101 1 4 48 95 13 -141 -73 -54 179 57
5797 57 -40 -63 -247 0 -77 208 179 3 -70 -121 91 156 28 -71 -108 -93 130 163 209 -87 -91 -174 -63 98 141 118
5823 118 -125 -213 35 154 92 46 45 -86 -35 44 36 26 -113 -167 -125 87 -12 17 31 -112 -77 74 -3 121 -28 -10
5849 -10 -30 -12 7 14 19 -85 -82 -8 25 121 -32 -42 -20 19 67 15 76 -26 0 -62 -11 125 16 -45 -71 -77 39 2 62
5878 62 144 -96 -59 108 73 -30 -41 -136 -137 33 3 -85 58 -39 -125 -51 51 93 -3 7 132 -20 53 32 -105 -117
5904 -117 -14 83 -4 -3 14 -13 -34 -105 83 21 -17 -34 99 -47 -102 -83 142 -54 -30 -39 -80 149 56 -15 108 -100
5930a00J08Q6m0J4j9K4n4m9P5R1k05P4L1j9j1om1M1m4j9M4R4l2j25M1j24K02p9
5958d2O2j0p4j2J8J24jo6M6j61J63R6l2M1j96p2J96k0p9R9L7j3m7n2QJ7q0J82
5986A32j31M6Lo7K38j79o4k0j5P9k2j1n4M6k7J26l0O5j31L0N8o9m4J87k08M9P
6013fO1l4R3j01jll8J17r8l9J24j43j5M6J45n9p5J0JP0m1J23o9qr7O3N3p2J2Q
6043B7M1n5j1J12p2j15P8l1O1JK24k73j3n4J33J72k03j7n2j00J78J6j2n7j15r3
6069b30J91M7j7rj27J5J0K65n9j17o4O4p4J28J46r9j2j67J23l2J01jj64k4K9J15
6095C8k3M3p3N0k12O9J00J83r4j02q6lJ30k1j0Mk4nj9K01j5k34P7q5N9J49p7j47
6123a27P3j10J19J46n1n2j24J04m0J23Jq7r7K8r1K28%Pp8j01J38J8J1r7l0Q6o3
$$ plain form
5930 -100 8 94 54 68 49 73 19 -30 45 136 -69 5 36 17 6 0 -41 0 -44 -63 -19 75 43 -82 -41 -165 37 -42
5958 -42 20 10 -64 -76 -58 66 65 -1 45 -116 47 143 111 152 -44 -116 80 60 -19 80 117 104 57 5 13 30 -50 132
5986 132 1 47 50 -17 221 42 -22 -42 -57 22 0 -11 -65 -19 -46 80 50 115 -16 14 72 3 -41 146 -62 -13 -6
6013 -6 55 21 114 13 12 9 -29 88 -10 -49 75 -68 -83 -37 108 49 -26 -16 -15 55 14 137 68 60 -37 26 79 7 19 27
6043 27 68 13 2 114 42 -73 5 -26 35 36 260 -13 -26 -80 53 225 22 5 -47 -147 31 47 35 -22 -137 -230
6069 -230 -39 8 -9 -18 -145 -130 -120 145 86 -31 -95 -31 -105 23 169 70 58 -109 14 -18 83 82 -82 -106 -77 38
6095 38 15 58 -15 35 -177 -108 -8 175 81 -21 -107 -110 20 -1 -11 -7 -31 -36 -55 146 131 -103 -26 -111 -52 97 20 -127
6123 -127 -54 -164 -45 101 50 -2 -126 -22 -62 61 62 -25 -122 -94 -185 43 43 50 -28 -129 9 27 38 -59 -89 -3 -66
6150f6R6L9J12j67j4m5J4J41l3k0j70R6p7J31N3m3n8q6J52l0nJ33j99k5O1J5K4
6177B9l3np5J7j6J72k7j49J0KJ84J3n9l1q3j7J02J8m1P6j36p1J01%Q7j09k3O7
6205Cl6P2j03J20j45N4p8Q9K5L9O3j38L8L2J1J68o7j33p3J31l7N1j16K7o0L7J29
6232A03j6r7j08O6k9K3J11K4j57p0j5K27q1M3j11r3J09J50m3j39J52k12Q4J4J21
6257E6N1j86J18p6O4M1K3%j02q8j1J43O8l1p2k4R3N4r5j3M2r1J9JR1l5k8k03J36
6286e5L1R2M5j37N1n5m4J18J7l5l3o9n2p0K63J0j55%J69k08K14j33P9p0NrJ22
6313I1q7J7K1o4Q7m9P9j60J92j65J9R3m3N0n0m2L0nJ61j11O4j37j10J41j8J18
6339A22k70J15J3M3M3j21l2J96j53M6P3L9k5P0k33J26p0n6J14qq2j03J55J3j3
$$ plain form
6150 -66 30 69 181 14 0 -45 -31 110 77 57 -113 -17 -94 37 90 47 -11 -97 55 25 20 153 -46 -71 -10 5 29
6177 29 -4 -9 -84 -67 -83 89 62 -87 -77 -75 109 122 63 32 -51 -68 34 52 11 87 -49 -120 -19 -19 68 -41 -64 3
6205 3 -33 39 -64 56 -89 -35 -113 -24 1 40 103 -35 3 35 46 214 147 14 -59 72 35 86 -30 -3 -63 -26 103
6232 103 87 -10 -118 -52 -81 -58 53 77 -80 -150 -165 62 -19 24 -87 -180 -71 79 36 -103 49 -163 -79 -65 56
6257 56 107 -79 39 -37 27 68 91 91 -11 -99 -110 33 101 70 -2 -26 67 121 26 13 55 -36 -17 -16 75 40 12 -191 -55
6286 -55 -24 68 113 -24 27 -28 -72 46 63 28 -5 -74 -126 -196 67 77 -78 -78 91 -117 97 -36 43 -27 -22 -31 91
6313 91 4 21 42 -22 65 16 95 -65 127 -38 -19 74 31 81 31 -11 19 14 175 64 128 -9 -119 22 4 122
6339 122 -148 -33 -20 23 66 -55 -87 109 -44 2 75 114 89 159 -74 52 -18 -74 40 32 -50 -153 2 15 2
6364Bj3L5n7rQ9l8p0J06O4l4k4l4J5K3o1OLK6QJ9o0J20j46J02m9n0J2J04n9n2
6394b2o2J50k2j11N5P2p0K6o9qJ17o1k5j19J00Q4k8M8qK3j65J53K3q9M6M6j10
6421b6L4k8L2O3m4K7l2l5n7Q0J5L4j23J10P5l2j71J11M2o0K3J07j54M8or5J28
6448F6n3m7o3j8J34q0J41J2j37J23L1j82J00r9J31l2j0m1P5O8j79J6Q9pr1J77
6474A24j38k7n6J59j15J14J2j19L9JQn8j25J73O0N8j12J06r7l5%J0r7P9J15o5
6500A4rN2J02r7j34P3p0J85j50N9p5M3L2l1k7j6J30n2K7r3j11R6N4o6N1MJ0n5
6528e4R7r7O2n2l0j1oJ54j56J53O7j24r0J61k1j22J27J3J7k01R9L8J0J77j71j12
6554g2J25q4J16o6k6N8K6n7rK5l2o9J76l3j12P7o6pN5o5M1m6J57L4j88J17j81
$$ plain form
6364 2 -11 24 -33 -42 47 9 -61 45 109 75 51 17 32 55 -6 0 3 29 37 56 -4 116 -30 72 23 -27 -15 89 30 -22
6394 -22 -84 66 44 -67 -12 60 -10 16 -53 -61 56 -5 -30 -149 -49 35 7 55 47 70 -95 58 81 -8 38 84 -26
6421 -26 8 -20 12 75 31 58 26 -9 -66 14 29 63 -60 50 125 93 -78 33 75 15 38 145 -9 39 33 -62 66
6448 66 13 -34 -97 -115 19 -61 80 92 -45 78 109 -73 27 -72 59 27 17 -24 51 119 -60 -44 45 38 -53 124
6474 124 -14 -41 -97 62 -53 61 73 -46 -7 -6 2 -56 -181 -8 52 110 -2 104 7 -28 -28 -18 -115 -36 79 14
6500 14 5 57 159 62 -72 1 -69 116 -34 25 -50 -7 25 -6 -33 -49 81 29 56 -37 -148 -52 2 -64 -13 -9 1 -54
6528 -54 43 -54 8 -44 -74 -85 -91 63 -93 60 127 3 -87 74 53 -69 58 71 88 -113 -14 24 34 211 40 -72
6554 -72 53 -31 85 19 -7 51 77 20 11 36 4 -65 111 78 -34 43 -23 -30 25 -40 1 -45 112 146 -42 75 -106
6581a06R7o3J52j0j8j59J29j1K4M2p5k7k1K0o0J19J14j32l2J10j46J8J20q5q9
6606h9%J80k4n4Jj4Q6k54K04kR3j53L4R0l3j67L5J57j90N4qO3KM0kkJ25j48kj09
6636h7Q4m0Q1r4P7P0j30q0P3N2qj8Q3j35N5k0J22n2k6Ok6J42j36J04k13J41o0
6663c5K3M4J9j4o6MR2k3Pr9n1J00J3K5Q2l3q5j29J31J4O7j24P4j04J37q6M1r5
6691g1rj27Q6J23J01m2j30l4J74K1j38J65j21k0Oq9J41J31j51j53mN5L0K41j35
6716E0j4j30J03m0N9l3j5k3k5K08j83N1p0O5n1N4n3R8p8q1J39k3k6R9o4j21O1
6743d3O9nM9j4l7l7m3J04m3j49K09p0j10R9l3R5r4J9p2P5J05Rk32J60j01O1J55
6770A26j2k18k9J60n1L2J27l5j97Jk2J44k5r0p5J83J2K3j44J72j43M1q4J16L4
$$ plain form
6581 -106 -9 -72 80 70 52 -107 22 11 35 77 2 -25 -46 -26 -86 33 147 15 -17 93 -53 -35 85 0 -89
6606 -89 -89 91 67 13 14 0 86 -168 36 34 127 -26 8 98 65 -102 -67 90 -100 -46 -54 9 11 51 49 47 172 24 22 -87
6636 -87 -3 -43 38 -56 21 91 -39 -119 -46 6 -2 -20 63 -72 -17 -37 85 33 7 13 -13 129 -7 97 -116 25 -35
6663 -35 -12 32 51 37 -29 -25 67 44 51 -48 -99 1 14 39 121 88 3 -126 5 19 86 -38 36 -68 69 -17 24 -71
6691 -71 -80 -207 -121 2 103 61 -69 -103 71 92 -46 119 -2 -22 -16 -105 36 167 16 -137 -141 -86 -56 185 50
6716 50 36 -94 9 -31 28 -5 -20 -43 -68 140 -43 8 -62 3 -48 6 -47 51 -27 -108 31 8 -18 81 17 -104 -43
6743 -43 26 21 70 56 19 -18 -61 43 0 -149 60 -10 -120 -21 -54 41 -53 -34 -106 -31 74 83 -149 11 -90 -29 126
6770 126 114 -104 -133 27 -24 8 135 100 -97 -96 -118 26 1 -89 -164 19 31 54 -90 82 -61 -20 -104 12 46
6795D6lj4o2L4j24R3JJ09j9j47R7R4j18j0K7P0j62J13J64j40q8J04J0rOK3j63
6822f8Q8p1OJ42l1N8r6j52J46Q9n7j61K8Q9L5Q9j7j17o5r6K38Q1j56L4j52J31
6848A5j59J97l1r1J05p6J0K6Qm4r1J91j83PR8Q4j50Q6J3j0J26k7k3K5j12o8J24
6875E0j08Q6n1K6qO7N0j9Jj53J15%q3P6q8J1M6L0Q3j10pq5J9K3P7r6O9R7j16q1
6905g9l5K14j98J36j40J39o2J1k1%P0j19J22K6r8P7l7J68j13j93J24J0O8j06m3
6930g9J30j41O4J59j62P8j03N6j2kR7j20n6J54p9P5q2O0q8J00K2q4O4j34l7N1
6956f9O9l6nl8p8O3O0L8k7J84j17q8k1J2J16j68N7o4J40j11J36J2M4k04O0j4j6
6983f5R1K1o7jk2J30n7kOj12J8J70k19J56m6J7j36J48P4k18N4M8q2J51n0L4k1
$$ plain form
6795 46 43 29 -33 1 -123 -30 -29 80 61 -86 11 105 -13 -23 4 74 -88 25 189 49 -39 65 75 66 72 95 -68
6822 -68 20 -51 -45 97 66 124 28 -124 22 111 54 -107 -79 10 45 134 117 0 -65 -161 77 158 2 36 -116 15
6848 15 -144 53 22 -69 36 -40 -30 -4 4 -40 -131 60 -123 -116 -18 66 -84 2 15 5 131 104 81 106 -6 -74 50
6875 50 -58 28 -23 3 -5 62 112 93 94 -59 56 56 -27 49 -39 -28 18 48 131 21 14 -71 -52 -29 48 -48 21 118 2 -79
6905 -79 -114 100 -98 38 -102 37 -25 -14 -35 -35 35 -84 38 64 -34 43 6 174 61 -132 -8 2 70 -36 -79
6930 -79 51 -90 -26 133 -29 49 -54 2 -10 -12 85 -35 -91 63 -16 59 -23 37 -51 49 71 -13 51 -83 -120 -69
6956 -69 0 -36 -41 -79 -157 -94 -34 4 -23 161 44 -44 -65 -53 63 -105 -48 -112 28 -83 53 65 109 -95 -35 -49 -65
6983 -65 26 47 -20 -21 -43 87 30 28 34 -78 -60 110 -109 47 1 18 -118 30 104 -114 -60 -12 -94 57 7 41 20
7010B0k12J36M7M1J0J1p7j12J67N9o0p2k8o5l7R2J11l2p6n3PK25j27M7J9j76J66
7037C1k5P9j04m2kJ0q3J83J69j71m0j5m9J65J3Jj84l9m6K57K6q1n5j45k3J32L0
7064hJ00p0J2q9M7J1kO6j23J2p2J67m8q8L5q5J40o1J63j37P4k03J00J85n2Kj52
7091g6J5R7j02J98p6j22oP6N1J38nj89j26m3J67J49Ln7k46l9K18M6k2j0k4j26
7117a11L0K08J6j67rj03J06Q0N3j36n5l7m1J82J1J17k23pp0J68Q6m3j8j67j0Q0
7143f0R6R3l6j75k9M6j4J55l4j24k2J47%N0j0n6r3L6O9N0J91j96j06j11O3J12
7169D2J50j16j78J25M7p7J58k15M1MK3Q3o3M6n8j03J4lN7Mj51Q2o9J17Q4N9o8
7196C5j67k0R1Q0O3o8j49M2K4J39k7M7k17q6K35N3o9J00l9n7m0J04Q3k0j48l1
$$ plain form
7010 20 -192 -56 -9 32 42 53 -24 -136 31 90 30 -42 -70 -135 -172 -80 31 -1 -77 -130 -123 102 -25 22 41 -135 31
7037 31 6 85 -19 -61 -63 -53 -136 47 216 45 5 -10 -59 106 119 120 -64 -103 -149 108 134 53 -2 -147 -170 -38 -8
7064 -8 92 22 34 -55 -8 3 1 67 -56 -44 -116 51 3 -85 -50 -135 5 -56 107 -30 44 -159 -59 126 74 76 -76
7091 -76 -61 36 -66 132 56 -66 -72 4 55 193 188 -1 -127 -170 -3 146 149 92 -154 -193 25 71 49 39 15 -111
7117 -111 -81 127 143 -24 -33 -136 -30 50 103 -33 -88 -125 -166 16 27 144 -79 -86 -156 12 98 55 37 -130 -140 -60
7143 -60 36 129 93 -82 -111 -65 -79 76 42 -82 -104 43 43 93 83 27 -66 -30 39 89 280 84 -22 -133 -70 42
7169 42 192 76 -102 23 70 -7 151 -64 -23 -19 4 87 24 70 12 -91 -77 -80 -23 -19 -170 -88 -157 -40 44 103 35
7196 35 -132 -152 -61 19 82 14 -135 -93 -69 70 43 90 -127 -213 22 75 6 106 67 10 -30 74 157 137 -11 -42
7222d2k7MK54o1o6j24m0R8J74j09n8Op1O9O4R3j27j83J10j12J97p5J01r2j55J8
7248a54J89R8n9j64r4J42J59j17J39j89o3j4J12R0rm8l7p6J31M8L0J4q7j18L6
7273d1J57Jj34p9J14j06K82r0o5M0j17P0l6J33m4j37m2J01o6qK21k96O6o3j0K32
7299H3m8j59o7M2N1J53o5J46l04J54j18Q2L0O1k6j05l6J02Q4mL3p0j47J97O5j15
7325A9L0JJ3n3J23j02J21k04J7K0R9K5p1o2j07J92r5J14m7o9q0J32l6q2J53j21
7351g0M6J5J0j31J35j27j9P4J20l7oMp7oP3k1J58q4kj46%J30n5K0p2J9j4J01j70
7380a32J92M6m9o0Mp0J80r0J11p9K2j7j15N7K0l8M9O8J4j05k5K03k35J1p9J62
7406D5J07j40J0k7j42K6R4J25j04n5P4m3J96l02L1J29p6l4pJ26L9o3O8j33l3J82
$$ plain form
7222 -42 -69 -65 189 128 62 -62 -102 -4 170 61 3 9 -62 7 71 164 37 -146 -36 -148 49 -26 75 -17 -172 -154
7248 -154 35 133 74 -90 -184 -42 117 0 139 -50 -113 -127 -15 75 66 18 -19 -95 36 84 114 128 41 -77 -41
7273 -41 116 117 -17 -96 18 -88 194 104 39 79 -38 32 -4 129 85 -52 -94 7 -59 -67 154 -142 -76 -139 -149 83
7299 83 35 -124 -191 -149 -98 55 -10 136 -168 -14 -132 -50 -20 41 15 -90 -126 -24 60 56 89 19 -128 69 134 19
7325 19 49 50 63 10 133 31 152 -52 -35 -15 84 109 38 -24 -131 61 -34 80 33 -36 -116 16 -20 -102 51 -70
7351 -70 -24 -9 1 -130 5 -122 -141 -67 53 16 10 14 -63 -69 4 -17 141 57 55 -91 -91 39 -16 4 -68 -49 -63 38 -132
7380 -132 60 106 57 -3 1 -69 111 21 132 53 75 58 -57 0 20 -18 31 99 113 8 -17 186 -49 -38 -117 45
7406 45 152 12 22 -5 -147 -121 -27 98 -6 -61 13 -30 166 -136 -105 24 -52 -86 -93 33 72 9 77 -56 -89 93
7432I3kj34k9J70j69K22o6Lp8oj5J62p8j8j58J15Mn7Q4m7l4N5P6O5k00Q6j6J4
7460D2j13L2J24j1l3o2j00J67K6n7P3k28Q0O0N1m2Lj17K0M3J9J07l4l6o0J02K8
7487H4j41J00j5Kn4n0J79o3j10O3M1o6K08n8J2j27j59R2J45Pm3o7j09N3J80O5
7513A69j44L6j43n8J83J28j10M1j82r4K42k6k0k03J31j97K35J35j01k7m1J5J25
7536I4rl1r7k8L2Q1J43r6j19l3K8m4J34j6k1o9L7r3J39J0J04k56J36n2J38O1j26
7563D7j15m8J24m3R4l8jj34L9L5J05Rj17M9q0J24j31O5l0j5r2J77J7J0j51j1Q6
7590b5mJ9O5o2O7j39M0J14j7J00j34j26L6O1O9P8j98M8j5j5K86j75m9o1n5M3J71
7617A22r7%N3j57J4J33M1Lj20j47Q6P8O5j11%L0j16J75m3ll9j08Q7N9P0rm7j55
$$ plain form
7432 93 91 -43 -72 98 -71 151 85 88 10 4 -11 151 73 55 -103 12 16 -41 43 -4 -38 17 93 158 -42 44 28 42
7460 42 -71 -39 85 74 41 -21 -121 46 72 15 88 -140 -60 0 51 9 12 -105 -85 -42 -23 84 50 14 -46 56 84
7487 84 -57 43 28 30 -24 -74 105 42 -68 -5 36 -30 178 120 132 5 -154 -62 83 90 47 -20 -129 -76 104 169
7513 169 25 61 -82 -140 43 171 61 102 -80 -174 68 42 22 -181 -50 -247 -12 123 22 -5 -46 -31 94
7536 94 85 54 -43 -71 -39 42 185 89 -30 -63 -35 -79 55 39 18 -51 -14 -107 32 42 146 -110 26 -26 112 173 47
7563 47 -68 -116 8 -35 59 21 20 -114 -75 -40 65 74 -43 6 -74 50 -81 -16 -46 -61 -153 24 41 51 -100 -111 -25
7590 -25 -29 -10 55 -7 60 -79 -39 75 58 158 24 -102 -66 -5 64 142 -56 -8 -23 -38 248 73 24 -37 -92 -49 122
7617 122 25 25 78 -79 -65 68 109 112 -8 -155 -69 9 74 -37 -37 -7 -123 52 9 6 -33 -141 -54 5 75 66 19 -136
7645a36j3J02P4P8j2j55r0J10J26j52K1m1L9N1O5J13j12r4k1NJ66om7o4Q2j14
7671b5J6J15J5j8k75J34jN3J03j56L0n1N6ON9o4K5r0L6J38j2J3q3k7k55L04O8
7698A14n3j2k21J38lQ7R7k48Q4m2K1nJ67n9k42J55o5J61J12k1k41%QJ02N1J2j04
7725gPK2K5J09Lk77J51m8r9J76J9q2J21p3j00J65L1j28j15NQ1pJ47q1j6o4K2n
7753a8k2KJ2L8n8J18j3kj06p5P7J74j62J26j39M1j91J68Q6k3K3r5o8P2Q1M1o8
7780A9j51Q8o4J25o4MJ3l8R3j20K27p8M4k08K04K4j52R4qo5j0J7M7m2M9n4j33
7807a39J67Pp5J10j61Q8oJ00o6n9j2l6J6k3J05k3j0k1j2O8qk9p5P4k5M8J42j23
7835B2r7J83j51n2K6mJ53j40N8O6K8q7l0q5J10O4J0j15J31r7J5r3m1O8L3J2k4
$$ plain form
7645 -136 -149 -47 27 105 93 -62 -152 -42 84 -68 -47 -88 -49 2 67 180 68 -26 -47 -42 124 118 71 7 89 -25
7671 -25 -9 106 121 103 -172 -38 -39 14 117 -39 -9 -60 -4 2 61 -3 22 -68 -32 106 94 107 24 -3 -258 46 114
7698 114 61 49 -172 -34 -37 50 147 -101 -17 -59 -38 -43 124 65 -177 -22 -87 74 186 165 -76 -76 -68 34 85 97 -7
7725 -7 0 22 47 156 159 -118 33 -15 -114 62 81 -1 120 47 -53 112 143 15 -100 -95 -14 -21 126 45 29 -35 -13 -18
7753 -18 -40 -38 -26 12 -46 72 59 57 -49 -124 -47 127 -35 91 -48 -7 -198 -30 56 33 56 -39 -107 -35 46 87 19
7780 19 -132 -44 -108 17 -47 -43 -30 -68 25 -95 132 54 98 -110 94 118 -34 60 52 -13 -23 -6 41 -1 48 -6 -139
7807 -139 28 35 -40 70 -91 -3 -9 91 25 -34 -46 -82 -66 -89 16 -7 -17 -38 -50 18 10 -19 -94 -20 -45 3 145 22
7835 22 -75 108 -43 -95 -69 -73 80 -60 -2 64 92 5 -25 -110 0 64 74 -41 90 -7 8 -85 -126 -58 -25 -13 -37
7862c7n1m6P3J01r9QN2l7O5R1r7p1M9J23j70k7J39J4r0J08j04l8j0Q8o4J8k1M6
7890A3L0jJ7p8k9L9N5j1m4j25J12lL9k7k4j7p4K12j62P7N4q2k3P6j26J26k6p7
7918g9Q9j6R5j05p7J58j59l6J19jL4L6P6k03L0L4J16j44m4Q2p4N9r9J27j2j8l
7945a5l5M6L0j00L6J8p3j8J53J58j47p4j38J54M2J08k01Q3o4L3k2O5K9j57p0J07
7971e2M8jJ6r9m5J70j17P5p1o4J1O4Ok1J96j40ro4R4J08l7J8j74j6PJ07%R9k38
8000a29O2O8L4N5o4n6J1lJ14l8j30J54k10P2N0k4J61j99P4q7p1J32J21nj97O2
8026d3j53J12L9J9m1K2NJ67j31m7k9M8l3KJ49j00L6k7r8M9J35J3K0j45j76J58
8052d9J18o3K3k2j76J32J35Jr3l2m1K08PL6k32qJ14m2J8J8N7m7j90J07K5J67j23
$$ plain form
7862 -37 -88 -134 -61 40 -59 -51 1 -36 29 120 23 -48 1 124 -46 -73 66 80 -10 98 -6 -44 -54 34 -30 -12 -33 13
7890 13 43 42 59 -19 -48 -9 46 35 -9 -134 -22 -25 14 -13 -37 -54 -128 84 -78 -1 53 -29 -52 24 -102 24 -2 -79
7918 -79 10 -6 89 -16 -93 65 -94 -130 -11 -12 22 58 134 -69 -39 -5 111 -33 -77 5 -69 -10 -109 18 6 -12 -15
7945 -15 -50 -4 26 -74 -38 -20 -93 -111 42 200 53 -21 -159 -5 37 145 -56 27 -37 -4 -26 39 68 -89 -159 -52
7971 -52 -4 -5 11 -88 -133 37 -80 -5 -76 -140 -129 -65 -59 -80 116 -24 -33 -97 -3 105 68 86 -88 -104 -97 10 10 109 -129
8000 -129 -67 1 35 90 26 -30 -19 -22 92 54 -76 78 -132 -60 -10 -34 127 -72 2 -85 -156 -24 97 92 -105 -43
8026 -43 -196 -84 -45 -26 -67 -45 -40 127 -4 -51 -80 -32 -65 -63 86 -14 22 -5 -103 -54 81 94 114 -31 -207 -49
8052 -49 69 6 29 7 -169 -37 98 99 6 -26 -67 141 148 184 -48 -56 58 16 34 52 109 62 -128 -21 4 171 48
8079D8M1j61J1N4J4J9p6Ml4R0O3j03j7K7n7K9J26L4K4j56m3j1mR4J7o5jk6mJ43
8109H0j0r9j4j24J87P2pj10p5N1K2J65j65J00j62N8M2p8J47m7r2M2Q1q2n7J53
8135G8j40RK0L7m5L5K7j49N3P4L9J6p2M3o6J63m4n4J36j38p7n0J03R9q7j11PL9
8163e5J08Jj19J15Kj06J16k1m6l1o2J70o4k8J04j73j6K09j38K1Jk0k2m1K62j74
8189gJ22p1
$$ plain form
8079 48 89 -72 -61 -7 7 26 -50 -46 -80 10 73 -30 -47 -20 -77 -48 78 112 136 -20 -63 -74 -78 16 33 -32 -33 -59 -63 80
8109 80 70 -29 -43 -167 20 92 85 -25 -100 -49 -27 138 -27 73 -89 -31 11 -67 80 33 -59 -17 64 -18 -75 78
8135 78 -62 -53 -33 4 -41 -6 21 -128 -75 -1 38 54 -18 25 -41 122 78 24 160 22 -55 -105 -2 97 10 -101 -94 -55
8163 -55 53 54 -65 50 52 -54 62 41 -5 -36 -98 72 8 -20 84 -89 -105 104 -34 -13 -12 -32 -54 -95 167 -7
8189 -7 115 44
8191D4
$$ Imaginary data points
##PAGE= N=2
##DATA TABLE= (X++(I..I)), XYDATA
0@%%%%%%%qJ6j6J2j2K4k4K1l0L8m5N2n8O8q2R2j04J20j35J53j74J92k14K43k70
32a41K99l36L74m13M55n00N55o18O82p52Q33r25J026j140J273j428J610j822K081
51A113k410K827l378M140n247O993j0051J6362l4052J66184N90669n26738n56456
64c50044L13304J10856m11021K05844O54535k10099p26165O2390N08366j1236
74A46730j41210K05537o7510m61927j7787M49913J20088j82687R37k8252k16938
85a93106P2656L25041n7566l10001M6103J86735r5473k3266K36896m6454l52157
96b10592J1600L25371M393k05541L7872N9636j34023N4342K72469l1035l04132
107a19640p9384J08123M2527J35863J81114j76314l38626O0392K59568n231j9312
$$ plain form
0 0 0 0 0 0 0 0 0 -8 8 -8 4 -8 16 -8 13 -17 21 -24 28 -30 38 -44 48 -56 64 -71 82 -92 100 -114 129 -141
32 -141 158 -178 196 -217 238 -262 293 -325 357 -395 438 -487 539 -601 672 -756 854 -968 1113
51 1113 -1297 1530 -1848 2292 -2955 4038 -6013 10349 -23703 142481 733150 206412 -350044
64 -350044 -36740 74116 -336905 -131061 523474 313375 -412790 -350400 157966 146730
74 146730 5520 211057 143547 -318380 -336167 113746 233834 51147 52084 23832 -193106
85 -193106 -120450 204591 147025 -162976 -116873 69862 -25611 -48877 188019 141565 -210592
96 -210592 -198992 126379 130772 -74769 -36897 22739 -111284 -56942 215527 184492 -119640
107 -119640 -199024 -90901 -48374 87489 268603 92289 -246337 -185945 73623 68392 49080
118D9080J39435j73232l95165J51436N26138N964l50229J0746O2415k96947J1306
129b59053N62852J21738n55588j83093L57548K3299j99972K64778K15375m67150
139a19266l39323M30191L39005k66013j09552K25783j59851l43203K54287M22526
149C34584k07886l53429J53614J76230j69321J0699K61002j00535l38088O8593
159a64537K82616l4867j23475Q8218j0113j76985O6696K29993n8473k03650K4530
170h0047P8479m9690P0844J64754j09493k46095M6147J89577q136m3135O5720
181G8925p3164j74996Q6260K34881j2483j52670k1494k4514p9866J22368K15951
192A99198p4876k18950Q553Q1027m9674O5650J78155j17595k84602P1815K59124
$$ plain form
118 49080 188515 15283 -379882 -228446 297692 303656 -46573 -35827 26588 -270359 -259053
129 -259053 303799 425537 -130051 -313144 44404 67703 -132269 132509 347884 -119266
139 -119266 -458589 -28398 310607 44594 -64958 160825 974 -342229 -87942 334584
149 334584 126698 -226731 -73117 103113 -66208 -55509 205493 104958 -233130 -164537
159 -164537 118079 83212 -40263 47955 37842 -139143 -72447 157546 99073 -104577 -80047
170 -80047 -1568 -51258 19586 184340 74847 -171248 -125101 64476 56340 13205 78925
181 78925 5761 -169235 -82975 151906 139423 -13247 -34741 -59255 -139121 -16753 199198
192 199198 124322 -94628 -86075 -5048 -54722 10928 189083 71488 -213114 -141299 117825
203A17825m0784j16251J29087l70k84659k992L50655M2562k86280l112J82949
214H8630j18940j29281K45793J38719k96392j53788K50027R5739j79830L5255
224b4068J68774j42872j92859J72513J81770j53421j13374J34764J5193j37363
234i0943P4710J61883j10686j64916R6846J08393q6250j8108J07980n0137j35510
245a06738P6383J36752p1224r5643O2286J8563q3700M3589J21216n3290j21480
256g3286L5720O4980m3132L654P7059m3278j05588M4960R4004l6077l8965M9770
268B9821k2952q8242M8689J06507m6760p6601N7262K5112r0003J4100J19433l2926
280D3440j20924M7855R4445p2585n5627J07897K6763j30726m937J29436k3939
$$ plain form
203 117825 77041 -39210 89877 89507 -195152 -198144 152511 195073 -91207 -94319 88630
214 88630 -30310 -159591 86202 224921 -71471 -225259 24768 120507 -59323 -24068
224 -24068 144706 1834 -191025 -18512 163258 9837 -103537 31227 46420 -90943
234 -90943 -16233 145650 34964 -129952 -33106 75287 -10963 -29071 78909 28772 -106738
245 -106738 -30355 106397 35173 -60470 1816 20379 -63321 -19732 101484 48194 -73286
256 -73286 -37566 27414 -15718 -12064 64995 21717 -83871 -38911 55093 19016 -19949 29821
268 29821 6869 -81373 -32684 73823 27063 -49538 7724 32836 -57167 -43067 76366 43440
280 43440 -77484 -29629 64816 -7769 -63396 44501 71264 -59462 -64399 65037 41098
291D1098j11829O1259R4522r0163p3337J04643M1697j09903l518J12009l0087
302C6391j07106N1709Q7412o6736n4264Q2692J8359r9122M394J01549j6656q1801
314d3179L0906M6118n8439j9300Q4822J0426q8388p313O4020j1045l2785M3582
326A9425J5424p1464j6701P2748J9475m4273J007J2851m1559p260P0234K2331
338E2238o0320k3738K6871l509n66M7831L370p4352k4658N9338K8799j7128J0246
351B4422k813o2229j7289P8415M3345m9395l4665J0249j3752j619O6472L2402
363G3543p6224o4944L4149M4501N040K0078P190o7018n3548N5697P4413j1456
375D1421m1390j5018k4637j2010O2888O7746l6381q3217j7683L0666K6394L5954
$$ plain form
291 41098 -70731 -9472 85050 -5113 -78450 26193 67890 -42013 -45531 66478 36391
302 36391 -70715 -19006 68406 1670 -52594 30098 48457 -50665 -46271 55278 38622 -43179
314 -43179 -12273 33845 -24594 -43894 40928 51354 -37034 -44347 19673 8628 -24157 19425
326 19425 34849 -36615 -53316 19432 38907 -5366 -4359 8492 -33067 -40327 29907 52238
338 52238 -8082 -31820 -4949 -8458 -9024 38807 42177 -32175 -56833 2505 31304 14176 24422
351 24422 21609 -40620 -57909 20506 63851 14456 -20209 -9960 -23712 -25331 41141 73543
363 73543 -2681 -67625 -33476 11025 16065 36143 43333 -23685 -77233 -21536 52877 41421
375 41421 31 -14987 -39624 -51634 11254 79000 42619 -40598 -58281 -27615 -1221 34733
387C4733K2720n1756p4063J2796P5475L3779j9437l1069m2052k7837M4424Q1855
399E9568J3587o5022n4639l028K9859M8721L5879k9948p6087l0113M9219O6257
411D4253K3972k9069o2413m7802K0307P3890M9273k1082o3272m9195O418O2441
423G721O1258p509p0262n9795L338N8042O6200J7826n6011q0507k0719N7451P0677
436D7710J8871m1674o5707l4347L5776P8741M2098m0404q0808m2841L1163P3462
448B2040N1441j6072o9952n8671J0938P1188O0567j1066p0714o0393O268O6528
460B102O8251P283o4158p6295j4200N9839P3451K0463m9658p5863k8751N2644
472b4892Q1476K5088n0570p3516l7786K8572Q2070O2626l1639r4804m9616L6058
$$ plain form
387 34733 57453 5697 -68366 -55570 19905 53684 34247 3178 -38874 -66711 -22287 59568
399 59568 73155 8133 -46506 -49534 -19675 29046 64925 34977 -41110 -71223 -22004 44253
411 44253 68225 39156 -23257 -71059 -50752 23138 72411 51329 -11943 -61138 -54720 7721
423 7721 68979 61470 -8792 -68587 -65249 -7207 58993 76819 20808 -59699 -80418 -22967 47710
436 47710 66581 24907 -40800 -75147 -39371 39370 81468 41064 -39744 -82585 -51422 22040
448 22040 73481 57409 -12543 -71214 -60276 10912 71479 60413 -10301 -70694 -64426 2102
460 2102 70353 77636 13478 -62817 -77017 -17178 56273 76736 27078 -48785 -77536 -24892
472 -24892 56584 81672 31102 -42414 -80200 -51628 30442 93068 61429 -33375 -82991 -46933
484d6933O5550M2527j674o0889p9816o81R4639P5420k4001p1962n1080j4804L9415
497c4289Q6653M0774o9446r3290n452O3214N4964K1376k4630p7719n7912M6806
509d8951J00458L4727m7517o2757m0507M551O8908P3719j8371r1039m8900L2073
521d3606N9697M6772P797o0975q6113o449Q5477P1631q530n5535n5018k3183M0988
534b7047Q0833K9340o2435q1327j7198N1486P1737L5012l7204q0472m5088L1834
546e0529P3972N0495j8955p7950n8701K7544P8438M3639j7428n3239o1518j8324
558h2556O9102R1812K32q1695n5141O115L0339M9979M6986l2933r8109l0750P4638
571a1981O6779j406k4018l6993n7664m29R1117O2504n0922p2055p033J7832K0697
$$ plain form
484 -46933 18617 61144 59470 -1419 -81235 -81916 12723 88143 64142 -7820 -58900 -73704 -34289
497 -34289 52364 93138 23692 -69598 -75050 -11836 43128 64504 39874 -37845 -95757 -48951
509 -48951 51507 86234 38717 -24040 -64547 -59996 8912 82631 64260 -26779 -75679 -43606
521 -43606 16091 62863 70660 9685 -76428 -82877 2600 74231 65701 10166 -44852 -68035 -27047
534 -27047 53786 83126 20691 -60636 -77834 -26348 45389 80401 43197 -37275 -82363 -50529
546 -50529 23443 73938 54983 -22967 -81668 -54124 24314 67953 50525 -2714 -64232 -82556
558 -82556 -13454 78358 78590 -3105 -58246 -52131 -21792 28187 75173 42240 -55869 -86619 -11981
571 -11981 54798 53392 29374 -7619 -65283 -65712 25405 87909 36987 -35068 -42101 -24269 -3572
584c572N0507K2218p3824p8253L3407Q1223J8800j9955j6417m3728m1563M8585
596b2572R0315l907q1506l5990K1749K1471L2318M2721k5915r2100l2001O9265
608a6152O5802j100k8831l4138m0412K545P0151N6364l1829p3935l2184K4904
620c8815M8758M1437L499m6922n9258j1402N1102O2529Q624n0150n0324l499L1239
633a3182L7331K7010j2693o1544m3436L7252O5691J0143l0054j9571k0525j8509
645d2087L4293O1025r762o9098j9287L7934J6320k31K1985p689o2179j7137O6650
658A0737L8394m0000k7672J3748j0645j2751M7815L7413n6247o0745L1900N0042
670B1989p951n633J8964l0955n6002K9409P8905j443o0513j2201J7055j2273R885
$$ plain form
584 -3572 46935 69153 -4671 -82924 -49517 31706 50506 30551 14134 -29594 -71157 -22572
596 -22572 67743 63836 -17670 -53660 -31911 -10440 21878 64599 38684 -53416 -85417 -16152
608 -16152 49650 48550 19719 -14419 -54831 -52286 17865 74229 42400 -31535 -63719 -38815
620 -38815 9943 51380 54879 7957 -51301 -62703 -11601 50928 59552 9402 -40922 -44421 -13182
633 -13182 24149 51159 38466 -23078 -66514 -29262 36429 46572 16518 -3053 -23578 -42087
645 -42087 -7794 53231 43469 -25629 -44916 -6982 9338 9107 31092 23403 -38776 -55913 10737
658 10737 49131 9131 -18541 -4793 -15438 -28189 19626 57039 792 -59953 -28053 21989
670 21989 14038 8405 27369 -3586 -59588 -30179 48726 47283 -13230 -25431 -8376 -20649 -10764
683a0764N7378O538p5039l9068M6532L9357p812J214M960l9829l5960L9501N9855
696D6863q470m5828j3597O388j635J5873L5672l75m7450k7936K4720L0602J189
709A6016p412k455j3718j8013J2393L4126M096l0786j5154J5380P313p564Q899
722C121J4370j7622k3928J6970K6624j5073k3068J5917J6719j8943p494K6026
734A3619L99l5037K038M0114j11l5526K648K4696j4648j7056L2060K0925m0458
747f337k7687L3589K1714k3989j407K7339j5945m0624J7434M5197j0750l3334
759a4800J2221J5610k7385q938M1163J3410m0607j4303K9235J662k5158J4105
771c785L1126j9078l4643J4471K6215j5071j3846K5102J0379l2983j4993K8301
$$ plain form
683 -10764 46614 53152 -21887 -60955 -14423 24934 17122 18336 23296 -16533 -52493 -12992 46863
696 46863 38393 -7435 -21032 -14644 -16279 -406 35266 34891 -12559 -40495 -15775 14827 16016
709 16016 8604 6149 -7569 -25582 -13189 20937 25033 -5753 -20907 -5527 1786 -5778 3121
722 3121 17491 -131 -24059 -7089 19535 4462 -18606 -2689 14030 -4913 -12407 13619
734 13619 14018 -21019 -18981 21133 21022 -14504 -11856 12840 -1808 -18864 13196 34121 -6337
747 -6337 -34024 -435 21279 -2710 -4117 23222 7277 -33347 -15913 29284 18534 -14800
759 -14800 -2579 13031 -14354 -23292 17871 31281 -9326 -23629 5606 7268 -17890 -3785
771 -3785 27341 8263 -26380 -11909 14306 -765 -14611 10491 20870 -12113 -27106 1195
783A195J4452j7811j626J7561j1004k8144R508L4276K399k3178m662O711r552
796i875m190K5099J8399k2116k8801N744J8970K751J296R262q945k7731k874L0821
810G810J6932j6074j3446J559n332n775J9927K0883j7466k8762N482K0160k219
823C679m954J1543l345k5855O83L2463N879k8363o672J8586k533j2524J6972J4915
837B0474k8032k2871K8974K7849k0129j9903J2986O54j9450J5100L7711j2594
849B0769m7121j618L4781O419j0208J1562j194l7595j1637M5519L0656k5051k7364
862a2082Q49k500k389K9260K7769k6002m4606R8K9328J4540L785J285k1535l0961
876c3161O684L9777J8586j7147k1548j1685l911J5229K9079O085k7929k5801M381
$$ plain form
783 1195 15647 -2164 -3790 13771 2767 -25377 -15869 18407 20806 -2372 -7034 -323 -9875
796 -9875 -14065 11034 29433 7317 -21484 -15740 3230 5981 7277 16539 7594 -20137 -23011 7810
810 7810 24742 8668 -4778 -3219 -8551 -14326 5601 26484 9018 -19744 -14262 5898 3679
823 3679 -1275 10268 6923 -18932 -18249 14214 20093 -8270 -14942 3644 1111 -11413 5559 20474
837 20474 -7558 -30429 -1455 26394 6265 -13638 -652 2 -19448 -4348 33363 20769
849 20769 -26352 -27970 6811 13230 3022 14584 13390 -24205 -35842 9677 40333 15282 -12082
862 -12082 -11233 -13733 -16122 13138 40907 14905 -29701 -29603 -275 14265 18050 19335 -2200 -33161
876 -33161 -26477 13300 31886 14739 -6809 -18494 -22405 -7176 21903 27988 59 -25742 -21361
889b1361K0344J5727M308j1271k2805j1338J6210K6836P608j8406k2109m300J4030
902f527J7252Q361o589k0945j8142J0637L2939J3510k1912k3692k444O529J1824
915H01K2343O198l3600l2670J7161L7749P108j3281q561j7340j8892K1376M6160
928C4552K769m2623k3319J1528J1707J2469K2217n628m4131k1546L1960L3905
940B3860j407j2909j2949k2303m556L5807L1368j7477l4322q516Q296J2058K2021
953A8971J0376k7573l4113O798L1938J5078l203j1031k2197j5582K0445L5787
965B5694L528k7051k0600k008J0002K2725J8848j3518l4918j3539J9099K5573
977A3835J2268o916k5131k2606P512K9754J8863p050k2809k2290k027K6644K8243
$$ plain form
889 -21361 -1017 14710 19018 7747 -15058 -26396 -10186 16650 24258 5852 -16257 -20557 -6527
902 -6527 10725 19086 12497 -8448 -26590 -15953 16986 30496 8584 -15108 -17552 -11023 801
915 801 23144 29342 -4258 -36928 -19767 17982 25090 11809 3248 -14092 -32984 -11608 34552
928 34552 37321 -5302 -28621 -17093 -5386 7083 29300 23672 -20459 -42005 -10045 23860
940 23860 22453 9544 -3405 -25708 -30264 5543 36911 19434 -14888 -23404 -15108 -3050 18971
953 18971 29347 1774 -32339 -25541 6397 21475 18272 7241 -14956 -30538 -10093 25694
965 25694 29222 2171 -18429 -20437 -10435 12290 31138 17620 -17298 -30837 -11738 13835
977 13835 26103 19187 -5944 -28550 -21038 8716 27579 20529 -2280 -24570 -26597 47 28290
990B8290l461k6802j8596j701J2274K5417J5826k1060l5439l141K6008J7611J911
1003A7137m487j9427k3772R325L8092J3927k3436k1582k902L305J3579K3805N39
1016B4103l2327k1767J5433K4527Q985j792j3900k4220n542K7582K5590o091k1094
1029e13j4520n538J1310K7930J1903k4029k8034q9J6382J5205J2426l338k8249
1042i154k1882J5744L0308P372j1962j4223j4251l867K1712K6004n328k7215j4512
1055b1254N345J3436J6249P387j6306k4671j741K0006J5714J841r348j8091j1482
1068b2915J4248K4596L969j5894j3563n615L247J7338J7664r316k6191p667J4471
1081e628J3210N753J139j3262k1053J289K5449J4763j0021j4798p496l337Q668
$$ plain form
990 28290 24829 -1973 -20569 -22270 -9996 15421 31247 10187 -25252 -28393 -2385 15226 17137
1003 17137 12650 -6777 -30549 -21224 16868 30795 7359 -14223 -17125 -13820 -241 23564 24103
1016 24103 -8224 -29991 -14558 9969 18954 17162 3262 -20958 -26500 1082 26672 20581 -513
1029 -513 -15033 -20571 -9261 18669 30572 6543 -21491 -21580 -5198 10007 22433 19095 -9154
1042 -9154 -31036 -15292 15016 22388 10426 -3797 -18048 -21915 -203 25801 20473 -6742 -21254
1055 -21254 -15909 -2473 13776 21163 4857 -19814 -21555 -1549 14165 16006 6658 -11433 -22915
1068 -22915 -8667 15929 19898 4004 -9559 -15174 -11927 5411 23075 13759 -12432 -20099 -5628
1081 -5628 7582 13335 14474 1212 -19841 -18552 6897 21660 11639 -3159 -10655 -13992 -5324
1094e324K0339O180j9541j8761K367J3371J0858N883o527j8830r852J2514J7757
1107A0434L931p594j1998j0394L300J8002J1181q935j4725n739K421R142J3511
1120A2537K177j6753j4392N658J3962O001k59n366j2360o484J2110J6724l94j3290
1134a29q265n92M178J0553Q272o809j4908m470Q605R841M204l237j0481q315M448
1149g105J2036N510l704p601p727p63R745J0505k611j0934n152K095L865O383
1163D542M788o176j2176j406J0182O825j645l433m200n134J942R807N061o509
1177B468q128q92L786M406M077m97o965n613K935O670L327j162m349m943k64O114
1193I70N087j580m469k946o34J888N392K606m391o071L48M209K051j18kk510l815
$$ plain form
1094 -5324 15015 21195 1654 -17107 -14740 -1369 9489 15372 8845 -9985 -19837 -7323 10434
1107 10434 14365 6771 -5227 -15621 -12321 5681 16862 7927 -6798 -12537 -10116 -974 12537
1120 12537 14714 -2039 -16431 -10773 3189 9190 8931 3565 -8795 -15279 -3169 13555 13161 -129
1134 -129 -8394 -8986 -4808 5745 14017 7208 -7700 -12170 -3565 6276 10480 7243 -3238 -11553 -7105
1149 -7105 4931 10441 6737 -864 -8591 -9354 391 10896 8285 -2649 -7801 -5706 -1841 4542
1163 4542 9330 3154 -9022 -10428 -246 6579 4934 1501 -2699 -7833 -5891 3916 8977 2468
1177 2468 -5660 -6552 -2766 1640 5717 5220 -1745 -7358 -4423 2247 5574 4412 63 -4880 -5144 970
1193 970 6057 4477 8 -2938 -3572 -1684 3708 6314 1923 -4148 -3800 409 2460 2342 2340 -170 -3985
1210c985Q93N495K261l995l384J029R75LJ585J695k505l847J334M108q6k505M1
1227h88P55j324j66K785P41l083j265K347J229j445j52J221j049j057J684J407
1243A740j681j234J423P39r51MQ01n58p48J004J151j246j171N04J036L47p4p28
1261C58r30k28R51R45O24j040k420p67K617K315j144j852k46j380n59L723L867
1278D834l712n611J088L626k1O46K966l132p402J673Q656J284n073q17M80m226
1294d741P06R289K759r558m781N077K159j621M536K786q934o649P916P933l767
1309C110l578K016l157n038O385R613m719j0002J412N147j525Q21N640l309j0217
1324g401R18J0374K033n475j449j48l687J544Q563J711q446n420K969M008K755
$$ plain form
1210 -3985 -3092 2403 4664 669 -2715 -1686 -711 -708 877 2572 67 -3780 -2446 1662 1576 -929 -888
1227 -888 -133 -1457 -1623 1162 1903 -1180 -2445 -98 1131 -314 -466 755 -294 -1351 333 1740
1243 1740 59 -1175 248 987 36 40 841 283 -465 539 1690 444 -727 -223 813 1160 1086 358
1261 358 -572 -800 151 1096 1720 680 -1740 -2507 110 2425 1281 -571 -817 -2197 -2756 967 4834
1278 4834 1122 -4489 -3401 225 204 850 3816 684 -6718 -5045 3611 4895 -178 -995 -515 -4741
1294 -4741 -4035 5254 8013 -1545 -6326 -1249 910 -711 3825 6611 -2323 -8972 -1056 6877 3110
1309 3110 -468 1548 -1609 -6647 -262 9351 4632 -5370 -3958 1189 -336 485 6125 2816 -7401
1324 -7401 -6483 3891 5924 449 -1000 -1148 -4835 -3291 5272 6983 -1463 -6883 -3914 94 2849
1339B849J958k663p083k465N457O464J639l412o912l836M700P884K015l477m501
1354a383n102q43Q865Q858m058j0111k330K770J763N570O253o653j2953N35J1487
1369B668L656l032N14l683r567J966J4878L590j1206n202L480j450K54J0444K873
1384A0183j4175p867J0283P185m259K53K768r021o988J1855J1598q102j0071K895
1398c463K605l345N840Q950p804j3861L323J2055J160l530P21l849q039L975J3155
1413G893J723r543n769P12J853N221O709k607j0422m380M720O551M777k74q153
1428i89p935K612Q624M083m68l575q162m110Q296J0521j673p979l141j400m04
1443e700P847Q580o047j2522N7P702J581J265L915n620j1683K719J3995J639q348
$$ plain form
1339 2849 4807 2144 -4939 -7404 -1947 4517 6156 2744 -4168 -8004 -3304 4580 6595 3118 -1383
1354 -1383 -6485 -7328 1537 10395 6337 -3774 -6104 -3334 -1571 3999 10252 3599 -9354 -8819 2668
1369 2668 6324 3292 3806 123 -9444 -7478 7400 10990 -216 -5418 -1938 -3388 -3134 7310 10183
1384 10183 -3992 -11859 -1576 5609 1350 1603 4371 -4650 -11638 217 11815 3713 -6358 -3463
1398 -3463 -858 -4203 1637 10587 2783 -11078 -7755 4300 5460 1930 2651 -1198 -9237 -5262 7893
1413 7893 9616 73 -5696 -4984 -3131 2090 8799 6192 -4230 -8610 -3890 2661 7438 7164 -989
1428 -989 -8924 -6312 2312 6395 5927 2352 -5810 -9920 -1624 8897 7224 -755 -3896 -5296 -5700
1443 -5700 2147 10727 4680 -7842 -7785 -83 1498 2763 6678 1058 -10625 -7906 6089 7728 -620
1458f20p51Q95n986J778J3361J089j4553m411R544K347l407N319K110j2487n704
1473a1476J3383Q680q104n787L276k654l728R554Q748r530j1575L857P421j69
1487A896J404L113p251r312N140J0995Q31n366k472l202k712O373Q915k277q804
1502b729l163J659K454N476L772n726q636N57O087L273J605q91o571n271N224
1517b880P881j69l537j723l623j879P010P377m944q026J148L058r02L404N162
1532G357o021r711L919R520j142m334K219j497p124L341J1232r89j0815q97N669
1547G27j580n25P134k32j1496k293J0169L490n153J21J226o214k171R842N255
1562H300p931n425L408N42j213N573L376p686o463M850N771j092l15O77m967l644
$$ plain form
1458 -620 -1371 -476 -6462 -4684 8677 9766 -4787 -9198 346 2693 -714 4605 6715 -5772 -11476
1473 -11476 1907 10587 2483 -3304 -28 -2682 -6410 3144 11892 2362 -9213 -5356 2065 1896
1487 1896 3300 6413 -838 -10150 -5010 5985 6816 1450 -1022 -4224 -6936 -563 8352 6075 -2729
1502 -2729 -5892 -4233 -1779 3697 7469 1743 -6893 -6336 -249 3024 4629 3738 -2833 -8104 -2880
1517 -2880 5001 4832 1295 -428 -4051 -5930 1080 8457 3513 -4513 -3365 -307 -1209 2195 7357
1532 7357 1336 -8375 -4456 5064 3922 -412 1807 310 -6814 -3473 7759 6770 -4045 -4942 727
1547 727 -853 -1378 5756 5524 -5972 -8265 1904 5394 241 362 1588 -4626 -6797 3045 8300
1562 8300 369 -5056 -1648 -1106 -2319 3254 6630 -1056 -7519 -2669 3102 2010 1695 2372 -2595 -6239
1578f239N763O058k352m179l26j196l97M986L753m421n216J170K472N25K404J180
1594C985n178l961L904M261j169q89L06l563k214N350M329l974l782J702M9j472
1610b316L736L763n194n574L878M296k430n86L227l153n355M086O871k870n351
1625b972K109J651l526J513O232k071p332J183N459r95k190L251j16n923Q9O847
1641C209O35n050L78J900k910m64N332R62n693j299L597O0j711K734J018m706
1657b008j480M336J658k849J20J386k621j293L973J690l559j190K081n19j289
1672a564K537J357l548j475L106Q22k121R64J650k703j597L470J451l143n40K505
1688A171j070j990K573J992l313j695L371O97k982J004K543k295k509L075K135
$$ plain form
1578 -6239 -476 5582 3230 -949 -1275 -2471 -2868 2118 5871 1450 -3766 -2596 -124 401 2805 3985
1594 3985 -1193 -5154 -1250 3011 1842 953 1259 -2304 -4518 832 5161 1187 -2595 -893 -844 -2316
1610 -2316 1420 5183 -11 -5585 -1707 2589 159 -427 2800 -353 -5708 -1622 5249 2379 -2972
1625 -2972 -863 788 -2738 -1225 5007 2936 -4396 -3213 2246 1251 -939 2312 2196 -3727 -3638 3209
1641 3209 3844 -1206 -828 1072 -1838 -2302 3030 3992 -1701 -3000 597 657 -1054 1680 2698 -2008
1657 -2008 -3488 848 2506 -343 -223 1163 -1458 -2751 1222 2912 -647 -1837 244 -275 -1564
1672 -1564 973 2330 -1218 -2693 413 1235 -886 78 1728 -975 -2572 898 2349 -794 -1334 1171
1688 1171 101 -1889 684 2676 -637 -2332 1039 1736 -1246 -242 2301 6 -2503 572 2707
1703B707l387r51L032l03l200J761L070k579k659L035J576l361l12L214o73k999
1719b029J540K611k439j945K883R69k747R1K292j039k241K176J871k613j191K417
1735F06O3k133J381J928k203j884K467J414j980k77K040j322k248K204K488k097
1751D47k056J819M05j801J255K399j931k793J451K304j241l62J237r91k278J491
1767f45K786j002j886N32M4j335J371K660j443l112P19J694n79L50J791j581l240
1784b876J115L523k08k046N57k42k044J072L555J6l714o97J674J65L42K009p23
1801A478l623l22K845J461q50l37q62k108P54L595Q42k772j357L21k53R84K896
1818B692j43m100j573K650J595j42N91n05l411q90L819K514j888k029n18n08M09
$$ plain form
1703 2707 -680 -1631 1401 1098 -2102 -341 2729 150 -2509 526 2102 -1259 -1571 1643 970 -2029
1719 -2029 -489 2122 -317 -2262 621 1590 -1157 -1066 1226 187 -2054 122 1993 -620 -1811 606
1735 606 669 -1464 -83 1845 -358 -2242 225 1639 -341 -618 1422 100 -2148 56 2544 447
1751 447 -1609 210 615 -1186 69 2468 537 -2256 -805 1499 258 -104 1133 142 -2136 -645
1767 -645 2141 1139 -747 -215 -171 -1506 -135 2525 1082 -2030 -1311 383 -196 154 1945 364 -2876
1784 -2876 -1761 1762 1554 -492 65 -177 -2221 -1149 2406 2422 -1292 -1989 -315 -150 192 2201 1478
1801 1478 -2145 -2467 378 1839 989 652 -210 -2318 -1564 2031 2873 101 -1256 -935 -1188 -204 2692
1818 2692 2549 -1551 -3124 -474 1121 979 1570 1065 -2346 -3236 583 3097 1209 -820 -1338 -1846 -1437
1835a437L170J621l040l031M22K171J145J134n45l135j941K422L105J94j302j432
1851d79k083K94L431K338j984k945o68O16J437K435P58l330l259J318L319J124
1867B322l46j308k498j487K618L938j77l288j926p3J091K803J799k039l953p90
1883c314K498K379J079q90l014k431J379M016J650j810k591j700qL035L276p11
1899B843l724k524J088K489K198P36k314l837m53K949L499J89k386k924j053J823
1915a401L702J411k178l480j479J638L585J873j685l429j764J318K811K358n26
1930B754l370l104J096L726K207r46k558k466m92K606L897Q3l767l062O75K206
1946e15K641J183j908m100j530L176L732P31k468k766j661J235L836K445j707
$$ plain form
1835 -1437 1733 3354 314 -2717 -2295 -124 1021 2155 1610 -1525 -3466 -1044 2061 2255 953 -479
1851 -479 -2562 -2268 1163 3501 1517 -1428 -2096 -1480 -43 2392 3150 -180 -3439 -2121 1198 2322
1867 2322 1976 668 -1830 -3317 -699 3239 3062 -226 -2152 -2225 -1134 1669 3468 1429 -2524 -3314
1883 -3314 -816 1563 2642 1752 -1262 -3693 -2314 1702 3352 1542 -1049 -2749 -2757 278 3554 2843
1899 2843 -881 -3405 -2317 172 2370 3106 792 -3045 -3498 -549 2950 3139 753 -2171 -3224 -1401
1915 -1401 2301 3712 1534 -1946 -3425 -1787 1798 3671 1986 -1443 -3207 -1889 922 3280 2754
1930 2754 -616 -3720 -2624 1102 3309 2363 -195 -2661 -3153 -547 3350 3433 -334 -3396 -2721 -515
1946 -515 2126 3309 1401 -2699 -4229 -1053 2679 3410 942 -1824 -3485 -2250 1586 4031 2324
1961B324m111j944J661L231K274n70l225l313N83L828K861o53l164k607j94K426
1977e93L601Q11l136l753m19L034K949M71j576k985k221J833M261J673k707l646
1993b403o13J584K135K412k88l869l370J857M276J351j464k121j918p64K774M060
2009C639j39m271k826J423K222J794J123j366m055j608L358L883j38k540k164
2024a665q97O94L331K377j778l942j552K200K656J284p15k435k457J61L305K800
2040C367j002l120k054O76K129K153O69k197l459n70L174L066m82k251j856p76
2056b533P10L126K506k488m088l33K711J619M19L36j954l477N76M755J650k970
2072E65j838M9l28L79L515J401m096l353K233K952k83l08P44k404k810K483M460
$$ plain form
1961 2324 -1787 -3731 -2070 1161 3435 2865 -360 -3673 -3090 738 3599 2946 -218 -2825 -3019 -593
1977 -593 3008 3819 683 -3070 -3489 -455 2494 2965 1389 -1596 -3817 -1984 2277 3950 1243 -2403
1993 -2403 -3016 -1432 703 3115 2827 -1042 -4412 -2555 1721 3072 1608 -513 -2431 -3195 -421 3639
2009 3639 3500 -771 -3597 -2174 48 1842 2965 1599 -2456 -4064 -706 3177 3039 499 -1665
2024 -1665 -2562 -1868 1463 3840 2062 -1880 -3432 -1232 1424 2708 1993 -442 -2899 -2738 567 3367
2040 3367 2365 -755 -2809 -2133 -4 2149 2818 621 -2838 -3408 -234 2832 2350 99 -1757 -2533
2056 -2533 -1823 1303 3809 1321 -2767 -3100 -389 1230 1649 1985 31 -3446 -2870 1885 3535 565
2072 565 -1273 -1224 -1552 -1173 2342 3743 -353 -3706 -1473 1479 1196 888 1632 -772 -3582 -1099 3361
2089C361o62l650n94R72n01R17K928n81m132j238L050J791q01l40k89j888q46
2106b503K989K387j592k754j36P79P59J167P51j511k493R5K199J753o45j591p85
2123a131k36N95J680J082r55k516m03J816J522m55o09l5j534o89K328K218j783
2140H95k450R71J090r44L67K117r75l187M45L432k93k433P54J265k222r13L383
2157A302J113l272j364K906L33k234R18K058j772k391J922K617k105j768K033
2172B96P77k207K8K647l28k912N98K438o87j832J172J135j551q02J875P29j764
2189c88p07J584M03j222J00Q26m12p51M11J157n92j092J03J094r4p11L48J98m78
2208b23o14R86J084j023j453O08J251l09p96R28n9j771O7K437M81k433m58J517
$$ plain form
2089 3361 2699 -951 -1545 -573 -1074 -157 2771 2190 -1942 -3180 -130 1661 860 520 231 -1657 -2503
2106 -2503 486 2873 1281 -1473 -1609 -830 -71 1096 1847 336 -2157 -2062 137 1890 1245 -346 -1131
2123 -1131 -1367 -772 908 1990 1035 -1481 -1884 -68 1454 999 390 355 -1179 -1868 460 2678 895
2140 895 -1555 -584 506 -438 -71 2046 1071 -2116 -1671 1761 1468 -965 -211 1054 -1168 -2081 1302
2157 1302 2415 -857 -2221 685 1018 -1216 -298 1760 -12 -2403 -481 2136 31 -1737 296
2172 296 1073 -1134 -1106 1541 1213 -1699 -1101 1337 650 -1182 -10 1125 -426 -1228 647 1376 -388
2189 -388 -1095 489 892 -330 -230 596 184 -567 -156 1001 409 -683 -580 514 420 -291 57 255 -223
2208 -223 -837 149 1233 210 -1243 -635 616 307 -489 439 380 -1391 -1324 1113 1594 -839 -1297 220
2226B20l63q20J677J235k610j906K229K097j333r24J347p33k428J699L327r71
$$ plain form
2226 220 -143 -963 714 1949 -661 -2567 -338 1759 426 -498 849 116 -2312 -613 2714 1743
$$ [...]
8191g9
##END NTUPLES=NMR FID
##END=
