##TITLE=1H_IPEDM2907
 CDCl3, 108 sc, 
 31.7.2019
##JCAMPDX= 6.0         $$ Bruker NMR JCAMP-DX V2.0
##DATA TYPE= NMR FID
##DATA CLASS= NTUPLES
##ORIGIN= UXNMR, Bruker Analytische Messtechnik GmbH
##OWNER= root
$$ XWIN-NMR		Version 3.5
$$ Wed Jul 31 16:24:39 2019 Russian Standard Time (UT+4h)  she@DPX200
##.OBSERVE FREQUENCY= 200.13155
##.OBSERVE NUCLEUS= ^1H
##.DELAY= (6, 6)
##.ACQUISITION MODE= SIMULTANEOUS
##.ACQUISITION SCHEME= undefined
##.AVERAGES= 108
##.DIGITISER RES= 18
##SPECTROMETER/DATA SYSTEM= spect
##.PULSE SEQUENCE= zg30
##.SOLVENT NAME= CDCl3
##.SHIFT REFERENCE= (INTERNAL, CDCl3, 0, 15.7039)
##AUDIT TRAIL= $$ (NUMBER, WHEN, WHO, WHERE, WHAT)
$$ ##TITLE= Audit trail, XWIN-NMR		Version 3.5
$$ ##JCAMPDX= 5.01
$$ ##ORIGIN= Bruker BioSpin GmbH
$$ ##OWNER= she
$$ F:/spectra/data/she/nmr/H-F/1/audita.txt
$$ ##AUDIT TRAIL=  $$ (NUMBER, WHEN, WHO, WHERE, WHAT)
(   1,<2019-07-31 16:22:16.00 +0400>,<she>,<DPX200>,
      <continue with go, POWCHK disabled, PULCHK disabled
       configuration hash MD5:
       00 E9 B6 7A A2 85 ED C7 34 08 36 98 17 FE 4E 26
       data hash MD5: 16K
       EC 44 B3 9C 19 0F C5 83 DE C1 39 E0 F4 A6 24 58>)
$$ ##END=
$$ 
$$ hash MD5
$$ 53 17 E3 F4 CD CB 24 D9 ED 3C 82 9D 23 C2 05 53
##$RELAX= 
##$RELAX= 
##$RELAX= 
##$RELAX= 
##$RELAX= 
##$RELAX= 
$$ Bruker specific parameters
$$ --------------------------
##$DU= <F:/spectra>
##$EXPNO= 1
##$NAME= <H-F>
##$PROCNO= 1
##$TYPE= <nmr>
##$USER= <she>
##$AMP= (0..31)
100 100 100 100 100 100 100 100 100 100 100 100 100 100 100 100 100 100 
100 100 100 100 100 100 100 100 100 100 100 100 100 100 
##$AQSEQ= 0
##$AQ_mod= 1
##$AUNM= <au_zg>
##$AUTOPOS= <>
##$BF1= 200.13
##$BF2= 200.13
##$BF3= 200.13
##$BF4= 200.13
##$BF5= 200.13
##$BF6= 200.13
##$BF7= 200.13
##$BF8= 200.13
##$BYTORDA= 1
##$CFDGTYP= 0
##$CFRGTYP= 5
##$CHEMSTR= <none>
##$CNST= (0..31)
1 1 145 1 1 1 1 1 1 1 1 1 1 1 1 1 1 1 1 1 1 1 1 1 1 1 1 1 1 1 1 1 
##$CPDPRG= <>
##$CPDPRG1= <>
##$CPDPRG2= <>
##$CPDPRG3= <>
##$CPDPRG4= <mlev>
##$CPDPRG5= <mlev>
##$CPDPRG6= <mlev>
##$CPDPRG7= <mlev>
##$CPDPRG8= <mlev>
##$CPDPRGB= <>
##$CPDPRGT= <>
##$D= (0..31)
0 1.2 0 0 0 0 0 0 0 0 0 0.03 0 0 0 0 0 0 0 0 0 0 0 0 0 0 0 0 0 0 0 0 
##$DATE= 1564575342
##$DBL= (0..7)
120 120 120 120 120 120 120 120 
##$DBP= (0..7)
150 150 150 150 150 150 150 150 
##$DBP07= 0
##$DBPNAM0= <>
##$DBPNAM1= <>
##$DBPNAM2= <>
##$DBPNAM3= <>
##$DBPNAM4= <>
##$DBPNAM5= <>
##$DBPNAM6= <>
##$DBPNAM7= <>
##$DBPOAL= (0..7)
0.5 0.5 0.5 0.5 0.5 0.5 0.5 0.5 
##$DBPOFFS= (0..7)
0 0 0 0 0 0 0 0 
##$DE= 6
##$DECBNUC= <off>
##$DECIM= 24
##$DECNUC= <off>
##$DECSTAT= 4
##$DIGMOD= 1
##$DIGTYP= 9
##$DL= (0..7)
0 120 120 120 120 120 120 120 
##$DP= (0..7)
150 150 150 150 150 150 150 150 
##$DP07= 0
##$DPNAME0= <>
##$DPNAME1= <>
##$DPNAME2= <>
##$DPNAME3= <>
##$DPNAME4= <>
##$DPNAME5= <>
##$DPNAME6= <>
##$DPNAME7= <>
##$DPOAL= (0..7)
0.5 0.5 0.5 0.5 0.5 0.5 0.5 0.5 
##$DPOFFS= (0..7)
0 0 0 0 0 0 0 0 
##$DQDMODE= 0
##$DR= 18
##$DS= 0
##$DSLIST= <SSSSSSSSSSSSSSS>
$$ [...]
##$SUBNAM2= <"">
##$SUBNAM3= <"">
##$SUBNAM4= <"">
##$SUBNAM5= <"">
##$SUBNAM6= <"">
##$SUBNAM7= <"">
##$SUBNAM8= <"">
##$SUBNAM9= <"">
##$SW= 24.9336996594482
##$SWIBOX= (0..15)
0 0 2 0 0 0 0 0 0 0 0 0 0 0 0 0 
##$SW_h= 4990.01996007984
##$TD= 16384
##$TD0= 1
##$TE= 0
##$TE2= 300
##$TE3= 300
##$TEG= 300
##$TL= (0..7)
0 120 120 120 120 120 120 120 
##$TP= (0..7)
150 150 150 150 150 150 150 150 
##$TP07= 0
##$TPNAME0= <>
##$TPNAME1= <>
##$TPNAME2= <>
##$TPNAME3= <>
##$TPNAME4= <>
##$TPNAME5= <>
##$TPNAME6= <>
##$TPNAME7= <>
##$TPOAL= (0..7)
0.5 0.5 0.5 0.5 0.5 0.5 0.5 0.5 
##$TPOFFS= (0..7)
0 0 0 0 0 0 0 0 
##$TUNHIN= 0
##$TUNHOUT= 0
##$TUNXOUT= 0
##$USERA1= <user>
##$USERA2= <user>
##$USERA3= <user>
##$USERA4= <user>
##$USERA5= <user>
##$V9= 5
##$VALIST= <valist>
##$VCLIST= <CCCCCCCCCCCCCCC>
##$VD= 0
##$VDLIST= <DDDDDDDDDDDDDDD>
##$VPLIST= <PPPPPPPPPPPPPPP>
##$VTLIST= <TTTTTTTTTTTTTTT>
##$WBST= 1024
##$WBSW= 4
##$XGAIN= (0..3)
0 0 0 0 
##$XL= 0
##$YL= 0
##$YMAX_a= 10035593
##$YMIN_a= -6590788
##$ZGOPTNS= <>
##$ZL1= 120
##$ZL2= 120
##$ZL3= 120
##$ZL4= 120
##$ABSF1= 10
##$ABSF2= 0
##$ABSG= 5
##$ABSL= 3
##$ALPHA= 0
##$AQORDER= 0
##$ASSFAC= 0
##$ASSFACI= 0
##$ASSFACX= 0
##$ASSWID= 0
##$AUNMP= <proc_1d>
##$AZFE= 0.1
##$AZFW= 0.1
##$BCFW= 1
##$BC_mod= 2
##$BYTORDP= 1
##$COROFFS= 0
##$CY= 11.3945322036743
##$DATMOD= 1
##$DC= 2
##$DFILT= <>
##$DTYPP= 0
##$F1P= 20.1537800932815
##$F2P= 0.134698688090026
##$FCOR= 0.5
##$FTSIZE= 0
##$FT_mod= 4
##$GAMMA= 1
##$GB= 0.15
##$INTBC= 1
##$INTSCL= 1
##$ISEN= 128
##$LB= 0.24
##$LEV0= 0
##$LPBIN= 0
##$MAXI= 10000
##$MC2= 0
##$MEAN= 0
##$ME_mod= 0
##$MI= 1.114404
##$NCOEF= 0
##$NC_proc= 0
##$NLEV= 6
##$NOISF1= 3.799351
##$NOISF2= 2.8
##$NSP= 1
##$NTH_PI= 0
##$NZP= 0
##$OFFSET= 15.70392
##$PC= 1
##$PHC0= -9376.705
##$PHC1= 8.600969
##$PH_mod= 1
##$PKNL= yes
##$PPARMOD= 0
##$PSCAL= 0
##$PSIGN= 0
##$REVERSE= no
##$SF= 200.130013532006
##$SI= 16384
##$SIGF1= 3
##$SIGF2= 2
##$SINO= 400
##$SIOLD= 16384
##$SREGLST= <1H.CDCl3>
##$SSB= 0
##$STSI= 0
##$STSR= 0
##$SW_p= 3612.71676300578
##$SYMM= 0
##$S_DEV= 0
##$TDeff= 0
##$TDoff= 0
##$TI= <>
##$TILT= no
##$TM1= 0
##$TM2= 0
##$TOPLEV= 0
##$USERP1= <user>
##$USERP2= <user>
##$USERP3= <user>
##$USERP4= <user>
##$USERP5= <user>
##$WDW= 1
##$XDIM= 8192
##$YMAX_p= 0
##$YMIN_p= 0
$$ End of Bruker specific parameters
$$ ---------------------------------
##NTUPLES= NMR FID
##VAR_NAME=  TIME,          FID/REAL,        FID/IMAG
##SYMBOL=    X,             R,               I
##VAR_TYPE=  INDEPENDENT,   DEPENDENT,       DEPENDENT
##VAR_FORM=  AFFN,          ASDF,            ASDF
##VAR_DIM=   8192,          8192,            8192
##UNITS=     SECONDS,       ARBITRARY UNITS, ARBITRARY UNITS
##FACTOR=    0.0002004,     1,               1
##FIRST=     0,             0,               0
##LAST=      1.6414764,     0,               0
##MIN=       0,             -6590788,        0
##MAX=       1.6414764,     10035593,        0
$$ Real data points
##PAGE= N=1
##DATA TABLE= (X++(R..R)), XYDATA
0@%%%J08k16K16k16L24n40P56r72J188j512J944k355K787l348M011m776N640o601
21c562P767r067J0439j2010J3792j5759J7970k0389K3033k5999K9283l2857L6779
34A9420m1101M5850n1056N6736o2955O9837p7413Q5695r4844J05020j16334J28968
46F7823j43170J59243j77651J98933k23791K53375k89281L33901l91190M67743
56B55935n75884P41592j030023J671848n457912K012816J0777245o601566l822959
65b028908L852874q09190p605564L899839R457312j989493r040638N95011M238714
74E69957j018423n44M887853j042823o701466j067969M592758R58617o73631J465922
84A970251r88328l881918J253934M438404q94506l554348R57579J236549k176211
$$ y = [0, 0, 0, 0, 108, -108, 108, -108, 216, -324, 432, -540, 648, -864, 1080, -1275, 1512, -1836, 2175, -2601, 3039, -3562, 4205, -4862, 5577, -6433, 7359, -8400, 9570, -10819, 12214, -13785, 15498, -17359, 19420, -21681, 24169, -26887, 29849, -33106, 36731, -40682, 45013, -49831, 55189, -61145, 67823, -75347, 83896, -93755, 105178, -118613, 134762, -154519, 179382, -211808, 255935, -319949, 421643, -608380, 1063468, -4394444, -2381628, 8395617, 1794051, -2028908, 1823966, 1014776, -6590788, -2690949, 6766363, 4776870, -4263768, -3668757, 569957, -448466, -449010, 4438843, 3396020, -3305446, -4373415, 219343, 1177960, 504329, 1970251, 981923, -2899995, -1646061, 2792343, 1897837, -1656511, -698932, 537617, -1638594]
93a638594N72307M148133p80500m716704L06405L658426m23061j799384J084740
102D11768k79430k710338J177772M236165O6201l151872j080119l67652o72470
111b369975K699489L562914k163004m322991O13318K057809o43942J474713L267936
120D176267l184251o432064J703906O317275n4258k544361J957045n73269o060838
129d694548K85877Q107363J383301o563579j143679L537693j837590j908562N619312
138B785588K838822o984023m123921N173014K696348l165952R73057L419166l679496
147f7397m757177M010270M948022l051062l341093K285538O11496k731462J577753
156e15112L952481j930710m185813J178434K631569j024554n13896J707853r90174
$$ y = [-1638594, -1066287, 3081846, 2301346, -2415358, -2108953, 1549473, 1126412, -672972, 411768, 132338, -2578000, -1400228, 2835937, 2902138, -249734, -1329853, -1697505, -2369975, 329514, 3892428, 1729424, -2593567, -1980249, 77560, -566382, 908331, 4176267, 992016, -5440048, -3736142, 2581133, 2526875, -17486, 1939559, 1366290, -4694548, -4408671, 3698692, 5081993, -1481586, -2625265, 912428, -925162, -2833724, 2785588, 5624410, -1359613, -5483534, -310520, 2385828, -780124, 192933, 3612099, -67397, -4824574, -814304, 4133718, 1082656, -2258437, 27101, 638597, -2092865, -515112, 3437369, 1506659, -2679154, -1500720, 1130849, 106295, -407601, 1300252, 310078]
165C10078k572719J461285K903965r54436j916326M72524k17399j235662J758425
174I735K627637j612056k909515O96926J562968m15759M79163J319347j728780
183B9666k661763J307581K766452j11673q52527J91245j382732j761100J930858
192e43993K872277j013093k049361M22860r5032j216797J882381K874675k069551
201A064366l647103J206087K390225j193844k33680K712393q59001m277698O08113
210b230142M331378l74418l033064J149336J548716k771617r38422M075841J147831
219B905439m031132j058716K915291j30290k029830J733915J883763k681524j918947
228b412031K697638J502998k176600m59930J709299q71264j687139J764646J840019
$$ y = [310078, -2262641, -801356, 2102609, 1148173, -768153, -295629, -513028, -1748690, 9735, 2637372, 1025316, -1884199, -1187273, 375695, -40064, 439099, 1758446, 29666, -2632097, -1324516, 1441936, 1330263, 477736, 668981, -713751, -2474851, -543993, 2328284, 1315191, -734170, -311310, -406342, -1623139, 259242, 3133917, 1064366, -2582737, -1376650, 1013575, -180269, -413949, 2298444, 1439443, -2838255, -2230142, 2101236, 1726818, -1306246, -156910, 1391806, -1379811, -2318233, 1757608, 2905439, -1125693, -2184409, 730882, 600592, -1429238, 304677, 2188440, -493084, -2412031, 285607, 1788605, -387995, -847925, 861374, -9890, -1697029, 67617, 1907636]
237A907636j806239j478535J453918N12185j268675N88113J385910j305386j544935
246a556008J417539J359981j073621n34501R01171n12054j173024J058215J416759
255A304457r51737j080483O92629K35476p24396O05748J034422r62956j198150
264a044990P79683P47828n90585J38826P92869q23660j130355R64365J037488
273H71469r00126m61824R87619k53014j263820P28015J422836r14463j202619
282i85927J044010O47154j331200j01733J632072k51619j664067N53022J414164
291I55876r18571j056919J278605P13624j469233l23171J481920j29059j379962
300h46890N98281J256278r18525j037571J054339O50008j092784j26659J174553
$$ y = [1907636, 101397, -1377138, 76780, 588965, -679710, -91597, 1294313, -11073, -1556008, -138469, 1221512, 147891, -386610, 514561, 2507, -1170517, -112302, 1304457, 352720, -727763, -35134, 200342, -524054, 81694, 1116116, 153160, -1044990, -265307, 482521, -108064, 30762, 823631, -29, -1130384, -166019, 871469, -28657, -490481, 497138, 244124, -1019696, -291681, 1131155, 216692, -985927, 58083, 705237, -625963, -727696, 904376, 652757, -1011310, -458288, 955876, 37305, -1019614, 258991, 972615, -496618, -819789, 662131, 533072, -846890, -248609, 1007669, 89144, -948427, 105912, 755920, -336864, -463523, 711030]
309G11030l11082j232367N21630J081745n86197o54096P19874J48512r75610J53818
319d22743J130316k17990r79395K32803N28605m30987o9190P78304j29073j005333
329e84683M2686Q07763k5630l15505L07726p4710p35090J05939R05763N3992o34914
340a46663n6328J04412l10796K40661Q27788j26425r74415j51209N60280Q1972
350D9277J7469M41870k13310r60448k4406J008628L13030m98392j32457p0069
360f8808n33305J20137J091125L29369r44449n79159K97897J71527J39628O02250
370F26212M3023j049584n70535P65379P44925p6492j79373k25909o77319k24719
380h24392R41670Q16461m35911p83219j97775N3524K37196P00392L48772p99605
$$ y = [711030, 399948, -832419, -310789, 770956, 184759, -469337, 250537, 399049, -576561, -422743, 707573, 489583, -489812, -257009, 271596, -159391, -228581, 549723, 420650, -584683, -541997, 265766, 240136, -75369, 232357, 157647, -577443, -471504, 434259, 488251, -146663, -202991, -98579, -409375, -168714, 659074, 532649, -441766, -592975, -32695, 49277, 66746, 508616, 295306, -665142, -689548, 319080, 632110, 133718, 1261, -68808, -602113, -481976, 609149, 938518, -5931, -585090, -287193, -115666, 23962, 626212, 669235, -380349, -950884, -185505, 559420, 482928, 303555, 77646, -599673, -824392, 117278, 933739, 497828, -285391, -483166, -429642, -192446, 507946, 856718, 57113]
390E7113r37225J69733P76321M25926P6321k46046p45638n21044N72818R90101
400F18380J45460o38837n78412k09150K34307P37250O01040l74569r93332m60553
410i18416M36595P67943M94531j43916p70125o98022J63930Q59407O43499j35940
420F99486p44359p37422l7197Q07093Q71477L8589p64736p95857j86498N61458
430b87966Q92715L79905o16175r95649l11632O16823Q64840L69389m06333r00091
440c94174o12791L40131J012012O47518l46510r31544o17602K14745Q22404O91412
450H25601r2877q36606q01424M1915Q77941Q52048m003q21325q45623j14688P11011
461b08030R02548K36321o90570r34282k47163O51079R21094L60458n67250j021252
$$ y = [57113, -880112, -710379, 65942, 491868, 568189, 322143, -423495, -944539, -371721, 618380, 763840, 125003, -453409, -662559, -428252, 308998, 910038, 535469, -457863, -918416, -481821, 286122, 780653, 636737, -133388, -831410, -667480, 191927, 835426, 699486, -44873, -782295, -819492, -12399, 859078, 897667, 132931, -662926, -849424, -287966, 604749, 984654, 368479, -627170, -938802, -321979, 542861, 912250, 505917, -394174, -1006965, -666834, 345178, 992696, 646186, -285358, -902960, -688215, 134189, 825601, 732724, -103882, -905306, -863391, 14550, 866598, 862595, 41270, -804353, -919041, -208030, 694518, 930839, 240269, -694013, -941176, -290097, 630997, 991455, 424205, -597047]
471e97047m62213N95669J011905M41334m13708q59356o57130J91903J042965Q22936
481A117258l84540j091180n63274L05556P19083P19568J69122q57098j152537
490a018042k4164J109072Q30997j35165o13153o79125m22761M81244J184651M46852
500A160406r06529j050981j11385N61170P12949N57397k22466j109320p57258
509a166017N60951J070317L85099l55392o71134o71451l388R90658R26113l00810
519G64946j041900n76488J65301O06355P82710K79300q01216j083149k4960R51340
529B2239P50467k408n44558p74885m13227N67950J094546L80915p08502r53200
539e80663l30760M72106Q77136N21271l83153r34266n64651L02184Q91624P10108
$$ y = [-597047, -1059260, -463591, 548314, 989648, 575940, -283416, -940546, -748643, 294322, 1117258, 732718, -358462, -921736, -616180, 102903, 822471, 991593, 134495, -1018042, -1042206, 66866, 897863, 762698, 149545, -529580, -952341, -471097, 713554, 1160406, 253877, -797104, -908489, -347319, 365630, 923027, 700561, -408759, -1166017, -605066, 465251, 850350, 494958, -176176, -847627, -851015, 139643, 1065756, 764946, -276954, -853442, -688141, -81786, 700924, 980224, 179008, -904141, -929101, 22239, 772706, 770298, 225740, -549145, -962372, -394422, 700124, 1081039, 372537, -580663, -911423, -439317, 437819, 959090, 575937, -358329, -922980, -620796, 270828, 980936]
549I80936k14957j021624p36723L02136Q48766N73661K2188n82261r30355k85591
559a043824R16958J030780j07255q27531n36569j33851K44921Q40652O89948n87266
569D86963j220514k22764P63150N70837J68801r312n94258q72011J82052J185193
579D38137N03146o37428o03884j53445p9150L69020R09200J62513j066113p49777
589i07781M86269O75446J51800P4666j63236q09809m46659Q59211R91796k49090
599F62613q08985k92093p420R9664O47186O38559n05220j114509j84323P64901
609i9627N70994O8317j64109n23775o51561J27040R58938O10545m07000p86479
619b96717l86804J56414N27146N68954R4858n78652p29461j18358O43517P27936
$$ y = [980936, 765979, -255645, -992368, -690232, 158534, 732195, 754383, 172122, -758233, -1043824, -126866, 903914, 796659, -30872, -567441, -701292, -456371, 384281, 1074229, 486963, -733551, -956315, -193165, 377672, 546473, 537161, -57097, -929108, -747056, 438137, 941283, 303855, -300029, -453474, -532624, -163604, 745596, 908109, -158004, -907781, -421512, 253934, 405734, 480400, 317164, -492645, -939304, -80093, 911703, 662613, -146372, -438465, -445885, -346221, 300965, 939524, 434304, -680205, -864528, -99627, 471367, 539684, 375575, -148200, -799761, -672721, 286217, 896762, 489762, -296717, -683521, -527107, 39, 568993, 663851, 85199, -644262, -762620, -119103, 608833]
629F08833N6213n76627n37510j08778K56111N19804M69760k09266q30495l98276
639g50231N17956N95259M0295j51839j91013m60297j95537O61637O67151l52503
649C80878o93605j5098K47812o862K38098M09996l62518q01320J21226Q02806
659C21413J23567m24840l2704P170m06979P4800Q19686J75664q49082m07084M84109
670a14280K44065j32122K68102J62922p06898n28244O75263P54260k84265m84670
680a45867M7506r3158k90880M27979P62489k36406q98041j45595N13775J80104
690A21906n581K53773q7472o85958k47129O57916N32119k34152l53471n7731j07847
701b13627r1829L61297M57229j79255n71898j47727L13315K06531N068M8665l9976
$$ y = [608833, 665046, 88419, -449091, -557869, -301758, 218046, 687806, 478540, -351955, -750231, -232275, 362984, 403279, 251440, 60427, -399870, -595407, 66230, 733381, 380878, -312727, -327825, -80013, -86875, 151223, 561219, 198701, -602619, -481393, 321413, 444980, 20140, -12564, -5394, -412373, -337573, 482113, 657777, -191305, -598389, -114280, 129785, -2337, 265765, 428687, -278211, -806455, -131192, 623068, 338803, -145867, -98361, -191519, -482399, -54420, 708069, 471663, -426378, -571973, -58198, 121906, 116325, 370098, 282626, -403332, -650461, 7455, 539574, 305422, -48049, -105780, -213627, -305456, 55841, 513070, 333815, -238083, -385810, -72495, 134036, 139104, 187769, 147793]
712A47793l06363j88007K95945L67106j04022l14639j2869J25031p5314k2015
722h7354K41598N0732l42722j26126L37125J34380k98472p6654K68951k6610k63428
733a88580J46515K91528k54110l51103K88708L76196k45657k77834K34765R0396
743A10824l42799M5626N12403k6826n56106l3659M20790l5014k42478K63333K19593
754C35687m52922l14304M47742L32855l18713j52987K85260q2862m03468J79163
764a44549N06266j28466m40269J13512K62239k41357j66445L92409J91303m14147
774f9504k03366L20721P7667k87913Q2174L63550j28338m20603N8679L22126n7561
785E7632j61957J96292J24332l37191k34631K96501K94616j28856j55877O6891
$$ y = [147793, -158570, -346577, -50632, 316474, 212452, -102187, -115056, 9975, -65339, -87354, 154244, 204976, -137746, -263872, 73253, 207633, -90839, -167493, 101458, 74848, -188580, -42065, 249463, -4647, -355750, -67042, 309154, 63497, -214337, 20428, 110824, -231975, -186349, 326054, 299228, -256878, -290537, 130253, 95239, -147239, 116094, 335687, -117235, -431539, 16203, 349058, 30345, -122642, 162618, 79756, -323712, -144549, 361717, 233251, -207018, -93506, 168733, -72624, -239069, 153340, 344643, -69504, -272870, 47851, 125518, -162395, -80221, 283329, 154991, -265612, -206933, 115193, 57632, -104325, 91967, 216299, -120892, -355523, -59022, 235594, 106738, -49139, 17752]
795A7752n7013k10632J06006L82866N5712l43572j87163J28923R1902P916J52479
806A45176J03545k58853l06875J31823L45785M9156j58650l3219l3841j68482
816a84435L5838L39579J14727l15843k02184J65423J06013q0996Q6396J44916
826B09434k15158k78403K06059L36410j36300k72107J04069J22112j76931K824
836i7991L22676l6030m49185l4319M40435Q9207k93491n676J40680k26474j49293
847b99461M29720L09850m12841m10217K10988K54845q0889P7520K24879k68977
857C5417n01400J51110N78378R6932l10280j08807l7707j92062J09578N07846
867C29005J41622m77482l56089J39592K19500J21115J72169j6546m07174k95812
$$ y = [17752, -39261, -249893, -143887, 238979, 294691, -48881, -236044, -107121, -15219, -7303, 145176, 248721, -10132, -317007, -185184, 160601, 209757, 51107, 17888, -15953, -184435, -148597, 190982, 305709, -10134, -212318, -46895, 59118, -21878, 64518, 209434, -5724, -284127, -78068, 258342, 122042, -150065, -45996, 76116, -100815, -97991, 224685, 188655, -260530, -294849, 145586, 234793, -58698, -64374, 76306, -150168, -299461, 130259, 440109, 27268, -382949, -171961, 82884, 1995, 79515, 304394, 35417, -465983, -314873, 263505, 360437, 50157, -58650, -96357, -288419, -178841, 329005, 470627, -6855, -362944, -223352, -3852, 117263, 289432, 272886, -134288, -430100]
877d30100K56237M14037P0145j70572j83752j92689m1364K96075L30747p4970
887B73794l54992j94889Q1228J95854J90642N5385j95627k88394n0583K51178
897c6404K69321P216k37767k25076n958J76398J95009R0108j17204k99906j66861
908c51124K44080L72334J4318k78433j72645k3975K4040K21884L24688r4561n10754
919b30148j99237L43763L00466p510l2625j08006l53568j25469M73090M34278
929D95034k22346m29234q1614O4546O5334K98135K67309l05281n34090N357M14787
940C7937K02838k2502n3896k48068l16667J46087N04806J49453l16842k62271
950a79125n1430K2720K10185L32014l5498m44013k39605K13066K70159J06467
$$ y = [-430100, -173863, 240174, 310319, 139747, -44005, -236694, -278058, 18017, 348764, 273794, -81198, -276087, -194859, 995, 191637, 247022, 51395, -236999, -287582, -36404, 232917, 240133, 2366, -222710, -228668, -52270, 142739, 232847, 115643, -184263, -351124, -107044, 265290, 279608, 1175, -171470, -195445, -171405, 50479, 375167, 280606, -230148, -429385, -85622, 214844, 207334, 174709, 66703, -286865, -412334, 60756, 495034, 272688, -156546, -238160, -173614, -108280, 189855, 457164, 151883, -382207, -376850, 37937, 240775, 218273, 164377, -83691, -400358, -254271, 250535, 399988, 83146, -179125, -230555, -207835, 2350, 334364, 298866, -145147, -384752, -171686, 98473, 204940]
960B04940J0935j79854l38251m9868L83815L08184j10289k72173j72313n0330
970b65204J61918L40906J25760k99229l46241j4338K33964K52056J26542j43813
980A72321l50539j76306K09775L27677J32536j15561k82821k46931Q8774L76995
990A35920K15350j55620k65936j60016k0000K11784L47095L7712l85977k90012
1000c29700J22357K39555J24348P3490r1485l43801j78352L13307L68958n3039
1010B45638k58441j33772o4830L0912K80499K47348j96427l88215o1204K25831
1020g2661J84557R5914j8761k56090k67786J15703L60721J43801j36836j93334
1030d4772j72183m1864K51749L20332m2382l30227j82875O0601J46428K03420
$$ y = [204940, 215875, 36021, -302230, -352098, 31717, 339901, 229612, -42561, -214874, -265204, -103286, 237620, 363380, 64151, -282090, -296428, -62464, 189592, 316134, 172321, -178218, -354524, -144749, 182928, 315464, 199903, -82918, -329849, -241075, 135920, 351270, 195650, -70286, -230302, -250302, -38518, 308577, 346289, -39688, -329700, -207343, 32212, 156560, 230050, 138565, -205236, -383588, -70281, 298677, 245638, -12803, -146575, -211405, -180493, 100006, 347354, 150927, -237288, -298492, -72661, 111896, 207810, 189049, -67041, -334827, -219124, 141597, 285398, 148562, -44772, -216955, -258819, -7070, 313262, 270880, -59347, -242222, -181621, -35193, 168227]
1040A68227J41651j86061l69570o4116K91641K28607J236j00083j84121j96219
1050b68808Q0546L42210J59859k00669k46479o8524N9895J68863K07874j8466
1060B16301k84016j95583J04973K06925J19617J702j55098k29173j6800K51063
1070A9911J89519o2520j58224j25251o6630J11563K61561P9128k35190k14739
1080b00872L7508J34546J07024J01271l9981k53731j57544J84526K57291J8712
1090A88750j24954j08344j07689j4263K04246K09210q3592k46875r4230Q0389
1100i7352J20280J22031L7951j57249k04550Q268J86675J33405k998j01112j54241
1111a08892p2527J30822J89713J7353j31459j14232m5979M1759J56149J23029
$$ y = [168227, 309878, 123817, -245753, -309869, -18228, 210379, 211615, 111532, -72589, -268808, -188262, 153948, 313807, 113138, -133341, -201865, -141970, 26893, 234767, 216301, -67715, -263298, -158325, 48600, 168217, 169919, 14821, -214352, -231152, 19911, 209430, 146910, -11314, -136565, -203195, -91632, 169929, 249057, 13867, -200872, -163364, -28818, 78206, 179477, 139496, -114235, -271779, -87253, 170038, 188750, 63796, -44548, -152237, -166500, 37746, 246956, 163364, -83511, -177741, -97352, 22928, 144959, 182910, 25661, -178889, -170621, 16054, 149459, 146461, 45349, -108892, -181419, -50597, 139116, 156469, 25010, -89222, -135201, -93442, 62707, 185736]
1121A85736r9680k05036m4701J14097R6868M7494M043j13976j52927L2153J95945
1132F0016R2746q8669j10713n1096o920Q1123J39010K3151j42911j23254K5150
1143a02367J03755Q5482K3140p4514j21525k8397R7651J02394J9882n3527r6265
1154d4291o9012N5022J35219M4932q4260q2966j7681J4655N7512Q8600k749j27369
1166c2388q2091O5347R3583J7848j6667l3135p1098l3228P9195R6653j7126q9058
1178b2165m4092J2763L5920N4144K9008m7729p9723j3819N4306N6171J7445k7745
1190B4484n9483l3904L7657O4929J6068l1649l6016k4161J110M7813N4361j5005
1202D6204o6148k5886L1075K9534R636Q187j1314m3742j8232M5288M6108j8375
$$ y = [185736, 86056, -118980, -163681, -49584, 47284, 94778, 98821, -15155, -168082, -135929, 60016, 152762, 64093, -46620, -97716, -104636, -23513, 115497, 138648, -4263, -127517, -102367, 1388, 86870, 110010, 35496, -86029, -114426, -16775, 85619, 105501, 51974, -44291, -113303, -58281, 76938, 121870, 37610, -45356, -63037, -48382, 9130, 97730, 94981, -32388, -114479, -49132, 44451, 62299, 45632, 12497, -58601, -91829, -12634, 84019, 66893, -22165, -66257, -53494, -17574, 36570, 65578, 17849, -61874, -75693, -21387, 34784, 52229, 24484, -34999, -68903, -31246, 33683, 49751, 18102, -17914, -42075, -40965, 6848, 61209, 46204, -19944, -45830, -14755, 14779, 24415, 32602, 21288, -22454, -40686, 4602, 50710, 32335]
1214C2335m1157m910J0682k937J0887K8391q032m5200r584L7571J7042k2834q818
1227f564R158j0416j2121K2505K0179k2878k5457J4538J6647j0539m943J2501
1239B610n808j6911R618K0527q935j8248Q459J0889o896k981J0226k062j0817
1252a0329O984J5055n389j4734M03R754P367K279l498r227n191M829J0861J1413
1266B0577K34k4042k0782J8775L1347j348j7049l428j2495k0920K5192N1802r965
1279C7898o1196j3514L3257M802N71L5346m819p6475k4280P3658M3132l6275j8804
1292f699P994m0603k3636P7593O3210o3700p1289K4607K7554j5153L4792N2053
1304F6723n9143r2510L7198R0396o880l6848J9377j7364o7357K9522J07523j534
$$ y = [32335, -8822, -13732, -3050, -5987, 4900, 33291, 25259, -19941, -29525, 8046, 25088, 2254, -6564, 2594, -7822, -19943, 2562, 22741, -137, -25594, -11056, 5591, -4948, -9891, 2610, -3198, -20109, -10491, 10036, 1101, -17147, -8688, 2201, -4695, -7676, 2550, 488, -10329, -3345, 11710, 6321, -8413, -8010, 1744, 9111, 11390, 7892, -1335, -6526, -1697, 9164, 20577, 20811, -3231, -24013, -5238, 26109, 24761, 7712, 4284, -8211, -29131, -3939, 47863, 37898, -23298, -36812, -3555, 1247, 1818, 37164, 32345, -44130, -68410, 5248, 48380, 12105, -6699, 1295, -39308, -62944, 14649, 77859, 14159, -57130, -32523, -4969, -20122, 14670, 66723, 7580, -84930, -47732, 42664, 35784, -1064, 18313, 949, -66408, -36886, 70637, 69103]
1316F9103r6188j6596M6792n537l959O0583K109r7464l2639Q5600N0445l8013
1328B4236k0554O18l8034j2466P4258N0346n6093o9559J819L3419L0012K9510
1340D7512o152o2256m7183K4943N9950L8436q034o0938o0406J6397P2029L7981
1352E2279j3172l2059n4692l8938N6419J03901L957q8650m4237J1579P835M1813
1364F035P8659j7637j22263m2158Q6761N7136j1948P734j5984r3020k5603J20571
1376B8283P7260p2269o4083J5682j3206j5847Q9088O5442j02792j03469N8764
1387c7147P8576k1868q44L8080o5940r6686O9118J29980l0482j00427N131K6088
1399f421l5802K9532R8625k6683j34634j8921J00302L8631k5301P044k0205p9418
$$ y = [69103, -27085, -43681, 3111, -2426, -6385, 54198, 56307, -41157, -73796, 11804, 62249, 24236, 3682, 4300, -33734, -46200, 28058, 78404, 22311, -47248, -45429, -12010, 18002, 47512, 41360, -20896, -68079, -43136, 16814, 55250, 47216, -13722, -74128, -57731, 14298, 52279, 39107, 7048, -47644, -86582, -30163, 73738, 77695, -10955, -55192, -43613, -35778, 6035, 84694, 67057, -55206, -97364, -10603, 46533, 34585, 42319, 26335, -66685, -92288, 28283, 105543, 33274, -30809, -15127, -28333, -44180, 44908, 110350, 7558, -95911, -37147, 41429, 19561, 18717, 56797, -9143, -105829, -36711, 93269, 62787, -37640, -32509, -6421, -42223, -12691, 85934, 59251, -75383, -94304, 5998, 44629, 19328, 26372, 6167, -73251]
1411g3251m013J08189N6607o0844o5436j3467N663M1686O9655N626p9517o0714
1423f9816J3568N0642N7852K4921n5254q5605m649O7196M7652J1088j2744o6222
1435b1371o6375M2495J06225K0317o0155l7580k0171k0284N0129R3250j4745j08001
1447c6266l3163N2017K2674J3837M5282k7560j11423j3937J11358M3248n6600
1458I467j4804R526n8772j2289J13737N0047j10658p1366O4832L4529k9652M1093
1470B5690M5435r1716q9527Q4608J04716m0789o0482K0856j2967m8686N7629J01265
1482I6032m0387j12395l318N9505J1059J4961L7637l9813r2134P370R0225L2675
1494F1417l0029k2029l3207l8126L6298Q5795R988o6121m1490k000R948M3644
$$ y = [-73251, -77264, 30925, 87532, 26688, -38748, -52215, -46552, -4866, 64789, 70415, -9102, -69816, -56248, -5606, 52246, 77167, 21913, -63692, -68341, -1145, 46507, 57595, 44851, -21371, -87746, -45251, 60974, 81291, 21136, -16444, -36615, -56899, -6770, 86480, 71735, -36266, -69429, -17412, 5262, 19099, 64381, 36821, -74602, -88539, 22819, 66067, 9467, -5337, 4189, -54583, -66872, 46865, 96912, -13746, -85112, -20280, 14249, -15403, 25690, 71125, -20591, -110118, -25510, 79206, 38417, -22065, -1209, -14176, -62862, -5233, 96032, 55645, -56750, -60068, -563, 10496, 25457, 63094, 23281, -68853, -61483, 28742, 61417, 31388, 9359, -23848, -61974, -25676, 60119, 70107, 3986, -37504, -39504, -29556, 14088]
1506A4088N1333k5279p8848k1364M0722L3617K1192P695m7729o1766J7811O8154
1518A9626K0370k0180j4532l2768l3435M2415P5263j3935o8412q955K1409p554
1530b0688K3104N7708k5576r1869k10P9192J4085l3942J5664Q39o5383l128R5726
1543D5522K7886q1495l3074M0654l374j5061N7265K8865q3957n4654O4374N0291
1555D3242k8946p813J8425m5910m2052O3412O7994m0410n7304R753O438j4865
1567b8036L7712M7598m1223o8990J3643M7792M369p45J3254l2990m7554K5271
1579b9899O0355L221l1996r235j1635j5607L0346M6453j4568m7132o088J6562
1591i223N529K0287K1394k9487m5028J2679L8697L676m915N394k3433l1745K7817
$$ y = [14088, 65421, 40142, -38706, -60070, -19348, 14269, 35461, 43156, -4573, -66339, -48528, 19626, 39996, 19816, 5284, -27484, -60919, -18504, 56759, 42824, -25588, -34543, -13134, -20688, 2416, 60124, 34548, -57321, -57531, 21661, 35746, 1804, 17468, 18307, -47076, -50204, 45522, 73408, -8087, -41161, -507, -3881, -18942, 38323, 67188, -16769, -71423, -7049, 43242, 14296, 6483, 24908, -21002, -63054, 358, 68352, 27942, -29362, -19609, -13171, -28036, 9676, 57274, 16051, -52939, -39296, 8496, 12865, 12120, 25374, -7616, -55170, -29899, 30456, 33677, 1681, -7554, -19189, -34796, -4450, 42003, 27435, -19697, -25785, -9223, -3694, 16593, 37987, 8500, -36528, -23849, 14848, 18524, 13609, 19003, -4430, -36175, -8358]
1604h358M6793j3198l4903L771M084j8393K0761M3111k1185n6471Q533L9965p867
1617F643j1349K6759p888n2482N921O0692K828m5568J074J8755k5808n496N1110
1630B5191J1749n6940j7669M0211O262k0054K0633J4616m2980k1984M5214K6831
1642C1080k9084j0337J6462j7103j7863L5556K7595l2425k6468K1059Q560j4046
1654g014J5568J9934k7447k7956K3238K4188j4182o000J3213j3867k1034K0486
1666h73K5984j7228j9741J1768K521j3819J1783K0546j8396k3266J5307J4155
1678H741j3268k33J6232j1966k1592J6241K1854j6384j3834J6253Q95j9659R818
1691f902K4751j4118k3958J6532J5786j8401l920K2660l858k6104R970K6490j3958
$$ y = [-8358, 38435, 25237, -9666, -5895, -1811, -20204, 557, 43668, 22483, -33988, -25455, 14510, 6643, -4706, 22053, 14165, -38317, -32396, 28296, 31124, -14444, -13370, 5385, -20423, -25919, 25191, 36940, -20000, -37669, 2542, 8804, -11250, 9383, 23999, -18981, -40965, 4249, 31080, 1996, -8341, 8121, -8982, -26845, 8711, 36306, 3881, -22587, -1528, 7032, -7014, 8554, 28488, 1041, -26915, -3677, 20511, 6329, 329, 13542, -325, -21359, -873, 25111, 7883, -11858, -90, 2431, -11388, 395, 20941, 2545, -20721, -5414, 8741, -4527, -4760, 11472, -494, -22086, -5845, 16009, -375, -14209, 2044, 2939, -16720, -6902, 17849, 3731, -20227, -3695, 12091, -6310, -10230, 12430, 8572, -17532, -7562, 18928, 4970]
1704D970j8410J7983J0146k3706j049K6881m277k5859R819K1897j5893j5090K0354
1717G766P428k3248p50K3376n953k1872J0705J6503j4380j0105J6567J744j9850
1730a2069M299K0926r316j7138J1035Q737j4589J48J8997o158k1689P027J8242
1743H452q536q482J3347L80k0596L601K4429l196j8633M523R227j1029j005K0983
1757A3465J34k3833k076J7837M79o442R769m5j9692k110K2145M698j2592p15K094
1772C116j2207J714K2485K990k2337p070J1777o14k272J4972J429k5203r117K1688
1786A351J1683j0464k094K475j5394o394K4221J5195j8935j6115N889K801O2J4420
1800H701P899k0751j8284J2112J7324K2N68j668j7674q597K0819J9766r210j4178
$$ y = [4970, -13440, 4543, 14689, -9017, -10066, 16815, 12538, -13321, -3502, 18395, 2502, -12588, 7766, 15194, -8054, -8804, 14572, 8619, -13253, -2548, 13955, -425, -10530, 6037, 7781, -12069, -7770, 13156, 3840, -13298, -2263, 6474, -8115, -7967, 11030, 4872, -16817, -9790, 8452, -84, -8566, 4781, 5161, -15435, -11834, 12595, 9399, -9234, -4711, 4516, -6513, -7518, 13465, 13599, -10234, -12310, 5527, 6006, -436, 9333, 9288, -10404, -12514, 9631, 14329, 1737, 1022, 3116, -9091, -7377, 15108, 18098, -4239, -11309, 468, -146, -2418, 12554, 13983, -11220, -20337, 1351, 13034, 2570, 476, 2951, -12443, -18837, 5384, 20579, 1644, -14471, -8582, -5781, -5719, 8701, 16600, -4151, -22435, -10323, 7001, 7023, 7591, 5923, -11751, -20348, 471, 20237, 11027, -3151]
1814c151k004n050j69K1270J4920j9534k4296N839J4789L505O198M852j9437k1570
1828b3838J3342K7573K266j4558p887o699o333J5988K3281n165k6895r982Q833
1841a0074R907J1395O786j5483k4395P67K1885J3066j838p833j6914j1988J4682
1854a0037K7135K497j9166j3735k575L296J7572J9202q983l0662r061J8159J6428
1867A0070N455r73j4103k2088K146K9244J6435j2540j8510r499p50J4012K2710
1880B1609L290k4498k1258M376J7986J4714N298j2846k6034p180K0780K2970J108
1893B0315j3683j8106j1857P730K7531J4984j6423k5902p970J0015J7298J5966
1905A9898k133k4572k1162O982K6335J5679m746j8616j9434p06K0040K2859K402
$$ y = [-3151, -5155, -10205, -10374, 10896, 25816, 6282, -18014, -12175, 2614, 6119, 12317, 17169, -2268, -23838, -10496, 17077, 19343, 4785, -3102, -9801, -16134, -146, 23135, 17970, -8925, -18907, -10074, -167, 11228, 18014, 2531, -21864, -21097, 788, 13854, 12016, 4183, -12731, -24719, -10037, 17098, 19595, 429, -13306, -15881, -12585, 4987, 24189, 15206, -15456, -24517, -6358, 10070, 15525, 14552, 449, -21639, -19493, 9751, 26186, 13646, -4864, -14363, -15113, -1101, 21609, 24899, 401, -20857, -16481, 1505, 16219, 21517, 8671, -17363, -24543, -3763, 19207, 20315, 6632, -11474, -23331, -15601, 11930, 26914, 10491, -15411, -23381, -13366, 3932, 19898, 17765, -6807, -27969, -20987, 5348, 21027, 16281, -2335, -21769, -22475, -2435, 20424, 22826]
1918B2826k0535k1933l384J8637K3243M639j7513k0999o194J2633K2643J2729
1930B6792j2893k7903j0790J7372K2674O973q316j8820j7125M138K7373K0191
1942B9666j2698k7228j0862P329J5755J8285K931k3599k5885L122K6070J8871
1954B1757l684j7061j9241p187J6388K6834P593k1149k4838m125J4989K1350J1432
1967B3058j0680k5483j4253J2962K6144J0975r546k0835j4390L915K2187K0625
1979B4679m031k5404j7578O204K0344J5351R13j5308k2294o239K2155K5423j598
1992B2617k1299j5473j938Q963J9309J4281j3568l0004q904K2192J9522J224q217
2005H705j3704j7028J638K8578J9869j6207k6430n951R668J1345J3577N293j9458
$$ y = [22826, 2291, -19642, -23026, -4389, 18854, 23493, 5980, -15019, -21213, -8580, 14063, 26792, 13899, -14004, -24794, -7422, 15252, 22225, 13909, -4911, -22036, -17898, 9475, 29666, 16968, -10260, -21122, -13793, 1962, 20247, 23178, -421, -26306, -23184, 2886, 21757, 18073, 1012, -18229, -25416, -9028, 17806, 25399, 4250, -20588, -24713, -9724, 11626, 23058, 12378, -13105, -27358, -14396, 11748, 22723, 13177, -7658, -22048, -18133, 4054, 24679, 20648, -4756, -22334, -16130, 4214, 19565, 20478, 5170, -17124, -23363, -1208, 24215, 22617, 1318, -14155, -16093, -7130, 12179, 26460, 12892, -17112, -26016, -3824, 15698, 16922, 8705, -4999, -22027, -20389, 8189, 28058, 11851, -14579, -20530, -10862, 483, 14060, 19353, -105]
2018a05k5728L212K7228J5014p194j4004j1618o631J1375K3559P899j9319k1722
2031a8034l52J5331J5001N462p485j7970j1943R547K2591J0207j2185j8308p513
2044a5651O480J4705J2397j122j9119j6911N861K0967J0534o690j1331j0874n463
2057a6217J1453K2062L162k2420j6142O553J0339O745P661k202k2853j3728J8921
2070f666K3127m251j4199k745n165o235J4850K2863q679k7711l543J7515N030
2083D191j748Q497l223k3111m298K5696J4193j4385j2108L474j958l034J5588
2096G774J2612j5511k0166O040J5750J532j971J255p890j2458N560J9030L065
2109A4622j3024q335L17K734M555Q374J33j2701r890N624J1769L894m260o383
$$ y = [-105, -25833, -22621, 4607, 19621, 12427, -1577, -13195, -19826, -8451, 15108, 23007, 3688, -18034, -18386, -3055, 11946, 17408, 9923, -8047, -19990, -10443, 12148, 22355, 10170, -8138, -15651, -9171, 5534, 17931, 16809, -2310, -19221, -13360, 7607, 18141, 11451, 120, -10754, -16217, -4764, 17298, 20460, -1960, -18102, -11549, -1210, 5535, 13196, 10994, -11859, -25587, -6666, 16461, 12210, -1989, -4734, -9899, -16134, -1284, 21579, 12900, -14811, -18354, -839, 4191, 2443, 10940, 7717, -15394, -19692, 6004, 20197, 5812, -6296, -2822, -4780, -7814, 7774, 20386, 4875, -15291, -9251, 6499, 8031, 6060, 7315, -575, -13033, -7473, 11557, 14622, 1598, -6737, -6420, -3686, 869, 9243, 9376, -3325, -13215, -7591, 4178, 8072, 3812, -2571]
2123b571m154k277N110J0569K301j0229j0742L881R504J552m76R66n527r741M593
2138g241J5552J348j3433k599P048k343k610J1144N296j5566q876J4073Q550j0306
2152C7k116R290m360j2910Q554J6045q315j5830P799J0299r308m164J2488J504
2166I013j7270m04J6424m05j3472K459J0314p170q824J0597O807j1379o898J1188
2180I80M212r715p71Q738k713q450M532Q534m701p616L816N780k537l650M382
2195H21J281m570j060O126J629m853k495L902K413j939o26K361r56m135J408O431
2211E738k58o685j736N500J332l731K202L002o809n693P764Q545o990p555M559
2226h15K298n864K276J0810l998j4615J107J2615m9p208M275K352j1821l354J5854
$$ y = [-2571, -6725, -9002, -3892, 6677, 8978, -1251, -11993, -8112, 1392, 2944, 2468, 3434, -2093, -11834, -7241, 8311, 9659, -3774, -6373, 675, -1668, -4278, 6866, 12162, -3404, -12280, 1793, 10343, 37, -2079, 7211, 2851, -10059, -1505, 14540, 6225, -9605, -1806, 8493, -815, -4979, 7509, 9013, -8257, -8661, 7763, 7358, -6114, -3655, 6659, -511, -9335, 1262, 8069, -3310, -10208, 980, 5192, -4523, -5294, 3444, 731, -7719, -3187, 5347, 646, -6970, -3154, 2626, 89, -3561, 821, 2102, -2468, -3528, 2598, 4227, -626, -3121, 781, 3194, 1255, 629, 2990, 2034, -2101, -693, 5738, 5480, -1205, -2941, 2559, 3891, 160, 2362, 5364, -1445, -7138, 626, 9171, 2181, -5374, -815, 1483, -4381, -2105, 8705, 4707, -9908, -8801, 3814, 3765, -3443, 832, 3184, -8637, -11991, 3863]
2241C863P202j3148p377P674J046n226Q404Q917j1501j4304Q621J3042k387n123
2255b97L534k851j0171N186J5577P83j3714m599N662J103J352P141K51j2992o306
2270a0341R419R937j144n211k823n261j021Q773Q445l754j1446m696M235O893
2284B005M396l16o616q262j445R019R510q56j0061p195J576N733O015M497m455
2299C545j2489m446R789J1273k67o417m849m980R58J0659J1007n435j6082l553
2313a1287R004O770K918K328n923j4472m81J5829J0353o821r136l734k108L161
2327c599J3146P330j3069j5779K038J1092N823J222j358j0329j1748O541J7552
2340H862M476j1147r185k759J088Q010J2277j623j6278j0161O802J2176M957r42
$$ y = [3863, 11065, -2083, -9460, -1786, -740, -5966, 2438, 11355, -146, -14450, -5829, 7213, 4826, -297, 3237, 386, -9785, -4599, 10978, 11761, -1953, -6552, -890, 213, 1565, 8706, 8957, -4035, -10341, -922, 9015, 7871, 2660, -163, -5424, -6445, 2328, 10773, 7019, -4427, -9123, -4888, 2005, 6401, 6085, -531, -8793, -10238, -1219, 8291, 7435, -2626, -9821, -8245, -2512, 3503, 8000, 3545, -8944, -13390, -3601, 7672, 7405, 988, -3861, -8841, -7883, 2776, 13783, 8348, -7734, -11287, -2283, 4487, 7405, 9733, 3810, -10662, -11143, 4686, 15039, 8218, -918, -4652, -6760, -3599, 9547, 16877, 3808, -11971, -9933, 1159, 6982, 8204, 6846, -3483, -15231, -8690, 8862, 13338, 2191, -6994, -9753, -8665, -655, 11622, 9999, -6279, -16440, -9638, 2538, 7495, 6553]
2354F553o426j1268l557J2669J3811j560j1869p614r84O565J0887N821p432j4388
2368h792m092R419J2482L839n906j0972p155M896J3232Q457n488j2691q524L350
2382g945J2167R091k709j1116j0190J86J0908J2081M27j2399j1323p44R405J0661
2396H500K513p288j3963n247J0280J3559K678q304j0388o108L739J3911J0050
2409A3932p505j4662o663O505J0133Q167N10j1804j3150K661J4601J0472l426
2422I771r630q502k987Q311J5421L254j2819j2927J070Q175Q754N705m461j4403
2436e268q798R628J4443L586o983r082p509J329J1936J1283m643j4297p960L645
2450h690R354Q857N74j0890j1949L99J1747R417Op878j1336m026R270J4393J616
$$ y = [6553, 127, -11141, -14698, -2029, 11782, 10222, -1647, -9261, -10245, -3680, 7207, 13028, 5596, -8792, -12884, -3465, 9017, 12856, 6950, -4022, -11177, -6281, 6951, 15408, 9920, -2771, -11295, -7945, 4222, 13313, 10604, -512, -10702, -10516, 392, 12473, 12900, 501, -10822, -11566, -2161, 8500, 11013, 3725, -10238, -15485, -5205, 8354, 11032, 2728, -7660, -13768, -10029, 3882, 13932, 6427, -8235, -14898, -8393, 1740, 9907, 10417, -1387, -14537, -11876, 2725, 13197, 9771, 141, -8361, -11348, -3037, 12384, 15638, 2819, -10108, -9038, -863, 7891, 13596, 9135, -5268, -14066, -4438, 10005, 13591, 6608, -2474, -9983, -8654, 3282, 14565, 9922, -4375, -12335, -8690, 664, 9521, 10095, -795, -12744, -12345, -598, 8819, 8825, 947, -10389, -14415, -5145, 9248, 10864]
2465A0864j0044j0027k618M470J1640Q473o130j4307o188P991J0964N278j864
2478H502r966j0121J749J3975R696l947j0747p362l31Q965J1363J194j0821j0513
2492h364N6P365R642L859o825j3234l569R031J0115J832n023q000p416J862J3503
2507D834P959p829j1758l234L625N547P945J943j1001j1986L529J2118N087j167
2521E612n613q411l600Q135J2419P09r232p807p93M411R340N701n882j1348k365
2536h724O293P062M283j457q799p865L874J2159M148n192o379l744j148N630J0117
2551A0258K89j0939p348K934O612L475K055m440r238k969P358Q111K2n632o028
2566e480l105L676Q549L011n677o729j810J633N906O595j793r751m576N892N098
$$ y = [10864, 820, -9207, -11825, -7355, 4285, 12758, 6628, -7679, -13867, -5876, 5088, 10366, 8502, -1464, -11585, -9836, 4139, 13835, 9888, -859, -8221, -8552, 413, 11776, 12970, 2149, -8364, -8308, -943, 8699, 12558, 5733, -7501, -11070, -2039, 8076, 9908, 4885, -3115, -10531, -8669, 4834, 12793, 4964, -6794, -10028, -6403, -856, 7089, 9032, -1969, -13955, -10426, 1692, 6779, 5612, -1, -8412, -12012, -3877, 8542, 9251, 19, -7788, -8581, -4170, 5170, 10871, 4989, -6359, -8724, -2431, 4631, 8914, 7457, -1342, -9207, -5333, 6826, 10974, 5782, -597, -4341, -5489, 141, 10258, 10547, -392, -7740, -4806, 1806, 5281, 7336, 2896, -6342, -9311, -1953, 6158, 6180, 548, -5480, -8585, -4909, 3640, 6651, 974, -5755, -7565, -5932, -26, 6569, 4776, -4975, -9551, -3659, 1439]
2581A439J485N31k555p205k171R263O944l594o130n42l50Q21N939M891o049p556
2597d839J018N917J445J298k72m619n271L680P884O7m814k134n02j627K837O341
2613F409k227p264j680M129J573l49K047k124n861m92O371K729l377k023k16j277
2629c632M88L697J852l445l446J123K701J711J28j497k036l42K518J301L97n64
2645I54j366j617K136L561j755j856P75M40j575J269K987j310l944N73M506q12
2661B966l065J685J189m280j37N011M50o013p8L942p42k631K292J568m771k000
2677d614N968J723n045j829L529l96k800L299L050m919n027N251M775l357k320
2692b712L148j334m036K640P964k780p005K73M817L59j040L295m91o159k122P463
$$ y = [1439, 2924, 3455, 900, -6305, -8476, 787, 7731, 4137, -1993, -2535, -2885, -2064, 3875, 8766, 2717, -4839, -3821, 2096, 3541, 4839, 4567, -52, -5323, -1643, 6241, 6308, 1494, -640, -1142, -2769, 68, 6409, 4182, -3082, -4762, -633, 940, 591, 2638, 514, -5347, -5839, 532, 3261, -116, -2139, -2355, -3632, -3144, 553, 2405, -1040, -4486, -3363, -662, 1049, 1177, -320, -2356, -2698, -180, 1121, 1518, 954, -412, -2029, 107, 3668, 1913, 57, 832, 1272, -303, 966, 3953, 2643, -1301, -728, 3778, 2966, -99, 1586, 2775, -1505, -1642, 3369, 3819, -2194, -2272, 1670, 928, -1703, 589, 2157, -2614, -4614, 1354, 3077, -1968, -3797, -268, -664, -3464, -165, 2885, -2034, -7061, -1810, 2965, -392, -2712, 436, -898, -4934, -2294, 5670, 2890, -4115, -3842, 975, 1334, 294, 3589, 3098, -3061, -5183, 2280]
2708B280M692l568l972R6n30k80M398M442l040q323n62N804L351o61j675k136
2724C16m267n11O872M831m332p011n86L265J717J715K007m049p595O35Q141M503
2740E651m289m461r08j087J375P106L718q147p831K339P444K480l41q06n318n175
2756h250M680J0972J462r078m544J337J696L677O553r7j1586o665P781R173j27
2771F984l382k518n221l510P906J1461k838j1904m635M630L463K553M862k693
2785E158j2929m721J1717R373l508o834j690l159j171Q907J0099p057j3810j066
2799a0691R402L427P49J857m768j0523O83J3683O831p901p879m2J026K264Q399
2814F517M304j0608j0907M137J0918L548k031l271o058m891N684J2723K176j0769
$$ y = [2280, 6972, 3404, -568, -472, -1002, -1282, 3116, 7558, 4518, -3805, -4367, 1437, 4788, 4127, 2452, 316, -3951, -4462, 2410, 7241, 2909, -4102, -4688, -1423, 294, 2009, 4016, -33, -7628, -6993, 1148, 5651, 1362, -3099, -4007, -5094, -3719, 3387, 7105, -1042, -8873, -6534, 910, 3390, 3049, 2243, -3075, -8250, -3570, 7402, 8864, -214, -4758, -3421, -1725, 1952, 8505, 8408, -3178, -9843, -2062, 7111, 6984, 3602, 1084, -4137, -7647, 259, 11720, 8882, -3022, -7657, -3027, 436, 2989, 7851, 5158, -7771, -12492, -775, 8598, 5090, -1744, -3434, -6593, -7764, 1143, 11242, 4185, -9625, -10691, -1289, 2138, 2887, 4744, -24, -10547, -9864, 3819, 10650, 2749, -5130, -5172, -4146, -1882, 6517, 10821, 213, -10694, -6557, 4361, 7909, 5878, 2607, -3451, -8342, -2658, 10065, 12241, 1472]
2828A472q736J221N502N953M282j825j1190p958O622J1971L507o942p772l321
2842g214m62P359J0447p91j3017r530N592R742L388k78l424r322n839Q763J4115
2857I529l71j2342n444K940Q66N659R212k405j5682n302J2218R348l085k745j547
2872H49p333l224J2995J1575q664j3249R89O048J091L824O101p918j3943K438
2886h421J5483L893p127l774k504n884M266J3646K546j3432q836L489O626L437
2900C408L619j703j1463o973Q291J1366J628o412o297m606J324Q994P607k870
2914E913j0477o004L737Q575N532j166o985o814p57N911J0617J579r291q509J751
2929f388P106M464K170j700q128p263O367J2348O10r085l120j9j459M859J0247
$$ y = [1472, -7264, -6043, -541, 5412, 9694, 7869, -3321, -11279, -4657, 7314, 10821, 3879, -3893, -7214, -7676, -317, 10130, 9339, -3678, -13208, -7616, 2126, 5514, 5236, 1812, -7510, -13349, -4586, 9529, 9158, -3184, -8628, -5688, -4822, 837, 10049, 7644, -8038, -13340, -1122, 8226, 5141, 2396, 849, -6484, -9708, 3287, 14862, 6198, -7051, -6062, -14, 1077, 4901, 11002, 3084, -10859, -8421, 7062, 10955, 3828, 54, -2450, -8334, -4068, 9578, 12124, -1308, -10144, -6655, -29, 3408, 7027, 5324, -6139, -13112, -4821, 6545, 8173, 1761, -4536, -9142, -7818, 1176, 8783, 5913, -4564, -10568, -6831, 1744, 7276, 6110, -875, -7689, -8446, -2535, 8082, 9661, 370, -8139, -6388, 718, 5182, 7352, 5652, -2476, -9739, -3372, 8976, 9586, 501, -2619, -2638, -4097, 762, 11009]
2944A1009k519j3926m112R767N189k630Q85o89j0297l116J3136Q579q780p978
2958e482J863N48j501P873O547r512j2321M143J1158J30j908J126n964p203N039
2973e464J3023N44r296l823J131l16M691P587j769j0669m081O411N878J077p0
2988D854l233o799k65Q112N206k186n157m225n47M258O158m2n525l697p27K315
3004a500N197K929m749o733M13M432J933J021N27n554o091M822P565o22n068j182
3020b660k36k702L547Q099k105r405j367N971J525j141L626j046q755j63R573
3035B761L433n761j802J448k859j131Q228L796q173n352N045L038j887J700L223
3050E707n682o322N873O409k469l444J090j242l510L918N442k681o013L12K553
$$ y = [11009, 8490, -5436, -9548, 219, 5408, 2778, 3663, 2974, -7323, -10439, 2697, 11276, 2496, -5482, -3619, -3071, -4572, 3301, 9848, 336, -11985, -7842, 3316, 3446, 1538, 2664, -3300, -10503, -5464, 7559, 8103, -1193, -5016, -3885, -4201, 490, 8077, 6308, -4361, -8442, -2031, 3847, 4924, 4854, 1621, -5178, -5443, 2669, 7875, 5689, 532, -3693, -4240, 18, 6176, 6134, 609, -3088, -3815, -1500, 3697, 6626, 1877, -4856, -4443, -11, 1922, 2943, 3470, -2084, -8175, -3353, 4212, 3590, -1478, -2660, -2896, -5598, -2051, 6048, 3943, -5462, -6829, -858, 667, -474, 3152, 2106, -6649, -6812, 2761, 6194, 433, -1369, 79, -2780, -3911, 4317, 8113, -60, -5412, -367, 2671, 784, 2484, 5707, 25, -6297, -424, 5985, 3516, 72, 1162, -80, -3590, 328, 5770, 3089, -2924, -2612, -59]
3065e9j04J143K478k956n090J774L724j1j144K29k036k631L400L629k018k682
3081b354M99N15p81J940K785k887l407J664K979r64R2J690k093l065K825M253
3097C691j953k814K113K84k840J808M358j992n428K780K836j769j396L386o35
3112B429m945J531M462j201m128J439K566l667p43M697l76n102j94M734r64k894
3128b356J730J764l837j436N028M01l782j98K710r40j240K167R21l156o83L183
3144B76Q86k099K61J618j918n15L029J307l135n03J474P6p11K406J49l059q02
3161a260K598J219j628L45M22k295p15L827Q82l403o74J236q01j65K334O93m045
3178a430j405K558J332j180o6O41k768j068L745J786l001j497J287j112m86L113
$$ y = [-59, -163, 980, 3458, 502, -4588, -2814, 910, 899, -245, -16, -2052, -4683, -1283, 2346, 328, -2354, -1855, -1340, -2121, -181, 2604, -283, -3690, -2026, 953, -11, 81, 1771, -322, -3387, -562, 3691, 1738, -1076, 1037, 1321, -1519, 289, 4647, 2655, -2773, 7, 2843, 1074, -322, 3064, 2429, -2516, -985, 3477, 2276, -1852, -413, 2153, -1514, -2257, 2440, 2064, -3038, -3232, 1502, 538, -2356, -626, 1138, -2699, -4135, 893, 1294, -2488, -2686, 24, -916, -2156, 11, 932, -2224, -2907, 276, 1162, -937, -676, 942, -976, -1491, 1538, 2845, -290, -793, 681, 757, 46, 2452, 2601, -458, -1260, 1338, 2557, 929, 1274, 1696, -599, -1314, 2513, 3395, -8, -682, 554, -247, -412, 1922, 2615, -1430, -2835, -277, 1055, -125, -191, 450, -2318, -3386, 359, 2145, -856, -2353, -1066, -2178, -2664, 449]
3194D49K062m044k591K696K470j416O83J408l015k671L635L506j357k519P72j40
3210g2j661K991L133k174m181J048K073N07N50J030k600l533J833M354k7j946
3226A325p47j858j370K529M436k022l809j120J463N55J249K232k435m318l69M214
3242d5J616r10m78k511k004J930L889J083l197k202n7P20K203K858j091m034j729
3259c959K766K360R63P85k520l542N40M659J980k244k042m39j405J912M912L01
3275E027n224k444J812J688J165J471p77m898j592M106L351q92k591j082k062
3290b942O07L579K638k415m716j0J797J466J742K41l401l290J044M320J395j331
3306G24j572k614k75L475L216l93l978j974Q97J653L353J146k887l668K8L026
$$ y = [449, 2511, -1533, -4124, -1428, 1042, -374, 309, 1717, -1298, -3969, -334, 3172, 1815, -704, 68, -72, -1733, 1258, 4391, 2217, -1964, -916, 1157, 1664, 2214, 3244, 644, -2889, -1056, 3298, 3271, 1325, 578, -1280, -2650, -121, 4315, 2293, -1516, -2636, -1173, -618, 631, 2863, 428, -3890, -4259, -45, 1571, 661, 183, -2328, -4332, -2402, 1487, 2570, -627, -2829, -2886, -2166, 37, 2895, 1804, -2230, -3959, -1193, 1167, 2130, 2915, 395, -3147, -2607, 2052, 4032, 1788, -254, -693, -2098, -186, 4726, 5027, -197, -2641, -829, 859, 2024, 3495, 2718, -2180, -3772, 334, 3685, 2793, 202, -880, -2942, -2335, 1244, 3882, 1467, -3249, -3259, -1462, 4, 1746, 1987, -1414, -4704, -3660, 660, 2055, 724, -848, -3462, -3737, -262, 2954, 2561, -1417, -3391, -2494, -841, 2512, 3658, 771, -2897, -2869, 157]
3322A57K775N61j902k814j588J926M241J056k205l257j709J379L641K254j687
3337B828l900j247P87K462K324K68m316l398J515L653J598p56j208k808k590L020
3353a768M649m39l532k407R38P01K376K335j276n156j537M030K522P8l18j815
3369f19k408L15M161K882k273l544p77J173J620K595K67l227l467J645L065J877
3385C285l86k258k080j055K586L716Q8l286k769P25J665J836J184j640l430j846
3401c665J886L503J636k922k474j241J215K099K380j4m134l623J944L918J828
3416B336j128j565k002j845K432M617J53l716j904Q94J193J269J683j52l982k245
3432c962L247L639l57k151l59j135l10K586K931j924l453r44K530J332mK46j205
$$ y = [157, 2932, 3493, 1591, -1223, -2811, -885, 3356, 4412, 2207, -1050, -2759, -1380, 2261, 4515, 2828, -1072, -2319, -1532, 930, 3254, 3522, -794, -4192, -2677, 976, 2574, 1818, 610, -2198, -4788, -1768, 2881, 2442, -1090, -3497, -2559, -1858, 518, 2853, 1577, -3579, -5116, -1086, 1436, 1514, 1196, -619, -3027, -2712, 1449, 4331, 2058, -1486, -2263, -1090, 530, 3125, 3392, 165, -3302, -1657, 1408, 3285, 2899, 641, -1439, -2494, 92, 3808, 3896, 610, -2159, -1434, 231, 2067, 3251, 1611, -1819, -3665, -1779, 1724, 3360, 438, -2036, -3277, -2062, 37, 2417, 2403, -1731, -5354, -3410, 508, 2336, 1208, -357, -2359, -4204, -1772, 2845, 2998, -718, -2622, -1728, -535, 734, 2417, 2265, -1717, -3962, -715, 2924, 2567, 416, 57, -1078, -1388, 1198, 4129, 2205, -1248, -2192, 338, 1670, 1666, 1912, 707]
3449G07k905J34L638J900k197k473p7k09Q50K154J164l087l143N08L281J127n83
3466G89p42k064j735J673L472J376l307k545N05J337J056J925L93k807k830J426
3482b078M044M05j755n87m59j775J514L589J8l109k000J981J024J75R27M49k810
3499d47k101K968K937j387k316N85K74j207O49K789j045l300m48K413P49j235
3515a22q9O17j529j065K300K222l150k259J593J684n61J98Q62j268k431J044L183
3532A229R7j883m27O44j251M11K429J331k575k761J645K509K18r27O88j148k398
3549b169J277L119M35k377p48J256r47j97J868J860l470j767K196J722k032n51
3565e25J457j81k510L60L443j487k568J236J603o71k002J556J166k600n81L182
$$ y = [707, -2198, -2064, 1574, 3474, 1277, -1196, -1273, -1482, -632, 1522, 2686, -401, -3544, -3036, 245, 1372, 789, 47, -2017, -3752, -2079, 1393, 2769, -538, -3083, -2578, -1241, -185, 1740, 2133, -674, -3504, -2078, 1966, 2371, 616, 29, -430, -2205, -691, 2898, 2916, -193, -2193, -212, 812, 987, 1914, 2363, -447, -2548, 420, 3357, 1970, -346, 239, 513, -694, -45, 2744, 1699, -1601, -2049, 364, 1113, -122, -211, 406, -1123, -2188, 112, 2334, -816, -3075, -1482, 202, -359, -161, 701, -567, -2998, -1954, 1229, 1326, -557, -984, -340, -1591, -1180, 1249, 2580, 5, -2756, -1111, 1398, 1616, 689, 1377, 229, -2169, -892, 2227, 2662, 285, -463, 793, -154, -351, 1517, 3377, -93, -1860, 336, 2058, 26, -525, 932, 751, -1759, -1399, 2044, 557, -2011, -775, 828, 157, -1845, -289, 877, -1723, -2304, 878]
3581H78O34k967q57K300M68j605N67J472j722j626J954K211j178j892J017N76
3597B30j188L60K758J05l188j019K161Q84m00J05M37j532j055J522K492r41k098
3614c67mJ239o89n25J872J1k355j125K581J236k115m78J005nj907J273K054k102
3632d01k170J801K451j498j606J411J39k470J294L505q40l670J43J990J31n09
3648b99J369K30k686j857L546K105j488j450R14o51j255K246K729j189l646n2
3664a434K379L0L92J004j147k795p94L543J678j896j460J98n27j30J766J622k171
3681B58k517Q12J852P38o78j14q02j381L86K326J211k097k108N09J358P26J00
3698E79K42j716k201J983K808K10k292j033j33J191P19J789M31l748j898K316
$$ y = [878, 1512, -1455, -2312, -12, 456, -1149, -582, 890, -832, -2458, -504, 1707, 529, -1363, -346, 230, -958, -598, 2160, 2265, -923, -1942, 219, 1103, 703, 808, 1245, -287, -1342, 180, 2672, 1731, -367, -371, 868, 179, -346, 1526, 1537, -818, -1943, 638, 1874, -241, -719, 286, 281, -1626, -353, 1701, -401, -2571, -770, 1681, 183, -1423, -12, 127, -2343, -1049, 2456, 1616, -2054, -1911, 79, 210, -299, 1070, 1300, -1386, -3243, 303, 2408, 920, -530, 384, -267, -1522, 724, 3453, 2264, -1382, -1434, 945, 975, 1367, 2371, 1224, -1571, -2365, 1178, 2856, 960, -500, -302, -829, -959, 807, 2429, 258, -2259, -1447, 405, 1143, 465, 351, -451, -1832, -1446, 880, 2091, -6, -2114, -1605, -247, 479, 579, 821, -895, -3096, -1113, 1695, 1905, -387, -1420, -1553, -362, 357, 2146, 2577, -1171, -3069, -753]
3714g53K564O7p77j5k560j297K865L593m72l728j091P64J24J902J881j059m477
3731b469m21L156K228m97j491n88k143l25L377K511k194l199o19J288J221J364
3747A199K56k213k487Q09L176J326j267r87j655q1J081K441Q56k564k285L42K849
3764G96J066N8p93k297j424K030K971O45k159k508l39J564K180Q12r03k396k059
3781b756J612L538Q80j702k227j012k12K200K572k33l464k058J089K376R40M70
3797B013j464l272o21K877L055o38k724j481l38J296K282J275r64l921r26K995
3813e56K204K74p54k039k170J176K879K155j305l116j009P34K145J990m2k577
3829a1k528P89K909J447Q1k442k230L90J636K634K17k496k324m66K309J644O45
$$ y = [-753, 1811, 1878, 1101, 1086, -1474, -2771, 94, 3687, 3215, -513, -1604, -840, -716, 1186, 3067, 2008, -2469, -2890, 266, 2494, 1997, 506, -82, -2225, -2550, 827, 3338, 1144, -2055, -2674, -1386, -165, 1199, 1455, -758, -3245, -2436, 740, 2066, 799, -188, -1843, -1924, -843, 1598, 2454, -110, -2395, -2053, 796, 1862, 1920, 1127, -1170, -2594, -564, 2407, 3052, 893, -1615, -1954, -390, 1790, 2602, 1699, -697, -2756, -1144, 2394, 3274, 1572, -655, -1667, -1879, 321, 2893, 2660, -804, -2862, -1773, 603, 1543, 2013, 549, -2723, -3344, -467, 2588, 1950, -774, -2255, -2593, -1297, 985, 2260, 1296, -2625, -3551, -556, 1648, 1922, 1168, -871, -3041, -1865, 1014, 3169, 1864, -1252, -2261, -1527, 618, 2608, 2566, -11, -2539, -1750, 1159, 2606, 2687, 245, -1985, -1595, 41, 2675, 2892, 396, -1928, -2394, -85, 1559, 2204]
3846B204j333k561j079J109L030P99r26k902p48J013J523J838n93k487j649Q54
3862a908K612J280n86k094j566n83K662K490m91k387k086O53J564K148M70j482
3878F96k558m10J777K549N61j749k336l99J274K107J249j238k462j218J587K083
3894A513Q53j002j787j591P12J810K256j006k541j239Q14J124J261K12j529j821
3910a961n45K305J727o59j179j579m71J234K431J07j418j802m52J815J384L97
3926A334m47j705j217Q76K113P59j125j422r8n6J394J857n34k137j183O65J492
3943E66R25j34q92j851N29J942P17m90j251j458L92P98J535N29j886j891Q08M38
3961f74J742m14l32j623p11J383J374N33q48j826k05Q31R90K78m38q19m30k00
$$ y = [2204, 871, -1690, -2769, -1660, 1370, 2169, 1243, -1659, -2407, -1394, 129, 1967, 1374, -1113, -2762, -1908, 704, 1984, 1398, -696, -2262, -2845, -183, 2307, 1816, -571, -2657, -2004, -440, 1708, 2178, 696, -1862, -2272, -495, 2054, 2615, 866, -1470, -1869, -595, 1512, 2761, 1523, -939, -2157, -570, 1513, 2366, 1364, -423, -2014, -1302, 508, 2764, 1758, -783, -2022, -1208, -84, 1177, 1389, -140, -1961, -2506, -201, 1526, 867, -312, -1891, -2362, -1128, 1303, 1410, -8, -1810, -2262, -447, 937, 1334, 887, -818, -2035, -1159, 954, 1713, 588, -834, -932, -988, 406, 2263, 1729, -408, -1591, -926, 566, 1491, 1357, 465, -1386, -857, 1085, 1802, 1312, 61, -1397, -1005, -207, 1328, 1857, -29, -1920, -1112, -674, 1068, 654, 322, -1301, -2012, -629, 745, 1278, 430, -1396, -1601, -770, 220, 498, 60, -759, -1189, -1389]
3979a389J759L42m75p72n42L87P04Q39M23j069j690J161R01P33n41l71l25n81
3997e06K18J700j18j613j17K18P41j61L72M67k087j70J427J251j334l40m8Q5q09
4016h24J152R55j518j135L11J093O09l73K6n32j317R09J142j0p92j18k43k97P26
4035b36J251m89j379j06R14P66j11k6m52p31Q8J056R62l41j415m77O48O25N32
4054A079p70r6k05m15N16J806p61j570n6L81N22J4M07n99j436k76K111L03j171
4073b16q86M22P0l63J028J294k080j344Q95J858m57k86N92r27j181L26K375Q1
4091A201j775p73N51m62J102J975j56k887o85K219O42l77K33J28j784p19J707
4108A40J688q13j638K12N58k2K56J277j330j923k72K470P54j082m66O6n84r1J481
$$ y = [-1389, 370, 712, 237, -535, -1077, -690, 14, 853, 1276, 207, -1483, -322, 579, 1312, 771, 400, 75, -506, -288, 1412, 1294, -319, -436, -218, 523, 362, 734, 1201, -886, -1056, 371, 1622, 288, -52, -100, -15, -824, 328, 1283, -235, -1370, -1059, 34, 643, 270, 296, -236, -1553, -644, 498, 488, -304, -422, -665, -962, -236, 1015, 526, -853, -959, -45, 721, 610, 584, 132, -599, -511, 545, 1507, 1166, -249, -726, -78, 547, 1079, 309, 213, 8, -407, 109, 1915, 1154, -416, -472, -91, 431, 445, 852, 253, -1183, -1459, 652, 955, -216, -1102, -680, -610, -973, 55, 1349, -731, -2075, -1180, 678, 221, -65, 527, -400, -1581, -1255, 1120, 1201, -574, -1347, -796, -1258, -156, 1819, 1663, -1224, -1909, 310, 952, 575, 808, 936, -848, -1567, 140, 1828, 1015, -623, -411, 147, 125, 381, 1658, 328, -1595, -1867, 603, 1357, 275, -191, -125, -709, -800, 681]
4127F81P77j394j329m69J861N90j44k33j199r56L81K263J084k402j071m23J873
4144a10O01J33J178j688k674J657K071P18j531n73j78j137O94K594J098k872j581
4161a600J234Q25L69O62N02k596j847K371K234n71j652J40o90r66P78L189O8l479
4179a029j256K434K98l22Q66k52k523q73K566J968j363j853J19L37k36J465J505
4196A851j346k838p4L019Q79j092k07j055r76P25K633J053k426j886L31J331J121
4213A043L75M32k207k019J106K987J062k120j539o5j94R62K101Q34k923k489J461
4230a193J954O92J5m46k033j571O89L506J78k137j525J225j96j5K007Q43k983
4247i90j945J804K082k6q59N69j305j806J191L573q84k973M47J574q24N14J190
$$ y = [681, 1458, 64, -1265, -1734, 127, 717, 573, 340, -859, -1815, -1434, 829, 1913, -489, -1560, -1983, -110, 491, 624, 1802, 114, -2560, -903, 1168, 1886, 355, -218, -396, -1533, -839, 1755, 2853, -19, -1600, -366, 459, 828, 1490, 1992, -604, -2451, -80, 2154, 1583, -69, 71, -619, -1585, -807, 2382, 2450, -1029, -2285, 149, 447, 125, 991, 739, -1784, -2657, -91, 1877, 514, -1339, -1220, -883, -1119, 346, 1851, 505, -2333, -2407, 612, 1491, 399, 192, -863, -1839, -1114, 1519, 2572, 146, -1740, -1409, -78, 1043, 1418, 1850, -357, -2376, -1270, 1717, 2779, 659, -880, -945, -1139, -177, 1924, 2758, -165, -2654, -1193, 761, 1453, 1468, 1022, -1011, -2582, -1893, 1613, 1791, -346, -1871, -646, -842, -857, 1150, 1993, -990, -2935, -1131, 951, 925, 66, 635, -670, -2476, -1285, 2288, 1404, -1569, -1122, 452, -372, 142, 1332]
4264A332j4k606o52K833J447j613r00J87p49j21J253J920j527k245N77J501N68
4281A191k24j8j147j924L43K802J595k119j424k93M79k84K605M45j974k576M28
4298b095K207O00J17l78q74j727M12K658J106j576j949L48M91l3J780P99j766
4315A20k461R49K241N03j318N46l76j301K95K130P85j982j603J708O09o53N62
4332G54L06q22j705R28K394j048j636N90O09r01P0J648j42k343j78J678R30j139
4350gk78K03q63q90K083J546j399j575k99P30L11N26J151q74k067m59K034J146
4368A019j007J96m79p96l78J971J624j598j484N05Q56p8K13L0N03j784o42J735
4386D06P34l05q24M21p16j31N57J068q96j135O43L76M0p85J186l44j359J42J359
$$ y = [1332, 1318, -1288, -1940, 893, 2340, 727, -173, 14, -735, -856, 397, 2317, 790, -1455, -878, 623, 1191, 967, 949, -198, -2122, -1779, 1023, 2618, 499, -925, -1218, -739, -1023, 1582, 2027, 53, -2523, -2095, 112, 712, 829, 451, -423, -2150, -1738, 920, 2026, 450, -1499, -1151, -660, -693, 1087, 1886, 120, -2341, -1392, 849, 1352, 34, 580, 204, -1097, -802, 1328, 2113, 131, -1472, 236, 845, 192, 754, 1060, 238, -1467, -539, 1855, 807, -829, -239, 370, -531, -461, 1187, 1045, -1298, -1476, 202, 1132, -7, -285, -82, -945, -1835, 248, 1794, 395, -1180, -1479, -749, -438, 88, 1239, 365, -1702, -2161, -127, 1019, 12, 208, -271, -1067, -1445, 526, 2150, 552, -932, -427, 429, 351, 564, 594, 1097, -687, -1329, 406, 1140, 835, 11, 432, -284, -415, 142, 1210, 314, -821, -178, 198, 238, -547, 639, 295, -1064, -922, 437]
4405D37K48j354k56R99k96j63J80N16p72p03N83J008p90K0M02k21l73L08O38P1
4425D82q62m22R63N86n86p2N33o12q15J175N84m76m60K07N81j045j37J232k6j161
4445c31K11N50J19r95P97K72p04q75L71J361j166J10L92J80r42n00J778m09n58
4464c39M56J01l29n89O14N72o91K88n26L29l39J66L35K92m66n17J69K96M78l1
4484B69O4j91l43J79P55J81o98n5k17K85J94j91M62j191K58O01r1K36m79J6p12
4505f68K28K40J161n38p75o0J59L14m3p4J45j226k33J171O69j08j198Q72m64o74
4525a102R48J513j189r41m23R10N06K70q1l77j222N67J052Q60j160n20P6J24P8
4544a11J337L40j441q16q4R91L02M22n46j109m4Q92M64M23m52j051n23O13J191
$$ y = [437, 685, -669, -925, 74, -222, -385, -205, 311, -461, -1164, -581, 427, -363, -343, 59, -162, -535, -227, 411, 482, -380, -802, 161, 747, 161, 89, 622, 10, -805, 370, 954, 478, 18, 225, 806, -239, -376, 856, 830, -331, -120, 430, 549, -446, 351, 623, -81, -956, -585, 776, -390, -280, 112, 292, -650, -1150, 628, 219, -339, 117, 218, -111, -700, -86, 486, -205, 83, -443, -114, -453, -287, 48, 340, -126, -643, -474, -178, 300, 269, 333, 142, -201, -22, 733, 914, 216, 161, -56, 229, 423, 232, 694, -497, -239, 362, 271, 507, 28, 44, -668, -440, -200, 961, 423, -352, -412, -253, 61, 18, -56, 89, -1137, -1370, -199, 470, 362, -836, 36, -428, -1102, -154, 1359, 170, -771, -1194, -284, 222, 492, 411, 34, -1188, -621, 431, 1291, 131, -389, -313, -189, -111, 1226, 1566, 125, -691, -775, 216, 518, 940, 394, -715, -759, 133, 597, 1020, 568, -483, -1006, -393, 798]
4563G98N74o91j098n51L29O23J339m89j196j157O47J041M61L71r27j863P01N35
4581e53J281L2p56r36n28O93J733M25j161j176j95M48P87J250m74j246j171Q84
4599f63R33J168m31p95j331r0J879P31K21j290j104k36R11J398j47o31j975j76
4617a628J554J101J27n10j403p28O05J520R41j303j218n64M65J079J262n83j089
4634c72j672Q21J123Q67n4p02j646l74J583J617L36j451j443k69Q62J642O97q37
4652G28j803l66J012J303J455r07k267n19P39K115P4K12j833j699K20K209J310
4669A983o44j486j311P5J031K289J79j626k216L42O60J697L23n1k705j057J457
4686a060J877P86j138j452j333O68K115J417j051j875j380P83J729J565m51j148
$$ y = [798, 1372, 681, -417, -968, -639, -16, 1323, 834, -362, -1519, -872, 169, 630, 1001, 74, -1789, -1088, -553, 728, 760, 4, -932, -1460, -767, 966, 1391, 230, -946, -1141, -693, 94, 1344, 870, -376, -1547, -663, 270, 1438, 1007, 212, -1119, -1209, 670, 1401, 1622, 332, -772, -1008, -97, 1301, 1154, 523, -1452, -1628, -74, 1027, 1154, 644, -759, -1487, -882, 638, 1579, 276, -942, -1506, -1041, 38, 1300, 717, -372, -2044, -1223, -100, 767, 713, 11, -1635, -2009, -426, 1191, 1527, 76, -1367, -1636, -774, 868, 1565, 728, -1075, -1441, -429, 874, 2329, 1422, -845, -1364, -625, 1490, 1564, 1776, -57, -1756, -1536, 673, 1983, 1339, -147, -1458, -1383, -352, 1937, 2116, 490, -1726, -1384, -724, 973, 1296, 1245, -1460, -2517, -1060, 817, 1603, 465, -987, -2320, -1652, 463, 1880, 829, -1046, -2426, -1643, 86, 1651, 1200, 52]
4702E2j623q9J896J878r3j435k071o30R35K863P56j872k170m1J264J570R52r20
4720A222j875j236P72K164J379j006k240p68K60J857J731k05k331j871M68J815
4736A36J343J03j120k013q79J090K634J148k006k546l38J713J188P30k71j670
4752g58j879J012L157O07j466r72j521m2J267L199k69k930r30K9K083O65J057
4769B309j269k649r38K661K432k58k071j204j87L45J909J447j203k589n44J219
4785e90J737O06n76j665j882O43K584J664j393j656j645NJ909J673O16j870k497
4802b337k20K075J906Nj008j628j436R50K636J518j736k318m67J287J198J112
4818A537J10k053j291j42K925J056j087o47j132k98K36K693Q95k545j779J15J959
$$ y = [52, -1571, -1660, 236, 2114, 2021, 586, -1485, -2115, -1180, 1683, 2439, 567, -1603, -1644, -380, 1190, 2142, 1222, -653, -1889, -1117, 1047, 2426, 1420, -820, -1588, -1328, 529, 2260, 2055, -276, -2147, -1679, 136, 1479, 1582, 462, -1551, -2430, -1340, 1294, 2442, 436, -2110, -2448, -735, 453, 1183, 912, -758, -2637, -1625, 1532, 2139, 673, -299, -1820, -1862, -595, 2604, 2335, -595, -1525, -1496, 587, 1252, 2309, 1040, -1609, -2547, 114, 2546, 2288, 217, -987, -1174, -829, 1080, 2527, 1324, -1265, -1809, -590, 1147, 1753, 1177, -488, -2370, -1727, 857, 2521, 1128, -528, -2173, -2168, -259, 1414, 2030, 160, -2337, -2557, -482, 1424, 1429, 421, -1207, -2643, -1693, 943, 2461, 725, -1593, -2060, -773, 425, 1537, 1647, -406, -1697, -1839, 1086, 2142, 1055, 408, -724, -1022, -786, 1907, 2802, 257, -1522, -1407, 552]
4835E52O18J52N3j922j791J315K536P21k096j075RK25L52J992l71k539j196J018
4853a447K197m8o8m78j836n57K409K180j037k235m83R5Q89M14K099n33k812j081
4871b332K056J984n06n88m92j678j90K191K401j011k702p32J192N94P95P62q92
4888H52k015n86J899J277k08r66n66o80M7J404J628j127k645L67J356L15l75J070
4906A047q12j470p83K111J620j660q12L72J14o82Q27J278p76k265J132J638l34
4923E45m03L96L9k068L98K466L72j989n72Q63M6j2Q28P89j706j489R09J852l59
4942I05j44k09n66j023M80K271J04j523j206P21r8o1P23J442k138j166P61J153
4960D26o0p76M39k56q36m49K481P5j759q26J423p62l08J237J565j286k232J389
$$ y = [552, 1170, 1322, 1375, -547, -2338, -1023, 1513, 2234, 138, -937, -928, -703, -351, 1641, 1270, -1269, -2465, -1447, 750, 702, 634, 156, -1680, -2237, 172, 2352, 1315, -920, -1403, -1308, -419, -5, 2094, 1561, -1251, -2332, -276, 1708, 1202, 614, 122, -1556, -1746, 445, 2846, 1835, -867, -1599, -407, 187, 982, 1744, 852, -1163, -1749, 150, 1427, 1219, 253, -313, -993, -946, 458, 2086, 959, -1686, -1319, 37, 352, -23, 1047, 235, -1235, -2018, 93, 1713, 53, -759, -387, -273, -955, -128, 1150, 374, -1891, -759, 879, 545, 142, 538, 577, -1491, -1093, 1373, 1745, -244, -816, 47, 93, 81, 909, 1698, -8, -1497, -588, 1264, 905, 761, 552, -14, -1037, -557, 1714, 1818, 295, -911, -190, -288, -349, 374, 1816, -322, -1488, -727, 426, 366, -410, 29, -227, -1063, -1512, 969, 1044, -715, -1541, -118, -880, -1188, 49, 1614, 328, -1904, -515]
4978e15J192n68K76J95J74k066M81J564P67j674k66J261o67o08R50J494j360k379
4996a749J711J236m03p40P19j28j446K38J728L04j789n08Q35L47p01N50R56j479
5014c19j236Q02J909n57o53L3l28r39J33K568k42k318m74Q37K20K26J358o2k089
5033a131j203J399K577l95r45p19l09q82J616K107o5k756r68J199P93O32Q99n53
5051A296k082r76J701K103o62p80l81j201l74J272K139m69k521p22J288O16L24
5068E71O54r72j450q72K190J570q12j689k48k90P1J364J543p26l127j12K168J064
5086H97j50n76j198r17L98K318J776j714k266k42J270R62P29Q07k217j994M15
5103a702K817J349q28j125j060n72N70K406J370k124k810p5J611Q11J466k38k546
$$ y = [-515, 677, 109, 385, 580, 754, -1312, -831, 733, 1500, -174, -440, 821, 154, -454, 496, 1990, 630, -1749, -38, 1198, 795, 55, 774, 646, -800, -562, 1166, 1470, -319, -827, 8, 355, -346, 204, 1160, -319, -1555, -753, 1156, 599, -54, -21, -349, -1288, -1155, 1413, 1171, -1147, -1621, -784, -564, -338, 1020, 958, -1131, -2334, -935, 1642, 1247, 302, -417, -726, -1608, 8, 2115, 2050, -706, -1674, -475, 318, 950, 1849, 1296, -786, -1762, -61, 2042, 1380, 600, 219, -982, -1356, -84, 2055, 1586, -935, -1657, -369, 247, 571, 1225, 253, -1197, -2069, 121, 1691, 879, -810, -1058, -1348, -1277, 87, 1630, 904, -2223, -2335, -167, 897, 747, 171, -1027, -1944, -1546, 772, 2548, 834, -1432, -1674, -404, 558, 1287, 2094, -123, -2117, -1702, 1115, 2464, 1636, 511, -549, -1121, -551, 1855, 3225, 1101, -1709, -1784, -173, 638, 2104, 1866, -680]
5120f80k231J515K416J489j998j075j269J75Q58K929l57k516j983L10K697M36
5136G16O84k30l036j131J807K929O21k547j472m04Q09K128J481j083k485j293
5152b506J364K316J096n59j962j920M99K402K236j51k761k287O23J945J974j95
5168B114j198k571r18K186K585Q04k132k244j045J352K289J799j806l194j199
5183c178J710K349J263o12k476k257P48K755J865m89k221k134Q8J645K819Q15
5199B690k208l138j97J983K435Q19j033k221k047J516L407J398j613l113n07N26
5215a303K178K166m41k772k254Q35K779J336Q0k398k396o1K107K894l64k135k645
5232b394j44K086K187R44j930k581j195J697K844J115j240l126m70L67K409J712
$$ y = [-680, -2911, -1396, 1020, 2509, 511, -564, -1833, -1658, -800, 2129, 1772, -744, -2727, -2417, 280, 716, 1400, 1170, -1866, -2997, -1190, 1739, 2360, -187, -1659, -2063, -1254, 874, 2355, 1272, -1213, -2506, -1142, 1174, 2270, 1711, -251, -2171, -1672, 730, 2966, 2815, 54, -2233, -1610, 335, 2309, 2114, 916, -1655, -2573, -387, 2198, 3002, 870, -1374, -2419, -1067, 1222, 3021, 1215, -1979, -3178, -1468, 881, 2144, 1532, -944, -3201, -2453, 302, 2167, 1678, -543, -2677, -2589, -944, 1875, 2690, 482, -2656, -2853, -870, 1565, 2384, 1351, -870, -2917, -1401, 2006, 3404, 1791, -1322, -1829, -1303, 875, 3041, 2600, -172, -2426, -1591, 1188, 2524, 2604, 206, -2190, -2251, -144, 2750, 2386, 251, -2394, -2538, -452, 1735, 2679, 749, -1832, -3027, -1330, 1514, 2629, 1389, -1737, -2207, -1840, 569, 2281]
5248B281m77k740k791R31L142K159q87j681k301l10K197L098n1k320k731j47K374
5265b54K264N21j158l078j345K397L346K33j440k134j374K80K734K794j301k886
5281d01j876Q03K581J890j38k661l059P8K918K182m85j465k306q20J637K953Q45
5298B676k186k477p96J199K747J488j223k685k003J443K415J676j127j996j539
5313b388J45K748K078o24j924j934n26K134K229J87k087j471n76J013K547J220
5329B771j583k539r52J979J942R27p29j994j628L14K599J599j344k309o85Q5J906
5346C59K014K39k867j958J94K232J341L0j396k218m39K071J814K90j579j702p58
5363b333Q34K201J451j234k198q61J024J148J177O11j566k420M24K303O00J70
$$ y = [2281, 1804, -936, -3727, -2796, 346, 2505, 1618, -63, -2364, -2674, -477, 2621, 2570, 250, -2481, -2628, -254, 2010, 2531, 1373, -1705, -3050, -653, 2693, 2926, 1486, -648, -2022, -1742, 992, 3786, 2485, -401, -2277, -1474, 1107, 2997, 2859, 198, -2861, -2783, 135, 2317, 1832, 367, -1939, -2759, -1122, 1831, 2676, 490, -1987, -2783, -1584, 1163, 2651, 1428, -1257, -3260, -1817, 598, 2274, 1147, -849, -2388, -2243, 505, 2583, 1959, 35, -1899, -2425, -291, 1938, 2125, 38, -1433, -2009, -996, 1551, 2771, 1188, -1351, -2303, -324, 1618, 2545, 1816, -178, -1806, -1492, 1107, 2706, 1362, -947, -1632, -1547, 359, 2373, 2612, -255, -2213, -2019, 213, 1554, 1584, 188, -2030, -2469, -398, 1416, 1706, 127, -1575, -2333, -1499, 702, 2153, 919, -1279, -2140, -1116, 32, 1209, 1820, 254, -2166, -1742, 561, 1161, 1331]
5379A331r51j296r77J864J793M29j553j567j46M99J756R38j157j917n69J365J155
5396I97P36o02j434j082L05J553J138q57o50j247l98J414J712k46j702r24k9P31
5414e85Q96J032r63j544o78J617Q49n0n0r35j204L08J462J195j055m93l58j93
5432g49K89J352N90j549j134R16Q04l00O23L65r47j553J381J701p29n44N1p11
5450a44q53J015J457k98j726L8O40J92m06J146l62j550m26J328L03k88J73l13
5468g4o03j009J605Q54o19n54m76P6K2J056L07j012k24n47P18O47J201r92n09
5487a33p27L37O38N12J055j891j194J335R35N32o17r4r06r12J106J340j28o34
5505E54q75P7r2N73J172j40j440j141Q37J294n69M29k65j532j160K526J208n77
$$ y = [1331, 380, -916, -1893, -29, 1764, 2193, 640, -927, -1073, -574, 1182, 2120, 963, -954, -1523, -158, 997, 1733, 1131, -303, -1385, -1080, 473, 1611, 754, 104, -1143, -1541, -127, 1585, 1339, -363, -1287, -1316, -585, 311, 1343, 380, -1164, -1842, -225, 624, 574, 524, -411, -1615, -1307, 155, 1350, 295, -198, -556, -749, -460, 892, 1482, -67, -1201, -285, 519, 219, 842, 1207, 260, -1293, 88, 1789, 1060, 516, 567, -144, -997, 18, 1475, 1177, -549, -511, 129, 321, -85, 1061, 699, -851, -1277, 51, 354, 66, 239, -74, -677, -1686, -81, 773, 154, -400, -876, -800, -778, 278, 585, -427, -651, -1198, -480, 167, 1368, 376, -133, -860, -523, 115, 627, 1682, -209, -1403, -68, 867, 1399, 782, 688, -218, -1130, -24, 1316, 1188, 554, -321, -244, -336, 237, 1409, 1269, -171, -1312, -475, 819, 250, 679, 414, -1118, -2278, 248, 1456, 879]
5523H79j635k21l94j20J564J652j209j847n80J273N00J155K00j400j719K43K035
5540C76J866j411q52j422L75N02J901J238j746k117k33J129J347R20o66k059j182
5557b034J283J603J553r66k098j084O37J647J084q2r22k281m26K464J495p23r70
5574A80j298o56Q17K176R14j805k545pJ395J674N17K42k478k032Q53L393Q15j549
5592F06j619j127O86J251K232O23l061k767J750K011J576l06m46l420j042K647
5608d06L410N7k769j616q62P75K705J835q82l721j896K473K365J036q50j785k298
5625b429K05K605K583p26l102k085M87K156J899J261k060l641p68K665L529k23
5641B356j649k041j570J262K616J948j020l942j211K026K695J187j106j993k211
$$ y = [879, -756, -977, -1371, -1491, 73, 1725, 516, -1331, -1911, -638, -138, 1017, 1217, -183, -1902, -1659, 376, 2242, 831, -21, -1443, -1068, -566, 1335, 2573, 827, -1290, -1523, -394, 953, 1873, 1207, -852, -2034, -751, 852, 2405, 1439, -659, -1743, -1106, 541, 1625, 1543, 621, -1660, -2086, 378, 1873, 1150, 180, -1118, -1774, -957, 1219, 2133, 328, -2217, -2224, -829, 845, 1362, 1604, -874, -2906, -2053, 1340, 2155, 606, -1013, -2140, -1454, -203, 2029, 2652, -409, -3176, -1426, 585, 2161, 1855, 1409, -2011, -3053, -406, 3004, 3061, 292, -1324, -2186, -1411, 1294, 3129, 2247, -1474, -3370, -897, 1468, 2504, 1654, -131, -2429, -2224, 381, 2964, 2238, -864, -2949, -2462, -306, 1593, 2854, 794, -2847, -3615, -950, 2579, 2356, 707, -1334, -2904, -1642, 974, 2922, 1902, -2040, -3251, -1225, 1470, 2657, 1551, -442, -2653]
5656b653j54L564K992j497l347q00R9J236L357J028k763m149K72L391K101j32
5672B545j345k156k390J633M385J286k954l173o59J126K702K360n43m173k981
5687d337K115L006K079j052k797j842p79L414L973n72l766k545K19J863L041P65
5703B785j731l825j288K542L321J250k294k703r02J029L193K475j243m168j964
5718c523J768L006J786o16k091k797n95L521K564L13l572k076N06J669K367R56
5734C186k256l752p51L376K815R5j645k751j519J292L778K087k474l645j389J473
5750b080K641J678J33k832l736R84M057K462j345k260k323q34L079K892J076l535
5766E7k869O18J705K177J383j679k848j506J732L607N08j403k330j616P33K973
$$ y = [-2653, -2807, 757, 3749, 2252, -1095, -1895, -1796, -560, 2797, 3825, 1062, -3087, -2815, 576, 2677, 2545, 1200, -956, -3346, -1713, 2672, 3958, 1004, -2169, -2828, -1702, 1000, 3360, 2817, -1356, -4337, -2222, 784, 2863, 1811, -986, -2828, -3607, -193, 3780, 3208, -558, -3103, -2884, -1021, 2020, 2785, 1054, -2771, -4059, -1517, 1804, 3054, 760, -1943, -2845, -1816, 1377, 3852, 2609, -1559, -3523, -1755, 1251, 3037, 2421, 330, -2467, -3062, 459, 3023, 3336, -236, -2312, -1806, -137, 2230, 3186, 930, -2822, -3573, -197, 2618, 2713, 1068, -1683, -3202, -1910, 1868, 3955, 1481, -2164, -3553, -2080, 561, 2239, 2372, -460, -4196, -3212, 845, 3307, 1962, -298, -2621, -3455, -376, 2516, 3592, 57, -2812, -2194, -489, 1688, 3071, 1392, -1456, -2962, -1230, 2377, 2885, 1482, -848, -2464, -1731, 1242]
5782A242K334o58l651k189J247K384J774K54k316k710k03K070L017L15k878k192
5798b160l26K035J696J366j540k758j731K069K801J102j836k383j188R21K367
5813D35K009r28k563j727J300K031J283O2j677k671j41K639K780p20k136j280
5829a304p71J773J955J412k041k564o00K183J579J54j87k076j616M00L072R80
5845B349j188j786q98J73J526J630K52k270k308Q73J767J275j56p66k005m89J809
5862b12J654M2j369j636l34J600O85J402j101j564q75O10J930P32n14j437o19
5879a006OJ200J394l82j081j417M40J558P38K41p45j524q36J145J811l34q56r04
5897e52l43N83J067O01j81j330r18N10R56K34J86q80j197O6N95J786m82q50o11
$$ y = [1242, 3576, 2918, -733, -2922, -1675, 709, 2483, 2737, 421, -2289, -2492, -422, 2595, 2910, 32, -2160, -2486, -451, 1245, 2611, 1071, -1687, -3418, -1349, 1452, 2554, 718, -1665, -2853, -1932, 435, 2444, 1516, -1047, -2774, -1474, 557, 1840, 1902, 225, -2446, -2587, 52, 2832, 2112, -24, -1304, -2075, -302, 1653, 3065, 1024, -1540, -2140, 43, 1622, 1776, 1589, -487, -2103, -1703, 1369, 2349, 1161, -625, -1523, -1350, 176, 1806, 2058, -212, -2520, -1647, 120, 1395, 1239, 473, -1532, -2021, -212, 1442, 1484, 115, -1521, -1855, -255, 430, 1832, 731, -833, -1708, -1098, 832, 1564, 1050, -387, -1006, -1000, 200, 1594, 1212, 131, -1286, -846, 712, 1450, 1691, 946, -578, -1414, -269, 1542, 1208, 352, -552, -895, -312, 755, 1356, 1175, -155, -1073, -563, 393, 627, 813, -67, -1264, -1198, -603, 1183, 701, -149, -760]
5916g60q0M4Q58J002j224p98l88P13Q16K64J8j218l43J1J364K72m3m15n82k17
5936g06O69Q81K54q14n19qJ69J96Q31r5r31Kj55J209l87K91o86l96j05N14K18
5957D32K34l7q76k90L52N74L84m40l38n51n42O46R08M44j181k33m7N73K50M03
5977F65o68r07m41Q85K89M15M17r08p88m68J482O98l41p37l75K66J17J485L68
5996A454p84j407R3L53Q69N54j75j492k54J69J523Q42r91l78j742P06Q12J494
6014A646l41j373p47K4Q03R45j6r27j226l5Q29Q57M97q49j189o21P44J570J99
6033G90j93j170m81k11J140J648m67j784p45K1J337J188Q67k012q57p26J316J524
6051A185M29q63j618n70R06J896P46p91j864j021O88J754J110k43k175j199M95
$$ y = [-760, -840, -796, 62, 1064, -160, -958, -1346, -633, 183, 447, 465, -753, -1096, -1085, 279, 551, 508, 93, -489, -706, -37, 844, 1098, 284, -235, -243, -74, 122, 953, 858, -73, -71, -226, 983, 596, 887, 201, -195, -300, 214, 432, 666, 629, -247, -537, -185, 389, 773, 333, -5, -556, -1098, -452, 456, 900, -281, -514, -561, 12, 262, 665, -3, -910, -1351, -466, -177, 238, 655, -253, -1041, -1509, -27, 671, 330, -407, -782, -516, -399, 1086, 1454, 670, -737, -644, -291, 578, 1132, 957, -535, -789, -620, 903, 1745, 754, 376, -1366, -660, 152, 1646, 1305, -68, -815, -791, 12, 957, 941, 14, -1212, -1247, -418, 439, 936, 87, -1102, -1723, -979, 591, 790, 597, -573, -1054, -1265, -125, 1523, 1056, -728, -1473, -1452, -115, 1073, 1940, -72, -929, -1655, -339, 1185, 1614, 751, -867, -1437, -531, 1365, 2111, 1320, -544, -1565, -877, 877, 1987, 1744, -431, -1630, -1135]
6068a135J394R74l4j138j440k79J169K153l74j576j035o32J581J622N64j761j644
6085a591q03J701J957N01j211j386j221R79J772J153n95j825j769L72K278J909
6101B221p25k186q95j27J849J935L9j610k389K93J040K151N39j213k015q37J559
6118c71K068P73j807j450r54P14K256J220o57k661j175N98J960J592j76k166k192
6135b428L22K375J814k86j659j612r60J841K208L17j799k321Q3J158K284M46o66
6152A117k112j641J544K091J045q37k223j017L89K305J719k99k557j649L95J979
6168B49J881j86j347k828L19J922K118K98k109j643l63O37K433O53o02k860r07
6185b335J261K328J306j471k205j169Q77K035J563m14k560j121q8J759J806j79
$$ y = [-1135, 259, 1233, 1199, 61, -1379, -1658, -489, 1664, 1290, -286, -1321, -1953, -372, 1250, 1814, 53, -1591, -2394, -693, 1264, 1765, 554, -832, -2053, -1074, 698, 1851, 1256, -569, -2338, -1966, 312, 2221, 1496, -690, -1585, -1712, 137, 2072, 2111, 501, -1888, -1595, -555, 1596, 2135, 922, -1093, -1930, -371, 1697, 2470, 663, -787, -1741, -1027, 1229, 2449, 1792, -869, -2044, -1446, 514, 2106, 1930, -236, -2428, -2106, 269, 2083, 1797, 138, -1474, -2434, -593, 1615, 1932, 133, -2188, -2105, -947, 1337, 1783, 1117, -995, -2636, -1092, 999, 2044, 1207, -1016, -2033, -1644, 661, 2380, 2081, -476, -2125, -1730, 249, 2130, 1944, 597, -2231, -1912, 10, 2128, 2426, 317, -1326, -1689, -1052, 1381, 2034, 1432, -1428, -2335, -1074, 1254, 2560, 1089, -1116, -2285, -1408, 627, 2190, 1776, -784, -1905, -1993, -234, 1572, 1393]
6201A393j669j694m33K004K533k93j501k167l7Q02K663J064j835k664l63J323
6217h74J803J195p27k155j578J076K829J365j492j821j349K37J601K357qk525
6233f6j896L4K211J796k75j082j979q88J684J993Q91k346j500p69Q60K492J024
6250B184j286k163r13R11K084O17l99j647j503L37K310J195k03j862j533J93J401
6267b77K070K60j618j897q63J663K332p2p24j609q32Q19K447M97j247j643j045
6284a739J050J934M72q54m58k263L29K127J700q46k224o69K69Q00J905J0j302
6301B41k303j47K101J517n78q71j014n51O52K168Q00j611j409o92P07R70J469
6318A449j42k224r43L01K174M99j39j100j266lJ410J021L7j256p41l95Q62J469
$$ y = [1393, -276, -1970, -2403, -399, 2134, 1841, 340, -1827, -1864, -1062, 1601, 2665, 830, -1834, -2197, -874, 929, 2124, 1397, -758, -2336, -1260, 1569, 2934, 1442, -379, -1728, -1491, 110, 2467, 2459, -66, -1962, -1928, 283, 2079, 1804, 722, -1257, -2145, -461, 1532, 2423, 77, -1423, -2192, -1332, 1160, 2184, 898, -1265, -2178, -1267, 817, 1434, 1035, -612, -2115, -1778, 532, 1727, 1524, -338, -1871, -1678, -277, 1793, 2053, 435, -1462, -2325, -662, 1670, 1598, 874, -735, -1567, -748, 1699, 2196, 949, -694, -1739, -689, 1245, 1717, 863, 405, -1858, -1529, 598, 2298, 1452, -772, -1441, -1172, -372, 1533, 1543, 241, -2062, -2209, -108, 1409, 831, -40, -1054, -1605, -953, 1215, 2015, 404, -1005, -1697, -990, -20, 1449, 1307, -917, -1860, -1559, 615, 1114, 975, -125, -1391, -1394, 16, 1037, 1074, -182, -923, -1318, -456, 1013]
6336A013L86p78j172o26J274J116k17l68j177k75L96R46J050o82j505p44P24R24
6354B85R21k70j298q78K17R89R29K02r39r87M5N79R4Q27k6j529k33Q30Q22k1o81
6375a22k07m56Q6R41O43j01p54p43K50Q12j64P33o49j027L97P59M57j05k18n42
6395a0n35K32N99Q02p60p63k20R17m82O44N38j075l33r9P04M88m57n65j99O9K0
6416d85K20L62m7o04N31o01L98K44K48l19o00M34N31j57J31m87l4j75j79R95m
6437D02j43q04O4K13L96K89L77o15o14nP82J36k88L44m48m81k12R36K35n81m8
6458f5p0K13j57J47M01k75o57M01q0K72M16l16n03m37L71J095O8n64m38m9j3K84
6480D4N02j07o07o06R7Q59L99m34j83n65o1K02P15J012j058o85l49J050L69K88
$$ y = [1013, 1399, 621, -551, -1177, 97, 1213, 996, 628, -549, -824, -428, 518, 1568, 886, -619, -1363, -639, 285, 1206, 936, -362, -1240, -1023, -34, 895, 1097, 158, -829, -784, -205, -111, 716, 690, -839, -1072, -242, 580, 559, -122, -329, -785, -699, 242, 885, 784, 30, -713, -463, 349, 185, 918, 269, -758, -361, 398, 855, 750, 532, -10, -545, -313, 286, 1088, 328, -435, -655, 262, -220, 424, 962, -113, -446, -545, 159, 647, 190, -375, -574, -505, -485, -265, 97, 50, -554, -23, -624, -226, 18, 266, -53, -653, -219, 312, 155, 286, -201, -235, -410, -589, 406, 402, 259, -545, -481, -268, 128, 417, 794, 179, -435, -440, 342, 478, 190, 534, 86, -395, -607, 329, 564, -17, -65, -135, 78, -79, 68, 469, 194, -463, -62, -142, 130, 546, 230, -273, -710, -339, 756, 824, 260, -178, -227, -240, 44, 546, 439, -168, -774, -677, 182, 581, 147, -36, -601, -662, -460, 255, 1267, 209, -476, -825, 225, 594, 882]
6500H82k30n59n76O6J039Q6q6o68o41M20M39O47r8j313j99j50R97O16k69p6o83
6521c56m37Q02P78j09p66p12M69jP24P49q66q32k01L69Q90M60n28l80j349M05
6541h91P52J549p94j034m64l4R05J307l46q55q68k83J201P81J39n98j091n47O17
6560e54J350P19j269r27l15O00O16P12p3j200o62k25J818M09J32j180n73l75J034
6579C7R96K3r98q34n84J209Q71Q66j552q12n23J222R46J93l67j694K44O5J254
6598E62M07Q9j344j049J19J790J062q77r55m04q33J502J018kq57j089l8O06J487
6617A194Q9r10q76p36P73J526P2n96j578R4M18J210L31m0j614r79J083R98R59
6636A418k33j551r72O00J335J98N9j140q91j43J140J297j56n03j338p2Q89J245
$$ y = [882, 652, 93, -483, -417, 622, 708, 622, -46, -687, -267, 172, 819, 721, -592, -791, -941, 56, 672, 403, 327, -356, -793, 9, 787, 678, -88, -800, -331, -332, 392, 1141, 275, -557, -758, -389, 501, 961, 433, 53, -1296, -891, -139, 1410, 616, -418, -882, -916, -11, 1296, 950, 95, -773, -1056, 145, 926, 1065, 467, -624, -1171, -554, 796, 1515, 246, -681, -996, -396, 220, 932, 859, -341, -1003, -1228, 590, 999, 1131, -49, -622, -997, 37, 1033, 1056, 58, -776, -1360, -151, 720, 1586, 34, -778, -1301, -79, 867, 1060, 693, -1001, -757, -692, 562, 969, 1058, -286, -1335, -1216, 574, 1636, 759, -196, -600, -1433, 69, 1087, 1085, 228, -861, -899, -293, 1194, 1283, 373, -503, -1239, -466, 1060, 1132, 536, -1042, -948, -530, 680, 1011, 971, -643, -1622, -539, 459, 1418, 1185, -366, -1338, -738, 597, 795, 854, -286, -1177, -1320, -180, 1117, 961, 458, -880, -952, -63, 1182]
6654A182M28q25j653m68J065N99Q94o65q21j031P28J139L90L72j547o79J23J497
6672G28M08m27r11m02qJ095N39q2p42j261l57J199J244R5q67m35j454J116J299
6691G77O00j063r37n48K23J344P53o52j312l60J05J193N90m50o57p41j5J379P27
6710I56k2p07j047m55J176R63o5r93m34l87N48J760k9n95j073k91L68P33M39L8
6730H83j001l39k14P53P75j85q95r17P59M33L70N74r48j063O34M35O39J6o90q48
6750h29k65J208J41J96Np22m99j7J250L10m41j137R2R25k89Q61l82q39p88R82
6770b38M62L32O7m28m19o49Q83P64j19q82l65nO58Q55K14p42q53j35K91P26J17
6791E34n37n97k00J16J444l6l05r19J93k88P57j18M17p84m2L45J91P66o76j59
$$ y = [1182, 1610, 785, -868, -1336, -271, 328, 1222, 557, -264, -1295, -567, 572, 962, 1334, -213, -892, -769, 728, 1136, 709, -202, -604, -612, 483, 1022, 940, 198, -1063, -1420, -221, 1023, 1118, 251, -184, -1638, -522, 777, 1377, 314, -623, -1171, -948, 396, 1149, 497, -815, -1175, -1070, 123, 713, 263, -394, -1135, -1150, 229, 956, 934, 227, -820, -1275, -99, 864, 799, -194, -628, -1015, -467, 1293, 1264, 669, -404, -695, -327, 406, 845, 883, -118, -457, -671, 82, 857, 672, -223, -1140, -381, 52, 422, 996, 48, -1015, -381, 54, 693, 709, 19, -829, -1094, 114, 255, 451, 456, -266, -765, -782, 468, 778, 337, -800, -708, 217, -72, 789, 407, -432, -1220, -238, 224, 556, 623, 195, -224, -873, 10, 774, 655, -227, -592, -597, 61, 916, 1130, 388, -465, -600, -309, 417, 534, -3, -600, -800, -684, 760, 724, 419, -500, -307, -595, 162, 44, 461, -323, -365, -20, 171, 937, 261, 102]
6811A02n30n9L37N93N11j392q2J02K45N79O41j174J4m57N66M51n4l52j5j46k5
6832a45M47Q7p67K74K89q86O17M97k36j86R4l45L24J41K82k50k08k84J93K43M97
6853F78o15l67J67l17N29J73J10k8l49m87N33K98K37l39q87M68M49n11M09K9k80
6874a00k79N54M41l93j48o6p9L92m20P46j025L76k87J02K65P6O1k75M31o58N46
6895B60j67O13m39m79J78Jj79N95K8o94J27j94N7J48K33l32K31j39j13L04J53
6916A92l85Q84q39J70l23j77O45n5k44L05k84K2J53l6P0k30L28r3l10n9k51N26
6938Ip0j00N6M73K35l49K32l09K27mm08O0m19P72k72K57K32m67m6J30j60L73k43
6961B09m73j13J89L66j17J46j12o81J78Q61r15Q95m97J5l04J05J12L07M11p90
$$ y = [102, -428, -487, -150, 443, 954, -438, -520, -418, -173, 406, 1047, -127, -113, -570, -4, 447, 393, 41, 26, -120, -145, 302, 389, -378, -104, 185, -701, -84, 413, 177, -9, 85, -260, 64, 205, 487, 237, 29, -255, -62, 181, 678, 63, -304, -137, -454, 75, 248, 358, 330, -19, -506, 27, 325, 562, 223, -664, -196, 253, -258, 151, 180, -100, -379, 175, 616, 223, 75, 9, -70, 322, -98, 648, -377, -1, -288, -186, 79, 155, 216, -59, 372, -286, 260, 93, 706, 267, -212, -34, -33, -212, 383, 411, -283, -156, -350, -293, -145, 88, -244, -13, -152, -265, 39, 192, -193, 691, -148, 22, -301, -478, 167, 112, -132, 173, -111, -89, 64, 28, 98, -132, 196, 103, -207, -266, -517, 9, -61, -161, -105, 368, 603, 254, 486, 177, 404, 400, -8, 52, -367, 405, 133, 390, 622, 155, 109, 239, 79, 452, 209, -264, -377, -188, 178, 61, 207, 95, -586, -408, 453, -462, 433, -64, -49, -353, -248, -136, 171, 582, -208]
6981b08l22J90L58q0k58K00k63L0J65J49O21r68K24j88K93O2k84N22n35k19N63
7002E2L05p0l35j00r0K55j99M89O47j201l54P88j96j08M88j64m36k69R36j05L11
7023F44p90j26k62L64M10M52p54k55k27L84R1N72j47l62k70j65P27L51oq93q33
7044a095P46K01R05l06o01o81M35M67K14K89o52j31l97N92L39O52m54p26j07K57
7064e3K95L73n25r0n52J15R63J73l81m32l88M1P44J65K64p19k77M25k45L46J20
7085C62l86m58j24R04O78o14%j114N3O19K84N93m24p87k14M31L76M91n41m24m34
7106g29Q53k91Q86k97n42m79L85L9N82J76n03n94J23P10L21j48M4p72k22P0J014
7127F26K11n63m89j64P3Q72L3k71j98o97J22P15K55o81o2m44R1O40N59p2m40r57
$$ y = [-208, -530, -340, 18, -62, -320, -120, -383, -353, -188, -39, 582, -386, -162, -350, -57, 5, -279, 243, -292, -511, 52, 357, 287, -48, -148, -238, 17, -182, 307, 954, -247, -601, 187, -9, -117, 371, 207, -229, -498, 438, 333, 644, -146, -272, -534, -170, 240, 692, -62, -317, -544, -160, -69, 503, 356, -6, -276, -441, 286, 637, 631, -262, -1095, -349, -148, 757, 451, -150, -831, -396, 71, 285, 574, -78, -209, -606, -14, 325, 977, 523, -203, -310, -53, 242, 615, 90, 0, -552, -437, 526, 699, 318, -114, -502, -461, 283, 448, 712, -7, -284, 141, -104, 242, 362, -24, -482, -606, 298, 976, 362, 362, -752, -699, -80, 204, 797, 373, -414, -628, -197, 179, 670, 129, -295, -729, 124, -167, 719, 422, -120, -599, -214, -175, 407, 583, 80, -514, -391, 319, 640, 492, 536, -236, -458, -388, 626, 837, 274, -215, -379, -306, 566, 599, 328, 130, -567, -445, 270, 525, -156, -218, -662, -571, 69, 628, 556, 116, -841]
7149h41R1O15N48J17n60k40j16O56M64J3m61p25J1K88N23M70l66q21l07L29J211
7170H99l85k80l93m89L46L08Q69n55j81r94J17P68O87N5m81p30j66P08N69l36
7190C36k81l11m30N89M43J56j41q36m80P30O92Q2l95l51p25N66M46Q17l24r89
7210d06o6k8M12O53k99n07l04P8K60Q93M0q47l60l35Q73O60q1m95m85k94O21M33
7232D16M03o76k98j04n5J013j1m53m82K23o08R10N07l80k48q26j22J347L70n35
7252C91o16l64N8P57L72r6p70k88J42M47M94K22n23o98n1L51L40qJ48j65q04M71
7274a90L72K74J16p84n51j96J277L1M42q34o74L87K30P14n37rj71n68N20L15M50
7295F14P5j057o7N2P35K73o78j29q5J22O56J34l95k49N9m45M97l3J46j30m28j85
$$ y = [-841, -750, -135, 413, 530, -30, -270, -386, 270, 734, 747, 286, -439, -428, -140, 383, 853, 487, -334, -641, -312, 899, 514, 234, -159, -648, -302, 6, 875, 320, 139, -855, -738, 30, 717, 772, 291, -439, -605, 103, 672, 336, 55, -256, -686, -97, 346, 502, 361, -475, -955, -225, 467, 549, 154, -197, -922, -356, 90, 907, 583, -406, -472, -500, -88, 565, 266, -241, -545, -467, -207, 686, 726, -121, -481, -816, 57, 717, 636, 141, -344, -638, -17, 416, 819, 143, -155, -259, -314, 699, 688, 235, -247, -24, -632, 278, 785, 405, 157, -669, -791, 556, 926, 391, -225, -589, -531, 226, 598, 502, -268, -556, -414, 33, 527, 749, 226, -472, -523, -172, 168, 160, 308, 143, -661, -190, 182, 456, 572, -212, -763, -959, 318, 349, 791, -43, -717, -330, -100, 614, 77, 68, -103, -671, -151, 164, 614, 689, -368, -435, -383, 352, 625, -53, -182, -267, -145, 511, 645, 250, 1, 60, -385, 112, 79, 225, 95, -333, -518]
7317e18N66M33m19j08j93l79P96P4P2n85p1n95Q48K1Q10l12p50M8k19Q73j14P8
7339C56k3l34k63J74L68l7Rq98N17K62k42M59m95k33oj20M19Lk08L05l6j02M1
7362h4L04j98j35M59k54m4J27k73L7M0l15L26n1N30m21K33j33m58J75j51L89m17
7384c14N73m1k1m2r6N45m06j92j56K24j54l5J78J6J66m95P6K32k0m3L0l76R5N52
7408B96k27K49p7p04O03J84r9K90m63m57N1Q89l33j97k45k27L80M51l63J03NR0
7430A99n43O81K67q52O81p13J2P27P0n71L25j046M61O51J26N3n83j81l70L96N36
7451C26N18q25l53%KM18N68k34o63l78M06L14Q37o33k29l96j08M72N18K88r46
7472i8o0j29K34J57L21j80p14J59K97O22o4R4o90r85Q04L18N67k63q08m00M90
$$ y = [-518, 48, 481, 62, -46, -239, -618, 178, 252, 324, -261, -332, -927, -79, -58, 752, 440, -310, -262, -481, 392, 278, 356, 333, -1, -264, -90, 278, 241, 250, -648, -131, 131, -111, 348, -147, -380, -386, -506, -87, -84, -292, 13, -23, -125, -84, 220, 22, -113, 346, 92, 48, 175, -98, -61, -21, -336, -10, -61, 469, 48, 281, 148, -310, -135, -286, 103, -314, 259, 218, 197, 155, 59, 604, 198, 6, -150, 74, -80, -115, 63, 79, 245, -250, -174, 58, 38, -5, 25, -351, -256, 296, 69, 318, 241, -463, 140, 324, 225, 515, 52, -405, -354, 535, 202, 5, -240, -467, -87, 364, 1, 104, 109, 199, -344, 337, 604, -248, 433, -280, -268, 459, 529, -42, 283, -763, -302, 349, 475, 528, -55, -236, -606, -210, 326, 844, 19, -334, -334, -332, 86, 654, 420, -243, -621, -215, 99, 936, 303, 74, -322, -430, 42, 560, 848, -98, -158, -287, -53, 104, 425, 245, -469, -310, -13, 609, 545, 639, -51, -1036, -232, 86, 653, 390, -418, -818, -328]
7493c28O45L1j00k27m89oM08P28Rq34n42J61Q54M86n7q03n23l17Q94M69K71m15
7515C15p53l32O87M88K94j84q38l21J02P24P49n26r19k21L46P48K04p1p78p16
7535a002O1Q75O35K79j093k39M1R37L37K17m23j582L36Q7J330J99n72j167q6M38
7555c92J085L82m43j201m45J84J539N60o22q07o59R5P17M99J55n25j120k6J044
7574B0Q07J93r06j087M5O55Q68L06p66j135j62N63J346N53j143o47o95O78Q50
7593C43P54m03j012n65L36N20J161n09o05j000n2J418O87L28j352j108R6P74J225
7612A036k78j95j140l13K77J547J52o11r12p33Q31N79R41p30j242l01M00J028
7630C36O44m40p58j123L44J162P74o6j312m21K27M97J496l48q27j010l45Q49J164
$$ y = [-328, 317, 348, 248, 21, -468, -474, -66, 662, 671, -163, -705, -544, 310, 796, 739, -64, -587, -904, -10, 459, 730, 315, -438, -770, -83, 405, 699, 515, -323, -644, -542, 182, 931, 405, -514, -735, -389, 359, 563, 492, -286, -1002, -941, -66, 569, 848, -245, -484, -443, 494, 831, 1048, 625, -957, -621, -534, 796, 995, 423, -744, -830, -392, 693, 1075, 632, -569, -1014, -830, 709, 1269, 647, -160, -819, -724, -7, 492, 647, 122, -998, -1024, 20, 827, 1020, 114, -973, -928, -273, 595, 901, 135, -1000, -1162, -599, 747, 1300, 157, -490, -1185, -507, 343, 1097, 694, -318, -883, -547, -27, 1134, 625, 20, -980, -1032, 386, 1073, 1401, 49, -1059, -963, -189, 1036, 758, 563, -577, -890, -613, 934, 1086, 475, -437, -1170, -339, 240, 1181, 451, -791, -1092, -692, 336, 980, 540, -218, -1341, -997, 165, 939, 873, -439, -860, -633, -136, 1360, 1012, 185, -825, -1170, -321, 843]
7649H43M65j336r76j35Q64J144L79p15j236l53M67J150O88n0j227j060K7J389
7667C28O65k07j510o07k84J851L70K62o16j490N33O04J235k64q83p01m24L12J306
7686D80L59l51r01p61O14J501L77o76j157n87P33P70M34k46j039o28L16P86J217
7705A241o60n39j151O0J189M46L85q44p31j95R79O55j6o05n87o01M49Q55O04m25
7725E09n68r15M35N96P09j21j094p30O34P24Q96k73j170o4n71O90J411m86k77
7744C35j432O21N09M99K80k21r96m60M32J138m92m9j009N1K58P57O29q18l94k92
7764f54N75K60N51n23o5p46p7R84L56l38r1n05J96J30N05jl58q40K12M28K86L94
7786F79j074J60m17L37O58P79o42j098k14Q93J45j2J85n17k94m30J071M6N1p09
$$ y = [843, 1308, -28, -1004, -1139, -275, 869, 1248, 533, -703, -1056, -589, 561, 1249, 1199, -28, -1088, -1061, 328, 993, 786, -724, -1331, -1615, 236, 606, 868, 252, -1238, -705, -101, 1134, 870, -13, -714, -1138, -826, 480, 839, 488, -413, -1174, -560, 941, 1318, 642, -515, -1102, -369, 401, 835, 589, -450, -1078, -762, 24, 1241, 581, 42, -1109, -1049, 140, 586, 971, 127, -604, -799, 180, 835, 819, 214, -373, -974, -525, 330, 934, 509, -59, -974, -539, 57, 766, 645, -449, -1179, -545, 179, 1075, 802, -368, -432, -1003, -313, 1098, 612, 335, -1097, -476, 33, 532, 812, 591, -405, -865, -433, 705, 213, 164, -845, -794, -536, 221, 850, 32, -362, -654, -79, 181, 732, 209, 144, -602, -679, 305, 661, 323, 232, -273, -77, 53, 558, 557, 199, -641, -429, -1, 285, 679, -395, -235, -652, -315, 343, 1122, 480, -618, -832, 61, 206, 194, 379, -138, -432, -862, 209, 255, 306, -403]
7806d03J64o9K95J55K28j99m43L7J02M5J52J76l05l72K50J028l00k87o94L00k39
7827c79M06L05J3n9l26K95l47M54Q1j94p0p10N22Q0O87l98p48O01m55N1j95P28
7849C42l54l32L16j17M17j32nj70K3j79J45N1m5J96K3j40j07J59K39k69j27o9
7871a35J27jK78k72L17l14n45M53J08n7j2j74M0m49N02J87J66k23k43J54O3M56
7893D26j03l35n21j65M36P39o1n84M7k21O5P80O96j057m35k61N45Jl8M68r13N07
7915A6p78O44Q95l59n23m44oL56P60J46m99r24j1L72J072r1k63p76j08L73L22
7936A74P43p30o23n19K22J387K42p07n14l73L08P75M30L27j103r30K89O55J109
7955A162l52q21p18l9O88P54M36p67j140l55P10Q18M9k49p92k83K05J418L86p66
$$ y = [-403, -239, -308, -13, 142, 370, 171, -272, -235, -133, -88, 64, 240, -65, -437, -187, 841, 541, 254, -440, -140, -379, 27, 332, 345, 286, -40, 255, -92, 362, 443, 249, 179, -531, -9, 71, 758, 360, -388, 213, -242, -191, -386, 342, -12, -344, -28, -145, 272, 140, 135, -35, -12, -191, -46, 5, -40, 156, 179, 39, -68, 91, 330, 61, -66, -135, -8, -9, 269, -3, 314, 0, -545, -92, 16, -41, -53, -227, -187, -636, -134, 53, 219, -4, -247, -93, -30, 426, 323, -12, -533, -698, -262, 477, 416, -168, -121, -342, -277, 503, 1199, 142, -293, -554, -9, -8, -46, 422, -491, 16, -762, -118, 777, 418, -105, -549, -555, -199, 561, 707, 208, -716, -727, -355, 717, 626, 363, -413, -521, -148, 174, 917, 187, -436, -955, -733, 654, 896, 189, -325, -698, -390, 385, 815, 1142, 39, -891, -602, 53, 1162, 810, -11, -729, -768, -80, 674, 1110, 343, -797, -1152, -442, 376, 425, 176, -616, -899, -694, 724, 1110, 344]
7975C44o77m69M13M93N69J18q93j065Q3J262Q60l60q75o55l98J502N80N44j253
7994A23r11o67J096J126K93k47j684k06O60J023P94j094j071n13N23J551M89n14
8012G71p75j434J40J501O78K54j173r99P1R73Q96M36j253j724N68N32J752K01
8030A415q77j517p23J439J470O3o74j057j262J056J163J037n71j983m00O11J354
8047E44J503r53j329j632P18J899R81n24j413j057j19J613J084K31j357j288j06
8064a205J016J171N87j210j596o64J526J456O86q86j689p47P29J370J432p30k015
8081g69o12L49J437Q49q0j504j120K68J443P48N58j097j912n8J691J433n17r36
8099A71j202j073J689J289M49j006j631n64J629J034O93p87j075o05Q1J412J266
$$ y = [344, -333, -802, -389, 104, 673, 791, -102, -1167, -1084, 178, 1038, 678, -197, -852, -1250, 252, 832, 1376, 123, -788, -1455, -359, 767, 1060, 813, -871, -1077, -417, 606, 1400, 306, -765, -1278, -755, 796, 1285, 771, -4, -1438, -1298, 203, 881, 1135, -38, -1037, -966, 7, 903, 1339, 86, -1638, -1070, -538, 1214, 1415, 538, -979, -1702, -263, 1207, 1270, 596, -461, -1723, -667, 496, 1533, 962, -1021, -1421, -810, 544, 2047, 1094, -235, -1867, -1149, 750, 1731, 1207, -206, -1263, -1382, 231, 1315, 1546, 189, -1099, -1205, -189, 982, 1569, 359, -1237, -1901, -375, 1081, 1767, 881, -808, -1555, -826, 544, 1976, 1246, -769, -1381, -1032, 405, 1254, 1174, -330, -1450, -1182, 261, 1009, 1567, 470, -1442, -1500, 191, 1624, 1107, 171, -1031, -2104, -415, 874, 1323, 317, -1314, -1878, -249, 785, 1478, 691, -384, -989, -908, 504, 1770]
8116A770p62j681m73K73J218R94j96j188j658L34J303J330O8j371j139k7J139
8133f6J077L92m70k039n09J343J545l9p26j344l95J72J106J267o74j490q95Q02
8151i43J345J005o14r93q65q1J122J098N10j711r03k42J269J300M95j574j085
8168h67j96J86J981K73j170r85n96R70J101N62j45j490j073P68J185R28K39k043
8186c72q03K17J354O03L17
8191A316
$$ y = [1770, 1008, -673, -1146, -873, 345, 1339, 1143, -45, -1703, -1369, -66, 1264, 1332, -39, -1178, -1205, -66, 1011, 1403, 933, -1106, -1615, -272, 1273, 1234, 508, -836, -1231, -1059, 47, 1314, 640, -850, -1745, -943, 402, 1407, 793, -200, -1065, -1146, -24, 1074, 1584, -127, -1030, -1272, -3, 1297, 1792, 218, -867, -1063, -877, 1104, 1377, 207, -778, -1374, -404, 697, 1259, 1114, -376, -1449, -681, 504, 1432, 1671, -372, -1175, -958, 396, 999, 1316]
$$ Imaginary data points
##PAGE= N=2
##DATA TABLE= (X++(I..I)), XYDATA
0@%%%%%%%j08K16k16K16k16L24l89L89n03O11p03Q10r17J083j299J433j601J880
25A010k140K422k725L037l424L868m314M783n326N932o596P307q063Q934r917
40e212J0950j2082J3387j4845J6465j8304K0395k2837K5717k9094L3186l8278
52b0552M4721n3201O4819q1569J07704j52976K45291n00569K390862P991063p431135
63B604458p430031M381462J422949n567791L004618Q766505l177842r807647J177357
72d625962O904869l19111j863993K830771j105439o275538J0888O133848J417659
81C107992k510649P7942m47723k872020J232462M353874j089086m208689Q26396
90a529501K476021j381367j54998L211409q69919m679719N08173M334345k93289
$$ y = [0, 0, 0, 0, 0, 0, 0, 0, -108, 108, -108, 108, -108, 216, -173, 216, -287, 324, -379, 431, -486, 597, -702, 731, -870, 1010, -1130, 1292, -1433, 1604, -1820, 2048, -2266, 2517, -2809, 3123, -3473, 3834, -4229, 4705, -5212, 5738, -6344, 7043, -7802, 8663, -9641, 10754, -12083, 13634, -15460, 17726, -20552, 24169, -29032, 35787, -45782, 61922, -91054, 154237, -346332, 2044530, 10035593, 2604458, -4825573, -444111, 978838, -4588953, -1584335, 7182170, 4004328, -5803319, -4625962, 2278907, 1959796, 95803, 2926574, 1821135, -4454403, -4443515, 1690333, 3107992, 597343, 675285, 227562, -2644458, -1411996, 2941878, 1852792, -2355897, -1529501, 946520, -434847, -589845, 2621564, 1751645, -2928074, -2419901, 1914444, 1621155]
99A621155k791541O62649P33618j781716R99903L646976p49867m123887q29921
108b612631J495472N53204J889523K208293k727263m335180J338286L511599l08685
117A012618k61826J680735k730915n029462K755679O951978n92839m670935N07390
126c77577O16314m008150Q21940P544302O11796p708589j626070N041648o9763
135H45851k407232L834256K112379o756271l672486O344495L828124l965194r51073
144g87151L005123k616425m118156M104223N073730l596016m354139K560232K028651
153A300072k340637O66211L343274j993982m297184J572697L584667r69961j545120
162f79963J301597l49506k158567J367851K858656j292620k605555O13861R08267
$$ y = [1621155, -1170386, -507737, 225881, -1555835, -555932, 3091044, 2341177, -1782710, -2612631, -1117159, -563955, 1325568, 3533861, 806598, -3528582, -2190296, 1321303, 1012618, 750792, 2431527, -299388, -5328850, -2573171, 4378807, 3785968, -884967, -377577, 238737, -3769413, -2947473, 4596829, 5208625, -2499964, -4126034, 915614, 845851, -1561381, 2272875, 4385254, -2371017, -6043503, 300992, 4129116, 163922, -787151, 2217972, -398453, -4516609, -412386, 4661344, 1065328, -3288811, -728579, 1300072, -1040565, -374354, 2968920, 974938, -3322246, -1749549, 1835118, 865157, -679963, 621634, 272128, -1886439, -518588, 2340068, 1047448, -1558107, -944246, -35979]
171c5979o80075J181578J969880j873043k981579J153259K407871m13647n36375
180A91890P36242j285703k030164J723347K971313o71998k005914r1316l87231
189h49534q86935J915624K509414j551499k710336N73238J043048o42847J137023
198E37196K029665k196577l489513J653737L252736r95970j286894J816752n22286
207G98846l619645Q29701M522010m02275l788565O17899K231221j911967j104474
216a827249L549122R96154m243200j219939L529818N92045k376428R61421J887214
225A848958k326924j924682K792795J791500k466208j048655J903601k08421j638919
234a276955J420816J789741j878156j748161J637452J048404j319938N9532J300574
$$ y = [-35979, -716054, 465524, 2435404, 562361, -2419218, -1265959, 1141912, 728265, 191890, 928132, -357571, -2387735, -664388, 2306925, 1634927, -370987, -462303, -849534, -1736469, 179155, 2688569, 1137070, -1573266, -1000028, 43020, -599827, 537196, 2566861, 370284, -3119229, -1465492, 1787244, 791274, -495620, 1321132, 798846, -2820799, -1991098, 2530912, 2128637, -1659928, -1042029, 1189192, -722775, -1827249, 1721873, 2718027, -1525173, -2745112, 784706, 1376751, -999677, -38256, 1848958, -477966, -2402648, 390147, 2181647, -284561, -1333216, 570385, 361964, -1276955, 143861, 1933602, 55446, -1692715, -55263, 993141, -326797, -267265, 1033309]
243A033309j015517j481827J440492J522919j269904j021419R28714j2853r99859
252h75945Q76268J340347j065347j334353Q02011O91961o64032K19135Q60951
261H50996q66106j173695R12640J055863o48992l22639O41906n45609r84496R50985
271a29147J155670r28285p92871R14125R5023j115877N34641J380595q45586j365134
281a096846R69544R50277j166787l50888J503832r3370j687894L99516J566286
290I93670p25293j235756J112900Q86143j398406n25705J496100J04432j436986
299g28901L71396J322364p85112j165774J006212Q66121j076096l95566J125143
308E39787j18993j218817M43647J190518n60586q98075O31999L88154q44196L5750
$$ y = [1033309, 17792, -1464035, -23543, 1499376, 229472, -791947, 136767, 123914, -875945, 323, 1340670, 275323, -1059030, -257019, 434942, -229090, -9955, 850996, -15110, -1188805, -276165, 779698, 130706, -191933, 449973, -95636, -1080132, -129147, 1026523, 98238, -694633, 219492, 314515, -801362, -266721, 1113874, 268288, -1096846, -127302, 822975, -343812, -694700, 809132, 715762, -972132, -572616, 993670, 268377, -967379, 145521, 1031664, -366742, -892447, 603653, 708085, -728901, -357505, 964859, 179747, -986027, 20185, 886306, -189790, -585356, 539787, 420794, -798023, -354376, 836142, 275556, -622519, 9480, 397634, -446562, -410812]
318d10812J080294k09723j101344K13573P76248l04846k80329N97768p4181r31657
328f45009J04987R64448k613n73964J30161Q3840n26954J35279Q74826k7200q21393
339c03592r3491L78824q0390J22007N84232k34131r72147k4920Q25183J84241
349C85816k50585J44369j78979p36612J33579J062923J98514q03122l00076J77088
359a67085j66197J77884Q74064P7388j116431n25257O38810M54012j3459K09900
369D43629j26506r08207l06492R95152P41009m26484n49407j68934k73453P4199
379e05494R18906N60691p58491r04308P9422M73896L12550L72008N476q56505
389c01849o97584N44574R73845J95667l90533m45380m93280j12520P70406Q46124
$$ y = [-410812, 669482, 459759, -641585, -428012, 348236, 43390, -236939, 360829, 286648, -645009, -540022, 424426, 421813, -152151, -21990, 61850, -465104, -329825, 545001, 517801, -303592, -397083, -18259, -98649, 23358, 607590, 373459, -598688, -623608, 201575, 385816, 135231, 279600, 100621, -635991, -502412, 560511, 759025, -44097, -344173, -167085, -333282, -155398, 718666, 796054, -320377, -845634, -206824, 247188, 233729, 443629, 317123, -591084, -897576, 97576, 838585, 412101, -137306, -306240, -579693, -505494, 413412, 974103, 215612, -688696, -609274, -135378, 177172, 549180, 554656, -301849, -999433, -454859, 518986, 714653, 324120, -121260, -614540, -727060, 43346, 889470]
399H89470k29897r13210m42197K32122N08045N67909J75680o66260r06947m5849
409h31134Q23342P33648N2969n47730p54966l15799N50297Q98897K76093n80728
419C04889q20180l50856M30480R08455N21285m55101r65233n08029L34847Q12561
429B13118O37834j21040q83061p92147J72940R30574O95339j39445p62903p57972
439h06763j05961P43955R49519J78875p87443r26123j73304O66115Q54198K85677
449H78745n41657q94356m02062N26431R81585M70250n15639r82083n01363M15411
$$ y = [889470, 659573, -253637, -695834, -463712, 44333, 612242, 787922, 121662, -785285, -831134, -7792, 725856, 778825, 231095, -523871, -839670, -289373, 609524, 885617, 304889, -515291, -866147, -435667, 472788, 994073, 538972, -426261, -934290, -599443, 213118, 850952, 729912, -153149, -945296, -772356, 158218, 853557, 714112, -48791, -806763, -912724, -168769, 780750, 959625, 172182, -753941, -927245, -261130, 593068, 878745, 337088, -557268, -959330, -432899, 548686, 1018936, 503297, -478786, -980149, -564738]
$$ [...]
8191i15
##END NTUPLES=NMR FID
##END=
