##TITLE=1H_IPEDM2
 CDCl3, 8 sc, 
 22.7.2019
##JCAMPDX= 6.0         $$ Bruker NMR JCAMP-DX V2.0
##DATA TYPE= NMR FID
##DATA CLASS= NTUPLES
##ORIGIN= UXNMR, Bruker Analytische Messtechnik GmbH
##OWNER= root
$$ XWIN-NMR		Version 3.5
$$ Mon Jul 22 14:01:09 2019 Russian Standard Time (UT+4h)  she@DPX200
##.OBSERVE FREQUENCY= 200.13155
##.OBSERVE NUCLEUS= ^1H
##.DELAY= (6, 6)
##.ACQUISITION MODE= SIMULTANEOUS
##.ACQUISITION SCHEME= undefined
##.AVERAGES= 8
##.DIGITISER RES= 18
##SPECTROMETER/DATA SYSTEM= spect
##.PULSE SEQUENCE= zg30
##.SOLVENT NAME= CDCl3
##.SHIFT REFERENCE= (INTERNAL, CDCl3, 0, 15.7039)
##AUDIT TRAIL= $$ (NUMBER, WHEN, WHO, WHERE, WHAT)
$$ ##TITLE= Audit trail, XWIN-NMR		Version 3.5
$$ ##JCAMPDX= 5.01
$$ ##ORIGIN= Bruker BioSpin GmbH
$$ ##OWNER= she
$$ F:/spectra/data/she/nmr/H-F/1/audita.txt
$$ ##AUDIT TRAIL=  $$ (NUMBER, WHEN, WHO, WHERE, WHAT)
(   1,<2019-07-22 13:59:57.79 +0400>,<she>,<DPX200>,
      <created by zg, POWCHK disabled, PULCHK disabled
       configuration hash MD5:
       00 E9 B6 7A A2 85 ED C7 34 08 36 98 17 FE 4E 26
       data hash MD5: 16K
       86 F9 5C DE 9B FA D6 7B 17 30 52 FC A3 08 3D 19>)
$$ ##END=
$$ 
$$ hash MD5
$$ 7F A8 50 89 50 CE AF A1 F8 18 AE FF 2B 4F 71 80
##$RELAX= 
##$RELAX= 
##$RELAX= 
##$RELAX= 
##$RELAX= 
##$RELAX= 
$$ Bruker specific parameters
$$ --------------------------
##$DU= <F:/spectra>
##$EXPNO= 1
##$NAME= <H-F>
##$PROCNO= 1
##$TYPE= <nmr>
##$USER= <she>
##$AMP= (0..31)
100 100 100 100 100 100 100 100 100 100 100 100 100 100 100 100 100 100 
100 100 100 100 100 100 100 100 100 100 100 100 100 100 
##$AQSEQ= 0
##$AQ_mod= 1
##$AUNM= <au_zg>
##$AUTOPOS= <>
##$BF1= 200.13
##$BF2= 200.13
##$BF3= 200.13
##$BF4= 200.13
##$BF5= 200.13
##$BF6= 200.13
##$BF7= 200.13
##$BF8= 200.13
##$BYTORDA= 1
##$CFDGTYP= 0
##$CFRGTYP= 5
##$CHEMSTR= <none>
##$CNST= (0..31)
1 1 145 1 1 1 1 1 1 1 1 1 1 1 1 1 1 1 1 1 1 1 1 1 1 1 1 1 1 1 1 1 
##$CPDPRG= <>
##$CPDPRG1= <>
##$CPDPRG2= <>
##$CPDPRG3= <>
##$CPDPRG4= <mlev>
##$CPDPRG5= <mlev>
##$CPDPRG6= <mlev>
##$CPDPRG7= <mlev>
##$CPDPRG8= <mlev>
##$CPDPRGB= <>
##$CPDPRGT= <>
##$D= (0..31)
0 1.2 0 0 0 0 0 0 0 0 0 0.03 0 0 0 0 0 0 0 0 0 0 0 0 0 0 0 0 0 0 0 0 
##$DATE= 1563789597
##$DBL= (0..7)
120 120 120 120 120 120 120 120 
##$DBP= (0..7)
150 150 150 150 150 150 150 150 
##$DBP07= 0
##$DBPNAM0= <>
##$DBPNAM1= <>
##$DBPNAM2= <>
##$DBPNAM3= <>
##$DBPNAM4= <>
##$DBPNAM5= <>
##$DBPNAM6= <>
##$DBPNAM7= <>
##$DBPOAL= (0..7)
0.5 0.5 0.5 0.5 0.5 0.5 0.5 0.5 
##$DBPOFFS= (0..7)
0 0 0 0 0 0 0 0 
##$DE= 6
##$DECBNUC= <off>
##$DECIM= 24
##$DECNUC= <off>
##$DECSTAT= 4
##$DIGMOD= 1
##$DIGTYP= 9
##$DL= (0..7)
0 120 120 120 120 120 120 120 
##$DP= (0..7)
150 150 150 150 150 150 150 150 
##$DP07= 0
##$DPNAME0= <>
##$DPNAME1= <>
##$DPNAME2= <>
##$DPNAME3= <>
##$DPNAME4= <>
##$DPNAME5= <>
##$DPNAME6= <>
##$DPNAME7= <>
##$DPOAL= (0..7)
0.5 0.5 0.5 0.5 0.5 0.5 0.5 0.5 
##$DPOFFS= (0..7)
0 0 0 0 0 0 0 0 
##$DQDMODE= 0
##$DR= 18
##$DS= 0
##$DSLIST= <SSSSSSSSSSSSSSS>
##$DSPFIRM= 0
$$ [...]
##$SUBNAM2= <"">
##$SUBNAM3= <"">
##$SUBNAM4= <"">
##$SUBNAM5= <"">
##$SUBNAM6= <"">
##$SUBNAM7= <"">
##$SUBNAM8= <"">
##$SUBNAM9= <"">
##$SW= 24.9336996594482
##$SWIBOX= (0..15)
0 0 2 0 0 0 0 0 0 0 0 0 0 0 0 0 
##$SW_h= 4990.01996007984
##$TD= 16384
##$TD0= 1
##$TE= 0
##$TE2= 300
##$TE3= 300
##$TEG= 300
##$TL= (0..7)
0 120 120 120 120 120 120 120 
##$TP= (0..7)
150 150 150 150 150 150 150 150 
##$TP07= 0
##$TPNAME0= <>
##$TPNAME1= <>
##$TPNAME2= <>
##$TPNAME3= <>
##$TPNAME4= <>
##$TPNAME5= <>
##$TPNAME6= <>
##$TPNAME7= <>
##$TPOAL= (0..7)
0.5 0.5 0.5 0.5 0.5 0.5 0.5 0.5 
##$TPOFFS= (0..7)
0 0 0 0 0 0 0 0 
##$TUNHIN= 0
##$TUNHOUT= 0
##$TUNXOUT= 0
##$USERA1= <user>
##$USERA2= <user>
##$USERA3= <user>
##$USERA4= <user>
##$USERA5= <user>
##$V9= 5
##$VALIST= <valist>
##$VCLIST= <CCCCCCCCCCCCCCC>
##$VD= 0
##$VDLIST= <DDDDDDDDDDDDDDD>
##$VPLIST= <PPPPPPPPPPPPPPP>
##$VTLIST= <TTTTTTTTTTTTTTT>
##$WBST= 1024
##$WBSW= 4
##$XGAIN= (0..3)
0 0 0 0 
##$XL= 0
##$YL= 0
##$YMAX_a= 716095
##$YMIN_a= -482250
##$ZGOPTNS= <>
##$ZL1= 120
##$ZL2= 120
##$ZL3= 120
##$ZL4= 120
##$ABSF1= 10
##$ABSF2= 0
##$ABSG= 5
##$ABSL= 3
##$ALPHA= 0
##$AQORDER= 0
##$ASSFAC= 0
##$ASSFACI= 0
##$ASSFACX= 0
##$ASSWID= 0
##$AUNMP= <proc_1d>
##$AZFE= 0.1
##$AZFW= 0.1
##$BCFW= 1
##$BC_mod= 2
##$BYTORDP= 1
##$COROFFS= 0
##$CY= 11.3945322036743
##$DATMOD= 1
##$DC= 2
##$DFILT= <>
##$DTYPP= 0
##$F1P= 18.9103706918063
##$F2P= -1.10871071338519
##$FCOR= 0.5
##$FTSIZE= 0
##$FT_mod= 4
##$GAMMA= 1
##$GB= 0.15
##$INTBC= 1
##$INTSCL= 1
##$ISEN= 128
##$LB= 0.24
##$LEV0= 0
##$LPBIN= 0
##$MAXI= 10000
##$MC2= 0
##$MEAN= 0
##$ME_mod= 0
##$MI= 1.114404
##$NCOEF= 0
##$NC_proc= 0
##$NLEV= 6
##$NOISF1= 3.799351
##$NOISF2= 2.8
##$NSP= 1
##$NTH_PI= 0
##$NZP= 0
##$OFFSET= 15.70392
##$PC= 1
##$PHC0= -9017.775
##$PHC1= 11.40096
##$PH_mod= 1
##$PKNL= yes
##$PPARMOD= 0
##$PSCAL= 0
##$PSIGN= 0
##$REVERSE= no
##$SF= 200.130013532006
##$SI= 16384
##$SIGF1= 3
##$SIGF2= 2
##$SINO= 400
##$SIOLD= 16384
##$SREGLST= <1H.CDCl3>
##$SSB= 0
##$STSI= 0
##$STSR= 0
##$SW_p= 3612.71676300578
##$SYMM= 0
##$S_DEV= 0
##$TDeff= 0
##$TDoff= 0
##$TI= <>
##$TILT= no
##$TM1= 0
##$TM2= 0
##$TOPLEV= 0
##$USERP1= <user>
##$USERP2= <user>
##$USERP3= <user>
##$USERP4= <user>
##$USERP5= <user>
##$WDW= 1
##$XDIM= 8192
##$YMAX_p= 0
##$YMIN_p= 0
$$ End of Bruker specific parameters
$$ ---------------------------------
##NTUPLES= NMR FID
##VAR_NAME=  TIME,          FID/REAL,        FID/IMAG
##SYMBOL=    X,             R,               I
##VAR_TYPE=  INDEPENDENT,   DEPENDENT,       DEPENDENT
##VAR_FORM=  AFFN,          ASDF,            ASDF
##VAR_DIM=   8192,          8192,            8192
##UNITS=     SECONDS,       ARBITRARY UNITS, ARBITRARY UNITS
##FACTOR=    0.0002004,     1,               1
##FIRST=     0,             0,               0
##LAST=      1.6414764,     0,               0
##MIN=       0,             -482250,         0
##MAX=       1.6414764,     716095,          0
$$ Real data points
##PAGE= N=1
##DATA TABLE= (X++(R..R)), XYDATA
0 0 0 0 0 8 -8 8 -8 16 -24 32 -40 48 -64 80 -91 112 -136 160 -192 224 -257 304 -353 406 -467 535 -610
27 -610 695 -786 887 -1001 1127 -1261 1410 -1575 1757 -1953 2169 -2405 2667 -2956 3272 -3620
43 -3620 4009 -4442 4926 -5474 6095 -6812 7642 -8618 9789 -11227 13033 -15388 18597
56 18597 -23245 30628 -44177 77145 -316919 -165877 602769 84573 -169427 154503 81499
67 81499 -442474 -90584 513208 217633 -379269 -192637 60376 -93149 2964 370345
77 370345 132353 -324920 -164931 183565 50122 -49940 109034 -19436 -294888 -45171
87 -45171 303854 104804 -158869 990 71102 -106511 -18093 188534 -24326 -266389 -34121
98 -34121 205393 60708 -38308 43909 -50017 -158850 53201 213291 6415 -164159 -82502
109 -82502 -36899 2494 191868 190089 -129618 -244705 -22840 79229 57449 159840 77388
120 77388 -285825 -276213 185258 295696 -17366 -67573 39460 -165392 -228322 199702 357155
131 357155 -86747 -293149 -7988 68596 -59275 129384 255456 -124266 -346944 11985
141 11985 233253 9609 -45210 96568 -68235 -230441 72150 294730 -303 -212233
151 -212233 -16037 58572 -80223 17975 177724 -13197 -198128 -5961 156582 19539
161 19539 -56593 20097 -37060 -112246 37470 149202 6581 -100532 -23644 16257 6732
172 6732 75127 62670 -103826 -139924 22059 98258 43999 27835 -9325 -106744 -60009 106113
184 106113 103123 -33337 -59853 -43618 -78544 9325 168643 88785 -118298 -95048 32377
195 32377 3274 1778 115163 33438 -185453 -107655 141802 110500 -43492 11196 33020
206 33020 -128211 -91252 155250 122927 -121251 -91873 72213 -1955 -65439 101514 115188
217 115188 -121891 -135962 86328 84348 -66439 -4221 75140 -65236 -104980 88646 119185
228 119185 -66461 -80164 48166 11217 -59139 39007 73719 -63424 -79582 58341 60603
239 60603 -37558 -9528 35621 -38628 -50690 54638 54775 -45873 -37687 25403 -2683 -15696
251 -15696 48018 31115 -58778 -40705 36250 21072 -8141 22089 -801 -61013 -11241 66743
263 66743 19516 -36842 6739 11881 -48002 -9800 68992 11739 -63400 -789 42819 -26024
275 -26024 -22651 60259 16948 -77369 -15868 64769 -6431 -48560 38356 38651 -62567 -30377
287 -30377 71052 14685 -68861 6992 59310 -32948 -51533 48920 38018 -54033 -13862 57417
299 57417 -12476 -61695 27694 55806 -34770 -37211 40507 12324 -46841 10756 53526 -20566
311 -20566 -47459 23793 26530 -30417 -331 44945 -12720 -51977 14112 42945 -12926 -18794
323 -18794 19837 -7147 -35704 19277 48234 -12573 -38334 5625 10491 -14374 12879 30134
335 30134 -21448 -41316 13091 32629 -2995 -5047 8010 -22563 -30308 23916 40390 -9348
347 -9348 -26499 -910 -4242 -6893 31531 31772 -32841 -50452 6360 32111 9659 7857 5735
360 5735 -31615 -32697 27656 47642 -1916 -29374 -14658 -12363 -4114 36404 40930 -18161 -49043
373 -49043 -10851 23669 22260 16806 -698 -38599 -38630 17094 50670 23002 -14275 -28522 -28119
386 -28119 -2680 38586 36870 -16292 -47757 -22329 14979 31982 30729 3958 -37240 -41556 3483
399 3483 39946 27972 -8446 -34505 -33632 786 44055 45460 -2598 -46063 -41617 -936 37125
412 37125 39928 1207 -42288 -41056 5151 46350 44082 3656 -41260 -51680 -12419 40310 50714
425 50714 9417 -37893 -45736 -8999 39573 54667 16324 -41286 -59849 -20923 35094 54933
437 54933 22506 -30441 -52759 -19975 36320 57692 20944 -37515 -61516 -29267 28290 57694
449 57694 30794 -24898 -52159 -24237 27408 50783 24743 -27716 -60649 -38646 25135 67160
461 67160 39578 -26294 -58294 -30168 22714 52961 34563 -22635 -66101 -43443 26033 66839
473 66839 40851 -17295 -54012 -41134 13357 59657 43241 -23396 -66411 -43012 17462 62148
485 62148 56178 -1941 -62187 -57721 8559 59424 44864 -9863 -54870 -54650 1441 67980 67855
498 67855 -5080 -65766 -54524 -465 43563 51659 11869 -50894 -65035 -1906 64556 57886
510 57886 -1575 -48649 -54250 -17706 41141 64908 14092 -58062 -63499 13 57231 57900 11600
523 11600 -45676 -67667 -24512 47563 68750 14914 -49474 -57105 -9456 45678 61814 20851
535 20851 -46463 -72054 -23566 47379 65548 20312 -37588 -58332 -25234 38453 71854 29644
547 29644 -48716 -75317 -24870 41574 63444 31866 -27762 -67471 -39180 37852 75443 29270
559 29270 -41268 -63999 -34097 18319 61252 52038 -17447 -72573 -42200 32847 61140 27436
571 27436 -20999 -52916 -48078 8108 69238 55348 -22388 -65450 -32959 19499 44905 38741
583 38741 -3121 -58297 -56810 16513 70288 39820 -20510 -42697 -31174 -2266 40905 52976
595 52976 -4286 -65220 -44026 24841 52391 30905 -2069 -38401 -52703 -3759 62750 50874
607 50874 -23988 -58011 -28092 9848 37267 50894 12503 -58684 -64772 9984 60777 35270
619 35270 -8529 -32861 -44621 -19605 45546 69224 6075 -59559 -49241 24 31182 41380
631 41380 23455 -29415 -60906 -18391 46278 51967 6554 -31826 -40880 -21267 21358 49961
643 49961 24990 -27984 -46348 -14750 25896 37456 15983 -17204 -34724 -21662 12951 38256
655 38256 23940 -19954 -40254 -10168 27130 27113 5441 -11780 -26639 -24321 14405 44691 13347
668 13347 -33901 -27317 5125 12791 16107 22330 -9840 -50621 -21054 41196 36534 -9274 -15840
681 -15840 -9817 -25683 -4534 51509 36756 -40460 -50861 6400 22047 5521 22229 18663
693 18663 -40691 -49560 25945 54902 -863 -25698 -1849 -13204 -27748 23464 56903 -2590
705 -2590 -50846 -11177 22330 87 725 25995 -2858 -45030 -10803 40682 18709 -19321 -4771
718 -4771 7049 -16370 -10762 26334 17718 -24372 -19337 15763 11364 -10688 63 12307 -6722
731 -6722 -15503 7830 15330 -9092 -16496 5644 12953 -2577 -4474 6242 -1927 -15427 -165
744 -165 21037 6436 -19560 -11563 10139 5944 -3300 8323 8928 -16332 -19393 11863 20236 -5104
758 -5104 -9303 7776 -1930 -18050 4928 26591 272 -22868 -594 13062 -8178 -7993 19118
771 19118 10787 -20658 -11212 15421 3630 -12051 8198 15826 -13663 -20101 9508 14160 -7050
784 -7050 -1104 14321 -5836 -25250 -457 24657 8312 -11281 -5313 -2398 -9790 739 19575
797 19575 11601 -12694 -17840 -4242 6624 10527 9950 1166 -13101 -17000 -1416 18875 17872 -4625
811 -4625 -18038 -7997 3371 4913 10717 12294 -8582 -24457 -3026 21391 9647 -7343 -1092
824 -1092 -1619 -14027 779 25576 6951 -24822 -10034 15785 2731 -7732 11643 6887 -24138
837 -24138 -11347 28878 16111 -22623 -12599 10564 -4854 -7340 24763 15839 -33420 -26809 25151
850 25151 24662 -11049 -4961 7567 -20542 -23196 27611 39180 -12770 -33723 -3193 6958 -391
863 -391 18855 23238 -21088 -41708 714 32660 15370 -1344 -3378 -19265 -23431 12750 37819
876 37819 10332 -23152 -21181 -6181 5791 22134 21898 -8742 -30335 -13522 12578 18954 12124
889 12124 -2442 -20622 -19138 6805 24066 13570 -6527 -18600 -16627 3324 23172 15039 -10681
902 -10681 -19529 -9406 2543 15912 20618 -2811 -29022 -16253 14854 18373 5057 -300 -12221
915 -12221 -24928 -1513 35028 22506 -19310 -24860 -4401 805 8992 27702 10152 -34440 -30764
928 -30764 16834 30152 6432 -2413 -7348 -27196 -16100 31338 38053 -9443 -31861 -9945 3119
941 3119 5943 23356 19302 -23640 -39229 710 29775 15724 409 -6029 -22390 -19859 18916
954 18916 36399 1853 -27726 -17518 -1821 6193 22006 21040 -15080 -35766 -7143 23324 18126
967 18126 2924 -6813 -21342 -19919 13481 34862 10241 -21049 -21116 -6864 5928 21615 20938
980 20938 -10216 -33176 -14089 17454 24448 12596 -5453 -24137 -21822 8792 29896 14788
992 14788 -11342 -20841 -15483 2167 25275 24418 -7491 -29040 -15097 7805 17389 16887 2321
1005 2321 -23507 -25900 6681 29732 15232 -8307 -17250 -17551 -5308 21120 27504 -3181 -29176
1018 -29176 -17354 7144 17344 17109 5509 -19645 -28735 -1457 26584 20282 -3320 -16911 -18055
1031 -18055 -5948 18027 27120 3700 -23462 -22559 -1935 16328 22716 9276 -17991 -27530 -4303
1044 -4303 21374 21540 4647 -12626 -22741 -13114 14999 28753 8703 -17746 -20841 -6286 10012
1057 10012 20692 13548 -11941 -26915 -10553 15480 21372 7833 -9616 -20101 -13048 9716
1069 9716 23699 11235 -12468 -22086 -11230 9507 22265 12380 -11116 -21754 -9977 8397
1081 8397 18287 13858 -5342 -23434 -16383 10143 22877 10380 -7272 -15731 -13742 1638 20517
1094 20517 17863 -7194 -22492 -11473 7350 16547 13964 -673 -18281 -17615 3775 19757 13871
1107 13871 -3356 -15582 -14960 202 17608 16379 -2557 -16268 -13013 -318 12773 16204 1677
1120 1677 -17388 -16351 2788 15020 11461 1101 -10829 -16842 -4493 15818 16778 -2442 -14804
1133 -14804 -10094 -347 8602 14032 5247 -13227 -17459 -1137 13426 12092 2114 -8154 -13244 -5235
1147 -5235 10637 14993 2492 -10513 -11471 -3136 7682 12880 5201 -8783 -12500 -2845 7917 10849
1161 10849 5183 -6215 -12965 -5116 8652 11160 2465 -5349 -7937 -5434 3463 11304 5924 -7186
1175 -7186 -10790 -2846 4956 7398 5303 -2525 -10195 -6460 5301 9353 2391 -4554 -6336 -4328 1643
1190 1643 7572 5446 -3391 -7711 -3456 2628 5526 4332 -1279 -6782 -4638 3134 6328 2568 -1846
1205 -1846 -3472 -3397 -189 4980 4997 -1722 -5756 -1758 3016 2893 1513 832 -2189 -4500 -305 5299
1221 5299 2852 -3059 -2378 1375 237 -1202 2344 2845 -3167 -4282 2019 3475 -1747 -1907 2246 373
1237 373 -3302 390 3495 -1380 -3885 1542 3065 -2584 -2868 2604 1965 -2151 -270 1980 -1765 -2942
1253 -2942 2325 3360 -1560 -2359 421 -175 -523 3223 2917 -3153 -4195 1354 3210 812 514 -73
1269 -73 -3345 -2683 3392 5150 564 -3079 -3097 -1571 2189 5318 1889 -4205 -4709 -873 2551 4957
1285 4957 3780 -3487 -7735 -1691 5023 3789 1192 -484 -5880 -7353 3353 11270 2340 -7580 -4221
1300 -4221 -402 -1784 3872 9780 -1146 -13838 -4863 9199 5886 -1013 1167 -2423 -10636 -1736
1314 -1736 13946 7616 -9034 -7824 1349 505 1801 9530 3156 -12703 -9273 7828 9782 372
1328 372 -1581 -2688 -8472 -2655 12164 10482 -6097 -11066 -2525 2828 5028 7968 1681 -11378
1342 -11378 -10987 3778 11551 5813 -2276 -7296 -8415 -1171 9625 10477 -918 -11478 -10208 905
1356 905 10619 9058 -806 -8123 -8490 -3233 7142 13518 3173 -13668 -12439 3216 9556 5660
1370 5660 3657 -2697 -13998 -8171 13149 15485 -3630 -10881 -3099 -2291 -489 13104 12414 -11461
1384 -11461 -19085 2383 13699 3387 97 1820 -9901 -13191 8962 20175 -62 -14533 -5296
1397 -5296 393 -831 9700 13552 -7621 -20517 -1767 14075 5833 -634 629 -8830 -13942 5715
1411 5715 20619 4417 -13793 -8907 -773 563 8256 12297 -3800 -18095 -6784 10431 11049
1424 11049 3914 -2271 -10704 -10981 4103 14924 7078 -5520 -9880 -7705 1488 13288 10963 -5160
1438 -5160 -12972 -6063 2041 8407 12116 1324 -15675 -11829 7549 12053 3320 197 -4217 -13621
1452 -13621 -5498 16352 15082 -7748 -13566 -1955 567 1872 12289 7661 -14714 -16010 6368
1465 6368 12885 1329 -354 -545 -12536 -9519 14534 17705 -6451 -14535 -1233 1348 -1177 10281
1479 10281 10883 -11974 -18858 4148 15751 3415 -2049 -41 -8772 -10811 8744 18050 -372
1492 -372 -13778 -5699 1618 2385 8843 9185 -7220 -16114 -2365 10923 8313 1766 -3282 -9633 -7438
1507 -7438 6539 13156 3683 -7000 -9188 -5454 3431 11511 6427 -6735 -10001 -3057 2941 7106
1521 7106 7994 -2129 -13174 -6915 7354 8825 2152 -1205 -6184 -9815 1155 13992 6118 -8701
1535 -8701 -7235 -305 -733 4110 11705 931 -15642 -7951 9852 7897 -1079 1268 -1093 -11299
1549 -11299 -3644 14892 10001 -9180 -9002 1627 28 205 10178 5557 -12717 -11305 7189 9950
1563 9950 -129 -750 -515 -8779 -5803 10187 11159 -4508 -9187 -1454 377 757 7238 5365 -7888
1578 -7888 -10592 1416 7726 3556 255 -2541 -6786 -3668 6136 7840 -210 -5457 -4780 -1941 3417
1593 3417 7187 2319 -5680 -5904 -453 3586 5605 3625 -4055 -7931 -1370 5508 4123 1124 -585
1608 -585 -4984 -5326 3911 8912 844 -5924 -2666 -453 -897 4228 6916 -2700 -9348 -722 6309 1675
1624 1675 -717 1829 -2841 -7483 1293 9266 1499 -6314 -1821 1192 -2237 1385 6888 -330 -9004
1639 -9004 -2441 5798 2286 -1401 1607 -747 -5973 -587 7192 2750 -4495 -2429 501 -1066 1348
1654 1348 5203 298 -5849 -2085 3379 1691 316 1708 -1291 -4659 -67 5013 1856 -2061 -921
1669 -921 -888 -1851 1636 4242 -499 -4042 -522 1557 -234 970 2572 -1666 -4184 737 3384 -396
1685 -396 -1367 1276 -864 -3039 1457 3935 -1420 -3436 1268 1450 -2349 6 3387 -1040 -4049 1269
1701 1269 3579 -1717 -2238 2362 667 -3433 421 3945 -923 -3271 1810 2597 -2369 -1443 3110 535
1717 535 -3151 602 3200 -1319 -2501 2175 1982 -2204 -777 2270 -434 -2342 1487 2563 -1691
1732 -1691 -2204 1353 1018 -1235 494 1518 -1714 -2325 1475 2091 -827 -969 373 -1130 -1350 1835
1748 1835 2303 -1446 -2679 -54 888 446 1254 649 -2085 -2248 969 2242 761 -205 -968 -2032 -579
1765 -579 2680 2499 -972 -2348 -1037 169 1598 2636 619 -2730 -2525 793 2407 1608 466 -1476
1781 -1476 -2981 -708 3288 3150 -635 -2697 -1917 -470 1675 3227 980 -3004 -3319 73 2492 2361
1797 2361 821 -2166 -3913 -1262 3207 3627 22 -2778 -2835 -1238 1813 3936 1538 -3194 -4113 -519
1813 -519 2783 3150 1295 -1934 -4105 -1988 2764 4498 1298 -2707 -3622 -1453 2179 4316 2205 -2417
1829 -2417 -4378 -1674 2524 4257 2243 -1854 -4355 -2396 2316 4500 2258 -2039 -4274 -2558 1831
1844 1831 4677 2825 -1960 -4688 -2572 1657 4251 2898 -1467 -4801 -3311 1600 4851 3143 -1712
1859 -1712 -4844 -3357 1385 4648 3161 -1375 -4566 -3567 828 4728 4077 -1089 -5188 -3749 1259
1874 1259 4607 3587 -491 -4325 -4223 602 5104 4239 -869 -4524 -3784 278 4384 4744 233 -4834
1890 -4834 -4651 605 4755 4092 41 -3947 -4560 -595 4566 5066 235 -4579 -4416 -464 3727 4714
1906 4714 1120 -4249 -5348 -853 4283 4666 617 -3691 -4806 -1701 3551 5316 1322 -4193 -5069
1921 -5069 -1051 3358 4580 1812 -3073 -5504 -2135 3762 5529 1377 -3518 -4626 -1672 2819 5160
1936 5160 2553 -2985 -5489 -2088 3431 5179 2091 -2663 -4920 -2544 2673 5548 2779 -2824 -5222
1951 -5222 -2382 2536 4776 2631 -1969 -5064 -3248 2214 5499 3071 -2459 -5084 -3030 1550 4629
1966 4629 3517 -1425 -5453 -3688 1884 4918 2846 -1306 -4140 -3923 162 4955 4355 -1435 -5261
1981 -5261 -2990 1395 3551 3307 465 -4116 -4840 592 5301 3354 -1394 -3315 -2698 -538 3439 5143
1997 5143 396 -5386 -3908 1823 3801 2326 641 -2278 -4610 -1219 4956 4840 -1220 -4200 -2375
2012 -2375 -226 1947 4216 1874 -4279 -5330 532 4528 2624 -232 -1946 -3755 -2417 3235 5423
2027 5423 307 -4475 -3310 -38 1801 3216 2512 -2385 -5461 -1624 3861 3854 356 -1987 -2841 -2147
2043 -2147 1405 4481 2288 -2666 -3911 -997 2062 3140 1849 -1102 -3550 -2115 1944 3878 1646
2058 1646 -1829 -2909 -1283 1161 2786 2127 -826 -3401 -2309 1690 3558 1113 -1829 -2205 -1184
2073 -1184 364 2381 2668 -993 -3953 -1654 2264 2311 422 -494 -1796 -2787 54 3988 2291 -2550
2089 -2550 -3074 -308 665 1111 2470 669 -3623 -3221 1849 3485 581 -914 -738 -2011 -1421 2711
2105 2711 3806 -747 -3545 -859 1201 710 1358 1701 -1331 -3343 -295 2995 1541 -706 -663 -850
2121 -850 -1229 592 2664 770 -2233 -1656 612 864 254 584 -39 -1564 -1087 1280 1656 -452 -1488
2138 -1488 -486 272 173 395 579 -509 -1575 -424 1393 1101 -792 -1076 54 52 -85 1034 942 -1148
2156 -1148 -1758 506 1730 187 -565 244 -351 -1214 601 2199 224 -1787 -281 1002 -395 -362 1607
2173 1607 709 -1931 -1005 1777 890 -1055 -7 1126 -807 -1438 994 1377 -893 -881 980 120 -1554
2190 -1554 4 1586 -96 -1363 225 635 -1101 -701 1451 875 -1417 -1003 747 298 -451 511 805
2207 805 -991 -1481 477 1325 178 -427 -105 -396 -636 498 1471 385 -1157 -773 555 643 317 415
2225 415 52 -1005 -731 1028 1396 -234 -1102 -68 359 -109 536 1037 -497 -1834 -124 1758 678
2242 678 -1027 -453 -26 -715 64 1818 626 -2102 -1552 949 1082 -40 332 -104 -1941 -1102 1932
2259 1932 2138 -880 -1717 -421 -173 83 1770 1536 -1683 -2668 66 1961 1047 284 -236 -1712 -1628 1404
2277 1404 2984 501 -1804 -1254 -208 289 1615 1935 -679 -2796 -971 1704 1715 419 -396 -1466
2293 -1466 -1563 386 2373 1362 -1068 -1824 -843 560 1547 1388 -585 -2119 -1382 705 1738 1147 -616
2310 -616 -1999 -1446 732 1933 1002 -621 -1636 -1580 228 2218 1719 -957 -2211 -1054 581 1554 1757
2327 1757 100 -2347 -2156 951 2584 1193 -473 -1304 -1672 -333 2406 2605 -532 -2604 -1291 466
2343 466 1374 1886 879 -2121 -2897 304 2804 1421 -530 -1117 -1704 -1186 1644 3092 137 -2654 -1854
2360 -1854 241 1117 1592 1150 -1479 -3060 -631 2338 1870 -282 -1166 -1564 -1298 977 2798 929 -2072
2377 -2072 -2195 -132 1249 1705 1120 -979 -2577 -984 1664 2165 567 -1080 -1810 -1164 1083 2554
2393 2554 1083 -1367 -2040 -768 949 2091 1401 -924 -2424 -1100 1255 1980 1158 -678 -2165 -1552
2409 -1552 900 2401 1109 -1036 -1878 -1329 336 2140 1823 -931 -2520 -1272 734 1550 1322 -48
2425 -48 -2121 -2050 553 2319 1227 -527 -1473 -1552 -294 1964 2316 -376 -2291 -1322 420 1225 1624 644
2443 644 -1658 -2296 56 2167 1512 -149 -1137 -1606 -654 1599 2337 40 -1908 -1403 69 1054 1718
2460 1718 865 -1416 -2299 -286 1786 1490 226 -977 -1740 -998 1328 2198 286 -1650 -1529 -478 706
2477 706 1725 1023 -1178 -2238 -553 1309 1435 574 -628 -1742 -1135 1102 2055 496 -1110 -1340 -828
2494 -828 409 1861 1412 -895 -1968 -567 929 1316 1022 -73 -1663 -1391 828 1993 793 -692
2510 -692 -1092 -946 34 1574 1521 -569 -1742 -771 523 1064 1205 110 -1653 -1573 483 1597 752 -286
2528 -286 -988 -1319 -383 1445 1492 -418 -1446 -828 52 792 1218 360 -1460 -1452 340 1216 670 -15 -643
2547 -643 -1269 -444 1277 1394 -182 -1037 -744 -163 654 1402 443 -1153 -1265 155 1009 741 319 -396 -1204
2566 -1204 -465 1141 1244 -61 -748 -659 -478 386 1301 578 -1005 -1171 -6 601 579 442 -228 -1198 -701
2585 -701 867 948 -18 -457 -570 -756 10 1120 644 -878 -952 -18 292 322 581 64 -1024 -692 633
2604 633 874 109 -247 -216 -466 -4 815 618 -457 -608 30 278 238 478 79 -644 -495 351 573 49
2624 49 -68 -192 -355 -38 507 397 -346 -434 -78 78 89 238 -39 -450 -300 201 234 16 -144 -174 -264 45
2646 45 190 71 -166 -113 -184 -107 214 141 -253 -169 271 125 -231 45 324 -103 -281 158 441 -161 -276 350
2668 350 294 -227 -34 288 -37 -157 376 358 -262 -295 322 174 -117 88 120 -361 -383 407 580 -149 -428 -104
2690 -104 -52 -16 419 332 -431 -718 -50 384 242 138 -111 -560 -599 255 790 204 -485 -561 -256 99 452 565
2712 565 -58 -796 -527 337 724 435 -164 -469 -395 64 657 731 -51 -717 -549 340 722 382 -12 -449 -527
2733 -527 60 711 704 -182 -713 -308 299 523 460 -1 -728 -745 224 975 423 -468 -779 -397 77 741 783 -177
2755 -177 -1163 -864 334 942 520 -207 -862 -1008 -94 1145 1074 -299 -1219 -773 107 723 1007 358 -906
2774 -906 -1305 -64 1317 1004 -62 -634 -857 -468 729 1462 491 -1034 -1050 31 743 796 594 -282 -1240
2793 -1240 -639 1034 1247 21 -764 -672 -333 206 1043 656 -833 -1305 -128 834 631 93 -462 -916 -653
2812 -653 720 1273 164 -1060 -953 -84 611 868 436 -740 -1345 -413 971 1186 274 -719 -997 -506
2830 -506 600 1328 713 -743 -1378 -467 814 1319 550 -444 -1156 -740 418 1365 993 -498 -1370 -527
2848 -527 508 977 873 -11 -1144 -1185 294 1385 725 -483 -866 -615 -202 796 1153 -55 -1413 -863
2866 -863 512 753 344 9 -601 -1108 -124 1233 826 -687 -840 -253 33 341 858 136 -1148 -945 590
2885 590 1067 313 -277 -391 -697 -219 1107 1116 -330 -1116 -364 361 705 791 273 -812 -1115 111 1186
2904 1186 811 -99 -696 -747 -272 709 1169 157 -968 -968 -116 643 740 259 -548 -996 -497 539 931 314
2924 314 -601 -837 -261 360 560 414 -353 -824 -535 399 793 194 -320 -507 -344 151 648 507 -300 -794
2944 -794 -192 500 422 231 10 -365 -439 348 849 275 -413 -440 -87 306 537 443 -169 -617 -266 476 564 200
2966 200 -189 -500 -415 155 668 489 -347 -649 -287 116 491 416 -106 -621 -551 18 548 419 -159 -552 -412
2987 -412 -56 372 479 124 -521 -610 27 456 339 15 -166 -275 -166 232 553 179 -458 -292 79 139 238
3008 238 282 47 -473 -114 467 378 -118 -141 -51 -128 120 465 232 -350 -308 145 182 88 26 -28 -382 -222 260
3031 260 328 -53 -259 -151 -115 -38 269 209 -302 -375 -47 211 131 101 -48 -292 -203 113 271 161 -113 -214 -132
3054 -132 51 237 144 43 -111 -173 19 275 282 53 -172 -51 46 123 188 93 -159 -242 81 196 144 50 -13 -130
3078 -130 -141 175 252 -50 -190 -55 48 48 60 93 -88 -263 -14 213 -10 -64 -16 -157 -184 22 125 -153 -205
3101 -205 -11 38 -59 -11 65 -27 -160 16 112 0 -33 25 -9 -70 97 75 34 -85 8 68 21 29 126 -34 -55 36 81
3128 81 10 83 51 8 15 135 23 -55 -19 58 40 -46 -21 -25 -97 -63 58 -5 -124 -58 41 -76 -26 90 -50 -188 -73
3155 -73 24 20 -54 51 -110 -67 -29 143 16 -111 -6 11 -31 133 214 -73 -177 -20 145 91 78 40 -105 -106 76
3180 76 185 99 -121 -15 -31 17 210 172 -36 -168 -80 150 68 93 25 -203 -200 93 206 -28 -118 -150 -130 -85 220
3205 220 180 -165 -230 -68 27 72 43 -50 -118 -203 94 200 85 -28 -59 -83 -28 335 260 -28 -216 -2 51 156
3229 156 179 53 -191 -209 124 277 102 -26 -75 -150 -12 306 290 -66 -248 -103 57 114 205 51 -244 -316 99
3252 99 203 128 -26 -105 -226 -191 230 173 -115 -315 -218 -39 61 202 8 -236 -207 28 235 119 11 -53 -206
3275 -206 -46 226 283 8 -158 -165 -10 152 277 28 -230 -213 87 158 178 121 -69 -177 -13 155 165 -34 -78
3298 -78 -135 -30 112 165 17 -257 -162 42 105 108 -4 -122 -199 -52 157 145 -94 -186 -212 -114 72 154 -46 -221
3322 -221 -199 -4 111 156 -23 -163 -200 -7 217 189 10 -167 -136 -25 169 274 -31 -165 -88 7 141 157 108
3345 108 -114 -132 35 178 182 -60 -117 -79 9 145 156 -13 -184 -51 4 99 169 9 -124 -142 -15 73 82 0 -144
3370 -144 -96 4 147 67 -104 -128 -60 -60 79 65 -26 -200 -111 -44 130 19 -27 -101 -167 59 146 124 -60 -188 -31
3395 -31 53 130 153 54 -123 -127 94 190 118 37 -76 -100 22 160 148 10 -112 -106 31 31 148 -33 -119 -106 -6 130
3421 130 30 -46 -144 -189 -16 140 75 -100 -141 -90 58 90 65 -41 -136 -130 34 106 143 -85 -143 -118 113 108 71 -72
3447 -72 -148 2 49 112 88 -9 -9 -33 82 133 104 37 -90 -82 81 151 99 -16 -133 -84 -27 207 63 -107 -84 -51 45
3474 45 90 121 -95 -178 -134 57 113 83 -88 -150 -161 -29 115 126 -144 -110 -52 37 52 24 -33 -100 -175 -39 228 65
3500 65 -54 -110 27 -6 68 106 30 -103 -111 30 142 62 48 -8 -65 32 147 185 -61 -99 -46 60 38 27 44 -13 -101
3527 -101 87 58 6 -54 -101 -2 -30 29 138 -25 -176 -51 28 59 13 -61 -52 -92 -112 76 119 -19 -95 -35 -15 7 117
3554 117 88 -76 -133 54 144 69 20 -2 8 -22 4 266 65 -122 46 95 59 -10 78 94 28 21 105 174 -40 -43 106
3581 106 79 -79 -4 80 8 -79 -9 101 -50 -167 -19 43 -30 14 -14 -41 -184 10 28 34 13 -59 7 -55 -99 84
3607 84 90 -52 -65 -59 46 16 21 61 23 -49 9 44 28 50 39 1 -19 31 108 27 -23 41 47 37 31 62 122 69 -36 48 45 -68
3639 -68 -56 105 85 -9 -75 11 -62 -131 71 174 -95 -253 -55 77 59 -74 40 -46 -215 -125 150 98 -155 -62
3663 -62 18 -99 -58 139 158 -176 -229 64 159 13 16 87 -106 -216 59 239 -19 -117 -23 84 30 162 192 -30
3687 -30 -157 14 198 130 44 -13 -6 -103 18 234 69 -73 -177 -17 32 123 89 -63 -155 -167 100 172 10 -202
3711 -202 -228 -144 56 176 95 -105 -350 -169 143 263 28 -183 -152 -107 -2 227 257 -120 -255 -108 196 184
3733 184 191 -3 -260 -247 66 425 260 -124 -235 -64 70 247 294 98 -376 -274 125 352 130 -3 -161
3754 -161 -284 -3 371 348 -136 -335 -187 79 221 248 17 -382 -402 8 368 265 -50 -281 -342 -78 323
3775 323 348 -49 -381 -319 30 296 365 17 -299 -385 -44 357 358 41 -295 -311 -3 373 506 47 -319 -303 -45
3798 -45 375 440 110 -338 -446 -88 369 441 120 -299 -472 -84 423 518 125 -365 -379 -158 278 473 155 -416
3820 -416 -478 -132 344 442 165 -322 -616 -273 361 483 91 -382 -434 -202 227 518 267 -332 -540 -110 318
3841 318 509 273 -203 -530 -300 294 622 241 -372 -422 -113 264 454 373 -196 -561 -184 272 514 262 -174
3862 -174 -537 -356 253 565 286 -307 -467 -237 176 543 349 -216 -551 -355 160 468 326 -213 -561 -409
3882 -409 167 580 334 -225 -557 -345 172 573 267 -162 -518 -421 96 485 411 -178 -592 -359 220 550 368
3903 368 -36 -416 -343 136 585 383 -72 -469 -364 32 480 465 -1 -525 -372 175 501 377 -96 -354 -429
3924 -429 39 491 365 -72 -400 -397 -29 303 430 18 -515 -499 67 456 310 8 -366 -446 -83 361 313 -61
3946 -61 -388 -335 -47 326 436 113 -396 -425 30 383 384 90 -240 -395 3 336 385 37 -242 -252 -85 246
3968 246 359 122 -301 -339 -5 219 252 112 -202 -378 -47 295 222 68 -181 -310 -154 194 282 48 -335
3989 -335 -280 23 151 179 77 -143 -325 -116 209 178 -1 -138 -249 -117 138 356 2 -280 -215 -28 77
4010 77 127 182 -56 -302 -41 236 271 58 -149 -99 -133 77 314 111 -188 -185 1 104 161 103 -94 -187 -115 112
4034 112 175 67 -60 -92 -64 15 155 76 4 -191 -89 5 98 78 -187 -131 6 76 71 59 -43 -121 -156 65 99 -15
4060 -15 -43 -24 17 17 135 47 -104 -38 143 106 -85 17 70 -156 -115 185 180 -55 -103 120 32 -133 82 131 -85
4085 -85 -176 94 224 -117 -140 85 17 -43 62 155 -14 -216 24 108 -81 -41 51 -7 -219 10 188 37 -181
4108 -181 -49 65 -17 -66 65 104 -131 -109 31 77 -39 -91 32 -65 -42 87 103 47 -109 41 129 -8 -22 52
4132 52 105 -67 -54 225 138 -129 -187 119 86 -43 4 94 -91 -197 50 153 56 -97 -69 -87 -51 87 212 -29
4156 -29 -283 -119 138 12 -77 90 41 -263 -173 195 163 -85 -202 27 -109 -61 185 211 -179 -325 -2 189
4178 189 52 24 129 -109 -170 0 327 113 -87 -124 63 41 -11 205 100 -192 -169 148 226 -44 -86 8 -137
4201 -137 -115 150 225 -42 -293 -92 209 94 23 37 -213 -340 24 323 121 -251 -257 -74 -78 10 313 124 -416
4224 -416 -403 167 315 128 11 -170 -278 -186 268 442 31 -329 -218 -13 116 274 234 -209 -411 -138 364
4245 364 286 -50 -161 -163 -158 98 519 332 -255 -389 -102 203 283 146 -89 -319 -320 240 481 120 -313 -360 -108
4268 -108 76 265 260 -99 -516 -350 275 388 106 -243 -327 -277 35 463 384 -332 -533 -94 287 308 252 16
4290 16 -327 -439 210 658 292 -263 -324 -143 125 459 422 -97 -557 -278 311 542 266 -94 -320 -423 4
4311 4 594 499 -184 -571 -274 169 314 382 11 -447 -516 103 543 463 -198 -439 -377 -21 367 522 7 -643
4333 -643 -604 154 473 317 28 -376 -504 -189 491 609 5 -556 -382 135 300 452 232 -390 -595 -4
4353 -4 645 439 -131 -260 -281 -137 369 701 128 -528 -425 125 459 382 176 -247 -616 -113 572 595 -101 -479
4375 -479 -299 -140 241 573 214 -460 -668 -87 449 473 72 -340 -512 -208 374 582 87 -451 -483 -119 267
4396 267 442 257 -240 -476 -229 369 520 156 -328 -393 -99 322 476 276 -214 -439 -186 341 509 113
4416 113 -213 -268 -230 152 574 247 -327 -452 11 270 291 204 -77 -416 -339 259 588 5 -257 -244 -189 -34
4438 -34 386 353 -301 -585 -170 348 232 12 -66 -347 -359 167 425 123 -238 -290 -89 52 249 260 -93 -329
4460 -329 -122 300 276 145 -27 -199 -132 70 269 201 -75 -188 -131 84 307 255 -104 -180 -4 62 222 179 -37
4483 -37 -246 -153 219 140 13 -28 -55 -252 -14 330 133 -272 -193 49 75 -94 97 60 -308 -214 289 182 -138
4506 -138 -38 40 -138 -121 199 108 -265 -239 120 122 -41 135 109 -181 -98 224 168 -136 -156 94 24 -55 136 166
4530 166 -122 -197 144 112 -5 -45 18 -88 -77 234 127 -132 -103 37 -16 33 106 58 -162 -94 115 118 -69 -146 -170
4555 -170 -99 68 203 1 -84 -85 -106 -5 131 190 -140 -150 -37 153 111 -19 -31 -114 -153 167 278 19 -153 -55
4579 -55 15 2 89 259 -30 -207 -69 150 129 40 -56 -98 -186 108 337 28 -210 -4 -17 9 106 161 -129 -260
4603 -260 -21 94 92 73 28 -258 -222 100 206 19 -143 -40 -126 -5 201 172 -89 -244 -69 105 73 178 44
4626 44 -287 -230 204 281 32 -3 -73 -99 -107 216 192 -52 -203 -57 41 112 191 114 -282 -145 129 167 4 46 -25
4651 -25 -158 -180 220 319 -52 -137 -55 -61 -4 213 129 -203 -266 91 82 116 13 -36 -244 -186 154 250 -55 -178 -113 -124
4677 -124 -54 176 151 -136 -222 3 146 106 64 71 -173 -154 160 190 58 12 -43 -135 36 269 155 -83 -166 -58
4701 -58 9 107 161 98 -178 -153 27 143 182 96 -157 -280 -127 235 171 -97 -120 -166 -178 60 330 43 -233 -232 -8
4726 -8 13 190 191 -96 -354 -147 293 161 13 1 -183 -288 81 450 202 -191 -226 -18 19 126 254 28 -355
4749 -355 -221 222 316 49 -72 -146 -245 29 392 326 -146 -306 -48 46 163 263 89 -329 -338 119 286 176
4771 176 -12 -166 -301 32 288 258 -71 -312 -239 -28 272 350 24 -293 -327 -46 256 313 115 -212 -336 -71
4793 -71 201 208 24 -149 -342 -179 265 388 74 -292 -240 -85 87 324 289 -236 -398 -56 275 266 73 -8 -316
4816 -316 -303 210 488 25 -351 -275 38 44 246 287 -118 -486 -178 338 321 10 -96 -279 -335 57 476 187
4838 187 -304 -372 -27 114 185 285 -20 -395 -331 236 433 162 -165 -203 -183 35 399 387 -117 -430 -143 218
4860 218 275 107 -47 -189 -243 -26 278 421 -97 -411 -198 121 233 209 19 -268 -313 118 456 194 -215
4881 -215 -252 -147 -60 191 380 115 -425 -258 226 240 37 -19 -123 -308 -147 384 355 -181 -352 -102 52 71
4903 71 205 182 -267 -400 104 417 136 -181 -91 -131 -202 170 416 123 -274 -235 139 188 101 114 -21 -270 -99
4926 -99 218 279 -69 -236 -46 30 11 102 104 -139 -272 70 241 101 -160 -121 -61 -88 36 253 33 -268 -187 94
4950 94 150 -31 -48 -21 -209 -186 134 250 -87 -253 -55 88 38 -28 168 -64 -272 -48 281 65 -175 22
4972 22 171 -70 -73 204 128 -241 -49 222 68 -161 -4 172 -55 -136 157 178 -211 -230 115 223 -66 -76 165
4995 165 -82 -202 126 269 -47 -287 -19 143 -79 -12 106 -75 -300 6 258 35 -179 -31 129 -60
5015 -60 -4 235 100 -229 -124 140 247 -45 -66 27 -90 -9 238 254 -130 -189 41 241 98 69 90 -128 -186
5038 -186 65 296 138 -164 -172 14 94 50 166 28 -255 -174 109 322 59 -101 -216 -105 -59 282 242 -148
5060 -148 -329 -116 181 193 74 -34 -146 -323 11 398 213 -191 -260 -42 50 111 231 102 -314 -322 168 379
5082 379 129 -108 -139 -160 -32 218 378 11 -383 -154 126 178 245 70 -194 -351 31 376 225 -165 -246 -119
5104 -119 -103 162 304 32 -322 -356 -11 305 205 -2 -179 -416 -86 267 350 -34 -272 -311 -39 198 266 107
5126 107 -233 -414 -96 310 337 -9 -276 -245 -59 252 390 170 -248 -356 -55 335 345 51 -133 -307 -163
5147 -163 241 477 168 -297 -276 -24 189 337 179 -92 -471 -199 243 373 102 -159 -280 -268 51 395 267
5168 267 -235 -440 -129 118 232 172 -41 -430 -355 174 369 116 -170 -244 -222 1 316 358 -95 -389 -202 117
5190 117 279 231 -89 -236 -272 45 365 296 -8 -369 -246 39 378 349 38 -323 -318 91 321 292 1 -267
5212 -267 -294 -74 309 417 43 -342 -404 1 267 273 42 -260 -310 -157 283 356 -35 -281 -287 -138 215 292 161
5235 161 -243 -430 -144 237 251 67 -169 -263 -187 70 404 133 -233 -268 -104 154 375 272 -132 -332 -165
5256 -165 182 363 156 -110 -225 -306 69 389 239 -146 -252 -193 82 360 261 -103 -409 -222 33 249 218
5277 218 -13 -308 -313 109 320 178 -78 -288 -287 -31 285 241 -46 -372 -204 59 198 275 24 -330 -324 6 316
5300 316 240 38 -208 -274 -82 284 328 -35 -309 -244 34 195 341 169 -204 -350 -49 240 240 94 -120 -232
5322 -232 -131 196 326 90 -195 -259 -127 86 299 163 -216 -293 -75 155 204 109 -75 -277 -161 94 215
5343 215 99 -203 -242 -101 128 276 162 -208 -284 -85 55 211 170 -12 -226 -114 151 218 144 -66 -228 -169
5365 -169 98 290 177 -134 -137 -60 -33 175 195 -2 -225 -106 169 217 160 -39 -114 -238 -12 243 158 -85 -146
5388 -146 -46 -27 8 202 59 -198 -222 34 131 41 17 -141 -195 -21 194 210 -35 -97 -39 -68 73 160 50 -168
5412 -168 -183 -11 100 140 43 -104 -175 -28 123 77 43 -68 -78 -22 50 87 85 11 -69 25 84 78 5 -44 -70 27 56 78
5440 78 -30 60 43 -67 0 25 6 -70 12 43 -10 -14 46 -57 -105 52 35 -25 -56 57 13 -56 -51 74 -42 -126 3
5467 3 93 6 -87 72 36 -36 36 75 -24 -95 8 82 46 7 48 38 -40 50 70 45 -116 -110 27 14 7 17 -27 -86 5 108
5497 108 84 6 -74 -93 20 19 83 39 -79 -117 -90 109 83 -3 -113 -98 -131 63 235 60 -147 -167 -35 84 139
5522 139 82 6 -194 -185 84 251 33 -119 -152 -19 65 186 156 34 -240 -59 119 192 63 37 -127 -145 84
5545 84 214 111 -203 -143 -48 67 140 203 27 -255 -203 108 189 89 -86 -178 -142 -19 218 187 -49 -202 -158 89
5569 89 107 142 -14 -246 -290 -26 325 209 -60 -190 -160 -13 203 218 150 -265 -342 29 344 206 105 -170 -207
5592 -207 -106 237 384 82 -267 -237 21 224 212 121 -144 -355 -112 259 348 72 -208 -199 -173 98 302 219 -263
5615 -263 -364 -103 199 267 70 -94 -258 -218 148 378 140 -243 -237 -132 76 230 195 -125 -443 -203 258 304
5637 304 49 -68 -280 -167 23 429 351 -220 -396 -123 174 180 172 -59 -294 -357 70 398 226 -155 -361 -232
5659 -232 12 322 396 50 -452 -330 169 278 241 -3 -223 -357 -117 343 428 -2 -376 -319 -9 197 331
5680 331 104 -301 -464 -27 335 334 -20 -212 -313 -135 254 370 142 -314 -346 -17 276 237 128 -191 -363
5701 -363 -200 345 452 46 -347 -290 -42 232 371 178 -188 -439 -142 271 347 59 -245 -332 -323 172 469 224
5723 224 -287 -467 -107 180 346 203 -79 -443 -350 147 433 275 -227 -346 -249 -8 337 304 -43 -433 -281
5744 -281 152 360 259 -52 -296 -334 15 386 332 -156 -364 -232 125 247 315 8 -386 -332 26 424 261
5765 261 -51 -175 -227 -80 307 336 3 -423 -398 52 254 231 -8 -295 -406 -111 385 375 -82 -358 -261 -48
5787 -48 178 271 41 -312 -397 -91 270 290 -63 -237 -235 -189 200 336 80 -302 -280 -40 123 331 216 -178 -253
5810 -253 -126 198 377 102 -188 -273 -132 142 284 134 -117 -245 -134 170 275 145 -103 -222 -156 52 305
5831 305 172 -213 -234 -97 104 175 139 -66 -285 -236 110 249 77 -106 -261 -120 43 183 157 -86 -311 -180
5853 -180 120 135 54 -18 -162 -227 -36 185 171 -113 -188 -97 52 78 161 22 -175 -92 45 269 130 -5 -97 -96
5877 -96 -31 162 172 -13 -158 -68 24 97 146 73 -132 -125 -37 125 80 -34 -6 -108 -97 107 23 5 -68 -126 -57 45
5903 45 43 17 -40 -73 -49 73 58 11 -91 -110 10 21 30 -2 27 -81 -56 22 154 77 -65 -70 39 20 3 105 98 2
5931 2 -57 40 23 50 9 45 -28 -15 59 16 -9 18 -19 -65 -30 75 25 36 -39 -12 58 -90 25 -19 -13 -102 -20 -29 47 44 -56
5962 -56 -51 -67 -36 -1 -28 -32 -34 -110 74 33 20 -6 -77 -24 -30 67 111 54 -98 -30 -42 -11 110 84 -15 -107 -6 72 95 41
5992 41 32 -31 -83 49 106 84 43 -55 -51 37 86 95 -41 -155 -80 10 36 -14 55 -113 -167 -19 128 77 -40 -100 -121 -106
6020 -106 132 143 5 -135 -74 -53 79 117 -22 -77 -174 -8 148 136 -125 -93 -100 -11 122 175 44 -70 -104 -38 100
6045 100 119 139 -20 -193 1 144 176 25 -18 -110 -94 90 145 25 -91 -168 -105 1 175 114 -148 -158 -59 38
6069 38 136 80 -75 -223 -211 73 164 -9 -52 -97 -106 1 139 96 -8 -235 -89 -7 117 157 17 -198 -235 88
6093 88 187 103 -6 -90 -197 42 121 196 -65 -151 -118 37 130 170 98 -164 -194 -11 205 103 -4 -106 -246 -90
6117 -90 153 246 110 -173 -169 -40 133 202 60 -59 -216 -82 143 178 58 -101 -244 -103 90 249 97 -96
6139 -96 -230 -189 97 216 127 -69 -245 -78 90 184 185 -30 -236 -116 143 181 113 -3 -205 -244 29 253 248 -95
6163 -95 -236 -212 37 182 200 46 -275 -190 138 240 132 17 -129 -274 -64 255 170 -4 -184 -149 54 126
6185 126 152 32 -217 -242 -16 289 299 47 -201 -313 -130 192 290 77 -170 -240 -25 163 303 101 -164 -255
6207 -255 -101 98 255 105 -147 -256 -56 200 235 148 -78 -300 -159 144 298 162 -163 -221 -146 76 272
6228 272 234 -118 -302 -147 167 283 131 -113 -295 -277 95 327 214 -149 -242 -159 -61 221 277 -59 -304 -212
6250 -212 132 246 116 41 -160 -291 -10 297 218 -103 -232 -145 32 210 266 -13 -308 -159 54 312 192
6271 192 -8 -206 -233 12 223 251 23 -281 -173 74 242 278 22 -233 -220 0 183 252 22 -243 -279 36
6293 36 200 207 89 -254 -280 -111 224 218 23 -113 -205 -111 58 283 61 -192 -256 -28 108 193 132 -96 -279 -136
6317 -136 122 281 48 -122 -162 -101 51 232 220 -107 -188 -86 129 176 80 -32 -126 -139 109 325 18 -169 -119
6340 -119 -51 66 128 112 -88 -231 -63 100 170 101 -23 -173 -64 53 202 140 -38 -177 -63 77 102 72 -70
6363 -70 -150 -134 40 184 138 -94 -142 -74 -1 123 127 45 -109 -136 53 133 45 -8 -16 -46 -47 75 132 -38 -100 -51 40 34
6391 34 63 80 77 -135 0 123 69 -19 -23 28 -48 -49 98 42 -36 -72 8 20 1 8 -35 -43 -32 3 10 12 -22 -26 -15 -79 -53 45
6423 45 65 -61 -88 74 -7 -61 61 56 -19 -61 19 8 10 -16 -19 -15 -60 -18 91 46 17 -23 24 6 39 136 -21 -127 -118 38
6453 38 127 25 7 -12 -191 -47 85 148 10 -125 -112 -28 115 110 61 -78 -153 -72 204 90 43 -67 -148 -94 99
6478 99 194 45 -94 -143 45 43 115 19 -53 -200 -113 110 228 99 -158 -121 -63 78 164 134 -94 -228 -94 103
6502 103 175 51 -87 -180 -107 25 206 113 -123 -243 -94 103 195 106 -41 -131 -169 75 177 112 -114 -191 -153 65
6526 65 167 199 -37 -251 -105 91 285 104 21 -136 -211 15 206 266 -20 -194 -129 64 168 170 100 -214 -187
6549 -187 -15 247 209 0 -140 -177 -10 246 292 55 -251 -206 5 207 171 117 -181 -182 15 198 212 -50 -229
6572 -229 -192 -23 95 197 -2 -203 -259 -20 201 246 57 -122 -274 -36 186 251 148 -185 -170 -60 87 208
6594 208 128 -138 -221 -128 96 298 96 -77 -165 -120 102 229 153 -82 -189 -114 155 213 85 -91 -178 -151 35
6617 35 231 158 -67 -174 -133 33 210 131 -43 -239 -149 10 238 187 -42 -163 -136 8 165 191 52 -210 -226
6640 -226 31 175 84 -15 -114 -165 -57 138 217 -30 -126 -146 51 129 177 17 -196 -161 -36 135 177 35 -75 -113
6664 -113 -71 74 219 93 -157 -152 -31 94 215 159 -33 -146 -92 75 161 169 -95 -191 -127 62 222 141 -83 -199
6688 -199 -149 31 143 124 -48 -165 -167 -25 199 167 -4 -139 -102 66 132 137 -12 -181 -137 -7 221 155 48 -118
6712 -118 -159 -58 156 257 94 -120 -162 -27 143 193 142 -105 -125 -75 104 233 157 -144 -171 -33 119 152 74
6735 74 -110 -142 -51 78 255 28 -47 -145 -154 19 192 134 -77 -226 -145 47 213 105 -21 -165 -113 -15 146 163
6759 163 -24 -220 -83 26 183 127 -33 -158 -179 19 142 175 38 -56 -186 1 218 235 60 -169 -139 -31
6781 -31 173 235 73 -166 -116 46 174 119 48 -123 -148 -51 158 196 75 -167 -166 -59 58 132 16 -201 -223 -23
6805 -23 90 160 -2 -85 -125 -110 114 176 30 -75 -218 -111 2 168 118 -98 -209 -94 92 100 70 -42 -82 -73
6829 -73 68 231 107 -14 -125 -74 120 166 119 -7 -164 -96 74 112 60 -24 -76 -91 -3 121 -4 58 -150 -193
6853 -193 3 64 91 -38 -138 -100 16 -19 77 -39 -110 -130 -33 49 50 -30 -97 -98 -61 35 125 -23 -38 15 -29 57 19 54
6881 54 -23 -61 15 71 -37 29 79 4 -12 22 55 55 48 -46 74 -61 -24 58 44 -31 -61 3 -10 58 41 47 -32 -70 -54 58
6911 58 77 6 -13 -58 -118 -36 44 61 -57 -140 -74 1 81 37 -14 -73 -72 -20 127 82 13 -42 -68 -42 84 119 -29 -170
6939 -170 -117 -36 130 101 27 -26 -100 -33 166 160 -21 -129 -94 -6 87 218 86 -102 -161 28 191 120 42 -95 -161
6964 -161 -113 129 224 68 -249 -172 -13 45 143 113 -128 -283 -86 118 228 35 -209 -177 -129 77 262 143 -127
6987 -127 -263 -134 126 186 163 -77 -238 -151 58 296 154 -104 -267 -113 80 244 145 -23 -331 -162 80
7008 80 298 206 -109 -271 -223 72 296 243 -45 -316 -204 79 247 228 -15 -308 -302 27 361 254 -149 -349
7030 -349 -258 -27 237 286 -50 -383 -269 76 318 258 -31 -276 -305 -63 330 293 -30 -297 -270 -28 287 282 51
7053 51 -296 -324 -33 314 273 -13 -276 -261 -66 228 438 99 -233 -336 -61 298 252 144 -192 -304 -102 277
7075 277 358 118 -305 -259 -69 201 289 183 -161 -337 -102 239 339 91 -215 -313 -134 173 309 198 -215
7096 -215 -364 -145 156 334 207 -162 -370 -195 121 334 162 -141 -354 -185 190 370 199 -139 -315 -206
7116 -206 202 377 174 -63 -304 -207 73 333 217 -95 -221 -186 111 279 165 -37 -271 -225 142 310 116
7137 116 -88 -348 -236 49 253 202 51 -292 -203 53 267 152 -88 -236 -251 -13 225 276 7 -283 -179
7158 -179 45 187 182 41 -153 -288 29 272 243 56 -175 -227 -17 225 175 80 -168 -248 -4 130 148 137 -88
7181 -88 -221 -115 150 222 95 -145 -246 -65 45 173 143 -88 -180 -138 126 201 95 -92 -189 -136 88 192 81
7204 81 -73 -160 -166 64 143 88 -9 -238 -96 94 181 71 -29 -97 -51 -43 199 90 -2 -152 -91 63 187 166 9
7229 9 -170 -149 -28 127 125 -27 -64 -136 -5 105 134 60 -120 -178 -84 62 76 18 -93 -121 -85 59 103 32 -121 -187
7255 -187 -9 67 93 62 -46 -84 -102 -14 101 38 -17 -70 -137 31 111 122 -20 -134 -27 -16 32 81 79 -91 -130 44
7281 44 97 118 -8 -37 -87 13 43 152 -30 -189 -73 33 54 89 18 -30 -131 -70 59 74 4 -114 -43 -50 28 68
7307 68 47 -41 -106 -41 35 121 -16 -31 -60 -8 50 84 11 22 -61 -97 -15 65 84 -39 -89 -43 76 120 85 -59 -61 -8 11
7336 11 18 158 102 -91 -51 29 22 80 23 -67 4 0 58 18 12 10 -32 -24 -16 86 105 -41 -88 -30 11 23 39 -32 -42 -19 13 43
7368 43 -1 -32 -88 -8 53 -18 0 43 -8 33 -47 -5 -16 -43 -20 -78 -72 12 22 24 -31 -22 -58 12 62 65 65 9 -39 -54 24 67 5
7401 5 -31 -41 -51 48 98 91 -36 -65 -71 -33 97 49 59 -40 -48 -52 23 44 -51 -57 -100 -57 13 159 31 -147 -70 -30 68 144 23
7432 23 -91 -177 -70 136 116 76 -27 -166 -28 89 175 49 -73 -116 -43 109 205 61 -86 -231 -130 45 207
7455 207 114 -107 -184 -124 89 174 189 -78 -139 -143 148 231 180 -103 -225 -145 75 261 155 -47 -249 -212 118 229
7479 229 93 -55 -258 -176 -1 231 169 -83 -269 -168 27 175 213 6 -261 -167 60 249 203 31 -245 -242
7501 -242 18 243 192 -19 -208 -238 -6 240 218 19 -221 -177 -31 273 279 -19 -265 -291 7 261 280 59 -240
7524 -240 -259 -46 209 241 60 -232 -286 -115 211 254 36 -223 -298 -106 241 353 84 -210 -323 -109 231 322
7546 322 111 -194 -314 -132 176 330 84 -199 -357 -199 212 375 168 -166 -323 -226 218 422 194 -112
7566 -112 -333 -174 163 362 244 -144 -363 -242 155 296 169 -111 -304 -209 126 338 196 -115 -327 -247 117
7587 117 372 259 -154 -332 -243 75 324 218 -78 -360 -282 108 321 259 -117 -285 -264 1 358 216 -31
7608 -31 -320 -251 37 281 310 -75 -316 -260 68 333 313 4 -368 -260 10 285 254 -2 -297 -297 5 302 318
7631 318 6 -245 -281 -66 259 316 0 -323 -332 -57 206 322 47 -255 -283 -29 206 277 34 -274 -298 -19
7653 -19 191 322 51 -185 -320 -125 161 252 100 -186 -304 -135 178 282 137 -205 -284 -96 227 279 65
7674 65 -128 -256 -124 125 260 126 -104 -280 -186 119 288 166 -113 -225 -146 125 241 147 -108 -192 -69 87
7696 87 199 202 -58 -259 -120 83 154 157 -66 -196 -148 -34 250 171 -77 -161 -152 -10 117 186 9 -195 -179 22
7720 22 236 182 -10 -105 -39 -37 158 197 27 -156 -181 48 110 134 35 -91 -132 -11 103 146 -34 -122 -161 -64 106
7745 106 155 64 -131 -154 -12 84 105 33 -65 -180 -120 81 149 23 -164 -82 -26 50 14 90 -37 -126 -39 36 125 -11
7771 -11 -78 -47 -87 -52 65 122 -12 -53 -30 14 56 20 69 -66 -93 -35 125 65 -5 -39 -43 38 45 67 79 -36 -59 -10 111
7800 111 68 89 31 -56 -54 40 60 65 -44 -4 -12 -26 69 86 -28 -39 -11 53 86 48 -31 -3 -35 -28 17 -2 -16 -24 21 -39 73
7831 73 52 13 -31 -80 -48 25 44 7 -27 -21 -25 29 79 -22 8 -27 -25 19 -15 71 41 -21 -47 -31 71 -29 -26 6 -9 -85 4
7862 4 73 -18 -61 -34 -33 1 23 96 20 -70 -94 13 30 17 -13 -117 -35 -110 68 18 -37 -40 -33 -14 3 53 29 -71 -54 -29
7892 -29 -2 85 55 30 -30 -62 -24 46 108 -19 -29 -58 27 71 62 5 -23 -71 6 119 72 -10 -42 -93 28 44 113 6 -75
7921 -75 -75 -10 70 54 63 -21 -99 -85 133 142 5 -69 -148 4 75 130 108 -17 -167 0 44 100 21 -64 -73 -46 -16 143 75
7950 75 -22 -121 -135 0 130 56 -52 -120 -141 99 85 127 17 -136 -144 -7 130 162 33 -171 -135 12 120 87 -47
7975 -47 -215 -152 -3 179 151 -57 -173 -165 24 162 216 59 -166 -251 -31 73 167 10 -137 -157 -91 150 186 35
7999 35 -174 -153 -53 136 219 80 -157 -224 -122 144 217 76 -177 -215 -5 95 207 112 -92 -196 -138 97 229
8022 229 125 -70 -289 -216 58 280 125 -119 -239 -154 104 227 90 -72 -246 -221 109 211 150 -96 -281
8043 -281 -130 22 233 156 -65 -239 -231 74 232 155 -73 -241 -226 59 242 201 -55 -270 -164 -4 216 254
8065 254 1 -300 -211 46 130 193 -63 -231 -231 32 230 252 -25 -228 -216 29 195 208 16 -190 -206 -36 213
8088 213 288 -14 -255 -259 -38 162 259 37 -204 -226 -34 242 257 52 -194 -332 -88 208 281 128 -170 -233 -118
8111 -118 141 259 75 -219 -259 -73 148 275 127 -131 -176 -134 146 213 183 -188 -244 -106 160 236 131 -133
8133 -133 -293 -142 90 225 167 -134 -228 -208 101 275 138 -119 -233 -192 73 225 160 -116 -245 -183 37 174
8155 174 134 -120 -204 -215 75 239 163 -87 -270 -148 60 251 180 -42 -158 -150 28 171 144 3 -186 -195 30
8178 30 202 128 14 -145 -125 -6 90 146 37 -148 -135 53 120
8191A20
$$ Imaginary data points
##PAGE= N=2
##DATA TABLE= (X++(I..I)), XYDATA
0 0 0 0 0 0 0 0 0 -8 8 -8 5 -8 16 -12 13 -16 21 -24 28 -29 37 -45 48 -53 63 -72 81 -91 100 -114 129 -142
32 -142 158 -174 194 -217 239 -263 291 -323 356 -393 437 -484 538 -600 668 -753 851 -966 1111
51 1111 -1295 1532 -1847 2296 -2962 4050 -6039 10402 -23807 142848 716095 160571 -357220
64 -357220 12868 98922 -319328 -71307 499819 152915 -482250 -237013 215264 78805
74 78805 15959 267272 61751 -378155 -173214 253996 115304 -114527 21155 693 -210371
85 -210371 2358 329514 93796 -235306 -64982 103051 -61425 -47291 145303 -12295
95 -12295 -234909 4849 259070 63647 -121997 -20498 -21080 -108907 57944 193270 -32628
106 -32628 -208643 -53173 76072 68498 137831 95873 -185557 -246288 49466 183354 62105
117 62105 42870 -8996 -248477 -183054 261114 321354 -90143 -201483 -1759 -66159 -125792
128 -125792 210147 313587 -150973 -350099 27036 193125 -617 49366 154260 -153060
138 -153060 -327569 67086 310848 17402 -136714 32982 -24757 -165808 84222 278186
148 278186 -38640 -271522 -22919 133411 -22892 -6455 136526 -21195 -197793 3049
158 3049 184064 14836 -112809 -9857 1369 -65492 49380 143458 -14293 -131982 -19116
169 -19116 60963 20210 30972 20445 -104012 -109385 71739 137159 22722 -36206 -36638 -77311
181 -77311 -25477 116429 88419 -76606 -95685 -12474 -3131 43542 140772 42940 -157178 -108119
193 -108119 71533 56557 -7294 56648 7118 -161681 -70808 178741 126133 -88845 -59542
204 -59542 23841 -79338 -60635 152170 113662 -143322 -116253 94855 50747 -60523 57082
215 57082 86940 -123571 -135094 105503 117176 -72418 -44867 67514 -34032 -88878 84142
226 84142 117048 -80995 -106847 53268 45414 -51533 17259 67190 -54469 -78116 64843
237 64843 74850 -47256 -37318 33335 -17422 -42665 50894 55319 -52592 -49126 36012 20056
249 20056 -17423 27403 21329 -58998 -38904 50147 34997 -20797 -810 754 -43940 -3475
261 -3475 69319 18428 -54369 -11093 20966 -28659 -9214 61659 11363 -69232 -8585 53883
273 53883 -11006 -31690 43318 17761 -72867 -18018 73420 7300 -55979 22343 42684 -52560
285 -52560 -35226 68372 23303 -71247 -4757 64371 -20051 -55052 43074 46474 -51904 -26672
297 -26672 55645 127 -59840 21768 60668 -31571 -47681 37720 25308 -43253 460 51022
309 51022 -17109 -52436 22582 38840 -25711 -12614 37471 -8233 -50366 14253 49457 -13393
321 -13393 -32452 14651 4724 -27364 15495 43509 -17662 -46696 7423 25136 -8271 2699
333 2699 22056 -19503 -37468 18630 39713 -7322 -20739 2457 -11000 -18654 26652 38463
345 38463 -17096 -36150 2878 12424 -102 20063 18321 -36353 -44094 21477 46419 5556 -11946
358 -11946 -5086 -23022 -19205 33191 43412 -15909 -42968 -9655 9442 10052 29687 23728 -31339
371 -31339 -49853 2718 39468 19751 -3806 -15810 -32655 -19476 32901 50753 4190 -37051
383 -37051 -31988 -9644 15211 37735 21035 -31246 -47158 -3510 36206 33206 9849 -18189
395 -18189 -41012 -26527 22607 45668 14296 -26864 -35429 -13255 22646 45892 24909 -27948
407 -27948 -53604 -23611 25379 45925 24477 -19846 -46060 -22743 28314 50695 22147 -26356
419 -26356 -51551 -32949 17176 54037 37530 -16423 -50101 -31358 17114 49468 35647 -15787
431 -15787 -57568 -45185 11513 55593 45252 -5921 -48751 -43220 5975 50515 43171 -10828
443 -10828 -56875 -48891 4708 53254 52188 3104 -46695 -47968 -773 44433 41962 -3119 -46949
456 -46949 -49264 -4199 52001 62519 9559 -52684 -56780 -3829 45704 47525 5682 -44805 -57411
469 -57411 -9917 55078 65383 10448 -47992 -55933 -14865 38382 56982 15802 -48140 -62528
481 -62528 -10082 50694 63546 23054 -38542 -70137 -33694 38656 66068 21143 -39672 -57596
493 -57596 -24167 35176 71625 37356 -42973 -78635 -31733 35489 57441 31406 -18487 -58562
505 -58562 -42123 29280 73850 34390 -37961 -63650 -33026 17961 56292 47477 -15425 -68522
517 -68522 -42508 33876 69982 34287 -27164 -62405 -46982 12918 67284 54498 -16822 -66063
529 -66063 -40974 22967 59759 40924 -16213 -64260 -53853 13594 69468 52856 -13847 -59078
541 -59078 -45792 7569 56069 54288 -7410 -70459 -60939 13090 67957 53141 -4509 -53603
553 -53603 -57817 -6100 60100 64345 -5589 -67839 -55965 3048 49761 57683 19500 -45672 -70837
566 -70837 -14721 58455 58856 -1919 -48015 -48094 -14387 38351 68537 27080 -51348 -68900 -8399
579 -8399 47371 46187 11584 -29392 -55869 -28351 44169 72853 15397 -50204 -49292 -8924 23682
592 23682 42401 29830 -27124 -65901 -21678 50496 55960 5497 -32468 -42803 -29166 20818
604 20818 64468 29616 -48269 -61762 -4119 39355 40640 23401 -17765 -63967 -43402 37935
616 37935 70555 16572 -38404 -41567 -21684 10629 53504 49243 -23531 -73317 -33409 32124
628 32124 48074 26723 -4870 -41823 -47167 7365 60722 40590 -21397 -48796 -29485 5965
640 5965 37658 41818 2147 -44129 -40855 6513 40836 30875 -5024 -32292 -30597 -2795 27994
653 27994 34436 6116 -32565 -35953 4516 36959 21585 -11951 -23936 -19888 -6161 24219 38107
666 38107 -691 -42996 -23763 19961 23404 7771 3183 -17403 -39953 -4743 50779 32945
678 32945 -25830 -30463 -3847 -4426 6708 42610 20444 -50735 -48450 23634 41411 4700 1339
691 1339 3374 -35913 -35461 36634 56749 -12437 -43660 -4841 4921 -9936 23583 45533 -14680
704 -14680 -58415 -7260 37425 8505 -8722 12224 -4631 -37799 -3093 46070 16947 -30629
716 -30629 -14277 10718 -6586 -7829 23016 14389 -26756 -19731 20129 16212 -12388 -5564 10714
729 10714 -4345 -14462 7311 15464 -8681 -15836 7967 15663 -3492 -8935 3429 500 -10615
742 -10615 1913 19123 3250 -21197 -9581 15609 10645 -5219 1158 4765 -13834 -14393 15475
755 15475 21718 -7705 -15460 5226 3092 -12288 4867 23473 -2596 -26297 -1741 17900 -2855
768 -2855 -9394 14258 8874 -21304 -11955 18258 8234 -13053 2276 12969 -12441 -18849 12153
781 12153 18484 -7372 -7934 9387 -3979 -20366 3875 26781 5083 -19071 -8753 3281 -1570
794 -1570 3854 16515 5124 -18154 -16512 4357 14296 9819 2469 -6255 -13826 -9594 7570 20604
808 20604 11114 -12724 -20290 -2841 11903 8955 5166 3064 -11754 -19967 3175 24963 8001
821 8001 -14740 -7078 1589 -6363 2355 20926 2756 -26895 -9745 20567 7546 -11273 3963
834 3963 6256 -18806 -8948 27575 13950 -27275 -16134 16240 5160 -7303 15382 10383 -31288
847 -31288 -22012 31039 27955 -17832 -16725 6879 -8524 -13510 27425 33062 -21871 -39701 3490
860 3490 21964 4578 7934 10649 -23411 -34694 12543 41409 10158 -17788 -12760 -11995 -9785
873 -9785 19432 33829 -1562 -33931 -18792 8561 16633 17520 8428 -18637 -29928 -3402 23759
886 23759 19034 421 -12879 -19517 -9392 15769 24471 3860 -17708 -19103 -6135 12525 22464
899 22464 6640 -18910 -19910 221 13170 15241 9629 -11416 -27728 -7545 24132 20269 -4214
912 -4214 -11233 -11017 -12671 7752 33278 12917 -29828 -27106 6673 15410 10313 14991 -1311 -34503
926 -34503 -21832 28029 34213 -3884 -18652 -10766 -14150 -2460 33359 29440 -22102 -38993 -2494
939 -2494 18865 11115 12062 5234 -27562 -32152 13374 38432 10067 -15647 -14379 -14195 -6574 23698
953 23698 30596 -9586 -35619 -12131 13953 15340 14976 7161 -21845 -31530 4189 32712 15225
966 15225 -10582 -15261 -14530 -5966 20952 30764 -1680 -31177 -18620 7152 16566 17501 7910 -18827
980 -18827 -30170 -1761 28830 22834 -2107 -17933 -22057 -9181 19036 29353 3750 -23344
992 -23344 -21121 -2740 13998 23824 12083 -19119 -30656 -5264 20469 19394 5572 -9608 -23532
1005 -23532 -15327 17246 31200 5241 -21529 -19947 -6159 7746 22693 18066 -13954 -31713
1017 -31713 -8368 20298 20795 6485 -7740 -22062 -19018 10838 31366 13089 -16144 -21556 -8905
1030 -8905 7044 21502 18552 -8580 -28943 -15287 12124 23103 14863 -4247 -23631 -20750 7918
1043 7918 27927 15334 -9447 -20586 -16473 240 22057 23745 -3464 -26394 -17658 5771 17905
1056 17905 15861 1397 -19340 -23197 723 23967 18593 -3853 -18127 -16668 -1869 17298 20876
1069 20876 579 -20753 -19276 626 18455 19531 1656 -19075 -19715 402 17556 16829 3112
1082 3112 -14106 -21302 -5816 19322 22787 1026 -17048 -15680 -3900 10748 19827 8913 -15801
1095 -15801 -22783 -2711 17029 16880 4158 -10470 -18942 -9650 12530 21402 5938 -13266 -17297
1108 -17297 -7012 9201 18777 9167 -11573 -19015 -6676 9079 15154 9386 -6805 -19293 -10309
1121 -10309 11134 18009 5508 -8152 -13648 -10402 4008 18612 12093 -9950 -17804 -4949 8215
1134 8215 11577 8500 -2522 -15741 -12654 6947 17751 8269 -5980 -11895 -8908 2005 13937
1147 13937 11607 -4556 -14544 -8238 4158 11384 9510 -1470 -12546 -10194 3175 11738 8074
1160 8074 -1708 -10242 -10518 581 12192 9377 -3150 -9634 -6503 -282 6671 9360 1080 -10546
1174 -10546 -9588 2132 8988 6284 217 -6138 -8956 -2154 8711 8961 -1399 -7764 -5321 82
1188 82 4917 7087 2178 -6208 -7471 -87 5933 5505 1162 -3887 -6154 -1743 5692 6484 50 -4482
1204 -4482 -3662 -991 2104 4911 2871 -3722 -5884 -199 4747 2868 -589 -1426 -2505 -3054 1108 5283
1220 5283 1738 -4472 -3130 1932 1353 -1178 1055 1746 -3130 -3832 2543 4076 -1816 -2844 1873 1019
1236 1019 -2853 -39 3391 -988 -3771 1516 3538 -2032 -2798 2796 2554 -2297 -1205 2040 -752
1251 -752 -2312 2369 3385 -1956 -2975 1025 1379 -95 1988 1704 -3470 -3760 2465 4109 -31 -1449
1267 -1449 -783 -2236 -1140 3916 4165 -1760 -4721 -2280 713 3082 3798 -366 -5532 -3912 1863 4273
1283 4273 3336 363 -5073 -6574 805 7073 3325 -2152 -3059 -4194 -3397 5454 10181 -498 -10293
1298 -10293 -4164 3504 2013 3058 6056 -3195 -12749 -1884 12546 6488 -4879 -3126 -1707 -6191
1312 -6191 1158 13524 5091 -12249 -8683 5124 5013 1333 4926 -1 -12292 -6590 11144 10657
1326 10657 -3578 -6509 -2670 -3867 781 11456 6871 -10228 -12066 1377 7633 4796 2794 -2773
1340 -2773 -11200 -6847 8544 12647 1466 -7830 -8052 -3763 3776 10390 6328 -6308 -12569 -5213
1354 -5213 7098 12162 5017 -6432 -10203 -4665 3194 9369 9324 -2516 -15043 -8716 9304 12955
1368 12955 2476 -3332 -5625 -9859 -2280 15161 13007 -8791 -14715 -717 4873 2787 8900 6232
1382 6232 -13944 -17151 7248 17956 1621 -7275 -2247 -6214 -7500 10787 17860 -5000 -19109
1395 -19109 -3957 7692 3531 5757 7011 -10313 -18590 3016 18819 4903 -7590 -3945 -5329
1408 -5329 -7225 8816 18884 -757 -18886 -8138 6617 6216 6044 6201 -7286 -16614 -1346 15960
1422 15960 10529 -3059 -7976 -8913 -4561 8946 14862 1908 -11483 -9935 -1259 6924 12197 5227
1436 5227 -10563 -13825 -939 8673 8923 5600 -4660 -15652 -7319 12558 13677 -1596 -7165 -5518
1450 -5518 -7812 -25 16528 11043 -13068 -16189 2096 7816 3361 6568 2133 -15232 -12835 11280
1464 11280 16016 -1858 -7357 -2403 -6832 -3757 15288 14720 -11183 -17711 1863 8641 1495 5448
1478 5448 5669 -12447 -15708 8879 19056 667 -9422 -3187 -4412 -5087 10326 15713 -4974 -17390
1492 -17390 -3536 8242 5397 4623 3001 -9661 -14080 2632 15029 6461 -4883 -7250 -7069 -2142
1506 -2142 9355 11514 -1695 -11640 -7842 635 7415 9767 1642 -10466 -9596 1661 7533 6205
1520 6205 2688 -5642 -11877 -2568 11441 9158 -2495 -5974 -5219 -4573 4669 13248 2875 -12234
1534 -12234 -7731 4170 4228 3403 6570 -2366 -14930 -4815 13807 9303 -5120 -3964 -1027 -6714
1548 -6714 -543 14295 7316 -12959 -10768 5038 5189 327 5561 2015 -12804 -9151 10572 11719
1562 11719 -3393 -6018 -1403 -4644 -2237 10650 9081 -8040 -11333 931 5117 2012 4000 1938
1576 1938 -8712 -8719 5051 10207 1678 -4045 -3863 -4139 -233 7555 6484 -3440 -7543 -2815 2123 5017
1592 5017 5388 -610 -7248 -4642 2975 5759 3753 -84 -5590 -6492 1437 7618 3505 -2163 -3064 -3749
1608 -3749 -2375 5045 7741 -1699 -8261 -2549 2724 1503 2904 3948 -4141 -8890 812 8340 1711
1623 1711 -3727 -591 -1774 -4834 2520 8974 178 -8344 -2238 3673 138 592 4627 -1299 -8534
1638 -8534 -1182 7928 2952 -3383 -643 -78 -3896 517 7160 1860 -6171 -2936 2526 1119 1044 3471
1654 3471 -834 -6028 -1313 4879 2291 -1347 -156 -1183 -3400 850 5303 1119 -3830 -1845 318
1669 318 -503 1534 3196 -1363 -4609 -331 2804 366 -259 1279 -1643 -3718 1199 4006 -531 -2515
1685 -2515 606 62 -2157 1334 3666 -1478 -3836 1278 2497 -1721 -573 3017 -521 -3834 1229
1700 1229 4088 -1363 -2903 2037 1457 -2805 122 3789 -622 -3640 1412 3056 -2098 -2084 2842 968
1716 968 -3142 105 3210 -1034 -2902 1701 2276 -2325 -1544 2177 149 -2381 890 2403 -1786 -2582
1732 -2582 1507 1575 -1372 -307 1256 -1328 -2096 1640 2317 -1218 -1791 485 -98 -754 1679 1909 -1764
1749 -1764 -2639 692 1970 552 315 -1 -1828 -1437 1834 2617 132 -1285 -990 -904 453 2759 1664
1766 1664 -1952 -2652 -55 1523 1688 1407 -648 -3079 -1787 2007 2744 512 -1096 -1923 -1882 454 3458
1783 3458 2043 -2278 -3399 -904 1226 2119 2083 -613 -3677 -2495 1705 3317 1370 -1136 -2685 -2649
1799 -2649 523 4060 2683 -1749 -3707 -1704 1020 2859 2956 -247 -3959 -3173 1576 4023 2246 -786
1815 -786 -2961 -3090 154 4093 3774 -769 -4058 -2777 758 3450 3327 6 -3854 -3757 422 4009
1831 4009 3436 -218 -3566 -3921 -315 3767 3911 -63 -3923 -3861 -377 3557 4165 501 -4030 -4382 -469
1848 -469 3576 3957 655 -3374 -4438 -1073 3698 4668 814 -3797 -4645 -1001 3578 4667 1086 -3340
1864 -3340 -4414 -1258 3208 4827 1885 -3327 -5238 -1484 3774 4972 1487 -2941 -4594 -2066 3013
1879 3013 5442 2170 -3407 -5015 -1730 2910 4785 2547 -2509 -5511 -2744 3046 5352 2071 -2775
1894 -2775 -4794 -2746 1928 5178 3153 -2579 -5626 -2877 2261 4754 2934 -1704 -5261 -3683 1874
1909 1874 5575 3107 -2090 -4869 -3308 1213 4857 3970 -1385 -5425 -3606 1834 4933 3404 -807
1924 -807 -4463 -4197 615 5433 4342 -1270 -5136 -3508 1176 4459 4052 -220 -4677 -4542 569 5200
1940 5200 4203 -717 -4647 -4107 176 4450 4580 25 -4836 -4762 125 4435 4144 33 -4069 -4601 -747
1957 -747 4123 4918 385 -4679 -4774 -524 3867 4409 1129 -3549 -5205 -1278 4164 4994 644 -3628
1973 -3628 -4183 -1468 2651 5047 2385 -3506 -5456 -989 3797 4093 1253 -1893 -4276 -2811 2781
1988 2781 5788 1736 -3716 -3861 -864 1709 3569 3155 -1896 -5924 -2461 3886 4491 550 -2018 -2966
2004 -2966 -3013 734 5367 3301 -3527 -5222 -933 2274 2618 2438 -301 -4929 -4081 2525 5440 1298
2020 1298 -2731 -2950 -2255 -23 4176 4295 -1637 -5570 -2240 2379 3124 2103 295 -3336 -4380 586
2036 586 5356 3249 -1803 -3386 -1998 -19 2679 3853 510 -3978 -3522 901 3538 2496 -45
2051 -45 -2469 -3119 -566 3162 3377 -133 -3240 -2657 173 2383 2410 426 -2259 -3245 -892 2825 3177
2068 3177 -315 -3071 -2111 199 1450 2063 1186 -2117 -3776 -435 3374 2310 -1007 -1642 -1376 -1166
2084 -1166 1230 3714 1181 -3532 -3012 1082 2244 1170 1042 -416 -3388 -2117 3099 3783 -476 -2351
2100 -2351 -910 -719 -104 2795 2867 -1888 -4000 -236 2462 1163 267 396 -1711 -2814 611 3437
2116 3437 1059 -1938 -1455 -307 -318 785 2056 -42 -2745 -1522 1413 1406 -63 -279 -349 -1283 -596 1431
2134 1431 1415 -937 -1745 -197 931 486 191 222 -530 -1067 172 1652 882 -1159 -1098 336 686 223
2152 223 629 497 -1065 -1334 953 1977 42 -1045 -48 77 -719 591 1897 -132 -2100 -387 1406
2169 1406 36 -580 1006 415 -1887 -936 1825 1004 -1423 -616 905 -571 -1371 875 1513 -1022 -1225
2186 -1225 829 442 -1300 -48 1564 -52 -1571 109 937 -665 -593 1352 812 -1477 -971 1130
2202 1130 757 -561 215 619 -732 -1022 845 1590 -3 -939 -187 19 -181 616 1199 -75 -1412 -642
2220 -642 915 826 -28 -140 -291 -785 -344 1066 1120 -727 -1370 -86 586 51 53 512 -682 -1632 40
2239 40 1813 395 -1489 -770 429 -169 160 1241 156 -2102 -1224 1597 1492 -354 -488 -257 -1186
2256 -1186 -437 2207 1807 -1538 -2049 148 1026 498 1141 756 -1855 -2234 1025 2651 708 -899 -759
2273 -759 -1154 -699 1830 2634 -474 -2675 -1086 834 964 1132 824 -1422 -2658 -224 2407 1529 -673
2290 -673 -1376 -1247 -713 1046 2199 439 -2059 -1903 49 1337 1396 430 -1346 -2047 -517 1541 1798
2307 1798 244 -1376 -1841 -510 1557 2022 251 -1535 -1577 -468 1209 2111 848 -1754 -2159 24
2323 24 1660 1676 662 -937 -2312 -1162 1934 2685 295 -1749 -1655 -713 703 2405 1597 -1715 -2917
2340 -2917 -534 1618 1630 812 -377 -2446 -2135 1373 3057 654 -1809 -1767 -957 30 1924 2278 -900
2357 -900 -3278 -1278 1534 1788 876 -63 -1864 -2353 474 2967 1471 -1392 -1775 -828 97 1596 2335
2374 2335 -48 -2708 -1724 1055 2117 1185 -19 -1581 -1987 65 2436 1883 -645 -1936 -1492 -18
2390 -18 1732 2076 36 -2269 -1902 312 1696 1641 259 -1772 -2218 -110 1986 1775 -147 -1599 -1962
2407 -1962 -640 1736 2202 125 -2058 -1827 -289 1260 2022 775 -1808 -2453 -263 1804 1783 487
2423 487 -1014 -2085 -1133 1586 2617 519 -1587 -1569 -576 794 2179 1499 -1283 -2550 -514 1654
2439 1654 1558 798 -457 -1838 -1526 1026 2601 973 -1305 -1599 -884 364 1823 1663 -937 -2422 -1005
2456 -1005 989 1461 950 -285 -1872 -1837 641 2246 1027 -833 -1548 -1257 29 1715 1779 -606 -2146
2473 -2146 -1050 670 1324 1327 154 -1670 -1806 435 2044 1223 -330 -1240 -1347 -172 1766 1935 -257
2490 -257 -1814 -1052 222 1112 1558 620 -1587 -1858 149 1653 1146 43 -868 -1619 -740 1413 1948 -21
2508 -21 -1553 -1098 -234 682 1425 762 -1309 -1924 -261 1151 1102 311 -730 -1686 -867 1246 1694 142
2526 142 -1021 -1061 -641 415 1639 925 -1095 -1678 -336 848 1036 833 -147 -1491 -1004 885 1552 301
2544 301 -637 -810 -736 279 1474 1068 -762 -1361 -369 578 888 856 -131 -1428 -1027 713 1242 386 -400
2563 -400 -740 -910 -25 1295 858 -649 -1121 -435 79 597 922 53 -1409 -1059 529 968 328 -98 -542
2582 -542 -1039 -176 1149 926 -432 -814 -353 -140 399 1066 358 -1091 -864 473 760 231 152 -159 -754
2601 -754 -385 917 881 -247 -611 -201 -91 160 782 384 -644 -630 224 372 135 158 -105 -687 -283 563
2621 563 474 -229 -389 -248 -251 54 505 234 -487 -435 72 245 65 101 -81 -395 -232 281 257 -12 -221 -170
2643 -170 -70 91 268 57 -106 -90 -17 35 237 195 -215 -180 258 237 -192 -9 255 -78 -178 194 348 -182
2665 -182 -290 321 214 -282 -207 272 26 -209 156 256 -405 -423 281 260 -233 -107 122 -318 -305 351 438 -349
2687 -349 -576 -64 152 59 237 74 -497 -572 135 603 208 -150 -241 -330 -214 461 745 59 -656 -440 162
2708 162 459 492 344 -297 -756 -190 647 725 78 -470 -500 -196 314 655 401 -389 -783 -318 584 666 77
2729 77 -471 -503 -264 222 671 375 -556 -822 -69 508 394 94 -414 -753 -437 483 868 180 -873 -706
2749 -706 -63 510 617 345 -524 -1098 -388 885 1061 126 -669 -858 -366 579 1273 662 -756 -1167 -217
2768 -217 704 993 491 -205 -1115 -964 601 1500 666 -723 -983 -508 125 974 1130 -207 -1370 -923 598
2787 598 1069 396 -201 -749 -1047 -176 1214 1016 -542 -1196 -503 176 496 688 112 -1117 -1080 334 1153
2806 1153 457 -501 -646 -681 -120 924 1025 -282 -1286 -646 551 994 638 -153 -927 -967 261 1383
2824 1383 987 -371 -1080 -694 162 1075 1064 12 -1136 -1129 155 1280 1093 -162 -1093 -1009 -164 868 1157
2843 1157 232 -1088 -1361 -112 1070 952 125 -675 -1169 -694 799 1416 157 -1087 -997 -176 334 754
2861 754 713 -535 -1405 -477 1019 922 -28 -375 -605 -679 319 1200 520 -959 -951 241 599 448 515 -179 -1080
2882 -1080 -571 1022 1158 -175 -739 -422 -196 217 1045 684 -806 -1159 -123 867 651 254 -266 -961
2900 -961 -806 548 1330 338 -841 -932 -432 245 765 735 -369 -1223 -749 383 904 492 -258 -870 -806 -51
2920 -51 809 767 -139 -875 -656 147 700 507 32 -560 -643 -77 734 721 6 -597 -383 12 345 548 226
2941 226 -487 -574 71 683 411 -143 -291 -309 -182 372 695 -69 -698 -468 223 369 302 47 -471 -628 -92
2962 -92 637 472 -152 -532 -422 -148 329 637 100 -563 -611 -47 425 439 127 -409 -587 -196 347 650 262
2983 262 -465 -480 -67 316 457 324 -122 -508 -386 307 561 231 -263 -245 -101 -20 380 497 -53 -544 -198
3004 -198 322 313 137 34 -181 -429 -41 433 227 -299 -379 -71 -42 21 267 65 -436 -344 135 258 -54 -94
3026 -94 -85 -314 -141 339 248 -160 -365 -58 47 83 239 108 -337 -325 116 313 221 -16 -165 -175 -111 297 312
3049 312 53 -138 -173 -27 129 270 119 -57 -184 -88 164 203 146 -124 -175 -33 138 140 46 46 -236 -170 69 197
3073 197 21 -123 -91 -91 -73 168 87 -181 -260 30 69 1 27 35 -143 -265 17 204 24 -101 27 -4 -58 109
3097 109 146 -94 -110 103 236 9 19 72 -5 -63 112 168 33 -138 -51 -8 20 153 125 -37 -100 -38 70 -10 29
3122 29 40 -93 -41 20 -4 -68 -84 -52 -80 -94 39 15 -108 -96 37 -13 -113 -45 -50 -53 -39 73 -28 -138 -15 -55 -31
3149 -31 4 2 3 -140 3 156 6 19 91 4 -71 76 224 16 -109 -25 99 127 78 93 -32 -120 -22 157 49
3174 49 -15 -18 -64 -116 99 123 -19 -177 -96 -16 -50 101 54 -94 -270 -61 168 24 -67 -58 -107 -157 109 217 -54
3199 -54 -146 -50 3 55 146 143 -136 -245 71 224 106 10 -10 -171 -126 190 254 -8 -127 -27 -100 22 282 170
3223 170 -157 -227 25 181 119 125 -67 -226 -114 185 282 -12 -181 -114 -184 -8 216 156 -236 -286 23 104 67 83
3247 83 -73 -261 -91 159 203 -27 -178 -153 -123 15 235 252 -243 -275 -32 153 145 122 -46 -283 -97 175 226
3270 226 49 -119 -93 -129 14 306 189 -184 -211 -14 83 239 118 -26 -257 -90 76 156 59 -144 -256 -183
3292 -183 109 243 88 -161 -256 -83 61 192 156 -99 -245 -137 96 133 18 -32 -205 -239 74 267 180 -125
3314 -125 -226 -100 36 183 125 -146 -232 -39 183 162 53 -50 -155 -164 43 311 98 -67 -124 -89 88 176 97
3337 97 -70 -194 -86 176 167 35 -30 -88 -188 38 241 128 -125 -193 -102 3 92 91 -157 -189 -35 54 90 26 -16
3362 -16 -157 -147 45 136 61 -85 -189 -89 25 192 107 -41 -144 -65 82 158 64 -11 -63 -57 92 140 85 -43 -116
3387 -116 -96 47 178 117 -96 -95 -6 197 75 30 -92 -90 -44 110 103 5 -97 -98 -2 -32 135 49 -164 -156 -63 49 52
3414 52 5 -92 -148 -112 91 111 -98 -93 -139 -67 4 135 13 -79 -82 -23 151 104 39 -27 -3 -71 58 179 5 -32 -105
3441 -105 29 119 108 58 -53 -154 51 175 170 -27 -85 -68 49 58 93 2 -33 -166 -69 78 63 -34 -127 -95 -65 65
3467 65 127 -83 -132 -174 -20 43 52 -30 -132 -123 -47 112 114 -46 -122 -58 -50 41 129 61 -126 -48 6 135 82 29 -36 -45 -38 114
3497 114 193 102 -59 -39 53 69 66 46 57 -96 -61 42 82 5 -101 -65 -117 32 52 147 -92 -171 23 76 -57 -41
3523 -41 -25 -97 -66 -11 23 27 -158 -99 -11 14 45 5 -56 -200 -74 70 86 -108 -57 8 6 44 179 102 -70 -107 63
3550 63 105 23 96 5 -124 -78 24 176 64 -73 -2 57 21 20 136 62 -106 -86 98 112 -28 5 18 -41 -99 110
3576 110 27 -123 -95 4 -34 -137 -113 62 7 -147 -104 77 -17 -153 -87 55 -26 -61 26 -1 -95 1 96 46 -27 -52
3602 -52 92 -12 -12 118 132 -30 -107 8 156 56 93 65 13 18 68 86 2 -28 -10 -14 -46 1 38 32 -93 -81 33 4
3630 4 -100 24 3 -32 -78 -6 13 -43 -73 33 -1 -122 -138 34 -28 -106 48 140 -2 -220 -46 194 107 -122 -3
3655 -3 -24 -119 15 224 131 -142 -126 129 96 49 156 150 -112 -150 245 162 -31 -38 59 -88 -133 113 219 -47 -254
3680 -254 -34 94 11 54 69 -109 -212 -10 189 9 -140 -94 -99 -82 24 156 -26 -293 -218 -1 97 95 -71 -150
3704 -150 -144 30 165 135 -44 -189 -122 35 126 136 63 -145 -229 -56 262 309 8 -175 -182 61 174 181 136 -158 -274
3729 -274 22 238 256 19 -86 -189 -166 195 379 55 -303 -217 23 130 175 137 -161 -390 -222 260 316 -39
3751 -39 -227 -251 -193 115 371 123 -348 -425 -72 174 166 101 -138 -355 -302 256 448 82 -282 -306 -76 153 397
3774 397 273 -178 -383 -189 255 389 186 -162 -327 -165 189 435 242 -165 -411 -236 176 432 298 -125
3794 -125 -427 -227 174 426 235 -169 -489 -326 159 445 271 -200 -472 -420 85 488 253 -242 -445 -293
3814 -293 122 331 335 -40 -504 -388 182 399 319 -71 -410 -458 89 620 441 -134 -428 -336 60 360 432 80
3836 80 -384 -488 147 570 299 26 -475 -422 33 409 526 -64 -523 -354 138 428 429 -3 -487 -502 -29 498
3858 498 411 -63 -397 -473 -99 482 511 47 -541 -508 -22 404 429 80 -447 -576 -107 334 439 37 -431 -568
3880 -568 -71 427 523 83 -471 -468 -72 429 568 106 -354 -475 -141 327 499 164 -342 -501 -62 469 536
3901 536 75 -331 -434 -178 390 588 203 -384 -484 -139 273 444 258 -276 -587 -189 345 467 80 -263
3921 -263 -431 -295 176 564 224 -368 -555 -156 175 389 238 -290 -548 -279 368 518 166 -262 -405 -260
3941 -260 142 514 281 -271 -463 -119 242 359 307 -75 -463 -263 278 449 183 -120 -358 -256 195 444
3961 444 288 -166 -335 -227 101 344 263 -117 -460 -272 202 337 134 -139 -348 -239 35 336 157 -182
3981 -182 -313 -226 3 307 278 -120 -392 -208 95 270 102 -89 -204 -250 43 325 139 -149 -242 -86 -41 182
4003 182 272 -38 -326 -159 198 211 164 2 -128 -221 -35 310 215 -158 -172 2 -14 110 190 89 -272 -189 51
4026 51 165 107 -44 -125 -127 -67 187 153 -74 -182 -82 4 79 123 24 -119 -169 -41 138 105 -66 -183 -64 64
4050 64 57 -22 -2 35 -41 -43 97 124 -53 -119 84 42 81 114 39 -110 -102 150 134 -66 -28 124 -21 -144 149 134 -180
4077 -180 -136 102 60 -51 -32 87 -87 -185 157 214 -157 -170 83 -37 -153 -21 149 -73 -183 5 200 -45
4099 -45 -105 36 31 -196 4 201 32 -200 -41 71 -16 -87 107 66 -176 -23 111 112 -38 -96 73 42 -35 71
4123 71 52 -23 -94 1 13 18 -137 20 -3 -53 -79 161 -27 -103 -173 152 78 -74 -40 -25 -56 -162 86 218 -63 -221
4149 -221 -19 94 -85 -3 116 -58 -309 -114 197 153 -67 16 8 -192 -88 272 212 -103 -182 25 75 5 149
4172 149 133 -84 -228 72 232 43 -51 13 -57 -162 -16 232 87 -232 -167 41 83 -4 88 51 -228 -137 214
4195 214 146 -136 -181 40 -73 -89 126 228 -135 -290 -44 251 50 -140 -57 -157 -180 87 367 34 -310 -244
4217 -244 11 82 86 230 20 -401 -192 255 380 27 -176 -144 -132 43 350 344 -129 -387 -109 182 218 179 20
4240 20 -301 -380 67 482 256 -205 -355 -181 -9 203 314 52 -405 -422 90 360 196 -58 -240 -285 -92
4261 -92 349 350 12 -451 -346 46 248 212 127 -275 -444 -15 442 416 -96 -366 -203 -45 202 452 159 -416
4283 -416 -495 116 458 290 -21 -235 -400 -282 363 657 94 -540 -341 15 297 359 125 -321 -581 -93 550
4304 550 478 -80 -393 -342 -291 231 570 232 -450 -646 -182 392 435 146 -295 -480 -246 311 592 201 -459
4325 -459 -498 -188 238 487 320 -226 -677 -313 434 583 131 -260 -342 -210 201 590 457 -295 -637 -157 374
4346 374 409 241 -85 -498 -456 269 696 294 -395 -477 -154 109 373 428 -214 -742 -340 402 505 185 -211
4367 -211 -387 -417 79 641 369 -449 -634 -164 171 359 320 4 -534 -474 212 647 293 -182 -410 -360 65
4388 65 521 451 -141 -598 -345 232 480 429 -41 -408 -350 36 546 499 -38 -547 -294 160 435 366 2 -402
4410 -402 -388 86 463 366 -192 -422 -277 42 249 412 35 -482 -443 168 407 130 -114 -247 -340 -190 368
4431 368 401 -133 -491 -170 46 141 246 134 -361 -554 64 488 207 -65 -154 -204 -88 333 433 20 -333
4452 -333 -232 90 209 197 223 -193 -357 26 378 262 -25 -181 -166 -25 210 268 52 -208 -259 15 202 269
4474 269 32 -230 -250 17 181 72 19 -105 -281 -43 213 139 -133 -173 -94 -77 93 263 93 -302 -234 222
4496 222 136 13 96 -11 -223 -85 283 188 -132 -164 90 8 -10 184 154 -259 -161 220 232 -55 -54 50 -79 -94
4520 -94 248 150 -100 -136 176 81 -44 74 111 -109 -265 163 166 -133 -143 -36 -37 -65 106 13 -211 -153 32 -10 -52
4545 -52 7 -58 -205 -82 133 108 -96 -109 -51 -11 131 187 -46 -168 -40 52 21 49 62 -99 -187 39 168 157 -35
4570 -35 -51 -44 -78 179 285 -70 -218 -44 45 21 93 78 -122 -247 41 137 18 -46 -23 -125 -137 142 211 -63 -234
4595 -234 -50 42 46 41 30 -112 -263 69 169 76 -23 -126 -116 -93 176 241 -69 -244 -27 111 56 140 143 -180 -215
4620 -215 57 93 64 55 -39 -207 -83 230 265 16 -162 -16 -123 27 243 151 -82 -188 -23 170 123 102 2
4643 2 -217 -172 174 226 49 -94 -18 -182 -66 246 176 -206 -254 -67 58 30 70 64 -244 -228 126 246 -67 -61 4
4668 4 -114 -79 217 185 -91 -232 -21 -26 19 198 166 -204 -241 130 235 108 -30 22 -218 -68 176 214 -27 -99
4692 -99 -32 -50 88 250 131 -145 -182 -27 122 162 76 8 -216 -134 137 187 -3 -72 -200 -218 7 280 122 -152
4716 -152 -255 -102 0 153 263 -40 -279 -184 121 183 137 22 -188 -322 16 354 179 -86 -82 -46 -38 112 366
4739 366 149 -278 -265 177 135 148 179 -87 -366 -104 334 296 -49 -231 -116 -124 111 304 144 -297 -341 -18 186
4762 186 189 172 -105 -407 -233 203 284 14 -234 -204 -146 102 305 197 -229 -401 -114 138 246 192 -92 -339
4784 -339 -258 142 334 228 -121 -299 -226 141 358 229 -70 -273 -280 26 385 347 -67 -378 -176 196 257 247
4806 247 51 -322 -367 47 444 227 -122 -219 -246 -152 304 371 -145 -515 -188 158 211 84 49 -215 -479 -82
4828 -82 450 239 -142 -246 -182 -52 173 397 132 -469 -365 111 336 163 24 -184 -343 -127 261 394 -6
4849 -6 -265 -255 -45 188 391 248 -231 -433 -71 339 287 10 -185 -247 -132 95 326 160 -305 -400 -83 250
4871 250 216 65 -127 -311 -211 207 427 54 -387 -263 -19 73 163 203 -106 -411 -222 377 400 -177 -186 -155 -169
4894 -169 35 341 254 -236 -403 -2 271 79 88 3 -274 -312 197 489 67 -287 -144 -17 32 66 294 -44
4916 -44 -421 -157 256 188 3 -25 -53 -242 -83 262 126 -197 -307 -20 133 8 127 60 -170 -211 115 343
4938 343 -9 -262 -85 -43 -18 42 97 -43 -237 -110 204 187 -84 -55 -55 -146 -170 165 221 -151 -299 42 187 -16
4962 -16 -16 103 -86 -199 -23 290 69 -236 -96 214 -37 -117 142 76 -279 -154 194 45 -207 -82 137 -3
4984 -3 -156 144 80 -189 -215 138 215 -97 -239 83 -23 -163 101 208 -108 -323 -26 284 35 -80 49 -80
5006 -80 -239 24 295 57 -222 -77 163 48 -82 119 31 -197 -110 210 245 -143 -167 -14 45 1 151 124 -195
5029 -195 -227 66 158 60 -64 -67 -135 -175 26 251 19 -300 -155 159 155 95 11 -75 -317 -163 183 261 -104 -230
5053 -230 -204 -29 84 255 164 -235 -339 -83 271 167 -21 -111 -150 -143 123 419 195 -312 -280 53 150 104 190
5076 190 29 -321 -219 252 399 9 -279 -133 -95 85 346 285 -214 -359 -121 217 229 89 -125 -315 -271
5097 -271 192 367 123 -319 -348 -46 123 209 160 -60 -413 -304 189 359 144 -129 -288 -238 83 355 206
5118 206 -104 -330 -178 226 307 235 -63 -326 -233 133 436 305 -194 -318 -97 149 303 243 -29 -339 -289 110
5140 110 398 211 -138 -293 -317 -25 342 307 -45 -499 -258 76 251 169 7 -294 -432 -86 414 314 -101
5161 -101 -299 -192 -55 164 333 118 -379 -440 41 300 203 27 -178 -349 -96 332 388 -19 -310 -250 -27
5182 -27 157 326 197 -249 -422 -35 225 346 68 -190 -302 -104 200 383 152 -210 -358 -173 141 355
5202 355 115 -264 -357 -258 119 376 199 -209 -362 -211 141 337 178 -163 -471 -376 236 328 126 -163 -356
5223 -356 -219 21 284 268 -146 -386 -222 50 273 227 36 -316 -306 88 421 230 -79 -211 -175 5 290
5244 290 436 31 -376 -250 77 289 234 69 -188 -343 -95 355 226 -63 -259 -258 -65 245 373 38 -311
5265 -311 -316 -103 114 320 20 -227 -380 -101 244 313 69 -251 -269 -185 189 315 40 -205 -298 -113 173 313
5287 313 184 -217 -403 -131 273 324 133 -99 -347 -189 210 370 168 -178 -212 -182 56 341 292 -122 -415
5308 -415 -117 142 123 203 5 -277 -215 46 316 188 -77 -178 -200 25 264 301 -135 -362 -267 21 210 172
5330 172 -12 -277 -300 17 228 119 -63 -305 -253 -27 179 246 -5 -262 -193 26 196 234 69 -201 -142 -3
5352 -3 237 228 100 -207 -205 -72 218 205 39 -161 -194 -40 191 230 44 -262 -270 -14 144 263 117 -88 -306 -109
5376 -109 115 235 41 -122 -196 -148 22 281 30 -289 -216 -28 90 95 113 -13 -251 -130 132 184 -23 -66 -92
5399 -92 -70 -39 171 149 -194 -174 -12 48 67 100 -2 -154 -150 104 217 84 -75 -74 -76 36 134 136 -74 -72 -86 61 107
5426 107 92 19 -57 -68 75 117 48 -63 -65 -34 63 81 -64 -9 -38 -7 -29 -2 53 -55 -85 -36 -3 30 -13 -56 -27 -101
5454 -101 31 111 -23 -82 3 40 -37 25 79 -38 -121 92 129 -46 -85 45 14 -35 -36 67 -7 -57 54 100 -8 -8
5480 -8 37 -11 -61 87 114 -3 -98 24 75 -11 -6 2 -37 -80 81 124 83 -129 -126 -81 12 64 62 -40 -61 -168 -53 105
5508 105 62 -77 -146 -111 -53 86 88 52 -137 -139 83 145 101 -25 -75 -120 -76 137 220 50 -228 -146 70 99 115 117 -132
5535 -132 -253 0 183 187 -106 -88 -152 -141 156 180 117 -188 -196 10 101 152 62 -85 -260 -162 206 215 4 -143 -195
5560 -195 -81 122 253 86 -180 -265 -36 219 204 110 -130 -282 -79 57 310 116 -176 -229 -36 152 267
5581 267 183 -46 -319 -180 177 375 121 -139 -215 -172 90 226 213 -89 -332 -164 141 227 136 -3 -226 -279
5603 -279 26 357 224 -137 -347 -135 60 222 244 -8 -335 -397 104 409 165 -56 -197 -186 65 254 400
5624 400 -48 -384 -257 91 234 159 123 -194 -327 -32 377 275 -128 -216 -195 -82 233 352 148 -285 -365 16
5646 16 295 226 127 -210 -254 -170 259 425 107 -296 -294 -17 241 335 142 -173 -526 -225 246 382 72 -173 -321
5669 -321 -188 32 371 266 -216 -471 -176 161 302 152 -75 -276 -345 93 471 183 -184 -331 -249 85 331
5690 331 343 -81 -371 -296 191 385 162 -46 -201 -300 -19 381 321 -151 -507 -180 116 354 249 -12 -318
5711 -318 -416 -9 451 379 -155 -305 -284 -43 322 499 -30 -434 -363 37 361 299 4 -268 -279 -82 357 419
5733 419 67 -318 -352 -32 249 442 120 -241 -394 -68 387 368 49 -247 -290 -156 216 431 180 -274 -378
5754 -378 -48 294 333 129 -154 -333 -205 245 415 123 -251 -298 -10 163 279 268 -211 -407 -282 229 425
5775 425 151 -164 -281 -303 76 385 269 -316 -338 -127 105 223 215 23 -353 -256 154 407 198 -159 -263 -236
5797 -236 29 281 361 -101 -331 -250 142 322 145 21 -225 -242 -47 374 214 -53 -333 -222 68 155 198 -5
5819 -5 -223 -194 42 201 206 -88 -207 -233 -3 197 227 5 -320 -235 42 170 191 21 -212 -215 -68 237 308 68
5843 68 -143 -159 27 154 134 72 -155 -275 13 187 136 53 -115 -174 -118 144 230 116 -186 -239 38 93 202 137
5867 137 -51 -178 -119 160 174 58 -51 -150 -76 39 127 100 -76 -191 -54 75 110 60 -117 -194 -132 71 152 17
5891 17 -64 -218 -35 13 71 73 -46 -164 -88 42 133 63 -8 -156 -70 91 97 81 -106 -71 -13 5 151 57 18 -49 -84
5918 -84 -19 69 88 -25 -18 13 -28 27 33 -21 -10 -52 48 59 6 -47 -26 -51 -55 11 50 -18 -101 16 1 5 -36 25 -30 -86 -66
5949 -66 -86 -74 -31 -11 -46 -89 36 -28 -7 13 31 33 14 -35 47 32 -5 6 -54 -2 100 64 23 10 -30 -50 53 67 76 14
5979 14 -53 -16 42 55 137 45 -85 -83 -9 65 98 -19 3 -35 -61 55 89 -61 -123 -96 -52 -25 46 64 -110 -183 -28 87
6007 87 -2 58 -62 -96 -146 63 81 76 -128 -90 -38 86 137 106 -35 -130 -49 89 107 23 -31 -126 -152 26 225 118
6033 118 -106 -73 3 60 166 161 -44 -183 8 113 105 85 -8 -194 -146 45 119 109 0 -190 -112 -50 96 190 -2
6058 -2 -226 -105 -41 84 108 24 -188 -204 62 130 150 36 -111 -245 -50 116 157 -2 -116 -147 -39 120 163 73
6082 73 -149 -188 -6 131 194 111 -17 -263 -113 137 246 90 -167 -118 -18 66 219 259 -104 -197 -30 133 172
6105 172 85 -70 -235 -138 29 173 85 -62 -180 -146 -33 131 89 -62 -253 -113 66 139 116 -12 -248 -185 1
6128 1 187 198 5 -142 -202 33 198 173 -23 -177 -142 19 201 223 38 -229 -124 -36 169 201 116 -102 -211
6151 -211 -41 194 303 -6 -91 -169 -125 171 305 119 -225 -262 -25 143 150 147 -96 -317 -116 234 240 36 -137
6174 -137 -235 -173 26 229 141 -206 -316 -142 93 193 100 -93 -306 -231 86 240 110 -47 -217 -107 98 197
6196 197 210 -61 -196 -148 51 241 181 5 -146 -161 41 257 232 -13 -256 -195 87 247 192 -12 -180 -245 108
6219 108 253 226 -38 -311 -248 16 170 281 77 -277 -294 -19 252 213 6 -166 -246 -154 183 253 26 -264
6241 -264 -272 -59 193 212 122 -210 -318 -95 259 200 36 -208 -268 -80 211 308 85 -209 -219 -73 155 284 180
6264 180 -76 -297 -103 129 305 73 -147 -172 -102 102 268 186 -149 -248 -155 167 231 119 -118 -239 -202 93
6286 93 301 139 -195 -316 -99 124 249 130 -77 -219 -181 -18 287 185 -162 -233 -139 -2 204 168 -19 -282
6308 -282 -223 120 178 126 17 -90 -146 -11 262 176 11 -261 -77 85 81 176 21 -175 -145 41 180 118 24 -125
6332 -125 -145 25 146 195 28 -272 -142 43 102 125 -13 -139 -199 -51 216 188 -37 -184 -116 -11 130 199 1
6355 1 -125 -127 -35 88 101 -10 -90 -94 -58 37 130 65 -113 -142 -28 88 75 93 -6 -94 -141 130 159 28 -43 -68 57
6382 57 78 115 108 -5 -134 10 84 19 34 -19 -22 -68 4 21 6 -3 -9 14 18 -7 16 19 -30 -44 26 98 15 -55 -66 -48 -55 19
6414 19 39 4 -39 6 67 -62 -5 113 15 -106 -56 56 -17 9 25 9 6 -102 6 105 24 -24 4 -41 -34 41 91 26
6442 26 -132 -26 39 1 27 65 -44 -142 -76 29 92 -38 -70 -67 -24 37 84 88 -69 -123 -74 52 73 112 -59 -56 -99 14
6470 14 192 118 -109 -144 -30 30 90 162 -22 -268 -97 152 170 90 15 -60 -116 -39 133 186 -19 -161 -128 53 214
6495 214 159 -23 -158 -140 18 201 138 -31 -168 -86 -14 120 169 6 -216 -215 27 123 142 9 -124 -120 -27 177
6519 177 274 55 -131 -259 -51 171 201 28 -119 -193 -63 184 228 0 -164 -129 -53 141 269 132 -177 -205
6541 -205 -42 221 161 63 -82 -250 -145 92 249 128 -122 -242 -82 60 220 78 -104 -221 -112 126 258
6562 258 102 -65 -243 -127 88 253 169 -34 -252 -137 54 151 116 41 -237 -164 67 282 191 -64 -239 -218
6584 -218 44 178 192 -77 -197 -192 88 214 93 -61 -167 -132 17 294 158 -33 -210 -204 -2 178 153 -33
6606 -33 -229 -178 -61 223 140 14 -170 -196 -34 163 207 32 -124 -219 7 190 177 26 -84 -206 -84 169
6628 169 132 41 -145 -202 -52 144 195 152 -106 -171 -61 138 216 113 -55 -207 -143 85 197 149 -106 -90 -86 72
6652 72 176 129 -50 -214 -200 91 154 108 -46 -134 -134 -41 149 182 -10 -267 -175 10 152 125 -13 -117 -145 -31
6676 -31 143 129 -12 -205 -179 -55 149 186 25 -103 -210 -44 154 191 73 -81 -170 -112 113 269 58 -106
6698 -106 -112 -70 71 216 80 -56 -197 -166 103 107 115 -41 -164 -177 111 173 197 -16 -200 -124 -4 187 160 51
6722 51 -180 -187 8 147 126 -83 -126 -134 27 148 131 -29 -192 -185 13 122 158 -38 -156 -145 -103 118 173 1 -92
6747 -92 -185 -49 209 153 113 -135 -152 -24 89 181 149 -84 -154 -73 75 168 167 -117 -172 -65 86 233 105 -64
6771 -64 -201 -72 116 215 111 -110 -186 -108 46 145 94 -78 -213 -131 78 162 93 -61 -182 -88 45 199 107 -60
6795 -60 -202 -135 41 126 100 -48 -202 -159 -30 145 98 -49 -137 -122 -12 138 173 -27 -176 -119 23 116 108 78 -127
6820 -127 -128 9 124 147 -35 -106 -108 -18 156 145 3 -94 -49 2 89 135 43 -72 -131 -31 113 95 -40 -124 -164 -37
6846 -37 68 61 -47 -97 -107 -65 40 55 21 -161 -63 -32 46 132 73 -8 -115 -14 75 66 61 -26 -48 -37 105 156 18 5
6874 5 -8 17 26 1 90 7 -36 -43 35 105 -9 9 87 15 -56 -10 46 -8 5 1 32 -49 17 43 -11 -85 -32 -25 -5 -8 -5 4 -130
6907 -130 -97 5 13 4 -36 -116 -46 -11 5 17 12 -86 -115 -27 56 44 16 -21 -143 -61 122 139 86 -46 -81 -33 47 102 136
6936 136 -21 -108 2 96 180 -17 -66 -70 -100 20 205 121 -141 -197 -62 36 68 59 -7 -254 -132 61 176 94 -22
6961 -22 -165 -125 -7 163 216 -45 -234 -184 116 103 191 -18 -212 -226 59 232 149 -90 -232 -169 -74 129 256
6984 256 -30 -187 -270 42 308 243 35 -122 -212 -2 191 316 68 -299 -215 14 306 232 65 -166 -320 -56
7006 -56 180 190 -4 -170 -292 -130 152 280 42 -328 -375 -113 215 311 90 -226 -325 -151 156 364 129 -203
7028 -203 -355 -122 203 204 127 -151 -362 -211 192 389 81 -237 -278 -140 117 389 281 -86 -372 -119 134
7049 134 311 185 -41 -349 -257 167 370 203 -116 -286 -184 81 294 258 -91 -405 -249 122 333 189 -85
7070 -85 -285 -246 51 337 271 -119 -300 -211 22 311 226 -44 -318 -305 88 331 247 -44 -338 -260 -6 286 256
7093 256 -4 -353 -310 73 286 334 -74 -277 -316 3 342 351 1 -325 -370 6 223 272 58 -261 -261 -49 259
7116 259 280 -26 -276 -265 -117 189 290 35 -267 -305 3 228 277 91 -195 -278 -173 198 285 126 -247 -232
7138 -232 -91 237 311 127 -182 -304 -173 156 297 35 -116 -260 -172 183 281 102 -177 -297 -123 140 216
7159 216 122 -87 -237 -132 147 273 108 -180 -216 -125 93 282 277 -28 -281 -119 86 233 155 -82 -220 -166
7181 -166 97 239 222 -72 -187 -73 16 138 189 6 -214 -122 29 165 181 30 -158 -147 -67 89 183 45 -168
7204 -168 -135 -35 162 121 6 -122 -164 -76 96 236 -29 -142 -143 -108 154 152 70 -46 -148 -78 124 189 42 -96
7228 -96 -105 -114 26 90 12 -117 -146 -47 105 111 103 -119 -202 -49 61 171 59 3 -126 -62 9 143 153 -1 -114 -76
7254 -76 46 142 121 45 -136 -79 -13 140 125 2 -111 -52 -41 92 138 71 -72 -127 -72 45 85 -27 -35 -95 -36 80
7280 80 87 64 -129 -89 -18 -8 108 60 -53 -117 2 67 124 49 15 -80 -66 -57 96 71 -26 -109 -24 43 15 93 -65 -55
7308 -55 -26 -80 32 45 42 -125 -21 42 50 76 55 -98 4 -36 -9 64 71 -61 -143 -68 82 63 5 -98 -65 16 38 39
7336 39 -28 -54 -114 -43 87 74 38 -1 -77 -23 0 57 -31 -28 -44 11 14 35 71 45 -32 -49 28 34 28 49 -30 -42 -31 54 42 26
7368 26 48 -39 -13 65 24 49 -8 12 -74 -5 42 30 53 -35 15 -27 -6 58 8 4 -56 -30 -5 4 31 6 -41 -52 -4 83 37
7399 37 -44 27 -77 -27 29 45 -62 -26 -152 12 79 60 -6 -23 -76 -29 78 84 59 -54 -56 -93 23 75 68 -43 -143
7426 -143 -51 57 118 108 -40 -141 -103 25 88 80 18 -97 -95 41 212 75 -20 -158 -141 55 151 155 -37 -217 -134
7451 -134 23 187 150 15 -180 -222 -20 128 122 35 -182 -182 -57 87 169 46 -149 -267 -36 208 235 40 -195
7474 -195 -193 4 155 221 71 -134 -247 -96 144 255 127 -140 -191 -100 228 254 100 -137 -219 -74 158 248 121
7497 121 -173 -258 -157 180 348 85 -117 -290 -112 198 320 165 -78 -246 -219 183 277 182 -125 -361 -162
7518 -162 95 307 157 -147 -348 -131 91 293 201 -96 -366 -211 75 347 214 -110 -286 -197 151 357 250
7539 250 -51 -312 -242 47 322 301 -9 -340 -255 46 339 341 18 -282 -272 107 354 317 6 -239 -307 129 325
7562 325 219 6 -290 -336 0 283 333 80 -336 -351 -48 271 287 39 -316 -369 -99 276 345 1 -323 -308
7584 -308 -50 287 302 106 -216 -319 -56 301 319 77 -232 -296 -70 237 395 110 -277 -293 -102 250 305 82
7606 82 -183 -339 -129 150 452 108 -148 -349 -131 223 375 125 -209 -399 -153 196 260 195 -155 -373 -189
7627 -189 145 350 134 -191 -348 -160 135 307 121 -162 -293 -172 94 300 193 -94 -293 -125 126 302
7647 302 216 -83 -348 -207 94 361 206 -41 -269 -196 103 303 222 -146 -252 -148 107 215 269 14 -231
7668 -231 -206 61 343 293 -3 -261 -184 -29 209 214 24 -285 -166 -13 218 158 -18 -176 -308 -66 122 238
7690 238 24 -182 -177 -4 191 212 21 -190 -195 -55 208 184 28 -65 -144 -57 131 183 97 -97 -203 -92 170 168
7714 168 83 -119 -234 -101 89 192 39 -63 -175 -52 49 139 147 -39 -113 -53 65 155 82 -45 -122 -118 2 177
7738 177 117 -72 -121 -42 -21 116 74 -8 -71 -80 -2 141 94 -41 -55 -56 -53 102 121 31 -138 -90 21 59 120 -9 10
7765 10 -65 -48 87 92 21 -57 -108 -31 77 106 90 -57 -72 -54 46 68 10 -33 -61 -43 59 113 75 -62 -80 -29 -26 30
7793 30 68 20 -52 -48 -16 62 37 9 13 -93 -42 85 50 -35 -122 -86 -13 -51 43 50 -49 -168 -40 31 35 -23 -68 13 -55 -11
7823 -11 23 52 18 -47 9 29 50 69 82 -63 -32 71 20 102 11 28 -28 -47 16 37 -7 4 -66 16 86 7 -32 -26 -13 -5
7853 -5 -59 48 99 -1 -89 -10 14 -4 7 -29 -40 -63 -26 -31 -4 48 35 -93 -42 27 27 1 -35 4 -21 -11 12 74 -23 -98
7883 -98 -31 16 94 19 40 -39 -47 -2 47 68 -32 6 -61 9 51 46 42 -57 -83 -9 20 75 49 -59 -55 -94 88 49 12 -32 -91
7914 -91 -57 61 88 105 -22 -117 -51 2 79 68 -43 -104 -83 25 92 66 -40 -118 -82 35 98 23 24 -54 -145 6 102
7941 102 49 -22 -88 -168 -80 -16 178 80 -78 -91 35 98 73 88 -52 -99 -64 135 160 108 -98 -46 11 64 165 116
7967 116 -42 -219 -58 125 186 80 -92 -195 -89 100 243 61 -82 -200 -14 77 160 157 -94 -179 -186 96 190
7990 190 105 -76 -208 -105 50 214 182 -54 -175 -175 37 202 130 -24 -184 -164 26 243 139 -4 -254 -168
8012 -168 71 185 188 -38 -188 -191 -7 245 170 -20 -211 -234 -43 75 232 33 -275 -202 -33 202 236 22 -185
8035 -185 -198 -9 207 189 -20 -181 -244 -35 201 191 30 -151 -258 -26 190 262 7 -206 -265 -77 167 220
8057 220 107 -140 -259 -127 155 257 108 -84 -295 -123 143 252 130 -125 -259 -111 100 249 122 -166
8077 -166 -245 -131 123 219 125 -146 -201 -210 135 247 148 -138 -289 -206 133 226 168 -96 -325 -207 59 326 247 -46
8101 -46 -169 -132 142 257 219 -49 -190 -152 56 295 190 -92 -210 -203 53 275 157 -2 -189 -175 26 185
8123 185 217 -53 -258 -234 12 287 221 -8 -204 -176 11 191 285 -6 -208 -141 15 184 200 49 -239 -271 1
8146 1 254 289 61 -266 -196 20 174 283 58 -160 -229 -98 208 273 16 -140 -154 -78 129 171 85 -97 -169 -58
8170 -58 167 209 38 -120 -175 -100 139 179 58 -128 -156 -103 59 145 132 -128 -241 -31 26 140 53
8191E3
##END NTUPLES=NMR FID
##END=
