##TITLE=1H_IPEDM1
 CDCl3, 8 sc, 
 22.7.2019
##JCAMPDX= 6.0         $$ Bruker NMR JCAMP-DX V2.0
##DATA TYPE= NMR FID
##DATA CLASS= NTUPLES
##ORIGIN= UXNMR, Bruker Analytische Messtechnik GmbH
##OWNER= root
$$ XWIN-NMR		Version 3.5
$$ Mon Jul 22 13:51:42 2019 Russian Standard Time (UT+4h)  she@DPX200
##.OBSERVE FREQUENCY= 200.13155
##.OBSERVE NUCLEUS= ^1H
##.DELAY= (6, 6)
##.ACQUISITION MODE= SIMULTANEOUS
##.ACQUISITION SCHEME= undefined
##.AVERAGES= 8
##.DIGITISER RES= 18
##SPECTROMETER/DATA SYSTEM= spect
##.PULSE SEQUENCE= zg30
##.SOLVENT NAME= CDCl3
##.SHIFT REFERENCE= (INTERNAL, CDCl3, 0, 15.7039)
##AUDIT TRAIL= $$ (NUMBER, WHEN, WHO, WHERE, WHAT)
$$ ##TITLE= Audit trail, XWIN-NMR		Version 3.5
$$ ##JCAMPDX= 5.01
$$ ##ORIGIN= Bruker BioSpin GmbH
$$ ##OWNER= she
$$ F:/spectra/data/she/nmr/H-F/1/audita.txt
$$ ##AUDIT TRAIL=  $$ (NUMBER, WHEN, WHO, WHERE, WHAT)
(   1,<2019-07-22 13:50:45.71 +0400>,<she>,<DPX200>,
      <created by zg, POWCHK disabled, PULCHK disabled
       configuration hash MD5:
       00 E9 B6 7A A2 85 ED C7 34 08 36 98 17 FE 4E 26
       data hash MD5: 16K
       B7 73 BC 9C FB A3 A0 4E 7E 08 E2 2F 9C F2 28 55>)
$$ ##END=
$$ 
$$ hash MD5
$$ F9 2D D6 71 74 E7 40 2A B9 30 31 13 64 F1 95 50
##$RELAX= 
##$RELAX= 
##$RELAX= 
##$RELAX= 
##$RELAX= 
##$RELAX= 
$$ Bruker specific parameters
$$ --------------------------
##$DU= <F:/spectra>
##$EXPNO= 1
##$NAME= <H-F>
##$PROCNO= 1
##$TYPE= <nmr>
##$USER= <she>
##$AMP= (0..31)
100 100 100 100 100 100 100 100 100 100 100 100 100 100 100 100 100 100 
100 100 100 100 100 100 100 100 100 100 100 100 100 100 
##$AQSEQ= 0
##$AQ_mod= 1
##$AUNM= <au_zg>
##$AUTOPOS= <>
##$BF1= 200.13
##$BF2= 200.13
##$BF3= 200.13
##$BF4= 200.13
##$BF5= 200.13
##$BF6= 200.13
##$BF7= 200.13
##$BF8= 200.13
##$BYTORDA= 1
##$CFDGTYP= 0
##$CFRGTYP= 5
##$CHEMSTR= <none>
##$CNST= (0..31)
1 1 145 1 1 1 1 1 1 1 1 1 1 1 1 1 1 1 1 1 1 1 1 1 1 1 1 1 1 1 1 1 
##$CPDPRG= <>
##$CPDPRG1= <>
##$CPDPRG2= <>
##$CPDPRG3= <>
##$CPDPRG4= <mlev>
##$CPDPRG5= <mlev>
##$CPDPRG6= <mlev>
##$CPDPRG7= <mlev>
##$CPDPRG8= <mlev>
##$CPDPRGB= <>
##$CPDPRGT= <>
##$D= (0..31)
0 1.2 0 0 0 0 0 0 0 0 0 0.03 0 0 0 0 0 0 0 0 0 0 0 0 0 0 0 0 0 0 0 0 
##$DATE= 1563789045
##$DBL= (0..7)
120 120 120 120 120 120 120 120 
##$DBP= (0..7)
150 150 150 150 150 150 150 150 
##$DBP07= 0
##$DBPNAM0= <>
##$DBPNAM1= <>
##$DBPNAM2= <>
##$DBPNAM3= <>
##$DBPNAM4= <>
##$DBPNAM5= <>
##$DBPNAM6= <>
##$DBPNAM7= <>
##$DBPOAL= (0..7)
0.5 0.5 0.5 0.5 0.5 0.5 0.5 0.5 
##$DBPOFFS= (0..7)
0 0 0 0 0 0 0 0 
##$DE= 6
##$DECBNUC= <off>
##$DECIM= 24
##$DECNUC= <off>
##$DECSTAT= 4
##$DIGMOD= 1
##$DIGTYP= 9
##$DL= (0..7)
0 120 120 120 120 120 120 120 
##$DP= (0..7)
150 150 150 150 150 150 150 150 
##$DP07= 0
##$DPNAME0= <>
##$DPNAME1= <>
##$DPNAME2= <>
##$DPNAME3= <>
##$DPNAME4= <>
##$DPNAME5= <>
##$DPNAME6= <>
##$DPNAME7= <>
##$DPOAL= (0..7)
0.5 0.5 0.5 0.5 0.5 0.5 0.5 0.5 
##$DPOFFS= (0..7)
0 0 0 0 0 0 0 0 
##$DQDMODE= 0
##$DR= 18
##$DS= 0
##$DSLIST= <SSSSSSSSSSSSSSS>
##$DSPFIRM= 0
$$ [...]
##$SUBNAM2= <"">
##$SUBNAM3= <"">
##$SUBNAM4= <"">
##$SUBNAM5= <"">
##$SUBNAM6= <"">
##$SUBNAM7= <"">
##$SUBNAM8= <"">
##$SUBNAM9= <"">
##$SW= 24.9336996594482
##$SWIBOX= (0..15)
0 0 2 0 0 0 0 0 0 0 0 0 0 0 0 0 
##$SW_h= 4990.01996007984
##$TD= 16384
##$TD0= 1
##$TE= 0
##$TE2= 300
##$TE3= 300
##$TEG= 300
##$TL= (0..7)
0 120 120 120 120 120 120 120 
##$TP= (0..7)
150 150 150 150 150 150 150 150 
##$TP07= 0
##$TPNAME0= <>
##$TPNAME1= <>
##$TPNAME2= <>
##$TPNAME3= <>
##$TPNAME4= <>
##$TPNAME5= <>
##$TPNAME6= <>
##$TPNAME7= <>
##$TPOAL= (0..7)
0.5 0.5 0.5 0.5 0.5 0.5 0.5 0.5 
##$TPOFFS= (0..7)
0 0 0 0 0 0 0 0 
##$TUNHIN= 0
##$TUNHOUT= 0
##$TUNXOUT= 0
##$USERA1= <user>
##$USERA2= <user>
##$USERA3= <user>
##$USERA4= <user>
##$USERA5= <user>
##$V9= 5
##$VALIST= <valist>
##$VCLIST= <CCCCCCCCCCCCCCC>
##$VD= 0
##$VDLIST= <DDDDDDDDDDDDDDD>
##$VPLIST= <PPPPPPPPPPPPPPP>
##$VTLIST= <TTTTTTTTTTTTTTT>
##$WBST= 1024
##$WBSW= 4
##$XGAIN= (0..3)
0 0 0 0 
##$XL= 0
##$YL= 0
##$YMAX_a= 679505
##$YMIN_a= -385010
##$ZGOPTNS= <>
##$ZL1= 120
##$ZL2= 120
##$ZL3= 120
##$ZL4= 120
##$ABSF1= 10
##$ABSF2= 0
##$ABSG= 5
##$ABSL= 3
##$ALPHA= 0
##$AQORDER= 0
##$ASSFAC= 0
##$ASSFACI= 0
##$ASSFACX= 0
##$ASSWID= 0
##$AUNMP= <proc_1d>
##$AZFE= 0.1
##$AZFW= 0.1
##$BCFW= 1
##$BC_mod= 2
##$BYTORDP= 1
##$COROFFS= 0
##$CY= 11.3945322036743
##$DATMOD= 1
##$DC= 2
##$DFILT= <>
##$DTYPP= 0
##$F1P= 18.9103706918063
##$F2P= -1.10871071338519
##$FCOR= 0.5
##$FTSIZE= 0
##$FT_mod= 4
##$GAMMA= 1
##$GB= 0.15
##$INTBC= 1
##$INTSCL= 1
##$ISEN= 128
##$LB= 0.24
##$LEV0= 0
##$LPBIN= 0
##$MAXI= 10000
##$MC2= 0
##$MEAN= 0
##$ME_mod= 0
##$MI= 1.114404
##$NCOEF= 0
##$NC_proc= 0
##$NLEV= 6
##$NOISF1= 3.799351
##$NOISF2= 2.8
##$NSP= 1
##$NTH_PI= 0
##$NZP= 0
##$OFFSET= 15.70392
##$PC= 1
##$PHC0= -9015.938
##$PHC1= 10.40096
##$PH_mod= 1
##$PKNL= yes
##$PPARMOD= 0
##$PSCAL= 0
##$PSIGN= 0
##$REVERSE= no
##$SF= 200.130013532006
##$SI= 16384
##$SIGF1= 3
##$SIGF2= 2
##$SINO= 400
##$SIOLD= 16384
##$SREGLST= <1H.CDCl3>
##$SSB= 0
##$STSI= 0
##$STSR= 0
##$SW_p= 3612.71676300578
##$SYMM= 0
##$S_DEV= 0
##$TDeff= 0
##$TDoff= 0
##$TI= <>
##$TILT= no
##$TM1= 0
##$TM2= 0
##$TOPLEV= 0
##$USERP1= <user>
##$USERP2= <user>
##$USERP3= <user>
##$USERP4= <user>
##$USERP5= <user>
##$WDW= 1
##$XDIM= 8192
##$YMAX_p= 0
##$YMIN_p= 0
$$ End of Bruker specific parameters
$$ ---------------------------------
##NTUPLES= NMR FID
##VAR_NAME=  TIME,          FID/REAL,        FID/IMAG
##SYMBOL=    X,             R,               I
##VAR_TYPE=  INDEPENDENT,   DEPENDENT,       DEPENDENT
##VAR_FORM=  AFFN,          ASDF,            ASDF
##VAR_DIM=   8192,          8192,            8192
##UNITS=     SECONDS,       ARBITRARY UNITS, ARBITRARY UNITS
##FACTOR=    0.0002004,     1,               1
##FIRST=     0,             0,               0
##LAST=      1.6414764,     0,               0
##MIN=       0,             -385010,         0
##MAX=       1.6414764,     679505,          0
$$ Real data points
##PAGE= N=1
##DATA TABLE= (X++(R..R)), XYDATA
$$ plain form
0 0 0 0 0 8 -8 8 -8 16 -24 32 -40 48 -57 73 -88 104 -128 153 -184 215 -249 294 -342 391 -448 516 -589
27 -589 669 -757 853 -963 1084 -1213 1357 -1516 1690 -1879 2087 -2317 2568 -2846 3150 -3487
43 -3487 3861 -4276 4746 -5270 5869 -6561 7358 -8300 9426 -10812 12553 -14820 17914
56 17914 -22392 29512 -42577 74377 -305580 -161326 576415 43586 -225271 149654 166669
67 166669 -365053 -139525 396603 167128 -332077 -105494 118040 -122165 -74917 350338
77 350338 166269 -327570 -172190 228539 41021 -154496 103221 122272 -252711 -158365
87 -158365 282037 190148 -194864 -101123 118360 -26838 -90149 135978 88766 -191332 -108144
98 -108144 159071 80703 -74374 22692 26433 -152719 -67023 188342 112093 -126880 -95719
$$ packed form
0@%%%Qj6J6j6K4m0N6p2Q8j05J30j61J92k32K81l37L99m64N43o36P33q39R64j105
27e89J258j426J610j816K047k297K570k873L206l569L966m404M885n414N996o637
43c487P348q137R022j0016J1139j2430J3919j5658J7726k0238K3365k7373L2734
56A7914m0306N1904p2089J16954l79957J44254P37741n32829k68857L74925J7015
67A66669n31722K25528N36128k29475m99205K26583K23534k40205M7248M25255
77C50338j84069m93839J55380M00729j87518j95517K57717J9051l74983R4346
87a58365M40402r1889l85012R3741K19483j45198o3311K26127m7212k80098Q3188
98a08144K67215p8368j55077R7066L741j79152Q5696K55365p6249k38973L1161
$$ plain form
109 -95719 15523 -24166 20688 144649 21438 -195827 -129927 55992 93589 112780 107470
120 107470 -111637 -261610 -16983 214043 52039 -95594 29218 13206 -173894 -37675
130 -37675 265942 147409 -181817 -156726 27213 2276 6625 150518 69244 -176454 -119273
141 -119273 119803 100246 -30736 14230 14517 -129913 -78636 147754 125958 -81475 -80186
152 -80186 35669 -7290 -43375 68777 74039 -84038 -99630 47032 77546 -2859 -12637 -7078
164 -7078 -57257 -35056 62350 58522 -34424 -55764 -12401 13483 41744 56029 -8694 -80466
176 -80466 -54420 13623 46406 56633 22685 -60127 -67261 31993 71217 13447 -1288 1091
188 1091 -77686 -87394 72090 144215 -2869 -92007 -4699 24430 -27586 34733 97181 -32842
$$ packed form
109i5719J11242l9689M4854J23961j23211k17265O5900J85919L7597J9191n310
120A07470k19107j49973K44627K31026j62004j47633J24812j6012j87100J36219
130c7675L03617j18533l29226K5091J83939k4937M349J43893q1274k45698N7181
141a19273K39076j9557j30982M4966K87j44430N1277K26390k1796k07433J289
152h0186J15855m2959l6085J12152N262j58077j5592J46662L0514q0405r778N559
164g078n0179K2201R7406l828r2946k1340M3363K5884K8261J4285o4723p1772
176h0466K6046O8043L2783J0227l3948q2812p134R9254L9224n7770j4735K379
188A091p8777r708J59484P2125j47084q9138Q7308K9129n2016O2319O2448j30023
$$ plain form
200 -32842 -134681 -9936 89067 10657 -8134 64579 -7242 -119756 -14073 118457 21298
211 21298 -83854 -3989 32605 -50992 -12318 101159 26254 -101299 -25522 74234 -366
222 -366 -45274 40460 30944 -74079 -33763 75792 27883 -54606 556 39834 -27489 -25168
234 -25168 53627 21853 -61493 -21064 46406 10378 -16526 22580 7072 -40126 3659 54255
246 54255 3429 -33015 10461 9660 -31806 9573 57371 -6601 -54757 8284 34635 -18670
258 -18670 -2905 49311 -6437 -66391 1405 49420 -15238 -25049 42682 11215 -61407 2593
270 2593 74043 -8457 -66541 19874 45924 -42539 -29634 60973 18411 -62911 1050 58328
282 58328 -23919 -50008 44912 39057 -60283 -26617 64746 8491 -61023 16260 59141 -31413
$$ packed form
200c2842j01839J24745R9003p8410j8791P2713p1821j12514J05683J32530r7159
211B1298j05152P9865L6594q3597L8674J13477p4905j27553P5777R9756p4600
222c66m4908Q5734r516j05023M0316J09555m7909q2489N5162L9278o7323K321
234b5168P8795l1774q3346M0429O7470l6028k6904L9106j5508m7198M3785N0596
246E4255n0826l6444M3476q01m1466M1379M7798o3972m8156O3041K6351n3305
258a8670J5765N2216n5748n9954O7796M8015o4658r811O7731l1467p2622O4000
270B593P1450q2500n8084Q6415K6050q8463J2905R0607m2562q1322O3961N7278
282E8328q2247k6089R4920n855r9340L3666R1363n6255o9514P7283M2881r0554
$$ plain form
294 -31413 -45675 47222 30243 -56515 -9068 67166 -2505 -64011 15036 54669 -23040 -34255
306 -34255 35545 16488 -43859 -1644 45611 -8099 -34887 22430 21783 -37628 -12383 46572
318 46572 6038 -45277 2172 37840 -10304 -23992 23447 14489 -33850 -12708 29916 5455
330 5455 -20014 7314 11910 -19168 -6025 26896 1587 -30620 -1794 21817 -5712 -12821 16989
343 16989 10213 -22412 -10009 18925 5352 -12555 2006 4721 -13941 -3765 22549 10777
355 10777 -15982 -10415 2994 -2312 1027 14265 2892 -16015 -3995 13190 1742 -7923 5855
368 5855 7536 -12416 -12996 10933 18012 416 -11835 -8494 -261 7421 8258 -1254 -8447 -4445 -179
383 -179 -216 5428 10494 404 -14186 -11658 3045 11058 7294 -1793 -9019 -7165 1681 5936 3285
$$ packed form
294c1413j4262R2897j6979q6758M7447P6234o9671o1506P9047L9633p7709j1215
306c4255O9800j9057o0347M2215M7255n3710k6788N7317o47n9411K5245N8955
318D6572m0534n1315M7449L5668m8144j3688M7439q958m8339K1142M2624k4461
330E455k5469K7328M596l1078J3143L2921k5309l2207K8826K3611k7529p109K9810
343A6989o776l2625J2403K8934j3573j7907J4561K715j8662J0176K6314j1772
355A0777k6759N567J3409n306L339J3238j1373j8907J2020J7185j1448r665J3778
368E855J681j9952n80K3929P079j7596j2251L341Q233P682Q37r512p193M002M266
383a79l7N644N066j0090j4590K528J4703Q013l764r087p226J854Q846M255k651
$$ plain form
398 3285 433 -4082 -10839 -6615 9926 15874 1135 -12719 -10261 -1186 5522 9601 5811 -6434
412 -6434 -11903 -2703 9064 11930 6961 -3398 -13682 -10918 5485 16027 9502 -3012 -10198 -9984
426 -9984 -539 14812 18006 -990 -21602 -17787 4918 18774 11835 -2059 -8610 -8406 -4103 5666
440 5666 14550 7588 -13184 -23284 -7640 17350 25298 9009 -15486 -23788 -7879 12751 15161
453 15161 2790 -7364 -12207 -10584 5886 25123 16809 -15162 -29241 -10398 13432 21933 16217
466 16217 -2523 -23598 -20047 8459 26552 16860 -2348 -16886 -20814 -1689 28013 27027 -7692
479 -7692 -28055 -13029 8138 18379 22350 8486 -23931 -34069 -1325 31282 25491 -1110 -20041
492 -20041 -24512 -8465 21788 32058 6132 -24030 -27392 -9636 15351 33642 20989 -20875
$$ packed form
398C285k852m515o757M224J6541N948j4739j3854K458R075O708M079l790j2245
412f434n469R200J1767K866m969j0359j0284K764J6403J0542o525j2514p186K14
426i984R445J5351L194j8996k0612L815K2705J3856o939j3894o551K04M303R769
440E666Q884o962k0772j0100J5644K4990P948j6289k4495q302J5909K0630K410
453A5161j2371j0154m843J623J6470J9237q314l1971j4079J8843K3830Q501n716
466A6217j8740k1075L551K8506J8093r692j9208j4538l928J9125K9702r86l4719
479g692k0363J5026K1167J0241L971j3864l2417j0138L2744L2607n791k6601j8931
492b0041m471J6047L0253J0270k5926l0162l362J7756K4987J8291j2653m1864
$$ plain form
504 -20875 -42607 -14749 25070 31708 10192 -12587 -23860 -16230 9050 28367 18067 -12486
516 -12486 -31727 -18610 17189 40001 22725 -16335 -35881 -21335 10201 34721 30128 -5266
528 -5266 -35496 -24938 10400 30875 24850 1000 -28641 -33426 4340 41055 27383 -11811 -27083
541 -27083 -20009 -5727 22426 40563 7752 -42168 -36727 11895 34449 21417 2069 -23071
553 -23071 -41004 -13162 39140 44304 106 -30915 -29956 -15348 15638 46515 26216 -32598 -49098
566 -49098 -6769 28392 27397 14375 -6560 -33946 -28997 16920 45116 19489 -21805 -35367 -18780
579 -18780 13704 39057 27987 -13704 -40152 -24002 13018 35430 25874 -7304 -32542 -24960
591 -24960 4692 28180 27761 46 -34132 -32986 8047 36091 20004 -7799 -20807 -24750 -8507
$$ packed form
504b0875k1732K7858L9819O638k1516k2779j1273P630K5280J9317j0300l0553
516a2486j9241J3117L5799K2812j7276l9060j9546J4546L1536K4520m593l5394
528e266l0230J0558L5338K0475o025k3850k9641m785L7766L6715j3672l9194j5272
541b7083P074J4282K8153J8137l2811m9920N441M8622K2554j3032j9348k5140
553b3071j7933K7842N2302N164m4198l1021R59J4608L0986L0877k0299n8814j6500
566d9098M2329L5161r95j3022k0935k7386M949M5917K8196k5627m1294j3562J6587
579a8780L2484K5353j1070m1691k6448J6150L7020K2412r556l3178k5238P582
591b4960K9652K3488m19k7715l4178J146M1033K8044j6087k7803j3008l943J6243
$$ plain form
604 -8507 29896 36935 -11743 -45288 -17125 17501 19312 19109 14373 -25505 -50305 -4039 46584
617 46584 26801 -13322 -17674 -19413 -21209 20405 57253 11541 -52330 -35845 11636 14355 12730
630 12730 28379 -283 -51424 -28136 38769 39470 -5435 -16144 -15018 -27981 -2017 49097 32094
643 32094 -31916 -37609 712 5937 3613 27389 16598 -36927 -39165 16162 32949 3362 -6520
656 -6520 -6836 -24444 -13215 30167 27881 -18759 -26362 1523 4097 176 18440 10818 -28531 -25956
670 -25956 16073 20942 -2462 114 922 -23460 -14021 31624 27513 -22964 -30058 229 3326 2700
684 2700 26294 15991 -32695 -31646 16464 21264 -5291 3510 8547 -29050 -30122 30506 44272
697 44272 -12831 -32803 -266 474 -14900 14837 33986 -10250 -38321 -3063 17833 -1990
$$ packed form
604h507L8403P039m8678l3545K8163L4626J811k03m736l9878k4800M6266N0623
617D6584j9783m0123m352j739j796M1614L6848m5712o3871J6485M7481K719j625
630A2730J5649k8662n1141K3288O6905P01m4905j0709J126j2963K5964N1114j7003
643C2094o4010n693L8321N225k324K3776j0791n3525k238N5327J6787k9587r882
656f520l16j7608J1229M3382k286m6640p603K7885K574l921J8264p622l9349K575
670b5956M2029M869k3404K576Q08k4382R439M5645m111n0477p094L0287L097o26
684B700K3594j0303m8686J049M8110M800k6555Q801N037l7597j072O0628J3766
697D4272n7103j9972L2537P40j5374K9737J9149m4236k8071L5258K0896j9823
$$ plain form
709 -1990 2664 19503 -11248 -38690 1973 38297 4530 -25338 -10 10911 -15928 -9868 24961
722 24961 13527 -23649 -13264 15870 2849 -14637 6512 17310 -11327 -20601 9424 16523
734 16523 -11412 -13969 12214 11246 -11427 -6380 10463 -2147 -15338 5575 18832 -7119 -20757
747 -20757 5546 15449 -9492 -9825 17489 7308 -26996 -13060 24401 11486 -19190 -3202 16573
760 16573 -7703 -19295 12053 18439 -13198 -11163 15775 355 -22139 7823 28432 -10985
772 -10985 -28255 14024 22127 -21001 -16440 28411 14365 -29120 -10932 22192 -1063 -17636
784 -17636 15936 19667 -23363 -22599 19268 15838 -12390 1290 14344 -15419 -22799 15624 23115
797 23115 -8127 -9207 6573 -10488 -17561 17595 26881 -11734 -22952 3531 4159 -7741 12133
$$ packed form
709a990M654J6839l0751k7442M0663L6324l3767k9868K5328J0921k6839O060L4829
722B4961j1434l7176J0385K9134j3021j7486K1149J0798k8637r274L0025P099
734A6523k7935k557K6183r68k2673N047J6843j2610j3191K0913J3257k5951j3638
747b0757K6303R903k4941l33K7314j0181l4304J3936L7461j2915l0676J5988J9775
760A6573k4276j1592L1348O386l1637K035K6938j5420k2494K9962K0609l9417
772a0985j7270M2279Q103m3128M561M4851j4046m3485J8188L3124k3255j6573
784a7636L3572L731m3030P64M1867l430k8228J3680J3054k9763p380L8423P491
797B3115l1242j080J5780j7061p073L5156R286l8615j1218K6483O28j1900J9874
$$ plain form
810 12133 20124 -14535 -25725 7320 15919 -3745 3571 13170 -15187 -24242 15912 27509 -10036
823 -10036 -16489 10745 2502 -16855 7554 24422 -8181 -22186 7691 12016 -9565 3096 17047
836 17047 -14373 -24948 20039 29854 -16858 -22138 15732 6683 -20750 8641 32370 -12602 -37721
849 -37721 7918 28508 -6533 -9601 15921 -5898 -32584 5547 38405 2488 -25764 -1902
861 -1902 4790 -13580 6538 33280 315 -35954 -9374 20691 6352 94 14383 -3255 -30412
874 -30412 -6701 28205 14618 -9312 -4756 -4988 -14394 5453 28271 6412 -21561 -8965 6728
887 6728 -2102 2003 18925 3715 -23682 -11007 17099 13297 -2286 -3117 -6571 -11411 4320 18093
901 18093 2524 -12175 -3493 -253 -6853 5875 18828 -2849 -23723 -4162 16691 4955 -3954
$$ packed form
810A2133P991l4659j1190L3045Q599j9664P316R599k8357r055M0154J1597l7545
823a0036o453K7234q243j9357K4409J6868l2603j4005K9877M325k1581J2661J3951
836A7047l1420j0575M4987R815m6712n280L7870r049k7433K9391K3729m4972k5119
849c7721M5639K0590l5041l068K5522k1819k6686L8131L2858l5917k8252K3862
861a902O692j8370K0118K6742l2965l6269K6580L0065j4339o258J4289j7638k7157
874c0412K3711L4906j3587k3930M556k32r406J9847K2818k1859k7973J2596J5693
887F728q830M105J6922j5210k7397J2675K8106l802j5583q31l454m840J5731J3773
901A8093j5569j4699Q682L240o600J2728J2953k1677k0874J9561K0853j1736q909
$$ plain form
914 -3954 4798 -2956 -17532 231 23521 8437 -14379 -7563 1250 -4931 3313 19184 3629
927 3629 -21814 -11084 12654 8724 -1184 5033 655 -16801 -8960 17965 17619 -5751 -11974 -2813
941 -2813 -1172 1045 11269 9409 -7313 -12923 -1931 5767 5747 5658 195 -11679 -11296 5773 15143
956 15143 3593 -9301 -6825 -39 -632 212 7644 6754 -7402 -12934 950 11546 3608 -4741
970 -4741 -1958 -1471 -4612 2941 10830 446 -11502 -3789 5265 -154 -285 8933 1849 -14291 -5974
985 -5974 12855 6545 -7306 210 5700 -7714 -7364 12727 11109 -10411 -9132 7076 2248 -6377
999 -6377 5663 9073 -9304 -11070 8014 7262 -6806 143 7775 -8678 -12995 11711 16393 -9169
1013 -9169 -12973 6535 2845 -10883 3456 16567 -3274 -16716 310 8309 -2834 1247 10417
$$ packed form
914c954Q752p754j4576J7763K3290j5084k2816O816Q813o181Q244J5871j5555
927C629k5443J0730K3738l930r908O217m378j7456P841K6925l46k3370o223R161
941b813J641K217J0224j860j6722n610J0992P698k0q9n463j1874L83J7069R370
956A5143j1550j2894K476O786n93Q44P432q90j4156n532J3884J0596p938q349
970d741K783M87l141P553P889j0384j1948P713R054n419j31R218p084j6140Q317
985e974J8829o310j3851P516N490j3414L50K0091j618k1520J279J6208m828q625
999f377J2040L410j8377j766J9084p52j4068O949P632j6453m317K4706M682k5562
1013i169l804J9508l690j3728J4339J3111j9841j3442J7026P999j1143M081R170
$$ plain form
1026 10417 -5751 -17648 2937 15661 -2312 -8364 6957 2375 -13696 -545 18049 2657
1038 2657 -15275 -3104 7090 -2016 504 12071 4 -16341 -3099 12930 3452 -3746 4682
1051 4682 -1298 -15527 -2543 17986 7424 -10707 -3910 3559 -5577 -2378 13408 6034 -14306
1064 -14306 -9335 8249 6902 -204 3228 -916 -12307 -4539 12405 7950 -5848 -4360 -977 -6326
1078 -6326 -346 14517 7801 -13089 -12948 3137 7384 4002 5132 -34 -11363 -8030 6932 10014
1092 10014 2543 -1164 -4542 -8597 -251 13109 8095 -8012 -9843 -454 3283 4755 7926 1606
1106 1606 -11139 -9927 4089 10641 6121 -5 -6322 -9454 -954 10671 9062 -1941 -6865 -5402
1120 -5402 -2168 5186 10993 3268 -10371 -10683 815 7713 6534 2169 -4766 -9108 -3174 6822 8086
$$ packed form
1026A0417j6168j1897K0585J2724j7973o052J5321m582j6071J3151J8594j5392
1038B657j7932J2171J0194r106K520J1567j2067j6345J3242J6029r478p198Q428
1051D682n980j4229J2984K0529j0562j8131O797P469r136L199J5786p374k0340
1064a4306M971J7584j347p106L432m144j1391P768J6944m455j3798J488L383n349
1078f326N980J4863o716k0890J41J6085M247l382J130n166j1329L333J4962L082
1092A0014p471l707l378m055Q346J3360n014j6107j831R389L737J472L171o320
1106A606j2745J212J4016O552m520o126o317l132Q500J1625j609j1003m924J463
1120e402L234P354N807p725j3639l12J1498O898j179m365o935m342N934R996J264
$$ plain form
1135 8086 1694 -4409 -7695 -5281 5597 12840 4036 -9264 -9421 -406 4578 6043 5926 -884 -9477
1150 -9477 -6638 4465 9115 4149 -2767 -6993 -5639 2887 9873 5529 -4188 -6903 -3020 1368 5792
1165 5792 7451 740 -8312 -6933 2873 7738 4327 -747 -4461 -5374 -591 6122 6121 -785 -6026 -5404
1181 -5404 -665 5151 6841 1025 -6484 -6028 725 4580 3136 575 -2113 -4642 -3077 3176 6767
1196 6767 2444 -4512 -6093 -1050 4364 4554 347 -3192 -2933 -741 1246 2860 3295 146 -4301 -3344
1212 -3344 2597 5242 1138 -2948 -2534 -370 856 2383 2770 -74 -2527 -1200 860 899 1039 1079 -1314
1229 -1314 -2993 445 3398 219 -2281 889 1844 -2329 -2228 2633 1188 -4071 -1400 3921 335
1244 335 -4433 81 3887 -1049 -3260 1312 925 -3571 -300 4372 -911 -5015 1331 3597 -3088
$$ packed form
1135H086o392o103l286K414J0878P243q804j3300j57R015M984J465j17o810q593
1150i477K839J1103M650m966o916m226J354Q526O986m344r717k715L883M388M424
1165E792J659o711r052J379R806M865l411n074l714r13M783O713jo906n241O22
1181e404M739N816J690n816p509M56O753L855j444k561k688k529J565O253L591
1196F767m323o956j581N043N414J90m207l539K59K192J987J614M35l149m447R57
1212c344N941K645m104m086M14K164J226J527L87k844k453J327K060L9J40M0k393
1229a314j679L438K953l179k500L170R55m173J01M861j445n259K671N321l586
1244C35m768M514L806m936k211M572l87m496L271M672n283m104O346K266o685
$$ plain form
1259 -3088 -1735 6392 1633 -8990 -2838 8623 3261 -6097 -1164 3653 -2813 -3132 6287 4672 -5610
1274 -5610 -4241 3095 775 -1227 4729 2121 -9175 -5979 8135 7167 -3842 -2808 2038 -3538
1288 -3538 -4484 6552 7609 -5839 -9454 -182 2880 1125 4875 3237 -7959 -8895 3576 7460
1302 7460 -102 -2334 -1776 -6745 -4515 8639 10462 -3488 -9352 -2165 879 612 5914 5338 -7083
1317 -7083 -10915 955 8575 4869 1535 -2261 -9270 -5808 8878 11126 -2525 -7994 -2266 -1383
1331 -1383 -964 8271 9548 -6122 -14217 -1721 9305 6337 1774 -1819 -9290 -8688 5571 12462
1345 12462 1681 -7445 -5247 -3116 -1090 7978 10743 -3585 -15543 -7272 6647 8444 3145 -1848
1359 -1848 -7382 -8177 1458 11136 7934 -3605 -10813 -8825 356 9837 9791 -406 -9602 -8467 870
$$ packed form
1259c088J353Q127m759j0623O152J1461n362r358M933M817o466l19R419j615j0282
1274e610J369P336k320k002N956k608j1296L196J4114r68j1009J034M846n576
1288c538r46J1036J057j3448l615R272L062j755L750j638j1196r36J2471L884
1302G460p562k232N58m969K230J3154J823j3950n864P187L044k67N302n76j2421
1317g083l832J1870P620l706l334l796p009L462J4686K248j3651n469N728Q83
1331a383M19R235J277j5670q095J2496J1026k968m563l593p471O02J4259O891
1345A2462j0781r126K198K131K026R068K765j4328j1958Q271J3919J797n299m993
1359a848n534p95R635R678l202j1539p208J988R181R481m6j0197r196J135R337
$$ plain form
1374 870 9496 9319 -299 -9584 -9402 -1584 7323 11774 5232 -9367 -13829 83 12065 7180 -1596
1389 -1596 -3583 -6895 -8464 4375 16735 5733 -12726 -11259 950 4574 6430 8324 -3355
1402 -3355 -16811 -6421 12501 9329 -2918 -2480 -3116 -11591 -2824 18229 12676 -13002 -15448 2377
1416 2377 6039 1266 6444 3736 -13601 -13731 8502 15967 2436 -4076 -3645 -9477 -5398 13613
1430 13613 14908 -7360 -15223 -1013 5247 2435 8694 9139 -9779 -18547 539 15488 6940 -3384
1444 -3384 -4326 -6871 -5253 8099 13918 918 -9914 -6908 -2946 1146 10622 9643 -8106 -15318
1458 -15318 -196 10783 4935 -161 -802 -7050 -8788 4005 12419 3205 -6616 -6609 -4640 336 10588
1473 10588 9076 -7521 -12920 175 7157 2701 3412 3709 -8484 -13086 3817 15340 4089 -6523
$$ packed form
1374H70Q626j77r618r285J82P818Q907M451o542j4599m462J3912J1982m885q776
1389a596j987l312j569J2839J2360j1002j8459J467J2209L624J856J894j1679
1402c355j3456J0390J8922l172j2247M38o36q475Q767K1053n553k5678k446J7825
1416B377L662m773N178k708j7337j30K2233P465j3531o512M31n832M079J9011
1430A3613J295k2268p863J4210O260k812O259M45j8918q768J9086J4949q548j0324
1444c384r42k545J618J3352N819j3000j0832L006L962M092R476r79j7749p212
1458a5318J5122J0979n848n096o41o248j738J2793Q414r214r821PJ969M976J0252
1473A0588j512j6597n399J3095O982m456P11K97j2193m602J6903J1523j1251j0612
$$ plain form
1487 -6523 -3875 -2621 -2695 6888 11587 -2085 -12542 -4108 4434 3082 5305 6791 -5664 -13967 310
1502 310 13981 5129 -6000 -3237 -2306 -6269 1611 13215 6054 -9163 -8888 680 3686 3899 3991
1517 3991 -2783 -9239 -2827 6421 4755 225 49 -3353 -7703 -525 9863 5371 -6242 -7044 -117
1532 -117 2833 3455 3767 -758 -6167 -3793 2480 4804 3883 904 -5190 -6658 1466 7534 3023 -2582
1548 -2582 -2264 -2134 -2284 3394 7394 399 -6756 -3311 2084 1976 2499 3107 -3016 -7294 -44 7225
1564 7225 3314 -1805 -810 -2385 -5838 365 8591 3205 -6656 -4510 2257 1270 -140 3304 1435
1579 1435 -5895 -5414 2388 4557 1156 -372 -1646 -4011 -1053 4943 3616 -3042 -3930 165 827 24
1595 24 2392 2658 -2259 -4914 -564 4216 3395 -576 -2432 -1606 -366 817 2266 2398 -677 -3579
$$ packed form
1487f523K648J254p4R583M699j3672j0457Q434Q542j352K223J486j2455q303J4277
1502C10J3671q852j1129K763R31l963P880J1604p161j5217K75R568L006K13R2
1517C991o774o456O412R248j666m530j76l402m350P178J0388m492j1613q02O927
1532a17K950O22L12m525n409K374O273K324r21k979o094j468Q124O068m511n605
1548b582L18J30j50N678M000o995p155L445N395j08N23O08o123m278P250P269
1564G225l911n119R95j575l453O203Q226n386r861K146O767r87j410L444j869
1579A435p330M81P802K169l401j528j274k365K958N996j327o658q88M095O62q03
1595B4K368K66m917k655M350M780q21l971j856Q26J240J183J449J32l075k902
$$ plain form
1611 -3579 -1310 2827 2479 -435 -566 -480 -2276 -586 3863 2359 -3552 -3133 1534 754 -1213 2304
1627 2304 2672 -4189 -4932 3331 4572 -2540 -2576 2455 -787 -4771 1919 6380 -1441 -5982 488 2540
1643 2540 -2406 -45 4576 -1528 -6606 1254 6067 -1426 -3643 3509 1704 -6050 -1021 7676 1640
1658 1640 -6313 -440 4404 -1563 -2119 4883 2202 -5730 -1534 5215 244 -3674 2591 2852 -5233
1673 -5233 -2769 6340 2596 -5716 -1003 4712 -1562 -4195 3640 3816 -4723 -3094 4524 1451 -3870
1688 -3870 1051 3510 -3531 -3504 4300 2279 -4963 -923 4784 -1370 -4972 3075 4495 -4499 -4089 4933
1704 4933 2757 -4590 -490 4767 -1173 -4050 3041 3517 -3476 -1572 4722 310 -4493 1934 4987
1719 4987 -3032 -4039 4521 3503 -4844 -2224 5122 1021 -4271 1222 4127 -2364 -3245 3187 2458
$$ packed form
1611c579K269M137l48k914j31Q6j796J690M449j504n911M19M667p80j967L517
1627B304L68o861p43Q263J241p112l6N031l242l984O690M461p821m541O470K052
1643B540m946K361M621o104n078P860M813p493k217P152j805p754N029Q697o036
1658A640p953N873M844n967n56P002k681p932M196O749m971l918O265K61q085
1673e233K464R109l744q312M713N715o274k633P835J76q539J629P618l073n321
1688c870M921K459p041K7P804k021p242M040N707o154l602Q047J420q994M10R022
1704D933k176p347M100N257n940k877P091M76o993J904O294m412m803O427L053
1719D987q019j007Q560j018q347K620P346m101n292N493K905o491q81O432p29
$$ plain form
1734 2458 -3057 -747 2882 -1237 -2659 3217 3097 -3734 -2754 3267 961 -3454 566 3466 -2166
1749 -2166 -4054 2321 3996 -1470 -2554 700 -188 -1478 1951 2879 -1282 -2256 904 725 -588 1990
1765 1990 2319 -2619 -3529 1936 4002 179 -1266 139 -767 -1189 1954 2991 -196 -1992 -827 -127
1781 -127 1149 3367 1711 -3271 -3296 1480 2885 580 211 114 -2636 -2394 2315 4047 72 -2920 -2260
1798 -2260 -1086 908 3339 2017 -2667 -3527 -144 1708 1669 1989 -208 -4272 -3282 2930 4960 765
1814 765 -2254 -2010 -1634 48 3579 3509 -1441 -4165 -1650 1337 3019 3380 455 -4489 -3982 2183 4950
1831 4950 1784 -1100 -1819 -2634 -1102 3524 5047 186 -4610 -3666 213 3307 3975 778 -4172 -4618
1847 -4618 259 3664 2697 516 -2014 -4424 -2708 3250 5838 1048 -4302 -4410 -938 2662 4259
$$ packed form
1734B458n515K310L629m119j422N876j20o831R80O021k306m415M020K900n632
1749b166j888O375J675n466j084L254q88j290L429R28m161r74L160j79j313K578
1765A990L29m938r10N465K066l823j445J405r06m22L143J037l187j796J165P00
1781a27J276K218j656m982k5M776J405k305l69r7k750K42M709J732l975k992O60
1798b260J174J994K431j322m684q60L383J852l9L20k197m064R90O212K030m195
1814G65l019K44L76J682L531p0m950k724K515K987J682L61k925m944N07O165K767
1831D950l166k884p19q15J532M626J523m861m796R44L879L094O68l197m950m46
1847d618M877L405r67k181k530k410J716N958K588m790n350j08L472L600J597
$$ plain form
1862 4259 1998 -3031 -5089 -1780 2828 4216 2488 -1886 -5494 -3619 2886 5747 2012 -2790 -3985
1877 -3985 -2374 1194 4901 4300 -1602 -5777 -3243 2121 4888 3618 -801 -5085 -4138 1672 5252
1892 5252 3139 -1099 -3757 -4304 -1186 4592 6025 -289 -6307 -4572 1166 4217 3401 511 -3667
1907 -3667 -5210 -1264 4235 4926 751 -3794 -5260 -2220 3688 6171 1222 -5144 -5184 -483 3127 3684
1923 3684 2216 -2050 -5852 -3528 3436 6401 2107 -3520 -4887 -2292 2218 5152 3258 -2505 -5532
1938 -5532 -2735 2361 4877 3442 -1224 -5508 -4428 1816 5882 3195 -2167 -4449 -3164 207 4118
1953 4118 4815 -34 -5502 -4780 909 4831 3655 -660 -4356 -4327 -17 4231 4065 49 -3757 -4529
1969 -4529 -1595 3402 5344 984 -4774 -5016 -304 3567 3770 1200 -2685 -4730 -2004 3040 4665
$$ packed form
1862D259k261n029k058L309M608J388j728m374l608J875O505K861l735m802j195
1877c985J611L568L707o01n902m175K534N364K767j270m419m284R47N810L580
1892E252k113m238k658n47L118N778J433o314o018J735N738L051q16k890m178
1907c667j543L946N499O91m175m545j466L040N908K483m949o366m0M701L610N57
1923C684j468m266l802K324O964K965m294n627j367K595M510K934j894n763l027
1938e532K797N096K516j435m666m284J080O244M066k687n362k282J285L371L911
1953D118O97m849n468P22N689L922j176m315l696K9M310M248j66m016l806p72
1969d529K934M997J942m360n758k42M712L871K03k570l885k045K726N044J625
$$ plain form
1984 4665 1561 -2629 -4568 -2577 2646 5400 2079 -3415 -4169 -1003 1731 3330 3151 -977 -5437
1999 -5437 -3426 3009 5269 1752 -1804 -3122 -3012 106 4535 3972 -1680 -4541 -2138 818 2343
2014 2343 3337 1043 -4231 -4864 1213 4880 1796 -1628 -1940 -2411 -1835 2457 4971 444 -4648 -3089
2030 -3089 949 2124 2047 1558 -1811 -4626 -1410 3730 3419 -479 -1859 -1686 -1726 613 3952 2369 -2850
2047 -2850 -3978 4 2424 1645 863 -10 -2413 -2501 1501 4131 1463 -2317 -2477 -644 686 2089
2063 2089 2490 -184 -3330 -2266 1482 2804 1022 -587 -1390 -2076 -950 2376 3211 -597 -3339 -1398
2079 -1398 1272 1225 565 613 -784 -2635 -1021 2425 2214 -672 -1618 -871 -743 324 2375 1450 -2125
2096 -2125 -2587 660 1698 32 139 820 -964 -2173 805 3139 465 -2155 -686 1039 161 20
$$ packed form
1984D665l104m190j939J991N223K754l321n494p54L166K734J599j79m128m460
1999e437K011O435K260l517l556j318J10L118M429n63n652k861K403K956J525
2014B343R94k294n274o33O077L667l084l424l12m71N76M292K514m527n092J559
2030c089M038J175p7m89l369k815L216N140l11l898j380J73m0K339L339j583n219
2047b850j128L982K420p79p82q73k403q8M002K630k668l780j60J833J330J403
2063B089M01k674l146J064L748J322j782j609q03o86J126L326Q35l808k742J941
2079a398K670m7o60M8j397j851J614L446k11k886r46P47J28J067K051r25l575
2096b125m62L247J038j666J07O81j784j209K978K334k674k620J469J725q78j41
$$ plain form
2112 20 1442 476 -1822 -928 1568 1427 -271 -303 -39 -913 -447 1649 1431 -1156 -1564 359 760 -298
2130 -298 254 1116 -572 -2097 -150 1997 492 -1638 -583 839 -117 -981 412 1149 -584 -1491 -96
2147 -96 885 100 -171 187 -318 -642 433 853 -425 -683 792 671 -1049 -621 1398 788 -1276 -463
2165 -463 1540 554 -1518 -331 1765 609 -1371 -477 909 338 -395 266 504 -489 -601 183 347 -36
2183 -36 227 0 -857 -666 839 906 -583 -997 5 197 -434 108 1003 -7 -1712 -964 1212 1093 -655
2202 -655 -1028 -18 271 -291 81 763 11 -1133 -655 570 888 343 -232 -812 -803 522 1471 380 -960
2221 -960 -566 394 -9 22 1361 783 -1676 -1832 1161 2429 175 -1536 -464 267 -396 99 1548 675
2239 675 -1691 -1778 289 1465 908 -70 -965 -1617 -739 1415 1683 -260 -1528 -970 -455 -2 1443 1599
$$ packed form
2112B0J422r66k298Q94K496j41j698l2K64q74M66K096k18k587m08J923M01j058
2130b98N52Q62j688j525J947K147j505k130J055J422r56q64J393P37j733r07J395
2147i6R81p85k71L58n05l24J075M20j278k58J475j21j720M28K019o10k064Q13
2165d63K003r86k072J187K096j156j980Q94J386n71p33O61K38r93j12P84J64l83
2183c6K63k27q57J91J505O7j489m14J002J92o31N42Q95j010j705P48K176j19j748
2202f55l73J010K89n62L72O82p52j144M78J225L18n45n75n80RJ325R49j091j340
2221i60L94R60m03L1J339n78k459j56K993J268k254j711J072P31o63M95J449q73
2239F75k366q7K067J176n57r78q95o52Q78K154K68j943j268N58N15M53J445J56
$$ plain form
2257 1599 -1006 -2839 -639 2101 1194 -629 -322 -223 -1487 -583 2329 1942 -1381 -2136 -76 778 626
2274 626 1458 718 -2243 -2144 1578 2532 -183 -935 395 -830 -1822 1607 3649 -412 -3715 -664 2253
2291 2253 566 -396 1218 -71 -2963 -989 2913 2023 -1159 -1377 -662 -1152 500 3060 1009 -3033
2307 -3033 -2353 1054 1166 204 1193 291 -2966 -2330 2255 3203 -282 -1876 -823 -757 -267 2144 2294 -1085
2325 -1085 -2790 -676 1186 1366 1510 537 -2142 -2507 1023 3107 1234 -1084 -1141 -767 -243 1421 2418
2342 2418 446 -2152 -1955 250 2051 1993 74 -2048 -1768 369 1706 1382 411 -1023 -2090 -973
2358 -973 1753 2630 360 -1916 -2022 -479 1393 2101 720 -1569 -2123 -668 1079 1855 1250 -803 -2598
2375 -2598 -1408 1595 2429 718 -1007 -1650 -1091 495 2247 1879 -640 -2205 -1428 632 2234 2029
$$ packed form
2257A599k605j833K200K740r07j823L07R9j264R04K912l87l323p55K060Q54j52
2274F26Q32p40k961R9L722R54k715p52J330j225r92L429K042m061l303L051K917
2291B253j687r62J614j289k892J974L902q90l182k18P15m90J652K560k051m042
2307c033O80L407J12r62R89r02l257O36M585R48l485j594J053O6M90K411J50l379
2325a085j705K114J862J80J44r73k679l65L530K084j873k318n7L74N24J664R97
2342B418j972k598J97K205J801n8j919k122K80K137J337l24r71j434j067J117
2358i73K726Q77k270k276j06J543J872P08j381k289n54J455J747P76o05k053j795
2375b598J190L003Q34j711j725o43N59J586J752l68k519j565P77K060J602k05
$$ plain form
2391 2029 -341 -2345 -1438 975 2081 1320 113 -1271 -1862 -213 2173 2215 105 -1807 -1826 -104 1993
2408 1993 2158 -31 -1893 -1390 100 941 1563 1180 -1228 -2830 -779 2147 1922 -242 -1248 -1468 -1008
2425 -1008 914 2325 842 -1718 -1746 -281 526 1450 1716 -517 -2776 -1151 1942 1798 113 -334 -823
2442 -823 -1667 -130 2637 1979 -1190 -1948 -361 605 1170 1688 305 -2064 -1466 1039 1719 822 277 -743
2460 -743 -1932 -635 2112 2121 -644 -1796 -792 -5 624 1541 688 -1391 -1861 -171 1054 1076 584 -803
2478 -803 -2012 -850 1515 1586 -318 -1078 -793 -740 198 1530 1090 -1054 -1767 -444 806 1122 899 -397
2496 -397 -1716 -766 1069 1276 402 -92 -535 -1211 -100 1785 1301 -778 -1252 -231 217 637 1183 230
2514 230 -1351 -1097 500 900 402 281 -419 -1480 -504 1477 1186 -720 -994 -134 -405 -118 1094 850
$$ packed form
2391B029k370k004R07K413J106p61j207j384n91J649K386M2k110j912j9J722K097
2408A993J65k189j862N03J490Q41O22l83k408j602K051K926k25k164j006k20M60
2425a008J922J411j483k560k8J465Q07R24K66k233k259J625L093j44j685m47m89
2442h23q44J537K767o58l169p58J587R66N65N18j383k369N98K505O80q97n45j020
2460g43j189J297K747Rk765j152J004P87O29R17q53k079m70J690J225K2m92j387
2478h03j209J162K365P1j904p60K85N3R38J332m40k144p13J323J250L16k23j296
2496c97j319R50J835K07q74m94m43o76J111J885m84k079m74J021M48M20N46r53
2514B30j581K54J597M00m98j21p00j061R76J981k91j906k74Q60k71K87J212k44
$$ plain form
2532 850 -1159 -1462 29 672 176 173 -163 -1186 -728 817 722 -376 -464 -69 -672 -495 1125 1064 -818
2551 -818 -1281 168 715 181 285 331 -572 -859 335 763 201 -30 -114 -596 -283 854 929 -530 -822 252
2571 252 204 -274 309 695 -327 -863 2 577 112 -103 -190 -579 -370 373 352 -370 -346 35 -437 -616 464
2592 464 666 -464 -909 -2 413 -263 -138 304 -140 -490 35 386 -15 -38 198 -237 -367 407 506 -310
2612 -310 -506 369 353 -411 -134 670 301 -580 -202 534 195 -192 87 105 -56 28 177 20 -3 209 -65
2633 -65 -456 -99 384 14 -462 -123 273 -98 -428 25 235 -180 -460 -246 169 220 -5 -284 -203 125 101
2654 101 -174 -9 194 33 -448 -237 396 351 -120 -250 -46 85 184 204 170 -18 -66 -30 -6 293 614 46
2676 46 -526 -213 536 452 -204 -76 285 -133 -423 177 750 -11 -607 -252 316 190 39 202 -146 -563 -321
$$ packed form
2532H50k009l03J491O43m96ll36j023M58J545r5j098q8L95o03J77J620o1j882
2551h18m63J449N47n34J04M6r03k87J194M28n62k31q4m82L13J137P5j459k92J074
2571B52m8m78N83L86j022n36Q65N75m65k15q7l89K09P43k1p22K4L81m72j79J080
2592D64K02j130m45R07M15o76J25M42m44l50N25L51m01k3K36m35j30P74R9q16
2612c10j96Q75j6p64K77Q04l69q81L78P36l39l87K79J8j61Q4J49j57k3K12k74
2633f5l91L57M83l70m76L39L96l71l30M53K10m15k80K14M15N1k25k79Q1L28k4
2654A01k75J65K03j61m81K11O33m5m71j30K04J31R9K0l4j88m8L6K4K99L21n68
2676D6n72L13P49q4o56J28L61m18k90O00N73p61n96L55N68j26j51J63l48m17K42
$$ plain form
2697 -321 353 171 -128 42 -160 -607 -37 804 218 -823 -496 409 39 -418 283 511 -501 -897 282
2716 282 872 131 -387 -76 -167 -208 392 632 -78 -481 118 263 -138 446 802 -277 -1140 37 1163 482
2736 482 -483 -148 56 -391 -31 900 541 -612 -857 -26 350 480 353 -298 -804 -384 416 541 184 -143
2756 -143 -581 -807 -137 710 700 -277 -914 -582 231 710 445 -175 -493 -495 -313 403 1018 432 -820 -977 233
2777 233 835 369 91 -36 -613 -626 549 1121 57 -574 -419 -229 69 1009 884 -759 -1407 237 1048
2796 1048 166 -35 284 -570 -1305 229 1756 608 -1234 -904 -14 43 474 948 -141 -1632 -811 675
2814 675 825 286 25 -698 -1476 -205 1552 1156 -816 -1230 -454 -6 380 1116 666 -958 -1402 -136
2832 -136 1162 1055 154 -778 -1062 -348 766 1171 417 -607 -1095 -531 734 1261 554 -561 -1146 -548
$$ packed form
2697c21O74j82k99J70k02m47N70Q41n86j041L27R05l70m57P01K28j012l96J179
2716B82N90p41n18L11r1m1O00K40p10m03N99J45m01N84L56j079q63J177J126o81
2736D82r65L35K04m47L60R31l59j153k45Q31L76J30j27o51n06M20Q00J25l57l27
2756a43m38k26O70Q47j0r77o37L32Q13M79k65o20l18kJ82P16O15n86j252j57J210
2777B33O02m66k78j27n77j3J175N72j064o31J55J90K98R40j25j643o48J644Q11
2796A048q82k01L19q54p35J534J527j148j842L30Q90N7M31M74j089j491Q21J486
2814F75J50n39k61p23p78J271J757l96j972m14P76M48L86P36m50j624m44J266
2832a36J298j07r01r32k84P14J114M05p54j024m88N64J265N27p07j115n85N98
$$ plain form
2850 -548 613 1315 533 -762 -1050 -225 339 609 782 -32 -1438 -1236 747 1619 246 -861 -810 -635
2868 -635 -169 1050 1277 -502 -1711 -794 505 765 825 109 -1332 -1652 357 1715 780 -654 -785 -730
2886 -730 -445 835 1758 385 -1390 -1313 190 1067 1198 427 -831 -1421 -179 1033 1145 457 -497 -1283
2904 -1283 -782 868 1589 384 -894 -1140 -509 420 1279 760 -822 -1220 -325 366 766 917 17 -1710
2922 -1710 -1391 965 1634 13 -796 -455 -725 -530 1212 1593 -714 -1898 -433 753 437 685 557
2939 557 -1158 -1786 485 1941 425 -749 -135 -488 -938 872 2290 235 -2065 -883 937 654
2955 654 374 862 -237 -1718 -458 1652 1287 -260 -520 -577 -838 337 1833 643 -1375 -1114 267
2972 267 452 310 808 27 -1409 -1027 808 1258 222 -559 -888 -784 179 1170 532 -616 -865 -445 -39
$$ packed form
2850e48J161P02p82j295k88Q25N64K70J73q14j406K02J983Q72j373j107N1J75
2868f35M66J219K27j779j209R17J299K60O0p16j441l20K009J358r35j434j31N5
2886g30K85J280R23j373j775P7J503Q77J31p71j258n90J242J212J12o88r54p86
2904a283N01J650P21j205j278k46O31R29Q59n19j582l98Q95O91M00J51r00j727
2922a710L19K356O69j621q09L41k70J95J742L81k307j184J465J186l16K48j28
2939E57j715o28K271J456j516j174O14l53m50J810J418k055k300J182J820k83
2955F54k80M88j099j481J260K110l65j547k60n7k61J175J496j190k018K61J381
2972B67J85j42M98p81j436L82J835M50j036p81l29J04R63R91o38j148k49M20M06
$$ plain form
2991 -39 698 931 -55 -1208 -761 498 773 548 61 -698 -710 260 1031 554 -81 -289 -621 -344 930 1344
3011 1344 -166 -1193 -268 547 322 476 661 -307 -1215 -175 1120 700 -110 -322 -538 -550 415 1216 57
3030 57 -936 -317 64 -190 291 873 -150 -1368 -614 837 529 -172 -153 -416 -621 61 891 332 -464 -239
3050 -239 -172 -374 394 947 27 -1108 -272 694 342 -110 261 34 -600 -192 779 512 -198 -136 -70 -263 259
3071 259 853 80 -722 -93 520 -29 -128 533 185 -922 -346 760 457 -392 -150 82 -266 -196 486 225
3091 225 -498 -227 121 -153 -79 589 124 -786 -381 490 224 -445 -28 281 -272 -422 413 517 -150 -222 -33
3112 -33 -84 -33 362 130 -326 -155 247 59 -152 249 364 -227 -331 267 437 -26 -151 68 12 -23 119 38
3134 38 -5 49 7 -184 -30 398 116 -366 -171 181 -24 -243 10 124 -235 -238 -2 79 2 -20 -171 -417 12
$$ packed form
2991c9P37K33r86j153M47J259K75k25m87p59j2R70P71m77o35k08l32K77J274M14
3011A344j510j027R25Q15k25J54J85r68r08J040J295m20q10k12k16j2R65Q01j159
3030E7r93O19L81k54M81N82j023j218P54J451l08p01J9k63k05O82Q30n59p96K25
3050b39O7k02P68N53r20j135Q36R66l52m52L71k27o34M08R71k67p10O2O6j93N22
3071B59N94p73q02O29O13n49r9O61l48j107N76J106l03q49K42K32l48P0O82k61
3091B25p23K71L48k74P4O68m65r10M05Q71k66o69M17L09n53j50Q35J04o67p2J89
3112c3n1N1L95k32m56J71M02j88k11M01J15n91j04N98J70m63j25K19n6l5J42q1
3134C8m3N4m2j91J54M28k82m82J95L52k05k19K53J14l59lK36Q1p7k2j51k46M29
$$ plain form
3157 12 322 -114 -330 24 129 -291 -251 312 293 -358 -316 226 211 -51 85 119 -112 -78 189 179 -85 185 145
3180 145 -243 -103 481 327 -338 -274 280 87 -242 87 288 -123 -329 129 310 15 -67 -91 -233 -118 201
3201 201 99 -246 -161 114 -87 -328 13 251 -178 -497 41 210 -86 -217 -116 -91 -141 19 47 -86 25
3222 25 -33 -136 -124 204 218 -133 -228 203 189 -76 -20 148 130 -116 28 96 63 -8 -38 48 76 186 28 -164 34
3247 34 166 24 -122 76 71 -9 -114 19 36 -41 -138 -75 117 8 -61 -218 -118 39 106 -45 -90 -19 -67 -163 -25
3272 -25 109 49 -209 -203 62 179 7 -107 -126 -32 158 115 57 88 -27 -181 -42 294 330 -15 -298 -51 165
3295 165 274 193 25 -135 -89 -10 163 218 124 -133 -352 -10 424 326 -201 -281 -158 11 42 239 148 -285 -422
3318 -422 -49 221 358 33 -295 -429 -126 284 302 -94 -252 -267 -213 17 399 288 -313 -529 -127 362 377
$$ packed form
3157A2L10m36k16L54J05m20M0N63j9o51M2N42j5k62J36L4k31L4K67j0k64K70m0
3180A45l88J40N84j54o65O4N54j93l29L29K01m11k06M58J81k95q2k4j42J15L19
3201B01j02l45Q5K75k01k41L41K38m29l19N38J69k96j31J01K5n0J60K8j33J11
3222B5n8j03J2L28J4l51r5M31j4k65N6J68j8k46J44O8l3p1l0Q6K8J10j58j92J98
3247C4J32j42j46J98nq0j05J33J7p7r7O3J92j09o9j57J00J57O7j51m5P1m8r6J38
3272b5J34o0k58OK65J17j72j14j9R4J90m3n8L1j15j54J39L36L6l45k83K47K16
3295A65J09q1j68j60M6P9J73N5r4k57k19L42M34r8n27q0J23J69L1J97r1m33j37
3318d22L73K70J37l25l28j34L03M10J8l96j58j5N4K30L82j11o01k16M02M89J5
$$ plain form
3339 377 124 -205 -338 -192 244 400 257 -92 -337 -317 203 631 378 -283 -533 -154 166 409 316 2 -417
3360 -417 -368 113 497 411 -75 -595 -489 141 592 277 -282 -396 -229 -40 289 539 74 -660 -619 57 513
3381 513 361 -86 -421 -575 -101 527 475 -24 -495 -426 -89 388 697 290 -626 -712 42 617 526 26 -238
3402 -238 -499 -276 298 832 314 -414 -654 -206 434 577 287 -430 -674 -281 391 553 247 -196 -617 -459
3422 -459 198 717 388 -368 -724 -283 243 460 251 -190 -539 -544 50 638 420 -168 -689 -384 198 584 348
3443 348 -206 -597 -387 67 510 461 -63 -568 -471 16 626 682 16 -609 -493 101 604 479 55 -321 -490
3464 -490 -241 468 722 118 -562 -528 -51 418 480 201 -344 -538 -184 427 469 172 -329 -535 -332 184 608
3485 608 219 -439 -605 -185 190 375 209 -112 -503 -404 213 544 189 -281 -418 -195 175 378 287 -197 -412
$$ packed form
3339C77k53l29j33J46M36J56j43l49k45K0N20M28k53o61k50L79L20K43r3l14m19
3360d17M9M81L84q6m86n20J06O30M51l15n59j14J67J89L29K50m65p34M1O76M56
3381E13j52m47l35j54M74O28n2m99m71O9L37M77L09m07r16q6P54N75r1n00k64
3402b38k61K23N74N34n18p28k40M48O40J43k90p17k44L93O72J62l06m43m21J58
3422d59O57N19l29p56l56M41N26K17k09m41l49nN94N88k18n88n21L05N82L86k36
3443C48n54l91K10M54M43m9n24n05R7M87O10N6o66o25J16N94N03j25m24l76j69
3464d90K49P09K54o04o80L4M77M69O2k79n45j94L54O11M2k97n01k06K03N16M24
3485F08l89o58j66M20L75J85j66l21l91R9O17L31l55m70j37K23L70K03r1m84k15
$$ plain form
3506 -412 -233 218 366 320 14 -451 -412 128 657 337 -204 -318 -166 78 323 392 48 -370 -359 58 348
3527 348 379 61 -375 -348 55 362 201 -97 -164 -323 -160 164 343 67 -273 -372 -90 200 216 44 -234 -284
3549 -284 -109 39 123 88 -95 -306 -176 105 319 109 -190 -154 -7 115 126 104 -5 -80 -53 58 124 144 49
3572 49 -114 -29 118 202 -22 -149 25 80 6 -8 137 55 -107 -104 28 117 -41 -16 -63 49 38 -45 -36 -1 103 -81
3598 -81 -100 -4 39 -58 -99 -38 45 -30 -103 -53 81 90 -107 -228 -52 164 111 -68 -4 69 -59 -91 192 311 -7 -198
3624 -198 -105 35 98 299 85 -151 -242 49 220 74 124 99 -225 -253 239 452 102 -339 -176 42 -28 112
3646 112 323 -77 -499 -220 158 268 19 -29 -276 -354 53 380 13 -306 -217 -117 30 137 353 -12 -486
3667 -486 -332 231 416 128 -124 -177 -182 142 407 263 -29 -240 -188 17 286 486 -11 -451 -257 159 349
$$ packed form
3506d12J79M51J48m6l06m65L9N40N29l20n41j14J52K44K45O9l44m18J1M17K90
3527C48L1l18m36K7M03L07j61k98o7j59J63L24J79k76l40r9K82K90J6j72k78n0
3549b84J75J48Q4l5j83k11J30K81K14k10k99L6J47J22J1k2j09p5K7J11O6K0r5
3572D9j63Q5J47Q4k24j27J74N5p4j4J45q2j62LJ32Q9j58K5m7J12j1q3RL5J04j84
3598h1j9R6M3r7m1O1Q3p5p3N0J34Rj97j21J76K16n3j79O4P3j28l2K83J19l18j91
3624a98R3J40O3K01k14k36r1K91J71j46N0k5l24k8M92K13l50m41J63K18p0J40
3646A12K11m00m22K79L78J10k49m8k47p8M07L27l67l19Q9J00J47J07K16l65m74
3667d86J54N63J85k88k52n3nL24K65j44k92k11N2K05K69K00m97m40J94M16J90
$$ plain form
3688 349 247 32 -238 -346 42 359 398 173 -274 -440 -197 310 505 32 -430 -300 -86 154 335 288 -250
3709 -250 -610 -214 373 410 96 -190 -475 -320 213 511 83 -349 -392 -174 72 367 420 -181 -608 -277 352
3730 352 376 141 -83 -327 -382 136 582 325 -210 -298 -142 37 468 449 -140 -644 -219 354 339 206 91 -278
3752 -278 -472 2 545 357 -192 -400 -304 -110 366 437 -129 -486 -325 79 217 252 178 -296 -691 -181 463
3773 463 377 -167 -305 -312 -239 169 485 158 -371 -335 -71 157 317 276 -193 -572 -117 550 464 -19 -97 -83 -274
3796 -274 103 569 309 -254 -419 10 156 221 300 -115 -486 -246 299 353 49 -89 -202 -300 -15 446 337
3817 337 -288 -409 -67 123 118 222 -51 -365 -305 109 275 169 -73 -255 -297 -75 400 245 -140 -208 -77 18
3839 18 149 228 5 -210 -274 119 270 206 39 -191 -215 42 337 200 -66 -60 -65 -141 126 324 179 -207 -203 85
$$ packed form
3688C49j02k15k70j08L88L17L9k25m47j66K43N07J95m73m62J30K14K40J81m7n38
3709b50l60L96N87L7l14k86k85J55N33K98m28m32m3K18K46K95N3o01m27L31O29
3730C52K4k35k24k44n5N18M46k57n35q8J56J79M31j9n89n04M25N73j5j33j15l69
3752b78j94M74N43j88n49k08R6J94M76P1n66l57J61M04J38L5p4m74l95N10O44
3773D63q6n44j38pP3M08L16l27n29L6K64K28J60m1m69l79M55O67q6m83p8J4j91
3796b74L77M66k60n63j65M29J46O5P9m15l71K40N45N4l04j38j13r8K85M61j09
3817C37o25j21L42J90nJ04k73l14O0M14J66j06k42j82m2K22M75j55l85o8J31R5
3839A8J31P9k23k15o4L93J51o4j67k30k4K57K95j37k66Onp6K67J98j45l86MK88
$$ plain form
3863 85 185 160 114 -77 -216 -35 155 102 -71 -113 -138 -167 93 288 50 -264 -188 12 24 -6 69 -48 -260 -100
3887 -100 78 50 -88 -34 -174 -81 92 249 -11 -232 -76 79 39 -5 156 111 -105 -82 175 216 45 -17 50
3910 50 -39 67 165 -19 -152 46 87 -31 7 140 62 -175 -16 193 101 -111 -9 4 -61 -58 69 78 -8 -141 -18
3935 -18 45 -1 51 -94 -220 -99 152 4 -159 -73 -34 -9 -10 84 -19 -87 -112 77 106 91 32 -85 -65 78 121 38
3961 38 -13 96 21 5 69 173 95 -147 -62 131 105 22 11 -79 -39 59 31 -7 -70 27 -82 -49 46 186 -32 -98 -44
3988 -44 -6 -3 -17 -3 -43 -113 -23 25 -3 -54 -78 -128 -25 52 44 -53 -154 -49 15 -32 21 69 76 -75 -55 65 79 71 -104
4017 -104 2 -48 94 203 24 -15 2 37 -39 47 88 53 -99 -44 134 44 -45 -57 59 -8 -65 17 50 -11 -40 -91
4043 -91 -42 35 38 -30 -33 -32 -10 11 -18 24 5 -70 -103 -67 21 -17 -73 -39 -29 -29 0 44 74 50 21 -117 42 80 56 -1 -16
$$ packed form
3863H5J00k5m6j91j39J81J90n3j73m2k5k9K60J95k38l14P6K00J2l0P5j17k12J60
3887a00J78k8j38N4j40R3J73J57k60k21J56J55m0m4J61m5k16K3K57M1j71o2O7
3910E0q9J06R8j84j33J98M1j18L8J33p8k37J59K09r2k12J02J3o5LJ27Rq6j33J23
3935a8O3m6N2j45j26J21K51j48j63Q6L9K5jR4j03o8k5J89K9j5n9j17K0J43M3q3
3961C8n1J09p5j6O4J04p8k42Q5J93k6q3j1r0M0R8k8l8o3R7j09L3R5J40k18o6N4
3988d4L8Lj4J4m0p0R0M8k8n1k4n0J03P7qr7j01J05O4m7N3M8Pj51K0J20J4qj75
4017a04J06n0J42J09j79l9J7L5p6Q6M1l5j52N5J78r0q9j2J16o7n7Q2L3o1k9n1
4043i1M9P7Lo8lJK2K1k9M2j9p5l3L6Q8l8n6L4J0%K9M4L0k4k9j38J59L8k4n7j5
$$ plain form
4074 -16 33 46 19 101 34 68 -70 -21 18 143 73 -52 -129 44 102 56 55 25 -56 -80 -29 49 37 -48 -70 -116 24 47
4102 47 44 -7 -89 -39 8 19 127 -14 -64 -110 -79 84 40 -28 -126 -97 -22 -7 138 60 -82 -86 -119 51 201 118 -53
4129 -53 -136 -115 150 154 90 -3 -112 -56 58 180 152 -62 -181 -73 93 147 129 -65 -120 -113 54 125 111 51 -127 -246
4155 -246 -50 135 166 -20 -190 -187 -3 113 102 21 -128 -264 -1 107 110 31 -198 -308 -105 136 194 36 -162
4178 -162 -183 -91 133 213 130 -82 -231 -35 188 170 61 -117 -238 -95 112 318 141 -66 -236 -147 126 255
4200 255 140 -4 -265 -150 104 273 111 -71 -187 -176 -12 190 224 -8 -270 -242 37 255 187 -52 -254
4221 -254 -210 -43 198 129 29 -249 -267 -83 156 200 11 -227 -266 -65 194 276 35 -140 -222 -74 166 294
4243 294 199 -93 -305 -34 189 318 137 -140 -199 -111 190 241 105 -87 -267 -136 81 242 168 -107 -311 -182
$$ packed form
4074a6M9J3k7Q2o7L4j38M9L9J25p0j25p7J73N8m6jl0q1k4N1P8j2q5k2m6J40K3
4102D7ln1q2N0M7J1J08j41n0m6L1J63m4o8r8K9P5J5J45p8j42ml3J70J50q3j71
4129e3q3K1K65Mo4r3j09N6J14J22k8k14j19J08J66N4j8j94n5PJ67P1j4o0j78j19
4155b46J96J85L1j86j70LJ84J16j1q1j49j36K63J08Lp9k29j10K03K41N8j58j98
4178a62k1R2K24Q0q3k12j49J96K23j8j09j78j21J43K07K06j77k07j70Q9K73J29
4200B55j15j44k61J15K54J69j62j82j16J1J64K02L4k32k62K8K79K18o8k39k02
4221b54M4J67K41o9j00k78j8J84K39M4j89k38l9K01K59Q2k41j75q2J48K40J28
4243B94r5k92k12K71K23J29j81k77n9Q8L01N1j36j92j80J31K17J61p4k75k04J29
$$ plain form
4265 -182 93 262 154 -89 -220 -228 -57 190 227 -68 -279 -247 -1 189 170 17 -180 -181 -59 242 295 2 -176
4288 -176 -197 23 232 275 58 -228 -220 49 200 257 129 -122 -217 -197 85 266 140 -176 -281 -103 134 234
4310 234 60 -72 -241 -100 126 189 167 -77 -204 -194 113 216 160 -139 -302 -105 84 115 135 -37 -321 -217
4332 -217 38 266 164 -110 -269 -154 9 171 158 -88 -181 -129 27 122 150 76 -173 -198 -12 302 182 -6
4354 -6 -140 -160 -1 95 201 39 -103 -182 -51 167 216 91 -144 -138 -83 186 141 64 -34 -125 -101 8 231 86 -137
4379 -137 -191 -81 91 94 53 -33 -204 -41 30 154 65 -7 -170 -151 47 228 92 -141 -174 -56 34 108 154 54
4403 54 -132 -136 5 155 126 -14 -138 -98 15 260 176 -30 -98 -34 43 42 153 82 -101 -138 12 129 100 6 -79
4428 -79 -108 -18 68 58 -35 -73 -44 -77 12 48 -29 -117 -137 46 23 -12 15 -4 -129 -60 -9 138 51 -92 -79 -78 27 162
$$ packed form
4265a82K75J69j08k43j31qJ71K47L7k95k11L2K46J90j9j53j97jJ22L01N3k93j78
4288a76k1K20K09M3k17k86QK69J51N7j28k51r5K0K82J81j26l16j05J78K37J00
4310B34j74j32j69J41K26O3k2k44j27J0L07J03n6k99j63J97J89L1K0j72k84J04
4332b17K55K28j02k74j59J15J63J62j3k46r3N2J56R5K8p4k49k5J86L14j20j88
4354fj34k0J59R6J06j62j42p9J31K18M9j25k35ON5K69m5p7r8r1K4J09K23j45k23
4379a37n4J10J72Lm1q6j71J63P1J24q9p2j63J9J98J81j36k33l3J18R0P4M6j00
4403E4j86mJ41J50k9j40j24M0J13K45q4k06o8O4P7jJ11p1j83l7J50J17k9r4q5
4428g9k9R0Q6j0r3l8K9l3Q9L6p7q8k0J83k3l5K7j9j25O9N1J47q7j43J3JJ05J35
$$ plain form
4456 162 48 -68 -51 80 84 -39 41 56 -118 -75 90 120 -32 -30 8 -42 -3 96 -10 -65 -37 48 -1 29 81 115 -81
4483 -81 -64 98 120 -96 -78 38 45 -21 46 -11 -47 -53 -44 -60 -68 -13 -31 -86 -143 62 108 -118 -58 27 17 -91 -10 84 -14
4512 -14 -102 39 79 89 85 -5 -16 45 38 72 7 31 103 -23 5 11 127 -74 -75 23 38 44 -11 2 -66 10 50 -37 -15 82 29
4543 29 -79 -45 75 15 -113 -100 49 57 -65 -24 78 -3 -68 -38 19 4 -75 -1 -27 -41 -57 -6 -106 -7 67 -4 -72
4570 -72 65 165 -29 -60 45 80 33 -25 -39 15 58 78 -17 -42 26 83 5 -66 57 94 -31 -93 147 78 -68 -31
4596 -31 40 56 -60 -7 16 -61 -36 17 -29 -50 -7 7 -98 -46 63 -28 -104 -81 41 -49 -64 22 63 -53 -126 50 26
4623 26 -21 3 15 -26 -37 70 17 -150 65 96 15 -42 -10 9 -2 -17 129 48 -76 -71 19 66 35 56 -106 -71 76
4650 76 112 20 28 42 -144 -83 -1 184 12 -99 -114 -34 -8 67 78 -69 -143 -62 59 33 111 37 -139 -116 53 226
$$ packed form
4456A62j14j16J7J31Mj23Q0J5j74M3J65L0j52KL8n0L9R9j06n5K8Q5m9L0N2L4j96
4483h1J7J62K2k16J8J16Po6O7n7l6oRj6qN5j8n5n7K05M6k26O0Q5j0j08Q1R4r8
4512a4q8J41M0J0mr0j1O1pL4o5K4P2j26K8OJ16k01jR8J5On5J3o8P6M0q7K2R7n3
4543B9j08L4J20o0j28J3J49Qj22M1J02q1o5L0N7j5p9P4k6j4j6N1j00R9P4p1o8
4570g2J37J00j94l1J05L5m7n8j4N4M3K0r5k5O8N7p8p1J23L7j25o2K40o9j46L7
4596c1P1J6j16N3K3p7K5N3m6k1M3J4j05N2J09r1p6K3J22r0j5Q6M1j16p3J76k4
4623B6m7K4J2m1j1J07n3j67K15L1q1n7L2J9j1j5J46q1j24NR0M7l1K1j62L5J47
4650G6L6r2QJ4j86O1Q2J85j72j11j5Q0K6P5J1j47p4Q1J21k6P8p4j76K3J69J73
$$ plain form
4676 226 10 -159 -99 -39 39 101 223 5 -164 -123 35 130 196 69 -199 -147 64 235 94 -121 -44 -81 -91 44
4700 44 295 60 -214 -109 61 115 153 33 -117 -166 -28 238 103 43 -123 -227 -149 186 307 48 -237 -279
4722 -279 -26 76 97 64 -87 -343 -223 152 305 42 -146 -276 -145 109 282 158 -226 -258 -53 -7 248
4743 248 270 27 -342 -250 247 383 222 -139 -191 -169 77 343 233 -45 -251 -149 -1 284 303 20 -291 -340
4765 -340 125 313 166 -30 -240 -294 -114 281 323 37 -277 -376 -84 259 335 -19 -270 -330 -53 203 276 154
4787 154 -190 -459 -167 282 370 28 -302 -361 -128 180 263 130 -198 -352 -148 147 327 237 -138 -511 -246
4808 -246 295 415 157 -186 -248 -222 90 392 281 -91 -335 -257 57 446 398 -104 -470 -297 166 396 237
4829 237 -122 -299 -343 -66 350 407 -43 -386 -393 -9 307 306 -75 -334 -342 -100 181 323 91 -204 -421 -69 324
$$ packed form
4676B26k16j69O0O0P8O2J22k18j69M1J58R5O6j27k68N2K11J71j41k15P7l7j0J35
4700D4K51k35k74J05J70N4L8j20j50m9J38K66j35o0j66j04P8L35J21k59k85m2
4722b79K53J02K1l3j51k56J20L75J53k63j88j30J31K54J73j24l84l2K05M6K55
4743B48K2k43l69R2M97J36j61l61n2K2K46K66j10k78k06J02J48K85J9k83l11m9
4765c40M65J88j47j96k10n4J80L95M2k86l14r9K92L43P6l54k51o0K77K56P3j22
4787A54l44k69K92M49Q8l42l30n9K33L08Q3j33l28j54K04K95J80r0l75l73K65
4808b46N41J20k58l43o2K6L12L02j11l72k44P8L14L89m8n02l66J73M63K30j59
4829B37l59j77m4K77M16N7m50l43pL84L16jl81k59qK42K81J42k32k95k17L52L93
$$ plain form
4852 324 365 42 -292 -252 -104 166 349 152 -274 -350 -124 204 390 176 -194 -451 -123 323 354 116 -106
4873 -106 -231 -234 42 485 319 -216 -417 -136 194 329 215 -110 -351 -181 95 303 213 -8 -261 -321 -66
4894 -66 371 353 -161 -466 -221 86 160 229 -11 -191 -277 -32 231 273 13 -297 -284 -48 214 276 67 -218 -197
4917 -197 -24 94 218 83 -123 -289 -109 231 326 74 -193 -208 -2 112 160 97 -43 -173 -125 119 281 120
4939 120 -209 -260 -36 127 130 88 -67 -151 -140 33 128 113 21 -209 -174 55 220 113 -98 -186 -11 57 12 30 96
4964 96 -83 -185 -26 194 174 -99 -96 -50 10 2 101 98 -30 -53 -8 47 30 66 50 -83 -96 162 117 -10 -90 58 -18
4991 -18 -66 18 128 40 -147 -50 48 85 -4 4 88 -9 -55 -28 19 27 66 -66 -154 -50 102 101 -39 -8 16 -96 -84 36
5019 36 147 -9 -160 -51 87 135 37 -58 8 -69 -7 75 113 89 -53 -142 -131 103 205 -32 -202 -81 1 22 70
$$ packed form
4852C24M1l23l34M0J48K70J83j97m26p6K26L28J86k14l70k57L28M46L1k38k22
4873a06j25lK76M43j66n35k01K81L30J35j14l25k41J70K76K08r0k21k53o0K55
4894f6M37j8n14l05K45L07P4O9k40j80q6K45K63M2k60l10J3K36K62O2k09k85K1
4917a97J73J18J24j35k06j66J80L40R5k52k67j5K06J14M8o3j40j30M8K44J62j61
4939A20l29n1K24J63Lm2j55q4J1J73R5j5r2k30L5K29J65j07k11q8J75O8m5J8O6
4964I6j79j02J59K20k0k73LM6O0qR9lj28k3M5N5j7L6j6j33j3K58m5j27q0J48p6
4991a8m8Q4J10q8j87R7R8L7q9QQ4r7m6K7M7QL9j32q8J04J52jj40L1K4j12J2J20
5019C6J11j56j51J09J38M8r8r5O6p7O2Q2L8k4j42q9J1K34J02k37j70J21Q2K1M8
$$ plain form
5044 70 12 52 -78 -130 -1 208 166 -199 -205 -77 151 120 11 -120 -111 -58 12 68 196 -36 -313 -181 69 211
5068 211 204 -42 -200 -95 66 89 62 64 -102 -193 -120 129 312 -8 -181 -186 32 129 146 30 -168 -154 -34 160
5092 160 213 40 -122 -295 -69 217 175 21 -153 -152 -92 69 95 92 -89 -226 -145 136 232 88 -197 -173 -55 139
5116 139 137 86 -31 -178 -243 17 212 114 -127 -262 -137 181 207 34 -95 -171 -35 26 93 135 75 -101 -252 24
5140 24 360 177 -101 -270 -41 70 91 111 46 -106 -128 -5 195 209 35 -126 -199 -24 211 16 -143 -105 -46
5163 -46 -61 25 84 50 -123 -180 -14 147 142 29 -163 -86 -29 24 59 -64 -38 -148 -58 72 180 -5 -172 -118 -19
5188 -19 136 4 -90 0 -90 -29 71 36 105 -71 -135 -44 106 194 -76 -181 37 162 42 46 48 5 -83 -17 88 36
5214 36 31 -53 -43 99 114 80 -183 -99 66 67 -69 -75 71 -65 -119 41 112 -9 -79 -144 -37 169 49 -4 -106 -128
$$ packed form
5044G0n8M0j30n2J29K09m2l65oJ28K28l1j09j31RN3P0N6J28k32k77J32K50J42
5068B11pk46j58J05J61K3k7Kj66r1P3K49J83l20j73nK18R7J7j16j98J4J20J94
5092A60N3j73j62j73K26K86m2j54j74JO0J61K6lj81j37Q1K81R6j44k85K4J18J94
5116A39kn1j17j47o5K60J95r8k41j35J25L18K6j73j29p6J36O1O7M2o0j76j51K76
5140B4L36j83k78j69K29J11K1K0o5j52k2J23K00J4j74j61p3J75K35j95j59L8N9
5163d6j5Q6N9l4j73n7J66J61nj13j92P7N7N3L5j23K6j10R0J30J08j85j67N4R9
5188a9J55j32r4R0r0O1J00l5O9j76o4R1J50Q8k70j05K18J25j20MKm3q8O6J05n2
5214C6nq4J0J42J5l4k63Q4J65Jj36oJ46j36n4J60P1j21p0o5J07K06j20n3j02k2
$$ plain form
5240 -128 -38 88 85 -14 -3 -105 -82 139 203 31 -162 -100 67 79 79 75 -84 -131 -29 48 205 109 -142 -236 -1 166
5266 166 196 -3 -180 -48 -50 -9 127 189 -180 -305 -100 93 256 69 -212 -262 -99 179 228 51 -99 -207
5288 -207 -193 13 315 267 -169 -393 -121 225 317 91 -133 -293 -143 119 290 161 -100 -227 -274 1 393
5309 393 303 -154 -367 -100 118 148 180 88 -294 -367 74 288 313 -51 -284 -372 26 427 244 -74 -308 -119
5331 -119 -85 199 345 78 -315 -422 -30 363 287 -53 -313 -359 -64 274 310 -5 -246 -282 -163 151 418 126
5353 126 -386 -525 10 323 195 16 -114 -314 -239 182 440 165 -246 -253 -130 230 478 253 -292 -330 -85
5374 -85 204 154 128 -7 -309 -350 82 419 276 -200 -303 -164 130 267 199 -114 -318 -236 27 231 320 38
5396 38 -339 -397 63 346 127 -98 -273 -200 -73 175 350 -41 -243 -242 -47 289 341 34 -317 -234 116 254
$$ packed form
5240a28R0J26lr9J1j02K3K21O4j72j93O2J67J2%mj59m7J02P7J57r6k51r4K35J67
5266A66L0j99j77J32kM1J36O2l69j25K05J93J63j87k81n0J63K78M9j77j50j08
5288b07J4K06L02m8m36k24K72L46R2k26k24j60J50K62J71j29k61j27m7K75L92
5309C93r0m57k13K67K18L0L2r2l82p3M41K14K5l64k33q8L98M01j83l18k34J89
5331a19L4K84J46k67l93j07L92L93p6l40k60m6K95L38L6l15k41l6J19L14K67k92
5353A26n12j39N35L13j28j79j30k00P5M21K58k75m11pJ23L60K48k25n45l8K45
5374h5K89n0k6j35l02m1M32L37j43m76j03J39K94J37o8l13k04Q2K63K04Q9k82
5396C8l77n8M60K83k19k25j75P3J27K48J75l91k02JJ95L36N2l07l51Q3L50J38
$$ plain form
5418 254 171 35 -135 -189 -137 189 305 101 -266 -193 -71 174 238 78 -137 -165 38 118 161 127 1 -309 -254
5441 -254 184 341 39 -236 -168 6 101 113 94 -25 -170 -124 -31 141 124 -92 -281 -148 151 185 -80 -157 -6
5464 -6 3 -40 3 116 10 -157 -111 51 166 66 -8 -185 -22 193 52 -98 -5 121 -22 -126 77 225 -70
5487 -70 -110 77 166 -51 -160 -10 25 52 65 -27 -58 7 25 -115 -18 183 -53 -218 -105 153 159 -125 -137 17 77
5512 77 -114 -13 24 -19 -147 -86 76 126 66 -136 -231 11 241 110 -166 -158 -18 19 9 128 55 -127 -236 -90
5536 -90 224 240 22 -210 -228 26 252 123 8 -63 -141 -133 115 365 169 -253 -364 -82 220 256 45 -188 -238
5559 -238 -78 119 242 155 -68 -338 -199 194 346 119 -286 -415 -141 127 286 149 -51 -365 -242 71
5579 71 304 339 -122 -497 -319 185 457 180 -119 -348 -200 -15 308 388 23 -366 -373 130 407 290 -3 -343
$$ packed form
5418B54q3j36j70n4N2L26J16k04l67P3J22K45O4j60k15k8K03Q0M3l4j26l10N5
5441b54M38J57l02k75O8J74R5J2j9j19j45M6R3J72j7k16j89J33K99L4k65p7J51
5464fRm3M3J13j06j67M6J62J15j00p4j77J63K15j41j50R3J26j43j04K03J48k95
5487g0m0J87Q9k17j09J50L5K7J3r2l1O5J8j40R7K01k36j65J13K58Ok84j2J54O0
5512G7j91J01L7m3j28O1J62N0o0k02r5K42K30j31k76QJ40L7j0J19p3j82j09J46
5536i0L14J6k18k32j8K54K26j29j15p1p8QK48K50j96m22j11K82L02L6k11k33n0
5559b38J60J97J23q7k23k70J39L93J52k27m05j29K74K68J59j37k00l14J23L13
5579G1K33L5m61l75J78N04K72k77k99k29J48J85L23Q0l65l89pN03K77j17k93l40
$$ plain form
5601 -343 -253 87 363 328 -4 -269 -345 -46 370 534 19 -524 -376 55 425 239 24 -281 -411 -130 315
5622 315 491 159 -406 -541 -146 380 539 104 -392 -482 -166 296 405 206 -204 -491 -327 263 547 348
5642 348 -285 -545 -187 260 483 209 -244 -393 -301 85 427 454 -160 -602 -350 236 485 229 -115 -351 -334
5663 -334 42 446 420 -31 -460 -342 -23 481 474 -52 -533 -371 166 430 249 1 -248 -464 -189 429 592
5684 592 -18 -465 -442 41 361 406 137 -352 -489 -193 338 430 156 -193 -521 -257 260 585 208 -421 -439
5705 -439 -142 233 316 260 -71 -465 -379 168 573 270 -295 -416 -259 178 371 269 -83 -390 -228 91 303
5726 303 270 -20 -464 -419 32 384 242 -150 -378 -210 9 266 322 37 -321 -396 -69 411 433 -7 -385 -228
5748 -228 27 223 315 123 -198 -360 -166 236 371 84 -197 -244 -96 220 353 111 -243 -264 -65 82 200
$$ packed form
5601c43R0L40K76l5l32k65p6K99M16J64n15n43J48M31L70j86k15l05j30K81M45
5622C15J76l32n65j35L95N26J59m35m96r0L16M62J09j99m10k87J64N90K84j99
5642C48o33k60L58M47K23k74m53j49R2L86L42K7o14m42K52N86K49k56l44k36J7
5663c34L76M04k6m51m29J18L19N04pn26m81J62N37K64j81k48k49k16K75O18J63
5684E92o10m47K3M83L20M5k69m89j37K96N31R2k74l49l28K64N17L25l77o29j8
5705d39K97L75Q3n6l31l94Q6N47M05l03n65j21J57M37J93j02l52l07J62L19K12
5726C03l3k90m44M5M51L52j42l92k28J68K19K57N6k85l58p5L27M80K2m40l78J57
5748b28K55J96R2j92l21j62J94M02J35k87k81m7J48L16J33k42l54k1J99J47J18
$$ plain form
5769 200 196 -44 -329 -209 229 327 103 -181 -136 -105 20 161 260 -1 -223 -208 58 245 188 -3 -219 -241 13
5792 13 266 126 -101 -89 -121 -126 78 295 127 -264 -259 45 207 56 -27 -117 -112 -91 87 139 79 -20 -194 -160 88
5817 88 198 59 -142 -108 -36 61 61 102 27 -104 -183 3 135 119 15 -168 -79 53 67 -10 12 40 -87 -148 -4
5842 -4 203 71 -144 -168 11 105 38 50 -154 -4 -30 23 26 157 68 -89 -152 55 191 81 -84 -15 100 59 -48
5867 -48 145 179 25 -176 -88 56 100 40 -134 -41 49 46 -23 61 102 16 -136 -70 203 138 -17 -71 -70 98 45 24 -23
5894 -23 -29 -47 -108 -86 77 176 -140 -148 -4 156 -7 -95 6 23 -102 -36 36 80 70 -155 -73 21 136 117 -81 -106
5920 -106 164 -5 -28 -94 135 53 -142 -62 179 218 -82 -3 99 57 -38 -6 -90 -60 74 -36 -94 -18 141 59 -229
5945 -229 -5 173 -1 -161 30 143 -42 -138 -68 152 17 -60 17 23 17 4 -72 -148 -45 65 -90 -157 78 197
$$ packed form
5769B00mk40k85J20M38R8k24k84M5L1J25J41R9k61k22J5K66J87n7j91k16k2K54
5792A3K53j40k27J2l2nK04K17j68l91NL04J62j51q3r0NK1J78N2o0r9j74L4K48
5817H8J10j39k01L4P2R7%M1p5j31p9J86J32j6j04j83Q9J32J4p7K2K8j27o1J44
5842dK07j32k15k4J79R4o7J2k04J50k6N3LJ31q9j57o3K07J36j10j65O9J15m1j07
5867d8J93L4j54k01Q8J44M4o0j74R3R0lo9Q4M1q6j52O6K73o5j55n4JJ68n3k1m7
5894b3oj8o1K2J63R9l16qJ44J60j63q8J01J7j25O6P2M4j0k25Q2R4J15j9j98k5
5920a06K70j69k3o6K29q2j95Q0K41L9l00P9J02m2r5L2q4L0J34j10n8P6J59q2k88
5945b29K24J78j74j60J91J13j85r6P0K20j35p7P7Ooj3p6p6J03J10j55o7K35J19
$$ plain form
5969 197 9 -225 23 120 -54 -79 137 155 -176 -68 126 126 67 3 -80 -138 104 224 -10 -78 54 23 -177 22
5993 22 234 53 -281 -213 156 148 41 7 -81 -91 -87 93 100 34 21 -242 -141 106 310 75 -339 -151 56 142 48
6018 48 25 17 -224 -174 35 240 153 -107 -253 -136 120 345 46 -196 -106 -2 68 196 269 19 -371 -357 150
6041 150 343 169 -115 -280 -160 123 205 199 22 -245 -263 -83 356 375 25 -309 -301 102 272 250 35 -193 -314
6064 -314 -158 258 363 177 -265 -473 -188 307 417 34 -308 -374 -18 214 324 252 -175 -439 -266 247 507
6085 507 229 -265 -413 -198 256 429 192 -160 -345 -222 3 476 482 -113 -603 -404 264 489 230 -120 -339
6106 -339 -361 17 458 430 14 -404 -474 -15 481 520 -43 -545 -395 85 347 321 73 -340 -524 -164 373 563
6128 563 36 -434 -515 -118 462 536 74 -403 -474 -152 246 502 294 -290 -678 -275 464 596 99 -301 -397
$$ packed form
5969A97j88k34K48R7j74k5K16J8l31J08J94%n9o4q3n8K42J20k34o8J32l1k00J99
5993B2K12j81l34O8L69qj07l4q8j0MJ80Po6j3k63J01K47K04k35m14J88K07Q6r4
6018D8k3qk41N0K09K05q7k60j46J17K56K25k99k42R0J04P0J28P3k50l90J4N07
6041A50J93j74k84j65J20K83Q2oj77k67j8J80M39J9l50l34QM03J70k2k15k28j21
6064c14J56M16J05j86m42k08K85M95J10l83l42o6L56K32J10p2m27k64J73N13K60
6085E07k78m94j48K15M54J73k37l52j85J23K25M73On95m90J99O68K25k59l50k19
6106c39k2L78M41k8m16m18p0M59M96L9n63n02J50M80K62k6k48m13j84L60N37J90
6128E63n27m70q1L97N80P4m62m77p1L22L98K56k08n84l88M03P39J32m97m00r6
$$ plain form
6149 -397 -241 252 499 305 -179 -496 -344 164 630 388 -186 -649 -336 322 516 226 -101 -447 -455 -16 501
6170 501 498 -68 -651 -450 148 525 394 -68 -411 -415 21 352 437 150 -356 -544 -192 525 572 -55 -471 -429
6192 -429 15 309 426 162 -308 -539 -246 279 641 183 -385 -590 -193 398 475 170 -250 -372 -204 189
6212 189 519 315 -191 -546 -337 172 551 282 -250 -469 -147 139 371 279 -80 -404 -479 73 566 382 -165
6233 -165 -484 -317 70 338 284 -51 -349 -379 25 353 338 35 -394 -491 -52 485 386 -111 -311 -240 21 213
6255 213 322 196 -275 -419 -188 298 407 20 -319 -262 -90 241 348 100 -113 -235 -227 120 370 258 -178
6276 -178 -382 -137 265 317 104 -112 -168 -127 18 260 251 -51 -284 -261 70 392 99 -112 -205 -127 40 176 136
6299 136 55 -159 -244 -49 196 208 -34 -211 -149 2 218 89 -26 -50 -107 -79 51 200 160 -132 -218 34 189
$$ packed form
6149c97J56M93K47j94m84l17J52N08M66k42n74m63L13O58J94k90l27l46qM39N17
6170E01ln66n83K01N98L77j31m62l43mM36L31Q5k87n06j88L52P17M7o27m16M2
6192d29M44K94J17k64m70k31K93N25L62m58n68k05L97N91P7l05m20j22J68L93
6212A89L30k04n06l55K09N09L79k69n32k19L22K86K32r2l59l24p5N52M93j84n47
6233a65l19J67L87K68n4l35k98l0M04L28j5l03m29r7M39N37r9m97k00P1K61J92
6255B13J09j26m71j44K31M86J09l87l39N7J72L31J07k48k13j22QL47K50j12m36
6276a78k04K45M02N2k13k16n6M1J45K42rl02k33K3L31L22k93k11r3P8J67J36m0
6299A36q1k14q5J95K45J2k42j77O2J51K16j29j15k4n7K8J30J49m0k92q6K52J55
$$ plain form
6322 189 181 -30 -59 -33 -62 -9 89 95 29 -97 -138 4 154 78 -75 -112 13 45 -7 -44 50 66 -99 -63 53 161
6348 161 -54 -203 -80 72 47 -64 -31 59 -7 -78 -43 10 119 -11 -115 -63 101 88 -22 -11 86 48 -84 -82 67
6373 67 114 -21 -104 -26 9 51 30 10 25 39 0 -63 42 120 -86 -215 -70 93 101 -88 -21 -12 -56 -112 16 151 67
6400 67 -55 -121 5 169 168 -9 -86 -48 44 -15 156 121 -10 -161 -202 100 221 100 -178 -107 39 88 5 60 20
6425 20 23 -143 -112 117 210 -49 -232 -151 136 180 41 -41 -57 -100 -113 52 152 105 -201 -289 -4 202 150 -45 -172
6450 -172 -87 87 77 106 51 42 -161 -166 97 252 108 -245 -211 22 87 103 103 26 -133 -118 8 228 239 -27 -226
6475 -226 -128 44 164 117 -106 -63 -132 35 123 119 145 -154 -284 -21 250 122 -107 -212 -68 16 79 93 92 -120
6499 -120 -207 -114 91 253 98 -135 -239 39 204 133 14 -79 -71 -48 -10 121 171 -77 -186 -140 104 231 88
$$ packed form
6322A89qk11k9K6k9N3R8Oo6j26m1J42J50p6j53l7J25L2n2l7R4J6j65L6J16J08
6348A61k15j49J23J52k5j11L3R0o6p1L5N3J09j30j04N2J64j3j10J1R7l8j32KJ49
6373F7M7j35q3P8L5M2k1k0J5J4l9o3J05P8k06j29J45J63Qj89O7Rm4n6J28J35q4
6400F7j22o6J26J64jj77p7L8R2n9J71l5j31j51m1L02J21j21k78P1J46M9q3N5m0
6425B0Lj66L1K29R3k59j83Q1K87M4j39q2j6m3j3J65J00m7l06q8K85K06n2j95j27
6450a72Q5J74j0K9n5rk03nK63J55j44l53L4K33O5J6%p7j59J5J26K20J1k66j99
6475b26R8J72J20m7k23M3o9J67Q8mK6k99j30K63K71j28k29j05J44Q4O3J4jk12
6499a20q7R3K05J62j55k33j04K78J65p1j19r3QK3L8J31N0k48j09M6K44J27j43
$$ plain form
6522 88 -54 -131 -110 -30 87 136 69 -112 -262 -82 228 196 11 -186 -181 8 27 76 94 -37 -172 -163 115 225 89
6547 89 -120 -178 -47 145 116 -5 31 -80 -120 -23 149 267 -31 -271 -175 80 169 49 -34 -51 -191 -39 115
6570 115 150 6 -163 -226 -90 137 257 59 -244 -157 16 52 76 98 30 -277 -191 102 294 136 -134 -188 -78
6593 -78 35 113 114 -64 -181 -139 -31 148 237 38 -219 -267 -28 291 172 -3 -135 -76 -90 86 246 158 -142
6616 -142 -317 -77 144 259 41 -199 -253 -21 75 168 158 21 -233 -209 88 358 206 -178 -295 -106 156 132
6638 132 70 -57 -271 -193 -36 123 272 -36 -255 -305 31 369 151 -53 -236 -117 5 158 333 78 -207
6659 -207 -378 -56 348 296 -1 -265 -239 -31 65 156 53 -92 -306 -160 147 301 167 -243 -387 -205 204
6680 204 213 58 -104 -175 -191 17 318 224 -98 -353 -252 89 332 208 -143 -258 -211 35 216 196 24 -225
$$ packed form
6522H8j42p7K1Q0J17M9o7j81j50J80L10l2j85j97NJ89J9M9J8j31j35RK78J10j36
6547H9k09n8J31J92k9j21L6j11m0R7J72J18k98k40R6K55Q9j20q3j7j40J52J54
6570A15L5j44j69o3J36K27J20j98l03Q7J73L6K4K2o8l07Q6K93J92j58k70n4J10
6593g8J13P8Jj78j17M2J08J79Q9j99k57m8K39L19j19j75j32N9j4J76J60q8l00
6616a42j75K40K21J15k18k40n4K32R6R3j0j37k54K4K97K70j52l84j17J89K62k4
6638A32o2j27k14P8J57J59J49l08k19n0L36L38k18k04j83J19J22J53J75k55k85
6659b07j71L22M04n2k97k64K6K08R6R1j03j45k14J46L07J54j34m10j44J82M09
6680B04Rj55j62p1j6K08L01r4l22k55J01L41K43j24l51j15M7K46J81k0j72k49
$$ plain form
6702 -225 -310 -43 371 317 -31 -281 -216 30 232 200 25 -137 -240 -181 188 428 132 -230 -384 -39 269 271
6724 271 2 -205 -198 -16 63 247 222 -9 -387 -247 156 337 131 -253 -225 -96 72 170 97 -25 -224 -220 -27
6747 -27 277 255 -34 -336 -187 77 204 46 13 -121 -198 -122 124 311 79 -272 -331 -48 250 262 18 -224
6769 -224 -177 -20 91 146 50 -110 -300 -138 192 327 86 -227 -220 -43 129 124 129 3 -112 -161 35 185 199 -80
6793 -80 -332 -153 175 214 49 -98 -76 -88 -45 102 191 61 -227 -259 78 171 89 -77 -148 -70 1 67 46 83 -9
6818 -9 -182 -161 92 263 39 -172 -170 107 135 116 -26 31 -75 -150 59 151 167 -47 -205 -87 130 178 -16 -107
6842 -107 -96 49 15 33 125 67 -131 -170 -5 244 97 -62 -102 4 131 15 -6 40 23 -74 -50 94 160 5
6866 5 -109 -125 -35 98 -3 7 -32 84 -44 -67 -10 122 6 -116 -97 26 145 -55 -69 27 75 -56 -24 35 112
$$ packed form
6702b25q5K67M14n4l48k50O5K46K02l2j75j62j03N9L69K40k96l62j54L45L08K
6724B71k69k07PJ82P9J84k5k31l78J40M03J81k06l84K8J29J68R8p3j22j99MJ93
6747b7L04k2k89l02J49K64J27j58l3j34p7P6K46J87k32l51n9K83K98J2k44k42
6769b24M7J57J11N5r6j60j90J62L30J35k41l13PJ77J72nNj26j15m9J96J50J4k79
6793h0k52J79L28L9j65j47K2j2M3J47Q9j30k88l2L37R3q2j66p1P8P1O6k1L7r2
6818ij73K1K53J71k24k11KK77K8j9j42N7j06p5K09R2J6k14j58J18K17M8j94r1
6842a07J1J45l4J8R2n8j98l9J65K49j47j59m0J06J27j16k1M6j7r7K4J44O6j55
6866Ej14j6R0J33j01J0l9J16j28k3N7J32j16j22J9J23J19k00j4R6M8j31L2N9P7
$$ plain form
6891 112 -29 -56 -17 100 95 -12 -65 -25 -9 -22 -87 10 108 -28 -165 -94 120 43 -27 -43 91 33 -48 -88 120 60
6917 60 -67 -85 -31 26 63 -6 -48 63 -17 -15 -42 118 70 -55 -206 -56 145 101 -18 -74 2 10 -23 -15 64 -55 -70
6944 -70 -173 -56 268 94 -123 -126 73 142 73 66 49 -42 -128 -4 165 93 10 -204 -134 43 160 94 -105 -138 -7
6969 -7 -51 16 102 90 -90 -259 -5 169 106 -81 -113 -98 -37 90 143 66 -84 -134 -59 98 168 138 -171 -202 -74 94
6995 94 146 13 -43 -48 -159 -65 195 231 -13 -288 -183 114 265 139 -17 -199 -135 -3 122 298 31 -206 -220
7018 -220 -7 256 197 -11 -182 -246 20 161 177 64 -112 -211 -144 153 281 183 -259 -287 -85 236 157 37 -70
7041 -70 -269 -175 66 297 134 -107 -347 -146 111 287 115 -129 -208 -122 105 188 183 15 -197 -289 2 375 334
7064 334 -114 -351 -173 74 248 263 11 -215 -289 -25 260 329 99 -243 -339 -38 318 230 39 -218 -285 -176
$$ packed form
6891A12j41k7L9J17nj07n3M0J6j3o5R7R8j36j37P1K14p7p0j6J34n8q1m0K08o0
6917F0j27j8N4N7L7o9m2J11q0Kk7J60m8j25j51J50K01m4j19n6P6Ql3QP9j19j5
6944g0j03J17L24j74k17lJ99O9o9pj7r1q6J24J69p2q3k14P0J77J17o6j99l3J31
6969gm4O7Q6j2j80j69K54J74o3j87l2J5O1J27N3p7j50n0P5J57P0l0l09l1J28J68
6995I4N2j33n6nj11R4K60L6k44k75J05K97J51j26j56j82O4J32J25J76k67k37j4
7018b20K13K63n9k08j71o4K66J41J6j13j76r9O7K97J28r8m42k8K02L21p9j20j07
7041g0j99R4K41K31j63k41k40K01K57J76j72k44p9Q6K27Q3nj68k12r2K91L73m1
7064C34m48k37J78K47J74J5k52k26p4K64K85O9k30l42r6L01L56q8j91k57o7J09
$$ plain form
7086 -176 84 395 203 -149 -381 -189 221 406 154 -215 -316 -102 138 281 223 -26 -328 -334 98 405 339
7107 339 -179 -364 -211 83 364 248 -49 -263 -212 59 305 325 -4 -309 -406 75 457 330 -95 -284 -265
7128 -265 -114 251 329 196 -278 -420 -111 329 423 68 -271 -372 -80 260 364 144 -159 -298 -245 165 414
7149 414 230 -249 -486 -211 251 285 159 -96 -315 -198 87 344 335 -141 -446 -283 88 384 292 -171 -348
7170 -348 -178 90 304 252 34 -287 -409 -20 373 339 8 -343 -332 27 331 228 32 -272 -377 -134 219
7191 219 358 209 -314 -402 -84 367 369 26 -248 -308 -121 128 425 200 -231 -328 -189 186 432 226 -275 -315
7213 -315 -83 216 257 143 3 -222 -286 90 374 287 -156 -404 -228 70 320 180 -87 -293 -267 -12 218
7234 218 240 38 -194 -389 8 371 276 -42 -275 -269 57 187 225 36 -177 -337 -69 229 306 72 -252 -261 -51
$$ packed form
7086a76K60L11j92l52k32J92M10J85k52l69j01K14K40J43n8k49l02oM32L07o6
7107C39n18j85J53K94K81j16k97k14N1K71K46K0l29l05r7M81L82j27m25j89J9
7128b65J51L65P8j33m74j42L09M40R4l55l39j01K92L40J04k20l03j39N3M10K49
7149D14j84m79k37K75M62L4j26k55k19J17K85K57rm76l05J63L71K96r2m63j77
7170c48J70K68K14n2k18l21j22L89L93l4l31l51J1L59L04j03j96l04j05K43L53
7191B19J39j49n23q8L18M51Kl43k74o0J87K49K97k25m31r7J39L75K46k06n01m0
7213c15K32K99M1j14j40k25o4L76K84q7m43k48J76K98K50j40k67k06K6K55K30
7234B18K2k02k32j95L97L63r5l18k33OL26J30L8j89k13j60K68K98P7k34l24rK10
$$ plain form
7257 -51 202 251 58 -123 -215 -102 122 258 196 -140 -340 -154 169 317 81 -138 -72 -55 83 200 195 12 -166
7280 -166 -169 81 281 194 -104 -242 -145 105 175 168 -49 -91 -140 -24 151 240 35 -238 -131 27 199 68 -37
7303 -37 -102 -125 8 60 135 66 -94 -200 -55 169 174 2 -124 -129 0 60 128 58 -42 -153 -114 126 164 108 -148
7328 -148 -172 -24 144 120 -19 -50 -55 -73 -21 73 107 12 -135 -108 64 130 66 -106 -55 44 18 11 37 21 -51 -96 92
7355 92 75 107 -59 -173 -62 38 44 -1 -28 -58 3 -79 20 124 61 -165 -99 56 69 -22 -90 -21 12 -1 -26 63 107
7382 107 17 -23 -27 30 133 -41 -89 -29 89 1 -94 24 71 -24 -128 18 126 -2 -71 8 3 70 79 -31 -109 -1
7408 -1 104 28 -23 -27 38 -82 -30 99 18 -16 -131 48 70 53 41 -17 -18 -45 50 49 -5 29 22 -70 70 127 4 -48 -10
7437 -10 -25 59 -10 32 53 -43 -42 -36 99 86 -46 -71 -51 29 146 -13 -65 -33 37 -41 -41 107 92 -83 -128 67 77 54
$$ packed form
7257e1K53M9j93j81r2J13K24J36o2l36k00J86L23J48k36k19O6J7J38J17nj83j78
7280a66lK50K00q7k98j38R7K50P0pk17m2m9J16J75Q9k05k73J07J58J72j31j05
7303c7o5k3J33N2P5o9j60j06J45K24Nj72j26nJ29O0O8p0j00j11L9K40L8n6k56
7328a48k4J48J68k4j39l1nj8N2R4L4r5j47K7J72O6o4j72N1R9k6pK6j6p2m5J88
7355I2j7L2j66j14J11J00Om5k7l0O1q2R9J04o3k26O6J55J3r1o8O9L3j3k5Q9M4
7382A07r0m0mN7J03j74m8O0J18q8r5J18M7r5j04J46J08j28o9P9nO7Rj10p8J08
7408aJ05p6n1mO5j20N2J29q1l4j15J79K2j7j2n8jk7R5jn4L4pr2J40N7j23n2L8
7437a0j5Q4o9M2K1r6JOJ35j3j32k5K0Q0J17j59n2L2P0p8%J48j5j75m5J95J0k3
$$ plain form
7465 54 7 -36 -81 -36 48 72 -50 -96 -62 -61 78 125 29 -117 -175 83 121 28 -47 12 -82 -34 -13 105 145 -101 -146 -24
7493 -24 109 123 94 -101 -69 66 43 120 35 8 -86 -143 12 198 121 -14 -116 -132 64 122 147 -3 -63 -50 -74 159
7519 159 187 48 -221 -183 108 161 80 -3 -106 -89 -114 129 197 28 -202 -205 -60 196 195 30 -186 -185 54 124 188
7544 188 73 -38 -225 -110 84 251 127 -203 -195 -90 10 243 124 -58 -208 -100 1 167 239 1 -314
7565 -314 -231 101 267 119 -60 -113 -86 -60 72 164 -26 -178 -209 -34 178 250 -31 -297 -272 83 147 134 10
7588 10 -123 -237 -122 165 361 74 -215 -231 -10 199 264 59 -152 -202 -41 71 191 224 -120 -342 -183 193
7610 193 397 141 -221 -226 -50 107 164 233 -1 -227 -174 111 312 289 -112 -407 -162 108 329 94 -51 -192
7632 -192 -248 -33 241 361 -11 -373 -325 57 315 214 -85 -252 -226 22 180 265 40 -218 -240 -71 240 373
$$ packed form
7465E4m7m3m5M5Q4K4j22m6L4JJ39M7r6j46n8K58L8r3p5N9r4M8K1J18M0k46m5J22
7493b4J33J4k9j95L2J35k3P7q5k7r4n7J55J86p7j35j02j6J96N8K5j50o0J3k4K33
7519A59K8j39k69L8K91N3q1q3j03J7k5K43O8j69k30lJ45K56jj65k16JK39P0O4
7544A88j15j11j87J15J94J67j24l30QJ05J00K33j19j82j50J08J01J66P2k38l15
7565c14Q3L32J66j48j79n3K7K6J32R2j90j52l1J75K12P2k81k66K5L55O4j3j24
7588A0j33j14J15K87J96k87k89j6K21K09O5k05k11n0J61J12J20L3l44k22J59L76
7610A93K04k56l62nJ76J57N7O9k34k26N3K85K01k3m01k95K45K70K21k35j45j41
7632a92n6K15K74J20l72l62M8L82K58j01k99j67K6K48J58Q5k25k58k2J69L11J33
$$ plain form
7654 373 101 -291 -317 -24 205 253 181 -168 -288 -111 133 293 199 -219 -397 -179 302 385 104 -143 -249 -140
7676 -140 55 341 269 -97 -350 -191 144 315 223 -82 -319 -188 71 254 129 -10 -191 -229 -55 262 337
7697 337 -58 -358 -218 131 190 189 -54 -210 -178 10 236 251 10 -183 -277 -135 240 307 -58 -213 -173 -22 149
7720 149 165 81 -100 -286 -169 181 293 117 -169 -277 -61 206 129 74 -56 -125 -96 57 244 155 -127 -266
7742 -266 -219 117 127 132 -114 -173 -73 100 266 143 -6 -146 -200 -42 244 232 -114 -253 -81 68 57 15 101
7765 101 -49 -180 -76 180 224 73 -183 -135 -29 71 132 -114 -106 -66 -72 -27 88 108 -81 -175 -149 145 179 25
7789 25 -132 -80 50 8 30 107 56 -71 -58 25 103 126 -99 -135 -69 114 10 13 49 -66 -8 -102 1 105 48 -35
7815 -35 -63 -17 87 92 -21 52 78 -51 -83 84 91 31 -107 -13 70 82 14 -42 -20 30 15 -32 -22 130 8 -9 -18 -11 77
$$ packed form
7654C73k72l92k6K93K29M8p2l49j20J77K44J60r4m18j78K18M81Q3k81k47j06J09
7676a40J95K86p2l66k53J59L35J71r2l05k37J31K59J83j25j39j81l8J74L17P5
7697C37l95l00J40L49N9jk43j56L2J88K26J5k41j93r4J42L75O7l65j55M0J51J71
7720A49J6q4j81j86J17L50J12j76k86j08K16K67p7n5j30o9K9J53J87q9k82j39
7742b66M7L36J0Nk46n9J00J73J66j23j49j40n4J58K86j2l46j39J72J49j1m2Q6
7765A01j50j31J04K56M4j51k56M8J06J00O1k46QM0oM5J15K0j89r4K6K94L4j54
7789B5j57N2J30m2K2P7n1j27J3Q3P8K3k25l6O6J83j04LL6j15N8r4J03J04n7q3
7815c5k8M6J04Nj13P3K6j29l2J67Po0j38R4Q3J2o8n6K2N0j5m7J0J52j22j7rPQ8
$$ plain form
7844 77 17 -37 18 85 -83 -13 79 80 -14 -155 -44 102 51 50 -62 -61 -38 3 16 25 19 -82 -126 -83 90 67 -10 -166 -34
7873 -34 -19 75 81 -16 -73 -65 -50 119 145 67 -137 -197 32 151 57 -29 -43 -64 -65 79 47 41 -60 -145 -142 74 188 104 -28
7902 -28 -220 -51 49 120 110 -30 -92 -147 -37 218 102 -95 -253 -101 40 66 158 -2 -156 -121 -46 98 128
7925 128 9 -164 -186 2 142 101 -59 -104 -120 -3 28 139 21 -97 -209 23 144 152 -4 -142 -144 -50 113
7948 113 118 85 -20 -158 -77 95 202 148 -95 -224 -98 169 80 -56 -74 -142 -109 -1 120 179 -103 -182 -168 71
7972 71 211 136 -49 -132 -40 19 108 120 -13 -182 -174 35 130 153 -6 -157 -102 51 83 107 -6 -112 -90 -25 78
7997 78 121 62 -125 -208 26 157 98 -55 -114 -106 -23 80 104 77 -25 -189 -94 91 131 49 -112 -97 42 57 76 -26
8023 -26 35 -161 -96 62 115 155 -76 -166 -27 66 137 29 -4 -35 -2 19 79 55 13 -125 -114 100 104 80 -92 -44 35
$$ packed form
7844G7o0n4N5O7j68P0R2Jr4j41J11J46n1jj12JK3M1J3Roj01m4M3J73k3p7j56J32
7873c4J5R4Or7n7QJ5J69K6p8k04o0K29J19r4q6j4k1jJ44l2oj01q5LK16J14q4j32
7902b8j92J69J00P1j0j40o2n5J10K55j16j97j58J52J41K6R2j60j54L5P5J44L0
7925A28j19j73k2J88J40m1j60m5j6J17L1J11j18j18j12K32J21Qj56j38kR4J63
7948A13Nl3j05j38Q1J72J07n4k43j29J26K67q9j36j8o8L3J08J21N9k82p9J4K39
7972G1J40p5j85q3R2N9Q9J2j33j69QK09R5K3j59j51N5J53L2K4j13j06K2O5J03
7997G8M3n9j87q3K34J31n9j53n9QQ3J03K4k7j02j64R5J85M0q2j61J5J39J5J9j02
8023b6O1j96O5J58N3M0k31r0J39R3P1j08l3l1L3K1O0k4m2j38J1K14Mk4j72M8P9
$$ plain form
8050 35 33 79 -8 22 -21 -125 2 49 68 12 -69 1 81 -24 -1 -9 -25 1 45 -51 -1 88 6 -109 8 87 64 -4 -61
8079 -61 9 -17 -42 -56 -2 49 -37 -106 32 51 15 -61 -7 122 -44 -4 -25 42 151 44 9 -1 -14 43 12 66 83 15
8107 15 -1 -4 88 63 -29 -82 17 5 71 66 8 26 0 -76 21 95 6 -30 -148 -45 139 147 -14 -51 -4 -40 -8 97 94 -46
8137 -46 -65 -76 0 74 70 -73 -123 -35 128 99 24 49 -28 -43 54 125 121 -59 -158 -101 122 109 16 -49 -47 -53 -33 69 90 24
8167 24 -143 -123 63 198 86 -88 -95 -35 41 64 76 -15 -104 -156 40 196 149 -23 -197 -107 13 110 48 -22
$$ packed form
8050C5kM6q7L0m3j04J27M7J9n6q1P0Q0j05K3qj6K6M4r6N0Q9q2j15J17P9k3o8n7
8079f1P0k6k5j4N4N1q6o9J38J9l6p6N4J29j66M0k1O7J09j07l5j0j3N7l1N4J7o8
8107A5j6lR2k5r2n3R9j2O6nn8J8k6p6R7P4q9l6j18J03J84Qj61l7M7l6L2J05lj40
8137d6j9j1P6P4mj43n0Q8J63k9p5K5p7j5R7P1mj80r9N7K23j3r3o5KoK0J02K1o6
8167B4j67K0J86J35j12j74pO0P6K3J2r1q9n2J96J56m7j72j74R0J20R7o2p0
8191b2
$$ Imaginary data points
##PAGE= N=2
##DATA TABLE= (X++(I..I)), XYDATA
$$ plain form
0 0 0 0 0 0 0 0 0 -8 8 -5 4 -8 8 -8 8 -16 16 -21 24 -24 31 -37 41 -45 53 -61 68 -74 84 -96 109 -118 131
33 131 -147 162 -179 198 -219 245 -268 295 -326 362 -404 447 -498 557 -629 711 -809 932 -1091
52 -1091 1296 -1573 1968 -2562 3537 -5342 9337 -21749 132508 679505 135008 -368913 42687
65 42687 179792 -275838 -146849 394621 155091 -385010 -152122 227625 15438 -62902
75 -62902 264925 121240 -361205 -188539 278858 115331 -185847 30174 132533 -183427
85 -183427 -131502 287432 185715 -245651 -158540 149112 36381 -100305 86025 86205 -172207
96 -172207 -98487 187115 104603 -117587 -37776 39768 -93208 -39777 184130 92812 -169780
107 -169780 -117880 67877 42889 13460 88465 -10659 -187176 -76139 149607 142535 44490
$$ packed form
0@%%%%%%%qJ6j3Rj2J6j6J6k4L2l7M5m8N5o8P8q6R8j14J29j42J58j80K05k27K49
33A31k78L09l41L77m17M64n13N63o21O88p66Q51r45J055j186J340j520J741k023
52a091K387k869L541m530O099q879J4679l1086J54257N46997n44497n03921M11600
65D2687J37105m55630J28989N41470k39530n40101K32888L79747k12187p8340
75f2902L27827j43685m82445J72666M67397j63527l01178K16021J02359l15960
85a83427N1925M18934j01717m31366Q7111L07652j12731j36686J86330J80k58412
96a72207P3720K85602q2512k22190P9811P7544j32976N3431K23907r1318k62592
107a69780N1900J85757k4988k9429P5005r9124j76517J11037K25746p072r8045
$$ plain form
118 44490 38 -134943 -203294 51515 262027 55905 -151325 -19800 48167 -95905 -6697
129 -6697 239349 93624 -243698 -173226 101016 95165 12820 89735 29937 -175539 -99009
140 -99009 158158 123461 -71265 -50377 10562 -79094 -40528 154115 112109 -118462 -113767
151 -113767 51267 36189 -34387 43342 57835 -82672 -89587 71082 96693 -21678 -47866
162 -47866 -7783 -25370 -9522 69518 53287 -48587 -58414 14340 42328 34756 23243 -31890
174 -31890 -77345 -23547 57947 65423 31439 -10419 -62357 -46967 51852 79084 -5510 -42285
186 -42285 -15657 -42300 -37633 90460 130287 -34601 -125915 -8531 57761 -6674 9146 60396
198 60396 -42689 -124747 12255 122688 21538 -44850 22382 -8752 -99743 -3410 124717
$$ packed form
118D4490m4452j34981o8351K54809K10512k06122k07230J31525O7967j44072Q9208
129f697K46046j45725l37322P0472K74242n851q2345P6915n9798k05476P6530
140i9009K57167l4697j94726K0888O0939q9656L8566J94643m2006k30571M695
151a13767J65034j5078p0576P7729J4493j40507o915J60669K5611j18371k6188
162d7866M0083j7587J5848P9040j6231j01874r827P2754K7988p572j1513n5133
174c1890m5455N3798Q1494P476l3984m1858n1938J5390R8819K7232q4594l6775
186d2285K6628k6643M667J28093L9827j64888r1314J17384O6292o4435J5820N1250
198F0396j03085q2058J37002J10433j01150o6388O7232l1134r0991R6333J28127
$$ plain form
209 124717 20423 -104263 -16435 58323 -19130 -15322 81924 19046 -106269 -28701 89876
220 89876 16005 -58054 20490 36383 -58997 -30238 80664 35048 -64457 -13799 47694 -13340
232 -13340 -30888 42494 23247 -59234 -20396 58510 20156 -29148 6916 11335 -32004 -162
244 -162 49888 -266 -46995 494 20324 -20728 1464 45744 -10051 -60141 5795 46233
256 46233 -11857 -18773 32044 -6096 -62587 2894 60824 -5382 -36209 29000 17378 -53260
268 -53260 -4127 68855 -6598 -73469 12310 56526 -30473 -36602 53573 24435 -63560 -9767
280 -9767 60974 -12544 -54779 34805 44750 -53591 -33051 64208 18928 -62722 4543 60944
292 60944 -24480 -53502 39553 38456 -52198 -19541 62325 2276 -67422 8579 59997 -19542
$$ packed form
209A24717j04294j24686Q7828P4758p7453L808R7246o2878j25315P7568J18577
220H9876p3871p4059P8544J5893r5380K8759J10902m5616r9505N0658O1493o1034
232a3340j7548P3382j9247q2481L8838P8906l8354m9304L6064M419m3339L1842
244a62N0050n0154m6729M7489J9830m1052K2192M4280n5795n0090O5936M0438
256D6233n8090o916N0817l8140n6491O5481N7930o6206l0827O5209j1622p0638
268e3260M9133P2982p5453o6871Q5779M4216q6999o129R0175k9138q7995N3793
280i767P0741p3518m2235Q9584R945r8341K0540R7259m5280q1650O7265N6401
292F0944q5424k9022R3055j097r0654L2657Q1866o0049o9698P6001N1418p9539
$$ plain form
304 -19542 -45698 28371 24138 -41056 -9076 45409 -3995 -42193 13987 27425 -30897 -16909
316 -16909 42957 8829 -47301 -2342 42099 -6332 -31658 15960 17504 -30545 -13845 33096
328 33096 9760 -25384 219 15029 -14248 -9475 22824 2670 -30381 -2008 27134 -878
340 -878 -16647 11435 10745 -20979 -10470 21284 8065 -16061 -2209 8392 -7605 -2935 19563
353 19563 6949 -21230 -12528 8963 4978 560 9407 810 -16072 -3839 15092 3497 -10454
366 -10454 1553 6860 -9897 -9878 12969 16168 -6077 -16698 -5905 5538 8662 4800 -4997 -9858
380 -9858 -2381 4501 3391 3877 5127 -4158 -14339 -6698 9625 13036 2896 -7083 -9699 -3644 5711
395 5711 7666 1276 -3368 -4634 -5779 13 12631 12769 -4687 -15783 -6571 6687 10121 7400
$$ packed form
304a9542k6156P4069m233o5194L1980N4485m9404l8198N6180J3438n8322J3988
316a6909N9866l4128n6130M4959M4441m8431k5326M7618J544m8049J6700M6941
328C3096k3336l5144K5603J4810k9277M773L2299k0154l3051K8373K9142k8012
340h78j5769K8082o90l1724J0509L1754j3219k4126J3852J0601j5997M670K2498
353A9563j2614k8179Q702K1491l985m418Q847q597j6882J2233J8931j1595j3951
366a0454J2007N307j6757J9K2847L199k2245j0621J0793J1443L124l862r797m861
380i858P477O882j110M86J250r285j0181P641J6323L411j0140r979k616O055R355
395E711J955o390m644j266j145N792J2618J38j7456j1096R212J3258L434k721
$$ plain form
409 7400 821 -8580 -9048 3108 12868 9083 -1080 -9397 -11985 -3603 11711 16049 2973 -10749
423 -10749 -11734 -4064 6095 14219 9468 -10081 -22616 -9460 15130 21465 5443 -10967 -12462
436 -12462 -4791 2485 8420 10020 -217 -16208 -16641 4520 24098 19062 -4967 -23914 -19624 3314
450 3314 20621 14252 -4132 -12232 -8257 -170 12186 20463 5314 -22984 -25499 3262 25601
463 25601 20682 2849 -14262 -22912 -9206 19076 27418 5724 -16446 -20240 -10519 9617 27800
476 27800 15704 -19985 -30931 -3742 20414 19203 8005 -8083 -28311 -24206 12789 36653
488 36653 15394 -18367 -27367 -14702 6788 26795 22684 -9770 -32850 -20149 8342 25767
500 25767 25130 1893 -32090 -36124 3421 38624 27813 -6823 -25555 -21048 -2584 19406 25577
$$ packed form
409G400o579r401m68J2156R760l785j0163q317k588Q382J5314M338j3076j3722
423a0749r85P670J0159Q124m751j9549j2535J3156K4590O335j6022j6410j495
436a2462P671P276N935J600j0237j5991m33K1161J9578n036k4029j8947M290K2938
450C314J7307o369j8384q100L975Q087J2356Q277j5149k8298k515K8761K2339
463B5601m919j7833j7111q650J3706K8282Q342k1694k2170l794R721K0136J8183
476B7800j2096l5689j0946K7189K4156j211j1198j6088k0228M105L6995K3864
488C6653k1259l3761r000J2665K1490K0007m111l2454k3080J2701K8491J7425
500B5767o37k3237l3983m034L9545L5203j0811l4636j8732M507J8464K1990O171
$$ plain form
513 25577 4656 -23401 -27588 -2023 29143 33733 2698 -33019 -34604 -3464 27305 33462 11625
526 11625 -23441 -38185 -12101 25546 32195 8259 -18613 -32165 -19849 18323 40988 12417
538 12417 -30511 -33253 -7138 12514 25369 24900 -10453 -47224 -25465 28783 39678 5966 -20050
551 -20050 -28556 -25050 7112 45869 32122 -22357 -44362 -19927 8561 28039 35447 4288 -45462
564 -45462 -42888 13065 43712 21658 -7061 -21576 -29244 -12153 29094 40983 874 -38405
576 -38405 -32427 890 28655 33566 7233 -31660 -40322 -7044 29785 34205 7293 -25687 -35450
589 -35450 -11931 20465 30258 12277 -17859 -36487 -19336 22908 38352 6982 -25697 -25959 -11409
602 -11409 7313 30202 23447 -24002 -45667 -3921 34768 22761 1974 -6211 -28448 -35990 12423
$$ packed form
513B5577k0921k8057m187K5565L1166M590l1035l5717j585L1140L0769O157k1837
526A1625l5066j4744K6084L7647O649k3936k6872j3552J2316L8172K2665k8571
538A2417m2928k742K6115J9652J2855m69l5353l6771K1759N4248J0895l3712k6016
551b0050q506L506L2162L8757j3747n4479k2005K4435K8488J9478P408l1159m9750
564d5462K574N5953L0647k2054k8719j4515p668J7091M1247J1889m0109l9279
576c8405N978L3317K7765M911k6333l8893q662L3278L6829M420k6912l2980r763
589c5450K3519L2396R793j7981l0136j8628J7151M2244J5444l1370l2679k62J4550
602a1409J8722K2889o755m7449k1665M1746L8689j2007k0787q185k2237p542M8413
$$ plain form
615 12423 53379 18058 -32383 -27216 -5827 47 24458 41828 -7423 -61766 -28667 32884
627 32884 30166 4742 6785 -10861 -44597 -14562 48655 36870 -23450 -32945 -9557 -6606 9988
640 9988 42797 17246 -45357 -40555 14451 24173 4933 11947 3827 -36942 -30555 28110 39343
653 39343 -5365 -21957 -8536 -10887 -2067 30412 22086 -26298 -30048 9110 16547 1290 7893
666 7893 3591 -26378 -19640 24068 26223 -8282 -11880 -575 -12961 -6647 29458 20975 -30021
679 -30021 -31923 11278 19516 4727 13141 4993 -33381 -26474 25484 29338 -9411 -10045 4365 -17970
693 -17970 -18254 33200 39667 -23059 -42497 3301 16729 -4610 10359 25499 -14657 -39169 2892
706 2892 30166 3219 -6302 9883 -9031 -30260 8074 41353 2682 -32497 -3712 17350
$$ packed form
615A2423M0956l5321n0441N167K1389N874K4411J7370m9251n4343L3099O1551
627C2884k718k5424K043j7646l3736L0035O3217j1785o0320r495K3388K951J6594
640I988L2809k5551o2603M802N5006R722j9240P014q120m0769O387N8665J1233
653C9343m4708j6592J3421k351Q820L2479q326m8384l750L9158P437j5257O603
666G893m302k9969O738M3708K155l4505l598J1305j2386O314L6105q483n0996
679c0021j902M3201Q238j4789Q414q148l8374O907N1958L854l8749o34J4410k2335
693a7970k84N1454O467o2726j9438M5798J3428k1339J4969J5140m0156k4512M2061
706B892K7274k6947r521J6185j8914k1229L8334L3279l8671l5179K8785K1062
$$ plain form
718 17350 -7311 -8536 22198 12113 -25272 -14380 19892 9044 -14061 2455 15786 -9668
730 -9668 -19399 10770 19294 -9737 -14602 12537 13074 -11695 -9069 10624 2298 -12258 4728 17615
744 17615 -6467 -20053 6624 19069 -6402 -12094 13178 7965 -22595 -9604 27494 14142
756 14142 -21015 -7346 17840 -1861 -16976 11383 20314 -12183 -14870 14663 6410 -18017 4862
769 4862 26227 -9502 -28982 12542 26042 -16688 -18505 25505 15365 -29697 -13105 26480
781 26480 6262 -18715 9106 18299 -20673 -21394 22834 21221 -14893 -7733 12204 -9460 -18242
794 -18242 17535 25062 -11589 -17464 6080 -762 -10663 16449 23943 -15360 -26489 7356 15102
807 15102 -3260 6011 14450 -14460 -23908 12046 23548 -3497 -5619 7802 -10339 -18723 17270
$$ packed form
718A7350k4661j225L0734j0085l7385J0892L4272j0848k3105J6516J3331k5454
730i668r731L0169Q524k9031m865K7139N37k4769K626J9693q326j4556J6986J2887
744A7615k4082j3586K6677J2445k5471n692K5272n213l0560J2991L7098j3352
756A4142l5157J3669K5186j9701j5115K8359Q931l2497k687K9533q253k4427K2879
769D862K1365l5729j9480M1524J3500m2730j817M4010j0140m5062J6592L9585
781B6480k0218k4977K7821R193l8972p21M4228j613l6114P160J9937k1664q782
794a8242L5777P527l6651n875K3544o842r901K7112P494l9303j1129L3845P746
807A5102j8362R271Q439k8910r448L5954J1502k7045k122J3421j8141q384L5993
$$ plain form
820 17270 27998 -12474 -22885 9665 9637 -12968 3882 21562 -8474 -24382 8046 18154 -7732
833 -7732 -4325 13061 -9218 -20897 18472 28511 -18852 -27438 15563 15038 -17108 1825 26418
846 26418 -12199 -36650 10672 35076 -6013 -19417 9869 587 -24180 7966 38203 -1048
858 -1048 -33707 -3477 15663 -3797 3551 24816 -4263 -36863 -5285 30460 10629 -8994
870 -8994 3173 -4091 -24029 -709 32101 12456 -19535 -11699 833 -4352 7380 23394 291
883 291 -27119 -9648 14148 4865 -728 10948 -488 -23230 -7974 21479 13176 -10150 -9823
896 -9823 -3793 -4710 6422 16075 -945 -16832 -4578 5855 -702 4297 13340 -5226 -22605 -604
910 -604 21777 6074 -10076 -997 -492 -11160 3109 22331 4418 -20524 -9722 7411 2379
$$ packed form
820A7270J0728m0472j0411L2550k8k2605J6850J7680l0036j5908L2428J0108k5886
833g732L407J7386k2279j1679L9369J0039m7363q586M3001n25l2146J8933K4593
846B6418l8617k4451M7322K4404m1089j3404K9286r282k4767L2146L0237l9251
858a048l2659L0230J9140j9460P348K1265k9079l2600L1578L5745j9831j9623
870h994J2167p264j9938K3320L2810j9645l1991P836J2532n185J1732J6014k3103
883B91k7410J7471K3796r283n593J1676j1436k2742J5256K9453q303k3326L27
896i823O030r17J1132R653j7020j5887J2254J0433o557M999R043j8566j7379K2001
910f04K2381j5703j6150R079N05j0668J4269J9222j7913k4942J0802J7133n032
$$ plain form
923 2379 2627 12880 -771 -22333 -7988 18389 11581 -6143 -2504 -662 -11835 -4020 19258
936 19258 14310 -12750 -16754 110 5483 3161 7247 3734 -11216 -13096 2181 10108 4630 -402
950 -402 -4348 -10357 -6098 9749 14359 -1051 -13309 -6591 4139 3855 1507 4845 2835 -8434
964 -8434 -10421 4651 13242 1988 -8378 -3561 1396 -949 2971 8109 -1687 -12165 -2656 8949
978 8949 3029 -1976 4563 485 -12331 -3898 14503 7244 -9967 -3717 5925 -4089 -6219 10846
992 10846 9409 -12419 -11220 8300 5805 -6480 1687 7191 -8449 -10787 8760 9602 -7407 -4070
1006 -4070 6797 -4782 -10149 11082 15324 -10933 -15820 7180 8129 -7916 1154 13990 -4063
1019 -4063 -17669 1620 13357 -641 -3114 6282 -4409 -14637 4934 18081 -1731 -11932
$$ packed form
923B379K48J0253j3651k1562J4345K6377o808j7724L639J842j1173P815K3278
936A9258m948k7060m004J6864N373k322M086l513j4950j880J5277P927n478n032
950d02l946o009M259J5847M610j5410j2258O718J0730k84k348L338k010j1269
964h434j987J5072Q591j1254j0366M817M957k345L920N138r796j0478R509J1605
978H949n920n005O539m078j2816Q433J8401p259j7211O250R642j0014k130J7065
992A0846j437k1828J199J9520k495j2285Q167N504j5640k338J9547Q42j7009L337
1006d070J0867j1579n367K1231M242k6257m887K3000R49j6045R070J2836j8053
1019d063j3606J9289J1737j3998k473R396j0691j0228J9571J3147j9812j0201
$$ plain form
1031 -11932 4306 5170 -10062 -685 16750 1604 -17453 -3227 11774 1569 -2473 7061 -1079
1044 -1079 -15181 -1634 15574 4070 -8504 -395 -23 -10590 240 18240 5574 -15105 -6811
1057 -6811 6538 -637 -2114 10105 3914 -14749 -8108 12006 9153 -3918 -2525 -1603 -8659 -1469
1071 -1469 13554 6973 -9614 -7136 2006 -477 1661 11614 3904 -14979 -11142 8874 11938 1823
1085 1823 -868 -2960 -9438 -3984 10610 10588 -1764 -6251 -4587 -3931 2961 11967 4442 -11414 -10014
1100 -10014 3813 7690 3808 2574 -2609 -10978 -6153 8600 11828 1611 -6087 -7647 -5438 3268
1114 3268 11358 5705 -7108 -9461 -2536 2742 6322 7088 -1691 -12350 -8050 6046 10562 3834
1128 3834 -3074 -6880 -6651 1041 9229 6612 -2768 -7203 -5358 -28 7999 10113 -1033 -12440 -7824
$$ packed form
1031a1932J6238Q64j5232R377J7435j5146j9057J4226J5001j0205m042R534q140
1044a079j4102J3547J7208j1504j2574Q109L72j0567J0830J8000j2666k0679Q294
1057f811J3349p175j477J2219o191j8663O641K0114k853j3071J393R22p056P190
1071a469J5023o581j6587K478R142k483K138R953p710j8883L837K0016L064j0115
1085A823k691k092o478N454J4594k2j2352m487J664O56O892R006p525j5856J400
1100a0014J3827L877l882j234n183q369M825J4753L228j0217p698j560K209Q706
1114C268Q090n653j2813k353O925N278L580P66q779j0659M300J4096M516o728
1128C834o908l806K29P692Q188k617r380m435J845N330Q027K114j1146j1407M616
$$ plain form
1143 -7824 4652 8240 4555 857 -4464 -8864 -3209 7853 9082 37 -6794 -6520 -1532 5779 8872
1158 8872 1554 -8030 -7410 248 4828 5349 3312 -3384 -9191 -4581 6011 8116 880 -5079 -5733
1173 -5733 -3198 1987 6299 3411 -4344 -7315 -3003 3060 6128 4148 -2630 -7857 -4349 3608 5908
1188 5908 1661 -2315 -3451 -3240 -245 4684 5395 -560 -6500 -4857 1837 5691 3295 -2111 -4409
1203 -4409 -2169 1283 2720 2359 1072 -1853 -4406 -1963 3639 4588 -920 -4676 -2416 1066 1978 1636
1219 1636 910 -1779 -3369 -1220 1432 853 -113 -374 -1720 -2525 616 3170 -249 -3214 -192 1532
1235 1532 -2142 -2451 2053 1419 -3629 -1556 3857 694 -4335 -239 4025 -795 -3835 996 1983 -2470
1251 -2470 -514 4069 -299 -4704 1175 4456 -1909 -2578 4689 1346 -7964 -2246 9128 3339 -7579
$$ packed form
1143g824J2476L588l685l698n321m400N655J1062J229r045o831K74M988P311L093
1158H872p318r584O20P658M580N21k037o696n807M610J0592K105p236n959o54
1173e733K535N185M312k888p755k971M312O063L068j980o778n227L508P957K300
1188E908m247l976j136K11K995M929P11n955n940J643O694L854k396n406k298
1203d409K240L452J437l61j287k925k553K443N602R49n508l756K260L482R12l42
1219A636p26k689j590K149K652n79r66k61j346q05L141K554l419k965L022J724
1235A532l674l09M504o34n048K073N413l163n029M096M264m820l040M831R87m453
1251b470J956M583m368m405N879L281o365o69P267l343r310N718J1374n789j0918
$$ plain form
1266 -7579 -2559 4697 -730 -3089 4748 3683 -6505 -4989 4226 2656 -2163 1643 1030 -7638 -4216
1281 -4216 9033 6990 -6263 -5838 2041 -834 -3203 5199 5709 -7202 -9420 2641 6745 1390
1295 1390 1193 300 -7646 -6695 6118 8914 -1721 -5422 -1492 -2304 -593 8988 8267 -6535 -10990
1310 -10990 133 5648 2394 3217 2194 -7271 -8525 4860 11200 2811 -3749 -4597 -6215 -1596 10170
1325 10170 9283 -6007 -10738 -671 3629 1685 5650 5041 -8387 -13046 2357 12772 4764 -4214
1339 -4214 -5407 -6888 -3657 8476 11719 -1963 -11168 -4557 2132 3125 6468 5865 -7161 -14687 -2100
1354 -2100 12312 9442 -1102 -5688 -6182 -3153 5663 11150 3549 -8402 -10812 -2867 7080 11551
1368 11551 5983 -5390 -10741 -4369 6199 10532 4938 -5716 -10967 -5264 4994 10392 8009 -1265
$$ packed form
1266g579N020P256n427k359P837j065j0188J516R215j570m819L806o13q668L422
1281d216J3249k043j3253M25P879k875k369Q402N10j2911k218J2061M104n355
1295A390j97q93p946R51J2813K796j0635l701L930q12J711R581p21j4802m455
1310a0990J1123N515l254Q23j023r465j254J3385O340q389o560q48j618M619J1766
1325A0170q87j5290m731J0067M300j944L965o09j3428m659J5403J0415q008q978
1339d214j193j481L231J2133L243j3682r205O611O689R93L343o03j3026p526J2587
1354b100J4412k870j0544m586m94L029Q816N487p601j1951k410P945R947M471
1368A1551n568j1373n351O372J0568M333n594j0654n251N703J0258N398k383r274
$$ plain form
1382 -1265 -11951 -10636 5034 14370 4504 -7497 -6969 -3813 -2116 7123 13770 423 -16388 -9788
1396 -9788 6989 9193 3858 1643 -6285 -13949 -1604 15965 9219 -7834 -7205 -1195 -4351 1585
1410 1585 16482 8119 -16767 -15449 7701 12018 894 627 485 -11011 -8434 12912 16947 -2284
1424 -2284 -11044 -4542 -3195 111 13280 11069 -11054 -16224 3101 11611 3515 2503 2489 -11171
1438 -11171 -15139 5735 18633 4174 -9848 -6893 -2536 46 8973 10552 -4289 -13816 -5316
1451 -5316 3636 5297 7969 4185 -10599 -13560 4105 14228 3543 -5734 -4082 -4561 -3982 6719
1465 6719 11838 -329 -10510 -5804 1116 4665 8929 4764 -9822 -11946 3964 11396 2539 -1746
1479 -1746 -392 -6916 -8454 7380 15863 828 -11649 -5016 1744 1285 5764 7568 -5384 -13359
$$ packed form
1382a265j0686J315J5670R336r866j2001N28L156J697R239O647j3347j6811O600
1396i788J6777K204n335k215p928p664J2345J7569o746j7053O29O010l156N936
1410A585J4897q363k4886J318K3150M317j1124k67j42j1496K577K1346M035j9231
1424b284q760O502J347L306J3169k211k2123n170J9325Q510q096j012j4j3660
1438a1171l968K0874J2898j4459j4022K955M357K582Q927J579j4841r527Q500
1451e316Q952J661K672l784j4784k961J7665J0123j0685r277J652m79N79J0701
1465F719N119j2167j0181M706O920L549M264m165j4586k124J5910P432q857m285
1479a746J354o524j538J5834Q483j5035j2477O633O760m59M479J804j2952p975
$$ plain form
1493 -13359 -1442 9441 4916 1097 1399 -6703 -11269 3250 14962 2754 -10793 -5527 1095
1506 1095 -1110 3223 10769 1984 -12510 -8675 4701 6933 2222 -11 -4192 -7416 118 8685
1520 8685 4622 -3084 -3125 -2648 -4037 2107 9590 3244 -8579 -6673 3251 5704 2725 732 -2657
1535 -2657 -5602 -1499 5195 5267 1015 -2441 -5300 -4103 3756 8000 1194 -5412 -3285 -82 267 3370
1551 3370 5153 -1899 -7911 -2453 4577 3187 418 219 -3487 -5578 1689 7847 2001 -5076 -3033
1566 -3033 -1190 -2719 1855 7797 1506 -8186 -4426 4435 3304 -863 890 183 -5212 -3493 4714
1581 4714 5701 -253 -2603 -1801 -2048 651 5097 2570 -4244 -4050 1671 2766 557 1183 1203 -2693 -3962
1598 -3962 1190 5121 2465 -2451 -3280 -847 1225 1780 1750 819 -1835 -3345 -385 3405 2132 -1747
$$ packed form
1493a3359J1917J0883m525l819L02q102m566J4519J1712j2208j3547N266O622
1506A095k205M333P546q785j4494L835J3376K232m711k233m181l224P534Q567
1520H685m063p706m1M77j389O144P483o346j1823J906R924K453k979j993l389
1535b657k945M103O694P2m252l456k859J197P859M244o806o606K127L203L49L103
1551C370J783p052o012N458P030j390k769j99l706k091P267O158n846p077K043
1566c033J843j529M574N942o291r692L760Q861j131m167J753p07n395J719Q207
1581D714R87n954k350Q02k47K699M446k527o814J94N721J095k209O26K0l896j269
1598c962N152L931k656m916q29K433K072N55l0r31k654j510K960L790j273l879
$$ plain form
1614 -1747 -1924 -425 -1022 -26 3156 1385 -4109 -3148 2519 2219 -1139 758 1690 -3640 -3967 3937 5058
1631 5058 -2905 -3776 2339 864 -3389 1765 5811 -1803 -6513 842 4527 -1053 -974 3664 -776 -5571
1647 -5571 1641 6852 -914 -4680 2493 2756 -4539 -967 7302 1524 -7130 -1161 5505 -228 -3030
1662 -3030 3278 1980 -5537 -1974 5631 1009 -4562 984 3050 -4058 -2859 5926 2734 -6227 -1990
1677 -1990 5112 -300 -4394 2657 3977 -4347 -3597 4740 2445 -4175 -204 3562 -2469 -3457 4034
1692 4034 3103 -4596 -1519 5026 -31 -4630 2456 4999 -3616 -4089 5130 3794 -4388 -1368 4930
1707 4930 -236 -4206 2373 3973 -3182 -2495 4251 1023 -4606 887 4731 -2578 -4641 3787 3812 -4867
1723 -4867 -2955 5055 1672 -4742 -33 4053 -1985 -3917 2708 2853 -3281 -1796 2868 -338 -2802
$$ packed form
1614a747j77J499n97R96L182j771n494R61N667l00l358J897R32n330l27P904J121
1631E058p963q71O115j475m253N154M046p614m710P355L685n580P9M638m440m795
1647e571P212N211p766l766P173K63p295L572Q269n778q654N969O666n733k802
1662c030O308j298p517L563P605m622n571N546K066p108J199Q785l192q961M237
1677a990P102n412m094P051J320q324P50Q337k295o620L971L766o031r88P491
1692D034r31p699L077O545n057m599P086K543q615m73R219j336q182L020O298
1707D930n166l970O579J600p155O87O746l228n629N493L844p309k063Q428K5q679
1723d867J912Q010l383o414M709M086o038j932O625J45o134J485M664l206k464
$$ plain form
1738 -2802 2239 2761 -3809 -3240 3444 1899 -3277 -109 3505 -1400 -3647 2539 4262 -1847 -3326
1753 -3326 1143 1266 -671 1579 2520 -1618 -2752 1247 1715 -556 713 1382 -2503 -2908 2641 4065
1769 4065 -804 -2842 -284 86 -548 1597 2222 -1247 -2941 -471 982 1106 1809 -53 -3850 -2988
1785 -2988 2339 3238 -506 -1712 -820 -1921 -1364 2677 3271 -1473 -4019 -1519 948 1822 2546 538
1801 538 -3407 -3083 1340 3082 1271 147 -1210 -3408 -1483 4184 4612 -997 -3995 -1756 251 1427
1817 1427 3074 1890 -2887 -4220 -150 3246 2925 1202 -1726 -4573 -2459 3608 4891 -97 -3649
1832 -3649 -2509 -1198 519 3388 3060 -2364 -5793 -2578 2462 3850 1993 -1787 -4887 -3271 2179
1847 2179 4506 1484 -1973 -3039 -3021 -232 4381 4657 -1312 -5770 -3328 1812 4193 3046 -447 -4318
$$ packed form
1738b802N041N22o570N69O684j545n176L168L614m905k247O186J723o109j479
1753c326M469J23j937K250R41m138j134L999M68k271J269O69l885m05N549J424
1769D065m869k038K558L70o34K145O25l469j694K470J453J24P03j862l797Q62
1785b988N327Q99l744j206Q92j101N57M041N94m744k546K500K467Q74P24k008
1801E38l945L24M423J742j811j124j357k198J925N667M28n609k998K239K007J176
1817A427J647j184m777j333M070L396l21j723k928k847K114O067J283m988l552
1832c649J140J311J717K869l28n424l429L215N040J388j857l780l100J616N450
1847B179K327l022l457j066J8K789M613K76n969m458K442N140K381j147l493l871
$$ plain form
1863 -4318 -4146 653 4505 3572 -209 -3700 -4624 -847 4890 5412 -378 -4787 -3566 187 3232 4215
1879 4215 1636 -3865 -5717 -1050 4453 4690 785 -3449 -5205 -2140 3652 5282 719 -3934 -4338
1894 -4338 -2142 1563 5059 3763 -3028 -7025 -2697 3969 4944 1374 -2301 -4404 -3417 1451 5428
1909 5428 3508 -2024 -5157 -3565 898 5094 4649 -1478 -6333 -3778 2547 4818 2713 -512 -3487
1924 -3487 -4533 -557 5429 5632 -665 -5600 -4191 648 4241 4406 589 -4435 -5080 -204 4620 4474
1940 4474 517 -3812 -5264 -1841 4161 5836 794 -4684 -4581 -729 2857 4363 2571 -2639 -5998
1955 -5998 -2788 3497 5460 1618 -3188 -4754 -2163 2489 4931 2389 -2496 -4605 -2762 1319 4701
1970 4701 3974 -1424 -5727 -3406 2623 5081 2603 -1260 -3836 -3368 603 4600 3875 -756 -4129 -3450
$$ packed form
1863d318J72M799L852r33l781l491r24L777N737N22n790m409J221L753L045R83
1879D215k579n501j852M667N503K37l905m234j756L065N792J630m563m653m04
1894d338K196L705L496j296o791l997M328O666R75l570l675k103R87M868L977
1909E428j920n532l133J592M463M196m45o127m855K555O325K271k105l225k975
1924c487j046L976N986K03o297m935J409M839L593J65l817n024o45M876M824j46
1940D474l957m329j452L423O002J675n042n478J03L852L586J506j792n210l359
1955e998L210O285J963l842m806j566K591M652K442k542m885k109J843M081L382
1970D701p27n398m303K321O029K458k478l863k576M68L971L997p25m631l373O79
$$ plain form
1986 -3450 212 4244 4648 -249 -4950 -3564 1256 3636 2768 728 -2632 -4733 -1241 4815 5045 -570
2002 -570 -4093 -3101 -803 2039 4364 2143 -3597 -4977 -462 3017 2724 1552 -1029 -4377 -3234 3031
2018 3031 5353 540 -3569 -2302 -577 335 2976 3778 -1207 -5334 -2013 3028 3202 956 -383 -2368
2034 -2368 -3374 365 4790 2890 -2016 -2925 -910 225 1682 3325 1021 -3689 -3448 1601 3721
2049 3721 1176 -727 -1092 -1866 -1109 2336 3632 -99 -3653 -2356 836 1957 1762 881 -1501 -3378
2065 -3378 -1211 2580 2870 -217 -2014 -1595 -1024 408 2561 2178 -1634 -3612 -532 2468 1651 -228
2081 -228 -403 -951 -1855 -7 2783 1830 -1564 -2091 -216 608 893 1778 595 -2364 -2122 1533 2424 -45
2099 -45 -689 337 -702 -1468 1140 2862 -152 -2719 -645 1606 518 -346 603 169 -1697 -756 1757
$$ packed form
1986c450L662M032M04m897m701J386M820K380q68k040l360k101L492O056K30n615
2002e70l523R92K298K842K325k221n740j380M515L479k93j172k581l348J143O265
2018C031K322m813m109J267J725R12K641Q02m985m127L321N041J74k246j339j985
2034b368j006L739M425j900m906r09K015J135J457J643k304m710K41N049K120
2049C721k545j903l65p74P57L445J296l731l554J297L192J121j95q81k382j877
2065c378K167L791K90l087j797M19N71J432K153l83l812j978L080L000q17j879
2081b28j75n48r04J848K790r53l394n27J875Q24K85Q85j183k959K42L655Q91k469
2099d5o44J026j039p66K608J722l014k567K074K251j088q64R49m34j866R41K513
$$ [...]
8191a00
##END NTUPLES=NMR FID
##END=
