##TITLE=1H_IPEDM2511
 CDCl3, 8 sc, 
 26.11.2020
##JCAMPDX= 6.0         $$ Bruker NMR JCAMP-DX V2.0
##DATA TYPE= NMR FID
##DATA CLASS= NTUPLES
##ORIGIN= UXNMR, Bruker Analytische Messtechnik GmbH
##OWNER= root
$$ XWIN-NMR		Version 3.5
$$ Thu Nov 26 10:35:00 2020 Russian Standard Time (UT+4h)  she@DPX200
##.OBSERVE FREQUENCY= 200.1315066352
##.OBSERVE NUCLEUS= ^1H
##.DELAY= (6, 6)
##.ACQUISITION MODE= SIMULTANEOUS
##.ACQUISITION SCHEME= undefined
##.AVERAGES= 8
##.DIGITISER RES= 18
##SPECTROMETER/DATA SYSTEM= spect
##.PULSE SEQUENCE= zg30
##.SOLVENT NAME= CDCl3
##.SHIFT REFERENCE= (INTERNAL, CDCl3, 0, 15.7039)
##AUDIT TRAIL= $$ (NUMBER, WHEN, WHO, WHERE, WHAT)
$$ ##TITLE= Audit trail, XWIN-NMR		Version 3.5
$$ ##JCAMPDX= 5.01
$$ ##ORIGIN= Bruker BioSpin GmbH
$$ ##OWNER= she
$$ F:/spectra/data/she/nmr/H-F/1/audita.txt
$$ ##AUDIT TRAIL=  $$ (NUMBER, WHEN, WHO, WHERE, WHAT)
(   1,<2020-11-26 10:33:31.25 +0400>,<she>,<DPX200>,
      <created by zg, POWCHK disabled, PULCHK disabled
       configuration hash MD5:
       00 E9 B6 7A A2 85 ED C7 34 08 36 98 17 FE 4E 26
       data hash MD5: 16K
       49 71 75 CC 12 5F 6D C9 07 7D 5F 92 42 15 7D ED>)
$$ ##END=
$$ 
$$ hash MD5
$$ 7A 1B EB 25 0F 60 F8 98 1A 88 3B 70 0D 70 90 FF
##$RELAX= 
##$RELAX= 
##$RELAX= 
##$RELAX= 
##$RELAX= 
##$RELAX= 
$$ Bruker specific parameters
$$ --------------------------
##$DU= <F:/spectra>
##$EXPNO= 1
##$NAME= <H-F>
##$PROCNO= 1
##$TYPE= <nmr>
##$USER= <she>
##$AMP= (0..31)
100 100 100 100 100 100 100 100 100 100 100 100 100 100 100 100 100 100 
100 100 100 100 100 100 100 100 100 100 100 100 100 100 
##$AQSEQ= 0
##$AQ_mod= 1
##$AUNM= <au_zg>
##$AUTOPOS= <>
##$BF1= 200.13
##$BF2= 200.13
##$BF3= 200.13
##$BF4= 200.13
##$BF5= 200.13
##$BF6= 200.13
##$BF7= 200.13
##$BF8= 200.13
##$BYTORDA= 1
##$CFDGTYP= 0
##$CFRGTYP= 5
##$CHEMSTR= <none>
##$CNST= (0..31)
1 1 145 1 1 1 1 1 1 1 1 1 1 1 1 1 1 1 1 1 1 1 1 1 1 1 1 1 1 1 1 1 
##$CPDPRG= <>
##$CPDPRG1= <>
##$CPDPRG2= <>
##$CPDPRG3= <>
##$CPDPRG4= <mlev>
##$CPDPRG5= <mlev>
##$CPDPRG6= <mlev>
##$CPDPRG7= <mlev>
##$CPDPRG8= <mlev>
##$CPDPRGB= <>
##$CPDPRGT= <>
##$D= (0..31)
0 1.2 0 0 0 0 0 0 0 0.06 0 0.03 0 0 0 0 0.0002 0 0 0 0 0 0 0 0 0 0 0 0 
0 0 0 
##$DATE= 1606372410
##$DBL= (0..7)
120 120 120 120 120 120 120 120 
##$DBP= (0..7)
150 150 150 150 150 150 150 150 
##$DBP07= 0
##$DBPNAM0= <>
##$DBPNAM1= <>
##$DBPNAM2= <>
##$DBPNAM3= <>
##$DBPNAM4= <>
##$DBPNAM5= <>
##$DBPNAM6= <>
##$DBPNAM7= <>
##$DBPOAL= (0..7)
0.5 0.5 0.5 0.5 0.5 0.5 0.5 0.5 
##$DBPOFFS= (0..7)
0 0 0 0 0 0 0 0 
##$DE= 6
##$DECBNUC= <off>
##$DECIM= 32
##$DECNUC= <off>
##$DECSTAT= 4
##$DIGMOD= 1
##$DIGTYP= 9
##$DL= (0..7)
0 120 120 120 120 120 120 120 
##$DP= (0..7)
150 150 150 150 150 150 150 150 
##$DP07= 0
##$DPNAME0= <>
##$DPNAME1= <>
##$DPNAME2= <>
##$DPNAME3= <>
##$DPNAME4= <>
##$DPNAME5= <>
##$DPNAME6= <>
##$DPNAME7= <>
##$DPOAL= (0..7)
0.5 0.5 0.5 0.5 0.5 0.5 0.5 0.5 
##$DPOFFS= (0..7)
0 0 0 0 0 0 0 0 
##$DQDMODE= 0
##$DR= 18
##$DS= 0
##$DSLIST= <SSSSSSSSSSSSSSS>
$$ [...]
##$SUBNAM2= <"">
##$SUBNAM3= <"">
##$SUBNAM4= <"">
##$SUBNAM5= <"">
##$SUBNAM6= <"">
##$SUBNAM7= <"">
##$SUBNAM8= <"">
##$SUBNAM9= <"">
##$SW= 16.9725356469052
##$SWIBOX= (0..15)
0 0 2 0 0 0 0 0 0 0 0 0 0 0 0 0 
##$SW_h= 3396.73913043478
##$TD= 16384
##$TD0= 1
##$TE= 0
##$TE2= 300
##$TE3= 300
##$TEG= 300
##$TL= (0..7)
0 120 120 120 120 120 120 120 
##$TP= (0..7)
150 150 150 150 150 150 150 150 
##$TP07= 0
##$TPNAME0= <>
##$TPNAME1= <>
##$TPNAME2= <>
##$TPNAME3= <>
##$TPNAME4= <>
##$TPNAME5= <>
##$TPNAME6= <>
##$TPNAME7= <>
##$TPOAL= (0..7)
0.5 0.5 0.5 0.5 0.5 0.5 0.5 0.5 
##$TPOFFS= (0..7)
0 0 0 0 0 0 0 0 
##$TUNHIN= 0
##$TUNHOUT= 0
##$TUNXOUT= 0
##$USERA1= <user>
##$USERA2= <user>
##$USERA3= <user>
##$USERA4= <user>
##$USERA5= <user>
##$V9= 5
##$VALIST= <valist>
##$VCLIST= <CCCCCCCCCCCCCCC>
##$VD= 0
##$VDLIST= <DDDDDDDDDDDDDDD>
##$VPLIST= <PPPPPPPPPPPPPPP>
##$VTLIST= <TTTTTTTTTTTTTTT>
##$WBST= 1024
##$WBSW= 4
##$XGAIN= (0..3)
0 0 0 0 
##$XL= 0
##$YL= 0
##$YMAX_a= 278902
##$YMIN_a= -200748
##$ZGOPTNS= <>
##$ZL1= 120
##$ZL2= 120
##$ZL3= 120
##$ZL4= 120
##$ABSF1= 10
##$ABSF2= 0
##$ABSG= 5
##$ABSL= 3
##$ALPHA= 0
##$AQORDER= 0
##$ASSFAC= 0
##$ASSFACI= 0
##$ASSFACX= 0
##$ASSWID= 0
##$AUNMP= <proc_1d>
##$AZFE= 0.1
##$AZFW= 0.1
##$BCFW= 1
##$BC_mod= 2
##$BYTORDP= 1
##$COROFFS= 0
##$CY= 11.3945322036743
##$DATMOD= 1
##$DC= 2
##$DFILT= <>
##$DTYPP= 0
##$F1P= 15.9154993809931
##$F2P= -4.1035820241983
##$FCOR= 0.5
##$FTSIZE= 0
##$FT_mod= 4
##$GAMMA= 1
##$GB= 0.15
##$INTBC= 1
##$INTSCL= 1
##$ISEN= 128
##$LB= 0.24
##$LEV0= 0
##$LPBIN= 0
##$MAXI= 10000
##$MC2= 0
##$MEAN= 0
##$ME_mod= 0
##$MI= 1.114404
##$NCOEF= 0
##$NC_proc= 0
##$NLEV= 6
##$NOISF1= 3.799351
##$NOISF2= 2.8
##$NSP= 1
##$NTH_PI= 0
##$NZP= 0
##$OFFSET= 15.70392
##$PC= 1
##$PHC0= -10961.44
##$PHC1= 12.00088
##$PH_mod= 1
##$PKNL= yes
##$PPARMOD= 0
##$PSCAL= 0
##$PSIGN= 0
##$REVERSE= no
##$SF= 200.130013532006
##$SI= 16384
##$SIGF1= 3
##$SIGF2= 2
##$SINO= 400
##$SIOLD= 16384
##$SREGLST= <1H.CDCl3>
##$SSB= 0
##$STSI= 0
##$STSR= 0
##$SW_p= 3612.71676300578
##$SYMM= 0
##$S_DEV= 0
##$TDeff= 0
##$TDoff= 0
##$TI= <>
##$TILT= no
##$TM1= 0
##$TM2= 0
##$TOPLEV= 0
##$USERP1= <user>
##$USERP2= <user>
##$USERP3= <user>
##$USERP4= <user>
##$USERP5= <user>
##$WDW= 1
##$XDIM= 8192
##$YMAX_p= 0
##$YMIN_p= 0
$$ End of Bruker specific parameters
$$ ---------------------------------
##NTUPLES= NMR FID
##VAR_NAME=  TIME,          FID/REAL,        FID/IMAG
##SYMBOL=    X,             R,               I
##VAR_TYPE=  INDEPENDENT,   DEPENDENT,       DEPENDENT
##VAR_FORM=  AFFN,          ASDF,            ASDF
##VAR_DIM=   8192,          8192,            8192
##UNITS=     SECONDS,       ARBITRARY UNITS, ARBITRARY UNITS
##FACTOR=    0.0002944,     1,               1
##FIRST=     0,             0,               0
##LAST=      2.4114304,     0,               0
##MIN=       0,             -200748,         0
##MAX=       2.4114304,     278902,          0
$$ Real data points
##PAGE= N=1
##DATA TABLE= (X++(R..R)), XYDATA
0@%%%%%%%%%qJ6j6J6k4L2l2M0n6P2q7J03j20J38j62J92k24K63l04L50m04M62n26
$$ 0 0 0 0 0 0 0 0 0 0 -8 8 -8 8 -16 16 -16 24 -32 40 -47 56 -64 74 -88 104 -120 143 -161 189 -215 247 -279
32b79N96o75P63q59R64j081J207j345J498j665J846k044K263k501K759l043L352
$$ -279 317 -358 405 -454 510 -571 636 -709 789 -876 970 -1074 1189 -1312 1447 -1596 1756
49A756l690M062m471M927n436O004o643P368q196R156j0285J1630j3268J5310
$$ 1756 -1934 2128 -2343 2584 -2852 3152 -3491 3877 -4319 4837 -5448 6182 -7086 8224
63H224j7933K1441k6393L3931m6866P4826k29800Q8358K85461k58380K05564l39181
$$ 8224 -9709 11732 -14661 19270 -27596 47230 -182570 -94212 191249 -67131 138433 -200748
75b00748J82064K57014l29196M8157m5935J09705J30474k55736R2338J1029P2311
$$ -200748 -18684 238330 -90866 -42709 -88644 21061 151535 -104201 -11863 -834 71477
86G1477m5695j59914J79016m2041Q655L734q7709J89590j31849n6131Q4059k4118
$$ 71477 25782 -134132 44884 2843 11498 15232 -72477 117113 -14736 -70867 13192 -10926
98a0926P9001j31876K2598J14736k9834l1009j47142J60587N9010j09732J7211
$$ -10926 68075 -63801 -41203 73533 43699 12690 -134452 26135 85145 -24587 -7376
109g376j06420K31997j1437k37649J31672o1126J60303l2079k53145K54256l5700
$$ -7376 -113796 118201 106764 -130885 787 -60339 99964 67885 -185260 68996 33296
120C3296J0498j9413k05385K83601n9603r2019P5222j23996K20655r2315j37603
$$ 33296 43794 24381 -181004 102597 42994 -49025 26197 -97799 122856 30541 -107062
131a07062J51036q7287J03437o3609q3676J73156q7664M473k4235j8350J12014
$$ -107062 43974 -43313 60124 -3485 -87161 85995 -1669 2804 -21431 -39781 72233
142G2233j05711Q846K7491J7463L3209j20947N6671L5899j3906p042p8678J13796
$$ 72233 -33478 -24632 2859 20322 53531 -67416 -10745 25154 11248 4206 -74472 39324
154C9324P644n7893p748l4053J21407n8872o0062M9531j6590J02760j08608m1952
$$ 39324 46968 -10925 -18673 -52726 68681 9809 -50253 -722 -17312 85448 -23160 -65112
166f5112J09180o2079O6614q8588j6884J47547j14866L5479k7853k5708J29986
$$ -65112 44068 -18011 48603 -39985 -56869 90678 -24188 11291 -16562 -42270 87716
177H7716j35204K9669M0302m6131Q8728j11531L0682N8502p3702N8035o1656L5710
$$ 87716 -47488 -17819 22483 -23648 65080 -46451 -15769 42733 -30969 27066 -34590 1120
189A120M5788q3642N1741k6502J7240J8155o8268O1325j0602j923L350l9657N8598
$$ 1120 46908 -36734 15007 -11495 5745 23900 -44368 16957 6355 4432 7782 -31875 26723
202B6723k4255j1744O190j3529M9981m1445j853J4163j3005L6206n1297J7159
$$ 26723 2468 -9276 -3086 -16615 33366 -8079 -9932 4231 -8774 27432 -23865 -6706
214f706K0586k5161L5844m9668K5225J9693m2985M3702m0127J8804K3417m9870
$$ -6706 13880 -11281 24563 -25105 120 19813 -23172 20530 -19597 -793 22624 -27246
226b7246M8563l2670L660K9860m8342M4294k4591n418L6201m5090L1126j4147
$$ -27246 21317 -11353 -7693 22167 -26175 18119 -6472 -11890 24311 -20779 10347 -3800
238c800o207L3526m2470K2543k037o474K2304l8236K4149N729j2325J1491k7098
$$ -3800 -10007 23519 -18951 3592 1555 -4919 17385 -20851 3298 9027 -3298 8193 -18905
251a8905K8313J277k0923J1056r996K6023j1653k1621K0131k616J1772k1522p398
$$ -18905 9408 10685 -10238 818 -9178 16845 5192 -16429 3702 1086 12858 -8664 -16062
264a6062L2376j0590k390j7511Q462L0109l1050m088M261J5117J4886m2622P136
$$ -16062 16314 5724 3334 -14177 -5715 24394 -6656 -10744 -6483 8634 23520 -19102 -11966
277a1966K2514q86o423l0598K8020K4803k3996j2719n298L2730J438l8145N356
$$ -11966 10548 9662 3239 -27359 661 25464 1468 -11251 -16549 16181 17619 -20526 -15170
290a5170K0131J9153k2523k8764K8793J6474j2398k5920J649M1426m987l1448
$$ -15170 4961 24114 1591 -27173 1620 18094 5696 -20224 -18575 22851 17864 -13584
302a3584m554K3758J9295l2670k0835K7970K5584j2580l6025R205L6630n529l4604
$$ -13584 -18138 5620 24915 -7755 -28590 -620 24964 12384 -23641 -14436 22194 16665 -17939
315a7939r612L7452K1917l3962k5441K4146L1363j7498l9316Q619M2174N386m0240
$$ -17939 -27551 9901 31818 -2144 -27585 -3439 27924 10426 -28890 -20271 21903 27289 -12951
328a2951j3534L5787J9622l1039l0706K4571L8937j4853l8832O076L7689K753
$$ -12951 -26485 9302 28924 -2115 -32821 -8250 30687 15834 -22998 -16922 20767 23520
340B3520l9998j5272M0251K4371l3692k6311K2674L3529j4815m6274J0334M5193
$$ 23520 -16478 -31750 8501 32872 -820 -27131 -4457 29072 14257 -32017 -21683 23510
352B3510J575l7131j7143L9357K3649l7962l0442K3346M2709j3876m4612R000
$$ 23510 25085 -12046 -29189 10168 33817 -4145 -34587 -11241 31468 17592 -27020 -18020
364a8020L7709Q738m3105k3958M7144K1462k7663k8068J1910M7785j7753m7658
$$ -18020 19689 28427 -14678 -38636 8508 29970 2307 -25761 -13851 33934 16181 -31477
376c1477J1483L3228J4865l6652k4939M5154J9101l1652k9226J4990M4696j2844
$$ -31477 -19994 13234 28099 -8553 -33492 11662 30763 -889 -30115 -15125 29571 16727
388A6727m2485P765L8548P588m1997k0184L9087K5971k9028l1326K1168L9381
$$ 16727 -25758 -17993 20555 28143 -13854 -34038 5049 31020 1992 -29334 -8166 31215
400C1215j2555m5730K221M2753P627l3915k1735L4698L2270l5814k9821J5973
$$ 31215 18660 -27070 -24849 17904 25531 -8384 -30119 4579 36849 1035 -28786 -12813
412a2813L3279L357m7847J699M4484m85k4437k7290K4631L9239l4918k1800J6357
$$ -12813 20466 23823 -24024 -22325 22159 21674 -2763 -30053 -5422 33817 -1101 -22901 -6544
425f544K4182P549m7696j033M1329l789j7304k0780K3190L5467l6985k0986J6620
$$ -6544 17638 25187 -22509 -23542 17787 13998 -3306 -24086 -896 34571 -2414 -23400 -6780
438f780K0323N806m2467K971M3048n996k1873j9900K0593L5636l3809k3487K1438
$$ -6780 13543 19349 -23118 -20147 22901 16905 -4968 -24868 -4275 31361 -2448 -25935 -4497
451d497K1219N788m0147q831M3284L01k2853j4580J2978L6959k0925l2831J6761
$$ -4497 16722 22510 -17637 -26468 16816 17117 -5736 -20316 -7338 29621 8696 -24135 -7374
464g374J6900O223k3384j6901L6708P240k3621o143J403K4516o087l1338K0291
$$ -7374 9526 15749 -7635 -24536 12172 19412 -4209 -10352 -8949 15567 9480 -21858 -1567
477a567J3215m550p318j8305K7604O837l0134Q826M027J4441j695l5680K6189
$$ -1567 11648 7098 -220 -18525 9079 15916 -14218 -5392 -1365 13076 11381 -24299 1890
490A890J2706j5458n30j9614L2418J1393l8862J1721J81J4860M514m3276K6450
$$ 1890 14596 -862 -1392 -21006 11412 22805 -16057 -4336 -4155 10705 15219 -28057 -1607
503a607J5525j1357M103k9309K6088J7030l2373R430n734J2843J3419l3787J2205
$$ -1607 13918 2561 6664 -22645 3443 20473 -11900 -2470 -8204 4639 18058 -15729 -3524
516c524R055o768P994j8497R349J3343j5432M897r50k124P661r963K010R881j0633
$$ -3524 5531 -1237 6757 -11740 -2391 10952 -4480 417 -533 -2657 5004 -4959 -2949 6932 -3701
531c701J936M781n315Q264j1015k918J8979j3488K382L61r346K4276j8231n905
$$ -3701 -1765 3016 -2299 5965 -5050 -7968 11011 -2477 -95 266 -9080 15196 -3035 -8940
545h940J6133j6159K1644j2721j3883K7699k1302J2834l12k2340L1949j8479K854
$$ -8940 7193 -8966 12678 -43 -13926 13773 -7529 5305 4993 -17347 14602 -3877 -1023
558a023J1624k8524K8823q496q708J7299k7341K2842L737j9704J5305j6625J5210
$$ -1023 10601 -17923 10900 2404 -6304 10995 -16346 6496 10233 -9471 5834 -10791 4419
571D419Q905k5303J1136p57O566L842k1701R143J0903k434n958p668Q340R690
$$ 4419 13324 -11979 -843 -1600 4966 8808 -12893 -3750 7153 4719 -1239 -8907 -567 9123
585I123o749j2556Q809O411k249k239j2040J7318J308j5967J1706q841J2759j181
$$ 9123 2374 -10182 -1373 5038 2789 550 -11490 5828 7136 -8831 2875 -5966 6793 5612
599E612k2774K7666r727l271O009k0423L4365j3620j9751K3453j4993K2846j5636
$$ 5612 -17162 10504 777 -2494 3515 -16908 17457 3837 -15914 7539 -7454 15392 -244
612b44k4404M0831j3360J017q101j5509M3746j9581j6938R015k425K9656k6020
$$ -244 -24648 16183 2823 3840 -4261 -19770 23976 4395 -12543 -3528 -5953 23703 -2317
625b317j7503K5393O11N731k4371k523L0678p858r948j0852J3102J7043j9416
$$ -2317 -19820 5573 6184 11915 -12456 -14979 15699 7841 -2107 -12959 143 17186 -2230
638b230q742N060J8627m178k1471Q774Q877Q228j8896j1636K8448l406n507j3245
$$ -2230 -10972 -5912 12715 8537 -12934 -4160 4717 12945 -5951 -17587 10861 7455 1948 -11297
652a1297K317L2729k5689j0925Q356O211K1307l7910r30K9374q464L611l1092
$$ -11297 -8980 23749 -1940 -12865 -4509 1702 23009 -14901 -15831 13543 5079 8690 -22402
665b2402J3839L5409l0552k497o326J7459K0848m4138N822J6836N412J107l4836
$$ -22402 -8563 26846 -3706 -6203 -12529 4930 25778 -18360 -12538 4298 9710 10817 -24019
678b4019K1814K0392j5861q421j2540L0290M895k8228K618P421K0593j6648k3863
$$ -24019 -2205 18187 2326 -6095 -18635 11655 16550 -11678 -9060 -1639 18954 2306 -21557
691b1557K1727J0022J166k3137m106L2801o441j4963j2044J4838K4915k6555j0093
$$ -21557 170 10192 11358 -11779 -15885 16916 10475 -4488 -16532 -1694 23221 -3334 -13427
704a3427Q477J7332M359l6321R672J9785M46q146k5335K8935J3907k3826l727
$$ -13427 -4950 12382 16741 -19580 -9908 9877 10323 2177 -23158 5777 19684 -4142 -7869
717g869n586K9304k410l3206J6189Q184J0302j5318k3668L1935M781j1968j1394
$$ -7869 -13455 15849 13439 -19767 -3578 4606 14908 -410 -24078 7857 12638 670 -10724
730a0724j228L1967j2288k0912L756J2045J6693k7197q642K1534N906k095k7108
$$ -10724 -11952 20015 7727 -13185 -9429 2616 19309 -7888 -16530 5004 10910 8815 -18293
743a8293R392K5941j3420r396q558J9756J4272k8746k513J0357J2726m173k5359
$$ -18293 -8901 17040 3620 -5776 -14334 5422 19694 -9052 -11565 -1208 11518 7345 -18014
756a8014J4376J5335l586j4155r579K4868J692j5718n293N985K1963j5589j6463
$$ -18014 -3638 11697 8111 -6044 -15623 9245 10937 -4781 -10074 -4089 17874 2285 -14178
769a4178J2215P301O626k0913m637K4689k909p927j1873P697J9959j6086r699
$$ -14178 -1963 5338 11964 -8949 -13586 11103 8194 267 -11606 -3909 16050 -36 -9735
782i735M804J2095M967k1307N37J3677L464p722j4352J4426J0538r559q098k052
$$ -9735 -4931 7164 12131 -9176 -8639 5038 8502 780 -13572 854 11392 1833 -6265 -8317
796h317J7468j607j6366L323O981R110j0666j2040J4105M899m403r403m19J6188
$$ -8317 9151 7544 -8822 -5499 1482 10592 -74 -12114 1991 6890 2487 -6916 -7335 8853
810H853l303j0585j155P505P359j1142n312P013P042j973j2065M408Q585j977
$$ 8853 5550 -5035 -6190 1315 8674 -2468 -7780 -767 6275 4302 -7763 -3355 5230 3253
824C253n308n764J0313M767r788j206J654P072j462j0733N306N657o96l882m670
$$ 3253 -2055 -7819 2494 7261 -2527 -3733 -2079 4993 3531 -7202 -1896 3761 3065 -817 -5487
839e487P393K942o417j926K228N268j647o088K502L642p2l357k585N003J876m113
$$ -5487 1906 4848 -1569 -3495 -1267 4001 2354 -3734 -1232 2410 2338 -1019 -3604 1399 3275 -838
855h38k61M51K606M1n149K972J836j539R53l236K848J833m538K446q30J10K113
$$ -838 -1099 -648 1958 1999 -3150 -178 1658 119 1072 -2164 684 2517 -2021 425 -405 -295 1818
872A818l599K381K09k095K223j380L17J12p86J822q86j201M82J272j69j470k53
$$ 1818 -1781 600 809 -1286 937 -443 -126 -14 -800 1022 136 -1065 -583 689 520 -950 -1203
889a203J192K359l427j244L155l57J370m959Q82O615n042K96k365J908P607j0849
$$ -1203 -11 2348 -1079 -2323 832 475 1845 -3114 -2232 4383 -659 -363 -2728 -820 6787 -4062
905d062J326M220j448N686j2421L801R921q625L150p077M795J0695j5152K840
$$ -4062 -2736 1484 36 5722 -6699 -2898 7023 -1602 1548 -5529 -734 9961 -5191 -2351
919b351K229J428O143j5506N556Q556n745J096q248Q165O612j1305M89J317O561
$$ -2351 -122 1306 7449 -8057 -2501 6055 310 1406 -6842 1323 7935 -3370 -2881 -1564 4997
934D997r90j1432N419O431l22o888l345R340K837o663p388P953P829o748n658
$$ 4997 4007 -7425 -2006 4425 4103 -2785 -6130 3210 6047 -616 -8004 -51 7778 1030 -4628
949d628j838J3265Q75j5887M600L378Q249m524j7935J7244L936n721k095j2056
$$ -4628 -6466 6799 7674 -8213 -3613 -235 8014 3490 -14445 2799 6735 1014 -1081 -13137
963a3137K2234l80j8162Q491l278J4023n518j9879J9388L97r34m826j1021K2959
$$ -13137 9097 8717 -9445 -954 -4232 9791 4273 -15606 3782 4179 3245 -1581 -12602 10357
977A0357m644j2377L650q03J5762j1714j2156J4680J873J101j2250k577J8635
$$ 10357 5713 -6664 -3014 -3817 11945 231 -11925 2755 4628 5729 -6521 -9098 9537
990I537l781r810l444Q421J0210j1440r407O806J3055n642j2781L351Q616P881
$$ 9537 5756 -4054 -7498 923 11133 -307 -9714 -2908 10147 4505 -8276 -4925 3691 11572
1004A1572j6226p543J8249m93j759j2336K78K3969j4481q086K937K547J7138k2216
$$ 11572 -4654 -12197 6052 5559 3800 -8536 -8258 15711 1230 -6856 -3919 -1372 15766 -6450
1018f450m971J8498m484M560j7874K856K3161j6521j999l096O362J5732k4695
$$ -6450 -11421 7077 2593 7153 -10721 -7865 15296 -1225 -3224 -6320 42 15774 -8921
1031h921J059J1503l89M026k0050Q807J6451j2489l101n309J1670Q376j8340j055
$$ -8921 -7862 3641 3252 7278 -12772 -3965 12486 -3 -3104 -8413 3257 11633 -6707 -7762
1045g762R148O750n257j3122O391J1873j842j3915N48J2876J208o829j1516J1407
$$ -7762 1386 8136 2879 -10243 -3852 8021 6179 -7736 -7188 5688 6896 67 -11449 -42
1059d2J1669j3382l313o97J1963M290k1193O754P486J601j548j7437J6558P211
$$ -42 11627 -1755 -5068 -5765 6198 10488 -10705 -3951 3535 5136 3588 -13849 2709 9920
1073I920j2300R93p466J6699Q66j9953J0721J048O354l812j6961J8561J831p253
$$ 9920 -2380 -1387 -8853 7846 8712 -11241 -520 528 6882 3070 -13891 4670 6501 -752
1087g52j291o665J7839l088j4049N900K040Q061q201r894J2377L359l144p937
$$ -752 -2043 -8708 9131 6043 -8006 -2106 -66 7995 -206 -10100 2277 5636 2492 -5445
1101e445J19J1810k272q279k040Q589M251q332l754L105R263m853r697O518L247
$$ -5445 -5326 6484 4212 -4067 -6107 2482 6733 -1599 -5353 -2248 7015 2162 -7535 -1017 2230
1116B230L179p666o065J3719k237m149k382j309J3510q305o468O273p47P164j0040
$$ 2230 5409 -2257 -8322 5397 3160 -989 -3371 -4680 8830 525 -5943 330 -417 6747 -3293
1131c293l521J2317m535P68n544J19J1862r520j567K041N90O954j0491J28P168
$$ -3293 -6814 5503 968 1736 -3808 -3689 8173 -1347 -2914 -873 -283 6671 -3820 -3692 3476
1146C476k534J056o388L067O688n712j272l89L827J787o253M54K945K261k767
$$ 3476 942 1998 -4390 -1323 5365 -347 -1619 -2008 1819 3606 -2647 -2193 752 3013 246
1161B46l442L452J601j45m028J81M832k081o53j989J700L753n111P82O12L10K581
$$ 246 -3196 256 1857 1712 -2316 -2135 2697 616 -37 -2026 -326 3427 -1684 -902 -290 20 2601
1178B601n376K533J730k520K498l905K613J760m031L169k055R91J454l846L531
$$ 2601 -2775 -242 1488 -1032 1466 -2439 174 1934 -2097 1072 -983 8 1462 -2384 1147
1193A147j343o74K161k920K613j084j134K620k347J070k93l08J836k409M84J047
$$ 1147 -196 -870 1291 -1629 984 -100 -1234 1386 -961 109 -184 -492 1344 -1065 -581 466
1209D66k70M24k036J371J374j149p18o31K490j28k114j19J242K072k444j797K192
$$ 466 196 620 -1416 -45 1329 180 -538 -1169 1321 1193 -921 -1040 202 2274 -170 -1967 225
1226B25J289j23l232K90L829q80k121j434K467K975l873j827K121K455k60m656
$$ 225 1514 1391 -1841 -1551 2278 1398 -723 -2157 310 3285 -588 -2415 -294 2161 1901 -2755
1242b755Q03M341k85l311j950L887K764l933k718K111M276j415n328J368M496
$$ -2755 -1952 2389 2104 -1207 -3157 730 3494 -439 -3157 -1046 3230 1815 -3513 -2145 2351
1257B351M77m401k516N105K978m445l406K588N027j596o115J145N666N09n212
$$ 2351 2828 -1573 -4089 1016 3994 -451 -3857 -1269 3758 2162 -3953 -2808 2858 3367 -1845
1272a845k494N209L771m751m517L361N442j753o310N87O342J079o124k769N757
$$ -1845 -4339 870 4641 -110 -4627 -1266 4176 2423 -3887 -3300 3042 4121 -2003 -4772 985
1287I85M044m700n198L412O203k015o813M90O879J325o666k887O017M444m981
$$ 985 5029 329 -4869 -1457 4746 2731 -4082 -3592 3287 4612 -2054 -4941 1076 5520 539
1302E39n960L957O488k293o683k05P717J677p759k562N784M959m719o957M420
$$ 539 -5421 -1464 5024 2731 -3952 -4157 3560 5237 -2522 -5084 700 5659 940 -6017 -1597
1317a597O780k211o913r20Q342J795p758k731N413N692m742p550M552O680j691
$$ -1597 5183 2972 -3941 -4861 3481 5276 -2482 -5213 200 5892 1150 -6400 -1848 4832 3141
1332C141o962j438Q725J923p883k783N167N936m496p774M528O992k012o736j470
$$ 3141 -3821 -5259 3466 5389 -2494 -5277 -110 5826 1330 -6444 -1916 5076 3064 -3672 -5142
1347e142Q164K691q200k969N947N045l998p544L566P928k467o838p73P281L459
$$ -5142 3022 5713 -2487 -5456 491 5536 1538 -6006 -2440 5488 3021 -3817 -4590 2691 6150
1362F150q336l574O547M404l393p422K626Q881k663o830p27O221M538q154m195
$$ 6150 -2186 -5760 787 5191 1798 -5624 -2998 5883 3220 -3610 -4337 1884 6422 -1732 -5927
1377e927O837L829k420p359J434R324k701o434l43M867N158p535m661P039K861
$$ -5927 910 4739 2319 -5040 -3606 5718 3017 -3417 -3760 1107 6265 -1270 -5931 1108 3969
1392C969k057o226N76R230k767o307M97L850M794o785m805P394K446k433n279
$$ 3969 1912 -4314 -3738 5492 2725 -3582 -3085 765 5559 -1226 -6031 1363 3809 1376 -3903
1407c903J53Q847k285o759R09L884M279n702n467O739L388k914m630l02P742k20
$$ -3903 -3750 5097 2812 -3947 -3038 846 5125 -577 -6044 695 4083 1169 -3461 -3763 3979 3759
1423C759p210K60M122L066l410n876M987M649l620l005o40N196J861p309O06M106
$$ 3759 -3451 -3191 931 3997 587 -5289 -302 4347 727 -2278 -2918 2278 4139 -3170 -2564 1542
1439A542O39p80n662L764N070n257p30m78L298K954q043J846M086j212N94n945
$$ 1542 2181 1401 -4261 -497 4573 -684 -1414 -1892 1406 4360 -3683 -1837 2249 1037 1631 -4314
1455d314L829N445o266J99p23K908L388q136J709L739p12Q45n839L037M947m617
$$ -4314 -485 4960 -1306 -1107 -1830 1078 4466 -3670 -1961 1778 1066 1911 -3928 -891 4056 -561
1471e61l18j099K359L144n497j03K918q6J57k878N80L619k039j534R89K57J339
$$ -561 -879 -1978 381 3525 -1972 -2075 843 757 914 -1964 -1384 2235 196 -1338 -349 -92 1247
1488A247j357k035L431q34j369J326j956L236j091l289M341k108P88M71l807N517
$$ 1247 -110 -2145 1286 452 -917 409 -1547 1689 598 -2691 1650 -458 330 801 -3006 2511
1504B511k220j839L058l947M644j433l608N248l825K242N54m426N497k979n7K605
$$ 2511 291 -1548 1510 -2437 2207 774 -2834 2414 -1411 831 1385 -3041 2456 -523 -580 2025
1520B025m504M068j349j364L312m126K303P81k034K192k635J183J761k135K38
$$ 2025 -2479 1589 240 -1124 2188 -1938 365 1146 -888 1304 -1331 -148 1613 -522 -284
1535b84l01R84R16j820q14J707R48j615l38l75J982O74l927K185N44l06J090m417
$$ -284 -585 399 1315 -505 -1319 388 1336 -279 -617 -992 990 1664 -2263 -78 466 160 1250 -3167
1553c167M101R39l473K511l173L673P63n951M879j195N36R30n744O644o60l418
$$ -3167 934 1873 -1600 911 -2262 1411 2174 -3777 1102 -93 443 1373 -4371 2273 1613 -1805
1569a805K308l184N640j516n399M840q34K116k351m067O830r02j939j284n89N978
$$ -1805 503 -2681 2959 1443 -3956 884 50 2166 -185 -4252 2578 1676 -263 -1547 -2136 3842
1585C842k815l620J396K146K311m628j593L815J842j880l926K437L219r25l086
$$ 3842 1027 -2593 -1197 949 3260 -1368 -2961 854 2696 816 -3110 -673 2546 1621 -1465
1600a465j738N943m63l776o4L08N401m084l890M654J73J707m815j547P743l156
$$ -1465 -3203 2740 2277 -1499 -1563 -1255 4146 62 -3828 826 999 2706 -2109 -3656 4087 931
1616I31j660j685J141O867p021j998L644Q67K628p592Q45O737k516j143m254L985
$$ 931 -729 -2414 -1273 5594 -1427 -3425 219 1086 3714 -3878 -3033 3704 1188 45 -4209 -224
1632b24N464o652j165R41M104R90p664K115M020P79k965m521N706K592l339l021
$$ -224 5240 -1412 -2577 -1636 2468 3458 -4206 -2091 1929 2708 -257 -4778 928 3520 181 -2840
1648b840L53O478k148m712O37L184L454o182j963M882J364o08o138K547O103l580
$$ -2840 -2487 3991 1843 -2869 -2232 952 4406 -1776 -3739 1143 2507 1899 -4239 -1692 4411 831
1664H31k251j928M923L254p534K26K634L004r63p374M737L824j876k657l277P220
$$ 831 -1420 -3348 1575 4829 -2705 -2479 155 3159 2196 -5178 -441 3383 1507 -1150 -4427 2793
1680B793R64n901j09J143N511l135n991M460K335P10m803k155P086k94l280k638
$$ 2793 3757 -2144 -2253 -1110 4401 1266 -4725 -265 2070 2780 -2023 -4178 2908 2614 -666 -3304
1696c304K277N641m569l232J717L488J398o638N07M572N32k161m696M708L550
$$ -3304 -1027 4614 45 -3187 -1470 2018 3416 -3222 -2715 1857 2389 228 -4468 240 3790
1711C790l924k043m10N532j90o041J477K560K510l457m135N256J617j619l405
$$ 3790 -134 -2177 -2587 2945 2755 -3286 -1809 751 3261 -196 -4331 925 2542 923 -2482
1726b482j59O270k094l473n8K301L733n135k075L767J398o6n033J341M965k033
$$ -2482 -2641 3629 1535 -1938 -1996 305 4038 -1097 -3172 595 1993 1927 -3106 -1765 3200 1167
1742A167k047j842L593K784m918q23J724K840q74m752K303K744p2k713k074M573
$$ 1167 -880 -2722 871 3655 -1263 -2086 -362 2478 1604 -3148 -845 1899 1827 -886 -2960 1613
1758A613O36k782j340P84M127k469k903J671J552J386l761q41L782k01j055k362
$$ 1613 2249 -533 -1873 -1089 3038 569 -2334 -663 889 2275 -1486 -2327 1455 1254 199 -2163
1774b163J491L284k697j300J54K249R45l813O57J749P00q07l031K782J454j660
$$ -2163 -672 2612 -85 -1385 -1231 1018 1963 -1850 -1193 556 1256 449 -2582 200 1654 -6
1790fo84r87L113J2l089J036N77J429j104k360K402P37p41j050m00K251l00j448
$$ -6 -690 -1677 1436 1448 -1641 -605 -28 1401 297 -2063 339 1076 335 -715 -1115 1136 836 -612
1808f12j57R31J037j364o38P20Q33j48j469P27O73j25m08q30J361Mp51J69k65
$$ -612 -769 162 1199 -165 -803 -83 750 602 -867 -140 533 408 0 -830 531 535 -216 -47 -312
1827c12J072o82o47R68n51O21o75l23J418j277L80J52o08J266j347K46R80j243
$$ -312 760 78 -569 399 -152 469 -206 -529 889 -388 -8 144 -464 802 -545 -299 681 -562
1845e62Q52n58n6J072j509O93M15p83P00p96M78P15j312L24N62j59J51r98M85
$$ -562 290 -268 -324 748 -761 -68 347 -436 264 -532 -54 661 -651 -327 235 76 227 -771 -286
1864b86J276j130m84K66N17R38j792m65J922j96l03j260J25K632j387j379N17
$$ -286 990 -140 -624 -358 159 1097 -695 -1160 762 566 263 -997 -872 1760 373 -1006 -489
1881d89N84J646k119j338K488N4k82j451l33L106j235j687O41M62J568j863j557
$$ -489 95 1741 -378 -1716 772 826 544 -907 -1240 1866 631 -1056 -415 47 1615 -248 -1805
1898a805K736O7r75q21j93K854j139k488J501R49O83j805j905L489O45k433n62
$$ -1805 931 998 23 -798 -991 1863 724 -1764 -263 686 1369 -436 -2341 1148 1793 -640 -1202
1915a202J29L216p69m051J917J868N04j798l008L901J829l017r93k26L654J82
$$ -1202 -1073 2143 1374 -2677 -760 1108 1612 -186 -3194 707 2536 -481 -1474 -1700 1954 2136
1931B136m737J262K173Q43j397l414L291K303k664j087j92K979N22m246J006K412
$$ 2136 -2601 -1339 834 1677 280 -3134 157 2460 -204 -1291 -1483 1496 2018 -2228 -1222 1190
1947A190P5j275k393K627K455l172j267J273K126K03m179O51L931p72k086j766
$$ 1190 1265 -10 -2403 224 2679 -493 -1760 -487 1639 1842 -2337 -1686 2245 1473 -613 -2379
1963b379K360L685l957k481K468K020P89m710o75N347m97k296k239J574M930l560
$$ -2379 -19 3666 -291 -2772 -304 1716 2505 -2205 -2880 2467 1970 -326 -2565 -991 3939 379
1979C79l153K067J798J718m342j535N024l04j744j875P81M324k771k804K024J395
$$ 379 -2774 -707 1091 2809 -1533 -3068 1956 1652 -92 -1967 -1186 3138 367 -2437 -413 982
1995I82R09l318j091M405l33k439r24J327L252k474l282K631K269n62k916j153
$$ 982 1891 -1427 -2518 1887 1554 -885 -1809 -482 2770 296 -2986 -355 1914 1352 -1564 -2717
2011b717M485P92l951q81J879L184j602m582K390L220o48k479k229M244K056m194
$$ -2717 1768 2560 -1391 -2272 -393 2791 1189 -3393 -1003 2217 1569 -910 -3139 1105 3161 -1033
2027a033q51J092L009l67m747J903K786n75j440k392L400J917l718k68Q67K081
$$ -1033 -1884 -792 2217 1850 -2897 -994 1792 1217 -223 -2615 785 2702 -1016 -1284 -417 1664
2043A664j99l965J834K556j099j373j428K866J617l589n59J739J657o51l448J326
$$ 1664 1465 -2500 -666 1890 791 -582 -2010 856 2473 -1116 -1675 64 1721 1070 -2378 -1052
2059a052L153j052k135q38K458K020l182j612K223J590m62l011K46L474n76k219
$$ -1052 2101 1049 -1086 -1924 534 2554 -628 -2240 -17 1573 1111 -1900 -1654 1820 1244 -975
2075i75n87J505K255k349j935K082J065j61k131l13K986n52j754j20Q29J855j868
$$ -975 -1562 -57 2198 -151 -2086 -4 1061 900 -1231 -1544 1442 890 -864 -984 -155 1700 -168
2092a68j586K066N79l69j461k78K668o53j743K48P87J420j572j550J987O10n04
$$ -168 -1754 312 891 522 -939 -1217 1451 798 -945 -697 90 1510 -62 -1612 375 985 481
2109D81j217l00K271k90j804K30P54J063r76j492J405P89n47q53l04J538M3j331
$$ 481 -736 -1036 1235 945 -859 -629 125 1188 212 -1280 125 914 367 -486 -790 748 791 -540
2127e40P6N60N73l99j132Q33O89n79m30l9P31J20r23O2O00K8k39n03M22N82o98
$$ -540 -464 96 669 270 -862 -29 660 81 -349 -388 343 463 -460 -398 202 230 -9 -512 -90 492 -206
2148b06q9K05J50K23p30K23N53m42R2k18J66M38p68L32J90k30K60m72M08J72o56
$$ -206 -295 -90 60 283 -447 -224 329 -113 -21 -239 -73 365 -403 -71 119 -111 149 -323 85 257 -399
2169c99M57k6N3j2n34P07M2m14K7l8O48l53n98M13L57J13p37j34Q36J16n69n07
$$ -399 58 32 85 73 -461 246 288 -126 -99 -137 511 158 -440 -27 330 443 -294 -428 408 524 -45 -552
2191e52N94P71p37n69K25R08m8j232K23P86M08r16q52J252N53p12q46J85J570
$$ -552 42 813 76 -493 -268 640 592 -640 -417 369 777 -139 -991 261 814 102 -744 -559 1011
2210A011m91j374K56R05P52j525p67J587M27n14j381M71J861q50j217l8J265R41
$$ 1011 520 -854 -598 307 1059 -466 -1233 354 781 267 -1114 -643 1218 368 -849 -887 378 1319
2228A319k030n09J440P78n73j925R80J789p33j497j60J828O41j997o61J353J434
$$ 1319 -711 -1220 220 998 425 -1500 -520 1269 536 -961 -1121 707 1348 -649 -1310 43 1477
2245A477j223j913J275J556k96j714k99K177L32j838r96J535J827j704j666R04
$$ 1477 254 -1659 -384 1172 876 -838 -1137 1040 1372 -466 -1462 73 1900 196 -1470 -566
2261e66J907p4k620J38K255L38j575j659K066J710j850j359M58K364j76k945N20
$$ -566 1341 1267 -1353 -1215 1040 1378 -197 -1856 210 1920 70 -1289 -831 1533 1357 -1588 -1068
2278a068J854P28j657j932K352J508j624j579L50K749n21k666K61J961R40k108
$$ -1068 786 1514 -143 -2075 277 1785 161 -1418 -1068 1681 1160 -1506 -1245 716 1656 -452
2294d52j639K252J594j485k020P37K644m98k562j89K549Q01k252j455J914K088
$$ -452 -2091 161 1755 270 -1750 -1013 1631 1133 -1429 -1618 931 1732 -520 -1975 -61 2027
2310B027j454k623J357J848K96k557p00K813P33j926j501J316K444j675k145J288
$$ 2027 573 -2050 -693 1155 1451 -1106 -1806 1007 1740 -186 -1687 -371 2073 398 -1747 -459
2326d59J568N33k621q80L078K41j643j314J043K734k016j921J186J595L68k681
$$ -459 1109 1642 -979 -1859 1219 1460 -183 -1497 -454 2280 264 -1657 -471 1124 1492 -1189
2342a189m84K980J32j700j330J243K496j772k238J259J896J03k430p66K802O65
$$ -1189 -1673 1307 1439 -261 -1591 -348 2148 376 -1862 -603 1293 1396 -1034 -1800 1002 1667
2358A667k042j222J185K212j039k646J107J934n1j755j210K422J073k147p17P36
$$ 1667 -375 -1597 -412 1800 761 -1885 -778 1156 1105 -650 -1860 562 1635 -512 -1229 -493
2374d93J762l92k646J133J641l28r82j351K206R94k308j54O56J305j69k641J313
$$ -493 1269 877 -1769 -636 1005 677 -305 -1656 550 1544 -764 -918 -262 1043 874 -1767 -454
2391d54J692p66q47j088K042J116k469k46R90J096j16k508Q33K099p74r05r23
$$ -454 1238 472 -375 -1463 579 1695 -774 -1020 -30 1066 950 -1558 -725 1374 600 -305 -1228
2408a228J381J615k118o96R99P83K77k044J20J984n96o06o40N27J622j575o53
$$ -1228 153 1768 -350 -1046 -47 736 1013 -1031 -911 1073 477 -129 -769 -242 1380 -195 -848
2425h48J018R7M30j285j83J754q79m40N4N6J268j360n87J426l35K3o78l39J860
$$ -848 170 267 697 -588 -771 983 104 -336 -282 -226 1042 -318 -905 521 186 209 -469 -808 1052
2444A052q70r63O47r7J113r72j132J668j52k08k47q61J747k32j208P39m22Q74
$$ 1052 182 -781 -134 -231 882 -90 -1222 446 294 86 -161 -1022 725 493 -715 24 -398 476
2462D76o4j332J164j37j12L55j053J029n6p43J010q59L14L62q40J031n73l57Q76
$$ 476 412 -920 244 107 -5 350 -703 326 270 -473 537 -322 -8 354 -486 545 -28 -385 491
2481D91o02L93k33o07J173m60l60L23m46Q55k38q86Q56j53n0J88p66P44J79q60
$$ 491 -111 282 49 -558 615 155 -205 118 -328 527 289 -597 259 106 56 244 -522 222 401 -459
2501d59O70k76N8L36q95Q74K7q62P26m16M48J52j360J225J37n63K54r52J331K73
$$ -459 211 -65 -7 329 -566 308 335 -527 199 -217 231 383 -977 248 385 -178 76 -876 455 728
2521G28j502N77n4P95o1j735J215O12l97k70j029J541M88j427M8K06Q98q6j556
$$ 728 -774 -197 -251 544 483 -1252 -37 575 178 -92 -1121 420 908 -519 -471 -265 633 547 -1009
2540a009P17R13k37n94n92J112O27j220m03P72N51k61j123K83J442n86r05N4P24
$$ -1009 -292 621 384 -210 -802 310 937 -283 -686 86 637 376 -747 -464 978 392 -513 -459 265
2559B65Q58j435p31J542K41l80j194R1K114r51j184J62P78J256j793r58J710M32
$$ 265 1123 -312 -1043 499 740 360 -834 -743 1371 420 -764 -602 176 1432 -361 -1319 391 823
2577H23l18j567J75K272q48j232j80J019J267j783r07J384P43l62j655M40J777
$$ 823 505 -1062 -887 1385 537 -695 -875 144 1411 -372 -1279 105 848 486 -1169 -729 1048
2594A048m39j308l16J381Q26j539q73J195J190r20j405N71J485J5j844j51J695
$$ 1048 609 -699 -1015 366 1192 -347 -1220 -25 1165 245 -1160 -589 896 911 -933 -1084 611
2611F11M53j232j216J300J553j336j190L58J653K77k367J44J644M35j000j602
$$ 611 1064 -168 -1384 -84 1469 133 -1057 -699 954 1231 -1136 -992 652 1087 87 -1515
2627a515J525J502j294j138J02J929N7k171J84J289P40j166j465J514J142r48
$$ -1515 10 1512 218 -920 -818 1111 1168 -1003 -819 470 1210 44 -1421 93 1235 287
2643B87j112J11J802k5j943K9J294Q06j461j177J410J101p13j643N22J719j72
$$ 287 -825 -714 1088 1063 -880 -851 443 1249 -212 -1389 21 1122 409 -1234 -712 1007 835
2660H35j510n47J679Q04j597q33R03J483p59j739P03J385N5j491o30J822N08j297
$$ 835 -675 -1222 457 1261 -336 -1169 -266 1217 458 -1281 -578 807 862 -629 -1259 563 1071 -226
2678b26q57P33J627r34j485O42J184K60j626m40J686L68r72j030Q07J517r67j186
$$ -226 -1083 -350 1277 343 -1142 -500 684 944 -682 -1122 564 932 -40 -1070 -263 1254 287 -899
2696h99L53J285K04j597k07J269N81r75j079J004J132p29j070J26J427k2j331
$$ -899 -546 739 943 -654 -861 408 989 14 -1065 -61 1071 342 -728 -602 825 803 -528
2713e28k05J047O98j079q60R47P85m05j154K23J307k33r39l57R81O91j188m69
$$ -528 -733 314 1012 -67 -927 20 805 400 -754 -531 776 543 -396 -753 228 919 -269 -738
2731g38O31P21j98j268M50R69j68o86m93R80N03r93l09L97P05j64j071M24P40
$$ -738 -107 614 416 -852 -402 567 399 -287 -780 200 703 -290 -599 -202 503 339 -732 -308 432
2750D32m9o46l76Q21L69o85l55L74O08k49p29K57O20r4n35j17N28K73n09l79N29
$$ 432 383 -263 -639 182 551 -134 -489 -115 493 244 -485 -228 392 298 -237 -354 174 447 -62 -441 88
2771H8K58j91m33O1O72k54m52J50J71L43m82l03O35q1n2k43j31P14m43j84J90
$$ 88 346 155 -278 -217 455 201 -251 -101 70 413 -69 -372 263 182 130 -113 -244 470 27 -157 33
2792C3pK42l83j03M53k53N5n9j21M39m10k2L18k68J01j45j6L82l83q0K91r3J30
$$ 33 26 268 -115 -218 235 -18 37 -22 -143 296 -114 -136 182 -86 15 -130 -146 236 -147 -227 64 -29 101
2815A01l18n0N54k75k38J15K4L79m04l62O74j17p1j93j52P61l38m33L19KL64m05
$$ 101 -217 -267 287 12 -226 -111 -87 292 -112 -474 200 83 12 -181 -333 428 90 -343 -24 -22 342 -63
2837f3m61Q69j39l03o0j15Q15l78o64N99J01J46m50m81J048j4o67j2O5Q15l96
$$ -63 -524 345 206 -97 -157 -272 543 165 -499 100 201 347 -103 -584 464 450 -217 -229 -164 651 255
2858B55r67O98M38q0m83o01J160L06j029q0J92Q59k12j243O36O55j71m07p59J073
$$ 255 -712 -14 424 344 -139 -740 420 726 -303 -383 -191 668 456 -787 -151 504 333 -74 -833 240
2878B40N96j208q9L12O31J3j364N61Q97l97l64o19R70O97j366r3N46N08k9j411
$$ 240 836 -372 -461 -149 482 495 -869 -308 589 192 -172 -791 179 876 -490 -583 -37 471 442 -969
2898i69N70J209n91o18l38R49Q16j491l69R30N40j35j409L48J528n21q74k60P82
$$ -969 -399 810 219 -399 -737 212 1028 -463 -832 98 638 503 -906 -558 970 449 -425 -685 97
2917I7J091j384p44J069N37r4j269k8J685m38r34j71O17J081j191r13J208L98
$$ 97 1188 -196 -940 129 666 572 -697 -725 960 522 -412 -583 34 1115 -76 -989 219 617
2935F17j57j026k21J751m16j059JO49R54j210j049J469M44n42o43k29J600k68
$$ 617 460 -566 -787 964 548 -511 -510 139 1093 -117 -1166 303 747 205 -438 -667 933 665
2953F65j427L34N77P86j003j186J291Q03n98q79k17J610O5j593R2Q11O74o67j351
$$ 665 -762 -428 149 935 -68 -1254 37 840 242 -637 -854 756 821 -772 -680 131 805 138 -1213
2972a213J088J037p57o97k61J368L20j583O6Q44M77m66j289R10J071p84n77j53
$$ -1213 -125 912 155 -542 -803 565 885 -698 -632 212 689 223 -1066 -156 915 131 -446 -599
2990e99J039M00j502M6J046K65m07j163Q38R84q20p52J58Q80M01j359j88J122
$$ -599 440 840 -662 -616 430 695 288 -875 -37 947 127 -625 -467 413 814 -545 -733 389
3008C89K31m44r74N51J197p77p47J56P61M96j276l26J121J92m34p84K92J199n95
$$ 389 620 176 -798 -247 950 173 -574 -418 343 839 -437 -763 358 550 116 -668 -376 823 228
3027B28q28K56N70M32r87m22J065J45m71n37K22J011n11p91L71M78K65p86l86
$$ 228 -600 -344 226 658 -329 -751 314 459 -12 -549 -327 684 173 -618 -247 231 496 -290 -676
3046f76R49J73n33l56K03P70l37p95M24M33J16n06m65Q42K51o17k18J86O05j72
$$ -676 273 446 -87 -443 -240 530 193 -602 -178 255 371 -135 -600 242 493 -124 -342 -156 449 277
3066B77p66L36M26Pl19m16O63K50n20j38R4M92m8o90K65L92j18k24k67M93J66
$$ 277 -489 -153 273 280 -39 -455 208 458 -62 -200 -106 386 338 -352 -87 305 187 -37 -304 189 355
3087C55m76j1P8K94q2m02J63L11j62j41j37K55J86l73m0K00R3p2k65J46K40j96
$$ 355 -121 -132 -54 240 158 -244 -81 230 68 -73 -210 45 231 -142 -182 18 111 39 -226 -80 160 -36
3109c6q5J7Q0J63k84OK38j08Pj40O6K02j85n5J19qM9k28J59J58j87%j0J33N1k68
$$ -36 -121 -104 -24 139 -145 -139 99 -9 -2 -142 -76 126 -59 -114 5 -3 46 -182 -23 135 -52 -52 -62 71 122 -146
3135a46N5K02j2j50p7J90J45k50o6J27J84j31k48J51K89j17l09P6K74O0l13j72
$$ -146 -91 111 99 -51 -128 62 207 -43 -109 18 202 71 -177 -26 263 146 -163 -87 187 247 -66 -238
3157b38L83J13k35j93J8N06j60n17J98L22J69n43k88N75K18l86k29J70N21k68
$$ -238 145 258 23 -170 -152 354 194 -323 -125 197 366 -177 -465 110 328 -58 -287 -117 404 136
3177A36m87J69L51J40n68k04O11J55l44l85K78N70l02n45J59M86J49o63j88O34
$$ 136 -351 -182 169 309 -259 -463 148 303 -41 -426 -148 422 120 -425 -266 220 369 -294 -482 152
3197A52K56m43m44L75N77k98o27J33O84oo24j86O18L56n89m35L98N84j90p59J54
$$ 152 408 -35 -479 -104 473 175 -452 -319 365 359 -265 -451 167 523 -66 -501 -103 481 291 -468 -314
3218c14P80p8n83l14O55M78o74l97L72N87j32q82K15P66p3n59m07P72M81p84l82
$$ -314 466 388 -195 -509 146 624 -50 -447 -75 512 380 -502 -287 479 406 -153 -560 212 693 -91 -473
3239d73L58O47j45r32J95Q43p2o78l43P30M97p01m98L97P42k61q85J29Q61J3p46
$$ -473 -115 532 387 -545 -350 493 421 -257 -600 130 627 -74 -572 -175 567 306 -579 -450 411 424 -322
3260c22k74O35N96p19n95N49O39k39p80LR90l0p78k25N53O63o75o92O57N32j54
$$ -322 -596 39 635 -84 -679 -130 509 270 -510 -507 483 453 -325 -550 3 666 -9 -701 -44 488 334
3281C34p67j04J057j3q23j40M60P42o80p72O82N25j20p55j70J054J9p99j83M60
$$ 334 -433 -537 520 507 -316 -456 4 746 66 -706 -24 501 381 -374 -544 510 529 -270 -453 7
3301GO76n62p93O35N34j92o64j32R28J16q32j63M81N15m04q13N71O43l33m93k00
$$ 7 683 121 -672 -37 497 305 -359 -491 437 553 -279 -442 39 554 150 -663 -92 551 218 -275 -475
3322d75Q15K27r39l6M66L66k47q64N16P06m24l85j96O92L36r42n7N00K51j39p81
$$ -475 340 567 -372 -408 58 424 177 -687 -171 535 111 -274 -470 222 558 -384 -441 59 310 171 -610
3343f10M34O78m56l00j85O14L88q72j21N95J42j38o87L31P14m35l32k4M20L73
$$ -610 -176 502 46 -254 -439 175 563 -309 -430 165 307 169 -518 -187 527 92 -240 -264 156 529
3363E29p79j23N56J09j11n05R5P59l90l77J20K03L79n71k79O00J9j59k59p9P29
$$ 529 -250 -373 183 292 181 -324 -229 530 140 -237 -117 86 465 -106 -385 215 234 75 -184 -263 466
3384D66l53l83K33N2L11l77l63O50o5j87j03j28O09k61m44L87p8K51k49l71O04
$$ 466 113 -270 -37 15 326 -51 -414 236 171 -16 -119 -247 362 101 -343 44 -34 217 -32 -403 201
3405B01o8k72P3j65M39j12m58L83l9P7o0l26M33rk78J96j60K05P3m29L29J0j25
$$ 201 133 -139 -66 -231 208 96 -362 21 -18 59 -1 -327 106 97 -181 15 -145 60 133 -296 33 43 -82
3428h2J49k54K75O8l43K91j03PJ61l76L50K8k69K04j30J33N1l71L21K0j84J45
$$ -82 67 -187 88 156 -187 104 1 8 169 -207 143 171 -98 106 -24 109 160 -211 110 130 -54 91
3450I1k25K70Q2m42L12m2LP6l61L19J41l74J42m6J23R0m62K91J46j34Ok76L19
$$ 91 -134 136 218 -224 88 46 49 125 -236 83 224 -150 -8 -54 69 159 -303 -12 134 0 6 -270 49
3473D9K08m91J21J15P6P9n05K33L52k43q7j41K75K67n17l6K50R8L9m87J53N23
$$ 49 257 -234 -113 2 78 157 -348 -115 237 -6 -93 -234 41 308 -209 -245 5 103 142 -345 -192 331
3495C31k87k20m6K29L28m92j55L89J05p8l77P2N94l01k98M2K62L28n48k41N41
$$ 331 44 -176 -222 7 335 -157 -312 77 182 104 -273 -201 393 92 -206 -164 98 426 -122 -363 178
3516A78J02j91l51N9O95l00m60J16L04K62n12k94N73J65k25m21P0P07k68n33J02
$$ 178 280 89 -262 -203 492 192 -268 -152 152 414 -98 -392 181 346 121 -300 -230 477 209 -324 -222
3537b22L60K47m86l56N34K72l40l52J02O21j53n79P8M17J91m41l91N04M04m37
$$ -222 138 385 -101 -457 77 349 9 -343 -241 380 227 -352 -274 143 334 -107 -498 6 410 -27
3557b7l63J81N28o8o51N7N30J33m40l67N24M07m54l81K14N16J1p67P5N76J45m73
$$ -27 -390 -209 319 251 -400 -343 187 320 -120 -487 37 444 -10 -391 -177 339 350 -417 -342 234 379 -94
3579i4l97N22M39m46m14J74N84l7o71J8N81J37m60l70M70M50l77m88K45N17o5
$$ -94 -491 31 470 24 -390 -216 368 331 -340 -322 259 396 -64 -434 36 486 109 -379 -134 383 318
3600C18n98n9O20J34m88k98M01M38k95o08L08M68n5n75r6O47J04m99k52L49M80
$$ 318 -280 -339 281 415 -73 -371 30 468 173 -435 -127 341 286 -289 -385 262 366 -133 -385 -36 444
3621D44l98m95L07M14j8n29j50O49J03m79k59L46M72l64m65K92M13k1n30j11N90
$$ 444 46 -449 -142 272 254 -275 -425 224 327 -152 -411 -65 407 43 -422 -130 283 262 -268 -379 211
3642B11R5l91k99L55L99l07m11J74N01j10m75m2M82J69m45k24L40L31k67m05J97
$$ 211 306 -85 -384 -29 370 63 -348 -174 327 217 -258 -300 182 351 -94 -318 22 353 86 -319 -122
3663a22M40j11m06nL58K18m51j67L27K26j91l94K00L83j22l17q2L37K23m19j37
$$ -122 318 207 -199 -204 154 372 -79 -246 81 307 116 -278 -78 305 183 -134 -216 121 344 -75 -212
3684b12K55K01j36l62J71K82o0k68j07L37J27l45j07K03J80j13l01J46K76r9k16
$$ -212 43 244 108 -254 -83 199 139 -129 -236 101 228 -117 -224 -21 159 46 -255 -109 167 68 -148
3705a48q0K73J06k89p1K16J23j24j86Q2K45o7k38P6J26Q4j45j70K41N2j00r1%
$$ -148 -228 45 151 -138 -209 7 130 6 -180 -98 147 80 -158 -82 44 128 -17 -187 54 106 6 -85 -85
3728h5K46j03j49J03J7Q8j29j08K17k0p0k0pJ62j21j02J33k0M8r1o4K43j21n4
$$ -85 161 58 -91 12 29 117 -12 -120 97 77 7 -13 -20 142 21 -81 52 32 80 -11 -75 168 47 -7
3752gL2j0J16j28o7J25on0j5m3J42n6j00J04pJ1p8q0J97j1k03J12J1P3q2j78K22
$$ -7 25 15 131 3 -64 61 55 5 -10 -53 89 33 -67 37 30 41 -37 -117 80 69 -134 -22 -11 62 -20 -198 24
3779B4Pq6%p0K24o0k67K09M7J9p2k13L12L8j90lm4K86n3l08J76J24Lr8k19L17
$$ 24 31 -55 -55 -125 99 39 -228 -19 28 47 -25 -238 74 112 -78 -81 -125 161 108 -200 -24 100 103 5 -214 103
3805A03J00k75PL5K17m2l46J67K25p8j18j76K92J66l86j3J55J82m4l83J42L16
$$ 103 203 -72 -65 -30 187 145 -201 -34 191 113 -5 -181 111 277 -109 -122 33 215 171 -212 -70 246
3827B46j61j56j40K75K82m78q6K57J42J2m53J03M27j74j73j64K31L52m60j22K74
$$ 246 85 -71 -211 64 346 -132 -218 39 181 193 -260 -157 270 96 -77 -241 -10 342 -118 -240 34
3848C4J22Lm50O7M77j54k26r7K16L27m38j98L48J21m8l72J4N12j25l25j8K30K75
$$ 34 156 159 -291 -224 253 99 -127 -224 -8 319 -119 -317 31 152 104 -268 -254 258 133 -192 -210 20 295
3871B95l78l10M70J42r2l65nN86r9m75M7K49L05l30m62N01K21j83k57j04N56j4
$$ 295 -83 -393 77 219 127 -238 -243 343 244 -231 -184 65 370 40 -422 79 300 117 -140 -244 312 298
3893B98n04N9J97K86k33m91M05K83k32k16j07N02L6n19M4K70J96k72l78L78L09
$$ 298 -206 -147 50 336 103 -388 17 300 68 -148 -255 247 283 -236 -192 78 274 2 -376 2 311
3914C11k86k20n1M93K3n35JL99J02k16m34L53M24l22k88j0L63J93n04p3L65K03
$$ 311 25 -195 -246 247 270 -265 -264 135 237 21 -413 -60 364 42 -246 -256 107 300 -204 -277 88 291
3936B91k87l27J08O48l02m17J31K24K41n02q4L80R7j66l14J69M29k45k62O8K34
$$ 291 4 -323 -215 433 131 -286 -155 69 310 -192 -276 104 201 35 -279 -110 319 74 -188 -120 114
3957A14J79m10j15L95O6j81k56J39M21k51k95J14K25J39l62j90M15Q6k29j59L9
$$ 114 293 -117 -232 163 229 48 -208 -69 352 101 -194 -80 145 284 -78 -268 147 233 4 -155 -116
3978a16L89j35l90J61J75J20k63k27L67J08k12j52M8L09n1l47J19J69O3k00j67
$$ -116 273 138 -252 -91 84 204 -59 -286 81 189 -23 -175 -127 182 131 -216 -97 72 135 -65 -232
3999b32K93Q3j98q0M7K15l5l13J24J79jj36j54K37J23k07j03J30J62o1k41R1J80
$$ -232 61 144 -54 -134 -87 128 93 -220 -96 83 82 -54 -208 29 152 -55 -158 -28 134 73 -168 -77 103
4022A03l5p2j17J47J30j84p2Q3J00j6j35K4J78q0o4p4J35R5j71j5J05K8j0j11
$$ 103 68 -4 -121 26 156 -28 -100 -17 83 67 -68 -44 134 54 -10 -84 51 146 -25 -40 65 93 83 -28
4046b8L8J16j02j3rM2O6j29nN2J6k4n7LJ12j05j%kN9m5o2J11q7r6J22QJ9q8L2
$$ -28 10 126 24 11 2 44 110 -19 -24 28 44 20 -37 -34 78 -27 -28 -28 -30 29 -16 -78 33 -54 -150 -28 -20 -1 -89 -57
4076e7O8l9k2mL9O0p9n9O0N7k3o0j8J51o4m5mO4J4q3l3R6K2k9q3J0J66o0j00K0
$$ -57 11 -28 -50 -54 -15 45 -34 -93 -33 24 1 -59 -77 74 10 -35 -39 25 39 -44 -77 19 41 12 -71 -61 105 45 -55 -35
4106c5P7P3j44p4J52M0k9j42M1J73m3j62N3J21M6j80r0J77Q2j11j22P5J61m2k27
$$ -35 42 115 -29 -103 49 89 60 -82 -41 132 89 -73 -20 101 147 -33 -123 54 136 25 -97 -22 139 97 -130
4131a30K7K02J3j81j00J98J48k16j16J05J76m3k56N6K02Nj64j38K30J39k17j55
$$ -130 -103 99 112 -69 -169 29 177 -39 -155 -50 126 83 -173 -117 85 90 -74 -212 18 157 -60 -215
4153b15J40K08n1k67N1K48J0j86j46K48J63k21j60J25K20n8k96N1K80K6k53j19
$$ -215 -75 133 82 -185 -134 114 124 -62 -208 40 203 -18 -178 -53 167 109 -187 -136 144 170 -83 -202
4175b02K78J69k41k00J52K51m7l52M5K96L4k18j60K70J85j88k54J60K29q4k61
$$ -202 76 245 4 -196 -44 207 160 -192 -147 149 183 -35 -195 75 260 72 -182 -22 207 123 -138
4196a38m6L54K5k77q9K17J92k05k50J80K59r4k95k5L52Lk98p8K16K44k38k96K19
$$ -138 -184 170 195 -82 -171 46 238 33 -217 -37 222 128 -167 -192 160 163 -135 -213 3 247 9 -287 -68
4219f8K40l8l07r5L87O3l12j04J84K85k30k88K01K29j6l08n4L45P1k94p4J55K62
$$ -68 172 134 -173 -268 119 182 -130 -234 -50 235 5 -283 -82 147 131 -177 -231 114 185 -109 -183 -28 234
4242B34j90l10K16K57r6k33n8L29P9l04j01J88K04j46k96J92K70j25k17n5K80
$$ 234 44 -266 -50 207 111 -122 -180 149 228 -76 -177 11 215 69 -227 -35 235 110 -107 -162 118
4263A18J35l44r8K29J64j21l29J74L02j24k29n1K75J88l67r6J94R9lk31j8K50
$$ 118 253 -91 -189 40 204 83 -246 -72 230 106 -123 -174 101 289 -78 -174 20 119 116 -115 -133 117
4285A17nn8k27J94J91k70j12J71J11k9k89J03K88j37j71j7J27J93k55j72K62Q1
$$ 117 112 54 -173 21 212 -58 -170 1 112 83 -206 -103 185 48 -123 -140 -13 180 -75 -247 15 96
4307I6p7j86PL06j08j57l4J38J88j94j84K45N2k9j21p0L11n5k04J5O1J83j51j67
$$ 96 19 -167 -160 146 38 -119 -153 -15 173 -21 -205 40 92 63 -58 -128 183 128 -76 -61 0 183 32 -135
4331a35J61M5r2j6j04K75J9k38J7J07j0K8k03K59Ko3j30j8K03l4M3j00J20j30
$$ -135 26 71 -21 -37 -141 134 153 -85 -68 39 29 57 -146 113 115 52 -78 -96 107 73 116 16 136 6
4355FJ63m59L73J51k32k6j8J24l5j88J05j1K3M3j34Q3J10j17J4Mj3Q2j45M5N0
$$ 6 169 -290 83 234 2 -24 -42 82 47 -141 -36 -47 -24 19 -115 -32 78 -39 -25 -21 -34 48 -97 -52 -2
4380bn0P9q5J4Q5j54R9qm7R0r7Q1Q3j54Q1j0l0N0p9J04M1j07L9l9O6L8j36O8L8
$$ -2 -52 27 -58 -44 41 -113 -14 -22 -69 21 -76 5 88 -66 15 5 -25 25 -54 50 91 -16 23 -16 50 88 -48 20 58
4409E8m5J8m8M1N6r0K0J6P8l8j55J00P2p2k6l1O1R6k01MJ36l2J0j09L5J33r8o8
$$ 58 13 31 -17 24 80 -10 10 26 104 66 -89 11 83 11 -15 -46 15 111 -90 -86 50 18 28 -81 -46 87 -11 -79
4437g9j2J06J01k35k3J68Ojj47K9K16j25r6J4P8R8j61q4J79M9n6j52L0K31j03
$$ -79 -91 15 116 -119 -142 26 32 31 -116 -87 129 4 -92 -78 0 98 -63 -147 32 81 25 -127 -97 134 31
4462C1j63N4J22Q9j71j29K05P2r6j27K8K37p6k08N8J29J08j76j63K57Q9j51j71
$$ 31 -132 -78 44 133 -38 -167 38 110 14 -113 -85 152 76 -132 -74 55 163 -13 -176 81 170 19 -152
4485a52J02K25Pl01N2J76J37j62j60J86J31j40k44J15R3P6l15J7K86N8k24o6L7
$$ -152 -50 175 182 -119 -67 109 246 84 -76 110 241 101 -143 -28 65 141 -174 -157 129 187 -37 -103 -66
4508f6K33k35l9j8K39l3k46PK34N9j64j83J91K15k03j68P7K05J5l01N1K15K9j43
$$ -66 167 -68 -107 -125 114 81 -165 -158 76 135 -29 -212 -21 194 -9 -177 -100 105 120 -181 -130 85 114 -29
4532b9j56J61K18j96j63O4K18lk08r4K65P0k08j27K06J66j47j58NK25J1l13r7
$$ -29 -185 -24 194 -2 -165 -101 117 114 -94 -188 77 147 -61 -188 18 184 37 -121 -116 109 120 -193 -290
4555b90K51J44j15j46J32K01j15j98j4K75K1k81P7J83J09j81r0J6L97l29l27J56
$$ -290 -39 105 -10 -156 -24 177 62 -136 -150 125 146 -135 -58 125 234 53 -37 -21 376 47 -280 -124
4577a24K41j22l0j26J68K70k19k08R1K17r0k27J24J38lj89q5K23N0j83j40J96
$$ -124 117 -5 -35 -161 7 277 58 -150 -59 158 68 -159 -35 103 100 -89 -174 49 99 -84 -224 -28
4599b8J71j28j58M8J91k3j67o5K11Q7j92o1R6J46n5j59JJ91J8j59q0J56J10j84
$$ -28 143 15 -143 -95 96 73 -94 -159 52 139 -53 -114 -18 128 73 -86 -85 106 124 -35 -115 41 151 -33
4623c3o5J65J07j95M0j25J64J25k52J33l5J62j51j07P6Q5k3j30K0J30pj10kM8
$$ -33 -98 67 174 -21 19 -106 58 183 -69 64 29 191 40 -67 9 94 71 -59 -39 91 84 -26 -28 20
4647B0J02j31p7P4P1Oj19RJ16Lr7o5R6P4r6n9M7O6k9q5QQ1J7q3qJ9R9p6p6N7Q5
$$ 20 122 -9 -86 -12 59 65 -54 -45 71 74 -23 -88 8 82 -14 -73 -26 40 11 -74 -66 15 32 -51 -59 -40 59 -17 -93 -36 49
4678D9n3l3mQ7j1o7K4J7J5kq2Q2MQ5j34j3J12m7k1l2K6k1O2k49K32n2K3O3l7k
$$ 49 -4 -37 -41 46 35 -32 -8 9 24 22 -60 22 26 111 -23 -36 76 29 8 -24 2 -19 43 -206 26 -26 -3 60 23 21
4708B1k3l3N4Ll2M5k7J3%k6N1On9J2K7K6mp9K3M8n3mm1Q6K2r9K2pL8K4q0L9L1
$$ 21 -2 -35 19 22 -10 35 8 21 21 -5 46 52 -7 5 32 58 54 -25 -2 46 -7 -11 -52 34 56 -43 -21 -28 10 34 -46 -7 24
4741B4nn9l1P9L2j15J5RP4Jj28O7J06q9mo8J24O0j77K9M6P7k7j27N8J38n8p4m1
$$ 24 19 -40 -71 8 40 -75 -60 -51 23 24 -104 -37 69 -20 -24 -92 32 92 -85 -56 -10 67 40 -87 -29 109 51 -23 -64
4770f4J08Q9j58m2J16M6l4j33N9J41p9j23PJ06J08j59q6J29O8l9j59O2J41j5j54
$$ -64 44 133 -25 -67 49 95 61 -72 -13 128 49 -74 -67 39 147 -12 -98 31 99 60 -99 -37 104 89 -65
4795f5k3P8J40j31j19J43Q6o3j37L1J92p9j53J2J10Q6j40j31J75R4p9j57L9K27
$$ -65 -88 -10 130 -1 -120 23 109 46 -91 -60 132 53 -100 -88 22 108 -32 -163 12 106 27 -130 -91 136
4819A36p0j83%J38J11j99j09J71R8q0j48J0K31nk33qJ72J03j23k03J68J48q7j32
$$ 136 66 -117 -117 21 132 -67 -176 -5 93 13 -135 -125 106 101 -132 -140 32 135 12 -191 -23 125 38 -94
4843i4nK21M2k60oJ66P8p7k23J61J84j33j30jK05L9k41j6J67M8r4k13J76J87j62
$$ -94 -99 122 164 -96 -102 64 142 65 -158 3 187 54 -76 -77 128 167 -74 -90 77 125 31 -182 -6 181 19
4868A9j23J5J86N7k79j5J73R9j13j83R4K49j30j59OJ87M2j92j02J72J12r9j77
$$ 19 -104 -89 97 154 -125 -140 33 132 19 -164 -70 179 49 -110 -104 83 125 -67 -169 3 115 16 -161
4891a61R1K26j08j58L0J55M6k26p3K09O9j25p8RK17o6j74M0J23N1j70o6J77P5
$$ -161 -70 156 48 -110 -80 75 121 -105 -178 31 100 -25 -103 -94 123 57 -117 -77 46 97 -73 -139 38 113
4915A13j02j19L3K28p0k02N4J30P7j61j08K00R5j16j38K7K03m1j88P5P0N9j21
$$ 113 11 -108 -75 153 83 -119 -65 65 142 -19 -127 73 168 52 -86 -59 144 103 -85 -10 60 119 -2
4938br9J50O9j00r7NJ43kj73N8O8N5p0j19J11Q9j00o5K0Q2L3j49J7P9L0n6r1R9
$$ -2 -101 49 118 18 -79 -74 69 67 -106 -48 20 75 5 -114 -3 86 -14 -79 -59 23 56 -93 -76 3 33 -23 -114 -15
4966a5Q6p9p3L1P2K1j18NJ06J0k9j11L8J45q1n2K2M3L4j10j0Q8%l4l5J6Q1m8k5
$$ -15 71 -8 -81 -50 22 43 -75 -70 36 46 17 -94 -56 89 8 -44 -22 21 55 -55 -65 23 23 -11 -46 -30 51 3 -22
4995b2RK2L0p1qO7Rk3j9NN2l4k4J0L4j6pn4P4jkk7j3L4j9Klk2J8Jm8M4qj7J3j9
$$ -22 -13 9 39 -32 -40 27 36 13 -6 -1 51 17 -7 3 37 21 14 -40 34 33 31 4 -9 25 6 8 5 -17 1 2 -46 -2 -10 -27 -14 -33
5031c3J6Mj3lJ7l3M6k4mjK1L1l8k5L8J5Lm4k1O3K7n4qJ9L3l1k9J0M9ko3oN8L3
$$ -33 -17 -13 -26 -29 -12 -45 1 -23 -27 -28 -7 24 -14 -39 -1 14 17 -27 -48 15 42 -12 -20 -1 32 1 -28 -18 31 29 -34 -40 18 51
5065E1m4n0J5Q7m6o2N0M2No3l4Q0K8p3k6L7Q9m7q3L0P2J0j10J2R3jq0k8N2M3j
$$ 51 7 -43 -28 59 13 -49 1 43 48 -15 -49 31 59 -14 -40 -3 86 39 -44 -14 58 68 -42 -30 63 62 -18 -46 6 49 48
5096D8j33N1J01l0j13nJ01M9j35l3P8N1j8j00K5J15rj43PJ12O5j26r9J35O5l7
$$ 48 -85 -34 67 37 -76 -81 20 69 -66 -99 -21 30 12 -88 -63 52 43 -100 -93 19 84 -42 -141 -6 59 22
5122B2j23L8J21qj04p8J71Q0j62p6J26R3n4j40M2J50Kj62rJ08Q3j28q0O2J47p5
$$ 22 -101 -63 58 50 -54 -132 39 119 -43 -119 7 100 46 -94 -52 98 100 -62 -71 37 120 -8 -88 -26 121 46
5148D6j51M5J58Nj51q9L08Nj82j34J65J09n1j13QJ36k9j07j48K24J07j30k05J55
$$ 46 -105 -60 98 103 -48 -137 171 176 -6 -140 25 134 83 -30 -22 114 85 -22 -170 54 161 31 -174 -19
5172a9J52q1j38kJ99J2k00l8J45Q9j46r9J04J14n8j54k5J99K1j77k0O2J44q2j32
$$ -19 133 52 -86 -88 111 123 -77 -115 30 119 -27 -126 -22 92 34 -120 -145 54 75 -102 -122 -60 84 2 -130
5197a30O3Q6l2Mk1P3O6j82l2J03J11q2j38Q8J63p5j53J8J57L3j68n7J47P2o8j68
$$ -130 -67 19 -13 -9 -30 43 109 -73 -105 -2 109 27 -111 -23 140 65 -88 -70 87 120 -48 -105 42 114 46 -122
5223a22J03J63p5j35JJ25P2j63q7J54O7n2j83R7J60n5j67K4J09R0j66n5J07J09
$$ -122 -19 144 69 -66 -65 60 132 -31 -118 36 103 51 -132 -35 125 70 -97 -73 36 126 -40 -95 12 121
5247A21q0j56O8J52l5j42k1J05Q7j42p8J32M8m0j22OJ87n7j05LQ5M0o5j04P8R5
$$ 121 41 -115 -47 105 70 -72 -93 12 99 -43 -121 11 59 19 -103 -97 90 33 -72 -69 16 56 -9 -113 -35 60
5273F0o9o5PJ29j3j23MQ7L9n0j05R9J07p3p7oJ23J8j23RO2L0k7j02P2P1m6m7k1
$$ 60 -9 -74 -67 62 49 -74 -70 17 56 6 -99 0 107 34 -43 -49 74 92 -31 -22 40 70 43 -59 13 84 38 -9 -30
5302c0Q4K3q4j7K3N8l0o4K3P7n2m2J6K9K9p0l5N4L9j7m8J5P5o5j3j0M3J2k8k0
$$ -30 54 77 -7 -24 -1 57 27 -37 -14 63 11 -31 -15 14 43 -27 -62 -8 31 14 -34 -19 56 -9 -22 -32 11 23 -5 -25
5332b5K8j9J0l9LR7n7j1J0j9K8j4m4O2k2j6K8m4M7k9MK4n7P4nl6M5l2M2k9j8J6
$$ -25 3 -16 -6 -45 -42 55 -2 -13 -3 -22 6 -8 -52 10 -12 -28 0 -44 3 -26 -22 2 -55 19 14 -22 23 -9 33 4 -14 2
5364BK4lJ6k5J5K0l8K1k3L1K2o1KM7Mnp5PP9j8l2l5M9K4p0kK5K2Rj10J10r3P5
$$ 2 26 23 39 14 29 49 11 32 9 40 62 1 3 50 54 49 -26 -19 60 42 10 -25 24 48 -22 -24 1 23 32 -78 32 -61 14
5397A4j1j32N6J22o7m7K7O4Oo2pN2M4r1j0M4N1l4j02O8N2J2j00n3J34Oo0k6J0
$$ 14 3 -129 -73 49 -18 -65 -38 26 32 -30 -37 15 59 -32 -42 2 53 19 -83 -15 37 49 -51 -104 30 36 -24 -50 -40
5426d0R8l5j06N4R4l3p2m0J19K2q0n8N1J21n8j18K1J29J0j08o3J24P0q3j08P5
$$ -40 58 23 -83 -29 65 32 -40 -80 39 61 -19 -77 -26 95 37 -81 -60 69 79 -29 -92 32 102 19 -89 -14
5452a4J20m8j14M5Q0M6j24p4J12P5j11p2K7J23l9j14OJ18K2j10o5J10R7j02j17
$$ -14 106 58 -56 -11 69 115 -9 -83 29 104 -7 -79 -52 71 32 -82 -76 42 64 -46 -111 -1 96 -6 -123
5477a23P8J24j2j72J5J51Qj04p9J07J03j06j15P5J03L2j42k3J35K8j31o6J28J08
$$ -123 -45 79 67 -105 -90 61 69 -35 -114 -7 96 -10 -125 -50 53 85 -57 -80 55 83 -48 -114 14 122
5501A22j01j46J00J11k7j50J1J25N2j13q4R0J47j13j23L0J77m0j19k7J69J4j34
$$ 122 21 -125 -25 86 59 -91 -80 45 97 -16 -100 -10 137 24 -99 -69 108 68 -51 -78 91 105 -29
5524b9o6J27R4o6j54M9J51l1j14n6J58N2j18q4J05J07r7j36O8J26j4j79PJ45L6
$$ -29 -95 32 126 60 -94 -45 106 75 -39 -95 63 115 -3 -87 18 125 28 -108 -40 86 72 -107 -100 45 81
5549H1j17r6J32R4o9j41K1J51n7q1l5J41O4j10q8Q5J08n2j36L6J75m2j24rJ19
$$ 81 -36 -132 0 94 25 -116 -95 56 -1 -82 -117 24 88 -22 -110 -25 83 31 -105 -69 106 64 -60 -69 50
5574E0N5j31p6Q6J19m7j32M3J07J8j32k4Q7P5q9r0Q1P4m9p9QJ19nq3m2Q2O0q1
$$ 50 105 -26 -102 -16 103 56 -76 -33 74 92 -40 -64 23 98 9 -81 0 74 25 -54 -46 73 68 -15 -57 25 85 4
5602Dq1N5Q9l4p0pJ07j1q6k2O3P3p5p2M8Q0l0o5OP3J5j18KM4N4m0n1J2N6rp3j6
$$ 4 -77 -22 67 33 -37 -44 63 52 -34 -56 7 80 5 -67 -19 61 31 -34 -28 45 60 -58 -56 -12 42 2 -49 -37 19 10 -63 -79
5634g9Q3L3m9m4N8J9k8m6L6L6k5rJ5nM2n5j7K7O1m2j1J5J1j8Nk7K2L9m8lJ7J4
$$ -79 4 37 -12 -56 2 21 -7 -53 -17 19 -6 -15 0 -5 37 -18 -35 -8 53 11 0 15 26 8 13 -14 8 47 -1 -4 13 27
5666B7J7k9l3N4j9k6J1j9M1rl0L3j6QJ5l7L9NROm3K8k5k3j4L8j8NJ4k8MJ8J3m2
$$ 27 44 15 -18 36 17 -9 2 -17 24 15 -15 18 2 10 25 -12 27 32 41 47 4 32 7 -16 -30 8 -10 -5 9 -19 -15 3 16 -26
5700b6J5K1k0jl0M7Ml6j5J5M4j8k8j6M9K1n4l6K6P5m8l2RK7M9p1LP9j6l6m2J2
$$ -26 -11 10 -10 -11 -41 6 10 -26 -41 -26 18 0 -28 -44 5 26 -28 -64 -38 37 -11 -43 -34 -7 42 -29 -26 53 37 1 -41 -29
5732b9P0j0p6K5O3K0r5K6M6L9r8jQP6k0j02N8M0Np4m2R1M4n6o0M6J06n2j26P9
$$ -29 41 31 -45 -20 43 63 -32 -6 40 79 -19 -20 -12 64 44 -58 0 40 45 -29 -71 20 64 8 -52 -6 100 48 -78 1
5762AL8K9p7p3J16K6m2j18P5J15m6j02J0Q9J4q5n7J00L6n6r4M2J27j8j27j2J12
$$ 1 39 68 -9 -82 34 60 18 -100 -25 90 44 -58 -48 41 55 -30 -87 13 49 -7 -101 -59 68 50 -77 -89 23
5789B3L9j08p2R6J23j28p5M1J33k4j42qJ48J2p9p5J19P9r4o4J4J25J2j66kJ40
$$ 23 62 -46 -118 -22 101 -27 -102 -61 72 48 -94 -102 46 58 -21 -96 23 102 8 -56 -42 83 95 -71 -73 67
5815F7M2j05n7O7J02n4j23L5R0L1j57j6J48L9j38n1M9J38p9j26O1Q5L4j56l7J42
$$ 67 109 4 -53 14 116 62 -61 -26 64 95 -62 -78 70 109 -29 -80 -31 107 28 -98 -37 48 82 -74 -111 31
5841C1L3r7q2P1J19l7j23L2J17Oj41k9J27N2o9r6O3J32o8j25M7R7j3r7p2J22P3
$$ 31 64 -33 -115 -44 75 38 -85 -53 64 70 -71 -100 27 79 10 -86 -23 109 41 -84 -37 60 47 -50 -122 0 73
5868G3j14o6P0J03j8j39O9P7Qj00p5J27R3r1r1L6R1L2j59O2P8Rp5q6J15R7r1r2
$$ 73 -41 -107 -37 66 48 -91 -22 55 63 -37 -112 15 108 17 -74 -38 53 85 -74 -12 66 75 0 -86 29 126 35 -57
5896e7M6R8lj39K3J14j5o5l7N0O5p7o2L9P9j8j11J6Q5K1q2p0R3N4o5n5M4N2Jm9
$$ -57 -11 87 84 -55 -32 82 67 2 -35 15 80 3 -59 -20 59 41 -70 -54 31 52 -30 -100 -7 47 -18 -73 -29 23 24 -25
5926b5n6J17Pn6o1P2O1m9p2q5J98l1l3o0Q6L2o9k9O5M4j7q0j5O6Ok2o1J10k1l5
$$ -25 -81 36 43 -13 -74 -2 59 10 -62 -147 51 20 -13 -73 13 45 -24 -53 12 56 39 -41 -56 10 16 -6 -67 43 22 -13
5956a3j7J3P3l0p2M3J9j5Jk6N4L2m1m1M8nK3n9J1K8j5Pj9K3J9j5k2nKJ2k0k1L6
$$ -13 -30 -17 56 26 -46 -3 16 1 2 -24 30 62 21 -20 28 23 46 -13 -2 26 11 18 -1 22 41 26 4 -1 1 13 -7 -28 8
5989HLJ2n4M0%k1rNJ9J4k0j9j2%K9l7K1J1Kk3jK9pNppJ8L5p1N1JM5j7n0m7L3j7
$$ 8 11 23 -31 9 9 -12 -21 -16 3 17 -3 -22 -34 -34 -5 -42 -21 -10 -8 -31 -32 -3 -10 -5 -12 -19 -1 34 -37 14 15 60 43 -7 -54 -21 -38
6026c8k5R6q9R3n4j07j00K60p0k2M1K0O1o4l4JO0Jm8k0N9K8l6m4M6M2j2p4QP1
$$ -38 -63 33 -56 37 -17 -124 -224 36 -34 -56 -15 5 66 2 -32 -31 29 30 -18 -38 21 49 13 -31 15 57 45 -29 -21 50
6056E0rp5K9L3M6p0l0J2N9%j10N2N3J8m4j05R7L6n3n1LQ0ln7rM2N0q3k7P4L8n9
$$ 50 41 -34 -5 28 74 4 -26 -14 45 45 -65 -13 40 58 14 -91 6 42 -11 -62 -59 21 18 -39 -48 -6 44 -39 -66 8 46 -13
6088a3n6M3Q9l8n2k8J13k0n2k7O3M1l7p7J3J12n5m3j2Q8J7q2l5N5N4j0j22K8R2
$$ -13 -69 -26 63 25 -27 -55 58 38 -14 -41 22 63 26 -51 -38 74 19 -24 -36 52 69 -13 -48 7 61 51 -71 -43 49
6117D9J3r3j6J05K0o7o9N3J08o9p9K0R8j2o3n6J03N0r8o9O0J09m9j31L0Q7M3j30
$$ 49 62 -31 -47 58 78 11 -58 -5 103 34 -45 -25 73 61 -2 -58 45 95 -3 -72 -12 97 48 -83 -53 34 77 -53
6145e3k3J02O1r4q9N6Q1k9j00L6Q8kq0l8R3N0p5r0N0J11n4q7L2J18Qj02p5J41
$$ -53 -76 26 87 -7 -96 -40 41 12 -88 -52 36 34 -46 -84 9 59 -16 -106 -56 55 1 -86 -54 64 72 -30 -105 36
6173C6O0r3n4J8J30n6j05oJ48Jj02l4R0O3p3q0J0J25l1j02L4Q3N6j33n8P3Q2n7
$$ 36 96 3 -51 -33 97 41 -64 -70 78 79 -23 -57 33 96 23 -57 -47 78 47 -55 -21 62 118 -15 -73 0 82 25
6201B5j01N7R5k7q4j2Q5J1o6o9J00O3q6o1J4J11lj08KP5K6n8r9J06L1n3m7J6J01
$$ 25 -76 -19 76 49 -35 -47 38 49 -17 -86 14 77 -9 -70 -56 55 52 -56 -54 21 47 -11 -110 -4 27 -26 -73 -57 44
6230D4j1j03qJ14l1m8m5M8Q7k5o9L6M0K4q4l9Q1M4k7q5N4O4p1k7QN8K3n8j6N2
$$ 44 33 -70 -78 36 5 -43 -88 -40 47 22 -47 -11 29 53 -31 -70 11 55 28 -57 -3 61 -10 -37 -29 29 52 -6 -22 30
6260C0N7r2m3L9O4k3o5NM8Pm6l7P4M2m7n8J6Q3l3n8J8LM5m2qK8K0k7k8j6K5M9
$$ 30 87 -5 -48 -9 55 32 -33 -28 20 27 -19 -56 18 60 13 -45 -29 54 21 -37 -19 -16 29 -13 -21 7 27 0 -28 -44 -19 30
6292C0l9qK1Ql0k4P5j3k4rkK8k0j7J0opL1n7M2pJ2k0LJ5K9n4QJJ0L1k5PKpj7%
$$ 30 -9 -17 4 12 -18 -42 33 20 -4 -13 -15 13 -7 -24 -14 -20 -27 4 -53 -11 -18 -6 -26 -23 -8 21 -33 -25 -24 -14 17 -8 -1 1 -6 -23 -23
6329b3L0J6k6QrK8J8n5QJ6K6q%k4M4m2J4j4J6rj2MJ3j8j0K2m9M1J3j6k1j8P5j4
$$ -23 7 23 -3 5 -4 24 42 -13 -5 11 37 29 29 5 49 7 21 7 23 14 2 6 19 1 -9 13 -36 5 18 2 -19 -37 38 24
6363B4l9K2oj5j3j1rL5k2j0l0P0K7q9m5J16P1p3n3J3Q6mn1r6Q1N2J3p9O4p7j34
$$ 24 -15 7 1 -14 -27 -38 -47 -12 -34 -44 -74 -4 23 -66 -111 5 76 3 -50 -37 49 45 -6 -102 -21 31 44 -35 29 -48 -182
6394a82J61k5J02k9L4n7o0J60j63N1J1L6r5Q8l6J70j00n3l4R6Q4l46J8J73j1R5
$$ -182 -21 -46 56 27 61 4 -56 104 -59 -8 3 39 -56 32 -4 166 66 13 -21 75 159 -187 -169 4 -7 88
6420H8j52O0N4m9n6m6J41P6j59p4O1Q4Om3nR6m5o5q0J04J3q7L4KP5Kn6%Q5j47
$$ 88 -64 -4 50 1 -55 -101 40 116 -43 -117 -56 28 34 -9 -14 82 37 -28 -108 -4 9 -78 -44 -42 33 35 -21 -21 64 -83
6450h3K7J4N6J39j89KQ2P6r5k39J11J80r4l4j5J39q6p6p6R7J65q8L5m0j0L4n6
$$ -83 -56 -42 14 153 -36 -34 48 124 29 -210 -99 81 -13 -47 -62 77 -9 -85 -161 -64 101 13 48 8 -2 32 -24
6477b4n2N8J22p6j62J01J27r1j1p9P1J79k76L5J06O6j20n7M8N3jj41K16l4n3j18
$$ -24 -76 -18 104 28 -134 -33 94 3 -8 -87 -16 163 -113 -78 28 94 -26 -83 -35 18 17 -124 92 58 5 -113
6503a13L8M7k2Q8j78K40O9k13n8j45J43K75j02j10O4Q8r5p6l0J33k4j6j44J07
$$ -113 -75 -28 -50 38 -140 100 169 -44 -102 -247 -104 171 69 -41 23 111 16 -60 -90 43 19 3 -141 -34
6527c4J03p8q2J67l4J6k43K31J24j53l5m4P8J51j94K9N0n3j37K11n0o0K9J69k46
$$ -34 69 -9 -91 76 42 58 -185 46 170 17 -18 -62 16 167 -27 2 52 -1 -138 73 23 -37 -8 161 -85
6552h5P3K22k17o1K4J61j26L0N1r2K2l6M3M9k0p5qR9O1l2q3l9N1O2q8J2J6K5m8
$$ -85 -12 210 -7 -68 -44 117 -9 21 72 -20 2 -34 9 58 38 -37 -45 54 115 83 0 -39 12 74 -14 -2 14 39 -9
6581ijrL6J5l3k6N2kq0L1L3Nk1n3L3J4j3k6lN7mm3ML7M1l8m6L8K1j6m7L9M7j3
$$ -9 -10 -19 17 32 -1 -27 25 23 -57 -26 7 12 -9 -62 -29 -15 -28 -54 -57 0 -4 -47 -43 -6 35 -3 -49 -11 10 -6 -53 -14 33 20
6615B0j7o5O8kNl2J3N0k8j8mj1M8k3j6K7LPl9LM7k0Nm7K1K4l3NONk8L2l4M2Rk5
$$ 20 3 -62 6 4 9 -23 -10 40 12 -6 -10 -21 27 4 -12 15 18 25 -14 -11 36 16 21 -26 -5 19 -14 -9 -3 2 -26 6 -28 14 23 -2
6651bPjNJ9k0k2MoL9m8KL0Rj7l1M8k1q%j7J8%J1j5kJ9kj0j4mJ2kPKL5o3%L6J6
$$ -2 5 4 9 28 8 -14 -10 -16 23 -25 -23 7 16 -1 -32 16 -5 -13 -13 -30 -12 -12 -1 -16 -18 1 -1 -11 -25 -29 -17 -19 -12 -10 25 -38 -38 -2 14
6690A4k1j5K3qM1l4j4M4K0j6o8L5L8Jk9MJ4qj3k9K7mL7l1j5N7l4l5KO5J4n9n4
$$ 14 -7 -22 1 -7 34 0 -14 30 50 34 -34 1 39 40 11 15 29 21 8 -21 6 2 39 8 -7 50 16 -19 -17 48 62 3 -51
6723e1L8K6Qm2j1P7j9n3l3P4J8n0k9J9O7j7n8K4N4j1n7j0K8L4l6l7M0J6Jn6JO9
$$ -51 -13 13 21 -21 -32 45 26 -27 -60 14 32 -18 -47 -28 39 22 -36 -12 42 31 -26 -36 -8 26 -10 -47 -7 9 10 -46 -45 24
6755B4km4n0M5P9o9m4M0Q3k1j14K9Q7j0n6k6N8O3p6j8JQ3k9o4KP5J6o1l8O5M1
$$ 24 22 -22 -72 -27 52 -17 -61 -21 62 41 -73 -44 43 33 -23 -49 9 72 -4 -22 -21 62 33 -31 -29 46 62 1 -37 28 69
6786F9k5r8K4Q8k8r3J5R4jn5k1K2O5o1p1N4O5oq2pQ0J5p5k1N1M5j7p2J0R5k6r1
$$ 69 44 -54 -30 58 30 -63 -48 46 45 -10 -31 -9 56 -5 -76 -22 43 37 -45 -52 28 43 -32 -53 -2 43 26 -46 -36 59 33 -58
6818e8K4N7Rp7OM1M8k9r1M8O5j2q7J7M0O0q7oM6J8j0r7L6R5j3q0pN4M6p4k5L2
$$ -58 -34 23 32 -45 -39 2 50 21 -70 -22 43 31 -56 -39 1 61 -26 -32 14 32 22 -75 -39 56 43 -37 -44 10 56 -18 -43 -11
6850a1Q2n6k8n7J50J0pj02R8l6J6l5J8Q5k6q4K4M3k7nk30J31Q0K4j27R6nj5o8
$$ -11 71 15 -13 -70 80 90 83 -19 79 43 59 24 42 127 101 17 41 84 57 52 -178 -47 33 57 -70 26 21 6 -62
6879f2M5PJ2l7k0K7Q5q6k2qJ08l0p0L0M7j2l5j7K5O8m9o4O9J8qn4K7J1K3k9rL5
$$ -62 -17 -10 2 -35 -55 -28 57 -29 -51 -59 49 19 -51 -21 26 14 -21 -38 -13 55 6 -58 11 29 21 -33 -6 5 28 -1 -10 25
6911B5Oj8o9N4L5l5l4jN9Qn2j1K6L2j9j4%L0jm5J6K9K5n3kOL6l1jJ4LK5pm8L1
$$ 25 31 13 -56 -2 33 -2 -36 -37 22 30 -22 -33 -7 25 6 -8 -8 22 21 -24 -8 21 46 -7 -9 -3 33 2 1 15 18 43 36 -12 19
6946A9M7m6j8kL1k1l7K0JL5j9l1K3Km3n1P4Q8j3k3j18N3J2lnL1j4Oj4llJ7J7k0
$$ 19 66 20 2 0 31 10 -27 -7 -6 29 10 -21 2 4 -39 -90 -16 72 59 36 -82 -29 -17 -20 -25 6 -8 -2 -16 -19 -22 -5 12 -8
6980hnK0j1L0k2QK3j2mk7K1qQpJ2Pnj5k4M1kOn8L5L1l9j1K3L6j8m9nP0j1l0KL3
$$ -8 -13 7 -4 26 4 12 35 23 19 -8 13 5 13 6 18 25 20 5 -19 22 20 26 -32 3 34 -5 -16 7 43 25 -24 -29 41 30 0 2 35
7017C5K1k6k9kL2mm2jK2M0k0m1OP7k0p0M4j3k1l5MK4L4l9J7j9O1l3qoKM8q5K1
$$ 35 56 30 1 -1 31 27 -15 -16 6 46 26 -15 -9 68 48 -22 22 9 -12 -47 -43 -19 15 -24 -7 -26 35 2 -6 -12 -10 38 -47 -26
7051b6O1L4n3n2M7R9o9j12Q0l8R2m4l1L0LNp0O8L9qn9%M3j0k3p4P5Q7q3m2QP3
$$ -26 35 69 16 -36 11 110 41 -71 9 -29 63 19 -12 18 21 26 -44 24 63 55 -4 -4 39 29 6 -68 7 94 11 -31 -23 50
7083E0No2J8L0j7k0l9M1K2l1o6M6O6pl0l8J08n6j2n5P6rRr0J19l6R2j79j1J51
$$ 50 55 -7 11 41 24 4 -35 6 28 -3 -69 -23 43 36 6 -32 76 20 8 -47 29 20 29 -61 58 22 114 -65 -76 75
7113G5l6j06L4k1N9j02M9j23J53J9q6K1J73K0n9p5r6M7R4j99J16J39j38n0J00
$$ 75 39 -67 -33 -54 5 -97 -48 -171 -18 1 -85 -64 109 129 70 -5 -101 -54 40 -159 -43 96 -42 -92 8
7138HR9j29l8K62j64l1Q8j30RR8p6kJ4K3M3j55M0N1kQK6j88K72m3q4Nq9P7M8L8
$$ 8 107 -22 -60 202 38 7 95 -35 -26 72 -4 -6 8 31 74 -81 -41 10 8 16 42 -146 126 83 -1 4 -85 -8 40 78
7168G8j17M9j7J94j87R6J2j34n8R5O5Mp2M4l0n3o8K1N2R2j01L9o1J20m5p2J3Q3
$$ 78 -39 10 -7 187 0 96 108 -26 -84 11 76 80 8 52 22 -31 -99 -78 -26 66 -35 4 -57 63 18 -54 -41 42
7196D2l8j3k2J8j7J5j7K0P2q0l0pQ9j8k7qM3J4k9m0L7M6k9m3J8M3K5o1l1P6j8
$$ 42 4 -9 -31 -13 -30 -15 -32 -12 60 -20 -50 -57 32 14 -13 -21 22 36 7 -33 4 50 21 -22 -4 39 64 3 -28 48 30
7227C0l4PQL5l0m9K4O4k5l7j8M5J6m0nJ3K3lo3M8Jk2mk0J7J7j2jQNll6K8L3l4
$$ 30 -4 3 11 46 16 -33 -9 55 30 -7 -25 20 36 -4 -9 4 27 24 -39 9 10 -12 -16 -36 -19 -2 -14 -15 -7 -2 -5 -41 -13 20 -14
7262a4lKJ9Lol4K6J9j0j0k5K0R7j05n0R7m5n7O4l0oJ27k3l9k0K3ko2J00l9p6L7
$$ -14 -17 -15 4 7 1 -33 -7 12 2 -8 -33 -13 84 -21 -71 26 -19 -76 -12 -42 -48 79 56 17 -3 20 18 -44 56 17 -59 -22
7294b2k8O9k9OK1kpj1JK8qj2L0k2j0MJ0nK0k9K2m1M5m5OJ8k4omM1m2JRK9j0k1
$$ -22 -50 19 -10 -4 17 15 8 -3 -2 26 18 6 36 14 4 8 18 13 33 4 26 -15 30 -15 -9 9 -15 -21 -25 16 -26 -25 -16 13 3 -18
7330a8J6Rnl2QJ0J1k4RnL2kl5J0M2k8pj6K9kj6k7J2M4k7j0jL1J4n3j8L7K6ql7
$$ -18 -2 7 2 -30 -22 -12 -1 -25 -16 -21 11 9 -26 -16 26 -2 -9 -25 4 2 -14 -41 -29 15 -12 -22 -23 8 22 -31 -49 -12 14 6 -31
7365c1K4J8J1l0rN5k4mm3L0M1Mn2J2L1J2k3l0M1J5n2k1N2K0k3o5K5M6nm6J0JL5
$$ -31 -7 11 22 -8 -17 38 14 10 -33 -3 38 42 -10 2 33 45 22 -8 33 48 -4 -25 27 47 24 -41 -16 30 25 -21 -11 -10 25
7398B5j7p9O6L0j2m9k8O7J2l2m8M8O6n1m5jK9KRm2J11n5Ok6K8N2k1j30K18m6j44
$$ 25 8 -71 -5 25 13 -36 -64 3 15 -17 -65 -17 49 -2 -47 -48 -19 -17 -8 -50 61 6 12 -14 14 66 45 -85 133 87 -57
7429e7J8L9K1Mj3n4L1O1l4l0k1N3ll3k1M4K8l5n5M0Q0m2o8L0P7k5m7l6Q6K3p6
$$ -57 -39 0 21 25 12 -42 -11 50 16 -14 -35 18 15 -18 -39 5 33 -2 -57 -17 63 21 -47 -17 60 35 -12 -48 38 61 -15
7460a5oL6M4n3k8J0M9j6l4k5N1K0%j9r7Q3N9j39j8P3J3n2K8n2O8L7n6m7j2J02
$$ -15 -21 15 59 6 -22 -12 37 21 -13 -38 13 33 33 14 -83 0 59 -80 -98 -25 -12 -64 -36 -88 -20 17 -39 -86 -98 4
7490Dl9KQ9n6km5K9O5p7nJ5N5j3o0J3O9j0m3k1K8K0l7RkP5m2l0oK0J7m0l4M9K8
$$ 4 -35 -33 56 0 -2 -47 -18 47 -30 -35 -20 35 22 -38 -25 44 34 -9 -30 -2 18 -19 -10 -12 63 21 -9 -15 5 22 -18 -52 -3 25
7524B5l7l9NP5j2l0J4J9K1n7LN9J1n4k9J4N1l3Mk4M1kl2J7j7L6k8k2RK6Jk5j2
$$ 25 -12 -51 -46 29 17 -13 1 20 41 -16 -13 46 57 3 -26 -12 39 6 10 -14 27 25 -7 10 -7 29 1 -21 -12 14 15 -10 -22
7557b2N2j5m5j3N9J3o1qJ1L9mj8l4N5K5l2n5k5J03l6K1m0k1O6km0J8L1j0j8NK8
$$ -22 30 15 -30 -43 16 29 -32 -40 -29 10 6 -12 -46 9 34 2 -53 -78 25 -11 10 -30 -51 15 13 -27 -9 22 12 -6 -1 27
7589B7l0K7k8J1Ql3J1L8j4l2LK9j1j6pj4L3k4Q%J0KK9l9J1J0L5j5lj2K6k3lJ0
$$ 27 -3 24 -4 7 15 -18 -7 31 17 -15 -12 17 6 -10 -17 -31 2 -22 -14 -14 -4 -2 27 -12 -1 9 44 29 26 14 40 17 14 24
7623B4Qm0m1L9m1O0Pm6N2l1K1n4M6n8L5Pn7M0P2m0l0J8l3Q6o2j08Q1J31k2l5n8
$$ 24 32 -8 -49 -10 -51 9 16 -30 22 -9 12 -42 4 -54 -19 -12 -69 -29 43 3 -27 -9 -42 44 -18 -126 -45 86 64 29 -29
7654b9j3L5K3L7l0k1J8o6NK1P9o9Q9J2q3kk1N6j8J8n2M1n4L6M6m3Om3J4L2n4K6
$$ -29 -42 -7 16 53 23 2 20 -46 -41 -20 59 -10 79 91 8 6 -15 41 23 41 -11 30 -24 12 58 15 21 -22 -8 24 -30 -4
7686dJj4j4K8K8m4J4k0K9Mk0k1L0K2l8j7L6M6n5j5J6L3ok2pJ8L8p4J3j2L5j6l7
$$ -4 -3 -17 -31 -3 25 -19 -5 -25 4 8 -12 -33 -3 19 -19 -36 0 46 -9 -24 -8 25 19 -3 -10 8 46 -28 -15 -27 8 -8 -45
7719d5L2K5nl3j4K5J9m3J1J1J9j2j5NN7j1l6qO0k5j0k4pO2m3j1k3O3ro7L6P5j2
$$ -45 -13 12 7 -26 -40 -15 4 -39 -28 -17 2 -10 -25 -20 37 26 -10 -18 42 17 7 -17 -24 38 -5 -16 -39 24 15 -52 -16 59 47
7752D7n5j1K5J9M8j65J19K3j3n1M0j61J94j6q5K0J15j30k1K6L2J4k9m3O5L0o3
$$ 47 -8 -19 6 25 73 -92 27 50 37 -14 26 -135 59 43 -42 -22 93 -37 -58 -32 0 14 -15 -58 7 37 -26
7779b6m1O8L4n8pMO6Ko4jK8Rk2k5K1L6qj9m8O9pl2pK0M8m3k0lL2l1qK0M6Km1k2
$$ -26 -67 1 35 -23 -30 -26 40 42 -22 -23 5 14 -8 -33 -12 24 16 -3 -51 18 11 -21 -28 -8 40 -3 -23 -26 6 -25 -33 -13 33 35 -6 -28
7815b8M6K3l9m2N4K5k3n8M3K8k5Qj8L7J8l7m7K6M9j1o3K7N6nn7l6L0K6k0k9J1
$$ -28 18 41 2 -40 14 39 16 -42 1 29 4 12 -6 31 49 12 -35 -9 40 29 -34 -7 49 44 -13 -49 -19 7 -13 -42 -31
7846c1L3J5l7%K0J9j5k1M6rk7nnL6l6k8QN1kk9rL5L9q0J5%N9n3lJ0M0l3%l2M6
$$ -31 2 17 -20 -20 0 19 4 -17 29 20 -7 -12 -17 19 -17 -45 -37 14 12 -17 -26 9 48 -32 -17 -17 42 -11 -14 -4 36 3 3 -29 17
7881A7J5l3n1M9konOKJ8l3J8k1L5ll1K6J3Pj8j8L9rK6k4l3L7pl0K2K2ol3PJ5l
$$ 17 32 -1 -52 -3 -5 -11 -16 -10 -8 10 -23 -5 -26 9 6 -25 1 14 21 3 -15 24 15 41 17 -16 21 14 -16 6 28 22 -11 -4 11 8
7917HQn9L5J3ll6L8Q1j04J9n2J1R3r3J23n0n0K9k2qQ1k4j1j7J5K3m5mm0L6kJ8
$$ 8 16 -43 -8 5 2 -34 4 85 -19 0 -52 -41 52 -41 82 32 -18 11 -11 -19 62 38 27 10 25 48 3 -1 -41 -5 -7 11
7949A1J0m8RJ8J4%j7j8K3kj2K2j0JJ3j9J3j3oJL3j2nk7N3k5rl3K5K6j4j1Kk2K4
$$ 11 21 -27 -18 0 14 14 -3 -21 2 0 -12 10 0 1 14 -5 8 -5 -11 -10 23 11 6 -21 32 7 -2 -35 -10 16 2 -9 -7 -29 -5
7984eL3o5P7K1o7J1j5k6J19p4r7P9J8N0j06J4O8n2L0o0M3n7J05j6o7P5r6l3m8
$$ -5 28 -37 40 61 -6 5 -10 -36 83 9 -88 -9 9 59 -47 -33 35 -17 13 -47 -4 -61 44 28 -39 36 -60 -93 -141
8013a41N4K04l9j36K55j23j26P0r2R4J1j18M8K21k65m6J16P8j35R6j9On0J13j56
$$ -141 -87 117 78 -58 197 74 -52 18 -74 20 31 -87 -39 182 -83 -129 -13 65 -70 26 7 13 -37 76 -80
8038h0L1R9j12K9J9J9qJ7m1L8M5n5m4L6K0J2n1J7K3Lk6k7K1L3J3l8K3rj6o%RK6
$$ -80 -49 50 -62 -33 -14 5 -3 14 -27 11 56 1 -43 -7 13 25 -26 -9 14 17 -9 -36 -15 18 31 -7 16 7 -9 -15 -15 -6 20
8071B0j9l9K5M2k3k1J5%Pm7J9J7Pk6k9M3M6k9k4j4N8k8l5pP8pp3KK9M0k6m0O2
$$ 20 1 -38 -13 29 6 -15 0 0 7 -40 -21 -4 3 -23 -52 -9 37 8 -16 -30 28 0 -35 -42 36 29 -44 -42 -13 27 1 -39 23
8104B3J7j5j8k2M9Jk0m6L4L8m1j3lK7J1l0LJ1J7k7l6M8K7k2k3J4j6M1p8J8K5M1
$$ 23 40 25 7 -15 34 35 15 -31 3 41 0 -13 -16 11 22 -8 -5 6 23 -4 -40 8 35 13 -10 4 -12 29 -49 -31 -6 35
8136C5o6J2%M9m4jjM8J3k8k1J1K0l1k1QK8ll6J2N0j9m1kK6Pl8L6k3M4om0J6%L3
$$ 35 -31 -19 -19 30 -14 -15 -16 32 45 17 -4 7 27 -4 -25 -17 11 8 -28 -16 34 15 -26 -28 -2 5 -33 3 -20 24 18 -22 -6 -6 27
8171B7l2j2J0K0j0n1K5M6Pm8k7L8K4k0rN8k6On4L1
$$ 27 -5 -17 -7 13 3 -48 -23 23 30 -18 -45 -7 17 -3 -12 46 20 26 -28 3
8191C
$$ Imaginary data points
##PAGE= N=2
##DATA TABLE= (X++(I..I)), XYDATA
0@%%%%%%%%%%%%%qJ6j6J6j9K7l2M0n1N9p2Q8j04J20j39J63j91K20k54K92l32L78
$$ 0 0 0 0 0 0 0 0 0 0 0 0 0 0 -8 8 -8 8 -11 16 -16 24 -27 32 -40 48 -56 64 -75 88 -103 117 -137 155 -177 201
35B01m27M79n39O10o86P67q56R53j058J173j300J438j588J752j931K129k346K581
$$ 201 -226 253 -286 324 -362 405 -451 502 -556 617 -683 755 -833 919 -1012 1117 -1229 1352
53A352k841L127l445L802m202M653n167N758o444P254q222R401j0866J2709j5020
$$ 1352 -1489 1638 -1807 1995 -2207 2446 -2721 3037 -3407 3847 -4375 5026 -5840 6869 -8151
68h151J7526k2510K79380k90169J7256l3399r3215M12184l60430n5230J53174
$$ -8151 9375 -13135 266245 -23924 -6668 -40067 -133282 278902 -81528 -136758 16416
79A6416j6318J59621k36296k315J46669n5695K8008j69899J46713O1991j12822
$$ 16416 98 159719 -76577 -78892 67777 12082 40090 -129809 16904 78895 -33927
90c3927P3385r9383J16262j8745j58329J57964k5570K3136m9996n1143J58279
$$ -33927 39458 -59925 56337 37592 -120737 37227 11657 34793 -15203 -66346 91933
101I1933o6522m9867o7616Q3926J41758j82046K1923j5938R0413R3290l01252
$$ 91933 25411 -24456 -92072 -8146 133612 -48434 -26511 -42449 47964 141254 -159998
112a59998J19812P9272j5584Q0714k76498J85558J12658j73300P7583j72911J81413
$$ -159998 -40186 39086 23502 104216 -172282 13276 125934 -47366 30217 -142694 38719
123C8719R6679k45674J37742o7927Q2802M7094k41410J81404p736k5139N0501
$$ 38719 135398 -110276 27466 -40461 42341 89435 -151975 29429 21693 -3446 47055
134D7055j45971J62486k3338r5588O3021n1376J01690n6250n7056R0458k7015
$$ 47055 -98916 63570 40232 -55356 7665 -43711 57979 1729 -55327 35131 8116
145H116K8377q5769R886R6119o0734N896m8652O3435N6444j12898J8714q547P0951
$$ 8116 36493 -49276 -39390 56729 -4005 1891 -46761 16674 73118 -39780 -21066 -29613 41338
158D1338O18j17010Q6895k401L3616l3087j05884J46542l6112j6582Q846q0390
$$ 41338 41956 -75054 11841 9440 43056 9969 -95915 50627 14515 -2067 6779 -73611
170g3611J58592p2352o1985P2729p3358J16056o8319o3510J23009p7871N2052
$$ -73611 84981 12629 -49356 23373 -49985 66071 -2248 -65758 57251 -20620 31432
181C1432l8820m8721J18562q5233K0099P423l0644Q3014q6732J5837L1767l5421
$$ 31432 -7388 -56109 62453 -22780 -2681 4742 -25902 57112 -29620 -13783 17984 -17437
193a7437M6975o3277L2132L2797m6745K6128l6449L6180R686m6458L1857j5702
$$ -17437 29538 -33739 -1607 31190 -15555 10573 -25876 10304 19990 -26468 5389 -10313
205a0313L1395j4252l5527M2527k1294K1715k0548j7927N2264l8202J9390j4257
$$ -10313 21082 6830 -28697 13830 -7464 14251 -6297 -24224 28040 -10162 9228 -5029
217e029j5389N2530n2506K3668J945k4623N1289n2477K1471J2062l7105N0965
$$ -5029 -20418 32112 -20394 3274 5219 -19404 31885 -20592 879 12941 -24164 26801
229B6801m1925J3007J8489m0335M8267l2726J35K3394l3164L8896k7699n000K8292
$$ 26801 -15124 -2117 16372 -23963 24304 -8422 -8287 15107 -18057 20839 -6860 -11860 16432
242A6432k7263K4353k2857M72K9451k9362J2860j3054P687K0652l3883J3538Q70
$$ 16432 -10831 13522 -9335 -8863 20588 -8774 4086 -8968 -1281 19371 -14512 -974 -104
255a04O883M222l1970K3212N314m428m819j6443L4108n967j7879O94j702L0862
$$ -104 6779 11001 -20969 2243 7557 3129 -1690 -18133 15975 10008 -7871 -7177 -8879 21983
269B1983k3923j7271K2769K614J1731l2831n311L7715j0764q789j6679J5699L2980
$$ 21983 -1940 -19211 3558 6172 17903 -14928 -20239 17476 6712 -2077 -18756 -3057 29923
282B9923l2367j5004P904K0580P995m0226N847K8941M993j8036k8569K8175K2261
$$ 29923 -2444 -17448 -9544 11036 19031 -21195 -15348 13593 18586 550 -28019 156 22417
295B2417k2427j7601M344L6094l282l8932K557K4897J3215k7803k1198L3215K1757
$$ 22417 -10 -17611 -13267 22827 19545 -19387 -16830 8067 21282 -6521 -27719 5496 27253
308B7253j9658l1306R454L7679q784l4956j158L5981J7101l7058k4113K9089K7639
$$ 27253 7595 -23711 -14257 23422 14638 -20318 -21476 14505 31606 -5452 -29565 -476 27163
321B7163k0381l5663J3961M1555j620m1667j0461L8166J6038l3398k4773K8172
$$ 27163 6782 -28881 -14920 26635 25015 -16652 -27113 11053 27091 -6307 -31080 -2908
333b908L5869j9944l9689J0159L7836k109l8625q771M0823K0901l7853k5667K8245
$$ -2908 32961 13017 -26672 -16513 21323 19214 -19411 -28182 12641 33542 -4311 -29978 -1733
346a733K8485j7978m0526J2809M7970n684m0440j0006L7153K1473m0539k6053
$$ -1733 26752 8774 -31752 -18943 29027 23343 -17097 -27103 10050 31523 -9016 -35069
358c5069L1413L6670j7035m5725J2278M0713j746l8530j8597M7583K3867l9660
$$ -35069 -3656 33014 15979 -29746 -17468 23245 21499 -17031 -35628 11955 35822 -3838
370c838k1926J6825L8370j3650n1357J8288L9780J360l2137k3497M2745K1739
$$ -3838 -25764 -8939 29431 15781 -35576 -17288 22492 23852 -8285 -31782 10963 32702
382C2702m0927k1513K1631L8573j2796m5324J1887L9176o10m0180j4843M1948
$$ 32702 -8225 -29738 -8107 30466 17670 -27654 -15767 23409 22799 -17381 -32224 9724
394I724K3644l4220k8311K4709L5133j7313m3244P226M5660K488l8028j4127L2727
$$ 9724 33368 -852 -29163 -4454 30679 13366 -29878 -22652 23008 25496 -12532 -26659 6068
407F068K8582l7130l2001K8262K9378l674m0769l087M9809m754l4137j1845K0851
$$ 6068 34650 -2480 -34481 -6219 23159 19485 -21284 -24371 25438 20684 -13453 -25298 -4447
420d447L8168l1660l1525K9516J8114j540l6769p546M9681m894k7836o169J5911
$$ -4447 33721 2061 -29464 52 18166 16626 -20143 -27689 21992 17098 -10738 -16907 -996
433i96L2399l2909k9820L0763J6364j946l1195m184M7379q330l2400m901J7342
$$ -996 31403 -1506 -31326 -563 15801 13855 -17340 -21524 25855 17525 -14875 -19776 -2434
446b434L1847k8257l1249L1886J8796o708l0035j1031M5697L245l4084m067J4832
$$ -2434 29413 1156 -30093 1793 20589 13881 -16154 -27185 18512 21757 -12327 -16394 -1562
459a562K7528j6288l8741K2030K3562n957j6915j4803L1930J3172l3780l795J0768
$$ -1562 25966 9678 -29063 -7033 16529 10572 -6343 -21146 10784 23956 -9824 -13619 -2851
472b851J4277J05l1568J5219K3734j6597o167r651J6301J6838l3878M603J7868
$$ -2851 11426 11531 -20037 -4818 18916 2319 -3848 -13499 2802 19640 -14238 -9635 8233
485H233j524K829k9939J4413K8090k7542m34m044J3957K2179m3388L989K0760
$$ 8233 6709 9538 -20401 -5988 22102 -5440 -5874 -9918 4039 26218 -17170 -13181 7579
498G579m502J0141l4896J1971L4710k7120J140j2095Q019L0587l6959N80J4545
$$ 7579 3077 13218 -21678 -9707 25003 -2117 -977 -13072 -5053 25534 -11425 -10845 3700
511C700l597J6768k8714l47K5234j5203M439p405j303K0383j6277k750Q073o347
$$ 3700 103 16871 -11843 -12190 13044 -2159 2280 -5125 -6428 13955 -2322 -5072 3001 -3346
525c346O946m494l838J1944p562m445R719o103K476j253q888J8714o601j0470
$$ -3346 3600 -894 -4732 7212 -350 -4795 4924 -1179 1297 44 -8844 9870 3269 -7201
539g201J1756j1192J4835l155k0805K4608j0314L400O552k6275K7967o916j0576
$$ -7201 4555 -6637 8198 5043 -15762 8846 -1468 1932 8484 -17791 10176 3260 -7316
552g316J8475k6936K2381K483k1533K4862k4238J1577J3992k7560K2077j4755
$$ -7316 11159 -15777 6604 9087 -12446 12416 -11822 -245 13747 -13813 8264 -6491
564f491K204K1877l0026J2241j87l154J8896k6842N107J2662n991P155j8041L946
$$ -6491 -4287 17590 -12436 -195 -382 -3536 15360 -11482 -6375 6287 296 7451 -10590 -6644
578f644J7535q139o292l866P594Q723p407j1387P386J0929p695k103o020Q416
$$ -6644 10891 2752 -3540 -7406 188 8911 1504 -9883 -2497 8432 737 -1366 -7386 1030
592A030J0515k1378Q961L061k773J0159k4405J7945P946k1687J6539j5183J5842
$$ 1030 11545 -9833 -872 2189 -584 9575 -14830 3115 11061 -10626 5913 -9270 6572
605F572P694l6081K7966k997j562O890l3591L6862K926k4328J1485j7814L1932
$$ 6572 14266 -21815 6151 3154 1592 8482 -25109 11753 14679 -9649 1836 -15978 15954
618A5954j914l6513K3090R6J3644r892l0015L3039L783q514r769r538L3324o184
$$ 15954 14040 -22473 617 713 14357 4465 -25550 7489 11272 2758 -7011 -16549 16775 10591
632A0591j9824L29P926J7805j9271j1869J3273J1601j586k3402Q712J4517j955
$$ 10591 -9233 -8904 -978 16827 -2444 -14313 -1040 10561 8975 -14427 -5715 8802 6847
645F847j0308j4361K7607K847j9033r6k148K7639j5225k5156K3651J745J1192
$$ 6847 -3461 -17822 9785 12632 -6401 -6497 -8645 18994 3769 -21387 2264 4009 15201
658A5201k2229j6217M1702j1162r704r302j220M2019k8820j7329J5779K521K1524
$$ 15201 -7028 -23245 18457 7295 -2409 -11711 -12931 29088 268 -17061 -1282 1239 22763
671B2763l6074p505L5665p234j302k3587R166L2533k5349r313m16J8123J3308
$$ 22763 -13311 -20816 14849 7615 6313 -17274 -8108 24425 -924 -10237 -10653 7470 20778
684B0778l4716L225J5865P723q558k7233K3547J5408j1335j3174p234L1958l264
$$ 20778 -13938 -10713 5152 12875 4317 -22916 631 16039 4704 -8470 -15704 16254 12990
697A2990k5010M54J0687K2796k2899j8283K0839Q960K199k9609K096L2010r769
$$ 12990 -12020 -11566 -879 21917 -982 -19265 1574 10534 12733 -16876 -14780 17230 7461
710G461r128j5452J7438K4052l2608m109P482J4508P076l7503J3622K0063o244
$$ 7461 -1667 -17119 319 24371 -8237 -12346 -4864 9644 16720 -20783 -7161 12902 6658
723F658o438k2699K7095J4698k5382k971Q09K4067n033l0007J2528J2699Q713
$$ 6658 220 -22479 4616 19314 -6068 -9039 -8230 15837 10804 -19203 -6675 6024 14737
736A4737j9016j5686K8849L287r968j6104K643L1224j5143j5971L595J1253J5673
$$ 14737 -4279 -19965 8884 12171 2203 -13901 -11258 19966 4823 -11148 -7553 3700 19373
749A9373k7801p628K1287M463l453k1689J0008K1912j2076j1662n618K0481O909
$$ 19373 -8428 -16056 5231 9694 6241 -15448 -5440 16472 4396 -7266 -12884 7597 14506
762A4506k2986j67Q348J4622r807k2445J7467R356k168j2354q908K6503j430j6562
$$ 14506 -8480 -8647 -299 14323 4516 -17929 -462 8894 6726 -5628 -14536 11967 10537 -6025
776f025k503M541J9123j3446j5317J2613Q237K272j7921k842J9266r18q456r848
$$ -6025 -8528 -3987 15136 1690 -13627 -1014 7223 9495 -8426 -11268 7998 7080 -1376 -11224
790a1224J0886J4005j4470p251K450J2589J890j9320M632J0877K345p164j2977
$$ -11224 -338 13667 -803 -8054 -5604 6985 8875 -10445 -5813 5064 7409 245 -12732
803a2732J4047Q129j0176n355K51J4125j624j4366K357P684N287r570o823J0271
$$ -12732 1315 9444 -732 -6087 -5836 8289 6665 -7701 -5344 2340 7627 -1943 -8766 1505
817A505N099l564j0125K803J1388m537n844k149P377O606j1606k070N664L228
$$ 1505 6604 3040 -7085 -4282 7106 2569 -3275 -5424 1953 8559 -3047 -5117 547 3775
831C775j19j0185M021Q645l962l731k800N640M460p889j736M199L444j391o417
$$ 3775 3656 -6529 -2508 6137 2175 -1556 -4356 1284 5744 -2145 -3881 318 3762 2371 -4046
846d046K376M890j640l039j570M206K662n152p92K346Q88M47m388J468M140l132
$$ -4046 -1670 3220 1580 -1459 -3029 1177 3839 -1313 -2105 241 1129 1576 -2812 -1344 2796 -336
862c36L57j169L54L511m609P52K149k104K660k617R2K564l233J874r3j118J447
$$ -336 21 -1148 -794 2717 -1892 -1140 1009 -1095 1565 -1052 -960 1604 -1629 245 152 -966 481
879D81j203J286k07j625Q80J077j91j472J85J208J297k049k396M066j57p74j703
$$ 481 -722 564 357 -1268 -388 689 498 -974 -789 419 1716 -333 -2729 1337 1180 406 -1297
896a297j395P182l938l307K703j166O829p151l958R846m108K576n561k980J4551
$$ -1297 -2692 4490 552 -2755 -52 -1218 5611 -1540 -5498 4348 240 2816 -2745 -5725 8826
911H826r106k347J757j989J2456j2504l736J0803l881M842r708j360J4682q685
$$ 8826 -280 -2627 -870 -2859 9597 -2907 -6643 4160 279 5121 -4587 -5947 8735 50
925E0j721j651K158J0056j2061j849O194J934O62j0393L702Q846l528n652k415
$$ 50 -1671 -3322 -1164 8892 -3169 -5018 1176 3110 3772 -6621 -2919 5927 2399 -3253 -5668
940e668Q612L034q297m497O556Q756q640n858K349Q379L434j6936L277J0082l45
$$ -5668 2944 5978 -2319 -6816 -260 8496 -144 -6002 -3653 4726 8160 -8776 -5499 4583 4238
955D238p66j6101J2142J2465j5246J147n765J2046R087k5080Q553N998R28L225
$$ 4238 3472 -12629 -487 11978 -3268 -2121 -7886 4160 13247 -11833 -3280 2718 3646 6871
969F871k1927J5802J0100j3129J936r186J5842M352k1406Q582K725O724l583j7471
$$ 6871 -15056 746 10846 -2283 -347 -9533 6309 10661 -10745 -2163 562 7286 3703 -13768
983a3768J6671N020o956n138m567J7929j660j4884J652P536Q047j0706r674R528
$$ -13768 2903 7923 967 -4171 -8738 9191 7531 -7353 -5701 1835 9882 -824 -10498 -970
997i70J0731n436j4146N856R710K045j0967j0288J9978K179j0781l174k768K1278
$$ -970 9761 4325 -9821 -3965 5745 7790 -3177 -13465 6513 8692 -2089 -5263 -8031 13247
1011A3247q235j8251J2926R61R745j1862j4753K5503l952n605m777n369K5740
$$ 13247 5012 -13239 -313 648 10393 -1469 -16222 9281 5329 -276 -5053 -10422 15318
1024A5318j3042j2533R850o57J3861j7667q629K2072n284l43j0566K53K2179j4410
$$ 15318 2276 -10257 -407 -1064 12797 -4870 -13499 8573 3289 2946 -7620 -7367 14812 402
1038D02p883L984N151J0059j7534l987J4737K182n582j1137O313J2680m501j2332
$$ 402 -7481 -3497 1654 11713 -5821 -9808 4929 7111 1529 -9608 -3295 9385 4884 -7448
1052g448L35J4621q00r350o061P707J3933j4522o670P302N232N603j9129J643
$$ -7448 -7113 7508 6708 -2642 -8703 -996 12937 -1585 -8255 -953 4279 9882 -9247 -7604
1066g604J6267n944r68j1661Q631J5342j8661K63J103O366P940k2655P787J0474
$$ -7604 8663 2719 1751 -9910 -1279 14063 -4598 -4335 -3232 3134 11074 -11581 -3794 6680
1080F680m842J663j5571J2913J0596j6292K356k459J0137L617j9306P507O529
$$ 6680 1838 3501 -12070 843 11439 -4853 -2497 -4956 5181 8798 -10508 -3001 3528
1093C528P77l279j1451J2328N928q372m338Q0J1090j688j0213P23P678M091r363
$$ 3528 4305 1026 -10425 1903 7831 -541 -4879 -4799 6291 4603 -5610 -4887 2791 6882 -2481
1108b481l504N616O087k792j1057P014O137k424l707o850J2262J811j0359K318
$$ -2481 -5985 -369 5718 2926 -8131 -1117 5020 2596 -1111 -7961 4301 6112 -4247 -1929
1122a929q97R280k936j2274J0164O28J088l405p977J4122k281n880J254l068J1171
$$ -1929 -2826 6454 3518 -8756 1408 2036 3124 -281 -8258 5864 3583 -2297 -1043 -4111 7060
1137G060n859p537P990j409M279n943m673J0982l419j938j741k80Q272n742l478
$$ 7060 1201 -6336 1654 245 4524 -1419 -6092 4890 1471 -467 -2208 -2488 5784 42 -3436
1152c436K955J617K183n950k90M780M34k206l597L617K337k014k270o70N324j662
$$ -3436 -481 1136 3319 -2631 -2921 1859 2293 87 -3510 107 2444 430 -1840 -2510 2814 1152
1168A152k770N92J80L951m065j586L719j481K141l356m22M749l978J465q83o92
$$ 1152 -1618 -1026 -846 3105 -960 -2546 1173 -308 1833 -1523 -1945 2804 -1174 291 -592 -1284
1184a284M237m720J538J074k030L134l602J555J660l104K942k014M21J506k880
$$ -1284 2953 -1767 -229 845 -1185 1949 -1653 -98 1562 -1542 1400 -614 -193 1313 -1567
1199a567K799j182p61J616j533J773j340o61J875r25L70j222L34K166j823o16
$$ -1567 1232 50 -711 905 -628 1145 -195 -856 1019 94 464 -758 -424 1742 -81 -697
1215f97M8J584M58k683L63J464J165j747k261K713J241j074k114j61L973r16l005
$$ -697 -649 935 1393 -1290 -927 537 1702 -45 -2306 407 1648 574 -1540 -1701 2272 1356 -1649
1232a649J2J856K648l413k503L335J719q41l713L95M824q62l652q61L436K641
$$ -1649 -1637 219 2867 -546 -3049 286 2005 1164 -2549 -2154 2670 1808 -1844 -2705 731 3372
1248C372m199k610L074L362j511n068J527N002o20m240j672M826K883n018l022
$$ 3372 -827 -3437 -363 2999 1488 -3580 -2053 2949 2329 -1911 -3583 1243 4126 -892 -3914
1263c914L523M138j888n779J443O014m44n331j614N276L243n087m142M132M906
$$ -3914 -391 3747 1859 -3920 -2477 3537 3093 -2238 -3852 1424 4667 -420 -4562 -430 4476
1278D476k471n987J186O392J93o194j983N965L426n293m567M014N706k659o633
$$ 4476 2005 -3982 -2796 3596 3789 -2405 -4388 1577 5003 -290 -4857 -843 4863 2204 -4429
1293d429J273O895M12o797k140O370L645n501n243M403O385l220o577R72P235
$$ -4429 -3156 3739 4151 -2646 -4786 1584 5229 -272 -5515 -1112 5273 2053 -4524 -3552 3683
1308C683J117q059j905O728L634n000o192M612P088l680o577M60P675J590q439
$$ 3683 4800 -3259 -5164 1564 5198 198 -5994 -1382 5706 2026 -4551 -4091 3584 5174 -3265
1323c265j950O522M078m816o976M858P266l460o452j43P905J949q797j977O435
$$ -3265 -5215 1307 5385 569 -6407 -1549 5717 2257 -4195 -4338 3567 5516 -3281 -5258 1177
1338A177M269m514p215M694P565l631o592J87P361K410q555k685P213L797m760
$$ 1177 5446 932 -6283 -1589 5976 2345 -4247 -4060 3301 5711 -2844 -5529 1684 5481 721
1353G21o461L704Q086l286p373J017O782K442p990l716P831L684m857n816K669
$$ 721 -5740 -2036 6050 2764 -4609 -3592 3190 5632 -2358 -6074 1757 5441 584 -5232 -2563
1368b563Q632k908q082J429O018L001p228m834Q173L569m585n303J291Q971k276
$$ -2563 6069 3161 -4921 -3492 2526 5527 -1701 -6535 1638 5207 622 -4681 -3390 5581 3305
1383C305q257J865N000L074o000n638Q069L300m565l984N15Q371j739q346K484
$$ 3305 -4952 -3087 1913 4987 -1013 -6651 1418 4718 153 -3831 -3316 5055 3316 -5030 -2546
1398b546M379K410m971n627P984L222n156l214M84P629j103q467K409M845J731
$$ -2546 1833 4243 -728 -6355 1629 4851 -305 -3519 -3035 4594 3491 -4976 -2567 2278 4009
1413D009m354n652O841M386n260l416Q27O374L69q064O13N684J063l262m862M230
$$ 4009 -345 -5997 844 5230 -30 -3446 -2619 3755 4124 -3940 -3327 2357 3420 158 -4704 -474
1429d74N686m860l457J429L691J974o790o88O345q25j786l276J624O434n456k587
$$ -474 5212 352 -3105 -1676 2015 3989 -2801 -3489 2856 2031 245 -3031 -1407 5027 -429 -3016
1445c016K886R46K840o305q37P140k890q40k419P56P150o365k164L310P1L484
$$ -3016 -130 816 3656 -2649 -3486 3654 764 -76 -2495 -1739 5411 -954 -3118 192 263 3747
1461C747o380j067P076k549m85k796L43O648m922k192K251L45L064m453j640M634
$$ 3747 -2633 -3700 3376 827 342 -2454 -2111 4537 -385 -2577 -326 19 3083 -1370 -3010 1624
1477A624o29q32j340k79L650j385k706J751P53rl64k180K834O75l101K042q79
$$ 1624 995 163 -1177 -1456 2194 809 -1897 -146 607 598 234 -1946 888 1563 -1538 504 -375
1494c75P80J247m364L617M72k568K609l539L068J302n063M219k044P26K429n872
$$ -375 405 1652 -2712 905 1377 -1191 1418 -2121 947 2249 -2814 1405 -639 87 2516 -3356
1510c356M824o27k199L724n049L524Q28l947M453l585J108K281m145L764k179
$$ -3356 1468 841 -1358 2366 -2683 841 1669 -2278 2175 -1410 -302 1979 -2166 1598 -581
1525e81o06L301l378J642o24q67L010k428l62R06K06Q31j718o21J591R76j823
$$ -581 -1187 2114 -1264 378 -246 -1113 1897 -531 -893 13 219 1050 -668 -1289 302 1278 -545
1542e45n64Q01O45J369l728J000K579j978J119k679J364L699n011J803m2j96L478
$$ -545 -1109 -308 337 1706 -2022 -1022 1557 -421 698 -1981 -617 3082 -1929 -126 -168 -364 3114
1559C114o400K968K575l457K846m579L308L355o698L235q81J526K026p248M649
$$ 3114 -3286 -318 2257 -1200 1646 -2933 375 3730 -2968 267 -614 912 2938 -4310 339
1574C39J756j929N70m586N619J429n114J012m52M263j028n478K985K269P27l447
$$ 339 2095 166 736 -3850 1769 3198 -1916 -904 -1356 2907 1879 -3599 -614 1655 2382 -1065
1590a065k289M758J282k411l319K164M111k483k441q64M580R40n483J038J273
$$ -1065 -3354 1404 2686 275 -3044 -880 3231 748 -1693 -2557 2023 2963 -2520 -1482 -209
1605b09L036j799n820N725J197j493j623l060P689j244n445K138k03N474m354
$$ -209 2827 1028 -4792 933 2130 637 -986 -4046 3643 2399 -3046 -908 -1111 4363 9
1620In163O749j07M05m192j799Q577k925l363n14J492O218o378k950M249J627
$$ 9 -5154 1595 1488 1893 -2299 -4098 4479 1554 -1809 -2323 -831 5387 -991 -3941 308 1935
1636A935J215o770P91O348j551k590l358M572L952n254k056J277M985j009o265
$$ 1935 3150 -3620 -2829 3519 1968 -622 -3980 592 4544 -710 -2766 -1489 3496 2487 -3778
1651c778K187L244J820m512l439O532P88k311l606Q15P205l992l854J209K698
$$ -3778 -1591 1653 3473 -1039 -4478 2054 2842 531 -3075 -2260 4945 953 -2901 -1692 1006
1666A006L725p190j276N623L51o50o003K932O253m426k170j387M938K877p767
$$ 1006 4731 -2459 -3735 1888 2239 1589 -4414 -1482 4771 345 -1825 -3212 1726 4603 -3164
1681c164N15L052K603j363o868M740L828k198k773k462O777O90n536m48J921M838
$$ -3164 -2649 403 3006 1643 -5225 -485 3343 1145 -1628 -4090 2687 3377 -2159 -2607 -686 4152
1697D152l632m748L804K607M50n279p50O345q06k746k822L162M809n125k119J512
$$ 4152 520 -4228 -424 2183 2633 -2646 -3396 2949 2143 -603 -3425 -263 4546 -579 -2698 -1186
1713a186L504Q67o677J441M219J30k273m191M970K846l934j769l2N398j017n411
$$ -1186 2318 3185 -3492 -2051 2168 2298 25 -4166 804 3650 -284 -2053 -2085 3313 2296 -3115
1729c115J818K148K378l737l401N252R87j556l135J62N798k404l212K92K227L087
$$ -3115 -1297 851 3229 -508 -3909 1343 2330 774 -2361 -2199 3599 1195 -2017 -1725 502 3589
1745C589m883j609L527J343o91m310J748L938j641k161j469L807J552m162l85
$$ 3589 -1294 -2903 624 1967 1276 -3034 -1286 2652 1011 -1150 -2619 1188 2740 -1422 -1807
1760a807J259K935j437m028K692J743L9k456j659M453j36k353p76P34L397k455
$$ -1807 -548 2387 950 -3078 -386 1357 1396 -1060 -2719 1734 1598 -755 -1531 -797 2600 145
1776A45k256J736J248R70l425r8L127n11p48k221J825K641k826n53J20J783R45
$$ 145 -2111 -375 873 1843 -1582 -1680 1447 936 188 -2033 -208 2433 -393 -946 -826 957 1902
1793A902l700R54J747Ql81k399K054J532j794n65j79J846Q2k042L08R89P05j180
$$ 1902 -1798 -844 903 911 530 -1869 185 1717 -77 -642 -821 1025 1107 -935 -627 362 1067 -113
1811a13r18J167N80k68j303M62J197o62l07n25R23N32j332M02K3M62oj181J098
$$ -113 -1031 136 716 448 -855 -393 804 142 -165 -690 233 765 -567 -165 -142 320 314 -867 231
1830B31j36k32K61q71J369o32o54J092r07Q43m00p57J569j079L9N17q24J193r34
$$ 231 95 -137 124 -747 622 -10 -664 428 -479 364 -36 -793 776 -303 -264 253 -571 622 -312
1849c12k00J233j105L88l4k89J057j110j74J094m51o5l86J2J368r36r26Q93K89
$$ -312 -512 721 -384 4 -30 -319 738 -372 -546 548 97 32 -354 -342 1026 90 -836 57 346
1868C46M03j077q51K082k8j131l26r9K201p66k239J338O33O71j206j859K697N01
$$ 346 749 -328 -1179 903 875 -256 -582 -681 1520 754 -1485 -147 486 1157 -49 -1908 789 1290
1886A290j490m26m49K526m19k711J379P79N14r81j983K604P76k041j12M7J971
$$ 1290 -200 -626 -1075 1451 1032 -1679 -300 479 993 12 -1971 633 1409 -632 -744 -697 1274
1903A274l15l047J694J564n47j051j635K791J424l350k16J131J752k4m143J628
$$ 1274 959 -2088 -394 1170 623 -428 -2063 728 2152 -1198 -1414 -283 1469 1445 -2698 -1070
1919a070L079j126j306k147K890K794m008j011J316K084P55m767Q02L673p05j253
$$ -1070 2009 883 -423 -2570 320 3114 -894 -1905 -589 1495 2250 -2517 -1715 1958 1253 0
1935@k496K341L278l518j341J212J759P98l988L27L563q47j503j373J810K769
$$ 0 -2496 -155 3123 -395 -1736 -524 1235 2033 -1955 -1628 1935 1088 -415 -1788 22 2791
1951B791l204j805K422J380k91l189l0M447j010k986k94J884L099l303l357L707
$$ 2791 -413 -2218 204 1584 1293 -1896 -1926 2521 1511 -1475 -1769 115 3214 -89 -3446 261
1967B61J853o76l207j286N657k35l983l93J319M050k603m486L461J914L9k832
$$ 261 2114 1438 -1769 -3055 2602 2367 -1616 -2009 -690 3360 757 -3729 -268 1646 1685 -1147
1983a147k230N313L36l553l17O48L597j819l944K955J683m47k101j466M264K58
$$ -1147 -3377 1936 2272 -1281 -1598 -950 2647 828 -3116 -161 1522 1075 -1026 -2492 1772 2030
1999B030l606O9J575K225j799l549K857K705j740k320n96L896J091m575n47K843
$$ 2030 -1576 -1507 68 2293 494 -3055 -198 2507 767 -1553 -2149 1747 2838 -1737 -2284 559
2015E59J860j388m245K147M126j944k487r52L229K587m739j211K745J602k16m324
$$ 559 2419 1031 -3214 -1067 3059 1115 -1372 -2324 905 3492 -1247 -2458 287 1889 1673 -2651
2031b651J172M113j753j686j110K207K728m123q52K392P86m2l391J054L540j886
$$ -2651 -1479 2634 881 -805 -1915 292 3020 -1103 -1955 437 1223 1181 -2210 -1156 2384 498
2047D98j666k40J951J886l619r41K806Q26r09k747R16L604j461k559J62K106J680
$$ 498 -1168 -1408 543 2429 -1190 -2131 675 1501 592 -2155 -1239 2365 904 -1655 -1493 613 2293
2064B293k934j914K943J370j217k228J02L509n12k954K79J592J553j822k362K529
$$ 2293 -641 -2555 388 1758 541 -1687 -1585 1924 1412 -1542 -1263 329 1882 60 -2302 227
2080B27J325j147j365l85K814j76k571N13J075J078j237k022K286R30j289p73
$$ 227 1552 405 -960 -1345 1469 1293 -1278 -765 310 1388 151 -1871 415 1345 56 -717
2096g17k40K247j79k398P26J080N85j003j791K027J046j432p00r6J875P1k278
$$ -717 -957 1290 1111 -1287 -561 519 1104 101 -1690 337 1383 -49 -749 -845 1030 1101 -1177
2113a177M75J206L54p39j459J311J174j132o49JJ196K81j607J07R46J55k93r92
$$ -1177 -702 504 858 119 -1340 -29 1145 13 -636 -635 561 842 -765 -658 288 443 150 -842
2131h42O38R46q25m54K39N73J46q94j2Q17j23l52k40K49O55o03l69N45j3J34m52
$$ -842 -204 742 -83 -537 -298 275 421 -473 -485 332 209 -143 -383 -134 521 -82 -451 94 81 215 -237
2152b37j06P72l82j99J49p8M78n31n5N60m47K03j78L7M54o84K21L15l00J59m27
$$ -237 -343 429 47 -152 -3 -81 397 -134 -189 371 -76 127 -51 -14 440 -244 -23 292 -8 151 -276
2173b76L99L64p34J63R5L15p8p48N02L82j57m92j84Q84K5o88k65N19P20q08o11
$$ -276 123 487 -247 -84 11 326 248 -500 2 384 227 -265 -449 435 460 -228 -493 26 746 -62 -673
2194f73N38O30l6j156J90J031Kp43p81J188P16j127n34K99J254k30j611N09J030
$$ -673 -135 495 459 -697 -507 524 526 -217 -998 190 906 -221 -755 -456 798 568 -1043 -534 496
2213D96K74j117r44J714N02j049p86L07J828p17j639N72J088O30j721p60J900
$$ 496 770 -347 -1291 423 925 -124 -910 -603 1225 508 -1131 -559 529 1159 -562 -1322 578
2230E78M38q51j416P67J995j041j477J41J587O37k110n21J676Q94r95j845J091
$$ 578 1016 165 -1251 -484 1511 470 -1007 -866 721 1358 -752 -1273 403 1297 302 -1543 -452
2247d52K000r58j663j08K423K17k221n09J506J592j834j667J437J550l38k308
$$ -452 1548 590 -1073 -1181 1242 1459 -762 -1271 235 1827 -7 -1674 -237 1313 975 -1333
2263a333J3K629j07j781j051J760J880k222j402J131J770o7k907M42K469o6j619
$$ -1333 -1320 1309 1202 -579 -1630 130 2010 -212 -1614 -483 1287 1220 -1687 -1245 1224 1158 -461
2280d61j462K067J827k182j400Q65K183k56k893M96K277K92j882j445K316J592
$$ -461 -1923 144 1971 -211 -1611 -746 1437 1181 -1712 -1216 1061 1353 -529 -1974 342 1934
2296A934j955j758J104K335n78k649J75K550M61k349j093K094J658j543k391J548
$$ 1934 -21 -1779 -675 1660 1082 -1567 -1392 1158 1619 -730 -1823 271 1929 386 -2005 -457
2312d57K281p31k386k18K738M99k552p40J549J964j324k751J910J545k48j906
$$ -457 1824 1093 -1293 -1511 1227 1726 -826 -1566 -17 1947 623 -2128 -218 1327 1079 -827
2328h27r88L157K28k290n63R63K288j599k461J873J546l34j986p78L085K04k417
$$ -827 -1815 1342 1570 -720 -1283 -320 1968 369 -2092 -219 1327 993 -993 -1771 1314 1518 -899
2345h99n61J386J985j613k519J807J914o04k025o22K777P00k514q48J569J689
$$ -899 -1460 -74 1911 298 -2221 -414 1500 896 -1129 -1751 1026 1726 -788 -1636 -67 1622
2361A622j014k550J137K341o99j662p26K116J266k489p77J486J099l43k382Q03
$$ 1622 608 -1942 -805 1536 837 -825 -1551 565 1831 -658 -1435 51 1150 807 -1575 -772
2377g72K266r81j048o02J469J461k533l98J509N03j01k193P31K397j379j001k13
$$ -772 1494 513 -535 -1137 332 1793 -740 -1138 371 874 773 -1420 -689 1708 329 -672 -885
2394h85J258J446k539o22J824M80l11j934L66K579j065j398l5R64J538j972j147
$$ -885 373 1819 -720 -1342 482 962 651 -1283 -917 1662 597 -801 -836 128 1666 -306 -1453
2411a453J760M92k04j415l06K288n47j315J52K88J367j110j266J547J02j55n71
$$ -1453 307 799 595 -820 -1126 1162 615 -700 -548 -260 1107 -3 -1269 278 380 225 -346
2428c46n63J725m12j213P36n3P99o99j141J721n8p48K3m67J502k47j640J033K60
$$ -346 -909 816 404 -809 -73 -126 673 -26 -1167 554 496 -252 -229 -696 806 559 -1081 -48 212
2447B12K65k49j455J596M48j117K53o02J094M80j787P76K89l6M56j459Q89N94
$$ 212 477 228 -1227 369 817 -300 -47 -649 445 925 -862 -86 203 167 623 -836 53 647
2465F47q97O01p07L03P59j216P52j04m98R19q83M61K23r65J042l01k74L80p68
$$ 647 -250 351 -356 -53 706 -510 242 138 -360 559 -324 137 360 -605 437 136 -138 242 -526
2484e26R03L8r68O67k41K92K43j104P15L51o06L62m82K45O43j031L94K87m96N79
$$ -526 377 415 -553 114 -127 165 408 -696 19 370 -236 126 -356 -111 532 -499 -105 182 -314 265
2504B65o33K31O58j121N38K35l49N89j167O31Q98j190L30l37N32Q34j735L75P59
$$ 265 -368 -137 521 -600 -62 173 -176 413 -754 -123 775 -415 -85 -422 110 944 -791 -416 343
2523C43j23L12j565P43J364j104j32m97Q76R68j755k9P68L58N4j447M69J333o42
$$ 343 220 532 -1033 -290 1074 -30 -162 -659 217 1185 -570 -599 169 527 581 -866 -397 936 294
2542B94o05k17P60P11j204m96J003M12m65q37K28J341m78j221M31P02M60j055
$$ 294 -311 -528 232 943 -261 -757 246 658 193 -644 -416 925 447 -774 -343 359 819 -236
2560b36r66J705L59j024n24j0J844n55j801Q15P12O95j262j329K065N12j001q98
$$ -236 -1202 503 862 -162 -686 -696 1148 593 -1208 -393 319 1014 -248 -1577 488 1000 -1 -899
2578h99OK147o14j835N62R13Q54j435j189J780O80q04j188K92J877n23j537J51
$$ -899 -893 1254 640 -1195 -633 280 1134 -301 -1490 290 970 166 -1022 -730 1147 624 -913 -762
2596g62J220O94j529q57J408J014r80j356P53J433k35j654j57J895J75j408p97
$$ -762 458 1152 -377 -1234 174 1188 208 -1148 -395 1038 803 -851 -1008 887 1062 -346 -1143
2613a143J157J507j397j353R24J282J12k090j01K127n4j178j051J175J706j614
$$ -1143 14 1521 124 -1229 -305 977 1089 -1001 -1102 1025 971 -207 -1258 -83 1623 9
2629Ij130O76J377J72k209P5J799J29r88j389J514J282j359j133O47J680m28j759
$$ 9 -1121 -445 932 1104 -1105 -1030 769 898 -90 -1479 35 1317 -42 -1175 -528 1152 724 -1035
2647a035J49J349O04j271j226J470J156r93j354M24J791l18j626j53J532P58j719
$$ -1035 -886 463 1067 -204 -1430 40 1196 203 -1151 -727 1064 746 -880 -1033 499 1257 -462
2664d62p76J248J117p48j678P69J643m63j324m38J748N85j667n36R06J286p76
$$ -462 -1238 10 1127 379 -1299 -530 1113 650 -674 -1112 636 1221 -446 -982 -76 1210 434
2681D34j662Q96J285j94j359m56J779L31j331o22P93J345r53j334P05J129J5j466
$$ 434 -1228 -332 953 759 -600 -1056 723 1054 -277 -899 -106 1239 286 -1048 -343 786 801 -665
2699f65k74J551K80j064q38R52J213r98j034M09J211k6j468pJ137M76j022q74
$$ -665 -939 612 892 -172 -1010 -58 1155 157 -877 -468 743 717 -751 -758 379 855 -167 -1041
2717a041J073Q09o61j006K58J316k60j127j2Q74O07j127n85J019M29k92j044K87
$$ -1041 32 841 180 -826 -568 748 488 -639 -651 223 830 -297 -882 137 566 274 -770 -483
2735d83J213m30p65j39P93O02j085l84O96N05k01j002L70R45l07n90k14O98M33
$$ -483 730 300 -465 -604 189 791 -294 -678 18 523 322 -680 -310 635 328 -262 -476 222 655
2754F55q17l26N34M98l30o72K94O76k17n32m6N26K16n51l29N78K72l84k75O3N60
$$ 655 -162 -488 46 544 214 -458 -164 512 295 -237 -283 243 459 -92 -421 157 429 45 -230 -167 393
2775C93j51n98K69K56Q5k92l76O21K7l78M4j66N97k19m95L90J6Kj17k76N16q6
$$ 393 242 -356 -87 169 254 -38 -414 207 234 -144 -100 -266 331 112 -383 7 23 25 -92 -368 148 62
2797F2k56J98k21L59j71k36M15j81o0Q0j60L57k12k64M01m6p7r3j34N03j24m22
$$ 62 -194 4 -217 142 -29 -265 150 -31 -91 -11 -171 186 -26 -290 111 65 -12 -105 -239 264 140 -282
2819b82K89K9J66j42m76N99R5m05P1j36N30m9o99M51J53mj11n33P28J59o85J71
$$ -282 7 36 202 60 -416 183 278 -127 -56 -192 338 289 -410 41 194 190 79 -454 274 433 -252 -81
2841h1mM55p0q97O49L21k68j43m76Q25K48r75J46K73M00j22j062O64O96m82l38
$$ -81 -85 370 300 -597 52 373 105 -38 -514 311 559 -416 -270 3 403 281 -781 -117 579 97 -241
2862b41l54Q03N41j203j11N92L89m0j203M52J069n54m50l06O96Q27j333k86Q34
$$ -241 -595 208 749 -454 -565 27 416 376 -827 -375 694 140 -310 -616 80 907 -426 -712 122
$$ [...]
8191C8
##END NTUPLES=NMR FID
##END=
