##TITLE=1H_IPDPCOO102
 CDCl3, 8 sc, 
 5.2.2019
##JCAMPDX= 6.0         $$ Bruker NMR JCAMP-DX V2.0
##DATA TYPE= NMR FID
##DATA CLASS= NTUPLES
##ORIGIN= UXNMR, Bruker Analytische Messtechnik GmbH
##OWNER= root
$$ XWIN-NMR		Version 3.5
$$ Tue Feb  5 15:53:25 2019 Russian Standard Time (UT+4h)  she@DPX200
##.OBSERVE FREQUENCY= 200.1313
##.OBSERVE NUCLEUS= ^1H
##.DELAY= (6, 6)
##.ACQUISITION MODE= SIMULTANEOUS
##.ACQUISITION SCHEME= undefined
##.AVERAGES= 8
##.DIGITISER RES= 18
##SPECTROMETER/DATA SYSTEM= spect
##.PULSE SEQUENCE= zg30
##.SOLVENT NAME= CDCl3
##.SHIFT REFERENCE= (INTERNAL, CDCl3, 0, 15.7039)
##AUDIT TRAIL= $$ (NUMBER, WHEN, WHO, WHERE, WHAT)
$$ ##TITLE= Audit trail, XWIN-NMR		Version 3.5
$$ ##JCAMPDX= 5.01
$$ ##ORIGIN= Bruker BioSpin GmbH
$$ ##OWNER= she
$$ F:/spectra/data/she/nmr/H-F/1/audita.txt
$$ ##AUDIT TRAIL=  $$ (NUMBER, WHEN, WHO, WHERE, WHAT)
(   1,<2019-02-05 15:52:28.82 +0400>,<she>,<DPX200>,
      <created by zg, POWCHK disabled, PULCHK disabled
       configuration hash MD5:
       00 E9 B6 7A A2 85 ED C7 34 08 36 98 17 FE 4E 26
       data hash MD5: 16K
       11 83 48 D6 65 CF F3 23 17 3F C5 07 7A C9 E8 47>)
$$ ##END=
$$ 
$$ hash MD5
$$ EB AE 0C 82 77 1A FF BB 2E FE B0 95 4A 99 70 7D
##$RELAX= 
##$RELAX= 
##$RELAX= 
##$RELAX= 
##$RELAX= 
##$RELAX= 
$$ Bruker specific parameters
$$ --------------------------
##$DU= <F:/spectra>
##$EXPNO= 1
##$NAME= <H-F>
##$PROCNO= 1
##$TYPE= <nmr>
##$USER= <she>
##$AMP= (0..31)
100 100 100 100 100 100 100 100 100 100 100 100 100 100 100 100 100 100 
100 100 100 100 100 100 100 100 100 100 100 100 100 100 
##$AQSEQ= 0
##$AQ_mod= 1
##$AUNM= <au_zg>
##$AUTOPOS= <>
##$BF1= 200.13
##$BF2= 200.13
##$BF3= 200.13
##$BF4= 200.13
##$BF5= 200.13
##$BF6= 200.13
##$BF7= 200.13
##$BF8= 200.13
##$BYTORDA= 1
##$CFDGTYP= 0
##$CFRGTYP= 5
##$CHEMSTR= <none>
##$CNST= (0..31)
1 1 145 1 1 1 1 1 1 1 1 1 1 1 1 1 1 1 1 1 1 1 1 1 1 1 1 1 1 1 1 1 
##$CPDPRG= <>
##$CPDPRG1= <>
##$CPDPRG2= <>
##$CPDPRG3= <>
##$CPDPRG4= <mlev>
##$CPDPRG5= <mlev>
##$CPDPRG6= <mlev>
##$CPDPRG7= <mlev>
##$CPDPRG8= <mlev>
##$CPDPRGB= <>
##$CPDPRGT= <>
##$D= (0..31)
0 1.2 0 0 0 0 0 0 0 0 0 0.03 0 0 0 0 0 0 0 0 0 0 0 0 0 0 0 0 0 0 0 0 
##$DATE= 1549367548
##$DBL= (0..7)
120 120 120 120 120 120 120 120 
##$DBP= (0..7)
150 150 150 150 150 150 150 150 
##$DBP07= 0
##$DBPNAM0= <>
##$DBPNAM1= <>
##$DBPNAM2= <>
##$DBPNAM3= <>
##$DBPNAM4= <>
##$DBPNAM5= <>
##$DBPNAM6= <>
##$DBPNAM7= <>
##$DBPOAL= (0..7)
0.5 0.5 0.5 0.5 0.5 0.5 0.5 0.5 
##$DBPOFFS= (0..7)
0 0 0 0 0 0 0 0 
##$DE= 6
##$DECBNUC= <off>
##$DECIM= 32
##$DECNUC= <off>
##$DECSTAT= 4
##$DIGMOD= 1
##$DIGTYP= 9
##$DL= (0..7)
0 120 120 120 120 120 120 120 
##$DP= (0..7)
150 150 150 150 150 150 150 150 
##$DP07= 0
##$DPNAME0= <>
##$DPNAME1= <>
##$DPNAME2= <>
##$DPNAME3= <>
##$DPNAME4= <>
##$DPNAME5= <>
##$DPNAME6= <>
##$DPNAME7= <>
##$DPOAL= (0..7)
0.5 0.5 0.5 0.5 0.5 0.5 0.5 0.5 
##$DPOFFS= (0..7)
0 0 0 0 0 0 0 0 
##$DQDMODE= 0
##$DR= 18
##$DS= 0
##$DSLIST= <SSSSSSSSSSSSSSS>
##$DSPFIRM= 0
$$ [...]
##$SUBNAM2= <"">
##$SUBNAM3= <"">
##$SUBNAM4= <"">
##$SUBNAM5= <"">
##$SUBNAM6= <"">
##$SUBNAM7= <"">
##$SUBNAM8= <"">
##$SUBNAM9= <"">
##$SW= 20.0189088683792
##$SWIBOX= (0..15)
0 0 2 0 0 0 0 0 0 0 0 0 0 0 0 0 
##$SW_h= 4006.41025641026
##$TD= 16384
##$TD0= 1
##$TE= 0
##$TE2= 300
##$TE3= 300
##$TEG= 300
##$TL= (0..7)
0 120 120 120 120 120 120 120 
##$TP= (0..7)
150 150 150 150 150 150 150 150 
##$TP07= 0
##$TPNAME0= <>
##$TPNAME1= <>
##$TPNAME2= <>
##$TPNAME3= <>
##$TPNAME4= <>
##$TPNAME5= <>
##$TPNAME6= <>
##$TPNAME7= <>
##$TPOAL= (0..7)
0.5 0.5 0.5 0.5 0.5 0.5 0.5 0.5 
##$TPOFFS= (0..7)
0 0 0 0 0 0 0 0 
##$TUNHIN= 0
##$TUNHOUT= 0
##$TUNXOUT= 0
##$USERA1= <user>
##$USERA2= <user>
##$USERA3= <user>
##$USERA4= <user>
##$USERA5= <user>
##$V9= 5
##$VALIST= <valist>
##$VCLIST= <CCCCCCCCCCCCCCC>
##$VD= 0
##$VDLIST= <DDDDDDDDDDDDDDD>
##$VPLIST= <PPPPPPPPPPPPPPP>
##$VTLIST= <TTTTTTTTTTTTTTT>
##$WBST= 1024
##$WBSW= 4
##$XGAIN= (0..3)
0 0 0 0 
##$XL= 0
##$YL= 0
##$YMAX_a= 36333
##$YMIN_a= -27967
##$ZGOPTNS= <>
##$ZL1= 120
##$ZL2= 120
##$ZL3= 120
##$ZL4= 120
##$ABSF1= 10
##$ABSF2= 0
##$ABSG= 5
##$ABSL= 3
##$ALPHA= 0
##$AQORDER= 0
##$ASSFAC= 0
##$ASSFACI= 0
##$ASSFACX= 0
##$ASSWID= 0
##$AUNMP= <proc_1d>
##$AZFE= 0.1
##$AZFW= 0.1
##$BCFW= 1
##$BC_mod= 2
##$BYTORDP= 1
##$COROFFS= 0
##$CY= 11.3945322036743
##$DATMOD= 1
##$DC= 2
##$DFILT= <>
##$DTYPP= 0
##$F1P= 18.9103706918063
##$F2P= -1.10871071338519
##$FCOR= 0.5
##$FTSIZE= 0
##$FT_mod= 4
##$GAMMA= 1
##$GB= 0.15
##$INTBC= 1
##$INTSCL= 1
##$ISEN= 128
##$LB= 0.24
##$LEV0= 0
##$LPBIN= 0
##$MAXI= 10000
##$MC2= 0
##$MEAN= 0
##$ME_mod= 0
##$MI= 1.114404
##$NCOEF= 0
##$NC_proc= 0
##$NLEV= 6
##$NOISF1= 3.799351
##$NOISF2= 2.8
##$NSP= 1
##$NTH_PI= 0
##$NZP= 0
##$OFFSET= 15.70392
##$PC= 1
##$PHC0= -9120.177
##$PHC1= 14.20004
##$PH_mod= 1
##$PKNL= yes
##$PPARMOD= 0
##$PSCAL= 0
##$PSIGN= 0
##$REVERSE= no
##$SF= 200.130013532006
##$SI= 16384
##$SIGF1= 3
##$SIGF2= 2
##$SINO= 400
##$SIOLD= 16384
##$SREGLST= <1H.CDCl3>
##$SSB= 0
##$STSI= 0
##$STSR= 0
##$SW_p= 3612.71676300578
##$SYMM= 0
##$S_DEV= 0
##$TDeff= 0
##$TDoff= 0
##$TI= <>
##$TILT= no
##$TM1= 0
##$TM2= 0
##$TOPLEV= 0
##$USERP1= <user>
##$USERP2= <user>
##$USERP3= <user>
##$USERP4= <user>
##$USERP5= <user>
##$WDW= 1
##$XDIM= 8192
##$YMAX_p= 0
##$YMIN_p= 0
$$ End of Bruker specific parameters
$$ ---------------------------------
##NTUPLES= NMR FID
##VAR_NAME=  TIME,          FID/REAL,        FID/IMAG
##SYMBOL=    X,             R,               I
##VAR_TYPE=  INDEPENDENT,   DEPENDENT,       DEPENDENT
##VAR_FORM=  AFFN,          ASDF,            ASDF
##VAR_DIM=   8192,          8192,            8192
##UNITS=     SECONDS,       ARBITRARY UNITS, ARBITRARY UNITS
##FACTOR=    0.0002496,     1,               1
##FIRST=     0,             0,               0
##LAST=      2.0444736,     0,               0
##MIN=       0,             -27967,          0
##MAX=       2.0444736,     36333,           0
$$ Real data points
##PAGE= N=1
##DATA TABLE= (X++(R..R)), XYDATA
0@%%%%%%%%%%%%%%%%%%%%%%%%%pJ5j6J6j6J6j6J6k0K8l2L2l2M0m8M8n6O4o8P6
45D0q4R2j02J12j22J36j50J64j82K02k22K47k77L10l48L94m53N27o24P59r56J270
67G33j859L309j3188j6962L8860J3782k2018N438K8238j2711k6853O411P082k0966
81a0704n534J5609o071j6902J1058J1717j2820j82K3365J413j8085M600J3314
94A0778j1725j0128J5348R585r864l19R018m852q103M183J50q116N02K020j0675
109a2198n211J0248K466p011Q233J4572l757o569R976O180q753j675O771n635
123G637j0803K58p73q551N16P760k446l410Q790M985o250K071J0274j907p862
138B89K850K207q075k579O232o26l691M849J979o974J33O539l965n917O585L243
$$ plain form
0 0 0 0 0 0 0 0 0 0 0 0 0 0 0 0 0 0 0 0 0 0 0 0 0 0 0 -7 8 -8 8 -8 8 -8 8 -12 16 -16 16 -16 24 -24 24 -32 32 -36 40
45 40 -44 48 -54 58 -64 72 -78 86 -96 106 -116 131 -146 164 -184 210 -243 284 -340 419 -537 733
67 733 -1126 2183 -11005 -27967 10893 24675 2657 8095 36333 23622 -3231 3180 10262 -10704
81 -10704 -16238 -629 -6700 -23602 -12544 -827 -13647 -13829 9536 10949 -7136 -2536 10778
94 10778 -947 -11075 4273 13858 3994 3675 12693 7841 -262 3921 4071 -4045 -3543 -1523 -12198
109 -12198 -17409 -7161 -4695 -11706 -3473 11099 7342 773 10749 16929 8176 6501 13272 7637
123 7637 -3166 -2908 -3681 -12232 -11716 -3956 -6402 -9812 -1022 3963 -2287 -216 10058 8151 289
138 289 3139 5346 -2729 -5308 924 298 -3393 1456 3435 -3539 -3406 3133 -832 -6749 -164 3079
154C079r558j192J0251n23o420P407P631q098m594P957j115r796L595P568q179
169a987p211Q215K106r858K763J2397k462p335P565N393r569k495R649j780j0120
184d729L056N646q513n494Q990L292p030K303Q342l622o225N443L698o294p75
199a912O523k051o704K664M170m330k055N502Q14m942M77L173k533k243L544J590
215A687k883K49K726j295k016K200J763j690n11J317r13j878L95O18o35K95P83
232B12o29l28J111J53o92Q90J102r87j058L94j39r21J88M52n27J9P64l67n38J249
252C48J067q67k64J188j41j257K57O99r35o83N43m42j180L23P50o71k82J181L67
271Ao42O67J303j95k99R78K82j200l48O05o23j309j2K81p93o05M25K93j29L82
$$ plain form
154 3079 -6479 -7671 2580 2057 -4363 3044 10675 2577 -2017 5940 4825 -4971 -1376 6192 -1987
169 -1987 -9198 -983 1123 -8735 -5972 6425 3963 -3372 4193 9586 17 -2478 7171 5391 -4729
184 -4729 -1673 3973 -4540 -10034 -1044 2248 -4782 -2479 5863 2241 -3984 1459 5157 -1137 -1912
199 -1912 4611 2560 -4144 -1480 2690 -1640 -3695 1807 2621 -2321 -1844 1329 -1204 -3447 97 1687
215 1687 -1196 -947 1779 484 -1532 668 2431 741 230 1547 634 -1244 -849 -231 -866 -571 212
232 212 -417 -745 366 519 -173 717 1819 832 -226 168 29 -892 -704 -252 -779 -760 4 -363 -901 348
252 348 1415 548 284 1472 1331 74 331 1030 95 -588 -45 -487 -1667 -1344 -594 -1265 -1547 -366 1
271 1 -641 26 1329 1134 835 1813 2095 895 547 1152 529 -780 -792 -511 -1304 -1909 -1484 -1191 -1320 -938
291i38O00K01L09O53K04j44K67L69l07n69l7J31m32p59k56K23j09o07k78M39L20
312g20l15j22P06P61J52R6M74M83O0l04l63j03j29o74p93p2J92l75l39M97N75
333c13q8m5N30M26RQ9J77m7J6Lm83m29K40lp97l21O26K32m73J39P98J64l68J30
357B12K59k49k21J62q5l57KK66j32k64R9J74j39j24O9R3J38K82K40j4j4K57J36
380G90l63m10J23K26m13n49J27L82j46l77J9J90L8o6r6J61O13M91j55m0O87L06
402A538p28m42L02l26j010k58K21l78j84O00K00l54N67P99m43l43J017M19j013
421A84q1R83l77j150M26P02r32n89R23J19j072K29J041n14q00P24M29r42k15R03
441iK0l96P43P33m00j19N47k68p64K6Q1o28l31J62k00r2N70K91l9N32L83o35k46
$$ plain form
291 -938 -338 -137 172 825 1029 885 1152 1521 1214 645 608 739 307 -452 -708 -485 -594 -1201 -1479 -1040 -720
312 -720 -1035 -1157 -451 310 462 558 1032 1515 1575 1271 908 805 676 2 -791 -863 -671 -1046 -1385 -888 -313
333 -313 -401 -446 84 510 519 608 785 738 754 757 274 -155 85 82 -715 -1036 -410 -178 -651 -512 286 450 82 212
357 212 471 222 1 163 78 -279 -277 -11 -143 -407 -308 -134 -273 -397 -328 -235 -97 185 425 411 397 654 790
380 790 427 17 140 366 -47 -596 -469 -87 -233 -610 -591 -401 -363 -429 -525 -364 249 740 585 545 1232 1538
402 1538 810 368 670 344 -666 -924 -703 -1081 -1265 -665 -465 -819 -252 547 104 -239 778 1197 184
421 184 103 1086 709 -441 -15 687 -245 -834 89 208 -864 -635 406 -108 -908 -184 245 -697 -912 -9
441 -9 11 -385 358 1091 691 572 1119 851 87 113 194 -434 -765 -603 -803 -895 -325 -34 -73 459 842 207 -39
464c9N86l38p69N99N77j028m34J089nr67P76J179q64o43J100k21j593N72J366
483I43j344j217J660N01k063K46K406m42j474J550J017k132m12K071p96k142J619
500iJ610k522r83K929J33k793J137K608k077k023K612P64l159M20L229j447k646
517b217K624J956l130o48L532n42l411J546K533k804j796L246M84l487P18L288
533A892j716k410K845J735l081n37L071o99k888J458K010k249j167K469N8k440
549a649R80K264j443j449K066P62k251k14J911m07j463Q22Q27j058l93P98k36
566a33m07P38J80p21J73M60o06j07Q69n5m56O62Q8j129K44J100q40q66J459L39
586I92k178r3J965q50j731J880J571k224p18K590k38k506J519K512k097j724K602
$$ plain form
464 -39 547 209 -560 39 616 -412 -846 243 238 -729 47 1226 362 -281 819 598 -995 -423 943
483 943 -401 -1618 42 543 -1520 -1274 1132 690 -784 766 1783 -349 -761 1310 514 -1628 -9
500 -9 1601 -921 -1904 1025 1158 -1635 -498 2110 33 -1990 622 1386 -1773 -1353 1876 429 -2217
517 -2217 407 2363 -767 -1415 2117 1575 -1836 -290 2243 -561 -2357 889 1373 -2114 -1396 1892
533 1892 176 -2234 611 2346 -735 -1272 1799 1100 -1788 -330 1680 -569 -1736 733 791 -1649
549 -1649 -669 1595 152 -1297 769 1531 -720 -934 977 570 -893 -71 756 -302 -695 103 -133
566 -133 -540 198 378 -343 -170 290 -316 -423 446 391 -65 597 685 -444 -200 900 60 -806 653 992
586 992 -1186 -1279 686 -164 -1895 -15 1556 -668 -1386 1204 966 -1540 -21 2491 394 -1330 1272
603A272L96l281L49K996j443k459K315J343l198m81L371n58k830K125K574k757
619b66j562L289M52l234R23K983k033k403K505R25l364L0L302j206k849K229K099
636A820k910r90L420J58l023J190K715k055j969K539R29k866L8K656j146k391
652a885J736J564k346q05K544O1k375P51K134j135j482J585R27j613k41J576l11
669F85j382O24Q74j067o77J096L62j007n1Q67j34p13K13O29r2l25J88K37k96l40
689c09K67L70k37l07M07K61p30m17P90L22q17j7R90k03j034M39R11o00n34R98
709E50K46j259p6J067n31j062Q90R20j113n85J296K52j219L28J304m87r66P98
727C53M94j193k95J129k30j123N73R46q96p10J080M06j007P4J065l58q76N96N70
$$ plain form
603 1272 1668 -1613 -1264 1732 289 -2170 145 1488 -1710 -2191 1180 622 -2208 -83 2491 -266
619 -266 -1828 1461 1913 -1321 -398 2585 552 -1851 654 1579 -1785 -1755 1547 341 -2508 -279 1820
636 1820 -1090 -2080 1340 1498 -1525 -335 2380 325 -1644 895 1824 -1042 -1004 1652 506 -1885
652 -1885 -149 1415 -931 -1736 808 869 -1506 -755 1379 244 -1238 347 1274 -339 -580 996 685
669 685 -697 -73 801 -266 -943 153 515 -492 -543 324 190 -523 -310 319 227 -98 90 327 31 -309
689 -309 -42 328 91 -216 191 452 -278 -695 95 417 -400 -417 573 370 -664 -225 686 86 -448 550
709 550 796 -463 -539 528 -3 -1065 -175 745 -368 -953 343 595 -624 -296 1008 521 -445 353
727 353 847 -346 -641 488 258 -865 -292 654 -242 -952 128 534 -473 -399 666 308 -568 28 598
746E98q38k62J046K7r84K93Q35o43p39P79M36r16j80Q89k01r14M58Q32n58m72
766e14Q73L20r11p0Q56k60q07M84O27p63m96Q31K20q74Q8R58k49p74M72N29p06
787a66l39P70N1p90K07P24m49o26O42N00o46j95O97k4o61J88M72m12k55N70N8
808C16o30J04N85l32m72M40L29n13j86M37k2l49K13K80k37m7L63r1l10K54K29
829C61l37j50K88o8l49J22J78k28n5K73p7k10K40K21k88l8L67m7l37J78K19k63
851@q9L03p5l47K17K30l60j51L98om37J25L15k33j76L71N7l49J82L59l02k45M54
874B41J49n14k0M55j97l99K65K27l88n6L94j62l50L57K24m44p7N34q8n17K74M61
896C69l53k95M60J51m19N6L56k04k46K89K4m16P2L49k60l62L55K33m05o5M40k1
$$ plain form
746 598 -240 -502 544 571 -413 -120 715 72 -667 112 548 -368 -548 341 140 -774 -316 516 -42 -514
766 -514 359 679 -232 -302 554 294 -513 -29 598 -165 -661 170 390 -484 -396 562 313 -461 11 540 -166
787 -166 -505 265 316 -474 -267 457 8 -618 24 524 -122 -317 380 356 -305 -117 355 -57 -312 258 316
808 316 -314 -210 375 43 -429 11 340 -173 -359 78 56 -293 -80 200 -37 -84 279 188 -122 132 361
829 361 24 -126 162 94 -255 -133 45 -183 -238 35 -42 -252 -12 209 -79 -117 250 203 -134 44 263 0
851 0 -89 214 139 -208 9 239 -121 -272 126 120 -317 -192 123 -110 -286 85 142 -207 -25 334 32 -213 241
874 241 390 -124 -144 311 114 -285 -20 207 -181 -237 157 -5 -355 2 226 -218 -295 239 151 -366 -92 369
896 369 16 -279 181 332 -87 -31 325 121 -125 164 188 -228 -156 193 -67 -429 -74 159 -246 -311 129 108
918A08l03J97K57k51p6L12l0k94J49K03k55j50K57j2k99O9K04k09j73K78O4k89
940b43M9L08j06j70K04J58j90jJ94n4j62J27Q4j90o2J55o0j78O3J15j44q8J45
963d6L3j02kR9L5j7L3j2K1J01j5r7L6J00o2j31M3M0n7n8j0l0j2O3m3p9Q6J23j02
992f2j09J74J15r9j2J33Pj04K7O3n3l0N7n3j57J4P9q6j11J17R1j19q9J25R0p3
1018f5O0J54j4j03O4P9j18l4J68M7k17j05J50l4k54M0K44q8k27J10R8j90LL18
1042H6K9k19J70K89k81k57M04K25l96j22L79j21n05J26L51k91k14L99N4m93N4
1063c33M92j75l21M56L10n26j67N53j3n12K92N26m17m65M26J74n80NN76j90n60
1084d49L01K95n00j53O86J09n78J60N07l29m00N22L51m71j14M19j86n33K37M44
$$ plain form
918 108 -195 2 259 8 -68 244 214 -80 69 272 17 -133 124 112 -187 -118 86 -123 -296 -18 46 -243
940 -243 -194 114 8 -162 42 200 10 9 203 149 -13 114 198 8 -54 101 41 -137 -74 41 -103 -191 -46
963 -46 -13 -115 -117 -18 17 0 33 21 42 143 128 31 67 167 105 -26 17 57 0 -58 -68 -98 -110 -47 -90 -169 -83 40 -62
992 -62 -171 3 118 19 7 140 147 43 70 133 80 50 107 54 -103 -89 -10 -96 -207 -90 1 -118 -207 -82 8 -65
1018 -65 -5 149 135 32 96 175 57 23 191 238 21 -84 66 32 -222 -182 62 -26 -253 -143 -45 -235 -232 86
1042 86 115 -104 66 355 74 -183 221 446 50 -72 307 186 -319 -193 158 -133 -347 52 106 -387 -333
1063 -333 159 -16 -337 119 429 -97 -264 289 276 -236 56 582 165 -300 126 300 -280 -275 301 111 -449
1084 -449 -148 147 -353 -506 180 289 -289 -129 378 49 -351 171 522 51 -63 356 170 -363 -126 318
1104C18l10k51L56N8n21l8M49j6k50K07K02l46j74L11J30j59J49K78k03l24J08
1125b6J69j10o5K31M6l16k19Q8P6m7J06K04o6k31j6R3m3O1L35J27l41j65J87l6
1149D2k47K13M52j25m45RJ16k99p9M71J44l55m3J67l03k52M98M32l03j02L59j73
1171A77n46K01N52j48k66L45K0o52j47N21K2l37K80L59n29m15M13K30l13J94N42
1192E03k61n53K27K96l24j0O04J7o16m3L35k87l02M91L39n06k54L26r0l96L09
1213a95N34k19k82K86N3m87Q1O07km28J64K48m53l34M72K81l82o7L21k23m70K27
1235b68L83j76j13L59j1m88N1M43m9j84L28K04m62k49L48O0l00J33L27k50m25
1256c39J25J84k23PL87Ql33NK10j38p3L41J90k26j10J26q5j82J56K36j08j87L9
$$ plain form
1104 318 8 -243 113 171 -350 -388 61 45 -205 2 204 -142 -316 -5 125 -34 115 393 190 -134 -26
1125 -26 143 33 -32 199 245 -71 -290 -202 -126 -173 -67 137 71 -160 -176 -83 -126 -65 270 397 56 -109 78 42
1149 42 -205 8 460 335 -110 -101 15 -284 -363 108 252 -103 -146 21 -282 -534 -36 396 93 -9 350 177
1171 177 -369 -168 384 236 -30 315 335 -317 -464 57 79 -258 22 381 -148 -563 -150 80 -233 -39 503
1192 503 242 -311 -84 212 -112 -122 482 499 -117 -160 175 -112 -414 77 416 -90 -344 -18 -108 -504 -195
1213 -195 339 120 -162 124 177 -310 -229 378 376 -52 112 360 -93 -427 45 326 -56 -123 198 -25 -495 -268
1235 -268 115 -61 -174 185 174 -314 -263 180 131 -53 275 479 17 -232 116 176 -124 9 336 86 -339
1256 -339 -214 -30 -253 -246 141 149 -184 -179 31 -107 -180 161 351 125 15 141 56 -126 30 266 158 -29 10
1279A0m7k21m1K41Q6j02k2O4n8r0Q1J82Q0k3Oj3r3m2O9Q2m4k6K6j20j95K9J50
1306c1k7j02J30P5k03q5K20Q8j05J12J62j22j88J52R6j82L5K34j27k96R5J54k21
1329a36r4K80M1k92K9K35j48j60L04J46k70j9K97p8k79J90K62k35j54K32j7l03
1351a69P1K38j74j86K21Q3k98j3L07n2k19J81J78j99o6K07L0j86J01J71j78j26
1373g8J73L1k12K3J67j06j69J12N8j37qJ52k6r0J01N0r2L7J47l6r5J19N0j52l7
1398a8J26m1j11M2M4j15l3O4l1n2Q1L9j00J3J28k6q1J09J01j00l8J32k6j10O2
1423E9O9j17o4R3l5j42N4R1r9o4J28K7j25O1J33p5n7J53M3j35J8J34o8j23R4N4
1449A07j25m5R4m9j02P8M2j19j1J27pj29Q5J29p3n5J11L3o8K7P1n4n2Q1k3j34
$$ plain form
1279 10 -37 -258 -299 -58 28 -74 -96 -32 -90 -180 -99 83 163 140 146 133 40 -2 67 149 105 79 105 -15 -210 -181 -31
1306 -31 -58 -160 -30 45 -158 -243 -23 65 -40 72 234 112 -76 76 172 -10 25 259 132 -164 -69 85 -136
1329 -136 -230 50 91 -201 -172 63 -85 -245 59 205 -65 -84 213 135 -144 46 308 73 -81 151 134 -169
1351 -169 -98 140 -34 -220 1 84 -214 -227 80 28 -191 -10 168 -31 -97 110 140 -46 55 226 48 -78
1373 -78 95 126 -86 -63 104 -2 -171 -59 -1 -138 -146 6 -20 -110 -9 41 -51 -14 133 97 2 121 171 19 -18
1398 -18 108 67 -44 -2 42 -73 -106 -42 -73 -125 -44 -5 -105 -92 36 10 -71 38 139 39 1 133 107 -3 59
1423 59 128 11 -53 40 5 -137 -83 8 -91 -155 -27 0 -125 -64 69 -6 -63 90 133 -2 16 150 82 -41 53 107
1449 107 -18 -63 31 -18 -120 -42 0 -119 -130 -3 -10 -139 -54 75 2 -53 58 91 23 50 121 67 15 96 73 -61
1475f1K1R0p5r8Q1O0r9l9J17ro1N9N9o1J9P8Jr2O1O7p5n6Q7qj06J5N1n3o2L5L1
1506b3q1J9O9l2k1O7L5k0JO0j5l0M1Ll9j4L7n2l6NK3n3j9M4Kl8J8K3j1mN1Ll7
1539b4N5L1m2JN8ol2MNl7l9J7j0m5JJ6l2nM9Kj5L7M8j9l4M5K6m3QM3jn5jK9m6
1574a1oL0j6n9K7J8n1k5N7K9m6RO4j4j5L7M7k1k3N0oo3k0M7l3m2J5K4m8m6N1Q
1606c2l3J7N3j9l6N2L8l4oP8Mp9jO3j8n8J0N0n3n9K4J3m3QN3j8m7M3M4l2rR0L0
1639I3p8kO0j6n8K1N2n6m4K4j2n0KP1k7n0M1L3n6j1P2K8n3J9N2l1m5N1L3l6oL1
1671E2j2p1nM5k3m4N0J0n3k0N1mk0N0M8l8l2M3J3l8J0O6k4o9K0L4o9k0M9K3o5
1702d3lL8k8m0M6M9m1k2P5jo9J3P8Ln3M5L0n8m3M3J4o2mM9k9n0K3L8l2l2P0K7
$$ plain form
1475 -61 -40 50 -25 -123 -42 18 -81 -120 -3 -12 -73 -14 45 -16 3 81 82 -10 51 118 43 -13 74 66 -40 -25 26 -27 -89 -54 -23
1506 -23 -104 -85 -16 -48 -69 -2 33 13 14 74 59 29 70 73 34 20 57 5 -31 -26 -3 -56 -75 -31 -29 -67 -49 -26 -37 -41 10 13 -24
1539 -24 31 62 20 21 79 73 41 45 50 13 -26 -9 -19 -64 -63 -47 -79 -84 -35 -33 -48 -11 37 18 -16 29 55 12 20 63 62 7 6 35 -11
1574 -11 -17 13 -3 -62 -35 -17 -68 -93 -36 -7 -53 -44 20 6 -9 28 75 54 31 81 75 12 -8 39 6 -36 -21 3 -45 -91 -40 -32
1606 -32 -65 -48 5 -14 -50 2 40 6 0 78 82 3 2 65 47 -11 -1 49 -4 -63 -39 -26 -69 -61 -8 -26 -73 -30 14 -18 -27 63 93
1639 93 15 13 73 57 -1 20 72 16 -28 -4 -16 -66 -64 7 -20 -70 -29 4 -52 -63 9 37 -16 3 55 24 -21 30 63 27 21 52
1671 52 40 -31 -36 9 -14 -58 -8 2 -51 -71 -20 -24 -44 6 54 16 -16 27 40 2 12 78 54 -15 5 39 -30 -50 -1 22 -43
1702 -43 -46 -8 -36 -76 -30 19 -22 -44 31 30 -39 -26 52 55 2 47 77 19 -24 19 33 -29 -33 16 -13 -63 -40 -2 -34 -66 4 31
1734C1p1QP2ql2K3M3k4n4L0L2m5l0M8j2o1NL8j8m2M4L0n3j7O5K8l9J6N5on3K8
1766C1L3n1j6N8qo8oN3m7m9N5L8m8k8M9Kl8J6O1k1k8N2jo2K0O0j3o0M0L4o6m0
1798d8M5J4n0K2K0k9m2M2K6l9J0O8k1m2L4L9l1k8M6J7n5pM1l2l5K9K7m8rK9Ln5
1830e9K6K8Jl2N0Jk1mM6Mk6NJ5k6k2J7Qk5rPRk8LJ2nO%J9Nj8J6K3k0%K2Lqk3J8
1869A8mk0rJ8nk9J8J0j3k2K8K0k8oL7qk0L3J2k6j0L8j4l1K1J6k5k6K4Pl6%L1j2
1903a3rONj3MM5j9j0J2K9k6oK5rj6pK7j7l4K2Jk3RJ6j1mNK4j5rLJ8j1ROOj1OP
1942B2k1OMnj2j3K4k6lJ4KnoK0jkRJ6k5K5%j3jJ4j1j0JoqJPlj2J5oj8K0MnqK3
1983GnpJ0MPkJ2j4k2J9Mj5mqJ0j5kK2j3pJ4J5qnKNOQJ0j7J%klQj2pmnO%rOjj2
$$ plain form
1734 31 -40 -32 40 32 0 23 66 42 -12 18 50 5 -25 23 11 -50 -45 -7 -25 -67 -23 7 -46 -63 2 30 -9 7 62 56 3 31
1766 31 64 13 -3 55 47 -21 -27 26 -21 -70 -15 23 -25 -53 -4 -2 -40 -24 37 16 -12 40 39 -23 -3 57 44 -16 24 58 -8 -48
1798 -48 -3 11 -39 -17 3 -26 -68 -26 0 -39 -29 39 18 -24 10 49 18 -10 36 53 -2 -9 32 0 -35 -6 21 -27 -36 -7 -4 -59
1830 -59 -33 -5 -4 -36 14 15 -6 -10 36 40 14 19 34 8 -14 3 11 -14 -23 -16 -7 -35 -32 -20 -25 -19 -19 0 5 -13 3 26 6 6 28 31 23 0 18
1869 18 14 -6 -15 3 -2 -31 -13 -3 -16 -38 -10 10 -18 -24 13 5 -15 18 30 4 -6 32 18 -13 8 24 -1 -27 -3 4 -32 -32 -1 -13
1903 -13 -22 -16 -11 -24 -20 25 6 -4 8 37 11 5 30 21 5 -2 25 8 -26 -4 -3 -26 -17 -1 -12 -16 -11 13 -2 -11 -8 10 -1 8 14 20 9 15 22
1942 22 1 7 11 6 -6 -19 5 -21 -24 -10 -8 -13 -19 1 0 -2 7 23 -2 23 23 10 9 23 12 2 3 -3 -11 -10 -3 -6 -18 -3 -9 -27 -7 -3 -8 -16 7
1983 7 2 -5 5 9 16 14 26 12 -10 9 13 -2 -6 -14 -4 -19 -21 1 -12 -19 -5 10 2 -3 -1 4 10 18 28 11 12 12 10 7 15 3 -4 -8 -13 -7 -7 -16 -10 -11 -23
2028b3PPlKJ0RPj6L1qj4NJ6k5QqlrnPj3%Q%jNQjPJ0LpJ1j0J0j4Lj0lJ4j5mOnn
2073hkJPj3OQpPjPrK0jmMKmMj6Kj0Rj0LqQrnQjJ0mNQp%J8pPnKjrJ1klj0lQj7K
2124iKRj5NMjlMO%LJ6j2rJ3nKlnojPoJ1qj2MQMqJKKQm%kJ3mlMJqNnmmj0J5rqo
2176b1J0MPLjmQjKJkKPoNKk0KKj2Rj3PNLljNjJJ1k2jJ3RkqPj1Rj3mJ6pKj5kJ4
2224dLj3pJ2NrJJ7Jj2RKOj4J0Ljj5PKk9J0J3%lj0J8qj3J1QMRQj1k1J7Ljj2K0O
2266B2j9j7J1lqNK2k8j4J5J1qJJ6lpPMnpK3%mj7OnoJ7nqoLjkJJ0KkKJ9k1%J8M
2310B3rlJ3j6oOMk0qJ5Jk1jQOj2J2LkmJ8Pj8J2K4j4k0J0Ol2MK2Lk1j1K0mj8J8
2349eJ3k3oK2Jk1K4K4j6j9K8Ll5qL6Ok9LJ6k8k4K2J8j3j0K7j2j8J2J9%j6K8Ok3
$$ plain form
2028 -23 -16 -9 -12 -10 0 9 16 0 31 23 9 14 30 5 13 5 2 -7 -12 -5 -18 -18 -10 -10 -11 -6 2 1 8 18 21 14 25 15 25 11 14 4 1 15 0 -4 2 -3 -8
2073 -8 -10 -9 -2 -15 -9 -1 -8 -1 -2 5 -4 16 15 11 15 17 13 17 1 3 -7 2 -8 -5 -13 -5 -14 -19 -11 -12 -2 -6 -1 7 0 0 18 11 18 13 15 14 5 16 14 11 1 -2 6 -11 -9
2124 -9 -7 2 -13 -8 -4 -5 -8 -4 2 2 5 21 9 0 13 8 10 7 2 -4 -5 2 -4 7 -1 -13 -9 -1 3 -5 -4 -2 0 8 4 4 2 15 11 8 12 13 5 10 5 1 -3 -13 2 -7 -15 -21
2176 -21 -11 -7 0 3 2 -2 6 5 7 8 6 8 15 9 14 16 -4 -2 0 -12 -3 -16 -9 -4 -1 -4 -5 0 -1 0 11 -11 -12 1 10 8 0 7 -4 5 -8 -12 4 -3 -1 -16 -18 -4
2224 -4 -1 -14 -21 -9 -4 -13 -12 5 6 -6 3 5 11 -3 7 10 9 -6 1 3 -26 -16 -3 -3 -6 -16 2 -6 -19 -8 0 4 13 21 10 -11 6 9 8 -4 16 22
2266 22 3 -14 -3 -6 -14 -9 13 -15 -29 -14 -3 -11 -10 6 3 -4 3 7 2 -5 18 18 14 -3 3 -2 -8 9 4 -4 -10 -7 -8 -10 -9 1 3 1 3 22 1 1 19 23
2310 23 14 11 24 8 2 8 12 -8 -16 -1 0 -21 -22 -14 -8 -20 -8 -5 -7 -11 7 14 -4 8 32 18 -2 8 14 -18 -14 8 11 -10 -21 -1 -5 -23 -5
2349 -5 8 -15 -21 1 2 -19 5 29 13 -6 22 25 -10 -18 18 24 -5 -2 14 -14 -38 -16 2 -11 -21 6 -6 -24 -12 7 7 -9 19 25 2
2384BrK2Nj7QOj7j2nJ9rjOpKkMQoJ5LJj1NRj5J1J0nj7JLk5MKOj2RRj7kQJ5qJR
2430FMj2J1J1Mj4J5kj8pJ9j0j7Ollj1J8mnmK8jq%J8nj3K5%ml3L6j1j9LJ8k5j7
2469b4Rjj%K2k4mJ3J0j7J0K7J1k5QOoq%Qj3JMj4j5J4J3k6KJ8o%%J2%LJ4nnqJ1
2510A4KpLpJonJrLMKpJMqJ3J4j1J0MoM%MnQpljlnj0OKj7QjRknJ0nQNNkP%knMn
2563A2Jk3J0qk%kj0J3kkJ0QrJ3KmJ9j0rJ8p%j0jmPKj0rLnJ1j3NJk%J6PpjlJ7q
2608A4%Oj8lJ5j1k0ORj1jMJ1j1jMqJ6%LrOJ9mpMJ5j0nnKj8J4j1nmQJoRNLlQrJ3
2654A5j4J6j7KQlOj2NRj7oNlj8J4j2J0J5LmpJ1KJ0NnMjrJLj6J0j6kllLQroJ1J2
2698Ek4J1RJMlJ6%j4MMo%Kj1k%Nj3k2K5lj8J3J3Lj3K1Pj5J3J1KpjNj5rJJ6l2j0
$$ plain form
2384 2 -7 15 20 3 11 17 0 -12 -17 2 -7 -8 -2 -9 -7 -9 -5 3 -3 12 15 16 5 10 19 4 15 25 20 3 4 7 -18 -14 -12 -6 -18 -9 0 -17 -19 -11 4 -4 -3 6
2430 6 10 -2 9 20 24 10 25 23 5 -2 17 7 -10 -4 -7 -10 -21 -3 -7 -12 -16 12 11 3 3 21 16 3 28 28 24 -9 27 16 -3 0 18 -7 -24
2469 -24 -15 -16 -17 -17 5 -19 -23 -10 0 -17 -7 20 31 6 14 20 14 6 6 14 1 2 6 -8 -23 -9 4 -22 -20 -2 -8 -8 -8 4 4 7 21 16 11 3 14
2510 14 16 9 12 5 6 0 -5 -4 -13 -10 -6 -4 -11 -10 -6 -14 -1 13 2 12 16 10 14 14 18 13 21 14 11 10 7 2 -8 -2 0 -17 -9 -10 -1 -3 -8 2 -3 5 10 15 13 20 20 18 13 17 12
2563 12 13 -10 0 -8 -10 -10 -12 -22 -9 -11 -13 -3 5 -4 9 11 7 26 16 7 25 18 18 8 7 3 10 12 2 -7 -4 -9 2 -11 -6 -5 -7 -7 9 16 9 8 5 22 14
2608 14 14 20 2 -1 14 3 -17 -11 -2 -13 -14 -10 1 -10 -11 -7 -15 1 1 4 -5 1 20 16 9 13 28 18 13 8 10 -8 6 -5 -10 -14 -6 -5 -11 -2 3 6 3 11 2 15
2654 15 1 17 0 2 10 7 13 1 6 15 -2 -8 -3 -6 -24 -10 -22 -12 3 6 2 -5 6 8 18 23 18 22 21 12 13 16 0 10 -6 -8 -11 -14 -11 -3 -12 -18 -7 5
2698 5 -19 -8 1 2 6 3 19 19 5 9 13 7 7 9 -2 -4 -4 1 -12 -34 -9 -12 -30 -17 -4 -1 -14 7 14 -1 12 23 25 18 17 22 7 -2 -1 15 -17 -27
2740b7K2nj7J5Pj1jOJ2j5K1Rqj4K7Pj6lJ2mj5j3J4qj4J7qj4lK1j4jJ8J3j1jLJ4
2778A5j2oK9J8l1%lj8pJ5Pj7qJ3j2j2NK3j1j3K2J6l0PJ7Jj1J5J3j4k3K2Jk5J2
2813bJ0j1n2L2K3j6rK4Kk2OL1lk7K4L0k7k3L6Jl9J2K4j3j6NJ6l3j5K3Qj7jK6N
2848A2k9jM7j4k1K3Lpj3J9qj8ONj1oPLk7K3J6j6k6L0J9j6pJ3K2l4oK9jj3OQk8
2885a1jK5j0k1MK9j4l0LK8k3OL4jk7nK4nj5L1J0l6JK3qk7J1L4l1k5K6Nj8qL2o
2921Dj2J2K1k2j1J5K5k8nL4pl0LK6j4k5K9mk9KK1j0k3J5L9k8k3K6Rk1OK1Nk1P
2956GQqk2K3Lj1j2QJj7J0K5j2%pJ0qqL0lj0kK0k0rJ1Mm%llpLK2j9j5J3%j0oK5
2997GpnJ4Kj2oJ1NnmJ0%l0J0J5pj1J7J1l2K0Mjj2J8Jrk0K6Mj9QK6j7olJ5qj6J9
$$ plain form
2740 -27 -5 -10 -27 -12 -5 -16 -17 -11 1 -14 7 16 8 -6 21 28 12 9 21 17 2 -11 3 -5 -19 -2 -10 -24 -27 -6 -20 -21 -3 10 -1 -2 1 15
2778 15 3 -3 26 44 13 13 10 -8 -15 0 7 -10 -18 -5 -17 -29 -24 -1 -12 -25 -3 13 -17 -10 7 8 -3 12 25 11 -12 10 11 -14 -2
2813 -2 8 -3 -55 -23 0 -16 -25 -1 1 -21 -15 16 13 -14 10 40 13 -10 26 27 -12 0 24 11 -5 0 16 -17 -32 -9 -1 -18 -19 7 12
2848 12 -17 -18 29 15 -6 17 20 13 0 19 11 -7 -1 4 -7 -13 -6 -3 -30 -7 9 -7 -33 -3 16 0 -7 6 28 -6 -12 17 16 3 9 17 -11
2885 -11 -12 13 3 -18 -14 15 1 -29 -26 2 -21 -15 19 18 -9 -14 10 5 -10 21 31 -5 -4 19 11 -16 -5 29 -2 -27 -1 4 -14 -22 10 4
2921 4 -8 4 25 3 -8 7 32 4 -1 33 26 -4 -1 25 11 -14 15 11 -18 -16 5 -5 -28 -13 26 -2 -25 1 10 -11 -5 16 21 0 7
2956 7 15 7 -15 8 11 0 -12 -4 -3 -20 -10 15 3 3 -4 6 -2 -10 20 17 7 5 25 5 -4 7 11 7 7 4 1 -6 -3 19 0 -15 -2 -2 -12 -18 7
2997 7 0 -5 9 11 -1 -7 4 9 4 0 10 10 -20 -10 5 -2 -13 4 15 -17 3 7 6 -6 12 13 4 -16 10 14 -5 3 29 12 6 3 18 10 -6 13
3037A3%k6NJ1mj4QJ3k0QRQj2%J8nmLLj0JJJj5PRorJ0lqJ1J2jj2J3pOrJ2L%j2J4
3081B2oj1OJ3k1Pnr%pRQqkJ1j4OJLj0RJ3j3mQPj0oRkKPkljj0KlmONKjK%kRLjJ
3131A6Lkrj1nJ1NqpONj1jJ0lOjpjRljJ1nPj0PQj4Nlj1LLmk%J1Oj9LJ7mj0MjmK
3179APQlrKOm%mmj4J0J3j2NkmkJ1lj9J5J5j2j1J6J0qj1J7mKLnjlkKk6K1K0k2J
3222@pRmJ0Lj2J1j7J4mL%oNqJ6j5jOLnj2RmmRrJ2koQPNmNkLl%Mj1J1nojQmpkQ
3272Hkj1J6mrMJ2Jk0J4J3j8nK1Kk8J0PprJ5qlj0K3j8mJ0J3rkROj3KJ4jj2MOnr
3314CK2k1j8J4J2lk1J5J5j0o%kOkJ0Mj4J9jk3KJ0rNj4K0j1j9J1J6j5oJ2mkMJ2
3352A1ooK0mJj1J8nj5J7j1J0j6mMj3pK3nj9J6Qj4lK2Mj7PJ4jk1KK3j5j5J9J6l3
$$ plain form
3037 13 13 -13 -8 3 -1 -15 -7 6 -14 -6 3 11 -1 -1 17 12 8 11 14 4 5 6 7 -8 -1 8 2 -7 3 0 -8 3 15 14 2 15 8 14 5 17 20 20 8 22
3081 22 16 5 11 24 3 10 5 -4 -4 -11 -2 6 -2 -4 7 -7 -1 0 3 -7 2 15 2 -2 6 13 3 -3 6 4 6 13 11 8 7 -3 -1 -4 -8 -2 3 5 4 6 6 4 13 16 15 16
3131 16 19 17 8 -3 -8 3 8 0 -7 -1 4 -7 -8 2 -1 5 4 -3 -4 5 2 1 12 7 14 4 11 19 5 10 7 -4 -1 2 -2 -4 -4 7 13 -6 -3 14 10 0 4 3 -1 1
3179 1 8 16 13 4 6 12 8 8 4 0 -14 -4 9 -3 2 0 -4 -6 5 2 -17 -2 13 1 -10 6 16 8 -3 14 10 12 15 10 9 6 4 6 -20 1 21 -1 0
3222 0 -7 2 -2 8 11 -1 10 -7 7 3 6 6 0 5 -3 13 -2 -3 3 6 1 -11 -2 -6 -10 -1 -10 2 0 -6 2 9 14 10 15 13 16 13 13 17 6 17 12 6 5 13 9 2 0 8
3272 8 6 -5 11 7 -2 2 14 15 -5 9 22 4 -1 20 22 -6 4 11 4 -5 10 2 -1 -11 12 -6 -10 0 13 4 2 11 17 4 6 20 19 7 11 17 12 3
3314 3 25 4 -14 0 12 9 -12 3 18 8 2 2 0 6 4 14 18 4 23 22 -1 1 11 2 7 -7 13 2 -17 -6 10 -5 -11 1 -3 -5 -1 11
3352 11 5 -1 19 15 16 5 23 18 3 20 9 19 3 -1 3 -10 -17 6 1 -18 -2 6 -8 -11 11 15 -2 5 19 18 -3 -1 22 7 -8 11 27 -6
3390fM%Lk4K4J3j9oK1Qk7PL0jj3JPqj9K4Jj7MJ4ml6MK7rk8K4Rk4QK0mj6PK8mj7
3431FRQj7lJ5pk7J1QllMknqJ7J0k1K1QMj7PMqlK0Nm0J6Pj3j6K6Ok5j0PnK%J1K
3474AKR%j3MK0Qk3J7%j0k9L7mk8J6rj1j7L1RqJJ5nj2MJ2Oj7J8J8k5NKj9JLJ9j6
3514A2k4jK0rj9J6K6l9QJ1J3j8J0J2kj1K0kk0KK2oj7rJ6rj7PJ3j6KJ7jj2J4Q%
3551A7JmJ0j7RROj1Lj0nj2jMqmJ5qpONJ0j8J4PnJJ5j6J0JpPk1J5Lrrjoj0J7qn
3595a7J5J8qKpJ9mMLlKjQj2ojNj5j4J7oj6PRMplJ1%LrK8k0QQJj2Mkj0J0lpno%
3641hjmK3j6J4j0PPOnmJ0j3J3Oj3PlrpLJ6k6rPNK%lOKoJ1J4pnPKrLkMj5jj1KJ2
3688BlmlqK3j8J2LNj1K2jjpLnJ0rj0J2j8Ro%Kkkj2J1jJkQLk%PMn%MokNjkKjpk
$$ plain form
3390 -6 -2 -2 1 -23 1 14 -5 -11 10 18 -9 -2 28 27 14 15 22 14 -5 19 20 3 7 21 17 -19 -15 12 3 -25 -1 8 -16 -8 12 8 -8 -1 27 23 6
3431 6 15 23 6 3 18 11 -16 -5 3 0 -3 1 -1 -6 -14 3 13 -8 13 21 25 8 15 19 11 8 28 33 -7 9 16 3 -13 13 19 -6 -16 -9 -14 -12 -12 -1 1
3474 1 3 12 12 -1 3 23 31 8 25 25 15 -14 23 19 -9 7 -2 -13 -30 1 10 2 3 18 13 1 5 17 23 6 24 42 17 22 24 5 6 9 28 12
3514 12 -12 -13 7 -2 -21 -5 21 -18 -10 1 14 -4 6 18 16 5 25 23 3 5 27 21 4 -5 11 2 -15 -8 5 -11 -9 8 7 -5 9 17 17
3551 17 18 14 24 7 16 25 31 20 23 13 8 -4 -5 -1 -9 -13 2 -6 -13 -7 -2 8 -10 4 11 6 7 22 6 16 17 10 17 -4 11 14 5 -4 -5 -11 -21 -4 -12 -17
3595 -17 -2 16 8 10 3 22 18 22 25 22 24 23 31 19 13 12 17 2 -12 5 -1 -17 -10 -1 3 -4 -7 4 4 7 -2 26 6 14 22 23 11 15 13 3 13 10 3 -2 -8 -8
3641 -8 -9 -13 10 -6 8 -2 5 12 18 13 9 19 6 19 25 12 19 16 7 0 3 19 -7 -16 -9 -4 -2 -2 -5 1 3 -3 8 22 15 10 17 19 10 13 11 15 0 -1 -12 -10 2
3688 2 -1 -5 -8 -16 7 -11 1 4 9 -2 20 19 18 11 14 9 19 10 0 12 -6 3 -3 -3 -1 -3 -5 -17 -6 -7 -6 -8 0 3 1 1 8 12 7 7 11 5 3 8 7 5 7 6 -1 -3
3738cmMRk1K3Pj0OkPjMNlrQmqqJ7j0oJ%ooM%lJ1LlkLJ3j5J2nKKjkNj6jNNKnkl
3789aj0%QlJ0qQqKJ0NLnNnPj6J%Rj2Lj4oJ1qRoJ7rN%NLJlJ1qkMllQrkqJ6j0Jj1
3839hoJJ7rNJ8rQJo%OqJ7q%j7J0mjoomoPOmjkJ1rJ0OPj4J1Oj3J0Pj5%JkpKmJ4
3887A2k4J2OmKJRqj2J3K1k0J4mOj0rRlnoJ5k4jORj0MPrJKnJ5mNJrJ0JkQj2Okj8
3933fJ4Lj0j1K0j3NKpj1J7J0omNJ0plJ4Kj6qOrKPKqJLLnoK0j8lmRj1OPLmKK0k1
3979B%PJ1mJkQj6lKlKmJ6rj0J1Qj1nK0Lj5j1J6j4j4K4%j7mJ0nJ2j7K4Mk2Pjnk
4021fJ8poM%Mj3J6Oj2LJ0j3oJ0J0p%j2J7j2j0J4nLpNj2LKLoJ0lKnLPomPNj2Pl
4066B%NokKmJ2%mLRj3rR%KnMPj1MJ0j3j1PJ9poMnKj0MMk1K4Jj4jJ3ljJ0mkj7J8
$$ plain form
3738 -3 -7 -3 6 -15 8 15 5 11 9 16 15 19 24 21 12 20 16 8 0 17 7 1 2 2 -4 -10 -6 -6 -9 2 5 2 0 3 16 1 13 8 10 12 11 9 14 -2 -3 2 7 9 4 2 -1
3789 -1 -11 -11 -3 -6 4 -4 4 -4 -2 8 13 16 11 16 11 18 2 3 3 12 0 3 -11 -17 -6 -14 -5 -11 6 -3 2 2 7 10 11 8 19 11 9 13 10 7 15 6 4 -4 12 2 3 -8
3839 -8 -14 -13 4 -5 0 18 9 17 18 12 12 18 10 27 19 19 2 12 8 7 1 -5 -9 -15 -8 -2 -6 -7 -9 2 -7 3 9 16 2 13 19 6 16 23 8 8 9 7 0 2 -2 12
3887 12 -12 0 6 2 4 5 14 6 -6 7 28 8 22 18 24 14 5 14 11 6 0 15 -9 -10 -4 5 -5 -1 6 -3 -2 0 -5 10 6 11 12 3 13 14 12 20 8 14 12 -6
3933 -6 8 11 1 -10 10 -3 2 4 -3 -14 3 13 7 3 8 18 11 8 22 24 8 0 6 -3 -1 6 8 0 1 4 7 2 -4 16 -2 -5 -9 0 -11 -5 2 5 1 3 23 2
3979 2 2 9 20 16 17 15 23 7 4 6 3 5 1 17 8 -2 9 17 6 1 21 24 9 -2 14 0 -14 10 10 -7 -11 -1 -6 6 -11 13 17 -5 2 1 -4 -6
4021 -6 12 5 -1 3 3 7 -6 10 16 4 7 17 4 -2 8 18 11 11 -1 16 4 -6 8 3 6 -1 4 -8 -5 -3 0 -6 4 1 3 -2 1 8 2 -2 5 10 -2 5 2
4066 2 2 7 1 -1 1 -3 9 9 5 8 17 4 -5 4 4 6 1 5 12 1 5 15 2 -9 -2 17 10 4 8 3 5 -5 -1 3 -18 6 7 -7 -8 5 2 1 11 7 5 -12 6
4113FJpnJ4%j4OjNqJ2Olj4NRj0MRj3mNJ7j5JMNj7KJ0j4JJOj1lMPnLPmmNpJ2k2
4160a4J8jnQkppjJ8jLLlnKQmpOMj0Rj0jPKkj3lNK1j8MrMLj0N%nK7j3jKjlkOJ2
4209A9rpKoLjKOrJ0Pk7QjJ0MKKqj%K0j5OqKmlPj3lK%mKKjNjJ0j0J0jpJ2Kj7J0
4257Ij0J1kmKpJ2LqjjJ0j1QpjOLoOJlkjJ1j2kpK1j2j4J0KpRLqoR%Pjj2J4rKJ8
4304B3jj0%jlj0K1j7kRKj4JJ3j0NjkLmPmm%J0JKKrJ1qljkpQj9QnkJ8KJj5J4mn
4351bJ9j1JPj3J2rJ0np%J0j5P%kjL%Kj1Qj1J4mPLmQmMpnQnj1J8j2joO%Pj4mOO
4398BNpJ4oJjOj7PJ2nJj3J0oQj4NRj1Qj5J2NqJ1Kjj2J2LpnJMj1MNj1jk%lJ2j6
4443a3MJ0QnnpQMKjjLNMmkrQpJOmPnoLj2PPOKrJ3q%JJpQn%rNjkkjnQjlJ4rlJ6
$$ plain form
4113 6 7 0 -5 9 9 -5 1 0 5 -3 9 15 12 -2 3 12 2 6 15 2 -2 3 20 5 6 10 15 -2 0 10 -4 -3 -2 4 -7 -10 -6 1 -4 -1 6 2 -2 3 -4 8 -14
4160 -14 4 3 -2 6 4 -3 -10 -11 7 6 9 12 9 4 6 14 10 3 9 13 3 12 2 1 8 10 8 -5 -8 -3 18 0 4 -5 -1 2 -8 -3 -3 -8 19 6 5 7 6 3 1 7 19
4209 19 10 3 5 -1 2 1 3 9 0 10 17 -10 -2 -3 7 11 13 15 7 6 6 26 11 17 9 11 7 4 11 -2 -5 -3 -3 -7 -5 -3 -4 1 0 10 0 10 9 2 14 16 -1 9
4257 9 -1 10 8 4 6 -1 11 14 6 5 4 14 3 11 4 3 9 12 6 12 13 10 8 7 18 6 4 -3 18 6 -8 2 4 -3 6 9 1 -5 4 4 11 10 -2 12 3 5 23
4304 23 22 12 12 11 8 -2 19 2 0 9 11 -3 -2 11 1 6 5 3 6 2 9 5 1 1 11 12 14 16 7 18 10 7 6 4 -3 5 -14 -6 -11 -13 5 7 8 -7 7 3 -2
4351 -2 17 6 7 14 1 13 4 14 9 2 2 12 -3 4 4 2 1 4 4 6 -5 3 -8 6 2 9 12 8 16 12 16 9 4 12 7 -4 14 2 1 -5 1 1 8 -6 -10 -4 2
4398 2 7 0 14 8 9 8 14 -3 4 16 11 12 -1 9 3 11 -3 2 11 0 8 -7 5 10 2 13 15 14 2 14 17 10 5 6 10 -1 3 8 -3 -4 -6 -6 -9 3 -13
4443 -13 -9 1 9 4 -1 -8 0 4 6 5 4 7 12 16 12 10 1 9 2 3 9 5 12 7 1 4 -8 -1 6 12 14 5 18 10 10 11 12 5 13 8 8 -1 4 3 1 -1 -2 -7 1 0 -3 11 2 -1 15
4498A5loNnj2J3rJ8k3J1%Qj6QOj2kNJ6qknNlKN%oRnnjMj0mQnnnJ1%kpPJjK1j5
4546AJ5j0%%mQjkJJlJJ1mj7MmMlnPJ0j6Q%jjJ3jmj3RLooRpjmJ4jkj4J2n%J0Kp
4595AkJ0pLqJ3lLOKmnjLj3J3pMrLKj7J4RkoMJOj7J1Kj7QJ5j2JLqLjMnPpNj7J2
4643@RNmlj2J3kj1J9OomOj0loJJ2nKj8J1oMLjLJrj0K7j3kMJj0J3jnlPOonPpj3
4690a5J6kLpKJPkJ3Mj6J1mLkkkMlLkrlO%QljLnKKj0NlMknJ1nrJ0%lRlLj7LJ0j
4741GmKLoORlj4J1nOqNRj5MkJ1j1kJ0pj6J1J4j0mJJkMj0PokKO%JpmJ0Ll%Rlql
4790cQnJ0NpQmj1QN%j6J1jj3NJJ7rlkj0J1%KJop%J6k3QJ2j7N%J0%j0PLoqOOnM
4837CmJ4k1OKJ0klKnQj1OrJ0jkJlJ0qMPj0MKMj6J3jnj1KJ1j3J7j5J5j2NjqLLl
$$ plain form
4498 15 12 6 11 6 -6 7 -2 16 -7 4 4 12 -4 4 10 -2 -4 1 17 9 7 2 7 4 6 11 11 5 14 9 4 3 7 -3 -7 1 -4 -9 -14 -3 -3 -5 -12 -5 -4 -5 16 1
4546 1 16 6 6 6 2 10 9 7 8 9 6 7 18 14 -3 1 -3 1 -2 -7 0 10 -6 2 2 1 0 13 12 8 -5 4 7 1 -5 4 -3 -4 -8 6 5 3 -11 1 -4 -4 6 8 1
4595 1 -1 9 2 5 -3 10 7 10 16 18 14 9 8 11 -2 11 4 8 -1 2 4 -13 1 10 8 2 6 7 13 -4 7 9 -8 0 15 3 4 7 -1 2 1 5 0 7 0 5 -12 0
4643 0 9 14 10 7 -5 8 6 -5 14 20 14 10 16 6 3 -3 -2 10 5 7 -11 0 -6 -2 1 0 3 4 -5 -15 12 -1 -3 1 2 -8 5 4 -1 -4 3 9 3 -2 5 -2 -15
4690 -15 1 -1 2 -5 -3 -2 5 3 16 20 4 15 11 14 12 10 8 12 9 12 10 1 -2 4 4 12 9 8 11 6 8 10 0 5 2 6 4 -1 10 5 -4 6 6 3 12 9 12 -5 -2 8 7
4741 7 3 5 8 2 8 17 14 0 11 6 12 4 9 18 3 7 5 16 5 3 13 6 -10 1 15 5 1 2 3 1 5 -5 2 -4 -6 -4 2 2 3 -4 -8 2 5 2 2 11 8 0 -3
4790 -3 5 0 10 15 8 16 12 1 9 14 14 -2 9 8 -5 0 1 18 9 6 4 -6 5 5 7 8 2 -5 -5 11 -12 -4 8 -9 -4 -4 6 6 -4 3 6 0 -8 -2 4 -1 3
4837 3 -1 13 -8 -2 0 10 8 5 7 2 10 -1 5 -4 6 5 3 4 1 11 3 7 14 4 8 10 14 -2 11 10 5 -6 -4 7 -6 11 -4 11 -1 4 3 -5 -2 1 -2
4882bmJ5kj0OJpMJ1j6J4Jj0oNMNpKpP%mKQrJ1pOjjnj2RrJKLOpQMo%MkjJpMmKK
4935Blk%NljPJMJkpNrpJ8pkNrQQmpoLKl%j0KPJNpMkN%lQj5RmOmLPpOj5J3Rj0l
4990BKrK5j5j1J6qMkkJ7j7Pp%NKrnMp%pK2njn%qJ4jj1PoJ4lj0kJ0kPjKJ0j1j3
5036hJ2kK%o%%QmMj1J4k2J0QllJ1%Mj3J2j6%NNjj3JmJ1qJ2mj3J2lKNj2KJ3j1P
5080COj1jLJ6lj3QKkj0%nMKOj%J0j0kkmJ1nMnjMj1J3pnMklJ0%j0%Rj2%J8Oj6L
5127AKrJQLJPlonJ1mj0LJ7j8oJ1Jn%J1Pj8J5j0j2mJ2KOj1JK0j1nmJ9j8J0j8OO
5170DlJ2mrJ5qKj1QjkOK1k1%%lnj0PJ5j0kJ6j2oPOoMnroJ0J1j0mLRj2MkJ1j4l
5215gJ9lqQlMj0jPJLlNLj0NloLM%pK1j7lMLpJoJ1j3J1%LJqj0MJqJ5j7J9rpK1j7
$$ plain form
4882 -2 -6 9 7 -3 3 4 -3 1 12 -4 10 11 1 -5 0 4 9 2 4 -3 4 4 0 2 10 1 12 5 11 10 9 4 -8 1 -8 -7 -5 -2 4 -3 5 9 3 3 7 5 4 5 -2 2 -2 0 2
4935 2 -1 -3 -3 2 -1 -2 5 6 10 11 9 2 7 -2 -9 9 2 0 5 -4 4 12 8 1 -5 -2 0 -3 -3 -13 -11 -4 -3 2 -5 -1 -3 2 2 -1 7 -8 1 -3 3 -1 2 9 2 8 -7 6 15 5 2
4990 2 4 -5 20 5 -6 10 2 6 4 2 19 2 9 2 2 7 9 0 -5 -1 -8 -8 -15 7 2 1 -4 -4 -12 2 1 -10 -3 -9 5 2 -8 -10 0 -2 5 4 6 16 5 -8
5036 -8 4 2 4 4 -2 -2 -2 6 2 6 -5 9 -13 -3 5 2 -1 10 10 14 1 13 -3 -3 2 7 6 -7 -6 -10 1 -7 5 1 -12 0 -3 -1 4 -8 -6 7 -4 3
5080 3 9 -2 -3 0 16 13 0 8 10 8 -2 -2 -7 -3 -1 5 4 4 14 4 2 0 -4 7 2 6 1 0 4 -7 6 -1 -6 -2 -4 -7 3 3 -7 -7 2 -10 -10 8 14 -2 1
5127 1 3 -6 -5 3 6 7 14 11 5 0 11 7 -3 0 17 -1 -7 4 5 0 0 11 18 0 15 5 -7 -11 1 3 9 -2 -1 19 8 3 -1 18 0 10 -8 -2 4
5170 4 1 13 9 0 15 7 9 -2 6 5 3 9 30 9 9 9 6 1 -9 -2 13 3 1 17 5 -1 6 12 6 10 5 -4 -10 0 11 1 -3 0 9 -3 1 -1 10 -4 -7
5215 -7 12 9 1 9 6 10 0 -1 6 7 10 7 12 15 5 10 7 1 4 8 8 1 22 5 2 6 9 2 3 -3 8 -5 6 6 9 10 2 -8 -4 -3 -11 4 -13 6 -3 -10 11 -6
5263fmJ3lk%OKpLRmolJ3l%OmMj8OJ1omPj2QQqJJj1%RJmj0J8j5mKoRkMj%J0j6j
5313iPPoMKMrjJ2q%MmQj5J2j1QoJlNmJ2j3KJ7rpOlMllJ2j4LOqoNNqpJ0Ok4NKJ6
5363DrM%J3j5MPj2J3loJ3p%nOjjRj5NqJnRj%P%kOj6lJ7qJ1j8J2j5J3pj0J5j0N
5408cLjlpJ4Jj4Rj3J7lPn%RnMoOnkKkoPkQjkj7K0%j4jJJ3j1OlqJ7rnN%kOpKJ3
5458A3j6%%j1PJ7j3NJKO%nmOJMj3MMplJ0j1mJ4jOomLmJMl%klnJQrOQk0J8nOrJ
5508b%kJ2qNnJ5qKqNkPj1J5j4jMKmj1J1QKj4J6kj7OLlKqP%qjJ2j1QoKjjpJKQK
5557B%RkpOJ0j4mm%PklQJm%JkMPMj9Rj0J3j0%nOJ0j0MPk5RQj2J8j2nPJokj0K5
5604Hj9%OJOKjlLRJ2k3J3llKqJ0Jnj0pQjjRj0KkJ1oPpJlMknQpKkQ%j0qJ0KkJL
$$ plain form
5263 -6 -10 3 0 -2 -2 4 6 -1 2 11 7 1 -2 11 8 8 14 10 14 -4 2 13 7 3 10 -2 6 14 6 7 8 -3 -3 6 7 3 -7 11 -4 -8 -6 -12 -3 -5 -1 -2 -2 8 -8 -9
5313 -9 -2 5 -1 3 5 9 0 -1 11 3 3 7 3 11 -4 8 -3 5 -1 0 -3 2 -2 10 -3 -1 16 7 0 6 3 7 4 1 13 -1 2 8 0 -6 -1 4 -4 -11 -1 5 -19 -14 -12 4
5363 4 -5 -1 -1 12 -3 1 8 -4 9 6 0 13 6 6 1 7 6 5 14 -1 4 -4 -3 -8 1 0 0 7 7 5 11 -5 -8 9 1 12 -6 6 -9 4 -3 -13 2 -8 -3
5408 -3 0 -1 -4 -11 3 4 -10 -1 -14 3 0 7 2 2 11 6 10 4 10 5 3 5 3 -3 4 2 10 9 7 -10 10 10 -4 -5 -4 9 -2 4 1 -7 10 1 -4 1 1 -1 5 -2 0 13
5458 13 -3 -3 -3 -14 -7 10 -3 2 3 5 11 11 6 2 8 9 13 0 4 8 1 -2 8 -3 -7 7 6 12 6 2 5 1 2 6 3 3 1 -2 -7 -6 2 -7 -1 7 -13 5 0 6 -3 -2
5508 -2 -2 -4 8 0 5 0 15 7 9 1 6 4 11 0 15 1 0 4 6 2 -9 2 10 12 -2 14 12 -5 1 4 1 3 -5 2 2 -6 -7 5 -6 2 -4 -2 -3 -4 -11 -10 -8 0 2
5557 2 2 11 9 2 8 18 4 0 -4 -4 3 1 -2 6 7 3 3 4 2 6 13 17 -2 7 -3 10 0 0 -5 1 11 1 5 12 -13 -4 4 -8 10 -2 -7 0 1 -5 -7 -17 8
5604 8 -11 -11 -5 -4 2 4 3 0 3 12 24 1 14 11 8 10 2 12 13 8 -2 -9 -1 -2 -3 6 -4 -2 -4 7 1 8 1 2 -1 3 1 -4 4 -3 -1 -3 5 5 -5 -13 -3 -1 -3 -2 1
5655ApJ1nnNMRlQnj2J3j8QLmnQJrMnkJ0LqnJ3j1Pj2PRLj3nQLJmJJ1j1pRj6J3Q
5703IqjoJ3ojJ4j1%NPj2K%Rnj0J1Lmq%NqRRj7kJ0Jjj6ONKj3J5lmLJjKJ0k3%PJ0
5751Hj0jPJnnJ2jonJ3j4ONMqNQj2KL%Lj6OJlMnmPKoJqJ8kj1%J2j0kLJLojJ6j3
5800cOJ2omPj3OLjLoMNnnlQj5J2J1j6qOJ7k7J1lOqlOOj2KPoJJKknNMmJQpKoJO
5851AKLj2QkLjMJ0j8kJ7j3QMj3J1j3J9rnqJ0oKOnkOj0J0PmqjJ4qkmL%%Mmj8PJ0
5898AqjNJJMMrOJ6j6lPnjJ4rknLmMJJoqjK%%mJ4%KRrK%mJ8j1j0KKn%ml%lJ2pJ3
5951FnjJ%J4pjlQrMLj1Rjj0NlNqQlj6JJ6mmNj3J5oM%J4rKlKj0JJ8lrJ2j3j%j1
5999a1K2j4jOlNNlMj7J9rj0J5Pj2PrMnKj0OMjoj1J4NnmQOj8QPJj3J4kklJNLLj
$$ plain form
5655 1 -6 5 0 -5 0 4 13 10 18 13 1 14 -4 4 7 3 -2 6 7 -2 2 -3 -5 5 8 0 -5 8 -3 4 -8 -1 8 11 -2 -7 1 4 5 1 2 13 2 -5 4 -12 1 9
5703 9 1 0 -6 7 1 0 14 3 3 8 15 3 5 5 14 9 -1 10 13 9 1 1 6 -2 7 16 -1 -3 7 8 7 -9 -3 2 4 -9 6 3 -1 2 3 2 4 14 -9 -9 -2 8
5751 8 -2 -3 4 5 0 -5 7 6 0 -5 8 -6 0 5 9 1 6 14 2 4 7 7 10 -6 0 1 -2 2 -3 -7 0 2 -4 -3 -11 7 5 -6 -6 6 -4 -6 -3 -2 1 -5 -6 10 -3
5800 -3 3 15 9 5 12 -1 5 8 7 10 4 8 13 8 3 0 8 -7 5 16 0 -8 -2 15 -12 -1 -4 2 -6 -9 -3 3 -9 -7 0 -6 -5 -4 -2 -4 -9 -4 0 -4 -3 5 -2 0 -6 -5 1
5851 1 3 6 -6 2 0 3 2 6 16 -2 -4 13 0 8 12 -1 10 -3 16 7 2 -6 4 -2 0 6 1 -1 5 -5 5 12 8 0 -1 13 5 3 -1 2 2 2 6 2 -16 -9 1
5898 1 -7 -8 -3 -2 -1 3 7 -2 4 20 4 1 8 3 2 16 7 5 0 3 -1 3 4 5 -1 -9 -10 -8 -8 -8 -12 2 2 4 13 4 6 6 2 20 9 -1 1 3 -2 -2 -6 -9 -9 -12 0 -7 6
5951 6 1 0 1 1 15 8 7 4 12 3 7 10 -1 8 7 -3 2 -1 4 -4 4 1 -15 -14 2 -2 -6 -1 -14 1 -5 -1 -1 13 4 6 3 5 -5 -4 14 11 2 14 1 0 0 -11
5999 -11 11 -3 -4 2 -1 4 9 6 10 -7 12 3 -7 8 15 3 10 1 5 0 2 -8 -2 2 1 -5 -16 -2 3 -2 -6 2 8 -10 -2 5 6 -7 7 5 3 0 1 6 9 12 11
6046A1%jj2P%J2j3l%%J2oj1K3mjmlQj0KJ0j1kkkoKQjKj4J3j3LJ3j9J2MqJ2rjN
6090CJ0pkKkLoJ0opJPN%j2%NpJ0Mm%oJJ5oj3KMnk0K2nNqMJ6j2%%oJ3Lj4Rkj2R
6138A%JJ3l%NrnLmKpkQJlOMJoM%pJ1%lqjJqQNj7RoPmOoLJ0qpJPJMkMkM%kj2J6
6193A4qmPjMqlnQ%jRj3NNJLj0nmJ5Kj4kKmNMqk%kJ7KlJlLPj5LMmRJ0k3kJ3KrJ
6244CmrMNJ1j2PnJ4oqP%JjPj2j1J2rR%lLKMppJLj1J2jNlRNj0QnQj2K0j8J3k8J3
6291DKPj0jQj2J0qLQoj1J1J2mqM%rjNQqpmJ3ojMJJj6LJJ0j1%J0LJlkkJ1j1Po%
6339@lQNj8J2kp%%J7rkLNj2klJ7ojJo%JnPoJ3j4J0mqK1k3KJ4j6%LJ6qJ1oOMon
6386DpK0k3J9j0MnMpjkKLLKMljjj0lPmJQj0lJ2kkLKonJ0j4LJ4oo%LlJ9j2OpjP
$$ plain form
6046 11 11 10 -2 5 5 17 4 1 1 1 13 7 -4 19 15 14 10 7 15 5 7 17 6 4 2 0 -6 -4 4 3 5 -9 4 -9 -6 7 -12 0 4 -4 8 -1 -2 3
6090 3 13 6 4 6 4 7 1 11 5 -2 -1 6 11 11 -1 -1 4 -3 7 11 7 7 1 2 17 11 -2 0 4 -1 -21 1 -4 1 -7 -3 13 1 1 1 -5 8 11 -3 6 4 -8 1
6138 1 1 2 15 12 12 17 8 3 6 2 4 -3 -5 3 4 1 7 11 12 6 10 10 3 14 14 11 3 2 3 -5 3 8 -9 0 -6 1 -3 3 -3 0 10 2 -5 -4 3 4 8 6 10 8 12 12 10 -2 14
6193 14 6 2 9 8 12 4 1 -4 4 4 3 12 -1 4 9 10 13 3 -2 -6 9 11 -3 -5 -3 -7 -2 2 -6 -8 -8 -10 7 9 6 7 4 7 14 -1 2 6 2 11 21 -2 -4 9 11 2 3
6244 3 -1 -10 -6 -1 10 -2 5 0 14 8 0 7 7 8 7 14 2 -9 3 -6 3 3 0 3 5 9 2 -5 -4 -1 -12 0 -1 4 1 10 15 5 13 8 16 4 24 6 19 -9 4
6291 4 6 13 3 2 10 -2 8 0 3 11 5 -6 5 17 13 5 9 9 0 -1 4 12 4 -3 -7 6 0 -1 3 4 5 -11 -8 -7 3 -8 -8 2 5 6 3 1 -1 10 -1 6 0 0
6339 0 -3 5 10 -8 4 2 -5 -5 -5 12 3 1 4 9 -3 -5 -8 9 3 2 3 -3 -3 -2 -7 0 -6 7 -7 3 -1 -9 12 -11 -9 5 -11 -11 -8 8 0 11 5 11 15 9 4
6386 4 -3 17 -6 13 3 7 2 6 -1 -2 -4 -2 1 4 6 10 7 6 5 -5 -8 -1 -5 -4 4 -6 -9 3 1 -1 2 4 -2 -7 3 -11 -8 6 0 -6 -6 -3 -6 13 1 7 0 -1 6
6435F%JmOj7J2KL%j2J3ok%j%joLkJ2j8J%MlQNj3J9j5J0j3O%qjJ2Lj0%KOOJlLj0
6483arQPlPj8J4lqkmJ9q%NKomoNRoLJ1j7lJ0OnKo%jJRj7NJRomLMoPKlRk0J3lK
6535Dj%nmmOQpOlLrLoLLj1LOnPKMrPlqLJ4jk1NKRj2J5j1j1K0nJOmJk%OJj1J5p
6586CpJJ0k1J3J%kmlJ0LOrLoLJMomjJ0kQqj1Nj3RjmOML%rMnKlJ6jjLrjKnRPnr
6639dOkoKpRoqJ1j0RlJJ0lqJ4kNrNj4J0mKlJ0j9J3jmJ3roJ6j4J0Nj1oK0Mj3jm
6684bjlRj1J0j0jLRj5MlPnLnPmNNp%NJJ0lJpMj2P%j4J0L%Nj1K3j5jKNrJ2j2J1
6731A0j1OJ1k4K0j2Rmj5J5kjpJQj1rRnPoPj0J7j1nQLRj4PqRpJ3nnN%pJ9j1qQj1
6776hPkJQ%OpNj0oOlJQrQKj2j0J0kJm%JjkQJlLLopJ2pK%LMMnPMrj1J0J3n%j1O
$$ plain form
6435 6 6 7 3 9 -8 4 6 9 9 -3 10 4 2 2 1 1 0 -6 -3 -5 7 -11 -10 -10 -6 -9 -1 4 -9 10 -5 5 -8 -2 -2 -10 -11 1 4 -6 -6 -4 2 8 9 6 9 -1
6483 -1 -10 -2 5 2 9 -9 5 2 -6 -8 -12 7 -1 -1 4 6 0 -4 -10 -5 4 -2 1 12 -5 -8 2 8 3 5 -1 -1 -2 -1 8 -9 -4 -3 6 0 -4 -1 3 -3 4 6 3 12 -8 5 2 4
6535 4 3 3 -2 -6 -10 -4 4 -3 3 0 3 -6 -3 -9 -6 -3 -14 -11 -5 -10 -3 -1 3 -6 1 -2 -10 -7 7 6 -15 -10 -8 1 -11 4 -7 -18 2 -3 -2 4 0 1 -1 -1 5 6 -5 10 3
6586 3 -4 -3 7 -14 -1 0 0 -2 -6 -9 1 4 10 1 4 -2 1 2 6 0 -4 -5 5 3 11 3 -8 -3 -16 -7 -8 -12 -6 -2 1 1 -8 -4 -9 -7 -10 6 5 4 7 -2 -3 -1 -6 3 10 5 -4
6639 -4 2 0 -6 -4 -11 -2 -8 -16 -5 -15 -6 -9 -8 2 -1 -9 5 3 8 -1 4 -10 0 -4 -2 -5 5 -14 -1 -2 -6 7 -2 -8 8 -6 4 9 -2 -8 12 16 3 2 -2
6684 -2 -3 -6 3 -8 2 -8 -9 -6 3 -12 -8 -11 -4 -9 -6 -11 -4 -8 -3 2 -5 -5 0 1 11 8 9 2 6 -6 1 1 -13 -3 0 0 5 -6 17 2 1 3 8 -1 11 -1 10
6731 10 -1 5 16 -8 12 0 9 5 -10 5 3 2 -5 -4 4 -7 -16 -7 -12 -5 -11 -4 -14 3 -8 -13 -5 -2 7 -7 0 -8 1 -6 7 2 -3 2 2 -5 14 3 -5 3 -8
6776 -8 -1 -3 -2 6 6 12 5 10 0 -6 0 -3 -2 6 -3 5 7 -5 -15 -5 -7 -6 -10 -10 -9 -10 -12 -4 -3 -6 -3 0 -6 -13 -1 -8 -6 -6 -3 1 5 0 7 11 2 -9 1 14 9 9 -2 4
6828DoKJ1qpKJ2j3Plj1J2Jj1jKMjmRlJ0j0%J1mKj3JNlkJ1Rprj3J9j1J3J%nMJ5
6873B2j9P%qPpJjMLoqomJ4qJRKOj1nJ0Rj3Lmk%mNLojLjNJNLjj3LOo%jJ1qLnQl
6926CrQOj1KqPlLjj2J3rlORrJjJL%kLNRppOnRj0LlNPj3M%JJklLlJ1pqPJ3rkPq
6980AMmo%lnLMqJ2mj0J5lqkOOjKPomMNj0RklNjpJ0j1J0rnPJ2j6R%LpJ5qj7MQL
7030DklJlPmmkJLlJ1onllRQNj2MmQLj0lJ1qJ2Lj2Lj7RpQo%J0llOlmmJJ1j0LJK
7081@lQlmnoJ3LppJ0%olJ3j%j3PJmLLmRLKjoKQj5N%pMKqNNKmrmJ1kmjMLjjNLp
7136blJ2%mn%J0jqMnLmJ0j2J8j4J4n%KJNojnK%Mj7J4%qO%%%Mj0Lo%llmPJ1j5N
7185fJ3qmJ0Kp%J1mmnKMkqjKJ0Nk2JQmJ2lJ%JNjrjJ1kj5NJ0j1oJ5okO%jrOn%J2
$$ plain form
6828 4 -2 0 11 3 -4 -2 10 -3 4 1 -10 2 3 -8 -9 -7 -3 -4 -8 1 -2 8 -2 -2 9 5 7 -6 -5 0 -3 -5 6 15 8 -1 -14 5 -6 7 8 8 3 7 22
6873 22 3 10 10 2 9 2 3 2 6 9 3 -5 -11 -15 -1 -9 -8 1 3 9 -2 -7 3 12 -1 2 -2 -4 -4 -8 -3 0 -6 -7 -4 -5 0 1 6 9 8 -5 -2 4 -2 -2 -3 8 0 3 -2 6 3
6926 3 -6 2 8 -3 -1 -9 -2 -5 -2 -3 -15 -2 -11 -14 -8 1 -8 -7 -8 -7 -4 -4 -6 -3 2 11 4 -3 3 -2 7 -3 0 -3 2 9 -4 0 0 1 2 0 -3 0 -3 8 1 -7 0 13 4 2 9 1
6980 1 5 1 -5 -5 -8 -13 -10 -6 -14 -2 -6 -16 -1 -4 -12 -14 -8 -2 -3 -1 6 0 -4 0 5 -5 4 2 -1 4 3 -4 6 -5 5 -4 -9 -2 10 -6 3 3 6 -1 14 6 -11 -7 1 4
7030 4 2 -1 0 -3 4 0 -4 -6 -5 -2 -5 6 0 -5 -8 -11 -2 6 11 -1 3 -1 7 10 0 -3 8 0 12 15 3 6 -11 -2 -9 -1 -7 -7 3 0 -3 3 0 -4 -8 -7 4 -6 -3 -2 0
7081 0 -3 5 2 -2 -7 -13 0 3 -4 -11 -1 -1 -7 -10 3 2 2 -11 -4 -3 -7 -4 -1 -5 4 7 9 8 2 4 12 -3 2 2 -5 -1 1 -7 -2 3 5 1 -8 -12 -1 -3 -7 -8 -4 -1 -2 -3 2 5 -2
7136 -2 -5 7 7 3 -2 -2 8 7 -1 3 -2 1 -3 7 -5 13 -1 13 8 8 10 11 16 10 9 4 6 6 10 -7 7 7 -1 5 5 5 5 9 -1 2 -4 -4 -7 -10 -14 -7 4 -11 -6
7185 -6 7 -1 -5 5 7 0 0 11 7 3 -2 0 4 2 -6 -7 -5 5 10 -12 -11 -3 -7 5 2 3 3 4 9 8 -1 -2 9 7 -8 -3 7 -4 -10 5 -1 -3 3 3 2 -7 -1 -6 -6 6
7235Fj4J3pJJJQnkJMjljljPLLjNmj4J1m%J0rj1lJ6kJjJ6k4j5J4j%Q%rj3J8j0P
7282dkMOj1jmRRj8J6oKkoPMnj%%qOLLJ1nq%Oj3R%l%Jj0L%rJ5rlM%J6roJLjpJ3
7334@ljqM%PNj1J3j8NJ3j5Rl%J0nNkllJ4j9J6qj2J5j6JORj1lJ3j7J5nl%NoOqP
7379bkkmKlkK2j5J4qnJ7j7kJ6j5RKlLj0J1JLonRj3MJ4j4Qj0oJ4j4J1r%N%J0j6
7422hLOj0NNpJoJ3Oj0joKJ0j2MQ%%%KlOrJLKkj0R%JNlKkrKlMjOj1JokQj2J6Lj
7474@pRJoLQpj0K1lj6J5rJ0pKlj1PJKL%%JJj0J5Lj6RMoJj2J4rMj4J3j0jJ5j4J4
7519Ej4J3j9K0k1J8lmmJ2LJoJ5krKlPknjJmQj2oKJ2Okoj1PkO%J0j1RploJOmNq
7567fJ0nlKJ1j5KjkMMrJ3jopJ3pQKqJNlnRrnJ0J0kj8OlOMnjQj6RMpjj2RJ%J2j7
$$ plain form
7235 6 -8 5 -2 -1 0 1 9 4 2 3 7 6 3 2 -1 -2 5 8 11 10 15 11 -3 8 4 4 14 5 -6 -9 7 5 6 5 21 -3 -18 -4 -5 -5 3 3 -6 -19 -1 -11 -4
7282 -4 -6 -2 4 -7 -8 -12 -3 6 -12 4 -2 0 -2 -8 -1 3 -2 -3 -3 -3 -11 -5 -2 1 12 7 -1 -1 5 -8 1 1 -2 -2 -1 -11 -8 -8 -17 -2 -11 -14 -10 -10 6 -3 -9 -8 -5 -6 -13 0
7334 0 -3 -4 -12 -8 -8 -1 4 -7 6 -12 -7 6 -9 0 -3 -3 7 2 7 5 2 -1 13 -6 10 2 -10 5 -11 -10 -4 5 -6 -9 4 -13 2 -3 -6 -6 -1 -7 -1 -9 -2
7379 -2 -4 -6 -10 -8 -11 -13 9 -6 8 0 -5 12 -5 -7 9 -6 3 5 2 5 -5 6 7 10 4 -1 8 -5 -1 13 -1 7 -3 -9 5 -9 2 -7 -7 -2 -2 8 -8
7422 -8 -5 1 -9 -4 1 -6 -5 -11 2 8 -2 -3 -9 -7 3 -9 -5 3 3 3 3 5 2 8 -1 0 3 5 3 -7 2 2 3 8 5 7 5 -4 -2 -5 -1 -2 4 -7 -6 -12 -14 -6 -18 -2 1 0
7474 0 -7 2 3 -3 0 8 1 -9 12 9 -7 8 -1 9 2 4 1 -10 -3 -2 0 3 3 3 4 5 -5 10 13 -3 6 10 4 5 -7 7 -2 2 -12 1 -9 -10 5 -9 5
7519 5 -9 4 -15 5 -16 2 -1 -5 -9 3 6 7 1 16 14 5 7 4 11 9 4 3 4 0 8 -4 -10 -8 4 10 8 2 -9 -2 -4 2 2 12 1 10 3 0 -6 -5 1 -3 2 -6
7567 -6 4 -1 -4 -2 9 -6 -4 -5 -7 -3 1 -8 5 4 -2 -9 4 -3 5 7 -1 0 5 2 -3 6 -3 -8 2 12 10 -8 -2 -5 1 5 0 -1 7 -9 0 4 -3 -4 -16 -7 -6 -6 6 -11
7617a1NJ%QmkmPjOj5OjPJmjJ3j5QOqK%LJj6PJKLrmJJ7j6KOJj5NmqJ4lpMJ0rPp
7668a0Oj0lJ6Nj3OmPjjQloJ2j9MJ6j6QKj5PJ0j5NNj0J7pPj0nK2j4j%m%JkPj0j
7712impRKj1K9k0mKJ0l%ROj0jJ0loNNnoRj3J0qljJNNMknJKj7J2j1PNpm%pJ0J%
7761hjLK%jj2J5mJ2MqKrKJ1nOJlrK0j9J0Jj0KkLolNLLj8QNKlLMj0%jJ4k1LJ4j6
7809a1kJ3j2RnnJ1QqloLRlQnjKPj7J4nmJ1j3J5j0kRKommJ3j0J2j3J1rKnmJJJ8
7854A2j6J3poKjoRo%oJ3KNlllpOQj2J1NNj4Rr%j1JPOLnlpJ1KpkkJ4rj0kRoJkq
7904a9K4j6J0jNJj5J0rJ0qmJ3oKkNj2J8rM%oK0j2rMlkNJj0OlJ0rJ5nrOj8J9qK0
7948A3%kj9PlJ0rJljNrLmJ1j6J5%kjJ3J1j8qPQjoN%mnkKOoMQrjNqjLQlkj1P%l
$$ plain form
7617 -11 -6 -5 -5 3 -1 -3 -7 0 -1 5 -10 -4 -5 2 3 -1 -2 11 -4 4 10 2 4 4 7 8 -8 -1 0 2 5 -4 -8 -7 10 -6 -4 2 3 -12 -7 -11 -19 -5 -8 -15 -11 -1 -10 -3 -10
7668 -10 -4 -14 -17 -1 4 -9 -3 -7 0 -1 -2 6 3 -3 9 -10 -6 10 -6 2 4 -11 -4 6 -9 -4 1 -9 8 1 8 -2 -7 15 1 0 0 -4 -4 -3 -5 2 -8 -9
7712 -9 -13 -20 -11 -9 -20 9 -11 -15 -13 -3 -6 -6 3 9 -1 -2 8 5 -1 4 9 4 -2 7 -6 4 -4 -7 -8 -7 -2 3 7 5 0 1 3 -14 -2 -13 -6 -1 -8 -12 -12 -19 -9 -8 -8
7761 -8 -9 -6 -4 -4 -5 -17 -2 -6 6 10 2 4 -5 -3 8 3 9 10 7 -2 18 -1 9 10 0 2 0 3 -3 -6 -1 2 5 -13 -5 0 2 -1 2 6 -4 -4 -5 9 -12 -9 5 -11
7809 -11 -13 0 -12 -3 -8 -13 -2 6 -2 -5 -11 -8 1 -2 6 1 0 2 9 -8 6 1 -3 8 -5 10 0 -2 7 9 3 -1 -5 8 -2 10 -3 8 -1 1 -4 -8 -7 -6 12
7854 12 -4 9 2 -4 -2 -3 -9 0 -6 -6 -12 1 3 8 5 2 -1 -8 -2 6 -6 5 10 15 1 10 1 1 -10 -9 -2 4 7 2 -1 -8 3 5 -2 -4 -6 8 -1 -11 -13 -4 -10 -9 -11 -19
7904 -19 5 -11 -1 -2 3 4 -11 -1 -10 0 -8 -12 1 -5 -3 -5 0 -12 6 -3 1 1 -5 15 3 -6 -2 -5 -7 -2 -1 -11 -5 -8 2 -7 8 3 -6 0 -18 1 -7 13
7948 13 13 11 -8 -1 -4 6 -3 -2 -5 -6 -1 -10 -7 -11 0 -16 -1 -1 -3 -4 9 20 2 -6 1 9 8 2 7 7 3 -2 -4 -2 4 -2 2 10 1 0 5 -3 -4 -1 7 4 2 -9 -2 -2 -5
7999eJPJmlOj5KMjjKQj0MJ4qLJpLnJ1Jkj1nJ5pmnJ3%lOlJlMoM%nNJjj4OjJ7rk
8051@j%olLMJj3NjQKMJJmlK1j9OJ2oj2mRKmmmL%J8rKk8K0RomPRk0J4j4LRk1LJ1
8100A%Qk0J4pqJ0lj2LRQ%PpmLRj0J0MnnjNj3KjLj2J0nJJoKJ0j0%lJ9pqJ5j0J1
8146HJmMrPj4jnmJ7ljoJ0j0PMNqNJ2oj3J3kqP%%o%Qj4MoLJ3qj3J4pqNnK3
$$ plain form
7999 -5 -4 3 4 0 -3 3 -12 -10 -6 -7 -8 -6 2 -8 -4 10 2 5 6 -1 2 -3 8 9 7 -4 -9 6 -1 -5 -10 3 3 0 6 3 4 1 5 -1 3 3 -2 3 4 3 -11 -5 -6 11 2 0
8051 0 -1 -1 -7 -10 -7 -3 -2 -15 -10 -11 -3 -1 3 4 5 1 -2 19 0 6 18 12 0 -4 5 7 3 -1 -5 -2 -2 16 7 9 -19 1 10 4 0 7 16 -4 10 -4 -1 8 -13 -10 1
8100 1 1 9 -11 3 -4 -12 -2 -5 -17 -14 -5 3 3 10 3 -1 2 11 1 11 15 10 5 4 9 -4 -2 -3 0 -12 -2 -7 -6 -5 -11 -9 1 -9 -9 -12 7 0 -8 7 -3 8
8146 8 9 5 9 0 7 -7 -8 -13 -17 0 -3 -4 -10 0 -10 -3 1 6 -2 3 15 9 -4 9 7 -1 6 6 6 0 0 8 -6 -2 -8 -5 8 0 -13 1 -6 -14 -9 -14 9
8191I
$$ Imaginary data points
##PAGE= N=2
##DATA TABLE= (X++(I..I)), XYDATA
0@%%%%%%%%%%%%%%%%%%%oJ4j6J6j6J6j6K4l2L2l5M3m8N6o4P2q0Q8j04J15j23J36
41G2j52J71j93K14k35K59k86L15l47L82m20M63n11N66o27O93p69Q59r65J090j242
62f63J429j670J997k457L161m393P173k4879j902K4020k8885O617L1237N13k2395
77a1097J6918J9842j1371q345J5952o548k1854K812J1125j4969o473J7982J547
90E521k0814K775J6658o940j0875J4995J0186j2628m872J0500q80n991P799P371
104A2805m276J039M358q138p450O136j099j3762j533P909p431r857J0173J1438
118C12l610K033J2938J455p386K833L181p822l407L942n647r069L608L577o963
133a0025L11J0818M74p031M164O235n063k369P084M40n773K124K448o253p17P472
$$ plain form
0 0 0 0 0 0 0 0 0 0 0 0 0 0 0 0 0 0 0 0 0 -6 8 -8 8 -8 8 -8 16 -16 16 -19 24 -24 32 -32 40 -40 48 -56 59 -64 72
41 72 -80 91 -102 112 -123 136 -150 165 -182 200 -220 243 -268 298 -329 364 -405 454 -511 579 -663
62 -663 766 -904 1093 -1364 1797 -2596 4577 -20302 -22204 1816 -27069 -20452 10785 11298 -11097
77 -11097 5821 25663 14292 5947 21899 15351 -6503 -3691 7434 -7535 -14008 3974 5521
90 5521 -15293 -12518 4140 -2800 -13675 1320 11506 -1122 -5994 4506 3626 -2365 5434 12805
104 12805 8529 9568 13926 5788 -1662 4474 3375 -10387 -11920 -4011 -11442 -21299 -11126 312
118 312 -3298 -1265 11673 13128 5742 8575 11756 3934 527 4469 -1178 -10247 -6639 -3062 -10025
133 -10025 -9714 1104 1578 -5453 -1289 4946 -117 -2486 4598 5038 -735 1389 3837 -2416 -3133 4339
149D339j435n993N359M165r186l487Q885n70r071L816P407p110m899R946L858
164F024p063L759R360o618r102O234K468j1192j270J0260l196r984N827P848o842
179c487j859J1657J709r539K201P129p060o869P737L385q997j201P388l084o949
194g839N463O073m981j517O903o22o843K258N423l678l218M868J263n425j91M181
210B118j469k707L026J647l646j048K570r12k285K091K301j582p00J929M4j486
226a09O85J089q75n96K53r30r02P12K33p24P05J303n84p74R27N71o93L9M98o62
246A66o02K84n24r17P31Q89q65m03J335L73r07N67J313l35n19P88J3j122R0O43
266I98r26r67N06r6j267l7R57k45m43J093Q55n68K38J418K49p21L70O00p88r95
$$ plain form
149 4339 2904 -3089 2270 6435 -2751 -6238 2647 2077 -6994 -3178 4229 -2881 -7780 2166 6024
164 6024 -1039 2720 12080 5462 -3640 2594 5062 -6130 -7400 2860 -336 -10320 -4493 3355 -3487
179 -3487 -5346 6311 8020 -1519 682 7811 751 -6118 1619 5004 -3993 -5194 2194 -890 -7839
194 -7839 -2376 3697 -1284 -2801 4102 3480 -3363 -1105 4318 640 -2578 2290 3553 -1872 -2063 2118
210 2118 649 -2058 968 2615 -1031 -2079 491 -421 -2706 -615 1686 104 -596 1333 1377 -109
226 -109 576 1665 790 194 447 -483 -1385 -673 -440 -1164 -459 844 260 -514 413 984 291 330 828 166
246 166 -436 -152 -676 -1593 -862 27 -838 -1241 94 467 -440 127 1440 1105 586 1374 1387 265 355 998
266 998 72 -895 -389 -485 -1752 -1789 -832 -1077 -1520 -427 428 -140 98 1516 1765 1044 1414 2014 1226 231
286B31J3j46q16l89N5l13k36L11J76m7M66P18J04j16M65O35K2k53J60M17j11p10
308F36m62J33j19q02o22K02K15l61k20M46N77K62J06K66N43M74j9k43K10K28n58
329H92p96q8rp03n78J90K26j20J33M67L40L05K92j08j84L11R6o52l48N44R4p73
351d69j86N84Mn31O9M07p5r7L85K57j01J60L34j50m13n3M6k63k83%M3KJ28J27
375g5n7J0K42J73k29j96L57M60j56l18L01M21k49n53j25L3k61m16l06n9K70K14
397e19k46l8P02N01l94k8Q37L29n28K6M76l54n76Q7k36q92j42L86n50m58J011
418f06P59o30Q3J267J1j050L68Q72p63p49Q50L15j033R7J170l00r18N22M33j105
438d07n93P35l7o93L78O53m32j72Q02K59l29M16N62l85m03J24k40m58J16m8m90
$$ plain form
286 231 244 98 -718 -1107 -1052 -1365 -1601 -1290 -1114 -1161 -695 23 127 11 476 1111 1133 880 1040 1457 1346 636
308 636 174 307 188 -614 -1236 -1034 -819 -1180 -1400 -954 -377 -115 -9 257 800 1274 1255 1012 1222 1450 892
329 892 96 8 -1 -704 -1282 -1092 -866 -986 -853 -386 -46 259 551 443 259 570 666 14 -334 210 304 -469
351 -469 -655 -71 -67 -598 -529 -122 -197 -294 91 348 247 407 741 591 178 125 171 -92 -375 -375 -332 -330 -202 -75
375 -75 -132 -122 120 293 64 -132 225 685 529 211 512 933 684 131 6 39 -222 -638 -944 -1003 -733 -519
397 -519 -765 -803 -101 400 6 -22 815 1144 616 642 1118 764 188 275 39 -853 -995 -609 -1159 -1617 -606
418 -606 153 -477 -394 873 884 -166 202 1074 311 -438 412 727 -306 -209 961 661 -257 265 698 -407
438 -407 -1000 -265 -302 -995 -617 36 -396 -568 234 493 164 580 1142 757 354 478 238 -220 -104 -152 -642
459f42N8K68m36n0R27K78m88N29O26r87p64Q29N3j166L43J158o88o92J245N06
479I07j176N30J499j101j542J224N64k173l15K200l18j845J161J476j667n53K307
496A178q7k096J212J796k273j491K653N16k903N47K834j555k327K405J425k944
512a110k37L158j071l137J927K298k882j208L588K59l349J218L119k163k224K978
528A164J021l626j02L250j380k940K337K225k872j017L287O3k934J175K505j940
544B16j732K266M54k603M10K368j218j845J840J163k110l76K245n4j675O13J083
561A045j051o65R44K5o32M80K51q25n6N99m01k90P66N0p30L68L46q24J89J284
581H73m10r36J201O18j887k99K006m70j998J219J539k216j253K382K64k479J006
$$ plain form
459 -642 -584 -316 -752 -802 125 403 -85 444 1070 83 -681 148 201 -965 -622 536 -152 -844 401 907
479 907 -269 261 1760 659 -883 341 905 -1268 -1583 617 299 -1546 -385 1091 -576 -1129 1178
496 1178 1091 -1005 207 2003 -270 -1761 892 1408 -1495 -948 1886 331 -1996 409 1834 -1110
512 -1110 -1347 1811 740 -2397 -470 1828 -1054 -2262 1326 1585 -1764 -546 2573 410 -1814 1164
528 1164 2185 -1441 -1543 1707 327 -2613 -276 1949 -923 -1940 1347 1410 -1524 -349 2156 216
544 216 -1516 750 1204 -1399 -989 1379 161 -1684 156 1319 -791 -1167 1078 1024 -651 -38 1045
561 1045 -6 -671 273 298 -334 146 397 -428 -484 115 -286 -576 190 240 -490 -122 224 -600 -411 873
581 873 463 -473 728 1346 -541 -840 1166 696 -1302 -83 1456 -760 -2013 369 633 -1846 -840
598h40K706j674k024K493J187k876O6L261q96k818J772J753k975j102L213j47
614A099l233J278K669k536k090L165J214l110M53L348j379k659K350J729k990
629f92m89L305p88l324J529K349k724j637L211N86l221N79K995j537k239K480
645C83J581k668l81K842n95k577J429J945k165j298K400L36k573K88K235j016
661A66j836J416J255j532m59J710L1j435N17J159q78p65J100M45j162k81Q57j11
679A97q09K23O99j66m48J42K69k17k17L17L84k15l47L12K81n72l46P78L63q44
699b16k28Q51j40j047L21J016m82o60R02M53j095j14J196k30j107O33R37j148
717a58q87J114L54j289P3J374l13j042P49Q08r37l55J219K8j176L15R41q42r18
$$ plain form
598 -840 1866 192 -1832 661 1848 -1028 -962 2299 1403 -1415 357 2110 -865 -1967 1246 1099
614 1099 -2134 -856 1813 -723 -2813 352 1566 -1544 -1091 2257 878 -1781 569 2298 -692
629 -692 -1181 2124 1336 -1988 -459 1890 -834 -2471 740 1326 -1895 -1316 1679 142 -2097 383
645 383 1964 -704 -1085 1757 1162 -1415 14 1959 -206 -1504 896 1232 -1341 -1053 1182 166
661 166 -1670 -254 1001 -531 -990 720 751 -684 -167 992 114 -651 449 894 -268 -549 308 197
679 197 -612 -389 310 144 -304 -162 107 -110 -327 -10 374 159 -188 124 405 -167 -513 265 628 -216
699 -216 -444 407 267 -780 -459 557 75 -585 317 770 -325 -439 757 527 -580 53 990 -158
717 -158 -1045 69 423 -866 -793 581 268 -774 -25 783 -154 -509 710 738 -438 -123 818 -24 -942
736i42R63N65j036j47J055k07r75M99P58p13l94R70J29j023J68R50m24p34P68
755B30O12q78l44Q65q4r85K56Q27n58o62P26M38q57j30R53k4p81M07P20o66o33
776e68P31L05q91o7R31j55q51L80O72n44m08P62K09q10L2O96l76p10N57N99o36
797a42l36O96R8o74J39O02k78l54M67J40o40L1O23j98n12L96M13n11k82M55O8
818B01m30Q8K92k86j80L13K9k87K21L28k48j56L44P0l30P3K26k20j79K05n7k89
840b72J51K12k91j10L63J8l16J50L01k01j53L11J4l08J53K85k96j93L90O7m42
861a67N5L39k25k82K87Q5l65O8L61k52k99M42K31m49k6M99n3m43K31L09l44j44
883a42L74q1m01K35K89m16j59M97j0n56J62M86l08l92M13K51m19n4M21q0k69K94
$$ plain form
736 -942 21 586 -450 -597 458 251 -724 -225 533 -180 -574 396 525 -498 -330 620 196 -538 230
755 230 842 -36 -380 485 401 -584 -328 499 -59 -721 5 443 -414 -544 409 385 -396 11 731 65 -568
776 -568 163 468 -423 -490 441 286 -565 -185 487 -57 -465 297 506 -304 -272 424 48 -662 -105 494 -142
797 -142 -478 218 316 -358 -219 383 105 -249 218 358 -282 -251 372 174 -338 58 471 -40 -322 133 201
818 201 -229 -141 151 -135 -315 -2 27 -260 -39 289 41 -115 229 299 -31 42 268 48 -131 74 17 -272
840 -272 -121 91 -200 -310 53 71 -245 -95 206 5 -148 163 177 -131 22 307 11 -182 208 275 -167
861 -167 -112 227 2 -280 7 92 -273 -205 156 -96 -395 47 278 -171 -197 302 249 -194 37 346 2 -142
883 -142 232 151 -250 -15 274 -142 -301 196 186 -370 -208 278 -30 -422 -9 242 -177 -231 190 110 -159 135
905A35J72l50jM02j98l85K65K54m19j98L80J1m04J17K94k11j38L03O1k61J19K89
927B37j71j63K71P3k77M1K57j76k32K22P5l08l5K69j05k58J49J75j79o2K27J9
949D9j51J14J56j36m8J90Nj86O0J23j23j21J11M4j59n0Q3l3o7K0K2oO4No9M6J35
976G8j3q1P7J08n7o6K3lj6N5n9j13L5P4j24j18J36J04j35p6J18M8q4K9J18omQ4
1004A32lj03M2J13p0j10O1N4j73j27R2M5j06j2J11k8j07O1J10l9%J68J01j84o2
1029c4J98M8k21N3K37q7k80L5J15j88q7K40kk98O3K54k05k24M03L15l37j29M07
1052B76nm08J31M27k18l31K97Q4n29l2M71j31m29L12L15n20k21N76J06m79J89
1073a19N45l36m71M69L51m82p1O04j21o13J80M06m33k77N53J00o67JN26k24m27
$$ plain form
905 135 307 -43 -44 358 160 -225 40 294 -125 -323 57 68 -336 -219 75 -136 -274 29 90 -171 -52 237
927 237 66 -97 174 247 -30 11 268 92 -140 82 157 -151 -186 83 -22 -280 -131 44 -135 -197 30 49
949 49 -102 12 168 32 -16 174 179 -7 53 176 53 -68 43 87 -72 -122 -39 -72 -139 -119 -97 -103 -39 -34 -103 -57 78
976 78 65 -16 61 169 112 46 69 66 50 105 46 -67 -32 42 -82 -200 -64 40 -95 -171 -53 -5 -89 -60 58 52 48 132
1004 132 129 26 68 181 111 1 62 116 -57 -184 -92 -47 -153 -165 -54 -82 -189 -128 -18 -57 -57 111 212 28 -34
1029 -34 164 212 -9 44 281 194 -86 -51 64 -124 -211 29 27 -271 -208 46 -159 -383 20 335 -2 -131 276
1052 276 271 -137 -6 421 203 -128 169 253 -276 -308 163 32 -397 -85 230 -290 -511 65 171 -308 -119
1073 -119 426 90 -381 88 439 -43 -114 490 369 -244 -64 342 -91 -368 185 285 -382 -381 145 -79 -506
1094e06M83M27m61k22M75mm60K52N06k76l61L04J16m75p3M94Ll74R5J65l10k09
1116d11L25J80k17L9K11j75k99K06L26n1p4K04M1l12j56J86J47q3LP7j45k81n
1139b64J65QL7K08K3l66j67K67J26j55J96L86j94m77N6K77j31m6L99R0m91j76
1161b29J92j65k13M20L63m05l09L08l4m15K60O51j07l91K32J06n04q3O47J13m50
1182a3R3K80m70m45M67L51l59l4M18k79n81K56M61k00j00M95L7o33j4M98q0k91
1204a43M23L06n45l70L56M6l72K03M53k93m62K21J70l59O5N96Jm92Q9L37l09k49
1226c28N33L42m19k07L18j25m28K34M30k18k75K01j7m45MM77J2k91K08K09l89
1247a74k02M53K25k63N5L25k42m06J71K75j83r6K68n6m28m9K61n3j21K68J52k99
$$ plain form
1094 -506 -23 404 -57 -279 196 192 -268 -16 490 214 -147 157 273 -202 -275 219 222 -152 -57 108 -202 -411
1116 -411 -86 94 -123 -84 127 -48 -347 -141 185 134 60 264 305 -7 -163 23 170 87 90 167 22 -259 -264
1139 -264 -99 -91 -54 154 177 -189 -356 -89 37 -118 78 464 270 -207 -151 126 -5 -51 348 438 -53 -229
1161 -229 -37 -202 -415 5 368 -37 -346 -38 -72 -487 -227 424 317 -74 158 264 -240 -323 324 437 -13
1182 -13 80 360 -110 -555 -88 263 -96 -130 288 9 -572 -316 145 -55 -155 340 377 -256 -270 228 148 -143
1204 -143 280 586 41 -329 27 73 -299 -96 357 64 -398 -177 -7 -366 -301 295 296 -196 -107 230 -79 -328
1226 -328 205 547 128 -79 239 114 -314 -80 350 132 -143 58 41 -404 -400 77 89 -202 6 215 -174
1247 -174 -376 77 302 39 94 419 177 -229 -58 217 34 -62 206 150 -278 -327 -66 -119 -240 28 180 -119
1269a19j46K05M9j03J88K71j19k19O8L7j26RK23K5k16j08J9o6j02Q5J45J7j09
1292i2l8K7j0K8J45J32m7l7L3o0j14O3J79o1j59L6L0k07j01J84R9j43lJ50j07
1317g3j61J82J57j16QK38p1k75J30K12j52j37K44N8l57k7K38j10k08K04J46l08
1339a78p1K87k2k58J58L21j93j94K65Q2k59L1K97j37k22J57J22k87q8L00k7k77
1361a93Q2K07j96j30K30O7j87N2J99j37j17K05R0j63J2K05r2j87J04J04j54o3
1383f2J26k6j63M2O5j03rJ34k6r0P7J07j00j6J56J1j16L8Q8q2m8O8j7r8N4K5j07
1410g2l4J09k9j20P2J02r4m9J38J2q7Q0J16q0n1J11J5j19L1R1j08j05R4J7j53
1435a13lJ16p5q4J18P1j20kJ62qj20Q8R9r1m2J06Jj22M5P4j17n7J20j2j54K5J25
$$ plain form
1269 -119 -265 -60 -11 -114 74 345 226 7 75 112 -14 -5 218 243 27 -81 -62 -128 -230 -145 0 17 -92
1292 -92 -130 -103 -113 -85 60 192 145 108 141 81 -33 30 209 148 -11 25 55 -152 -253 -69 30 -113 -116 34 -73
1317 -73 -234 -52 105 -11 -3 235 164 -111 19 231 79 -58 186 244 -113 -140 98 -12 -220 -16 130 -178
1339 -178 -249 38 16 -242 -84 237 44 -150 115 197 -62 -31 266 129 -93 64 186 -101 -189 111 84 -193
1361 -193 -111 96 -100 -230 0 67 -120 -68 131 -6 -123 82 172 9 21 226 134 -53 51 155 1 -62
1383 -62 64 38 -125 -83 -18 -121 -130 4 -22 -112 -35 72 -28 -44 112 123 7 45 133 51 3 71 54 -44 10 35 -72
1410 -72 -106 3 -26 -146 -74 28 -66 -115 23 35 -52 28 144 64 13 124 139 20 51 142 34 -71 23 40 -113
1435 -113 -116 0 -75 -159 -41 30 -90 -92 70 62 -58 30 129 38 -4 102 103 -19 26 100 -17 -74 46 34 -120 -95 30
1462C0p9j03J01P6r3%J13k3n0J05M2j06K9J24o1j26O4N9j08o3P3Pj09K1O9o6k1
1489i5Q0Mo7N2Q4n2m5Q9M3q3J3P1l6n4L3L1p5l2M8k6p1J8L1m0j3N7J7k4M2N0k0
1520C0J3L7Lm8K5M1o6k7L2lo0pJ9j8k6L2j4l7J2L6l3oO2J2k8J4O3j7j8M0K2m4
1552D1j3K3n4k4J6No9OM1l0k0K3N6l0LN2J6l8J9K9j4PK7km3MK2l5m1L4J8o9l1
1585g1M0l4k5J4N5j1k5N7J2k4PP2Lm1J1L1m0m9K8L3o3j5L6k4p4M5M6l7j9N8K3
1616A9o0J8P4J6m6K1N8m3m7L9J8n9mL7n2n5K5L2o3rO8J1p2rQ5%l5L7O5l5l4L5
1648C5J3l3OM2l5m6QJ3m8k6O3J7n8NM0qm2N9M7l2j3M7Qo5J1N5qm8K9Km8m1M3k
1682a0k9J2K6m0n0M7L0k6J0O8lp5L6M6k1m3P2K0m8k7L1j5n6M0L5m4m3L5J4o4J2
$$ plain form
1462 30 -49 -152 -51 25 -68 -68 45 22 -28 77 119 13 42 166 105 -21 43 102 -6 -69 4 11 -98 -77 -8 -74 -95
1489 -95 -15 -11 -78 -26 58 6 -39 50 93 10 23 94 58 4 37 68 -7 -39 9 -17 -88 -70 -39 -79 -92 -35 -18 -42 0 50 30
1520 30 43 80 83 35 60 101 35 8 40 37 -23 -30 -11 -29 -55 -23 -37 -74 -62 -26 -59 -65 -3 9 -19 -5 58 41 23 63 85 41
1552 41 28 51 -3 -27 -11 -6 -75 -69 -28 -58 -78 -55 1 -29 -26 26 42 4 23 52 38 45 72 70 27 31 53 18 -23 11 29 -40 -71
1585 -71 -31 -65 -90 -76 -21 -32 -57 0 12 -12 -5 67 70 29 40 71 31 -18 10 43 -20 -35 1 -23 -97 -52 -6 -43 -62 -4 19
1616 19 -41 -23 51 67 21 42 100 57 10 49 67 8 4 41 -11 -66 -41 -9 -72 -81 -13 -2 -74 -83 2 2 -33 4 69 34 0 35
1648 35 48 15 21 63 28 -18 -10 3 -45 -71 -8 9 -49 -44 -4 -12 -54 5 52 20 7 54 62 -3 8 63 55 7 36 38 -10 -51 -8 -10
1682 -10 -39 -27 -1 -41 -91 -44 -14 -40 -30 38 35 -40 -4 42 21 -22 50 70 22 -5 26 11 -45 -5 30 -14 -57 -22 -8 -72 -60
1713f0P5nl8J8O1m1l3O5M2o3%L9j5n7J2M0m0m7M4J3p2j8P0nl9QO7l1m5N6M6l9
1745HrM8Om6LL5pm7J9K7n5l0L9J8n2lO2j2n3L3N7k3j0N1Qo6NM2j6n0L9L4n3l1
1779b9K4J1m9J5L3k2l9L1J2n2K0P6%o1L7M4l4l4O1J4m2j2M2m5m4K1L3l4nM2j4
1810@m5J4M9k5j1M8J8m4j7N0nl2L6J9k7k5K2km6j2N4l3k8LJ2l3MM9%j9J4K4%j3
1844aJ7L0k4j3J0Nk5LnrNj2Qj2NOJ2jqQJ8j9jK9Mj3mK5j6l8K7Kk0k3K2Lm1kL6
1883a2ll5L1J5j6KJ7J5j5OK9j8j9K0J5k9kL0ol4jJ6k6lK2lj4j3L4j1qK3J5j9K
1918EL5j9j0J2Mk3qJ7j0k8MJ9l7oK7Jj8NJ7JjJ7J2j3NJ5rqJ0Pnj1oMpj8J3nMM
1958dorPJ8llJ7JrOPmoOj4RLj1k5J0Pj8oj0K3j4mJ5J1qRK7j6Qm%kJ7ooj5J7Jj3
$$ plain form
1713 -60 15 10 -28 -10 51 10 -23 42 84 21 21 60 45 -12 0 40 0 -47 -3 10 -62 -80 -10 -15 -54 -46 21 -10 -55 1 47 8
1745 8 -1 47 53 7 10 45 38 -9 10 37 -18 -48 -9 9 -43 -46 16 4 -49 -16 41 18 8 59 67 1 6 48 32 -18 21 55 2 -29
1779 -29 -5 6 -43 -28 5 -17 -56 -25 -13 -65 -45 31 31 -30 7 51 17 -17 44 58 16 4 46 1 -43 -22 11 -23 -28 14 0
1810 0 -45 -31 18 -7 -18 30 48 4 -13 37 32 0 36 55 28 3 25 23 -23 -35 19 -14 -42 -39 -27 -60 -56 -7 -7 -26 -12 12 12 -1
1844 -1 16 46 22 9 19 24 -1 2 -3 -12 -7 -19 -11 -23 -18 -12 0 -1 -9 -1 17 -2 -3 26 30 17 13 38 22 -16 11 13 -7 -30 -8 -5 -46 -48 -12
1883 -12 -15 -50 -19 -4 -20 -18 -1 14 -1 5 34 16 -3 17 32 3 1 31 25 -9 -10 6 -20 -23 -1 -4 -18 -31 3 -8 -16 7 22 3 5
1918 5 40 21 11 23 27 4 -4 13 3 -25 -21 -2 -39 -45 -18 -17 -35 -30 -13 -12 -13 4 16 3 8 23 14 6 16 23 18 7 1 5 -2 -20 -7 -12 -8 -4
1958 -4 -10 -19 -12 6 3 0 17 18 9 15 22 18 12 18 4 13 16 5 -20 -10 -3 -21 -27 -37 -14 -28 -32 -17 -6 -14 -5 22 6 14 10 10 8 25 19 13 -2 15 16 3
2002CpJ1j6NMjk1MJ1PqLPJ3rmPJ4j0jj0okQj1plrNMPmKkJJ3klOLPKJ2pRj1nOl
2051A2j2%JJlj2mRj2J4Mj0QOMKj0J5j5mJ6j9Mj4J0jqoJJ5j4JO%mPRORkNpj1K4
2095B1j9J7kpqlJ2j5lOnj%kRj5KJ3LJ0moNkPj8LppJ1j9%NOkKJJj5K5%QlpQMLJ
2143A3J6j2%pj%j8J2%oLJj4mPLJkmJ2OpLj%Qmrn%Rj3j4J7oj1J5orK1%mLJ1mNK
2190GQKlmJ4k0J1kmlj2lkPqQk0%K4rLPPqnRPj7Km%j%PLj2j8L0k7NMJ6j3OJRj0
2237hPRNoJ7kj7J7Ok0Jj8J5ooj0J3j1rJ0Rj6QlJ7lnK3k0mJ1OrjNk1MLKj2J1J1
2279Cj8Nj6J4j5OK8J2j1j2J7J0j6J5Oj6J3k4Kj1JOj3Kj2J2q%J0mJNMkj0%K3oo
2318eJ7Ok3oJ4mj2MK0k0j5J7Oj2JJ6j5qJ2K8k2J6PJ3l0mL0k4rKL1m7KJ4kk5OK0
$$ plain form
2002 3 -4 7 -9 -4 0 -1 -22 -18 -7 0 -8 -5 2 15 6 2 9 23 13 12 2 -4 -6 2 -9 -16 -19 -28 -23 -19 -12 -16 -14 -16 -15 -2 -4 -7 -1 2 9 11 23 16 25 14 9 15 12
2051 12 0 0 1 2 -1 -13 -17 -8 -20 -6 -2 -12 -4 2 6 8 -2 13 -2 -6 10 -9 -5 -19 -9 -10 -18 -24 -23 -8 -22 -21 -15 -15 -19 -12 -3 3 12 10 15 8 -3 21
2095 21 2 19 17 10 2 -1 11 -4 -7 -1 -6 -7 -7 -9 0 -15 -13 0 3 13 9 3 8 6 13 -5 -2 -9 -16 -5 -24 -24 -19 -13 -15 -13 -12 -11 -26 -1 -1 7 4 -3 5 9 12 13
2143 13 29 17 17 10 9 9 -9 3 3 -3 0 1 -13 -17 -10 -7 -6 -8 -12 0 6 -1 2 1 1 9 5 -4 -9 -9 0 -13 -27 -10 -16 -27 -12 -18 -27 -6 -6 -10 -7 4 0 5 7
2190 7 15 17 14 10 24 4 15 13 9 6 -6 -9 -11 -4 -12 -4 -24 -24 0 -9 -6 1 8 0 -5 4 11 -6 -4 -8 -8 -9 -9 -2 1 -11 -29 1 -26 -21 -17 -1 -14 -8 -7 2 -8
2237 -8 -1 8 13 7 24 22 5 22 28 8 9 -9 6 0 -6 -16 -3 -14 -23 -13 -4 -20 -12 -15 2 -1 -6 17 -3 -7 4 10 1 0 5 -16 -12 -9 -7 -19 -8 3
2279 3 -15 -10 -26 -12 -27 -21 7 19 8 -4 13 23 7 22 28 12 25 1 3 -8 -7 -1 -14 -12 -24 -12 -20 -20 -10 -14 -13 -8 -4 -6 -16 -16 7 1 -5
2318 -5 12 18 -5 -11 3 -1 -13 -9 11 -9 -24 -7 -1 -13 -12 4 -11 -19 -7 21 -1 15 22 35 5 1 31 7 -2 0 31 -16 -14 0 -2 -27 -21 -1
2356akl3K2J9k3qL6Ol2PK9k0j2J9J5k9OMj1j9J5J4j3qJ2J3l1lL3KjJ5Jj1rJ5P
2393B4nOqj3k0KQKj1K1j2j1qKOqK1JJpmJ8kJJ8pj3%Jj1j0J4Nlj8J1j1RoL4pj2
2435bJ6lmpK5Jj5JOpl1K7%j2j6Qlj2PJ5qoJ6Nk4%K1Qj2OK6k0j4J4J6k7NQj6j3
2475b1%K6k6KJ4J1j8J6J9j4pJ7J0j6kJ0%j6MJj2j8J8lj1jJ2j1j4MJ8nk1L1kj0
2511a5K1rJjMJ4pjjkj0qJ6Lj9MQj3J2PoPNjQJlJ0j2q%Mlj5Ooj1Qrl%j%mlPJ4k
2559a3NPJJ0pPlOj3J9j2j2Kkj9LJ5rmJ4Rj3RJ0J2rJJ9k1jJ0oj2KnKnj3Qnj5Jk
2602b9j4J5PkJ6lJ5j6J5J4j1lNOj4OMkj1qPKj2KNJ1j0NNkQMLpJ2n%nJ8j3j0nJ9
2645B2k1rJj6j2J4ppJ2J1jjKJ9Mj0RrJ7pOj1jkKj0oMjj0J0OnMoPJ5kj4J3mJ6q
$$ plain form
2356 -1 -3 -36 -14 5 -18 -26 10 16 -16 -9 20 0 -12 7 22 -7 -1 3 -8 -27 -12 2 -11 -19 -7 6 -25 -28 5 7 6 21 22 11 2 17 24
2393 24 19 25 17 4 -16 -14 -6 -4 -15 6 -6 -17 -25 -23 -17 -25 -4 -3 -2 -9 -13 5 3 4 22 15 2 2 3 -8 -18 -4 1 -2 -20 -9 -20 -11 -17 17 10 -2
2435 -2 14 11 7 0 25 26 11 12 18 11 -20 7 7 -5 -21 -13 -16 -28 -21 -6 -14 -20 -4 1 -23 -23 -2 6 -6 0 26 6 -8 6 22 -5 0 8 -8 -21
2475 -21 -21 5 -21 -19 -5 6 -12 4 23 9 2 19 29 13 11 21 21 5 9 10 -2 -20 -2 -5 -16 -17 -5 -16 -30 -26 -8 -13 -34 -3 -5 -15
2511 -15 6 -3 -2 -3 1 15 8 7 6 4 -6 -14 2 5 -14 -10 -2 -15 -3 4 -2 5 10 9 17 18 15 25 13 5 5 9 6 -9 -3 -9 -20 -12 -21 -24 -24 -25 -25 -29 -32 -25 -11 -13
2559 -13 -8 -1 0 10 3 10 7 13 0 19 7 -5 -3 -5 -24 -21 -6 -15 -19 -5 4 -9 0 10 22 13 14 33 12 11 21 15 3 5 0 2 -3 -16 -8 -13 -28 -27 -29
2602 -29 -43 -28 -21 -23 -7 -10 5 -11 4 18 7 4 9 15 1 7 11 9 -2 -10 -3 -1 -13 -11 -6 5 -5 0 5 3 11 15 18 11 23 18 18 13 31 18 8 3 22
2645 22 1 -8 -7 -23 -35 -21 -28 -35 -23 -12 -13 -14 -12 7 11 1 10 1 18 11 17 6 5 3 5 -5 -11 -7 -8 -18 -8 -2 -7 -3 -9 -2 13 11 -3 10 6 22 14
2688A4Mmj1kOnj1Pj8nqJ1LKj1J8pkRKjK0kj0JJ1Qj0J0plk3RK1j4j4PQj0oK0%j5
2731hJ2ROj7J0J2k1OK1j4k6J0mj3j1J9%k4%J1Nj7J1K5jkJ6opKRJ1rJJ0k2nJ3K
2770A4k0J7Ok2nJ4%roK7nj0oJ7Mj7L6j0l2j2L7k0k2KK8j6k1NRj7NK6Qj8OJ8k0
2807ij1L6MpJJ9j0l4J0J8%k8QJ3j9pL0j8rJ7J4j9k0K5J1k3RL2j6k7J7J5k9oJ5
2842BJ2l3rJ9pj5J2J4j6j5K0J5pOJ5Jj4RJ2j8pK1Jk3kJ9Kl3J5K0j8k0K1mj4JK1
2879CJ8l9K5J0j9j1L6Ll7JK8j7l1QK5j8j3K5Jm1J6K7j4j4K4K2j7j5L1pj4RK6j5
2913A6j7OJ9k3pL7j1l6NK1k8k8M4J8k8j0J9Nj2OK9k1j1NJ9l5kK6Ml8J3J5k2j5
2947c7L1Pk8LL0mj9KL9pk7K2K7k7k1L4j8rJ2J0j7k3L0Jj9j6K0J2k0jJ5J1l5K4
$$ plain form
2688 14 18 14 3 1 7 2 -9 -2 -20 -25 -33 -22 -19 -17 -28 -10 -17 -19 -10 -8 -9 11 9 -1 0 11 19 9 19 12 9 -14 -5 16 2 -12 -5 3 -7 -13 7 7 -8
2731 -8 4 13 19 2 12 24 3 9 30 16 -10 0 -4 -17 -28 -9 -9 -33 -33 -22 -17 -34 -23 2 1 -1 15 9 2 4 13 24 15 16 26 4 -1 12 14
2770 14 -6 11 17 -5 -10 4 4 -5 -11 16 11 1 -5 12 16 -1 35 25 -7 -19 18 -2 -24 -22 6 -10 -31 -26 -17 -34 -29 -3 5 -13 -7 11 -9
2807 -9 -20 16 20 13 14 33 23 -11 -1 17 17 -11 -3 10 -9 -16 14 -4 -13 4 18 -1 -21 4 15 -8 1 33 17 -10 7 22 -7 -13 2
2842 2 14 -19 -28 -9 -16 -31 -19 -5 -21 -36 -16 -1 -8 -2 13 14 0 9 21 3 -4 17 18 -5 -7 12 14 -19 -4 16 -2 -22 -1 -5 -19 -18 3
2879 3 21 -18 7 17 -2 -13 23 26 -11 -10 18 1 -30 -22 3 -15 -28 -3 -2 -43 -27 0 -14 -28 -4 18 1 -14 17 10 -4 5 31 16
2913 16 -1 5 24 1 -6 31 20 -16 -11 10 -18 -46 -2 16 -12 -22 -3 2 -10 -4 25 4 -7 -2 17 -18 -20 6 10 -28 -15 0 -22 -37
2947 -37 -6 1 -27 -24 6 2 -17 -15 24 17 -10 12 39 12 -9 25 7 -2 10 20 3 -20 10 11 -8 -24 -4 8 -12 -13 2 13 -22 2
2981BJ1k1RNjj1LJ6ql1RJ2j0kJ8lj0JJ7k1%J6Rk2J8J5j7qPK7k0KNJ0j9kkjj7K3
3021Iqj6PMnj0NK7ml0J8J4j6mNJ3k1J1jmKKJ0k3jJ6nj9J5J2llJ3Klj8J4K4j6p
3061FJ9Jl6K3Qk3KPjoj1K0j2j8K5oj1j5L3Lj2kNj0%LJ4j6%J1j4%jK5Kk1%NrNJ
3102flOJ0JKj9J6PPj3Qj5PlmnJ0nMlmnqK3k2RqkLJ6j1j5J1%lPmQkK%jMlJ5j3m
3149eMJmj2J5PnpJ1J1mmLj4lJ7mrRJj6lK3k2JmJ0j3nJ1pnMPrmK4Nk1J6J1%qLJ
3194GlJ%j1kJJ4oLQloMKNjrJ5j6J8k4O%rJ2j9K2j2nJ0j8Jj0LQN%JPqMJ1oJOoJ
3241BLj1MJ2j3OKkj2J8nJK%%mLKKj0kJ3MrqJ8j0j9JQj3KnNJkkNrLJ6nj3L0lnj
3288@K1j9n%Pl%OMk4J6Jlj2J6J3k4%MJ0%kMJj4J5J1k1pK6k1j4jJ6k2pNJ2j3Ok
$$ plain form
2981 2 13 -8 1 6 5 -6 -3 13 5 -26 -17 -5 -15 -17 1 -2 -12 -11 6 -15 -15 1 10 -12 6 21 4 -4 3 30 10 12 17 27 8 6 4 3 -14 9
3021 9 1 -15 -8 -4 -9 -19 -14 13 9 -21 -3 11 -5 -9 -4 9 -12 -1 -2 -6 -4 -2 8 -15 -16 0 -5 -24 -9 3 0 -3 10 12 9 -9 5 29 13 6
3061 6 25 26 -10 13 21 -2 0 7 6 0 -11 9 -3 -21 4 -2 -13 -28 5 8 -4 -6 -1 -11 -11 -8 6 -10 -10 1 -13 -13 -14 11 13 -8 -8 -3 -12 -7 -6
3102 -6 -9 -3 7 8 10 -9 7 14 21 8 16 1 8 5 1 -4 6 1 5 2 -2 -7 -15 8 -14 -5 -13 -15 -12 4 -7 -22 -11 -11 -14 -7 -11 -3 -5 -3 -3 -4 0 -3 12 -1 -5
3149 -5 -1 0 -4 -16 -1 6 1 -6 5 16 12 8 11 -3 -6 11 7 -2 7 8 -8 -11 12 -10 -9 -13 -3 -16 -21 -10 -17 -22 -18 -11 -20 -24 0 5 -16 0 11 11 3 6 7
3194 7 4 5 5 -6 -8 -7 7 1 4 12 9 3 7 9 14 13 4 19 3 21 -3 3 3 -6 6 -13 9 -3 -8 2 -16 -15 -25 -22 -14 -9 -9 -8 -1 -9 -5 6 0 1 7 1 2
3241 2 5 -6 -2 10 -3 3 5 3 -9 9 4 5 7 7 7 3 6 8 10 0 -2 11 15 6 -2 16 6 -13 -12 -4 -17 -15 -20 -15 -14 -16 -18 -13 -22 -19 -3 -8 -21 9 6 1 0
3288 0 21 2 -3 -3 4 1 1 7 11 -13 3 4 1 -11 5 18 -6 -6 -2 8 8 6 10 11 -3 12 23 2 -5 21 0 -14 -15 1 -21 -28 -23 -11 -24 -18 -20
3329b0QmJK2j7J6RmmOQoj0j2J7mKKprmRnjNPmj1J4Mj4J8QNk0MNrj9K5k4mPL%k4
3375c1RJ4j3QNNk2J8K6j2rOK1j3oOkk0J3J5k8j5K1J6k6kJ5J9m0J3J1Mk9L7Oj8
3411BJJ3Pk5LK0k1j5J0jj4k3K8Mk1oK3Qk0J7J3kKkK1k4J5J1qlQlqoJ3%j5Jljq
3452inK1j6qK5lj9J0K1j6qK9jl2jN%j0J4r%j5J0lj6J1K4jj4J4J7k1OJ5J0%j5R
3490A9j0pJ0K0j6j3J5k6p%J6Jj2NJ4j0k0K9j0kJ5J0k0j6J1J6k3oJ9%k6JP%j2R
3526a9J5j4LJ5lOj0K7Lj6%J5qj5K0Pk1mjlj5J4J0j4j8J9J0j0kJ3MpJ2jj5MJJ6
3564A8k5oLJlpJ2omJ0Lj2LJ6KJPqPMjJnJ2klJoj0MqKJ0k4nJ6lj8J9QorJ6qQpJ5
3611A3nlPk0j1LJ3nqKjj4J2qJ7JMJ3j5KJ9OkkJ2Lk1nQj1NlJj6pKJ2j2%J7ppNP
$$ plain form
3329 -20 -12 -16 -15 7 -10 6 15 11 7 13 21 15 5 -7 10 6 8 10 3 -6 -10 -1 -6 -7 -2 5 1 -10 4 8 -6 12 20 25 5 9 14 5 -14 11 -13 -17 -10 -7 -7 -31
3375 -31 -22 -8 -21 -13 -8 -3 -25 -7 19 7 -2 4 25 12 6 12 10 -10 3 18 -10 -25 -4 12 -14 -16 -1 18 -22 -9 2 6 -23 14 20 2
3411 2 3 16 23 -2 1 21 0 -15 -5 -6 -20 -43 -15 -11 -32 -38 -15 -7 -27 -10 3 1 3 1 22 -2 13 24 16 13 21 18 10 4 17 17 2 3 0 -1 -9
3452 -9 -14 7 -9 -17 8 5 -14 -4 17 1 -7 22 21 -11 -12 -7 -7 -17 -3 -12 -12 -27 -17 -20 -36 -25 -1 -2 -16 -2 15 -6 0 15 25 25 10 19
3490 19 9 2 12 32 16 3 18 -8 -15 -15 1 2 -10 -5 9 -1 -21 8 -2 -4 11 21 1 -15 -4 12 -11 -17 2 2 -24 -23 -16 -16 -28 -19
3526 -19 -4 -18 -15 0 -3 3 -7 20 23 7 7 22 14 -1 19 26 5 1 0 -3 -18 -4 6 -8 -26 -7 3 -7 -9 4 8 1 13 12 -3 1 2 18
3564 18 -7 -13 -10 -9 -12 -19 -7 -13 -17 -7 -4 -16 -13 3 5 6 13 5 12 16 15 16 11 23 21 18 19 13 3 7 -1 1 11 -13 -18 -2 -5 -23 -4 4 -2 -11 5 -3 5 -2 13
3611 13 8 5 12 -8 -19 -16 -3 -8 -16 -14 -15 -29 -17 -25 -8 -7 -3 10 -5 -3 16 22 20 18 30 33 12 7 15 4 9 6 7 -9 -16 -14 -2 -14 -14 3 -4 -11 -6 1
3655AOj1KJ2lLpkKk2LJ0j1Oo%lKQj0J2qJ4lJ0RKJnM%Njkj5nJ0rjMj1oPj3LnJ5
3702hQjj1QJ0j7JRmJ1Kj0Jj1lnKJjj3LQNJ7moJ6qRJ0mN%oRk7J5kqj1NlqMom%K1
3750aqmJ1Rj5lPOj0QPj0kQkj0J1rj0klJ8pknJ2RJMjPKPj0LJroKMkj2okkQrMlr
3800b5J4%%OnJ9j7MJ1or%NkmMPjj8J3kJqkJ7mNmKQMjj0nJ9qj0lJ0nr%JLnoMJQ
3849cnjKlkMQmrQLJqO%JmJ%nnQkQ%J6j0j2J6pOlJ1pjkRj7PLj2nQNj1kJQnqJ2k
3901cmpK0j7kjJ2j2qK6Oj3lOOk1mJ6J2qnO%KKPj5J5jJ0j5Rj0nj0J3Prj2J5rmO
3944bnj5OJ2oOj2Q%J2j5QjoJ6j1lMNqLJ2j1j0J6lloJ7KOj8J9pj2J5%j3MOMk8J3
3987alknNJ2k5OrJ5qMNrjpJ2PqK0jrk0K6koPkOj8LQlNJ2mj5OK%pOLKj1K5rk2O
$$ plain form
3655 1 7 -4 -2 10 7 10 3 1 3 -19 -16 -6 -17 -11 -17 -17 -20 -18 -10 -20 -8 -16 -2 -5 5 14 16 17 12 16 16 21 20 18 3 -2 8 -1 -2 2 -9 -15 -8 -21 -18 -23 -8
3702 -8 0 -1 -12 -4 6 -11 -10 -1 -5 6 8 -2 -1 -12 -15 -20 -18 -17 -18 -31 -28 -20 -15 2 -2 -8 8 0 9 19 15 20 20 14 23 -4 11 9 1 -10 -5 -8 -16 -12 -18 -22 -22 -1
3750 -1 -9 -13 -2 7 -8 -11 -4 2 -8 0 7 -3 -5 3 1 -9 2 -7 -17 -19 -22 -4 -11 -13 -18 -6 3 4 8 7 14 16 23 13 16 17 8 2 4 8 6 -6 -12 -14 -16 -8 -17 -13 -16 -25
3800 -25 -11 -11 -11 -5 -10 9 -8 -4 7 1 -8 -8 -3 -5 -9 -5 2 1 -17 -4 -6 -5 -13 -15 2 -2 3 -1 1 9 13 12 2 -3 16 8 -2 -5 5 0 -9 -9 -8 -5 -10 -16 -12 -11 -3
3849 -3 -8 -9 -7 -10 -12 -8 0 -4 -13 -5 -2 -1 -9 -3 -3 -2 -6 -5 -5 -10 -15 -7 -9 -1 -1 15 5 -7 9 2 8 5 16 9 8 6 15 -2 5 8 -4 -9 -1 4 -7 -9 -8 0 -5 -13 -1 -3
3901 -3 -7 -14 6 -11 -13 -14 -2 -14 -22 4 10 -3 -6 0 6 -15 -19 -3 9 1 -4 2 2 4 6 13 -2 13 12 22 7 16 6 1 -9 4 11 2 -10 5 -4 -8 -2
3944 -2 -7 -22 -16 -4 -10 -4 -16 -8 -8 4 -11 -3 -4 -10 6 -5 -8 -4 1 -7 -4 8 -3 -13 3 0 -3 -9 8 10 16 -2 17 10 -2 13 13 0 4 10 14 -14 -1
3987 -1 -4 -6 -11 -6 6 -19 -13 -22 -7 -15 -11 -6 -15 -16 -23 -11 -4 -12 8 7 -2 -22 4 2 -4 3 1 7 -11 -8 0 -3 2 14 10 -5 1 3 3 -4 2 5 7 -4 21 12 -10 -4
4035dJ1ojmJ2k0jJ3j1p%J5j2mJ9ppPJ2jj3QMjj3J3%nRj3J3%jOj3%LQj3J9mlj4
4078fRJ1k1J2Ljj0kJ7j7JLLn%nooJ0Pmj3J1Oj1KK1lroJ7j2JkPmlQJ4j8nK6j1j2
4122cKNoJnJ6j8oJ5Lj2NJ1Nj7J2lroJ1Ml0J3lJ3nKmjRNkj5J4NoLnRjJMPNpl%p
4170F%Nj6J4n%j1mJ5j1pJ5LjJkknnRkj3J7j3Qj0MrQMLmJKLlRmLMJ0qJ0jj1J0j
4217A6Jj0mj%pkJ0NlpojJ1Koj2J5j6J4rPmomPRqNm%lJKjJ0oKNnNNj2K4qQkj4O
4266IrNQj4lQj0Rj3PK%Nj8J0Mo%MkLj1J1Mp%M%Nnm%%%NmLqJ5KLOj5QPpQj3MlJ
4317Hj5O%jLJj0K1j7oPNomMKm%nQnQjj2NKJ0k0MJ2j3J8j8OJPkjLJ5rNnRrqJ2l
4365HpJ4j1j2J4j8MM%pK2j0%j0J3qNRpmJloJ3Jj2J1nRj1KpJ1pKPqJ2J0Pj9J0n
$$ plain form
4035 -4 7 1 0 -4 8 -12 -13 0 -11 -18 -18 -3 -15 -19 0 -7 -14 -7 5 4 -9 -1 3 2 -11 2 2 -3 6 -7 6 6 5 11 -2 -2 1 9 -4 15 11 8 -6
4078 -6 3 14 -7 5 8 7 -3 -5 12 -5 -4 -1 2 -3 -3 -8 -14 -20 -10 -3 -7 -20 -9 -3 -14 -12 9 6 -3 -9 8 -4 -3 -5 2 -2 -5 3 17 -1 -6 20 9 -3
4122 -3 -1 4 -2 -1 -6 10 -8 -14 1 4 -8 -3 8 13 -4 8 5 -4 -10 1 5 -25 -12 -15 -2 -7 -5 -9 -10 -1 4 2 -13 1 6 0 3 -2 7 6 7 11 18 23 16 13 13 6
4170 6 6 11 -5 9 4 4 -7 -11 4 -7 -14 1 4 3 4 2 0 -5 -10 -1 -3 -16 1 -12 -4 -14 -10 -19 -11 -7 -4 -8 -7 -5 -2 -5 4 0 3 7 17 9 19 18 7 17 16
4217 16 17 7 3 2 2 -5 -7 3 8 5 -2 -8 -9 2 4 -2 -14 1 -15 -1 -10 -3 -7 -13 -17 -10 -1 -9 -4 -8 -8 -11 -10 -8 -9 1 -5 -3 2 -3 2 7 -5 19 11 19 17 3 9
4266 9 0 5 13 -1 -4 4 -6 3 -10 -3 -1 -1 4 -14 -4 0 -6 -6 -2 -4 -1 -12 -1 3 -4 -4 0 0 5 0 -4 -4 -4 -4 1 -3 0 -8 7 9 12 18 3 11 18 11 19 6 10 7 8
4317 8 -7 -1 -1 -2 1 2 -8 13 -4 -10 -3 2 -4 -8 -4 -2 -6 -6 -11 -3 -8 0 -1 -13 -8 -6 4 -16 -12 0 -13 5 -13 -7 -6 1 -1 -2 1 16 7 12 7 16 7 -1 11 8
4365 8 1 15 4 -8 6 -12 -8 -4 -4 -11 11 1 1 -9 4 -4 1 10 3 -1 0 -3 -9 4 5 -7 4 -1 8 -3 -1 -8 3 -4 -2 5 -3 9 19 26 7 17 12
4408A2J1nkM%j4kJ8j9njJ%kpJ4m%MjkJ2rj6LMNmJ0j5J6Nj8J7pnlKmJ4nJ0JpPl
4454A0RKMlj1Jj%j6K1nj1j0J9k1J2Lj0pRLmoJ3Oj8OMolOOjMmKNj0KkPj1rJ9ML
4500A1KrNJLlQ%oj2J5mpojOj2kPrPj1QQmmJ2k3J2J2j0qJ4qOPj1OrMNoOlJ1nj8
4547a5J5PmMljJOJ5j7%KJj5OMpknJ1oqJ1omRj3K0j6lRLJmMpLJ7pJMmJ0k3P%nM
4595@RpPoLL%kL%oJLllMKj3J2JoNMkj2lmqLMmkJ3nJ2pKkJ0JqOknjoJ6rNJkPoJ5
4649A8j3LPLnqJ%%lRJrJqRj2PnlNnlLkoQQj8J1lK3j3MMoqlJ4mj2QJ9j3%kMnJ1
4698A2Pjj6Rj1KlJklKRjrlMoLRkojpN%%RmjMj0PkJ1Jj0Pn%lQPj1OJ1j3Rj2J0r
4748BlJ1KoKLj0nJ4pjj2J0jrMLpkPRj4NjlLONLj2PNk0RJ2pRj6J2oKlORqPqNmn
$$ plain form
4408 12 23 18 16 20 20 6 4 22 3 -2 -3 -2 -2 -4 -11 3 -1 -1 3 2 0 12 3 -13 -10 -6 -1 -5 5 -10 6 11 -7 10 3 -2 -5 -3 -7 7 2 12 13 6 13 10
4454 10 19 21 25 22 11 12 11 11 -5 16 11 0 -10 9 -12 0 3 -7 -14 -5 -2 -6 -12 1 7 -11 -5 -1 -7 -10 -4 2 1 5 1 3 8 -2 0 -2 5 -6 -15 4 8 11
4500 11 13 4 9 10 13 10 18 18 12 0 15 11 4 -2 -3 3 -9 -11 -4 -13 -6 -17 -9 -1 -5 -9 3 -20 -8 4 -6 -14 0 -8 -2 5 -6 0 -9 -5 0 -6 0 -3 8 3 -15
4547 -15 0 7 3 7 4 3 4 10 25 8 8 10 11 -4 2 6 -1 -3 -8 3 -3 -11 0 -6 -10 -1 -14 6 -10 -13 -4 -1 0 -4 0 -7 -4 13 6 7 11 7 17 -6 1 1 -4 0
4595 0 9 2 9 3 6 9 9 7 10 10 4 5 8 5 2 6 8 -5 7 8 2 7 11 9 -3 -6 -10 -18 -15 -11 -15 -17 -4 -9 3 -4 -2 -4 6 7 -1 5 3 -2 -3 -9 7 -2 3 4 2 9 3 18
4649 18 5 8 15 18 13 5 6 6 6 3 12 13 4 5 -3 6 -6 1 -4 -7 -2 -7 -10 -7 -9 -15 -7 1 -17 -6 -9 14 1 5 9 3 -5 -8 6 2 -10 -2 17 4 4 2 6 1 12
4698 12 19 18 2 11 0 2 -1 0 -2 -5 -3 6 5 -4 -7 -3 -9 -6 3 1 -5 -6 -13 -8 -8 -8 1 -3 -4 0 -10 -3 -5 6 7 -3 4 -1 -1 -4 4 11 0 6 17 4 13 1 11 2
4748 2 -1 10 12 6 8 11 1 -4 10 3 2 -10 0 -1 -10 -6 -3 -10 -12 -5 4 -10 -5 -6 -9 -6 0 5 8 -4 3 8 -12 -3 9 2 11 -5 7 1 3 0 6 15 7 14 6 11 7 2
4798BPoOoQmpOj6K0okNrNpoRoKj0PNjJOPlKn%jJKNkjjkjMJ6oj0J9j3nMj7J3j1
4849bRqlJ2kOj3Mj2PpmKRmmKJPopOJJNrO%P%lJoRPmOqQmPnlRmJj7J8ojkqlPnj
4905cmQ%nkoJ1ooJ2qMPmlJ5kpLnpNKOjLOnlQK%mJNj8QJkkrkJ2rPJRj2jNkjj0J4
4959Fjj2%N%mNKkj6J3mPRkNk5L3k1JQrMNkkONojlKMqKNj1J9k1PmrNJ9j0%ppQl
5009eRj5LkJ1j2OJ1qkkRPqLjMJmPj0jQLKj3QmPlmLqNNj1NKj3RqJkJ3Nj7j%Rj3
5059a1%NmKRQj1jJJ4j1lKLQoKLJQj3oQJ5klj5J3j5M%LpJ0rRnj7K2p%qJ3j7nJ2
5105aoLqNJ9k1M%LlPMmOnKj%RnKJnQnQj0LnPjjkoLj5J7j5LMLj5PPqnKJ8j4nJ6
5156EpMlM%JLLj0kQNj3NJLj3J1lKMJ4rpRKJj7NlokPj1J0pLkPj3Rj2oJ1J3k2Lj
$$ plain form
4798 2 9 3 9 3 11 7 0 6 -10 10 4 2 7 -2 3 -4 -10 -1 -7 -5 -15 -8 -3 -4 -3 3 10 7 9 4 4 3 4 6 11 9 8 7 5 4 8 24 18 8 27 14 9 13 -4 9 -2
4849 -2 7 -1 -4 8 6 12 -1 3 -9 -2 -9 -13 -11 -2 -6 -10 -8 -7 0 -6 -13 -7 -6 -5 0 -9 -3 -3 4 4 1 2 -4 5 12 8 14 6 14 10 17 12 9 18 14 15 -2 16 10 9 7 -1 -4 3 -2 -3
4905 -3 -7 1 1 -4 -6 -12 -1 -7 -13 -1 -9 -5 2 -2 -5 10 8 1 4 -1 -8 -3 -1 5 4 7 13 8 5 13 15 15 11 12 17 -1 7 8 6 4 -5 -7 5 -4 3 4 13 1 0 5 3 2 -8 6
4959 6 5 -7 -7 -2 -2 -6 -1 1 -1 -17 -4 -8 -1 8 6 11 -14 19 -2 -1 7 -2 2 7 5 3 9 14 8 7 4 6 10 2 4 9 -2 17 -4 3 -1 -10 -5 14 4 4 -3 -10 -2 -5
5009 -5 4 -11 -8 -10 1 -11 -5 6 -2 -4 -6 3 10 2 5 4 8 9 5 12 2 1 9 12 14 1 9 5 12 9 5 8 0 5 10 -1 4 6 -7 2 -6 -5 -7 6 11 -6 -7 -7 2 -11
5059 -11 -11 -6 -10 -8 1 9 -2 -3 -2 12 1 -2 0 3 11 5 7 10 11 19 6 0 8 23 21 18 3 16 1 5 5 8 1 11 2 11 6 -11 11 4 4 -4 9 -8 -13 -1
5105 -1 -7 -4 -12 -7 12 -9 -5 -5 -2 -5 2 6 2 8 3 5 4 4 13 8 10 11 6 14 9 17 7 10 5 12 11 10 8 2 5 -10 7 -8 -5 -1 2 -13 -6 1 -7 -12 -10 8 -6 -11 5
5156 5 -2 2 -1 3 3 4 7 10 0 -2 6 11 -2 3 4 7 -6 5 2 4 8 22 13 6 15 17 18 1 6 3 -3 -5 2 -9 1 -6 -3 -5 2 -11 -2 -14 -20 -9 4 -18 -15 -16
5204a6J6Rj1MKj0J9j2jPo%KMpjLQj3NJ0kOo%kkJRpnnNpKkjnJmKK%%kJ1k%lMjR
5256HNkMnj3J4olNj1J1k%M%j4J6KJljJQj1Qlj7LJ5mj6J3J0j5nkNjrJ5k0NkJ4p
5301elkJ0mmJ3NrJ5j2pOJ0j0PjLj2RRj0qJ9Jj5jKMqMjJ2oqkJLmrLMKj3MOJMk1
5349a8PJ7j3NJNnlJ8j1PnQOk5J4PJrJ7j5jNjJ0j0rJ2oj8J5jJj1PjKlj1J2j1Rp
5392hrKNkMQj4J0MQpOj6PKlmJ5nnRlKKJ0KLoj0O%j0JoJ4j5J6k1J4oMpj3J6j0P
5438cj4M%RmLlkJ3mKJPpMkkqNMJmOoMJrJ3mmj2K0pJ3j3J0j6LrQMO%j4Mmj%j5J1
5488a1QrnPrJ0KkQmNNnjJ0j0Rj6J0llQjqKJ3lRJ%j9QmJ0k3PLJ8rKj0pJ2qkJ0j2
5535glklKMmnJ2MqOnJ7rL%pJ4rNnOpJ4j8NLJ0Jj0JQjlmoKMqLj0MQjo%KJj6J0N
$$ plain form
5204 -16 0 9 -2 2 4 -6 13 1 0 7 1 1 3 7 0 -1 2 10 -3 2 12 10 16 10 10 8 6 7 16 9 4 -1 4 -3 -1 -3 -4 -9 -8 -12 -10 -8 -8 -8 -10 1 -1 -1 -4 0 -1 8
5256 8 13 11 15 10 -3 11 5 2 7 -4 7 5 5 9 9 -5 11 13 14 11 10 11 19 8 16 13 -4 -1 14 10 -6 7 17 2 -3 -5 0 -1 -10 5 -15 -10 -12 2 -5
5301 -5 -8 -10 0 -4 -8 5 10 1 16 4 -3 3 13 3 10 9 12 0 9 18 8 0 19 20 5 4 6 10 2 6 5 17 11 3 1 2 5 1 -8 -5 -1 1 -12 -8 -2 -1 3 -18
5349 -18 -11 6 -7 -2 -1 4 -1 -4 14 3 10 5 13 19 -6 8 15 16 7 24 9 8 13 12 22 12 3 15 9 -9 6 5 6 -5 2 1 3 0 -11 1 -10 -1 -8
5392 -8 -17 -15 -10 -12 -8 0 -14 -4 0 8 1 7 -9 -2 0 -3 -7 8 3 -2 7 4 6 8 18 20 23 17 7 13 13 3 4 -2 12 -3 13 -8 6 0 4 -3 -16 0 -10 -3
5438 -3 -17 -13 -13 -4 -8 -5 -8 -10 3 -1 1 2 9 2 6 4 2 -6 -1 3 4 0 6 0 4 5 -4 9 5 1 -11 9 2 15 2 12 -4 -1 -10 -2 2 8 8 -6 -2 -6 -7 -7 -22 -11
5488 -11 -3 -12 -17 -10 -19 -9 -7 -9 -1 -5 0 5 0 -1 9 -1 8 -8 2 -1 -4 4 3 -5 -3 10 7 16 17 17 -2 6 2 12 -11 -4 -1 17 8 10 0 -7 5 -3 -5 5 -7
5535 -7 -10 -12 -15 -13 -9 -13 -18 -6 -2 -10 -4 -9 8 -1 2 2 -5 9 0 5 0 6 -1 13 -5 0 3 13 14 4 5 13 12 9 5 -1 1 5 -3 0 -10 -6 2 1 -5 -5 -3 -2 -18 -8 -3
5586cJj1NkOnNJMkOnNpKMMlk%OkonjJ1JnpK0j1joNj0J7pqQJmJj3KlPLjj0%KNJ
5639gljJNJMlJ6j8KJ4llNj2MoOPKjnJ9k4nJ8j1rJ1oJ5j0JlLJj1MJkJ2j3knMJJ1
5686EKj1QrKLqNmJ3%Mmj3ORNj3%J4nJoNrOLJlJPk3RKmJoMPrkoONoLmrRMMjLJp
5741dJ5Npj0LLQRrnmOkjkQpJ%Mj3JQrMPmRk0J0Nj3QmJlmljOmjMjRKj3J7oPmJ5
5793B1nj4kJ9j3%LMPj2OkMkpqqJ9l%j3RoQJPnjjj5QjoNqkJ4pokJ1Jjlj0J1LQm
5842BJMkRlLL%ppPj5PKnOpK0k4OJ5j6kJ5j0Oj0KjkLj0J5j5jJ2kljpRLPmjOj1J
5890bPMKNkmKRjjj0Nj2J2j0LjnKNk0MMMPpL%%pRk0PlJ5j0J1mmJ2j6oNoJ1qJ6K
5938G%qJ2jJ0prJ2pMPj9LJ2j1okOmJ1r%lPmj1QLqJOpLMmqKPlQokJOKoMRrOJ5j8
$$ plain form
5586 -3 -2 -13 -8 -10 -4 -9 -4 -3 1 -1 5 0 5 -2 0 4 8 5 3 3 9 7 1 -4 -5 6 7 2 -5 15 4 3 -3 2 -8 9 2 -6 2 3 -1 0 -13 -11 -14 -7 -4 -5 -15 -15 -13 -8 -7
5639 -7 -10 -11 -10 -5 -4 0 -3 13 -5 -3 11 8 5 10 -2 2 -4 2 9 11 10 5 24 0 -5 13 2 -7 4 -2 13 3 4 1 4 5 -6 -2 -1 -3 9 -4 -6 -11 -7 -6 5
5686 5 7 -4 4 -5 -3 0 -8 -3 -7 6 6 10 6 -7 -1 8 13 0 0 14 9 10 4 9 0 6 9 10 7 8 15 -8 1 3 -1 0 -6 -2 5 -4 -6 -12 -6 -1 -7 -4 -8 -17 -8 -4 0 -1 2 3 -4
5741 -4 11 16 9 -1 2 5 13 22 13 8 4 10 8 7 5 13 6 7 7 11 -2 -1 7 -2 2 9 5 14 -6 4 9 -4 4 0 1 -2 -6 -9 -10 -4 -8 -9 -5 -6 3 5 -8 9 3 10 6 21
5793 21 16 2 0 19 6 6 9 13 20 8 14 12 16 14 7 -1 -9 10 7 7 -6 3 -3 5 6 13 8 7 6 -9 -1 -2 -8 -3 -11 -13 1 -6 -12 -14 -3 -2 -3 -6 -16 -5 -2 6 2
5842 2 3 7 5 14 11 14 17 17 10 3 10 -5 2 4 -1 5 -2 18 -6 0 15 -1 -3 12 2 8 -2 0 -1 -3 0 -10 5 -10 -11 1 -1 -4 -5 -12 -3 0 7 3 2 8 -3 -2
5890 -2 5 9 11 16 14 10 12 21 20 19 9 14 2 14 4 7 6 1 3 8 -12 -8 -4 0 7 0 3 3 3 -4 5 -15 -8 -11 4 -6 5 1 -3 9 -7 -13 -8 -14 -3 -11 5 7
5938 7 7 -1 11 10 20 13 4 16 9 13 20 1 4 16 5 -1 -3 3 -1 10 1 1 -2 5 1 -10 -2 1 -7 -6 0 -7 -4 0 -4 -12 -10 -3 -6 2 -4 -6 -5 1 3 -3 1 10 1 7 22 4
5990DLoPJnLJ1qQj1%%j1MjLOj1MPpL%qJoJ8j4JPj2lJ8rmJ3rJ0oJj7J6mP%%M%l
6039EQJkPoJ2%qpmKmoJlMpONRqnNm%oJ0j0%LJ%JOmjml%Qj0KKP%JmRLJPpJ3j2l
6094A1J3rPpmLj3J1lmj3QrJ2Mj7J3%J2j9%JJKjlJ4j3KoMJ1r%jlPMLjoOJ5Mj1K
6140A8Nj1MmKjKmPj5NJj1LpPj4NROljnKmMJoMLJ0j8OmJ0kOKj6klNJ0kJ7nrNNr
6190HjJll%J0j1%j2LJ6qOj8JL%oRjLMpNRqlPPj2J1qj2PMMqLlmMJ5j0J1nOj0J2
6238A6Rj1Mj0mK%j%Poj2NOj0mJ1lnpKNMmMMj0MlRpNjmNRj3J1qnJ0%Qj1JjKKJJ2
6288A8j3KnPnoJ3pj4J6lNj5NQj6LjKj2%J1oJ2%PolJ0rQJJJpLJJjkJOknKj7K7o
6336A0NRj1j0qJ0J1p%oqlJ0j9QRok%NnJ4j1lJ2J%pOjqJ8j0%J1Pj2knoM%J2LLj0
$$ plain form
5990 4 7 1 8 9 4 7 18 10 18 7 7 7 -4 0 -1 2 8 -3 1 8 1 4 4 -4 -3 -9 9 -5 -4 3 -9 -12 6 -3 -7 6 -3 7 1 2 -15 1 -3 4 4 4 8 8 5
6039 5 13 14 12 19 13 25 25 17 10 6 8 4 -2 -1 -4 0 -7 -1 4 13 5 0 5 1 1 -5 5 -5 -5 -2 -1 -1 0 6 2 1 -3 -6 -6 2 -8 -6 -4 3 3 4 0 9 12 13 20 13 26 14 11
6094 11 24 15 22 15 11 14 1 12 9 5 -8 0 -9 3 7 -10 3 3 15 -4 -4 -3 -2 0 -1 -4 10 -3 -1 -7 -3 8 -1 -1 -2 -5 2 6 9 8 2 8 23 27 16 18
6140 18 23 12 16 12 14 13 15 11 18 3 8 9 -2 1 -6 1 -13 -8 1 7 4 3 -2 0 -4 0 1 -5 -1 2 12 -6 0 -4 6 4 10 12 -4 -6 -9 -4 6 4 21 16 7 12 17 8
6190 8 7 8 5 2 2 12 1 1 -11 -8 8 0 6 -12 -11 -8 -8 -14 -5 -6 -3 1 -6 -1 8 0 -3 4 11 -1 10 2 -10 -3 1 5 -3 0 -3 -7 -3 12 2 13 8 14 4 16
6238 16 25 14 18 8 4 6 6 5 5 12 6 -6 -1 5 -5 -9 2 -1 -6 -13 -11 -6 -2 -6 -2 2 -8 -4 -7 2 -5 0 -1 -5 0 9 -4 7 -1 -6 4 4 12 1 2 1 3 5 6 18
6288 18 5 7 2 9 4 -2 11 4 -10 6 3 8 -7 -2 6 -10 -7 -8 -6 -18 -18 -7 -13 -1 -1 6 0 -3 7 -2 6 7 8 9 2 5 6 7 6 4 5 11 9 4 6 -11 16 10
6336 10 15 24 13 3 -5 5 16 9 9 3 -5 -8 2 -17 -9 0 -6 -8 -8 -3 -8 6 -5 -8 4 5 5 -2 4 3 -5 13 3 3 14 21 9 7 2 -4 0 0 12 15 18 8
6382HMknjmONMrJ1rJnpMmQmoLJ0j0lnRk%jJ6j2RrJmJ3nj0J3l%NLqjJ4qPnKqKn
6434CJJ1j2nQjljNK%ppJ4j1MklJ%Ln%O%J4rkMjlKljOnJ0j3J1Nmj6J5lJ1j0j5K1
6482A5rPj0jJ3pkJ5j4jllJ6rj1kJ0j4KlPpRNOj0QjqJ4o%rK1j8Q%nOj0RkJ6poK
6528A1lMj0J2j1J5qLj1%JNj1J4qo%%Qj5j2J3%jPNoJRnlQmkQpPjoJ1NmjoNLj0J
6576EjO%jOj1rJ6oMKj1J6j2qRj0Nj2QK%JKj3J0kmRJJ2k2O%J5Jj1J5klmQMqjmJ0
6623A8koQk5K0j1nMlqLNlJ8j9M%Oj1OKj0KPoRjmQkpMoPoNlQLNqLK%J0k0J2rMn
6673COjj2lNlLoNj0J4mQoknMKKnmnmJ3LqQjKJPKorOj0J3J1rMJnMNmQj1P%lj9J0
6725BPqNJkJJnPpnlnKj1LJ1qMMpJ4pJ1Kj1JpJ0nJ0mqJ8j2J2JplLRj2jMjOnqNp
$$ plain form
6382 8 12 10 5 4 0 6 11 15 6 17 8 9 4 -3 1 -3 5 1 -5 -2 8 -2 -5 -10 -1 -3 -3 -4 12 0 9 0 1 -3 10 5 -5 8 5 5 10 13 5 4 18 10 17 12 14 6 8 3
6434 3 4 15 3 -2 6 5 2 1 6 8 8 1 -6 8 -3 1 -1 -4 -3 -3 0 -5 -5 1 1 15 6 4 8 7 4 6 3 2 8 3 13 0 11 16 12 -4 11 8 19 9 -6 15
6482 15 6 13 3 2 15 8 6 21 7 6 3 0 16 7 -4 -6 4 -10 -8 -11 -4 -11 -2 3 9 -1 7 6 -2 12 6 6 -3 18 0 8 8 3 9 -1 8 6 22 15 9 11
6528 11 8 12 2 14 3 18 10 13 2 2 3 8 -3 11 3 -3 -3 -3 5 -10 -22 -9 -9 -10 -3 2 -4 -3 6 1 -2 6 2 0 8 1 8 7 1 12 17 13 12 6 11 14 4 5
6576 5 4 10 10 9 15 4 -5 11 5 9 11 0 16 4 -4 5 -5 0 -12 -4 -2 -2 -1 1 -12 -2 -4 -8 1 2 14 -8 -2 -2 13 14 3 18 16 13 9 17 21 13 12 8 18
6623 18 16 10 18 -7 13 2 -3 1 -2 -10 -7 -2 -5 13 -6 -2 -2 4 -7 -1 1 -9 -7 0 -6 3 2 -2 6 4 -3 1 -5 2 -4 1 -2 6 9 14 6 9 11 11 21 1 13 4 8 3
6673 3 9 8 -4 -7 -2 -5 -2 -8 -3 -13 1 -3 5 -1 -3 -8 -4 -2 0 -5 -9 -14 -18 -5 -2 -10 -2 -3 -1 0 7 9 3 -6 0 -10 3 14 5 9 10 5 9 14 10 18 7 14 14 11 -8 2
6725 2 9 1 6 7 5 6 7 2 9 2 -3 -6 -11 -9 -20 -17 -6 -14 -10 -6 -13 1 -6 5 7 -4 -3 -10 0 -5 5 1 -7 11 -1 11 12 5 2 5 14 2 1 5 4 10 5 -3 2 -5
6775elPlJ3kJj2knMLOqmLjRoll%jQpR%JOmnPJ2j4OJ3oj0RLmlrNJ2oj5LQj0JkJ5
6827A1j2KKp%KJKojkOj4NJ0JLqRqRrkJ0MlQooJ1mJJ4j8J4qmMj0jLjKj0Mn%J2p
6876bN%mrJL%J3j1%%OKkqPLqMM%Npj2MKL%jJ5jlQj6JNLj3J7pPmmlj1MKjjJ3j1
6927bJMpj3LJ2Oj4NnONjJ2ppJ3j9Oj4K6ljjJQ%rRRj3OKJj6qMJ0Nj6J2j4KPpkJ7
6974A3j3Kjj5J8j5KOj2QOj6RMKpoJ1J7k1OqOMKklJ3j0Q%j%jj3PLjLnLp%lJ1mj0
7021a0J3mNj0lMkjnOJ1j7LJ0JkjrQOmJ0j0lJ2j4J1QnLJomJ5j2NjPrOpmLj5K5j1
7067Dn%PqmOrLnmJ4j1NlJlNQLJj2NLrJRmoJ2oMOJ4j3M%jn%pMoQmPj1Mj1OpmJ3
7119arJ1jrKj%LnJKJ1Mj6NJ1j5mQjJLKOj1RjoK2rPj5J4j5%Olr%J1kj0LJ1j3kK
$$ plain form
6775 -5 -8 -1 -4 9 7 8 -4 -6 -11 -7 -4 2 -6 -10 -7 -8 1 -5 -8 -11 -11 -12 -4 -11 -2 -2 -1 5 1 -4 3 15 1 7 20 14 4 13 16 12 9 0 5 17 11 -4 -1 7 -3 -2 -4 11
6827 11 -1 1 3 -4 -4 -2 -1 1 -5 -6 -8 -2 -16 -11 -1 0 3 -5 4 -4 5 -4 -6 4 8 5 13 7 1 12 8 9 23 5 19 11 7 11 1 0 3 2 4 -6 -2 -7 -7 5 -2
6876 -2 3 3 -1 -10 -9 -6 -6 7 -4 -4 -4 2 4 2 -6 1 4 -4 0 4 4 9 2 -10 -6 -4 -1 -1 -2 13 12 9 17 1 2 7 10 -3 14 7 14 10 6 3 -8 -4 -2 -3 -4 9 -2
6927 -2 -1 3 -4 -17 -14 -2 4 -10 -5 -10 -4 1 0 12 5 -2 11 -8 -2 -16 10 7 6 5 6 14 14 5 14 23 10 16 18 19 3 -5 -1 9 14 -2 10 -4 -2 5 -2 -4 13
6974 13 0 2 1 -14 4 -11 -9 -3 -15 -7 -1 -17 -8 -4 -2 -9 -15 -4 13 -8 -2 -10 -4 0 2 0 -3 10 0 8 8 7 7 6 -7 0 3 2 5 0 3 -4 -4 -7 4 0 -10
7021 -10 3 -1 4 -6 -9 -5 -7 -8 -13 -7 4 -13 -10 0 1 -1 -2 -11 -3 3 -1 9 -1 -4 8 -6 5 13 8 11 12 6 2 17 5 10 9 16 7 13 6 2 5 -10 15 4
7067 4 -1 -1 6 -2 -6 0 -9 -6 -11 -15 -1 -12 -7 -10 -9 -12 -7 1 4 5 -7 -2 1 -8 -7 2 -2 -8 4 -2 2 8 22 9 13 13 12 7 7 0 4 -2 6 2 9 -2 2 -9 -3 -10 -14 -1
7119 -1 -10 1 0 -9 -7 -8 -8 -5 -10 -9 -7 4 8 -8 -3 8 -7 -11 -3 -4 -3 0 2 8 -3 6 5 -1 21 12 19 4 18 3 3 9 6 -3 -3 8 6 -4 -1 10 -3 -5 -3
7166cLj0PoLmjL%PmMnMJOj0kKPp%J0j3PlMNoJ8mj5KQrOj3RpPj0J4jrKOLmlnMM
7218BooM%j0J4ljKRj0PpoJ0RnPoKolOQqpJ6j9K0JolmJmL%j1J6lKlMj4JJ1j5JL
7267gOj3LpJ7rnJ1oQpJ7j1rK1nmmnLP%PlqQpJ8j2lKJj5LKjJ6q%%KpJlLoJ0oLj7
7317a9J2%LqNj1RmQkOnjJRPnnKjLJoJ6kjJpQj1PqmQj1LMJqNjj0jJMq%J5j2jKM
7369gRnMjj%KNrNj0LJNM%omNPjj9J1OJ1qJ%j5LLmoJj1J8jNMorj0J1jO%j1J2%p
7419a0M%J0lrJJ3nrQOqJJ0%lQj2J3qOqKmRpjj5J6rJ6Oj6J3j4j1QnJOj3JoRMJ0
7465Ej8Q%nNJ2j1j1J3rJ5j3J1pQj0J1jKMokJ2nj1PKlj0OOkj5RLJmj3J9j9J0kl
7508a1J2j8J6j7JJ7opKMNpoLNQmlpJ2kPJ2q%jJj3MOJrj1RNmkQoRpLlnMj1jNQK
$$ plain form
7166 -3 0 -10 -3 -9 -6 -10 -11 -8 -8 -1 -5 -1 -6 -2 -1 5 -5 -7 -5 2 -5 -5 5 -8 -1 -4 0 5 -1 17 13 -2 0 8 -1 5 -8 1 -6 1 -9 5 4 -5 -3 3 6 2 -1 -6 -2 2
7218 2 -4 -10 -6 -6 -16 -2 -5 -6 -4 5 -5 2 -5 -11 -1 8 3 10 4 6 0 -3 3 11 3 -4 12 -7 13 14 8 5 1 2 -2 1 1 -10 6 3 5 2 6 -8 -7 4 -11 -10 -7
7267 -7 -1 -14 -11 -18 -1 -10 -15 -4 -10 -2 -9 8 -3 -12 9 4 0 -4 -9 -6 1 1 8 5 -3 5 -2 16 4 1 3 4 -11 -8 -6 -7 9 1 1 1 3 -4 -3 -6 -3 -9 1 -5 -2 -19
7317 -19 -7 -7 -4 -12 -7 -18 -9 -13 -5 -7 -1 -6 -7 -6 3 10 5 0 2 1 4 5 -1 15 13 12 13 6 14 3 10 2 -2 6 -5 -2 2 3 -5 0 -1 -11 -12 -11 -7 -15 -15 0 -12 -13 -11 -7
7369 -7 2 -3 1 0 -1 -1 1 6 -3 2 -8 -5 -4 1 5 5 -1 -5 0 7 6 -13 -2 4 15 7 8 8 -7 -4 -1 -5 -11 -10 -21 -3 -4 1 5 -1 -10 -20 -9 -10 -4 -4 -15 -3 -3 -10
7419 -10 -6 -6 4 1 -8 -7 6 1 -8 0 6 -2 -1 9 9 6 14 2 15 7 13 5 7 3 12 5 4 -11 5 -4 12 18 2 15 1 -10 -2 -7 -6 0 -13 -12 -18 -9 -5 5
7465 5 -13 -5 -5 -10 -5 7 -4 -15 -2 -11 4 -9 2 -5 3 -7 4 3 5 9 3 1 13 8 -3 4 6 3 -7 -1 5 3 -12 -3 0 1 -3 -16 3 -16 -6 -8 -11
7508 -11 1 -17 -1 -18 -17 0 -6 -13 -11 -7 -2 -9 -15 -12 -7 1 -3 -6 -13 -1 -3 4 16 8 8 7 8 -5 -1 5 6 -3 -14 -5 0 -4 -6 2 -4 5 -2 1 -2 -7 -3 -14 -15 -10 -2 0
7558@qOKj1PjQj0J1n%oQonPRj0qJ1LRMj5JjPMJj8J1rQjmqJ3j4NLpnJJ0j4JMmm
7607b0J2J1j4LqQJmKnPkQNj1MJ0j5J0NnqJ8Lj5QjN%j0oMj2QlKnJ3k1nJ5mLJ4q
7652coKrRnRj2JJ3KLLj1MpKNJkJ1p%knJ0qNMJ%LoPj0jKJkkMkj%j0RkMj4Qj2Nm
7704a5KNkLOKmNKnj1J4j3J0lL%Qj1pJ8J1onjqMj5K2KrNjlnMLpMqJ0mj2J5j9JP
7751hjRmlkO%j0J6rmROj2J4j7MJ0J3noQqJjJ4j6LNmLj3RJpN%qOJpj9J1KK%LpJ2
7800BKj0Qk%%PonLNKKoLnPmjpJ0oNRlnP%j1oJ3rMJ1j6Ojo%J2k2kJ2oLmjkPMpN
7852dJ4Lj3NqJ1mj0MOnJPoPj0J1mmOoMPjj3J2Mnj1KNolJjjOqLr%NpJ5j6NQpJ0
7901@%R%KqmklQj1J4rJ1j1jJ5o%nNKpQJqOoMmRqJ2k0jJ4oKj2Oqj1RJ1rMLKkLJ
$$ plain form
7558 0 -8 -2 0 -11 -4 -5 3 -7 4 -1 -1 -7 1 -5 -10 -3 6 -4 -12 -1 2 11 15 0 1 0 7 11 12 -6 5 -4 4 3 -1 -9 4 -10 -5 -2 -9 -14 -13 -3 -17 -16 -12 -16 -20
7607 -20 -8 3 -11 -8 -16 -8 -7 -11 -9 -14 -7 -9 -1 4 -7 -3 7 -8 2 7 2 -6 12 15 0 8 7 12 12 2 -4 0 -12 -4 -7 -5 -10 3 -18 -23 -8 -12 -9 5 -3
7652 -3 -9 -7 -16 -7 -12 -3 -15 -14 -1 1 4 7 -4 0 -7 -5 0 1 -1 10 3 3 1 -4 6 -2 3 7 8 8 11 5 12 2 1 3 4 2 0 4 2 1 1 -9 0 -2 2 -12 -4 -16 -11 -15
7704 -15 -13 -8 -10 -7 -1 1 -3 2 4 -1 -12 2 -11 -1 -4 -1 -1 7 -4 -11 7 18 12 7 6 -2 2 -13 9 11 2 7 6 3 -2 2 5 -2 2 -6 4 0 -12 3 -16 -15 -8
7751 -8 -9 0 -4 -7 -9 -3 -3 -13 3 -6 -10 -1 5 -7 7 -10 -6 4 17 12 6 14 6 7 6 20 4 7 12 8 11 -2 7 8 1 6 6 -2 4 5 -2 -21 -10 -8 -6 -6 -3 -10 2
7800 2 4 -6 2 0 0 0 7 1 -4 -1 4 6 8 2 5 0 7 3 2 -5 5 -1 4 13 10 5 12 12 1 -5 8 -1 3 14 -2 4 3 -3 -3 9 -13 -15 -3 -9 -6 -10 -11 -13 -6 -2 -9 -4
7852 -4 10 13 0 5 -3 8 4 -6 -2 4 -1 0 7 1 8 -2 9 5 1 7 1 5 12 11 -2 10 14 9 -2 0 5 -1 -4 -3 -4 -5 1 -7 -4 -13 -13 -8 -15 0 -16 -11 -3 -10 0
7901 0 0 9 9 11 3 -1 -3 -6 2 -9 5 -4 7 -4 -5 10 4 4 -1 4 6 -1 7 8 0 6 0 4 0 9 1 13 -7 -8 6 0 2 -10 -4 -12 -23 -14 -3 -12 -8 -5 -3 -5 -2 -1
7951ajjJ0nqJ2mKkjjkOj2J7lnJ1qnLJ0q%kLkJ0j0Np%Lj0jQk6J5RmojKpK2nMoo
8000hJ3kj0J1Klj0J9k0J8Mkrn%J7j3Pj1J0Oj3KNNk0K1j4J7j7j%l%Plj5QNrJ0j2
8042a3J1Oj3J3PknoJ5nljjJ7pmkpRoNjK%LJ2k8LmkJ1oJ3j2L%jkJ1j3J0pj1J3q
8087fPk%rKJ0Lj0QkRlJ%pNLj1J3j0RkojK2j7mJ2j0MnM%Nj1kJ2pLMPj5loLmLpk
8136a3J2j0KJNQrJ3ppOOoLj1K1j0Rj2kJ1j3LM%JkKLnpJ8k4J2jNjj4J5%mjJoON
8182Gj6J2j0j0J2Lj1LJ3
$$ plain form
7951 -1 -2 -3 7 2 -6 6 2 4 2 1 0 -2 4 -8 9 6 1 12 4 -1 2 12 4 4 2 5 3 13 3 8 1 1 4 -6 -7 1 -25 -10 -1 -5 -11 -12 -10 -17 5 0 4 -2 -8
8000 -8 5 3 -7 4 6 3 -7 12 -8 10 14 12 3 -2 -2 15 2 9 -2 8 14 1 3 8 13 -7 14 0 17 0 -1 -1 -4 -4 3 0 -15 -7 -2 -11 -1 -13
8042 -13 -2 4 -9 4 11 9 4 -2 13 8 5 4 3 20 13 9 7 0 9 3 8 7 9 9 12 24 -4 -1 -5 -7 4 -2 11 -1 2 2 1 -1 10 -3 7 0 -11 2 -6
8087 -6 1 -1 -1 -10 -8 2 5 -5 3 1 10 7 8 8 1 6 9 -2 11 1 10 8 2 1 23 6 2 14 4 8 3 7 7 12 1 -1 11 4 7 11 18 3 0 -6 -3 -7 -4 -11 -13
8136 -13 -1 -11 -9 -8 -3 5 -4 9 2 -5 1 7 1 4 -7 14 4 13 1 -1 10 -3 0 4 4 5 3 5 8 3 -4 14 -10 2 1 6 5 -9 6 6 2 1 2 -4 2 7
8182 7 -9 3 -7 -17 -5 -2 -13 -10 3
8191C
##END NTUPLES=NMR FID
##END=
