##TITLE=1H_IPDP0702
 CDCl3, 8 sc, 
 8.2.2019
##JCAMPDX= 6.0         $$ Bruker NMR JCAMP-DX V2.0
##DATA TYPE= NMR FID
##DATA CLASS= NTUPLES
##ORIGIN= UXNMR, Bruker Analytische Messtechnik GmbH
##OWNER= root
$$ XWIN-NMR		Version 3.5
$$ Fri Feb  8 14:48:43 2019 Russian Standard Time (UT+4h)  she@DPX200
##.OBSERVE FREQUENCY= 200.1313
##.OBSERVE NUCLEUS= ^1H
##.DELAY= (6, 6)
##.ACQUISITION MODE= SIMULTANEOUS
##.ACQUISITION SCHEME= undefined
##.AVERAGES= 8
##.DIGITISER RES= 18
##SPECTROMETER/DATA SYSTEM= spect
##.PULSE SEQUENCE= zg30
##.SOLVENT NAME= CDCl3
##.SHIFT REFERENCE= (INTERNAL, CDCl3, 0, 15.7039)
##AUDIT TRAIL= $$ (NUMBER, WHEN, WHO, WHERE, WHAT)
$$ ##TITLE= Audit trail, XWIN-NMR		Version 3.5
$$ ##JCAMPDX= 5.01
$$ ##ORIGIN= Bruker BioSpin GmbH
$$ ##OWNER= she
$$ F:/spectra/data/she/nmr/H-F/1/audita.txt
$$ ##AUDIT TRAIL=  $$ (NUMBER, WHEN, WHO, WHERE, WHAT)
(   1,<2019-02-08 14:47:33.25 +0400>,<she>,<DPX200>,
      <created by zg, POWCHK disabled, PULCHK disabled
       configuration hash MD5:
       00 E9 B6 7A A2 85 ED C7 34 08 36 98 17 FE 4E 26
       data hash MD5: 16K
       69 17 73 57 72 28 12 93 80 F1 CB CD A5 43 87 A0>)
$$ ##END=
$$ 
$$ hash MD5
$$ 73 F3 0F DA 23 D0 09 65 8D EA 5E 0A 9E 00 E0 59
##$RELAX= 
##$RELAX= 
##$RELAX= 
##$RELAX= 
##$RELAX= 
##$RELAX= 
$$ Bruker specific parameters
$$ --------------------------
##$DU= <F:/spectra>
##$EXPNO= 1
##$NAME= <H-F>
##$PROCNO= 1
##$TYPE= <nmr>
##$USER= <she>
##$AMP= (0..31)
100 100 100 100 100 100 100 100 100 100 100 100 100 100 100 100 100 100 
100 100 100 100 100 100 100 100 100 100 100 100 100 100 
##$AQSEQ= 0
##$AQ_mod= 1
##$AUNM= <au_zg>
##$AUTOPOS= <>
##$BF1= 200.13
##$BF2= 200.13
##$BF3= 200.13
##$BF4= 200.13
##$BF5= 200.13
##$BF6= 200.13
##$BF7= 200.13
##$BF8= 200.13
##$BYTORDA= 1
##$CFDGTYP= 0
##$CFRGTYP= 5
##$CHEMSTR= <none>
##$CNST= (0..31)
1 1 145 1 1 1 1 1 1 1 1 1 1 1 1 1 1 1 1 1 1 1 1 1 1 1 1 1 1 1 1 1 
##$CPDPRG= <>
##$CPDPRG1= <>
##$CPDPRG2= <>
##$CPDPRG3= <>
##$CPDPRG4= <mlev>
##$CPDPRG5= <mlev>
##$CPDPRG6= <mlev>
##$CPDPRG7= <mlev>
##$CPDPRG8= <mlev>
##$CPDPRGB= <>
##$CPDPRGT= <>
##$D= (0..31)
0 1.2 0 0 0 0 0 0 0 0 0 0.03 0 0 0 0 0 0 0 0 0 0 0 0 0 0 0 0 0 0 0 0 
##$DATE= 1549622852
##$DBL= (0..7)
120 120 120 120 120 120 120 120 
##$DBP= (0..7)
150 150 150 150 150 150 150 150 
##$DBP07= 0
##$DBPNAM0= <>
##$DBPNAM1= <>
##$DBPNAM2= <>
##$DBPNAM3= <>
##$DBPNAM4= <>
##$DBPNAM5= <>
##$DBPNAM6= <>
##$DBPNAM7= <>
##$DBPOAL= (0..7)
0.5 0.5 0.5 0.5 0.5 0.5 0.5 0.5 
##$DBPOFFS= (0..7)
0 0 0 0 0 0 0 0 
##$DE= 6
##$DECBNUC= <off>
##$DECIM= 32
##$DECNUC= <off>
##$DECSTAT= 4
##$DIGMOD= 1
##$DIGTYP= 9
##$DL= (0..7)
0 120 120 120 120 120 120 120 
##$DP= (0..7)
150 150 150 150 150 150 150 150 
##$DP07= 0
##$DPNAME0= <>
##$DPNAME1= <>
##$DPNAME2= <>
##$DPNAME3= <>
##$DPNAME4= <>
##$DPNAME5= <>
##$DPNAME6= <>
##$DPNAME7= <>
##$DPOAL= (0..7)
0.5 0.5 0.5 0.5 0.5 0.5 0.5 0.5 
##$DPOFFS= (0..7)
0 0 0 0 0 0 0 0 
##$DQDMODE= 0
##$DR= 18
##$DS= 0
##$DSLIST= <SSSSSSSSSSSSSSS>
##$DSPFIRM= 0
$$ [...]
##$SUBNAM2= <"">
##$SUBNAM3= <"">
##$SUBNAM4= <"">
##$SUBNAM5= <"">
##$SUBNAM6= <"">
##$SUBNAM7= <"">
##$SUBNAM8= <"">
##$SUBNAM9= <"">
##$SW= 20.0189088683792
##$SWIBOX= (0..15)
0 0 2 0 0 0 0 0 0 0 0 0 0 0 0 0 
##$SW_h= 4006.41025641026
##$TD= 16384
##$TD0= 1
##$TE= 0
##$TE2= 300
##$TE3= 300
##$TEG= 300
##$TL= (0..7)
0 120 120 120 120 120 120 120 
##$TP= (0..7)
150 150 150 150 150 150 150 150 
##$TP07= 0
##$TPNAME0= <>
##$TPNAME1= <>
##$TPNAME2= <>
##$TPNAME3= <>
##$TPNAME4= <>
##$TPNAME5= <>
##$TPNAME6= <>
##$TPNAME7= <>
##$TPOAL= (0..7)
0.5 0.5 0.5 0.5 0.5 0.5 0.5 0.5 
##$TPOFFS= (0..7)
0 0 0 0 0 0 0 0 
##$TUNHIN= 0
##$TUNHOUT= 0
##$TUNXOUT= 0
##$USERA1= <user>
##$USERA2= <user>
##$USERA3= <user>
##$USERA4= <user>
##$USERA5= <user>
##$V9= 5
##$VALIST= <valist>
##$VCLIST= <CCCCCCCCCCCCCCC>
##$VD= 0
##$VDLIST= <DDDDDDDDDDDDDDD>
##$VPLIST= <PPPPPPPPPPPPPPP>
##$VTLIST= <TTTTTTTTTTTTTTT>
##$WBST= 1024
##$WBSW= 4
##$XGAIN= (0..3)
0 0 0 0 
##$XL= 0
##$YL= 0
##$YMAX_a= 639763
##$YMIN_a= -524899
##$ZGOPTNS= <>
##$ZL1= 120
##$ZL2= 120
##$ZL3= 120
##$ZL4= 120
##$ABSF1= 10
##$ABSF2= 0
##$ABSG= 5
##$ABSL= 3
##$ALPHA= 0
##$AQORDER= 0
##$ASSFAC= 0
##$ASSFACI= 0
##$ASSFACX= 0
##$ASSWID= 0
##$AUNMP= <proc_1d>
##$AZFE= 0.1
##$AZFW= 0.1
##$BCFW= 1
##$BC_mod= 2
##$BYTORDP= 1
##$COROFFS= 0
##$CY= 11.3945322036743
##$DATMOD= 1
##$DC= 2
##$DFILT= <>
##$DTYPP= 0
##$F1P= 18.9103706918063
##$F2P= -1.10871071338519
##$FCOR= 0.5
##$FTSIZE= 0
##$FT_mod= 4
##$GAMMA= 1
##$GB= 0.15
##$INTBC= 1
##$INTSCL= 1
##$ISEN= 128
##$LB= 0.24
##$LEV0= 0
##$LPBIN= 0
##$MAXI= 10000
##$MC2= 0
##$MEAN= 0
##$ME_mod= 0
##$MI= 1.114404
##$NCOEF= 0
##$NC_proc= 0
##$NLEV= 6
##$NOISF1= 3.799351
##$NOISF2= 2.8
##$NSP= 1
##$NTH_PI= 0
##$NZP= 0
##$OFFSET= 15.70392
##$PC= 1
##$PHC0= -8676.463
##$PHC1= 9.600191
##$PH_mod= 1
##$PKNL= yes
##$PPARMOD= 0
##$PSCAL= 0
##$PSIGN= 0
##$REVERSE= no
##$SF= 200.130013532006
##$SI= 16384
##$SIGF1= 3
##$SIGF2= 2
##$SINO= 400
##$SIOLD= 16384
##$SREGLST= <1H.CDCl3>
##$SSB= 0
##$STSI= 0
##$STSR= 0
##$SW_p= 3612.71676300578
##$SYMM= 0
##$S_DEV= 0
##$TDeff= 0
##$TDoff= 0
##$TI= <>
##$TILT= no
##$TM1= 0
##$TM2= 0
##$TOPLEV= 0
##$USERP1= <user>
##$USERP2= <user>
##$USERP3= <user>
##$USERP4= <user>
##$USERP5= <user>
##$WDW= 1
##$XDIM= 8192
##$YMAX_p= 0
##$YMIN_p= 0
$$ End of Bruker specific parameters
$$ ---------------------------------
##NTUPLES= NMR FID
##VAR_NAME=  TIME,          FID/REAL,        FID/IMAG
##SYMBOL=    X,             R,               I
##VAR_TYPE=  INDEPENDENT,   DEPENDENT,       DEPENDENT
##VAR_FORM=  AFFN,          ASDF,            ASDF
##VAR_DIM=   8192,          8192,            8192
##UNITS=     SECONDS,       ARBITRARY UNITS, ARBITRARY UNITS
##FACTOR=    0.0002496,     1,               1
##FIRST=     0,             0,               0
##LAST=      2.0444736,     0,               0
##MIN=       0,             -524899,         0
##MAX=       2.0444736,     639763,          0
$$ Real data points
##PAGE= N=1
##DATA TABLE= (X++(R..R)), XYDATA
$$ [...]
1837G72o13L70k05j142m63J446N21n58p3Q78p78j818P07J406o11p64J582J39j586
$$ 772 159 529 324 -818 -1281 165 686 128 55 933 155 -1663 -956 450 -161 -925 657 796 -790
1856g90m52J569J25n96N96J292j101j436P90R60j547k22J993n17k234L65J663
$$ -790 -1242 327 452 -144 452 1744 643 -793 -3 957 -590 -812 1181 664 -1570 -1205 458
1873D58j146p24J838J178j548o71J457l93j115M23J712j038j333J591J42k128
$$ 458 -688 -1412 426 1604 56 -615 842 449 -666 -243 1469 431 -902 689 831 -1297
1889a297L77J594p8j405O82R89j364r96J490P93r33r0J110l84j406Q64R46o00
$$ -1297 -920 674 596 -809 -127 862 -502 -1498 -8 785 -148 -238 872 488 -918 -54 892 292
1907B92o42J041k4j592p9R01J18o96N34J151n68j114Q38M97p76M1J051o49j059
$$ 292 -350 691 667 -925 -1004 -103 15 -681 -147 1004 436 -678 160 657 -119 -78 973 324 -735
1926g35J74O62m59l51N77M24j65n22P71j0o03M1Q34m02o28M23Q3j58k88N26Q0
$$ -735 -561 101 -358 -709 -132 292 127 -395 376 366 -237 -196 638 236 -392 31 114 -44 -332 194 274
1947B74m00O5J26k91m55L72J09J0P5L37K0k91MP77l72k6J01O8l70l99M0n7m88
$$ 274 -126 -61 65 -226 -681 -309 -200 -190 -115 222 242 -49 -45 732 360 334 435 503 133 -266 -226 -283 -771
1970g71J36K20O0j88M46K71j9L85l12L32j91J83l18k90q9J6J90m3j23L37j45j62
$$ -771 -635 -415 -355 -543 -97 174 155 540 228 560 369 552 234 -56 -145 -129 61 18 -105 232 87 -75
1992g5J08k58P6j98O9P3p3L17o2o1L66j56J65oj5l8m46K84j02l49K53j64j20K60
$$ -75 33 -225 -149 -347 -278 -205 -278 39 -23 -84 282 126 291 285 270 232 -214 70 -32 -381 -128 -292 -412 -152
2016a52M10k83k8j40O31k0m75K22J99k82k14J66p5p8j36M00m13J65m94P06J84
$$ -152 258 -25 -53 -193 438 418 -57 165 364 82 -132 34 -41 -119 -255 145 -268 -103 -597 109 293
2037B93r1p7J74l24K68k10j19j20L08K6n06K72K91m02m3J31Q0k89R1J59R9k13
$$ 293 202 125 299 -25 243 33 -86 -206 102 128 -378 -106 185 -217 -260 -129 -49 -338 -247 -88 11 -202
2059b02M70J20l53k5J47P0k22k32L66m39J12K82P0n33M0K28l4m8K72J49m26L04
$$ -202 268 388 35 10 157 227 5 -227 139 -300 -188 94 164 -369 -329 -101 -135 -183 89 238 -188 116
2081A16J89k43q0K39j78K85l03O0j75K7k80K28L4k89N68k16r2o6K76j42O6Q1j19
$$ 116 305 62 -18 221 43 328 25 85 -90 -63 -343 -115 -81 -370 198 -18 -110 -176 100 -42 24 105 -14
2104a4lj49K63n0l73J44J48O6l20M89j32J6P2N5k94r1O2k56K43l6P9M7R1n4K95
$$ -14 -17 -166 97 47 -326 -182 -34 32 -288 201 69 85 157 212 -82 -173 -111 -367 -124 -160 -81 -34 57 3 298
2129B98k7J49p9l71K17k40k29o5J84P6K6l1M06j72o3k24M45m06J52j1j92m27J70
$$ 298 271 420 341 -30 187 -53 -282 -347 -163 -87 -61 -92 314 142 79 -145 300 -106 46 35 -157 -584 -414
2152d14N10m55K66L40J58m13L07N2J07n55M9N5L1k95L18Ml43K3M83q6K7j3K22
$$ -414 96 -359 -93 247 405 -8 299 351 458 -97 -48 7 38 -257 61 65 -278 -255 228 142 169 156 378
2175C78j69l95l5J23j63J91j0l1j29J35J81M9m3K04K46p05k4J75j01J2j22L77
$$ 378 209 -186 -221 -98 -261 -70 -80 -111 -240 -105 76 125 82 286 532 -173 -197 -22 -123 -111 -233 144
2197A44k49k91K32N05k77q9K93rk21j22J92q3l81M25J11j69k78M08Qk89L94J13
$$ 144 -105 -396 -164 341 64 -25 268 259 38 -84 108 25 -356 69 180 11 -267 141 149 -140 254 367
2219C67l43j06M7M3j81k36L62k13L21N2k4m6J38r5K41j88k43L19k41l70k31L01
$$ 367 24 -82 -35 8 -173 -409 -47 -260 61 113 89 43 181 86 327 139 -104 215 -26 -396 -627 -326
2241c26K20L33o8j09k49K66J23j36m64J57N36n05p2K15K77j53j47L01J68n41J36
$$ -326 -106 227 159 50 -199 67 190 54 -410 -253 283 -222 -294 -79 198 45 -102 199 367 -174 -38
2262c8J71p4j52j82P42n38p3j99M35k57l9L28K23j28j63j04j58J35K26l4k12k2
$$ -38 133 59 -93 -275 467 -71 -144 -343 92 -165 -204 124 347 219 56 -48 -206 -71 155 121 -91 -113
2284a13J38o6j0LL84j09J2m37L34m07K4K67o5J27n8R1l31o7N60k90k4j52M10k20
$$ -113 25 -41 -51 -48 336 227 239 -198 136 -271 -247 20 -45 82 24 115 -216 -283 277 -13 -37 -189 221 1
2308Ak49K24p3j57K47N4J99l59J47j83l7N2P1K47k71J10M8k24j12J56K62Kl06
$$ 1 -248 -24 -97 -254 -7 47 246 -113 34 -149 -186 -134 -63 184 -87 23 71 -153 -265 -109 153 155 -151
2331a51ML79k98n7J73L65m28J7m3J11l23K68N2j45j55N3M15m64L04q4K31l52Q6
$$ -151 -147 232 -66 -123 50 415 -13 4 -39 72 -251 17 69 -76 -231 -178 237 -227 77 -7 224 -128 -42
2354d2k8K46j71O3O1M6m13M28o3l74M83j07n90K42JJ56q8k7O2Q7j74L31j2j96
$$ -42 -70 176 5 68 129 175 -238 190 127 -247 236 129 -461 -219 -218 -62 -150 -177 -115 -28 -202 129 117 -79
2378g9N3K08j35j05n4M41k83k73L77J2j81P5NP7j38M2j47J29l18M48J9l05j0J09
$$ -79 -26 182 47 -58 -112 329 46 -227 150 162 -19 56 61 138 0 42 -105 24 -294 154 173 -132 -142 -33
2402c3K57l57o2J79P4o2j03M52m82J99q4K96j7n88K73K17n25L81L42m86j90J65
$$ -33 224 -133 -195 -16 58 -4 -107 345 -137 62 -22 274 257 -331 -58 159 -366 15 357 -129 -319 -154
2424a54J68m5j59O0J74r4K06K13m51k9J82K74m32J3K67j55j92Q5J24k53J77k5
$$ -154 14 -31 -190 -130 44 -50 156 369 -82 -111 71 345 -87 -74 193 38 -154 -69 55 -198 -21 -46
2446d6M5j12j58L36K3O9L8n5j49m1J31j24j85j5M18l84L35n3K70j27l61K67j45
$$ -46 -1 -113 -271 65 88 157 195 140 -9 -50 81 -43 -228 -243 175 -209 126 73 343 216 -145 122 -23
2469b3m2J24k00K21l97J67P4J69k34O6L01j29K9o0K56m15j79L83j52k90N57l90
$$ -23 -65 59 -141 80 -317 -150 -76 93 -141 -75 226 97 126 66 322 -93 -272 111 -41 -331 226 -164
2491a64J65j04K48P9j68k29N1k25J79J78L3m1k55K55j53J52m6K9q2J10MJ95l28
$$ -164 1 -103 145 224 56 -173 -122 -347 -168 10 43 2 -253 2 -151 1 -45 -16 -98 12 16 211 -117
2514a17j04K21K55j89j59L49j57j19O0K0o9k19J62K24n3M2k75M8l4J2K35j48k54
$$ -117 -221 0 255 66 -93 256 99 -20 40 60 -9 -228 -66 158 105 147 -128 -80 -114 -102 133 -15 -269
2537b69L93R0l24K68j41l09K80J99k74j2J75J58P2j02M7o2l39r5Q3O4K0J0rp1
$$ -269 124 214 -110 158 17 -292 -12 187 -87 -99 76 234 306 204 251 189 -150 -245 -162 -98 -78 -68 -77 -148
2561a48K63k57L25k49R6LLj14R8j10n1K69l94J68Q2J22j70J21j32K49m6j8J87
$$ -148 115 -142 183 -66 30 33 36 -78 20 -90 -141 128 -266 -98 -16 106 -64 57 -75 174 128 110 297
2584B97k07j22J87j84k99K01j2N3lj43M07j22k06J46m9m6N6K12k68L6Q2K13l32
$$ 297 90 -32 155 -29 -328 -127 -139 -86 -89 -232 175 53 -153 -7 -56 -102 -46 166 -102 -66 16 229 -103
2607a03M9J80j38k89K79N6j25k94K04L43l35K31J53k08l38M22J25r6j82K39k7
$$ -103 -54 126 -12 -301 -22 34 -91 -385 -181 162 -173 58 211 3 -335 87 212 116 -66 173 146
2628A46j84p2J37j64j89J02N44m96K11K21j46m3J62r6j53L1J6r1o1L8J79k2k42
$$ 146 -38 -110 27 -137 -326 -224 320 -176 35 256 110 67 229 133 -20 11 27 -64 -125 -87 92 70 -172
2651a72K2K62j86K04J4J42m03K49j6k61K10j51O5n0R6P4k24N3O2l6J25l83K19
$$ -172 -150 112 -74 130 144 286 -117 132 116 -145 65 -86 -21 -71 25 99 -125 -72 -10 -46 79 -304 -85
2674h5M6O0kJ0n0K86J4k06rJ86k29k79J55J7n3K77l17P3J99J0K1k46L2O6j37Q4
$$ -85 -39 21 19 29 -21 265 279 73 64 250 21 -258 -103 -86 -139 138 -179 -106 93 103 124 -122 -90 -24 -161 -77
2700g7kj16nJ15j4j36j99N30rk59j37L43R5l43J77K53q1j87K00J47m81J00K98
$$ -77 -79 -195 -200 -85 -99 -235 -434 96 87 -172 -309 34 129 -214 -37 216 135 -52 148 295 -186 -86 212
2723B12j96m50J88K21j15J3J68K1r1r7R5lm34M32K49k54k68L93K89l82m2Q9j11
$$ 212 16 -434 -246 -25 -140 -127 41 62 -29 -126 -31 -34 -468 -36 213 -41 -309 84 373 -9 -51 38 -73
2746g3o9o6K95k48J75k5J37q7o4L27k6l77J53ll22K73J22j12m00L78L7L2l53K78
$$ -73 -142 -208 87 -161 14 -11 126 39 -25 302 276 -101 52 49 -273 0 122 10 -390 -12 25 57 -296 -18
2770a8o2J49l02N31k78l0L4K85L1n30M00j71k52n4M52nj00k89L71K7n28K85L26
$$ -18 -80 69 -233 298 20 -10 24 309 340 -190 210 39 -213 -267 185 180 80 -209 162 189 -339 -54 272
2793B72l31j22K46l9k21K38J5j4k09L17J40m69J48O5J85n38k59O04M3j95k66M15
$$ 272 -59 -181 65 26 -195 43 58 44 -165 152 292 -177 -29 36 221 -317 -576 28 71 -124 -390 25
2815B5J60j45j35L52k78R9o5K2M4l45O76m18k79L34M53n45k61L58Q0o11R6M48
$$ 25 185 40 -95 257 -21 78 13 35 79 -266 410 -8 -287 47 500 -45 -306 52 132 -479 -383 65
2837F5j89j72L69N83p81J0K38k45j43R6M90n03j84L73L56l12l10J70K59l26J08
$$ 65 -124 -296 73 656 -125 -115 123 -122 -265 -169 321 -182 -366 7 363 51 -259 -89 170 -156 -48
2858d8J19J26r26O38M65l94l7J33K04n81j70O48j7k28k03P29k79n30L54R0l02
$$ -48 71 197 -729 -91 374 -20 -57 76 280 -301 -471 177 160 -68 -271 458 179 -351 3 93 -209
2879b09o3N81n6n69j24O28p5l08K31M78o79k74O99k13o5j38L08J42p89M16K50
$$ -209 -272 309 253 -316 -440 188 113 -195 36 514 -165 -439 260 47 -18 -156 152 294 -495 -79 171
2900A71k31j17L32J31m83j29M57l32q6J11N62m51m5L21m0k1m77M33j21l63K29
$$ 171 -60 -177 155 286 -197 -326 131 -201 -287 -176 386 -65 -110 211 171 150 -327 106 -15 -378 -149
2921a49M69o56j15P75m8l16o9J26J24k30K86j39J07j87J77r3k42p6N1L08p07K83
$$ -149 320 -336 -451 324 276 -40 -109 17 141 -89 197 58 165 -22 155 62 -180 -256 -205 103 -604 -321
2943c21M49k61o0l1O83o05RL61r0p9J02m2J22o80O12j27j27l40M18K18N8l94L44
$$ -321 128 -133 -193 -224 459 -146 -137 224 134 55 157 115 237 -443 169 42 -85 -425 -7 211 269 -125 219
2966B19j55l30N73j47m04n5K47K68l67J8K70j41j07K25j2J9k12Q7M50n51q7L78
$$ 219 64 -266 307 160 -244 -299 -52 216 -151 -133 137 -4 -111 114 102 121 -91 -4 446 -105 -192 186
2988A86k1n18J80M33km28N4M7K09k33J64P2k24nK07j27MJ38K85k54l84L81n5l08
$$ 186 165 -353 -173 260 258 -170 -116 -69 140 -93 71 143 -81 -86 121 -6 -2 136 421 167 -217 164 109 -199
3012a99K09j04L47n86J73K63o4k93J40K04j10N8K82k78q2L79j99Q7k96j32L04
$$ -199 10 -94 253 -333 -160 103 39 -254 -114 90 -20 38 320 42 -40 339 140 227 -69 -201 103
3033A03l91R0J49J30k9j37J40r3J9m9m3J59R7J84k91k59J0K86l3j23j19K90j89
$$ 103 -288 -198 -49 81 52 -85 55 -38 -19 -68 -111 48 145 329 38 -221 -211 75 42 -81 -200 90 -99
3056i9o4L57k71o5J57M0M0L1l07K00Q5J95P9k38r2j30O4m38L56R9K03l47j87L30
$$ -99 -163 194 -77 -142 15 55 95 126 -181 19 104 299 378 140 48 -82 -18 -456 -100 -1 202 -145 -332 -2
3080bJ18m61J57M29k83M8m0J52r5r0K12j95J05k25K52o1l67L25J09q3p1L07m86
$$ -2 116 -345 -188 241 -42 6 -34 118 23 -67 145 -50 55 -170 82 21 -346 -21 88 5 -66 241 -245
3103b45L48O1Kj04l21L88J24l06j23J9K73l31J45J32N3mk27k8j6K65J16j04Q1
$$ -245 103 164 166 62 -259 129 253 -53 -176 -157 116 -215 -70 62 115 111 -116 -144 -160 105 221 117 198
3126A98m15Q6K30j76J25p0k52K73K57n92L44j5k47M21k39K48l33j3n8K33j73M63
$$ 198 -217 -131 99 -77 48 -22 -274 -1 256 -336 8 -7 -254 167 -72 176 -157 -170 -228 5 -168 295
3148B95j82k56q4K33m9K82j53k3k59J29J19J4l30Q3K48j98K06M1k31Q1O8k6r7
$$ 295 113 -143 -227 6 -43 239 86 63 -196 -67 52 66 -264 -181 67 -131 75 116 -115 -34 34 8 -89
3171h9R6K2m7j77J41j09K75k03J67r2J97k44K07J34m01L00j34o9J2K57k74l97
$$ -89 7 29 -18 -195 -54 -163 112 -91 76 -16 181 -63 144 278 -123 177 43 -26 -14 243 -31 -428
3193d28M54n8J84l41K83k7j46P8j03K59r6K00l88M40l09L0J36j22j79J84l43M19
$$ -428 26 -32 152 -189 94 67 -79 -1 -104 155 59 259 -129 311 2 32 168 46 -133 51 -292 127
3215A27j20l9J8M3J28j0k82K07L06m14R7q4l0m3N0p3J5L83n46L25r4K3k9j97K53
$$ 127 7 -32 -14 29 157 147 -135 72 378 -36 61 -23 -53 -96 -46 -119 -104 279 -267 58 -36 -13 -42 -239 14
3240A4q0J47j47J18L6j70l20N43j17r9Q4L6k64K39J58k89J52l5r9K9O9j47K89
$$ 14 -66 81 -66 52 88 -82 -402 141 24 -75 9 45 -219 20 178 -111 41 6 -93 -64 5 -142 147
3263A47jm72L21j14n8L40m31M15j61J75m6j53n8N0o5J99J03l61J86P3j62k5K84
$$ 147 146 -326 -5 -119 -177 163 -268 147 -14 161 115 -38 -96 -46 -111 88 191 -170 16 89 -73 -98 186
3286A86j92K4j31J0J15j1J03J65q7k6k24q8n9J59O6J53j08j18J55j64q2r7M04
$$ 186 -6 18 -113 -103 12 1 104 269 182 156 -68 -156 -215 -56 10 163 55 -63 92 -72 -154 -251 153
3309A53n05J94R8j94LL06J93j81N2k4J52j35l62M13j04r8pL58j84k16j19K03j1
$$ 153 -352 -158 -60 -254 -251 55 248 67 119 95 247 112 -250 163 59 -39 -46 312 128 -88 -207 -4 -15
3332a5nN0K74n90L29L78m71p9j5J25j40n4K30Q1m21R7M08J25l26o3M81m18l39
$$ -15 -20 30 304 -286 43 421 -50 -129 -144 -19 -159 -213 17 98 -323 -226 182 307 -19 -82 399 -19 -358
3355c58L33K20O1n67K21K12j42oM9L28l64m2R8J48o68N39l6J14l10M78k09n67
$$ -358 -25 195 256 -311 -90 122 -20 -26 23 351 -13 -55 43 191 -477 62 26 140 -170 308 99 -468
3377d68K51N26l51j56M22J23l44k22N8L38l61J88K42p6j73k3J61j51K11p9J9j24
$$ -468 -217 309 -42 -198 224 347 3 -219 -161 177 -184 4 246 170 -3 -26 135 -16 195 116 135 11
3399A1j81K26P5m80L14J08r7k06K25P5m79L39J57j29PO1J74k33k65M98j23l18
$$ 11 -170 56 131 -349 -35 73 -24 -230 -5 70 -409 -70 87 -42 -35 26 200 -33 -298 200 77 -241
3421b41K14J9J23k21K17No4l6j2L23l42J8K92k12K7K8J56k09o55K73N13l20J61
$$ -241 -27 -8 115 -106 111 116 52 16 4 327 -15 3 295 83 110 138 294 85 -570 -297 216 -104 57
3444E7q0Qk03j05M70L3l84M81j45j73j0K68j19j79n5K60m25K27PJ14k46k0K72
$$ 57 -23 -15 -218 -323 147 180 -204 277 132 -41 -51 217 98 -81 -136 124 -301 -74 -67 47 -199 -219 53
3467E3p2O4l73N03j61j43L01Q6j79l18L81l15q8P8N31k65n20M60j1j69j03K05
$$ 53 -19 45 -328 175 14 -129 172 258 79 -239 142 -173 -261 -183 348 83 -437 23 12 -157 -260 -55
3489e5J48k85L0L97m0n26J79M38m97o3L66j19p7l6L6J51m71M76K42k63k02P5R1
$$ -55 93 -192 -162 235 195 -331 -152 286 -211 -274 92 -27 -104 -140 -104 47 -424 52 294 31 -171 -96 -5
3512eJ28j9M3m9k36q6J80N1l18M21R9m84L0J65K21m68L95L22k54l60K41o9J7l18
$$ -5 123 104 147 98 -138 -224 -44 7 -311 110 209 -275 -245 -80 141 -327 68 390 136 -224 17 -52 -35 -353
3536c53K76J18q8r8K80j30m7L44k31j16p7J35J80l19m9M14q2k5k9R9l79n5K06
$$ -353 -77 41 -47 -145 135 5 -42 302 71 -45 -122 13 193 -126 -175 239 157 132 103 202 -177 -232 -26
3559b6J82O3l26o0J74o9R2m0J90j11j9J57Jk94K13M5k8M3k06J75k54P5m8Q8O9
$$ -26 156 219 -107 -167 7 -62 30 -10 180 69 50 207 208 -86 127 172 144 187 -19 156 -98 -23 -71 17 86
3584H6q0o3J92j96J25j35r4K17l3o5L0J76j65J44k10J65J86l97M77k19p2j33N4
$$ 86 6 -57 135 -61 64 -71 -165 52 19 -46 -16 160 -5 139 -71 94 280 -117 360 141 69 -64 -10
3607a0r3nJ16l4M4r6M4k9nj86Q6J69p5P8N1J76j62j76RL64k96L5J68j00l12J96
$$ -10 -103 -108 8 -26 18 -78 -34 -63 -68 -254 -168 1 -74 4 55 231 69 -107 -98 266 -30 5 173 73 -239 -43
3633d3K47m27J60K7k32M6J16K29j36j35J85O1r3j63M78l26r1kJ31O4l66K36J63
$$ -43 204 -223 -63 -36 -268 -222 -106 123 -13 -148 37 98 5 -158 320 -6 -97 -99 32 96 -270 -34 129
3656A29k31J4K13k06n3l0J95N5m00J43K66k01J62j54J78l49K49J90j90k39K49
$$ 129 -102 -88 125 -81 -134 -164 31 86 -314 -171 95 -106 56 -98 80 -269 -20 170 -20 -259 -10
3677a0j08K03o6J43j78L6J31j26K84l93K6M9m2J27k34K41l47K94Qq3J53k86R5
$$ -10 -118 85 19 162 -16 20 151 25 309 -84 -58 -9 -51 76 -158 83 -264 30 38 -45 108 -178 -83
3700h3K02J5j44J9l9j9N5L63l65m1J57k74K3P6R0J65n87L37J4K34k31m0L68j66
$$ -83 119 134 -10 9 -30 -49 6 369 4 -37 120 -154 -131 -55 35 200 -387 -50 -36 198 -33 -73 295 129
3724A29j33LR0j20K28j41J51o23O15j59J29k48R5l25M33l2j27qm3K95j61p4P8
$$ 129 -4 -1 89 -31 197 56 207 -416 199 40 169 -79 16 -309 124 92 -35 -43 -86 209 48 -26 52
3747E2J00k79N1r8J92m42K82L1j2N8J39K6M5r5k24M20k99J31P5k29j12J90Q4o2
$$ 52 152 -127 -76 -174 18 -424 -142 -111 -123 -65 74 100 145 50 -174 246 -53 78 153 -76 -188 2 86 24
3771B4j49R1j88O2L66n9j90J90j31J42k33p8j38L76J12j39nl2J25k42J91j62K64
$$ 24 -125 -34 -222 -160 206 147 -43 147 16 158 -75 -153 -291 85 197 58 53 21 146 -96 95 -67 197
3794A97j32k49M2ML47p7j54NL31k65j37K53M9o95M74K18j48k94L59m21M36k20
$$ 197 65 -184 -142 -138 209 132 -22 -17 314 49 -88 165 214 -481 -7 211 63 -231 128 -293 143 -77
3816g7M75m24j92L03l1j76J45j03K44j13j55O0J02J6k97K9J29K97k29J3K7j61
$$ -77 398 -26 -218 85 54 -122 23 -80 164 51 -104 -44 58 74 -223 -194 -65 232 3 16 43 -118
3838a18Q9L1QL64j25n5j86J33j84q7L27m1j95p5L1J19K05j55j73J54J12k87J49
$$ -118 -29 2 10 374 249 194 8 141 -43 -130 197 156 -39 -114 -83 36 241 86 -87 67 179 -108 41
3861D1P1m1m0J14J7l91M55m6L5j06k73O3R3j27N9L57l92j79L99P4l59J73J07l66
$$ 41 112 71 31 145 162 -229 226 180 215 109 -164 -101 -8 -135 -76 281 -111 -290 109 183 -176 -3 104 -262
3885b62J73J76j57j24J35N1J19k63k9K12j73J60J32K60k02j81P4Nj68%J58l21
$$ -262 -89 87 -70 -194 -59 -8 111 -152 -181 31 -142 18 150 410 208 27 101 106 -62 -62 96 -225
3907b25o8J70N0L10r0j44j68kM4J55K27l62L58k6l07J58m3j9o2k87O94l34j71
$$ -225 -293 -123 -73 237 147 3 -165 -167 -123 32 259 -103 255 229 -78 80 37 18 -44 -331 363 29 -142
3930a42k8L59p5n6j03J1l17K25L86j10k48L0R3l0j33J38J86k21j77L69j02jkJ1
$$ -142 -170 189 114 58 -45 -34 -351 -126 260 150 -98 -68 25 -5 -138 0 186 -35 -212 157 55 54 52 63
3954F3j24m6M2L5J01l3n8m1O7j59K46K16m62K96k93K42K16k37p4j81J14L54k03
$$ 63 -61 -107 -65 -30 71 38 -20 -61 6 -153 93 309 -153 143 -150 92 308 71 -3 -184 -70 284 81
3977H1q0M8P1k11L3k8R3j64J11J8n0k00J66L6mk3K43Nj39j21K05j43l44M42K20
$$ 81 1 49 120 -91 -58 -86 7 -157 -46 -28 -78 -278 -112 -76 -80 -103 140 145 6 -115 90 -53 -397 45 265
4002B65k5l76M72m9l81l8K34j45M7r3M22m39J01J20J74m46J35L03l75K68m24K53
$$ 265 240 -136 336 287 -94 -132 102 -43 4 -89 333 -106 -5 115 289 -157 -22 281 -94 174 -250 3
4024CK07k94n9K56j25L6RK56m51O4J44K16o03M19R8n29K31J66P4l48J05L70r1
$$ 3 210 -84 -143 113 -12 24 33 289 -162 -98 46 262 -341 78 176 -353 -122 44 118 -230 -125 245 154
4047A54k58m9M55j04n15L25K37l66j2K42m0P6l29K24j91J26J64Rl31P0J51rk36
$$ 154 -104 -153 302 198 -317 8 245 -121 -133 109 69 145 -184 40 -151 -25 139 148 -183 -113 38 29 -207
4070b07RN41k04l73L02R2l17Q2R2r8k25KN45l53R1K20k06M5Lj30K83m10K28J41
$$ -207 -198 343 139 -234 68 160 -157 -75 17 -81 -306 -304 241 -112 -21 199 -7 38 41 -89 194 -216 12 153
4094A53j92q2Q8K29m11K57O7L8q0j76K68Rj90K93k41l53J01N00k03l19j65O03
$$ 153 -39 -121 -33 196 -215 42 109 147 67 -109 159 168 -22 271 30 -323 -222 278 75 -244 -409 194
4116A94j71l11j5L58m8j21J75J81j60J8J11l20J73j83j0K74j29k27L11k82n4M08
$$ 194 23 -288 -303 55 7 -114 61 242 82 100 211 -109 64 -119 -129 145 16 -211 100 -182 -236 172
4138A72r1j20m7R4m9P1p8J81j33j53K54P9j29OL8n4j75J89J87n15O0K48p7j09
$$ 172 81 -39 -86 8 -41 30 -48 133 0 -153 101 180 51 57 95 41 -134 55 242 -273 -213 35 -42 -151
4162a51J24j1K52p6O1j65j41o6Q8m2p2M75k21j30q7J49p0R9o8n6K78l36K25r0
$$ -151 -27 -38 214 138 199 34 -107 -173 -85 -127 -199 276 55 -75 -162 -13 -83 16 -52 -108 170 -166 59 -31
4186c1K67k36j25J73l2k70L78j3p4j7q8j82J28J2K34j54j75J64K91k60k84L44
$$ -31 236 0 -125 48 16 -254 124 111 37 20 -68 -250 -122 -110 124 -30 -205 -41 250 -10 -294 50
4208E0J08j12k62M33K8l30j10K73M5k98J27j33R3J65P8k63o9NJ52L48l38K79r4
$$ 50 158 46 -216 217 245 -85 -195 78 123 -175 -48 -181 -88 77 155 -108 -177 -172 -20 328 -10 269 175
4231A75k63Q3l4q9l2R3J21k23J78k92J80k4L35j88O6j14M3%R8q0k17o1N9J54J22
$$ 175 -88 -5 -39 -128 -160 -67 54 -169 9 -283 -103 -127 208 20 86 -28 15 15 113 33 -184 -245 -186 -32 90
4256I0k98L98k47J32j70J22o0j17O9r7L29j9q4j56K27K5j86R6J05o3p1m9Q2j0
$$ 90 -208 190 -57 75 -95 27 -33 -150 -81 -178 151 132 48 -108 119 144 -42 54 159 96 25 -24 58 48
4280D8k26L25j7k16q6P5Q9j18lj10Q1L6jk4K53k24M9J3j5K58j66O3j91J73k62
$$ 48 -178 147 130 -86 -172 -97 -8 -126 -129 -239 -158 -122 -123 -147 106 -118 -69 -56 -71 187 21 84 -107 66 -196
4305a96K61j40J33J11j45k0J41k35j54L18J21j51j31K78q9O7j29j2k18J69N6M
$$ -196 65 -75 58 169 24 4 145 -90 -244 74 195 44 -87 191 102 169 40 28 -190 -21 35 39
4327C9Lk27K95mk8K97k59k67J08Q8r0j2J29l1J69k02J0j99K20k55M44j53j52j04
$$ 39 42 -185 110 106 78 375 116 -151 -43 45 -45 -57 72 41 210 8 18 -181 39 -216 228 75 -77 -181
4351a81K17j83K49J60k68J68j10j59n0n6J03K35j22j55K70k89Q6K36j28j37J6
$$ -181 36 -147 102 262 -6 162 52 -107 -157 -213 -110 125 3 -152 118 -171 -85 151 23 -114 -98
4372i8K55r9m7k88L89j56j2J13J59j67J13k82NL34l83K21j22k8K22O4q5P9N1q9
$$ -98 157 58 11 -277 112 -44 -56 57 216 49 162 -120 -115 219 -164 57 -65 -93 129 193 108 187 238 149
4396A49j36n4%o6L86n44L12j17J33J40j59N3j77l1L72l18J31j50j41K64k29J45
$$ 149 13 -41 -41 -107 279 -265 47 -70 63 203 44 97 -80 -111 261 -57 74 -76 -217 47 -182 -37
4418c7j04J10n4L8r9J53N2n0MJ54k43NK20j01k6Q7l86K90q1j57L7K21L17j63j14
$$ -37 -141 -31 -85 -47 -146 7 59 9 13 167 -76 -71 149 48 22 109 -277 13 -68 -225 -188 33 350 187 73
4443G3j94Q5P1o1R9j83M1pJ7K16k20J45Q2J2k01k17K80k72J10L17k53k80K98K28
$$ 73 -121 -36 35 -26 73 -110 -69 -76 -59 157 -63 82 164 176 -25 -242 38 -234 -124 193 -60 -340 -42 186
4467A86k11Ql6j0K27k01j07L19k08O3k6j91j76L73j91J69L5J1N7j46J02n4R3k99
$$ 186 -25 -17 -53 -63 164 -37 -144 175 -33 30 4 -187 -363 10 -181 -12 23 34 91 -55 47 -7 86 -213
4491b13L71j0P9j91K46j7l02J97o3q1j62K44p6o9j15K03k04K36K01o0l69K87Q7
$$ -213 158 148 227 36 282 265 -37 160 97 16 -146 98 22 -47 -162 41 -163 73 274 214 -155 132 219
4514B19l66k1K90k41k56J18J37L59k07k6O3k65N0K72jj15J3N9o2j84k83N97j34
$$ 219 -147 -168 122 -119 -375 -257 -120 239 32 6 69 -196 -146 126 125 10 23 82 20 -164 -447 150 16
4537A6k42M05n5j99J26P8j12j44J98P7r0k40J17Q7J3j73J33l7j4K9r2J18J0k67
$$ 16 -226 179 124 -75 51 129 17 -127 71 148 58 -182 -65 22 35 -138 -5 -42 -56 -27 -119 -1 9 -258
4561b58L43q7j48K31L9j87J37j25J12M7r7R8j59KL9o3j9k01K39M57l06p8K80j26
$$ -258 85 -2 -150 81 120 -67 70 -55 57 104 7 105 -54 -52 -13 -76 -95 -296 -57 400 94 16 296 170
4585A70k60J92k76K87k84K41R0K3j9j49J45j84j9o0M27m20J43p6r1Q5l7K20l17
$$ 170 -90 102 -174 113 -171 70 160 183 164 15 160 -24 -43 -103 324 -96 47 -29 -120 -35 -72 148 -169
4608a69J43j6J33j13j98J39Q2j84L82m37M34o8j41j45J0L2N2M3j22K57k29K40
$$ -169 -26 -42 91 -22 -220 -81 1 -183 199 -238 196 128 -13 -158 -148 -116 -64 -21 -143 114 -115 125
4630A25l37L70l50j02K46K38j3j91m8K76k75j51L68J50n26J35J21n3M2J61l44
$$ 125 -212 158 -192 -294 -48 190 177 -14 -62 214 -61 -212 156 306 -220 -85 36 -17 25 186 -158
4651a58J21j16J50j19O0L25m54K80j56r8J72j29O7K22l85K76l18M53m1j66j4J91
$$ -158 -37 -153 -3 -122 -62 263 -191 89 -67 -165 7 -122 -55 167 -218 58 -260 193 152 -14 -28 163
4673A63j22j38j28Q9J89j47J39Pm3k11L44j42J9j04P0J44j38M6R0k02J94M6n9
$$ 163 41 -97 -225 -136 53 -94 45 52 9 -202 142 0 19 -85 -15 129 -9 37 127 -75 119 165 106
4696A06m8o0J08K9j31k6o8j98K44k3J60M5k41O6k53J92K97q9q2J44j0k61l1M39
$$ 106 58 -2 106 135 4 -22 -90 -288 -44 -67 93 138 -103 -37 -290 -98 199 110 28 172 162 -99 -130 309
4720C09l06j34p4J15L42j61k15N7jNJ06Nk54j02M09k52J82p0J20J92n08L56j1
$$ 309 3 -131 -205 -90 252 91 -124 -67 -68 -63 43 48 -206 -308 101 -151 31 -39 81 273 -235 121 110
4743A10l82L02r4Q4l4o6K49r6n5kqO1l41J45R3L40j62j30j4j30M2J98rj21K47
$$ 110 -272 30 -64 20 -14 -80 169 73 18 16 8 69 -272 -127 -34 306 144 14 0 -130 -88 110 101 -20 227
4768B27l22k2R6o2J0j80K23o9N5m5K28n0j22r3m8K33j17K2Q2m61N66K0l38N3o3
$$ 227 -95 -117 -21 -83 -73 -253 -30 -99 -44 -89 139 89 -33 -126 -174 59 -58 -36 46 -415 151 171 -167 -114 -177
4793a77M06j57l21K88K74m22k9mP8m5o3o9J0ML29L8j07k7K5k6k70L10J59m3p4
$$ -177 229 72 -249 39 313 -109 -138 -142 -64 -109 -172 -241 -231 -227 102 140 33 6 31 5 -265 45 204 161 87
4818H7pk19J32J28j15J32l74M47j33p2k63L35k1j74J34l7l27O03m18J28Q3n4l33
$$ 87 80 -139 -7 121 6 138 -236 211 78 6 -257 78 57 -117 17 -20 -347 256 -162 -34 49 -5 -338
4841c38N79k31o1n1K00j7K29p4j76o1j46J39O0j8M6p5k2l9J01O8k01j4K58k13
$$ -338 241 10 -51 -102 98 81 310 236 60 -1 -147 -8 52 34 80 5 -17 -56 45 113 -88 -102 156 -57
4865e7j40J66J2J61k21J2O6k67K59J55k11R7r5l3J2K19j97j03K61q0K67j52k55
$$ -57 -197 -31 -19 142 -79 -67 -1 -268 -9 146 -65 32 -63 -96 -84 135 -62 -165 96 16 283 131 -124
4888a24M64m30K01j03J6j0J87k62J49j10M5j47J44Ok22M6J38q7N3Q4j41o3j09
$$ -124 340 -90 111 8 24 14 201 -61 88 -22 23 -124 20 26 -196 -150 -12 -99 -46 38 -103 -166 -275
4911b75K21N0J06n3p0q5N2K4j7k42K62L39l31l20L30J04r4J12n4k5J62k17j76
$$ -275 -54 -4 102 49 -21 -106 -54 -30 -47 -289 -27 312 -19 -339 -9 95 1 113 59 34 196 -21 -197
4934a97J16j00L22j21R8j45L9j23NQ1J35j16J93k29L42k91j66J1K8J09R6J05j99
$$ -197 -81 -181 141 20 118 -27 12 -111 -106 -25 110 -6 187 -42 300 9 -157 -146 -118 -9 87 192 -7
4957gN3M0n5o3j97J60J57j45K68q7M8Q3j83m7J12m50M40j56o0N3J60j15q5o2L33
$$ -7 46 86 31 -32 -229 -69 88 -57 211 124 172 255 72 25 137 -313 127 -29 -89 -36 124 9 -76 -138 195
4982A95l34l1lk0J37M8k5j58K67o2n1J18j02N5J43O1k39l9K11j47j15K07q4N1
$$ 195 -139 -170 -173 -193 -56 -8 -33 -191 76 14 -37 81 -21 34 177 238 -1 -40 171 24 -91 116 32 83
5006H3l0j06r8N2K06O4K66n51K82o3j79J87L4k26O2OK48l18K25o5Kr7J10J17l14
$$ 83 53 -53 -151 -99 107 171 437 -114 168 105 -74 113 147 -79 -17 -11 237 -81 144 79 81 -16 94 211 -103
5031a03R8R6K90l64P6k03K16k26K38r4R6j64K0L41k49j89L04k54j49K6J81K03
$$ -103 -5 91 381 17 93 -110 106 -120 118 24 120 -44 -24 317 68 -121 183 -71 -220 -194 -13 190
5053A90m35J85K75j96m5M9J81k30k09K87j64j73J95L24O1k84J1K16n69K07K73
$$ 190 -245 -60 215 19 -26 23 204 -26 -235 52 -112 -285 -90 234 295 11 22 238 -331 -124 149
5074A49o6n8ok3r3k84L17p4q8K81j52K01j63J0O2J29j54p6M58l22k69K45j6j07
$$ 149 83 25 19 -4 -97 -381 -64 -138 -226 55 -97 104 -59 -49 13 142 -12 -88 370 48 -221 24 8 -99
5098i9Qr1Q0L28j84J0J82l33m5J95j13K57j24J8j14o9O7J68l78K60j4l0j20J74
$$ -99 -91 -182 -102 226 42 52 234 -99 -144 51 -62 195 71 89 -25 -94 -27 141 -237 23 9 -21 -141 33
5122C3P7j89p2K86M2l67K33P7l30J63M19l79J22l3K39l98j06P9J23o3lK3J26N
$$ 33 110 -79 -151 135 177 -190 43 120 -210 -47 372 -7 115 82 321 -77 -183 -104 19 -44 -47 -24 102 107
5146A07k90K85j1n03L95J15j77k35K94L4j87n8K01k0l6l0L40k65l2R3o5J52q7
$$ 107 -183 102 91 -412 -17 98 -79 -314 -20 14 -173 -231 -30 -50 -86 -116 224 -41 -73 20 -45 107 20
5169B0J64J55l38r4Q8K5l30L94O9l87M16l0l4k27j71M11j55j05r4L63j79j27L62
$$ 20 184 339 1 -93 -5 20 -310 84 153 -234 182 152 118 -109 -280 131 -24 -129 -223 140 -39 -166 196
5192A96l54L29l16K81O7m01K5J72J44p5k5Kj75K15P5m8l58N25l76L0nQ4L97n45
$$ 196 -158 171 -145 136 203 -198 -173 -1 143 68 43 45 -130 85 160 112 -246 279 -97 -67 -72 12 409 -136
5216a36M24j81M5k37K04n2m07L54r9L20l19lK03j02j35q1M22l31m2K97q5k16J40
$$ -136 288 107 152 -85 119 67 -340 14 -85 235 -84 -87 116 14 -121 -202 220 -111 -153 144 59 -157 -17
5239a7J07N8j20K6J06Jk93M7K8K12M2k33r4qK03k89K50K10M6j11M3k50Np9J73
$$ -17 90 148 28 54 160 161 -132 -85 -57 155 197 -36 -130 -138 65 -224 26 236 282 171 214 -36 -31 -110 63
5264F3l8o7K0j02L0k8J03J42k91J04K64k78r0r9QJ77Q1J62o5J4j26j4K70r0n6
$$ 63 25 -42 -22 -124 -94 -122 -19 123 -168 -64 200 -78 -168 -267 -259 -82 -1 161 96 110 -16 -30 240 150 94
5289I4j21n9N5K53k95K61j98J37n4k31M07k49J38N3j65p7K46k73J63l7J5K8J01
$$ 94 -27 -86 -31 222 -73 188 -10 127 73 -158 249 0 138 191 26 -51 195 -78 85 48 63 91 192
5312A92J25j97j36qj74L66j01krJ30k48j77M78m27M0OM21k8m79L96j68j5J15L9
$$ 192 317 120 -16 -24 -198 168 67 65 56 186 -62 -239 239 -188 -148 -142 279 251 -228 168 0 -15 100 139
5336A39o8J92l73J35l3O5K1P7k90L46N2k01o0j16J17q6J25P3j33N2k04J81Qo8
$$ 139 71 263 -110 25 -8 57 78 155 -135 211 263 62 2 -114 3 -83 42 115 -18 34 -170 11 19 -49
5360d9j53K7P0J29j52J79O0k62K11j78J07J01L3j12m2J68j13j43q5K22K16m25
$$ -49 -202 -175 -105 24 -128 51 111 -151 60 -118 -11 90 123 11 -31 137 24 -119 -204 18 234 -191
5382a91k3M09n1k26K31j61N3P2k24N0R5j62J60j68J42L49k38k12K69k44j80K10
$$ -191 -214 195 144 -82 149 -12 41 113 -111 -61 34 -128 32 -136 6 355 117 -95 174 -70 -250 -40
5404d0j06j40M51n9j74r6j06L8R0K76J22k77j10j4J87k43K80j62k1J84L2M6J40
$$ -40 -146 -286 165 106 -68 -164 -270 -232 -142 134 256 -21 -131 -145 42 -201 79 -83 -104 80 112 158 298
5427B98m70J58j57J53oj31O1j74K07J56o8N3J6l9r6J20j44J45M8k8R6n1j51l4
$$ 298 -172 -14 -171 -18 -24 -155 -94 -268 -61 95 27 80 96 57 -39 81 -63 82 130 102 198 147 -4 -38
5451c8J9P2k74K92k7k31J23N8P6KJ16l28L73j16j91k5K74j31R5J01l85n1J91J61
$$ -38 -19 53 -221 71 44 -187 -64 -6 70 72 188 -140 233 117 -74 -99 175 44 139 240 -145 -196 -5 156
5475A56k53MJ89L1j54J90k58j1J69k07R7J44p4k58j8J73J8J74q0P4j33J05K29
$$ 156 -97 -93 96 127 -27 163 -95 -106 63 -144 -47 97 23 -235 -253 -80 -62 112 32 106 -27 78 307
5498C07l5k92j07R0L21k85j68J82J36p9p2J36l72L2J78J42Q5j16M5P3k57o4J85
$$ 307 272 -20 -127 -37 284 -1 -169 13 149 70 -2 134 -238 -206 -28 114 199 83 128 201 -56 -120 65
5521F5j57j32J30K39k25j45K89o0J92j92J26q2M1j23M7o5J94k53J69q7p1m8J17
$$ 65 -92 -224 -94 145 -80 -225 64 4 196 4 130 48 89 -34 13 -52 142 -111 58 -29 -100 -148 -31
5544c1J16q5k18J74K12l59L73m50K36q5o1L31k54J55K4k61J70P9n2L3j23Q8k31
$$ -31 85 0 -218 -44 168 -191 182 -268 -32 -117 -178 153 -101 54 78 -183 -13 66 14 47 -76 12 -219
5567b19L25j22j09K70j64Ln7K19k6j58J98l49L78m9j70L2j7M0M5J18m10K13J55
$$ -219 106 -16 -125 145 -19 -16 -73 146 120 -38 160 -189 189 140 -30 2 -15 25 70 188 -222 -9 146
5590A46jj9l22L17k55l9L03j49j0n4J63J53m06J28L23k27p9j10J98l8j63L16l64
$$ 146 145 126 -196 121 -134 -173 130 -19 -29 -83 80 233 -173 -45 278 51 -28 -138 60 22 -141 175 -189
5613a89J50K38j12K3k97oM9M02k7k04M4j40Q9k06J72j4J95j19rk30M08M1n22L80
$$ -189 -39 199 87 110 -187 -193 -144 258 231 27 71 -69 20 -186 -14 -28 167 48 39 -191 217 258 -264 116
5637A16L4L1j42J80j13p5Lj99L2k17L84j05M8k37M47k72K70k50O1J03j58K6N5
$$ 116 150 181 39 219 106 31 34 -165 -133 -350 34 -71 -23 -260 187 -85 185 -65 -4 99 -59 -33 22
5660B2J65n7P9j92K61l83p8J93N7m6P1K6k93j7L19j30jL8R0l02N6J63k75L13N9
$$ 22 187 130 209 17 278 -105 -183 10 67 21 92 118 -175 -192 127 -3 -4 34 124 -178 -122 41 -234 79 138
5685A38N9Qk59k72K98Jj11L32k07L25m00J52Q8k83J90l6p6J25k44K59p0n5J00
$$ 138 197 205 -54 -326 -28 -27 -138 194 -13 312 -88 64 152 -131 59 23 -53 72 -172 87 17 -38 62
5708F2N0q0o6P6j48l8L21J02n09K09J97k35J20RO3j83j70K57j61M4o8K48p8k41
$$ 62 112 32 -34 42 -106 -144 177 279 -230 -21 176 -59 61 70 133 -50 -220 37 -124 -80 -148 100 22 -219
5732b19KK02Qk96K26L00j68j14j27L99j77p0J80Pj92l0l1j78K52R1M1p5l25L48
$$ -219 -217 -15 -7 -303 -77 223 55 -59 -186 213 36 -34 146 153 -39 -69 -100 -278 -26 65 106 31 -294 54
5756E4J26k21N5J10k20l1n1K57J38l63J71K04m31J72K19j59Q4j76j22kJ09J1l9
$$ 54 180 -41 14 124 -96 -127 -178 79 217 -146 25 229 -202 -30 189 30 114 -62 -184 -186 -77 -66 -105
5779a05N7J65P6r4j38o2M24m07J15j5J86k94J67r5L6q0m2PJ15J25P1j61O0q8K90
$$ -105 -48 117 193 99 -39 -101 323 -84 31 16 202 -92 75 -20 16 -64 -106 -99 16 141 212 51 111 23 313
5804C13l50q5q9K71j07j7J41k0j29J85l2j9l52M09m03N02k89J09J22k5j68p3L12
$$ 313 -37 -122 -211 60 -47 -64 77 57 -72 113 81 62 -290 119 -284 218 -71 38 160 135 -33 -106 206
5827B06l34J50o0K68k20J61n19L39j57O45n52k65K22L83j90k74q8L83k02K38k47
$$ 206 -128 22 -38 230 10 171 -348 -9 -166 479 -73 -338 -116 267 77 -197 -285 98 -104 134 -113
5848a13O3J17N3J0p1o6O8l17J23J49l20M93j12k15J62Q9J68l76K23o2po7J63j59
$$ -113 -50 67 120 130 59 -7 61 -256 -133 16 -304 189 77 -138 24 113 281 -95 128 66 59 -8 155 -4
5872dQ7k0J05n1M0m4m2J65n60M61J29k47l1j8L24l24L25o14J81J85R7q7J59m17
$$ -4 83 63 168 117 157 113 71 236 -324 137 266 19 -12 -30 294 -30 295 -319 -138 47 144 57 216 -201
5896b01J05L2n5Q4r1L50n75L96J01j51K3k29M7K16o9P3K84m21J72M9Mm05K27m4
$$ -201 -96 -64 -119 -35 -126 224 -351 45 146 -5 18 -211 -164 52 -17 56 340 -81 91 140 144 -261 -34 -78
5920g8r4M66Q6m53R7J92j83l12M37l10J6M2L15k15J2p7J41K9J2o2m1j90J17j40
$$ -78 -172 294 380 -73 24 216 33 -279 158 -152 -136 -94 221 6 18 -59 82 111 123 61 20 -170 -53 -193
5944a93K41N3r1j82K04Q1j43K90l91P6j1n5j28L24l78L23p8K84j43K4J17k02j69
$$ -193 48 101 10 -172 32 113 -30 260 -131 -55 -66 -121 -249 75 -303 20 -58 226 83 107 224 22 -147
5967a47K00lJ05l59K18o0L3J82j76l2J31O8q6j46J9n4R7O1j80J55l62L60n0LK4
$$ -147 53 50 155 -204 14 -46 -13 169 -7 -39 92 160 74 -72 -53 -107 -10 51 -129 26 -336 24 -26 -23 1
5992Aj00J34Q2K2L8jj12k32P1O2J71m6j18J11r5K55j78O2j25L06j56q9R2Kk90
$$ 1 -99 35 117 139 177 176 64 -168 -97 -35 136 90 -28 83 -12 243 65 127 2 308 152 63 155 157 -133
6017a33N8M6J32ql8j34J09N7j06j92m16N93J78m0N9j86K46j74l6L13k25j8j27
$$ -133 -75 -29 103 95 57 -77 32 89 -17 -209 -625 -32 146 106 165 -21 225 51 15 328 103 85 -42
6040d2J49j51R2J25m10L65k04j21J00J47l14K64Om32L31K47k61l8K55K8o3O1l3
$$ -42 107 -44 48 173 -237 128 -76 -197 -97 50 -264 0 6 -426 -95 152 -109 -147 108 136 73 134 101
6063A01k29L00k41r4l4K64k31R7MM02m27m9K97q4r5J6J4JJ17p5N4l90L18K40j97
$$ 101 -128 172 -69 -163 -197 67 -164 -67 -63 339 -88 -137 160 76 -19 -3 11 12 129 54 108 -282 36 276 79
6088G9j85q0o4k7J33J26J39k60qJ32J05j00q2oj27L58j71L61l75P9J91j14l94
$$ 79 -106 -186 -250 -277 -144 -18 121 -139 -147 -15 90 -10 -92 -98 -225 133 -38 323 -52 27 218 104 -290
6111b90M84m11M45k68j47J28M3J08Q1m5K63j44k84J26k54M9K10q2m3k2j13K70
$$ -290 194 -217 228 -40 -187 -59 -16 92 173 128 391 247 -37 89 -165 -116 94 12 -31 -53 -166 104
6133A04l8q1L61k50k32K69R5k83j38K16o5Q8j98K40Oj25k82K31N0J12l09K34n6
$$ 104 66 -15 346 96 -136 133 228 -55 -193 23 -42 46 -152 88 94 -31 -313 -82 -32 80 -229 5 -51
6156e1j78L93l93J7J10J75K75l97K1J41j56j83L56k15o9J25j63Q5P9k69K93j5
$$ -51 -229 164 -229 -212 -102 73 348 -49 -28 113 -43 -226 130 -85 -154 -29 -192 -107 -28 -297 -4 -19
6178a9j50L58k54k96K72J1Q2k02K00j51j9K06j28L49l39J46L74m20j30K6L22K4
$$ -19 -169 189 -65 -361 -89 -78 4 -198 2 -149 -168 38 -90 259 -80 66 440 20 -110 -84 238 262
6200B62k02k55m4k5K66J3j42L54k25K66l85J64r5J25j05k41M92k80m3n4K73r0
$$ 262 60 -195 -239 -264 2 15 -127 227 2 268 -117 47 -48 77 -28 -269 223 -57 -100 -154 119 29
6222B9p5Lo3o2K03M5Pj74J39mJ71l75LK55o1j69J41m0j18J3m9K32o1N6Pq9J86
$$ 29 -46 -43 -106 -168 35 80 87 -87 52 48 219 -156 -153 102 41 -128 13 -27 -145 -132 -181 51 -10 46 53 -36 150
6249A50k16J05j02O4P0n1L3j59K67j64j76J34M43n37J69J5Lj42M8J39j88R2J1
$$ 150 -66 39 -63 1 71 20 53 -106 161 -3 -179 -45 398 -139 30 45 48 -94 -46 93 -95 -3 8
6272Hj60K08L1j70J39R4l36L52l91K08j00J06j0j10J45p9n4O4J82o4l07J92K84
$$ 8 -152 56 87 -83 56 150 -186 166 -225 -17 -117 -11 -21 -131 14 -65 -119 -55 127 63 -244 -52 232
6295B32k76o4l0M88m45Ok4j10K44k09K91k20J19m2K85j14j96P8r1N2L1Q6LJ72
$$ 232 -44 -108 -138 350 -95 -89 -113 -223 21 -188 103 -117 2 -40 245 131 -65 13 -78 -26 5 91 94 266
6319B66p3m25J05j3j11M90k58K3k5P6j56pK26r2J96k51K9k64J49l9P2P3K0J19
$$ 266 193 -232 -127 -140 -251 239 -19 4 -21 55 -101 -108 118 26 222 -29 0 -264 -115 -154 -82 -9 11 130
6343A30l5m7j17K13r9r2j65J53l7L03j36q3L04l22J79k18K21j00K3J13l75J55
$$ 130 95 48 -69 144 45 -47 -212 -59 -96 207 71 -12 292 -30 149 -69 152 52 75 188 -187 -32
6365c2K9M6om6K51k09O9j64N7M9J01j70q8ON8j19k2L16J1j36k14N80m07O4k11
$$ -32 -3 43 37 -9 242 33 102 -62 -5 44 145 -25 -113 -107 -49 -168 -190 126 137 1 -213 367 -40 24 -187
6390a87L85k67k03K98k40M10n4j03j35J33k22K36K1l7J68q6j94K07j77j26K87
$$ -187 198 -69 -272 26 -214 196 142 39 -96 37 -185 51 72 35 203 117 -77 130 -47 -173 114
6411A14m3N9j82J67Q1m8k31J28k8J28k71L73p0j22q3j39J99J11j95J18j4o6O0
$$ 114 71 130 -52 115 196 148 -83 45 17 145 -126 247 177 55 -28 -167 32 143 -52 66 52 -14 46
6434D6J77l41O6O0J4J04M4k73J42j93K19n0j43K64L8k06L7J9O3J24n63K64j43
$$ 46 223 -118 -52 8 22 126 170 -103 39 -154 65 15 -128 136 174 -32 5 24 87 211 -352 -88 -231
6457b31J41L39k74J18R0m43J63k7K07r2rK67k96Q9K81k44p0n0J06m4M6j78M57
$$ -231 -90 249 -25 93 183 -260 -97 -124 83 -9 -18 249 -47 42 323 79 9 -41 65 21 67 -111 346
6480C46m31J56p3j0k47J94M3j80J02O7Lp0l43N26n7j14K17Mj09o9P7J16k58L41
$$ 346 -85 71 -2 -12 -259 -65 -22 -202 -100 -33 -30 -100 -443 83 26 -88 129 133 24 -45 32 148 -110 231
6504B31k75Q7P8P8j27k99J60k38J88j20L43j63J16k52K04p9j7L9K1L24m92Q1J88
$$ 231 -44 43 121 199 72 -227 -67 -305 -117 -237 106 -57 59 -193 11 -68 -85 -46 -25 299 -193 -112 76
6527G6q7r0J74l51K72j8K08k09o4M36l00j64J82oo8K2P2j51k37J1J48J43J31r7
$$ 76 -11 -101 73 -278 -6 -24 184 -25 -89 347 47 -117 65 59 -9 13 85 -66 -303 -292 -144 -1 130 33
6551C3Lj11J16R4k11K88j34K5k89K67P1l01J63l27K09J90j19p0m6K16k00K07j45
$$ 33 36 -75 41 135 -76 212 78 103 -186 81 152 -149 14 -313 -104 86 -33 -103 -149 67 -133 74 -71
6574g1k38L65l12L88k09K33l76J95L01m46K06l01K03O2j47J74k61M45j30J36k88
$$ -71 -309 56 -256 132 -77 156 -220 -25 276 -170 36 -265 -62 0 -147 27 -234 211 81 217 -71
6595g1%K07j16K6k45K16r8L6O3q9J67R7j20p7j01K16R7k69k8J1p3M4L90k77q4
$$ -71 -71 136 20 46 -199 17 -81 -45 18 -71 96 193 73 -4 -105 111 208 -61 -89 -78 -151 -107 283 6 -78
6620g8n4O1J55P2r4j42J59j88J61J6j3J13j28nL4j45K36j71N6J29j97J42l53J27
$$ -78 -132 -71 84 156 62 -80 79 -109 52 68 55 168 40 35 69 -76 160 -11 45 174 -23 119 -234 -107
6644a07J95k10r9N4j4J80j07K41o8L1q7K53l62j80J54l2L70j94P2k26r0N3J08
$$ -107 88 -122 -221 -167 -181 -1 -108 133 65 96 9 262 -100 -280 -126 -158 212 18 90 -136 -226 -173 -65
6667f5M9N5q3K17k17O6jk6M7j41J39J17k09q2j17K25q3J76p8J94l01J04K92j77
$$ -65 -16 39 -44 173 -44 22 21 -5 42 -99 40 157 -52 -134 -251 -26 -109 67 -11 183 -118 -14 278 101
6691A01Q8j15o2k26Q9K19j96r4M41n1j47J6k06O6q1p2L48j72J02J05N8l48K99
$$ 101 189 74 12 -214 -125 94 -102 -196 245 194 47 63 -143 -77 -158 -230 118 -54 48 153 211 -137 162
6714A62l30L40j61L04k47Rj53P5K10q7k40nK43j35J56m7j57k4K11M0k95Q1n9K36
$$ 162 -168 172 11 315 68 77 -76 -1 209 122 -118 -123 120 -15 141 94 -63 -87 124 164 -131 -50 -109 127
6738A27j23J40K16l45JPL9j00k17L68r8K63m93K73k47L0K02J39m02J85r7J57k07
$$ 127 4 144 360 15 16 23 62 -38 -255 113 15 278 -215 58 -189 -159 43 182 -220 -35 -132 25 -182
6761a82j7M00N1k75K9j51J97O3r5J19l05Q1o1J8Q2P9J9o4k10M15J11l91j45M81
$$ -182 -199 201 252 -23 6 -145 52 115 20 139 -166 -85 -146 -128 -46 33 52 -12 -222 193 304 -87 -232 249
6785B49j25L6j0J6j35j58J5J42Q9j32m9L3RO4j69Q5k58Q1L57R0j26k11K61p0k96
$$ 249 124 160 150 166 31 -127 -112 30 119 -13 -62 -29 -20 44 -125 -40 -298 -217 140 230 104 -107 154 84 -212
6810b12J05L02o7k60J57j23j85K39qK14j63O5Q3l00L53l53M3O7J84l15J43K26
$$ -212 -107 195 128 -132 25 -98 -283 -44 -52 162 -1 64 147 -153 200 -153 -110 -43 141 -174 -31 195
6832A95l37N2M0J22K3m00K10K37l2k15L94k99j04qJ60k6j64N1K08j38j74J52O4
$$ 195 -142 -90 -50 72 95 -305 -95 142 110 -105 289 -10 -114 -122 38 12 -152 -101 107 -31 -205 -53 11
6855A1J48r1Q7J9n3r4l6M4k47P4J85j44p1k4Q5K5O4j0o6P6O3K80j10k73J75k18
$$ 11 159 68 155 174 121 27 -9 35 -212 -138 47 -97 -168 -192 -107 -82 -18 -28 -94 -18 45 325 215 -58 117 -101
6881a01kj16K39Jj22K45J02k83L6k3k11n7L23O3j83K04k30R8J41p2k21K77k03
$$ -101 -103 -219 20 21 -101 144 246 -37 -1 -24 -235 -292 31 94 -89 115 -115 -17 124 52 -169 108 -95
6904i5k04K34Q9j74L9J91j51N1l3L36j53j81N3K65m98M7k0PK68j39J89k25K19
$$ -95 -299 -65 24 -150 -111 80 -71 -20 -53 283 130 -51 2 267 -231 -184 -204 -197 71 -68 121 -104 115
6927A15L1n5Q8l62K16J74l17J36p4J8k81J47L20m13L33J3k70J33O2J30M7m20L15
$$ 115 146 91 179 -183 33 207 -110 26 -48 -30 -311 -164 156 -257 76 89 -181 -48 14 144 191 -229 86
6950H6M0L2k63J21O8J68l38N32m67P3k69K97m8P0K26l57M1j99L80k49j34N9L20
$$ 86 126 158 -105 16 84 252 -86 446 -21 52 -217 80 32 102 328 -29 12 -187 193 -56 -190 -131 189
6973A89k61J21k28K18j96J45K23k90r9P4L21j86J36k40N9m8Q4l21K86K19j92K36
$$ 189 -72 49 -179 39 -157 -12 211 -79 -178 -104 217 31 167 -73 -14 -62 22 -299 -13 206 14 250
6995B50k53k58L11Mk37J35o6P0L9N9l40J32Q3J50j31O3k9j86j39L60l7j2L80m50
$$ 250 -3 -261 50 54 -183 -48 -114 -44 -5 54 -286 -154 -71 79 -52 11 -18 -204 -343 17 -20 -32 348 -102
7019a02J9kL05l23J91o9p9R6K9r9l5J86M6l74P7L65j14l25J16J54K64j90k33L35
$$ -102 -83 -85 220 -103 88 19 -60 36 65 -34 -69 117 163 -211 -134 231 117 -208 -92 62 326 136 -97 238
7043B38J42j57j25k71M1J1mJ45J10j46O4j55O8J38J0k41L30j29j7Q7l94J82l9
$$ 238 380 223 98 -173 -132 -121 -125 20 130 -16 48 -107 -39 99 109 -132 198 69 52 139 -255 -73 -112
7066a12K65k56J93n5Q9N3K0j08j10n7J60r3L4j3O5k9O2n2L7j91J42j98J55K5j4
$$ -112 153 -103 90 35 124 177 197 89 -21 -78 82 -11 23 10 75 46 108 56 93 -98 44 -154 1 26 12
7091A2o2KO7L4m5o1J06q8p9K09N2K9j16L8j14l55N34k50pPj10N2l7L18l1L0q6
$$ 12 -50 -48 19 53 8 -53 53 -35 -114 95 147 176 60 98 -16 -371 163 -87 -94 -87 -197 -145 -182 136 105 135 49
7118D9LJ00J04k63k44M50k9m16R6J18K9j7J72j61qJ25N1p4m1r3j68N5L02j40j23
$$ 49 52 152 256 -7 -251 199 170 -246 -150 -32 -3 -20 152 -9 -17 108 159 85 44 -49 -217 -162 140 0 -123
7143a23R5M4k15n6K06K2Lj06K70k90K64k28rq4K36K3j67J16l8R1k36O3Q2J60l7
$$ -123 -28 16 -199 -255 -49 -27 -24 -130 140 -150 114 -114 -123 -207 29 52 -115 1 -37 54 -182 -119 -37 123 86
7168H6m2j45J05L8R9k49P3J47j2o6J04l18K50R2m56K44J57j91P3o8P2j80M9N2
$$ 86 44 -101 4 42 141 -108 -35 112 100 34 138 -180 70 162 -294 -50 107 -84 -11 -79 -7 -187 -138 -86
7192h6K14j86M8MJ56k33L4R1k87J4J25M6K96l56J78K94l83r0o8L12j25R9O4l06
$$ -86 128 -58 -10 -6 150 -83 -49 42 -245 -231 -106 -60 236 -120 58 352 -31 -121 -189 123 -2 97 161 -145
7216a45J28J82j25kj12o6R3J09m06M72r0M7O6j54K02j18k1o7n9K75j45l7K06l52
$$ -145 -17 165 40 38 -74 -140 -47 62 -344 128 38 85 151 -3 199 81 60 -7 -66 209 64 27 233 -119
7240a19j3j2R9l41N95r8J51k88k7M1J29O0k93P3j31K22J0J78k30k03L87j96m6
$$ -119 -132 -144 -45 -386 209 111 262 -26 -53 -12 117 177 -116 -43 -174 48 58 236 6 -197 190 -6 -52
7263e2R8p8K18k17J3j1R4l0k35J27K75k65k5O6j4l4J89K37n55K81K0P1k40l07
$$ -52 46 -32 186 -31 -18 -29 65 35 -200 -73 202 -63 -88 -22 -36 -70 119 356 -199 82 102 173 -67 -374
7287c74J74Q0N6K55k6k46r3L21j57l8J25r6l9K73j96j38J78O0j49k1J95m0k79
$$ -374 -200 -120 -64 191 165 -81 -174 147 -10 -48 77 -19 -58 215 19 -119 59 119 -30 -51 144 104 -175
7310a75l7K93j80J98j59J07m8J90m0l32J20J38kK04k07k73J94m8K63k03M4p9J55
$$ -175 -212 81 -99 99 -60 47 -1 189 149 -183 -63 75 73 277 70 -203 -9 -57 206 3 47 -32 123
7333A23L4k52K29l33J87o6oJ28O4l35J73NM0P6k07K57K15l29K9J52l08K66q5l69
$$ 123 157 -95 134 -199 -12 -78 -84 44 108 -227 -54 -49 -9 67 -140 117 332 3 32 184 -124 142 57 -312
7357c12K43n8K46n8k13J15J0L10l27L0Q7k38J68m6k1p0l4L59k00k14K74J06j37
$$ -312 -69 -127 119 61 -152 -37 -27 283 -44 -14 73 -165 3 -43 -64 -134 -168 191 -9 -223 51 157 20
7380B0N8j61J82k02j8J03l7J61j60k00K14j19P6K21k10j95M31k28L51m11J9r6
$$ 20 78 -83 99 -103 -121 -18 -55 106 -54 -254 -40 -159 -83 138 -72 -267 164 -64 287 -124 -105 -201
7402b01J17J46n4L4K17k77Q4j15o2L87k17l7L38n9l72J71k25l8j59K96j21J78
$$ -201 -84 62 8 42 259 -18 66 -49 -111 276 59 22 360 301 -71 100 -125 -163 -322 -26 -147 31
7424C1k41K56P0j01M7m3J9k45L73Q2j23p9K6rj40J31k1L0J97k45j55R1P6P9K0
$$ 31 -210 46 116 15 62 19 38 -207 166 248 125 46 72 63 -77 54 33 63 260 15 -140 -49 27 106 126
7449A26j61Q1Pl3q4Mq9J25J66k17J56Ok99P8p6L27j36l9L44l64K52j91p0K30q7
$$ 126 -35 46 53 20 -64 -60 -149 -24 142 -75 81 87 -212 -134 -210 117 -19 -58 286 -78 174 -17 -87 143 56
7474E6p4K77j40n4l21M17k16k9K82k82J31N7J01j23Rp6N4k9j5j27l2J03j98K06
$$ 56 -18 259 119 65 -256 161 -55 -84 198 -84 47 104 205 82 91 15 69 40 25 -102 -134 -31 -229 -23
7498b3k6p1L23m13M34pl65L56j12o7r9P5J63k69J15mk07L31k67J54n9J49J23m53
$$ -23 -49 -120 203 -210 224 217 -148 208 96 29 -70 5 168 -101 14 10 -197 134 -133 21 -38 111 234 -219
7522b19L17k60K5J21J49n2q3r7K82j23m13L97j4P1p6J52k83K29l16J87m%K35q2
$$ -219 98 -162 -137 -16 133 81 -2 -99 183 60 -353 44 30 101 25 177 -106 123 -193 -6 -10 -10 225 143
7546A43k03k9J75o6qj21j00L60j20o0K96j68k48J19Ml5K50l11K75j06k3k17j50
$$ 143 -60 -89 86 20 12 -109 -209 151 31 -29 267 99 -149 -30 -26 -61 189 -122 153 47 24 -193 -343
7569c43P55m89j47M3J46J98l34K99l18M41k62r4M40k15K7j25K7j8l01J79n3j17
$$ -343 412 -77 -224 -181 -35 163 -171 128 -190 251 -11 -105 335 120 147 22 49 31 -270 -91 -144 -261
7591b61K17N9J45k49J06j4J62j55K13j16m2j89j36L65Oq2K2j53J92j40K72l56
$$ -261 -44 15 160 -89 17 3 165 10 223 107 65 -124 -260 105 111 29 51 -102 90 -50 222 -134
7613a34k5K74k20K09Q9j70Q3k32J14R5l94L3K18J38O6j74R2L5j37j11J12j26L43
$$ -134 -159 115 -105 104 193 23 106 -126 -12 83 -311 -278 -60 78 144 -30 62 97 -40 -151 -39 -165 178
7636A78m10K01J02k24J87k94K6K46j53K75k97K0J38j04QJ05J40j51K51l94J34
$$ 178 -232 -31 71 -153 34 -260 -234 12 -141 134 -163 -143 -5 -109 -101 4 144 -7 244 -150 -16
7657a6j31K58k79k8J90o4MQJ77J14k19K34k14K91k15m2L4p2O6l3o7j40QM8J42
$$ -16 -147 111 -168 -196 -6 -70 -66 -58 119 233 14 248 34 325 110 68 102 30 96 63 -4 -144 -136 -88 54
7682E4J8K4j32J20j9j20Q8K9k89K34j42N00n50L3N10m62L08r8k71M25n07J04n0
$$ 54 72 96 -36 84 65 -55 33 62 -227 7 -135 365 -185 -152 358 -104 204 106 -165 260 -247 -143 -193
7705a93LJ91j56L6J32K7k12pK64j36J1j57J41L02k63R1l11L84j79P3k7o1J13o5
$$ -193 -190 1 -155 -119 13 40 -172 -179 85 -51 -40 -197 -56 246 -17 74 -237 147 -32 41 14 -47 66 1
7729AJ37j80OO2PqO2J24k67OO9J96l84K63m0j29q8J1oK97j08Q7n4j91Q1K38l77
$$ 1 138 -42 -36 26 33 25 87 211 -56 -50 19 215 -169 94 54 -75 -163 -152 -158 139 31 118 64 -127 -46 192 -185
7756a85O5K37j05K86j04k16o6K27l15L29k86L19k03j7%RL85k30J32l86P8j52K65
$$ -185 -120 117 12 298 194 -22 -88 139 -176 153 -133 186 -17 -34 -34 -25 360 130 262 -124 -46 -198 67
7779F7j06Q5J64j15j39Q4j53K34j31R3o6j60r8K89k53p0L68M0r7j4m3q2L13k56
$$ 67 -39 46 210 95 -44 40 -113 121 -10 83 17 -143 -241 48 -205 -275 93 133 36 22 -21 -103 210 -46
7803d6R7j65K25K2o7k04Q4N5j04K06j76j32J72q0K28Qo3J0k06J48K2P5k33KJ11
$$ -46 51 -114 111 133 66 -138 -54 1 -103 103 -73 -205 -33 -113 115 123 60 70 -136 12 34 109 -124 -122 -11
7828a1N6M4j37Q4l97J89J11M2j85J01K24k40L06j22n8k67K48M3P7j30m4M4k74
$$ -11 45 89 -48 36 -361 -172 -61 -19 -204 -103 121 -119 187 65 7 -260 -12 31 108 -22 -66 -22 -296
7851b96M00j9j18k48L5M4J80q2J79j27R6m2j5P9j55k0N5j90L28m17L08R5q6M5
$$ -296 104 85 -33 -281 -246 -202 -22 -104 75 -52 44 2 -13 66 -89 -109 -54 -244 84 -333 -25 70 -16 29
7875B9K60l47J28J19m15M01j40M8k3j92O3L44m48R4J30l22J72Q6J02j08l0M3O0
$$ 29 289 -58 70 189 -226 175 35 83 60 -132 -69 275 -173 -79 51 -271 -99 -13 89 -19 -49 -6 54
7898E4Q1j80j42J57J7K85l28L32j99k94L32J27j08k22J77j99K97m31K37K14j01
$$ 54 135 -45 -187 -30 -13 272 -56 276 77 -217 115 242 134 -88 89 -110 187 -244 -7 207 106
7919A06P1l12K44j64K22k03O7PO6k12K50L1k98J84k20P3J5rJ57P7j23k55M29l03
$$ 106 177 -135 109 -55 167 -36 31 38 104 -108 142 173 -125 59 -161 -88 -73 -82 75 152 29 -226 203 -100
7943a00q5K50m9k0J18k16OK18j94j82L50j26J88l8j6j23J33l60L48j17q0K60j63
$$ -100 -185 65 16 -4 114 -102 -96 122 -72 -254 96 -30 158 120 104 -19 114 -246 102 -15 -95 165 2
7966BN8j06O4j53P3j3r1M84m62j57J48k7J27J34l37J86J46j90J28J06j26M4k2
$$ 2 60 -46 18 -135 -62 -75 -166 318 -144 -301 -153 -180 -53 81 -256 -70 76 -114 14 120 -6 38 16
7989A6J21Q8j65j71O8J29J03j30Q4j29j67J09N6K43m89K00J49l77M36j75j15J55
$$ 16 137 225 60 -111 -43 86 189 59 143 14 -153 -44 12 255 -234 -34 115 -262 174 -1 -116 39
8011C9j95L73l61J14N9J36k26Q5j15NK39m0j02j47L99l54o3J41K09j06k20R0r5
$$ 39 -156 217 -144 -30 29 165 -61 24 -91 -86 153 113 11 -136 263 -91 -154 -13 196 90 -130 -40 -135
8034a35J4J67N8k13k1j4P4o9K73k44j5J60J27j83m9q4J29k27K46j99L41k93L33
$$ -135 -121 46 104 -109 -130 -144 -70 -139 134 -110 -125 35 162 -21 -70 -154 -25 -252 -6 -205 136 -157 176
8057A76j79K74k35q6J34kj49m9K07k57P8K96M4m60L34m6k92L21O1j59L6m30L88
$$ 176 -3 271 36 -50 84 82 -67 -116 91 -166 -88 208 252 -208 126 80 -212 109 170 11 47 -383 5
8080EP5k3l3m3r9K36j49J12l4J15k35J57j57J58J89n18K38j0j63m6K08j89J65
$$ 5 80 57 24 -19 -118 118 -31 81 47 162 -73 84 -73 85 274 -244 -6 -16 -179 -225 -17 -206 -41
8103d1R4o0K7J47J09l70J96J43l60m8L07j5J4p8j98K90J73k21k1m8j76J27j39
$$ -41 53 -7 20 167 276 -94 102 245 -115 -163 144 129 143 65 -133 157 330 109 88 40 -136 -9 -148
8126a48J9J48M1k8j10K99l5j58K13k34Q4K00j64o1j4j66J32j63J14MO2j02j15
$$ -148 -129 19 60 32 -78 221 186 28 241 7 91 291 127 66 52 -114 18 -145 -31 -27 35 -67 -182
8149a82J91q9R5r0l1Q1p2N0j81K98k20L46k54k25M42m6l66L64rl57J21J06O0R8
$$ -182 9 -80 15 -75 -106 -25 -97 -47 -228 70 -150 196 -58 -283 159 113 -253 111 102 -255 -134 -28 32 130
8173A30j79L9K36l46J31N2k82K67M3Kk7n0p3J81k41pJ61m51
$$ 130 -49 -10 226 -120 11 63 -219 48 91 93 66 16 -57 124 -117 -124 37 -414
8191d14
$$ Imaginary data points
##PAGE= N=2
##DATA TABLE= (X++(I..I)), XYDATA
0@%%%%%%%%%%Qj6J6j6K4l2L8m6N6o9Q2r3J10j34J57j81K08k42K80l23L70m19M75
$$ 0 0 0 0 0 0 0 0 0 0 0 8 -8 8 -8 16 -16 22 -24 32 -37 45 -48 62 -72 85 -96 112 -130 150 -173 197 -222 253
33B53n40O09o85P68q59R63j074J192j326J474j632J806j994K200k427K673k945
$$ 253 -287 322 -363 405 -454 509 -565 627 -699 775 -857 949 -1045 1155 -1272 1401 -1544
50a544L243l574L940m346M802n318N906o577P358q281R389j0751J2468j4707J7766
$$ -1544 1699 -1875 2065 -2281 2521 -2797 3109 -3468 3890 -4391 4998 -5753 6715 -7992 9774
65I774k2213K9287m2272P3641k84072k89044P18779J48789l74518J75681M95931
$$ 9774 -12439 16848 -25424 48217 -235855 -524899 193880 342669 -31849 143832 639763
76F39763k88501m40259J84847J29016m08420q5941L03007j10058l09760K16445
$$ 639763 351262 -88997 95850 224866 -183554 -269495 33512 -76546 -386306 -169861
86a69861K26303k29462J212M35600L710l80132P2355K72059k38738k46043K93539
$$ -169861 56442 -173020 -171808 263792 267502 -112630 -40275 231784 -6954 -252997 40542
97D0542K19264k26190n9686K07829o9347k21760P4779R4756j44259l9561R7805
$$ 40542 259806 33616 -26070 181759 112412 -109348 -34569 60187 -84072 -123633 -25828
108b5828j27978j45136J82992J51854j16337O8326K99265j2778k39216N9647J57883
$$ -25828 -153806 -298942 -115950 35904 -80433 -12107 287158 274380 35164 94811 252694
119B52694j52859j51165J11980j537k22265p1440O6298n3843p967J71797P7842
$$ 252694 99835 -51330 60650 59113 -163152 -234592 -168294 -222137 -230104 -58307 19535
130A9535l3680J19186J15411j20149n7478J64333J553k06299j3654Q5304j60947
$$ 19535 -14145 105041 220452 100303 42825 207158 208711 2412 -11242 74062 -86885
141h6885j56693J31514Q9591j02825N8176J73365p6656j25467J25530N3936j69760
$$ -86885 -243578 -112064 -22473 -125298 -67122 106243 29587 -95880 29650 83586 -86174
152h6174L2382K14969q4851j99032J48206J56756j96010p5921K55339J3239k81888
$$ -86174 -53792 161177 76326 -122706 25500 182256 -13754 -89675 165664 178903 -102985
163a02985Q581J79777j63742j92462J99668J43639j91315j3949K42997l0722j84406
$$ -102985 -94404 85373 -78369 -270831 -71163 72476 -118839 -132788 110209 79487 -104919
174a04919J52757J92438j66044j04537J94520j2082k75167P621J89134j20018
$$ -104919 47838 240276 74232 -30305 164215 152133 -123034 -115413 73721 -46297
184d6297j65776J73058J15707j93110l2292K26166O656j54911J06295J52195j43757
$$ -46297 -212073 -39015 76692 -116418 -148710 77456 84112 -70799 35496 187691 43934
195D3934j17277J32573J5182j68902L0478J54139p6119j20842J06736O7693j30360
$$ 43934 -73343 59230 74412 -94490 -64012 90127 14008 -106834 -98 67595 -62765
206f2765j2226J46049j9261j22755N6376Q3662r4994n3430J11048K9171q9493
$$ -62765 -74991 71058 51797 -70958 -14582 69080 -25914 -79344 31704 60875 -28618
217b8618K0874P6467n7610o5858O2683K9989o8562J475O2904l1004n3646M4167
$$ -28618 -7744 68723 11113 -54745 7938 37927 -30635 -29160 33744 2740 -50906 -6739
229f739L3042m4189M928N8442j6696m9196K3937J9405m3452n572M4405j3064l8783
$$ -6739 26303 -17886 -12958 45484 28788 -20408 3529 22934 -20518 -26090 18315 5251 -33532
242c3532K6068K2610l7296k131N0215k524l5229K4508K4198m2185j6899M1444
$$ -33532 -7464 15146 -22150 -24281 25934 23410 -11819 12689 36887 -5298 -22197 19247
254A9247k470m0816J6887K8419l5773k1210M0210M685l8588J8174M2854k6996
$$ 19247 16777 -24039 -7152 21267 -14506 -35716 4494 9179 -29409 -11235 31619 4623
266D623k9363L9857J7886m2169j5M4556j5937m4166J9640K3645l7562j7652L8676
$$ 4623 -24740 15117 33003 -9166 -9181 35375 19438 -24728 -5088 18557 -19005 -36657 2019
279B019L550l4155J6295L5723j9679j8475L7788J5745l6882n899L1008j5039l9223
$$ 2019 5569 -28586 -12291 23432 3753 -14722 23066 38811 1929 -3970 27038 11999 -27224
292b7224J0591K2833k3022j7604K5750J2834j7517L417K2833Mq139J0994M907
$$ -27224 -16633 6200 -16822 -34426 -8676 4158 -13359 -9942 12891 12895 4756 15750 20657
305B0657j2498q3Q283j0998j3548P930K668j8601o259J3380l55j2369O685J6927
$$ 20657 8159 8076 16359 5361 -8187 -257 2411 -16190 -22449 -9069 -9424 -21793 -15108 1819
319A819N48m141R721Q340l747m91L389m080n487K750j140j1253l182O132n218
$$ 1819 2367 -1774 7947 16287 12540 12049 15438 11358 5871 8621 7481 -3772 -6954 -822 -6040
334f040j4163N87R960m343r286J0785J8757R51l571J3085J4099n980j1715J202
$$ -6040 -20203 -19616 -9656 -13999 -23285 -12500 6257 7208 3637 16722 30821 24841 13126 14328
348A4328m55j3656j2736J2k26n814o99O470K732J147N842L999O08M377P288Q69
$$ 14328 13873 217 -12519 -12507 -12733 -18547 -19246 -12776 -10044 -8897 -3055 944 1552 5929 13217 14086
364A4086k097L849L542o588r891l163l331r627q774K46M747J637K706Q310J0697
$$ 14086 11989 15838 19380 12792 2901 -262 -3593 -13220 -21994 -21748 -17001 -15364 -12658 -4348 6349
379F349N381n0J529L559j699p364l191P49k351n026j895o38k660k295j868k249
$$ 6349 11730 11680 13209 16768 15069 7705 4514 5263 2912 -2114 -4009 -4647 -7307 -9602 -11470 -13719
395a3719K01K876J259K417R818Q784J236L005P462k252j1212k599L27j1699r643
$$ -13719 -13518 -10642 -9383 -6966 2852 11636 12872 15877 23339 21087 9875 7276 7603 -4096 -13739
410a3739N054Qj1713J062J3352k189p774J3575J3136r965l003J9258L540j5770
$$ -13739 -8685 -8677 -20390 -19328 -5976 -8165 -15939 -2364 10772 807 -2196 17062 20602 4832
424D832N390J6758j3740k1061Q345L976k4262p516K1261O80j7629J1511K1845
$$ 4832 10222 26980 13240 -7821 524 4500 -19762 -27278 -6017 -5337 -22966 -11455 10390
437A0390j0818j0399K1547J0603j8926p80J8023q356j9334J0320J2231j5152q596
$$ 10390 -428 -10827 10720 21323 2397 1617 19640 11284 -8050 2270 14501 -651 -9247
450i247J3196m083k1218J936J3422n258k557J7270R132p743J986R847l087m921
$$ -9247 3949 -134 -21352 -19416 -5994 -11252 -13809 3461 12593 4850 6836 16683 13596 8675
464H675L699k641j0335m203m400r001K313Q970k685M07J3793J40j3984Q103J7275
$$ 8675 12374 9733 -602 -4805 -9205 -18206 -15893 -6923 -9608 -9201 4592 4732 -9252 -1149 16126
479A6126j0043q169K2059L079l0407o69K4314j5673k4891K7775J9256l8255j3161
$$ 16126 6083 -2086 19973 23052 -7355 -8024 16290 617 -24274 3501 22757 -15498 -28659
492b8659L8460n220m2062K5036M5792l3064l2678M7254J7667n5648N402O6711
$$ -28659 9801 4581 -37481 -12445 33347 283 -32395 14859 32526 -23122 -17720 48991
504D8991j7332n7439L5744L7084o5980l2436O7326N570p2272J9837O8559m3862
$$ 48991 31659 -25780 9964 47048 -18932 -51368 15958 21528 -50744 -30907 37652 -6210
516f210n4673O8630M4830o9130o759Q3689j8906q6423L4480O2881o3201m3745
$$ -6210 -60883 7747 52577 -16553 -23312 60377 41471 -44952 -10472 52409 -10792 -54537
528e4537Q0592J9186q8886L895Q0525l3588o4493O4462N3367p5921l0403P5584
$$ -54537 26055 45241 -43645 -39750 40775 7187 -57306 7156 60523 -15398 -45801 29783
540B9783n900p8232L4529P5747m7080n1038O2974K4116p4856j287P5175j7180
$$ 29783 23883 -54349 -19820 55927 8847 -42191 20783 44899 -29957 -31244 43931 26751
552B6751o3036L4067L8347n8253k8657O0857J1095m8633J9113M6588l3545l5709
$$ 26751 -36285 -2218 36129 -22124 -50781 10076 21171 -27462 -8349 38239 4694 -31015
564c1015L8820J7535l7671M769L7406j9453l6001J8339J4941k3848M676L1040
$$ -31015 7805 25340 -12331 -7562 29844 10391 -25610 -7271 7670 -16178 -11502 19538
576A9538p042j9969J0734O19j9841J0462K1574j4647q839K0614j0768l0730J9816
$$ 19538 12496 -7473 3261 3880 -15961 -5499 16075 1428 -7411 13203 2435 -28295 -8479
589h479K9414k3941r355L9044o240m9108J5803L8680l2529k3143N2767Q952o3715
$$ -8479 20935 -3006 -12361 26683 20443 -28665 -12862 25818 -6711 -29854 22913 31865 -31850
602c1850O962N7720l3346m7057O2077M0404p2892j8827P6056j5838q0338M4521
$$ -31850 -24888 32832 -514 -47571 14506 54910 -17982 -36809 39247 23409 -56929 -12408
614a2408P6458o2230n4073P6378J7701r6039Q172R8085l1825p7808O5041N5025
$$ -12408 64050 1820 -52253 24125 41826 -54213 -46041 52044 20219 -57589 7452 62477
626F2477r2276l0565J05369L957r6429L6891Q6393p3823p6602Q6339M2840r7518
$$ 62477 -29799 -60364 45005 48962 -47467 -10576 75817 1994 -74608 11731 54571 -42947
638d2947m949J03689k8013r6104N2758P2657p3697l7492R5131J2406r5452J5629
$$ -42947 -47896 55793 27780 -68324 -15566 57091 -16606 -54098 41033 53439 -42013 -26384
650b6384P9211n0419o2074P6592M4637q1799j5669P9061k1132p9158M2412O5401
$$ -26384 52827 2408 -59666 16926 61563 -20236 -35905 43156 22024 -57134 -14722 50679
662E0679n5772m1914O2204R995p0278J1668O8148j9672l9800M4674K5169n5170
$$ 50679 -5093 -47007 15197 25192 -45086 -33418 34730 15058 -24742 19932 45101 -10069
674a0069j1368N0134r747m4304K3754K8174m2016k4119L7938P798k9825J5266
$$ -10069 -21437 28697 18950 -25354 -1600 26574 -15442 -39561 -1623 6175 -23650 -8384
686h384L4375j5616k0195J8390L950k0588O094J6644j2878q798J3240q016j8562
$$ -8384 25991 10375 -9820 8570 12520 -8068 -1974 14670 1792 -7006 6234 -1782 -20344
699b0344J7396J7308j6778j781K3098j1496k8940J4254J8607k1935l970L1567
$$ -20344 -2948 14360 -2418 -4199 18899 7403 -21537 -7283 11324 -10611 -14581 16986
711A6986o869l1893J8353K6013k7868j0007M2218n94m8446Q777L7691l2003l4022
$$ 16986 10117 -21776 -3423 22590 -5278 -15285 26933 26339 -22107 -13330 24361 -7642 -41664
724d1664M4762K5756m8787n934N3456r565m6953L0473M2323m0306k7529M4877
$$ -41664 3098 28854 -19933 -25867 27589 18024 -28929 1544 43867 3561 -23968 20909
736B0909J228n8382R117N1239k6633l7929M7071K8814n4339r846O0491m671n3725
$$ 20909 22137 -36245 -27128 24111 -2522 -40451 6620 35434 -18905 -28751 31740 27069 -26656
749b6656K4188M5070m2593l8644M5734J8508m9148J461N0821j6070m3687K8653
$$ -26656 -2468 42602 9 -38635 7099 25607 -23541 -22080 28741 12671 -31016 -2363
761b363K9570l8892j4633M4914N48m4270J2377L8020k4930k7322L5969J9884l6693
$$ -2363 27207 -11685 -26318 18596 19144 -25126 -12749 25271 341 -26981 8988 28872 -7821
774g821o478L5511p991l3156J3861K3673k1719j5055K2980L611k3660O155K2462
$$ -7821 -14299 21212 13221 -19935 -6074 17599 -4120 -19175 3805 7416 -16244 -10089 12373
787A2373r286j2406J8091P479k0721k800J7758n602j6282Q148J1010j1934o960
$$ 12373 3087 -9319 8772 16251 -4470 -7270 10488 4886 -11396 -3248 7762 -4172 -11132
800a1132J2207M017q354K982P548m412n094M625l50n773K660L852m672k430N899
$$ -11132 1075 5092 -3262 -280 7268 2856 -2238 2387 2037 -3736 -1076 2776 -1896 -4326 1573
815A573k4n827J777M962l255j830L335K46k813L177K383l890J646N227l477o137
$$ 1573 1549 -4278 -2501 2461 -794 -2624 711 957 -1856 1321 3704 -186 1460 6687 3210 -2927
831b927M313L287q292l181P564J00q742J905Q685l458n031P374M887o417r24P420
$$ -2927 1386 4673 -3619 -6800 764 864 -7878 -5973 2712 -746 -5777 1597 6484 67 -857 6563
847F563j909o695L290M674o630m272O840J026p861O20P755k407p092L961N998
$$ 6563 4654 -2041 1249 5923 -707 -4979 1861 2887 -4974 -4354 3401 994 -6098 -2137 3861
862C861n525l739O279K718n676j66O262l89m584K390L928l412l442K685R21m932
$$ 3861 -1664 -5403 876 3594 -2082 -2248 4014 3625 -959 1431 5359 1947 -1495 1190 2111 -2821
878b821r27L752n46l524K211M149k087k094L630K191l756j963L721l99n004N87
$$ -2821 -3748 4 -542 -4066 -1855 2294 207 -1887 1743 3934 178 -1785 1936 1537 -3467 -2880
894b880M182j449l154L259L474k455j076L761O5m124J75J882k626k878K642O18
$$ -2880 1302 -147 -3301 -42 3432 977 -99 3662 3727 -397 -222 1660 -966 -3844 -1202 -584
910e84l159Q02M145j398k401L709K308l723o43L980j76m372J597L766k935k729
$$ -584 -3743 -2941 1204 -194 -2595 1114 3422 -301 -944 3036 2860 -1512 85 3851 916 -1813
926a813L381N08m037M89L200k675l024L529J512m412k93N205q10m642L203N216
$$ -1813 1568 2076 -1961 -1472 1728 -947 -3971 -442 1070 -3342 -3635 1570 760 -3882 -679 4537
942D537l464k723N273J726m976j025L809j686m904J716K099k874j501L465O61
$$ 4537 1073 -1650 3623 5349 373 -652 3157 1471 -3433 -1717 382 -2492 -3993 -528 133
957A33k051J331L012j133k120K250J192k523r92J751M60j650m15J286k01q77o29
$$ 133 -1918 -587 2425 1292 -828 1422 2614 91 -901 850 1310 -340 -755 531 330 -547 -1176
974a176J51R28J05j558J229J861j115j160J744Q28j648j318K671r79k599P86K154
$$ -1176 -1025 -97 8 -1550 -321 1540 425 -735 1009 1837 189 -1129 1542 563 -2036 -1250 904
991I04k220j658L486P14l806N26M719j546l521L399L599l924j914M287M10n313
$$ 904 -1316 -2974 512 1226 -2580 -2054 2665 1119 -2402 997 4596 672 -1242 3045 3455 -1858
1007a858O56L899k882m100L210K147m830r73N620j6m557K564N349l050l602M770
$$ -1858 -1202 2697 -185 -4285 -1075 1072 -3758 -4731 889 873 -3684 -1120 4229 1179 -2423 2347
1023B347L186m705j565M673k36n749J57L703j978m101K578K355l712k403M163
$$ 2347 5533 828 -737 3936 3700 -2049 -1892 1811 -167 -4268 -1690 665 -3047 -5450 -1287
1038a287K214l798N92N551L30m594K007N349k526n614L745L997o208n476N862
$$ -1287 927 -2871 -2279 3272 3602 -992 1015 6364 3838 -1776 1969 5966 -242 -5718 144
1053A44K347p703j419Q935k89r010L788Q478o036o026R694N567j0153k133J2295
$$ 144 2491 -5212 -6631 2304 2015 -6995 -3207 5271 -765 -6791 2903 8470 -1683 -3816 8479
1068H479k784j3057N982J1824j0818r749J2809N169j6748r52J7703l139j5825
$$ 8479 5695 -7362 -1380 10444 -374 -10123 2686 7855 -8893 -9845 7858 4719 -11106
1081a1106Q719J3668j3613j0164J7314O142j7732J342J8902p330j7519J1454J2323
$$ -11106 -2387 11281 -2332 -12496 4818 10960 -6772 -5430 13472 6142 -11377 77 12400
1094A2400j7431q479J9724J815k0950M636J9980r977j5230J7410J2223j9201o201
$$ 12400 -5031 -13510 6214 8029 -12921 -8285 11695 1718 -13512 3898 16121 -3080 -9281
1107i281J8713j719k0464P345J8221j1934j3551J5186P165j8584j651J8974k203
$$ -9281 9432 7713 -12751 -5406 12815 881 -12670 2516 9681 -8903 -10554 8420 6217
1120F217j6004Q212J3185j2285r483J4664N895j4414j83J2753m792j3199O111
$$ 6217 -9787 -1575 11610 -675 -10158 4506 10401 -4013 -4196 8557 3765 -9434 -3323
1133c323R086p522n095R861K788r762j835O789p26m774L475O063j899l694O05
$$ -3323 5763 -1759 -6854 3007 5795 -3967 -5802 987 261 -4513 -1038 5025 3126 -568 37
1148C7K675l33k039J200L194k013p208j024M731j672m051P030O989q318n951Q583
$$ 37 2712 2379 340 1540 4734 2721 -4487 -5511 -780 -2452 -6503 527 7516 -802 -6753 1830
1164A830K339j0437K874J4314n110j3120P837R028j3859o029J7968K704j8218
$$ 1830 4169 -6268 -3394 10920 5810 -7310 527 9555 -4304 -10333 7635 10339 -7879
1177g879K094J6248j1197j6001J6391J3701j7004n602J9956k847k3514P899K1458
$$ -7879 -5785 10463 -734 -16735 -344 13357 -3647 -9249 10707 7860 -15654 -7755 13703
1190A3703j2191j3351K0116P634k5429l305K4292m536k0815J4848J7429k2639
$$ 13703 1512 -11839 8277 15911 -9518 -12823 11469 6933 -13882 966 18395 -4244
1202d244j4356K3036N321k3636N727K6537j1982k3349J6267J4809k1967o194K7078
$$ -4244 -18600 4436 9757 -13879 -8152 18385 6403 -16946 -679 14130 -7837 -14031 13047
1215A3047J470k5559N359J9687j5362j6332K1062J2224k1150l872K0780o138k1650
$$ 13047 14517 -11042 -5683 14004 -1358 -17690 3372 15596 -5554 -9426 11354 5216 -16434
1228a6434J1203J9115j2839j1462J7343L833k0975j379J9275k298j2598Q971J0108
$$ -16434 -5231 13884 1045 -10417 6926 10759 -10216 -11595 7680 5382 -7216 1755 11863
1241A1863j3202r451J1252M544r434K263J0148n110j0096M366N549m921o67Q222
$$ 11863 -1339 -10790 462 5006 -4428 -2165 7983 2873 -7223 -2857 2692 -2229 -2896 5326
1255E326R05o881j225L179j412l319K720L485o18m089k242J524J076j496J746
$$ 5326 6231 -650 -1875 1304 -108 -3427 -707 2778 2160 -1929 -4171 -2647 -1571 -3067 -1321
1270a321O499O61n807j331M247k423m430N176N863o321n614N741K53q827K676
$$ -1321 5178 5839 32 -1299 2948 525 -3905 1271 7134 813 -4801 940 1193 -7634 -4958
1285d958J1042l616q822N937N437j0559k626J3646K429j1152L140J0377q327j0700
$$ -4958 6084 2468 -6354 -417 5020 -5539 -8165 5481 7910 -3242 -102 10275 1948 -8752
1299h752R881P607j1392l281J2290k523j4043M087J1765p508p270J2068M902j2741
$$ -8752 1129 8736 -2656 -5937 6353 3830 -10213 -6126 5639 -1869 -9139 2929 7831 -4910
1313d910j771J3197j955j0419Q060R464r741q253R290J665j1633J779J1144m470
$$ -4910 -6681 6516 4561 -5858 2202 11666 1925 -6328 2962 4627 -7006 -5227 5917 1447
1327A447r772O763N989r031k853J1650J678r692J998Q453n234o876P193N506p350
$$ 1447 -8325 -1562 4427 -4604 -7457 4193 5871 -3821 -1823 6630 1396 -5480 1713 7219 -131
1342a31k775O550j577p835K316N836l811l221N852K353o111j7N630o27m571K574
$$ -131 -2906 3644 2067 -5768 -3452 2384 -1427 -4648 1204 3557 -2554 -2571 3059 2432 -2139 435
1358D35L844l740m201L296K377l827l82M000K86l896K67K146o57j362J685J325
$$ 435 4279 539 -3662 -366 2011 -1816 -2198 1802 2088 -1808 -1541 605 -52 -1414 271 1596
1374A596j345q52J258k4j477J148J742j079j897R89J156j928j515J626J258j658
$$ 1596 251 -601 657 633 -844 304 2046 967 -930 59 1215 -713 -2228 -602 656 -1002
1390a002j262J959J501j894k32K355Q68j368o09J458p54j599k79O54o13q86P36
$$ -1002 -2264 -305 1196 -698 -930 1425 2293 925 316 1774 1020 -579 -858 -204 -817 -1703 -967
1407i67P3o88P89R30n5J84O29R38j254p07P51P1q39r93O39Q65o98p27Q83J346
$$ -967 -894 -1582 -793 137 82 266 895 1833 579 -128 623 694 -145 -1138 -499 366 -332 -1059 -176 1170
1427A170o12p40Q20N08j127j297N65L02o17n2N93M66m5Q87o0m24K22R30q65j264
$$ 1170 558 -182 638 1146 19 -1278 -713 -411 -1028 -1080 -487 -21 -66 821 761 337 559 1489 624 -640
1447f40Q40M81j560o60J833J01j689R77J102l27j369R18Q88j484r9J331j151j051
$$ -640 200 681 -879 -1539 294 395 -1294 -317 785 458 -911 7 895 -589 -688 643 -508 -1559
1465a559J229M37j562L32K461L96k039J315K180j894k003J625M02k873j106J788
$$ -1559 -330 107 -1455 -1123 1338 1734 -305 1010 3190 1296 -707 918 1320 -1553 -2659 -871
1481h71n0k169J755K230j498k1K712o2k140R75J765j822k277J928M75k272l45
$$ -871 -921 -3090 -1335 895 -603 -624 2088 2026 -114 861 2626 804 -1473 455 930 -1342 -1687
1498a687K347J77k375J606J492j586q96J489j4k135P03J176j065j153K196M63
$$ -1687 660 837 -1538 68 1560 -26 -922 567 553 -1582 -879 297 -768 -1921 275 738
1514G38j507O56K164m77j251J244N01k152j004J125p51j492O95J204j091M8J689
$$ 738 -769 -113 2051 1574 323 1567 2068 -84 -1088 37 -714 -2206 -1511 -307 -1398 -1350 339
1531C39P87q01N46J127q29j451M96M9j171m26Q35M03n19O85N70n9Q0K60l70k69
$$ 339 1126 325 871 1998 1169 -282 214 263 -908 -1334 -499 -96 -615 70 640 581 661 921 551 282
1551B82j02m89q42J95j77J06L96J081J42J22N39L15r73m41J169m37j731j19O88
$$ 282 180 -309 -1151 -956 -1133 -1027 -631 450 592 714 1253 1568 595 154 1323 886 -845 -964 -276
1570b76j461l75J465J138q68N12K019p00j714J021J274j819q54J302n98k307K15
$$ -276 -1737 -2112 -647 491 -377 135 2154 1454 -260 761 2035 216 -638 664 66 -2241 -2026
1587b026K053m69j053K193J203j812q77K216k02j774M89J827j445j785J164J064
$$ -2026 27 -442 -1495 698 1901 89 -788 1428 1226 -548 -59 1768 323 -1462 -298 766
1603G66j620j17K798j46k474Q7J241j286j925J882J922j766p83K350j35j749O62
$$ 766 -854 -971 1827 1681 -793 -706 535 -751 -2676 -794 1128 -638 -1421 929 794 -955 -293
1620b93L279k58k248Q18R09k903j929K252R51k346o53K821p64l157J804L542p28
$$ -293 2986 2728 480 1298 2207 -696 -2625 -373 578 -1768 -2421 400 -364 -3521 -1717 1825 1097
1637A097j339K531J238l957j168L220P9l262J091L080k338l929K469K250l287
$$ 1097 -242 2289 3527 -430 -1598 1622 1701 -1561 -470 2610 272 -3657 -1188 1062 -2225
1652b225L9M257j6m200N84L337k228k159M126K905m277j856L558p42m178K119
$$ -2225 -2186 2071 2055 -2145 -1561 1776 -452 -2611 1515 4420 143 -1713 1845 1103 -3075 -956
1668i56M388k618l362K222J298m310JM773P67l721J575K883l073k849L816K238
$$ -956 3432 814 -2548 -326 972 -3338 -3337 1436 2203 -1518 57 2940 -133 -2982 834 3072
1684C072l035m25K858j674m015P79L358j391j717L190J442l519j352L253M37j758
$$ 3072 37 -388 2470 796 -3219 -2440 918 -473 -2190 1000 2442 -1077 -2429 824 1261 -497
1700d97J566K313j920l144O10J301j989N54K447M10k958o59J675k65p36J792K148
$$ -497 1069 3382 1462 -1682 -1072 229 -1760 -1206 1241 1651 -1307 -1966 -291 -556 -1292 500 2648
1717B648j089k292Q02P94j514m56K599P72k002r57R82r50j890J376K872r50k218
$$ 2648 1559 -733 69 863 -651 -1107 1492 2264 262 -695 287 -663 -2553 -1177 1695 745 -1473
1734a473J286J060k560r20L538J494k180K26K326k287k989K388K681k599j121
$$ -1473 -187 873 -1687 -2607 931 2425 245 471 2797 510 -2479 -91 2590 -9 -1130
1749a130K934j039m354N74M011r76k471L592K111m422j885M672K20l498J944L959
$$ -1130 1804 765 -3589 -3015 996 20 -2451 1141 3252 -1170 -3055 1617 1837 -1661 283 4242
1765D242l028m229K891K058l805n63M952j20m691P99L557l082k263L953K954m173
$$ 4242 1214 -3015 -124 1934 -1871 -2434 2518 2398 -2293 -1494 2063 -1019 -3282 671 3625 -548
1781e48j260L705r17m479K656M073k220k718L192O66m383m12M329K0k985J208
$$ -548 -1808 1897 980 -3499 -843 3230 1010 -1708 1484 2150 -2233 -2645 1684 1704 -1281 -73
1797g3K082k766k387K954K093k559j9K904j016k962L29K649j340j062K265N94
$$ -73 2009 -757 -3144 -190 1903 -656 -675 2229 1213 -1749 -1420 1229 -111 -1173 1092 1686
1813A686k559r90J917j70j102J460J866j289j488M88M31n63n12J722N58j395p13
$$ 1686 -873 -1863 54 -116 -1218 242 2108 819 -669 -181 250 -313 -825 897 1455 60 -653
1830f53L23k10q67Q54J927m79j238J72K54r26l5J080J347r93q24P61o07r72O80
$$ -653 -330 -540 -1407 -553 1374 895 -343 -171 83 -843 -878 202 1549 556 -268 493 -114 -1086 -406
1849d06J497j41j318P08j6j719JJ542K75j000M64J021p81j545J183J476r96j70
$$ -406 1091 950 -368 340 324 -1395 -1394 148 423 -577 -113 908 127 -1418 -235 1241 245 75
1867G5J504j74k525L58J150m62q68J261O93j915o63J780q7j259J105J622j108
$$ 75 1579 1405 -1120 -762 388 -74 -942 319 1012 -903 -1566 214 127 -1132 -27 1595 487
1884D87j501J120Q05j795K70J751K10k110N73J180j325q72J336R15j364n91J429
$$ 487 -1014 106 911 -884 -614 1137 1347 -763 -190 990 -335 -1207 129 1044 -320 -911 518
1901E18l60j505O64J516j75q38P58N65j421o45J486Pj112K50J053j206p83J013
$$ 518 158 -1347 -683 833 658 -180 578 1143 -278 -923 563 570 -542 -292 761 -445 -1228 -215
1919b15Q81o93o0J072k30q77LQ24k97p50L42M35q64l81N27L9k69K58Q16j53p13
$$ -215 666 -27 -87 985 755 -122 -119 705 408 -342 0 435 -429 -810 -283 -244 -513 -255 561 408 -305
1940c05J99N84o33k95Q95j82k79J06M70o93l40P30J53o58l95L88j37m27K9P07
$$ -305 -106 478 -155 -450 445 263 -16 90 560 -133 -473 257 410 -248 -643 -255 -392 -819 -790 -83
1960h3r9N8M23mJ48j37L26o5o1n63J94l68k34J72j85o6K05L25m15M44k7J9L33
$$ -83 -182 -124 299 295 443 306 632 567 506 -57 137 -231 -465 -293 -478 -544 -339 -14 -429 15 -12 7 340
1983C40k16M57n89j60L97O7j31j86q4r9L76j36J15l40J04J20m25J63L6J69l83
$$ 340 124 581 -8 -168 229 296 165 -21 -105 -204 172 36 151 -189 -85 35 -390 -227 -191 -22 -405
2004d05O7P85m08K27J27J57m94J7J92l27m83M91j01l59L0N50K72n40L42K76l86
$$ -405 -338 447 39 266 393 550 56 73 265 -62 -545 -54 -155 -514 -484 66 338 -202 140 416 30
2025C0n4L29j16k68p3L06l77nJ41L08n13J48M04k34l91M50J99m58J27M72n5m24
$$ 30 -24 305 189 -79 -152 154 -223 -228 -87 221 -292 -144 260 26 -365 85 284 -174 -47 425 370 -54
2047e4k3L27l5n16L50K98l76m00N76m55J96j1L13o7k41M85k46J5k16L72M1k33
$$ -54 -77 250 215 -301 49 347 -29 -429 147 -308 -112 -123 190 123 -118 367 121 136 -80 292 333 100
2069A00L72l04j84p2P2R8m95K86L03n14j9K82L75n89r5O60q0J15J22L2o56K33
$$ 100 472 168 -16 -88 -16 82 -413 -127 176 -338 -357 -75 300 -289 -384 276 196 311 433 465 -191 42
2091D2J69q7j21k5j00j23r9M42k36O8K48N9j34q2J81j98j75M9J63j92r9O3Q7p8
$$ 42 211 124 3 -22 -122 -245 -344 98 -138 -70 178 237 103 21 202 4 -171 -122 41 -151 -250 -187 -100 -178
2115a78O7K94m2J3p5j78K95m61L82j82n4j71R1j05N48k7l44L34N6k79j78L39k79
$$ -178 -111 183 141 154 79 -99 196 -265 117 -65 -119 -290 -199 -304 244 217 -127 207 263 -16 -194 145 -134
2138a34J36k49J31n4Q2k7K60J46j57Q1J67k83j19J43k82k66K02M88p90J02M32
$$ -134 2 -247 -116 -170 -88 -115 145 291 134 215 382 99 -20 123 -159 -425 -223 265 -525 -423 9
2159IJ46l11J80N60n23N2P0k5k14n07O00k20L4m3M54k71J37K6M00r5n61J25K08
$$ 9 155 -156 24 584 61 113 183 158 -56 -563 37 -183 -149 -192 262 -9 128 154 554 459 -102 23 231
2182B31n56j43M19l8N0M5L48j53k96N24j88k69L4J09J57n75R2M4q3j48N58R9l57
$$ 231 -325 -468 -49 -87 -37 8 356 203 -93 431 243 -26 8 117 274 -301 -209 -165 -248 -396 162 261 -96
2205i6J82j8J25k46j60L09j58j81M4L88l00n8M56j7j93pJ37k79j63L03o0r2lj70
$$ -96 86 68 193 -53 -213 96 -62 -243 -199 189 -111 -169 287 270 77 70 207 -72 -235 68 8 -84 -87 -257
2229b57J98k35L37K77j14k31L59J06o44P5L48l33j19O8J71j80l8K02K85l01J24
$$ -257 -59 -294 43 320 206 -25 334 440 -204 -129 219 -114 -233 -165 6 -174 -212 -10 275 -26 98
2250I8Q1k31q6j42K68J6l19K82K16l52K09J00JN3j19L76l45l24lJ60l5N5j17R2
$$ 98 179 -52 -138 -280 -12 4 -315 -33 183 -169 40 140 141 194 75 451 106 -218 -221 -61 -96 -41 -158 -66
2274f6R2k36M37l17j8L90j49p5k79K20k32k27L35J66J98j09p9n8k6J5L35k76O
$$ -66 26 -210 227 -90 -108 282 133 58 -221 -1 -233 -460 -125 41 239 130 51 -7 -33 -18 317 41 47
2297D7nP2j97j93J87L34k45j02J77q7J16j70L26m82j40P21l10j81j0N3J77j91
$$ 47 42 114 -83 -276 -89 245 0 -102 75 -12 104 -66 260 -222 -362 359 49 -132 -142 -89 88 -103
2319a03K96L03j44l37J39r0k12K15J22n4l54J53J83l05k9L12pj37J91j40K37k71
$$ -103 193 496 352 15 154 64 -148 67 189 135 -219 -66 117 -188 -217 95 88 -49 142 2 239 -32
2341c2M3J58j41l5K44k71l7J61l0ll56K76k77L60k36J25J77k05R3J75r4Lj78J92
$$ -32 11 169 28 -7 237 -34 -71 90 60 57 -299 -23 -300 60 -176 -51 126 -79 14 189 95 98 -80 112
2365A12P5p4L7O2m73J41K20j28n6N5N0k26m5K39J44m71L38J52P8l38l5J88R0j78
$$ 112 187 113 150 212 -261 -120 100 -28 -84 -29 21 -205 -250 -11 133 -338 0 152 230 -108 -143 45 135 -43
2389d3k7j01L1p2K48j08o1k1N80m86R3J52k83K1j33N27k69j74j46M85n48K0K95
$$ -43 -70 -171 -140 -212 36 -72 -133 -154 426 -60 33 185 -98 -77 -210 317 48 -126 -272 213 -335 -315 -20
2412b0L6j01j49J54P5K8o1M7J34j36m0L7j39L3K04Q5m52J91q7J82k32K72j32%
$$ -20 16 -85 -234 -80 -5 23 -38 9 143 7 -33 4 -135 -102 102 187 -265 -74 -161 21 -211 61 -71 -71
2436g1m1K84o1o3J61OJ68l43k2L69l06k26N9k6m0QJ69Q7l65K78j44K28j62K0J95
$$ -71 -112 172 111 48 209 215 383 40 18 387 81 -145 -86 -112 -152 -144 25 112 -253 25 -119 109 -53 -33 162
2461A62J1j09R2j76J82j66L09l21l26L12L15k67p4L29k09j42p8M95j16l34K10
$$ 162 173 64 156 -20 162 -4 305 -16 -342 -30 285 18 -56 273 64 -78 -156 339 223 -111 99
2482I9J97k32k45M40l01L2j1j54K67j83K22P5j26l4p6L91l51k48J82k95N7L81
$$ 99 296 64 -181 259 -42 -10 -21 -175 92 -91 131 206 80 46 -30 361 10 -238 -56 -351 -294 87
2504H7rk0k85J79P2J92m19L27J99j87K52l69k34L48j8j18k54M30K2k6j44J88J61
$$ 87 78 58 -227 -48 24 216 -203 124 323 136 388 19 -215 133 115 -3 -257 173 195 169 25 213 374
2527C74k13p0M2k42P5m6Q0n0l59P60j80l61n3J06K62l30L58P3m57K55J66k22J82
$$ 374 161 91 133 -109 -34 -80 0 -50 -409 351 171 -190 -243 -137 125 -205 153 226 -231 24 190 -32 150
2550A50l07N2J93j13K56j51Mn8J47k84J9P8M6k6J78m0n8n2J94j30n1j7k5K2k97
$$ 150 -157 -105 88 -25 231 80 84 26 173 -111 -92 -14 32 6 184 144 86 34 228 98 47 30 5 27 -270
2575b70L74k19P3o8Q4M2N9M6k27P1K9J08K66m05K02j23l24J60J82j72J27k12J12
$$ -270 104 -115 -42 -110 -26 16 75 121 -106 -35 -6 102 368 -37 165 42 -282 -122 60 -112 15 -197 -85
2598h5r7K24j06J25j25L8j24l9N1K34M9J88n10O7L6Q6p2J20j23j49J14j46J9M20
$$ -85 -182 42 -64 61 -64 -26 -150 -189 -138 96 145 333 -177 -110 -74 12 -60 60 -63 -212 -98 -244 -225 195
2622A95j30k08J43K45q3j31N3J20rm44N99l00Kj96L79l19k13M16P2k56j5R2o3
$$ 195 65 -143 0 245 162 31 84 204 195 -249 350 50 52 -144 235 -84 -297 119 191 -65 -80 12 -51
2645e1M0L13j36j35r1O6P7j66j37L02m0j13J09J28k13k02K28J0J2o9J69j55J59
$$ -51 -11 302 166 31 -60 6 83 -83 -220 82 42 -71 38 166 -47 -249 -21 -11 1 -68 101 -54 105
2668A05j96P5j57L18j53N1j63K8Ok71J93K6L16k06K79q5%j02pk5j33j9k6O8j60
$$ 105 -91 -16 -173 145 -8 43 -120 -92 -86 -357 -164 -138 178 -28 251 166 166 64 57 32 -101 -120 -146 -78 -238
2693b38J96j15rK32Q1rJ9j48J14j3kl81j15K65p7K04r2j37J46L0l49L67j72Q2
$$ -238 -42 -157 -166 66 147 138 157 9 123 110 108 -273 -388 -123 -200 4 -88 -225 -79 -49 -398 -31 -203 -121
2717a21L37N4n26L86l5j27J3J21R9j24j47N3M2k19M7K52k95O6j2L36j31k96Q9
$$ -121 216 270 -256 130 95 -32 -19 102 201 77 -70 -17 25 -194 -147 105 -190 -124 -136 200 69 -227 -138
2740a38M06l67J9K25K06k93kp9k33R0J83L63n90N5L14j84j13K87l12l9K99O9Q6
$$ -138 268 -99 -80 145 351 58 56 -23 -256 -166 17 380 -210 -155 159 -25 -138 149 -163 -202 97 166 252
2763B52k48rJ01k6l32J84K43k34k24N86j21m35PM99k71J73N4m4j76j07L52K83
$$ 252 4 -5 96 70 -262 -78 165 -69 -293 293 172 -263 -256 243 -28 145 199 155 -21 -128 224 507
2785E07n83R4J47j23n37L48J38o2l31M02K31n10K85j66M27m17p4M05j68k92L86
$$ 507 -76 18 165 42 -495 -147 -9 -71 -402 0 231 -279 6 -160 267 -150 -224 181 13 -279 107
2806A07J09k76M3jm1P6m45P07N3o53L89J93k37q9K52k3k62k9M23k57k73J01L88
$$ 107 216 -60 -17 -18 -59 17 -428 279 332 -321 68 261 24 -65 187 164 -98 -127 296 39 -234 -133 255
2829B55j31l28M06k50j17J26J88K17p81M80K34K6o03L46M78p40L8L65J5o43M00
$$ 255 124 -204 202 -48 -165 -39 149 366 -415 65 299 325 -278 68 546 -194 -156 209 224 -419 -19
2850a9J20Q3l19K69J92j14l53L54j04j53pK03o9j90l4M35k15l35M77J72n08n3
$$ -19 101 184 -135 134 326 212 -141 213 109 -44 -51 152 83 -107 -141 294 79 -256 221 393 -115 -168
2872a68M50o0n75M34O85o66m45M58J68n98j6L52J51o92K80M55j88j96K24O5n14
$$ -168 282 222 -353 81 766 100 -345 113 281 -317 -333 19 170 -522 -242 213 25 -171 53 118 -396
2893c96J23N51r2l91J27L92m29JQ4M9l30P6L53r3n38N17L81l29l33L12L01m54
$$ -396 -273 278 186 -205 -78 314 -115 -114 -30 19 -311 -235 118 25 -513 4 385 56 -277 35 336 -118
2915a18m5O23j18m51JK50j78k14M22q8l22q6K96K57n59K23J88J67m20J87K87n05
$$ -118 -163 460 342 -109 -108 142 -36 -250 172 84 -238 -324 -28 229 -330 -107 81 248 -172 15 302 -203
2937b03K83J77l1m40p6M78k05k57L32l7m27M68RL04m77J90K8M3l17J3L98k76m5
$$ -203 80 257 226 -214 -290 188 -17 -274 58 21 -406 62 71 375 -102 88 116 159 -158 -145 253 -23 -68
2960f8J92k24r0J45K51k20j6J43lk7j60K41K34l93j40J93M2l08o9O20j87n40K30
$$ -68 124 -100 -190 -45 206 -14 -30 113 110 83 -77 164 398 5 -135 58 100 -208 -277 343 156 -384 -154
2983a54K96k48L00J1P3l60P9L10j91k12Q0J42l1q3K40j77k55O2K14l16j5K89j05
$$ -154 142 -106 194 205 278 -82 -3 307 116 -96 -16 126 95 12 252 75 -180 -118 96 -220 -235 54 -51
3006e1o8J6K4M80o5l17K42J1m76K46J14R8n04L27j68j10l6M46k57k33J21K72k80
$$ -51 -119 -103 -79 401 336 19 261 272 -204 42 156 254 -250 77 -91 -201 -237 209 -48 -281 -160 112 -168
3029a68j43L91L33o29J09J03J01r6K9K3M4k95O7J42k30K63J66n0k85J61K0o9J66
$$ -168 -311 80 413 -216 -107 -4 97 1 30 53 97 -198 -131 11 -219 44 210 160 -125 36 56 -13 153
3052A53J20k36Mk62K81j57Jk20M74q2j52j38N59n51J53j51N17k67K1K98k73k8
$$ 153 273 37 41 -221 60 -97 -96 -316 158 76 -76 -214 345 -206 -53 -204 313 46 67 365 92 64
3074F4j24K41k48p3Q5N2j53P1J82j51l48O94l15J38rpj42J35J16k60O5j08K8J17
$$ 64 -60 181 -67 -140 -55 -3 -156 -85 97 -54 -402 292 -23 115 106 99 -43 92 208 -52 13 -95 -67 50
3098E0l08R3K58j73M9J07M7j9m8J14o4l19L45J74k04J53k49J3o9r6J28K35l02
$$ 50 -258 -165 93 -80 -31 76 123 104 56 170 106 -213 132 306 102 255 6 19 -50 -146 -18 217 -85
3121h5JM0L2k92M32O8m91N77m73J34nN7J94l01K54k78k9K79k34lk0J35M3rJ34
$$ -85 -84 -44 -12 -304 128 196 -295 282 -191 -57 -62 -5 189 -112 142 -136 -165 114 -120 -123 -143 -8 35 26 160
3146A60j06M0l98K15L13l36L5j61K11J54l71Q8J18k1R5l0j15K60j73J6P8o9J57
$$ 160 54 94 -304 -89 224 -112 -77 -238 -27 127 -244 -156 -38 -59 36 6 -109 151 -22 -6 72 3 160
3169A60j74qK77l72K39j77P0j54O9j88K54j02%J5K46k95Q4J31k7k25K13j50Q5
$$ 160 -14 -22 255 -117 122 -55 15 -139 -70 -258 -4 -106 -106 -91 155 -140 -56 75 48 -177 36 -114 -29
3192b9J29Ql94K34J43O0n8n7n2j14nm1K56N2m0j60R5J3K35j96j01p6J07k70K07
$$ -29 100 108 -286 -52 91 151 93 36 -16 -130 -135 -176 80 132 92 -68 27 40 275 79 -22 -98 9 -261 -54
3217e4Q1r7P1o3K05p6r6J67l28N15l87J09N1k2j25j10M17m65J08L28l29Nj6K21
$$ -54 27 -70 1 -62 143 67 -29 138 -190 325 -62 47 98 76 -49 -159 258 -207 -99 229 -100 -95 -111 110
3241A10M4j3n7P3J45l70M13k31j64K0k11K27n0nJ94l82K42J31j66J09m4j06M9
$$ 110 154 141 84 157 302 -68 345 114 -50 -30 -241 -14 -64 -69 125 -257 -15 116 -50 59 15 -91 -42
3264d2K1J45k06J06j27j19J58j7J03K62m26J01PO2j55Q0O5J56P6k24k0P9J91m70
$$ -42 -21 124 -82 24 -103 -222 -64 -81 22 284 -142 -41 -34 28 -127 -47 18 174 250 26 6 85 276 -194
3288a94M82p5k49j50J95K83n51K67L30q0k50KK2k6j16L23j36j59j5N31m34m94
$$ -194 288 213 -36 -186 9 292 -259 8 338 258 8 10 32 6 -110 213 77 -82 -97 434 0 -494
3310d94N98j2k51K40j2J00%n1Q6k7l62Q1M0N4j16L35J3l40N3J30nj57J92Q1j02
$$ -494 104 92 -159 81 69 169 169 118 204 177 -185 -104 -64 -10 -126 209 222 -118 -65 65 60 -97 95 176 74
3335G4k89L93j00Q2j69K07k37q4M8L06p8l02oK32k42j48N62p3k86J42J53j49p0
$$ 74 -215 178 78 160 -9 198 -39 -123 -75 231 153 -149 -155 77 -165 -313 249 176 -110 32 185 36 -34
3358c4K04P8r8l01M35j87k71p8N53m65j7L4L18l38qJ60K17m00J20L30r8j92j10
$$ -34 170 248 150 -151 284 97 -174 -252 301 -164 -181 -147 171 -167 -175 -15 202 -198 -78 252 154 -38 -148
3381a48M70k58m10N13j42l58K84K07r6l29K73M3j49j7K44k8j54j66N43r1q6k90
$$ -148 322 64 -346 167 25 -333 -49 158 62 -267 6 49 -100 -117 127 99 -55 -221 322 231 145 -145
3403a45J60j09O5l7J80m77J38M38j10k90J32K10j54P4P0O7j48q1K48J46l53l43
$$ -145 15 -94 -29 -66 114 -363 -225 213 103 -187 -55 155 1 75 145 212 64 -17 231 377 24 -319
3425c19P7K40O9k48K70k27l6L87O1j10P5R6m03r7J36L59j05l12K5j88J92j36L75
$$ -319 -242 -2 67 -181 89 -138 -174 213 274 164 239 335 -68 -165 -29 330 225 -87 -62 -250 -58 -194 181
3448A81k72j71K42J98l5j84K38o2k23Q4L18q6l06L08r5M7k38K70k01j49k14L11
$$ 181 -91 -262 -20 178 143 -41 197 135 -88 -4 314 228 -78 230 135 182 -56 214 13 -136 -350 -39
3470c9j0K6N6K58l98P5K98k41J21k77K94l40R0k42O25l38k08K94j62j32K07J17
$$ -39 -49 -23 33 291 -107 -32 266 25 146 -131 163 -177 -87 -329 296 -42 -250 44 -118 -250 -43 74
3492G4j02%K5M36k16j30j06L43m98Q2M82n73J79j18J11J4m7P7L24m19k1K05Q0
$$ 74 -28 -28 -3 433 217 87 -19 324 -174 -92 390 -183 -4 -122 -11 3 -44 33 357 -62 -83 122 202
3515B02k43j05J70K96n08K07OK8l31J53J60l32K65J61P1n88M01m2l9q2K34R6r1
$$ 202 -41 -146 24 320 -188 19 25 53 -278 -125 35 -297 -32 129 200 -388 13 -29 -68 -150 84 180 89
3538H9J36r8J69j81M2n7k41r8J66J63j50k66O50k08r1q5J55J54o15L04L80k18
$$ 89 225 127 296 115 157 100 -141 -239 -73 90 -60 -326 324 116 25 -60 95 249 -366 -62 318 100
3560A00P9k50K81k55L0p2L51l18K9L45m66k2r9O11k80j12n6J71m5k22M16j94N2
$$ 100 179 -71 210 -45 -15 -87 264 -54 -25 320 -146 -168 -267 344 64 -48 -104 67 22 -200 216 22 74
3583G4k22P7J2k73O63k62j91L50J7Nn57N64j24k76J31K5J9j61K71r5M7o4j40M03
$$ 74 -148 -71 -59 -332 331 69 -122 228 245 250 -307 257 133 -143 -12 13 32 -129 142 47 94 30 -110 293
3607B93l06r8L3K59n73N76j37p5K3r2J68k31K63k27Q9O4j30M10l21j51L82K3k18
$$ 293 -13 -111 -78 181 -392 184 47 -28 -5 -97 71 -160 103 -124 -35 29 -101 309 -12 -163 219 242 24
3630B4J68J51k66j36J6K09j09j05M4J07j88k2R8M1k08J68J92l06j12L61j08o3
$$ 24 192 343 77 -59 -43 166 57 -48 -4 103 -85 -107 -9 32 -176 -8 184 -122 -234 127 19 -44
3652d4J43j03M5l48M21k99K18K3j45K43m25K83j56J41l2K5K14q6l26J76J61j52
$$ -44 99 -4 41 -307 114 -185 33 56 -89 154 -271 12 -144 -3 -35 -10 204 118 -208 -32 129 -23
3674b3j46q7L64j72J14j70J07o5J57J55j46J78m11L99j16k2k65M48l24J77k90
$$ -23 -169 -256 108 -64 50 -120 -13 -78 79 234 88 266 -145 254 138 116 -149 299 -25 152 -138
3695a38P2J49k48J03K57j51j44K01J79m01J59J99j67o06N87j14p4J09n4R6L3k75
$$ -138 -66 83 -165 -62 195 44 -100 101 280 -121 38 237 70 -536 51 -63 -137 -28 -82 14 47 -228
3717b28J99n6qN8l5L10p9j78L7r0J44l7K2p4j10N28k75Lp5l83K42J78p9K28l15
$$ -228 -29 -85 -93 -35 -70 240 161 -17 20 -70 74 37 59 -15 -125 403 128 131 56 -327 -85 93 14 242 -73
3742g3j9J86k47J6L91k36k02L49K52n54J62j77L95k94p4j69L25k40O5P4L5n2J98
$$ -73 -92 94 -153 -137 254 18 -184 165 417 -137 25 -152 243 -51 -125 -294 31 -209 -144 -70 -35 -87 111
3765A11m1l48K40n5K05j77k68M97k75k8J95j73k55N24Q2m02J84j43J06M4O5j99
$$ 111 70 -278 -38 -93 112 -65 -333 164 -111 -139 56 -117 -372 152 234 -168 16 -127 -21 23 88 -111
3787a11K03m0M0j64K82l07O3n8K08j70J35j5j24j12PL21j33K71l75L46J08l44
$$ -111 92 52 92 -72 210 -97 -34 -92 116 -54 81 66 -58 -170 -163 158 25 296 -79 267 375 31
3809C1M9j75j10J36K18j12M4L05k75m95L24R4q9L1k56L77j22Q3O5J67j32L1l56
$$ 31 80 -95 -205 -69 149 37 81 386 111 -384 -60 34 -55 -24 -280 97 -25 58 123 290 158 189 -167
3832a67K93j97lp1P8j05L68k37J18N7N7j54k12j1J74j17J04J12N5k75J50j24Q
$$ -167 126 -71 -74 -145 -67 -172 196 -41 77 134 191 37 -175 -186 -12 -129 -25 87 142 -133 17 -107 -99
3855i9QJ84j75r5K75o3K32r0p4J32k79q9L92l16j03M2K07j54R3M1k85K65k48L42
$$ -99 -91 93 -82 -177 98 35 267 177 103 235 -44 -133 259 -57 -160 -118 89 -65 28 69 -216 49 -199 143
3879A43O9l61k5N52j18j52q4K15k79k29K15n0j04L08j29k05k0L43O8k42OL44k64
$$ 143 212 -149 -174 378 260 108 24 239 -40 -269 -54 -104 -208 100 -29 -234 -254 89 157 -85 -79 265 1
3902Aj60K23K93l74PL3Q3p8R5k8m0Q0j19J57k81l50K70K96o0l38K67M6o2p3K52
$$ 1 -159 64 357 -17 -10 23 106 28 123 95 55 135 16 173 -108 -458 -188 108 48 -290 -23 23 -39 -112 140
3927A40R4k86p5L46N6m15L19J12k80l5J65k42k37L38P3l07J53rJ23k09K66M9J60
$$ 140 234 -52 -127 219 275 -140 179 291 11 -24 141 -101 -338 0 73 -234 -81 -90 33 -176 90 139 299
3950B99m71K50M1m7j41jK40j86N1J38j6l09J68Mk2j14J42J67k61p5M04l69p8J32
$$ 299 -172 78 119 72 -69 -70 170 -16 35 173 157 -152 16 20 -2 -116 26 193 -68 -143 261 -108 -186 -54
3974e4L55j31m17L39K7R7j50p1L26k24p2j52K61n73L95L87m32k32L67k0j25J43
$$ -54 301 170 -247 92 119 216 66 -5 321 97 25 -127 134 -439 -44 343 -89 -321 46 26 -99 44
3996D4K56m36R2L79k89l89L91l28P88p24J31K8L46l84j53M82q3j45J31J06j93
$$ 44 300 -136 -44 335 46 -343 48 -280 508 -216 -85 -57 289 -95 -248 234 151 6 137 243 50
4017E0m44N63j05l29J13L52m1l36J16L2J7k86O94j26m59L61m6j33N8j37L5P9k47
$$ 50 -394 169 64 -265 -152 200 159 -177 -61 -29 -12 -298 396 270 -189 172 126 -7 51 -86 -51 28 -219
4040b19K11O8m44J94M64l27P2j44K19m8k39L33N5k65l73P72j97l30K40K03j21
$$ -219 -8 60 -384 -190 274 -53 19 -125 94 46 -193 140 195 -70 -443 329 132 -198 42 245 124
4061A24q1j96L85l83R3p4R2m1o5J05k6j6O4J43k97j96J52L93l88P4K94k20j58
$$ 124 43 -153 232 -151 -58 -132 -40 -81 -146 -41 -67 -83 -19 124 -173 -369 -217 176 -212 -138 156 -64 -222
4084b22K95j8q5Q6K5n0k5M3k73K63p1J68k15k35K31J43l1j61K1L65j95q2nR9N7
$$ -222 73 55 -30 56 81 31 6 49 -224 39 -32 136 -79 -314 -83 60 29 -132 -111 254 59 -23 -28 71 128
4109A28r7j55J36m8j26K35k05J26LK17m3j33m6m9p7M2L75m65L27n3K80kl65j55
$$ 128 31 -124 12 -36 -162 73 -132 -6 -3 214 171 38 -8 -57 -134 -92 283 -182 145 92 372 370 5 -150
4133a50L60m61K20K01m1l28j05L64k53J11K31R9l16J19n4j06q7K56K12l12k42
$$ -150 210 -251 -31 170 129 -199 -304 60 -193 -82 149 248 -68 51 -3 -109 -196 60 272 -40 -282
4154b82N10M3l97QL31j79j2j25J44j8j22K9J25k01K35O0j04n6kn6J3M2M0n0r4
$$ -282 228 271 -126 -118 213 34 22 -103 41 23 -99 -70 55 -146 89 149 45 -11 -13 -69 -56 -14 26 -24 -118
4179a18j81K22J62rj06l3L6L17k94r1J37M7j64J61k88M03j31L0J71k24K41pk90
$$ -118 -299 -77 85 76 -30 -63 -27 290 -4 -95 42 89 -75 86 -202 201 70 100 271 47 288 281 -9
4202iJ28P8n35M33k88N25j34k19j1J94r7m9lL3o0j1j42o9K48J90l02L6P2p1O9
$$ -9 119 197 -338 95 -193 332 198 -21 -32 162 65 16 13 46 -14 -25 -167 -236 12 202 -100 -64 8 -63 6
4227Fj11N50l61j35K42kl09mJ97j75K8k8j12J07J88J53j95J5j04q9K66N9j04J42
$$ 6 -105 445 84 -51 191 189 -120 -124 73 -102 -74 -102 -214 -107 81 234 39 54 -50 -139 127 186 82 224
4251B24k15q7K72k05P5o3r6P8j2j03L1O6N5j84K9K76J99m71j43M39M2K8j25q9
$$ 224 9 -78 194 -11 64 1 -95 -17 -29 -132 -101 -35 20 -164 -135 141 340 -131 -274 165 207 235 110 21
4275B1J00l8J90j28l6j00L0J2k86L67k00j01J24L57m73qP7L3N3Q5R5m19K78OJ1
$$ 21 121 83 273 145 109 9 39 51 -235 132 -68 -169 -45 312 -161 -169 -92 -59 -6 79 174 -245 33 39 50
4300E0k48k0L61L5j9n14L98r0j55J02K04r5j15j0N3j32J00O8J3k9m7m6K42J3j27
$$ 50 -198 -218 143 178 159 -355 43 -47 -202 -100 104 9 -106 -116 -63 -195 -95 -27 -14 -43 -90 -136 106 119 -8
4325hJ64q0R3j10j53J43N6j92P1o5J2K67l05NJ90n3J68m93R6K32K66j91N4j87
$$ -8 156 76 169 59 -94 49 105 -87 -16 -81 -69 198 -107 -102 88 35 203 -290 -194 38 304 113 167 -20
4349b0J6N2o7p1J05j9O4k76L26j54J18Q3j72q1j37K40J55j49k2J09p7j18O5K14
$$ -20 -4 48 -19 -90 15 -4 60 -216 110 -44 74 157 -15 -96 -233 7 162 13 -9 100 23 -95 -30 184
4373A84j18j16R0r4J81j50q3M26m19k29M40j01J53O7k67q1P0P3k31K20Q7j37J07
$$ 184 66 -50 40 -54 127 -23 -106 320 -99 -328 112 11 164 231 -36 -117 -47 26 -205 15 102 -35 72
4396G2j08N2J97j81p0k2K19m3k47K02O5r6J07o1j4Q8k25K61j69k6O5Q6qj93J28
$$ 72 -36 16 213 32 -38 -60 159 116 -131 71 136 40 147 86 72 160 -65 196 27 1 66 152 144 -49 79
4421G9N0p9j20J22o4q3R1k16Q6L29m6o4j32q9K29J4l1k47L55l88K74j53K59k08
$$ 79 129 50 -70 52 -12 -95 -4 -220 -134 195 149 85 -47 -136 93 107 76 -171 184 -204 70 -83 176 -32
4445c2J98k32R4J5j31M40l49k8Q4j12J22k3K34j72k24J47K05k56j95K59lk92J42
$$ -32 166 -66 28 43 -88 352 3 -25 59 -53 69 46 280 108 -116 31 236 -20 -215 44 41 -251 -109
4468a09K37j84p6j0L05m27K89K29j0k89K23J88k00j73j22NJ93J38j28nR4k69J20
$$ -109 128 -56 -132 -142 163 -264 25 254 244 -45 178 366 166 -7 -129 -124 69 207 79 74 168 -101 19
4491A9k3rM6L05l14k40N44k59N4m1L6J43n39M43k46J74k8m6J18l64L40p9j15J59
$$ 19 -4 -13 33 338 24 -216 328 69 123 82 118 261 -278 165 -81 93 65 19 137 -227 113 34 -81 78
4515G8J56r0j77j68J49j96L28k03M11k27K25k81J86j97M1l25r7M32k67K7L40l54
$$ 78 234 144 -33 -201 -52 -248 80 -123 288 61 286 5 191 -6 35 -290 -387 45 -222 -195 145 -209
4537b09J59J48j93n8L87k30j5j09L76j32k52J67r0J65k78M80k54J81m64K56R5
$$ -209 -50 98 -95 -153 234 4 -11 -120 256 124 -128 39 -51 114 -164 316 62 243 -221 35 130
4558A30j54P7j93K68l59P2J20l0k53J37J30j12J88j15K37m00M37L0m23Q9J43L
$$ 130 -24 53 -140 128 -231 -159 -39 -69 -322 -185 -55 -167 21 -94 143 -257 180 210 -213 -124 19 22
4580B2o0q6J29j58L12j08L7R4j77k64K83K5k93N28k60O1k77M31q7k69K42R9l36
$$ 22 -38 -124 5 -153 159 51 88 182 5 -259 24 49 -244 284 24 85 -192 239 152 -117 125 224 -112
4603a12M0K23k18K55j23j15J52l66M77k15K44k51P6mj83j5L25j71j16j74L63j79
$$ -112 -72 151 -67 188 65 -50 102 -264 213 -2 242 -9 67 63 -120 -135 190 19 -97 -271 92 -87
4625h7N1Q9o7M5N9J30q8j62L2L91o62M38N8j88k84Q8K64j13j7m3K32j35k3L9j37
$$ -87 -36 53 -14 31 90 220 132 -30 2 393 -269 169 227 39 -245 -157 107 -6 -23 -66 166 31 8 47 -90
4650i0J46O5j20N0J20j2j1k09J0J17j11J80l07lM0J93j72M34l79J2n4qJ56k01
$$ -90 56 121 1 51 171 159 148 -61 -51 66 -45 135 -172 -175 -135 58 -114 320 -59 -47 -101 -109 47 -154
4674a54M1L01l74J12J59m7l55K55J80o6k03K26J48k55p1K8K66k90K99j96Lo3J83
$$ -154 -113 188 -186 -74 85 38 -317 -62 118 52 -151 75 223 -32 -103 -75 191 -99 200 4 7 -56 127
4697A27J73m10J07L2J87r2j85L01j45j74L90j86p2k35K42r5J04k04L84m81R6O7
$$ 127 300 -110 -3 29 216 124 -61 240 95 -79 311 125 53 -182 60 -35 69 -135 249 -232 -136 -69
4719f9j28O01m20J44l44J97j48K83m06j04N11J26k49j76K29J1l27K69o4J79l43
$$ -69 -197 404 -16 128 -216 -19 -167 116 -290 -394 117 243 -6 -182 47 58 -269 0 -64 115 -228
4740b28J26L00l89p1J9J57R6j37J39K88j10l00L60k92K6m3o5M0K1J1M2m2L47k52
$$ -228 -102 198 -191 -262 -243 -86 10 -127 12 300 190 -110 250 -42 -16 -59 -124 -84 -63 -52 -10 -52 295 43
4764D3j43P3P8j40J31k78L48J90j15j76M7k46R9P8N4l09L50k28O8L18l31M9J8
$$ 43 -100 -27 51 -89 42 -236 112 302 187 11 58 -188 -89 -11 43 -266 84 -144 -76 242 -89 -40 -22
4787b2j17K72k91L57j72k88N06k78R5K24k16J10j77K4J0j71K05J5j30J0j28J26
$$ -22 -139 133 -158 199 27 -261 245 -33 62 286 70 180 3 27 37 -134 71 86 -44 -34 -162 -36
4809c6M6o6p7K99j99q0L4j9K43j48k09j95M02r4K74k55M2J08J49m7q0k41k06L27
$$ -36 10 -56 -133 166 -33 -113 -79 -98 145 -3 -212 -407 -5 -99 175 -80 -38 70 219 172 92 -149 -355 -28
4833b8k7O4l3L7J37k63qJ41p6L4j1L4P0j87J87j01K33j96j00J85J37j55J4j9j37
$$ -28 -55 9 -24 13 150 -113 -121 20 -56 -22 -33 1 71 -116 71 -30 203 7 -93 92 229 74 88 69 -68
4858f8J46j87j34J61k01L11N1J25j49M1n9l0M09k21k43J72p9M3j63K71k5j13O1
$$ -68 78 -109 -243 -82 -283 28 79 204 55 96 37 7 416 195 -48 124 45 88 -75 196 171 58 119
4881A19o3j3k88O81l76o5P1j82j2J92j89Q4P7J14j42j33K08j5J35m5n9r9l2J84
$$ 119 56 43 -245 436 60 -5 66 -116 -128 64 -125 -41 36 150 8 -125 83 68 203 158 99 0 -32 152
4905A52k16J36pR6j22k03K24K00m37Q8J1o5L1K41p0k12J35Rj66K03r0P6J09j46
$$ 152 -64 72 65 161 39 -164 60 260 -177 -89 -78 -143 -112 129 59 -153 -18 -9 -175 28 -62 14 123 -23
4929b3K76k96P7n9J6K01j74M4J08j71p8K11n0j88J46j41O1p1K84j17l4j26K74
$$ -23 253 -43 34 -25 -9 192 18 62 170 -1 -79 132 82 -106 40 -101 -40 -111 173 56 22 -104 170
4952A70m0l12J08j4k12K04k1J19L59m50l4L40r7j45j10p9M62l08j82M07J9j36
$$ 170 130 -182 -74 -88 -300 -96 -117 2 361 -89 -123 217 120 -25 -135 -214 248 -60 -242 165 184 48
4974D8R3k54qRj43K22J85j44j4m3K6P8m4j64M18k61l13J62M0N7j10O5n9J63n3
$$ 48 141 -113 -121 -112 -255 -33 152 8 -6 -49 -23 55 11 -153 265 4 -309 -147 -107 -50 -160 -95 -154 9 -44
4999d4K0j44J4J73J54k28k06M29r0k28m8N12k75m21J47K64j24P4P6J32j20j07
$$ -44 -24 -168 -154 19 173 -55 -261 168 78 -150 -198 314 39 -382 -235 29 -95 -21 55 187 67 -40
5021d0M0J47R0j07r1j14l2o1M35l05NL76k33j20n8K73k31K1R7l25K20m9K03l3
$$ -40 0 147 237 130 39 -75 -107 -168 267 -38 -33 343 110 -10 -68 205 -26 -5 92 -233 -13 -62 141 108
5045A08l10J86M65n09k28N26l54N2LJ8J82k07N4P7k08N8J04K7j60J05J49j28O9
$$ 108 -202 -16 449 -60 -288 238 -116 -64 -61 -43 139 -68 -14 63 -145 -87 17 44 -116 -11 138 10 79
5068G9J80k00k73J65R8o9n8j06P6L75n04J21J31j38m1J19O7J36j29L95m36k3q7
$$ 79 259 59 -214 -49 49 -20 -78 -184 -108 267 -237 -116 15 -123 -164 -45 22 158 29 424 -12 -35 -122
5091a22K64q4k82M50K5m13K19M6j61K68l82K45j29m7J43O8j87NO6j02M1J9nK4
$$ -122 142 58 -224 226 251 -162 57 103 -58 210 -172 73 -56 -103 40 108 -79 -74 -8 -110 -69 -50 -55 -31
5115c1r3L5M19m74q6P6L00j87M5J60R1k30OJ77l23K63k88K81j91o5K78m7l73J09
$$ -31 -124 -89 330 -144 -230 -154 146 -41 4 164 255 25 31 208 -115 148 -140 141 -50 -115 163 116 -257 -148
5139a48K31l2k01j7j49M46q4n1p0j37K68L45l49p0p4L84l95L87l8Qn27L87j18
$$ -148 83 51 -150 -167 -316 130 46 -5 -75 -212 56 401 52 -18 -92 292 -103 284 246 254 -273 114 -4
5162dn6K00l74L14j25r5N6K15k95K26n7qj16l8K95j77N2m4L1jJ7L8o8K36j57o8
$$ -4 -60 140 -234 80 -45 -140 -84 131 -164 62 5 -3 -119 -157 138 -39 13 -31 0 -1 16 54 -14 222 65 -3
5188cQ7l81O06j63l49K69j19L0j39J12K13l40J61O4J0pP4P2n06J70K40L8j31k26
$$ -3 84 -297 309 146 -203 66 -53 -23 -162 -50 163 -177 -16 48 58 51 125 197 -309 -139 101 139 8 -218
5212b18K29j44J88K41m34K21j21Q2p2K6j09K84j63j93R9J04K15l71L46j76K23
$$ -218 11 -133 55 296 -138 83 -38 44 -28 -2 -111 173 10 -183 -84 20 235 -136 210 34 257
5233B57k03l21K46K61j69J14j9l06J36j03J31O2j41q6K78j5m28L96n7o6J14m8
$$ 257 54 -267 -21 240 71 185 166 -140 -4 -107 24 86 -55 -141 137 122 -306 90 33 -33 81 33
5255C3n5P6j62J81Q6j18r6j48J45K69k32j6J13j1L2O7Ko5j94p8M07k07l17K37
$$ 33 -22 54 -108 73 159 41 -55 -203 -58 211 -21 -37 76 65 97 164 166 101 -93 -171 236 29 -288 -51
5279e1K2pNj43J46r1K25j06o3J09l44N70m91J38J1L44m15J08M1j65K8L27k13K54
$$ -51 -29 -36 -31 -174 -28 -119 106 0 -63 46 -298 272 -219 -81 -70 274 -141 -33 8 -157 -129 198 -15 239
5303B39k83J33N4m41K09M5Mm8Q3k62L09M4j4k6j14J69l77L70n6o2k5M9J46l19
$$ 239 -44 89 143 -298 -89 -44 -40 -88 -5 -267 42 86 72 46 -68 101 -276 94 38 -24 -49 0 146 -173
5327a73K86Q1j01M2J03k91J19k61L15j48L93n59J64P1N3l43K22j40J68J49j6l36
$$ -173 113 194 93 135 238 -53 66 -195 120 -28 365 -194 -30 41 94 -249 -27 -167 1 150 134 -202
5349b02M18m1p4j38J25q4r5R1oJ55n9j78M0R5j81K3O6k0K1K34k04o2K15k19p8
$$ -202 216 175 101 -37 88 4 -91 0 -6 149 90 -88 -48 47 -134 -111 -45 -65 -44 190 -14 -76 139 -80 -158
5374a58N96l63o5K64j58k63M13N0k55m0j42j63K18Kr4J97K1j85K47M9j21j59m3
$$ -158 438 75 10 274 116 -147 266 316 61 21 -121 -284 -66 -64 -158 39 60 -125 122 171 50 -109 -152
5397a52K99N7j24j35L5R1k71J05K68j24j07j3R0p2Q2j47q8M63m28m3K56m7K66
$$ -152 147 204 80 -55 -20 71 -200 -95 173 49 -58 -71 19 -53 29 -118 -206 257 -171 -214 42 -5 261
5420B61k94K11m18K89j09j34k3L76l6k24J77p0K8J11j00J17k62J7J9N5K15j38
$$ 261 -33 178 -240 49 -60 -194 -217 159 123 -101 76 6 34 145 45 162 -100 -83 -64 -9 206 68
5442F8j22J01L5M7j58K20j21l65K65O5R3j77j4K43L4j97M7m1q7J56K5k06R0jK17
$$ 68 -54 47 82 129 -29 191 70 -295 -30 35 128 -49 -63 180 214 17 64 23 -64 92 117 -89 1 0 217
5467B17k66J73k34l9P8J55J76k28j67l1K36K2L7k85m6P1J64j74JlO2L58k17N5
$$ 217 -49 124 -110 -149 -71 84 260 32 -135 -166 70 92 129 -156 -202 -131 33 -141 -140 -143 -81 277 60 115
5491A15N9j84pm0R9j37j02J47k28K55l1J8L3m1k2j0j25J99j16%j84J49J48j59
$$ 115 174 -10 -17 -57 42 -95 -197 -50 -278 -23 -54 -36 -3 -44 -66 -76 -201 -2 -118 -118 -302 -153 -5 -164
$$ [...]
8191D7
##END NTUPLES=NMR FID
##END=
