##TITLE=1H_1PDM2506
 CDCl3, 8 sc, 
 26.6.2019
##JCAMPDX= 6.0         $$ Bruker NMR JCAMP-DX V2.0
##DATA TYPE= NMR FID
##DATA CLASS= NTUPLES
##ORIGIN= UXNMR, Bruker Analytische Messtechnik GmbH
##OWNER= root
$$ XWIN-NMR		Version 3.5
$$ Wed Jun 26 15:32:00 2019 Russian Standard Time (UT+4h)  she@DPX200
##.OBSERVE FREQUENCY= 200.13155
##.OBSERVE NUCLEUS= ^1H
##.DELAY= (6, 6)
##.ACQUISITION MODE= SIMULTANEOUS
##.ACQUISITION SCHEME= undefined
##.AVERAGES= 8
##.DIGITISER RES= 18
##SPECTROMETER/DATA SYSTEM= spect
##.PULSE SEQUENCE= zg30
##.SOLVENT NAME= CDCl3
##.SHIFT REFERENCE= (INTERNAL, CDCl3, 0, 15.7039)
##AUDIT TRAIL= $$ (NUMBER, WHEN, WHO, WHERE, WHAT)
$$ ##TITLE= Audit trail, XWIN-NMR		Version 3.5
$$ ##JCAMPDX= 5.01
$$ ##ORIGIN= Bruker BioSpin GmbH
$$ ##OWNER= she
$$ F:/spectra/data/she/nmr/H-F/1/audita.txt
$$ ##AUDIT TRAIL=  $$ (NUMBER, WHEN, WHO, WHERE, WHAT)
(   1,<2019-06-26 15:31:00.42 +0400>,<she>,<DPX200>,
      <created by zg, POWCHK disabled, PULCHK disabled
       configuration hash MD5:
       00 E9 B6 7A A2 85 ED C7 34 08 36 98 17 FE 4E 26
       data hash MD5: 16K
       FD AA 60 21 5D 7E A8 AE D3 53 CA 06 0C 2C 57 E0>)
$$ ##END=
$$ 
$$ hash MD5
$$ 42 60 C4 65 F7 78 99 DD 72 A4 00 19 DC 98 D2 0F
##$RELAX= 
##$RELAX= 
##$RELAX= 
##$RELAX= 
##$RELAX= 
##$RELAX= 
$$ Bruker specific parameters
$$ --------------------------
##$DU= <F:/spectra>
##$EXPNO= 1
##$NAME= <H-F>
##$PROCNO= 1
##$TYPE= <nmr>
##$USER= <she>
##$AMP= (0..31)
100 100 100 100 100 100 100 100 100 100 100 100 100 100 100 100 100 100 
100 100 100 100 100 100 100 100 100 100 100 100 100 100 
##$AQSEQ= 0
##$AQ_mod= 1
##$AUNM= <au_zg>
##$AUTOPOS= <>
##$BF1= 200.13
##$BF2= 200.13
##$BF3= 200.13
##$BF4= 200.13
##$BF5= 200.13
##$BF6= 200.13
##$BF7= 200.13
##$BF8= 200.13
##$BYTORDA= 1
##$CFDGTYP= 0
##$CFRGTYP= 5
##$CHEMSTR= <none>
##$CNST= (0..31)
1 1 145 1 1 1 1 1 1 1 1 1 1 1 1 1 1 1 1 1 1 1 1 1 1 1 1 1 1 1 1 1 
##$CPDPRG= <>
##$CPDPRG1= <>
##$CPDPRG2= <>
##$CPDPRG3= <>
##$CPDPRG4= <mlev>
##$CPDPRG5= <mlev>
##$CPDPRG6= <mlev>
##$CPDPRG7= <mlev>
##$CPDPRG8= <mlev>
##$CPDPRGB= <>
##$CPDPRGT= <>
##$D= (0..31)
0 1.2 0 0 0 0 0 0 0 0 0 0.03 0 0 0 0 0 0 0 0 0 0 0 0 0 0 0 0 0 0 0 0 
##$DATE= 1561548659
##$DBL= (0..7)
120 120 120 120 120 120 120 120 
##$DBP= (0..7)
150 150 150 150 150 150 150 150 
##$DBP07= 0
##$DBPNAM0= <>
##$DBPNAM1= <>
##$DBPNAM2= <>
##$DBPNAM3= <>
##$DBPNAM4= <>
##$DBPNAM5= <>
##$DBPNAM6= <>
##$DBPNAM7= <>
##$DBPOAL= (0..7)
0.5 0.5 0.5 0.5 0.5 0.5 0.5 0.5 
##$DBPOFFS= (0..7)
0 0 0 0 0 0 0 0 
##$DE= 6
##$DECBNUC= <off>
##$DECIM= 24
##$DECNUC= <off>
##$DECSTAT= 4
##$DIGMOD= 1
##$DIGTYP= 9
##$DL= (0..7)
0 120 120 120 120 120 120 120 
##$DP= (0..7)
150 150 150 150 150 150 150 150 
##$DP07= 0
##$DPNAME0= <>
##$DPNAME1= <>
##$DPNAME2= <>
##$DPNAME3= <>
##$DPNAME4= <>
##$DPNAME5= <>
##$DPNAME6= <>
##$DPNAME7= <>
##$DPOAL= (0..7)
0.5 0.5 0.5 0.5 0.5 0.5 0.5 0.5 
##$DPOFFS= (0..7)
0 0 0 0 0 0 0 0 
##$DQDMODE= 0
##$DR= 18
##$DS= 0
##$DSLIST= <SSSSSSSSSSSSSSS>
##$DSPFIRM= 0
$$ [...]
##$SUBNAM2= <"">
##$SUBNAM3= <"">
##$SUBNAM4= <"">
##$SUBNAM5= <"">
##$SUBNAM6= <"">
##$SUBNAM7= <"">
##$SUBNAM8= <"">
##$SUBNAM9= <"">
##$SW= 24.9336996594482
##$SWIBOX= (0..15)
0 0 2 0 0 0 0 0 0 0 0 0 0 0 0 0 
##$SW_h= 4990.01996007984
##$TD= 16384
##$TD0= 1
##$TE= 0
##$TE2= 300
##$TE3= 300
##$TEG= 300
##$TL= (0..7)
0 120 120 120 120 120 120 120 
##$TP= (0..7)
150 150 150 150 150 150 150 150 
##$TP07= 0
##$TPNAME0= <>
##$TPNAME1= <>
##$TPNAME2= <>
##$TPNAME3= <>
##$TPNAME4= <>
##$TPNAME5= <>
##$TPNAME6= <>
##$TPNAME7= <>
##$TPOAL= (0..7)
0.5 0.5 0.5 0.5 0.5 0.5 0.5 0.5 
##$TPOFFS= (0..7)
0 0 0 0 0 0 0 0 
##$TUNHIN= 0
##$TUNHOUT= 0
##$TUNXOUT= 0
##$USERA1= <user>
##$USERA2= <user>
##$USERA3= <user>
##$USERA4= <user>
##$USERA5= <user>
##$V9= 5
##$VALIST= <valist>
##$VCLIST= <CCCCCCCCCCCCCCC>
##$VD= 0
##$VDLIST= <DDDDDDDDDDDDDDD>
##$VPLIST= <PPPPPPPPPPPPPPP>
##$VTLIST= <TTTTTTTTTTTTTTT>
##$WBST= 1024
##$WBSW= 4
##$XGAIN= (0..3)
0 0 0 0 
##$XL= 0
##$YL= 0
##$YMAX_a= 304280
##$YMIN_a= -179110
##$ZGOPTNS= <>
##$ZL1= 120
##$ZL2= 120
##$ZL3= 120
##$ZL4= 120
##$ABSF1= 10
##$ABSF2= 0
##$ABSG= 5
##$ABSL= 3
##$ALPHA= 0
##$AQORDER= 0
##$ASSFAC= 0
##$ASSFACI= 0
##$ASSFACX= 0
##$ASSWID= 0
##$AUNMP= <proc_1d>
##$AZFE= 0.1
##$AZFW= 0.1
##$BCFW= 1
##$BC_mod= 2
##$BYTORDP= 1
##$COROFFS= 0
##$CY= 11.3945322036743
##$DATMOD= 1
##$DC= 2
##$DFILT= <>
##$DTYPP= 0
##$F1P= 18.9103706918063
##$F2P= -1.10871071338519
##$FCOR= 0.5
##$FTSIZE= 0
##$FT_mod= 4
##$GAMMA= 1
##$GB= 0.15
##$INTBC= 1
##$INTSCL= 1
##$ISEN= 128
##$LB= 0.24
##$LEV0= 0
##$LPBIN= 0
##$MAXI= 10000
##$MC2= 0
##$MEAN= 0
##$ME_mod= 0
##$MI= 1.114404
##$NCOEF= 0
##$NC_proc= 0
##$NLEV= 6
##$NOISF1= 3.799351
##$NOISF2= 2.8
##$NSP= 1
##$NTH_PI= 0
##$NZP= 0
##$OFFSET= 15.70392
##$PC= 1
##$PHC0= -8657.511
##$PHC1= 14.80097
##$PH_mod= 1
##$PKNL= yes
##$PPARMOD= 0
##$PSCAL= 0
##$PSIGN= 0
##$REVERSE= no
##$SF= 200.130013532006
##$SI= 16384
##$SIGF1= 3
##$SIGF2= 2
##$SINO= 400
##$SIOLD= 16384
##$SREGLST= <1H.CDCl3>
##$SSB= 0
##$STSI= 0
##$STSR= 0
##$SW_p= 3612.71676300578
##$SYMM= 0
##$S_DEV= 0
##$TDeff= 0
##$TDoff= 0
##$TI= <>
##$TILT= no
##$TM1= 0
##$TM2= 0
##$TOPLEV= 0
##$USERP1= <user>
##$USERP2= <user>
##$USERP3= <user>
##$USERP4= <user>
##$USERP5= <user>
##$WDW= 1
##$XDIM= 8192
##$YMAX_p= 0
##$YMIN_p= 0
$$ End of Bruker specific parameters
$$ ---------------------------------
##NTUPLES= NMR FID
##VAR_NAME=  TIME,          FID/REAL,        FID/IMAG
##SYMBOL=    X,             R,               I
##VAR_TYPE=  INDEPENDENT,   DEPENDENT,       DEPENDENT
##VAR_FORM=  AFFN,          ASDF,            ASDF
##VAR_DIM=   8192,          8192,            8192
##UNITS=     SECONDS,       ARBITRARY UNITS, ARBITRARY UNITS
##FACTOR=    0.0002004,     1,               1
##FIRST=     0,             0,               0
##LAST=      1.6414764,     0,               0
##MIN=       0,             -179110,         0
##MAX=       1.6414764,     304280,          0
$$ Real data points
##PAGE= N=1
##DATA TABLE= (X++(R..R)), XYDATA
0 0 0 0 0 0 -8 8 -8 8 -8 16 -16 22 -24 32 -40 48 -56 72 -80 96 -112 129 -152 176 -201 232 -264 299 -337
29 -337 383 -432 485 -543 607 -678 757 -840 934 -1036 1148 -1274 1408 -1557 1725 -1913
45 -1913 2122 -2355 2624 -2934 3290 -3711 4218 -4838 5617 -6635 8022 -10039 13247 -19158
59 -19158 33638 -140799 -91477 253857 53985 -77868 54846 65593 -179110 -108334 171345
70 171345 144159 -110975 -92170 29637 -25978 -44545 127123 119175 -100632 -137417 31830
81 31830 48800 -21030 42691 74281 -70353 -104111 54646 91339 -39437 -46301 35836 -8679
93 -8679 -54375 54597 93389 -49135 -104092 14532 56377 -6592 9120 39600 -45355 -83104
105 -83104 32749 93299 5372 -47170 -22517 -37189 -30600 70003 99089 -18537 -89002 -45210
117 -45210 -23656 -1094 97422 100070 -71072 -138443 6722 79663 -1944 3164 65531 -41360
129 -41360 -154369 -10839 157489 66397 -64462 -18552 432 -84640 -27831 128987 75279
140 75279 -99685 -75390 47474 18137 -27186 58001 63373 -81909 -99511 51596 85237
151 85237 -18186 -26236 26528 -22239 -59719 31944 80408 -11632 -62098 -1428 20858 -10231
163 -10231 12074 33460 -26208 -57629 8142 47718 9864 -7591 -209 -32432 -41733 26363
175 26363 61010 809 -42519 -18363 -4339 -3073 32299 39413 -24181 -57659 -12237 21463
187 21463 18521 33407 26198 -43232 -67773 6336 50587 11407 -3955 11676 -26684 -51332
199 -51332 26309 78581 2684 -56422 -9221 9292 -31401 6305 78153 20172 -76548 -32185
211 -32185 48541 11507 -27905 26421 30856 -52612 -46292 50711 47166 -35100 -26052 24994 -8521
224 -8521 -36725 26054 49785 -23652 -47539 12692 22176 -19393 -2682 29421 -8955 -37536
236 -37536 10945 36142 -8602 -24591 6821 2417 -19891 7532 32018 -3312 -28254 -542
248 -542 11461 -7381 1911 19775 -6423 -27536 4315 26370 2001 -9181 5127 -6073 -21654
261 -21654 5469 28499 3879 -13171 3863 831 -17997 2621 27210 -1765 -27471 1602
273 1602 18473 -9571 -9402 22984 7961 -30711 -9816 25966 1729 -22307 8901 19987 -19296
286 -19296 -20439 22134 15263 -23909 -7320 24802 -2523 -27597 7387 24447 -13478 -19563 19305
299 19305 13734 -24917 -10005 25938 5799 -22552 1297 18080 -10090 -15562 16967 15541 -15900
312 -15900 -9836 13672 400 -12827 10729 17805 -12962 -18060 11866 13827 -9176 -3399 11753
325 11753 -4716 -17154 6210 18904 -2578 -11997 1647 22 -9027 5369 16526 -4016 -18471
338 -18471 -1470 8968 -1378 207 9793 -4105 -19373 -1983 17794 5992 -8565 -2793 -2036
351 -2036 -10479 599 19076 8817 -13604 -12061 508 1698 5053 13257 2401 -17878 -11742
364 -11742 10647 12960 1998 720 -2458 -14357 -9200 15009 20965 447 -13308 -9210 -3591
377 -3591 3125 14191 11319 -9024 -17933 -3909 9372 10121 7833 515 -15485 -19289 1483 20744
391 20744 14287 -4011 -13075 -12634 -5207 9315 16899 4096 -14333 -16306 -3285 10086 15569 8621
405 8621 -9621 -21828 -11521 10031 19507 11248 -3946 -16129 -15997 657 18876 17272 -2673
418 -2673 -17774 -14203 1658 16365 18749 4311 -15795 -21574 -6802 13965 22607 12392 -8808
431 -8808 -22587 -14056 9212 22500 12143 -8596 -19533 -12708 4693 19536 18205 -1013 -21464
444 -21464 -23137 -3414 19248 23735 5796 -17732 -24056 -7106 15063 20701 6205 -13362 -21745
457 -21745 -11675 9888 24774 16184 -9992 -27733 -18847 6761 24507 19809 -2213 -22500 -22003
470 -22003 20 21996 22437 2138 -19055 -23247 -6147 19053 28245 9558 -18420 -26699 -9791
483 -9791 13474 25118 17315 -6853 -27672 -20370 10004 28951 17040 -8349 -23079 -19460 -134
496 -134 23455 27401 2140 -26251 -26980 -4016 18076 24798 11832 -15564 -31997 -14214 19118
509 19118 28414 7873 -14713 -22598 -16299 4084 26719 23702 -7806 -31202 -20702 6439 23259
522 23259 21163 1721 -23521 -27965 -1032 27211 25021 569 -19283 -23561 -10710 15925 32821
535 32821 15674 -19379 -31516 -10911 15804 26105 16617 -7038 -27507 -21957 7914 30413
547 30413 21629 -6809 -27059 -22614 1676 25255 26761 3535 -24028 -30542 -9079 21138 30446
560 30446 9622 -18800 -27848 -13315 11081 27465 19063 -11793 -33293 -19323 11675 24890
572 24890 16060 -497 -19238 -27399 -6361 26499 27488 -3808 -23871 -16056 -1128 12066 22730
585 22730 12164 -19547 -30765 -3790 22174 19687 6920 -4890 -21747 -22713 9540 34786 14116
598 14116 -19273 -20590 -5008 3225 15162 24531 1906 -32522 -25823 12152 26757 12720 458
611 458 -11352 -26477 -15263 22456 33843 2231 -24415 -19240 -5459 5974 21482 21019 -9665
624 -9665 -34483 -19021 12785 23970 14726 -1001 -18236 -23200 -4658 19013 21052 2982 -15428
637 -15428 -20417 -6981 15167 21623 4798 -12928 -15316 -8157 3878 17928 16177 -6903 -21566
650 -21566 -8241 9721 11581 7511 1949 -12275 -17437 3523 22130 9309 -10458 -9378 -4021
663 -4021 -5027 6373 20664 5081 -22195 -16253 9079 12188 3103 4644 -2031 -21174 -13890 18228
677 18228 22647 -4586 -14397 -4573 -7218 -7232 16866 24882 -8818 -30597 -6376 15154 5113 1000
691 1000 11278 -2263 -26338 -11267 23229 19996 -7469 -10931 -1199 -6711 -6982 13744 19761 -4986
705 -4986 -19980 -4921 8660 4482 2833 6390 -2302 -13875 -5470 11157 9851 -2836 -5078 103
719 103 -1555 -3587 3401 7778 -1218 -9192 -1809 6926 1705 -5389 -909 3232 -2552 -3910 4825
734 4825 4550 -7293 -7591 5149 6179 -3607 -2487 3304 -4343 -9074 5566 13653 -2998 -13165
748 -13165 472 6694 -5106 -3241 12330 5764 -14740 -9562 10157 6809 -5607 1523 7806
761 7806 -6460 -12135 5462 12383 -2223 -6058 4665 1370 -9504 -1397 11475 4031 -7013
774 -7013 -1500 3431 -4147 -5093 5848 7976 -1880 -5845 -2339 -1689 -860 4007 5248 -232 -5071 -6283
790 -6283 -3668 3935 8711 1910 -6342 -4578 -1686 -3598 1871 11767 4882 -12153 -10606 3993 5493
805 5493 491 5130 4138 -11064 -11976 7380 12437 -2309 -4234 4425 -3379 -11794 4425 17075
819 17075 -403 -14242 -386 7965 -3507 -2598 10824 2472 -14569 -3662 13848 3132 -9872
832 -9872 1546 6845 -8436 -6985 13826 9174 -15645 -12050 10844 8250 -6801 243 7620 -8495
846 -8495 -15193 6665 17688 -526 -11758 -2665 -380 -5136 4850 15431 1864 -16579 -11251
859 -11251 4589 8474 6241 4558 -3968 -13564 -7852 7733 13330 5511 -4432 -10016 -8313 1463
873 1463 11028 10123 537 -8959 -11448 -2934 10485 13275 1421 -9081 -7949 -2576 2278 8810 9417
888 9417 -3020 -13620 -6849 6019 8441 4071 -486 -7773 -10616 699 12439 6465 -5885 -6563
902 -6563 -2776 -3639 1583 11936 6242 -12206 -13777 3480 10988 3827 45 -1499 -9912 -10336 7015
917 7015 17278 3818 -11033 -8362 -1786 -306 6688 13447 1737 -16551 -12538 7163 13524 5422
931 5422 -208 -4300 -11416 -7994 10053 18313 3633 -12088 -10598 -1949 3376 8921 10368 -1552
945 -1552 -15173 -10646 5970 12531 6300 -1719 -8479 -11919 -3109 12407 13599 -1738 -11885 -8092
959 -8092 -1667 3298 10070 8940 -6181 -16820 -6132 10159 11842 3051 -4267 -9939 -10280 1612
973 1612 14623 10715 -4351 -11210 -7631 -1374 7244 13289 4797 -11758 -13966 188 11096 9906
987 9906 3635 -4946 -12494 -7795 7660 14762 6181 -5316 -10182 -8708 834 13118 11889 -4027
1001 -4027 -13580 -7104 2162 6971 9925 4631 -10528 -16345 -1452 13241 10067 -94 -5723 -9704
1015 -9704 -8416 5151 15764 6087 -10124 -11957 -4025 2624 9666 12001 -1420 -17298 -12180 6282
1029 6282 12828 6813 762 -6629 -13674 -5877 12167 15819 1267 -9959 -9629 -4857 4231 14717
1043 14717 10608 -7868 -15808 -4541 6977 8680 7524 2092 -10570 -14315 1007 15434 10175
1056 10175 -3511 -9524 -8542 -3073 7754 13550 3719 -10523 -12155 -3019 6107 10780 6958 -5710
1070 -5710 -14050 -6502 6931 10540 4753 -3046 -9910 -10149 1324 13107 9608 -3804 -10963 -8354
1084 -8354 -964 8397 12172 2583 -11079 -11747 -360 8429 9149 4686 -4450 -12222 -7363 6998 13664
1099 13664 6055 -4911 -10026 -7137 2285 10893 8933 -1971 -9353 -7506 -423 7544 10644 2328
1113 2328 -10281 -11382 264 9131 7667 2102 -4279 -9911 -6996 5298 12113 4647 -6323 -9053
1127 -9053 -4847 1802 8237 7617 -2371 -10691 -7085 2446 7521 6190 617 -7033 -9339 -1697 7838
1142 7838 8317 946 -5777 -7242 -2882 5119 8866 3066 -5357 -7105 -2721 2736 6969 6460 -1362
1157 -1362 -8974 -5970 3718 7531 3802 -1016 -4187 -5430 -1452 5693 7149 435 -6003 -5715 -781
1172 -781 4351 6062 2125 -4386 -6250 -2317 2606 4648 3296 -1543 -6199 -4660 2333 5688 2372
1187 2372 -2155 -3991 -3767 -897 3948 4957 -267 -5006 -3635 85 2048 3062 2521 -1874 -5423
1202 -5423 -2044 3894 3851 -246 -1729 -892 -1385 -709 2887 3813 -559 -3712 -1398 1659 1719 910 551
1219 551 -983 -2040 103 2420 955 -904 -322 -152 -1370 -179 2358 1021 -2514 -1710 1535 880
1235 880 -1543 -204 1461 -858 -2276 615 1710 -1394 -2067 934 1151 -1625 -1085 1299 251 -1587
1251 -1587 377 1677 -1205 -2395 775 1958 -393 -859 757 -176 -1619 625 2946 927 -2037
1266 -2037 -2021 -383 1153 2588 1695 -1573 -2559 -333 987 1140 2616 1725 -3488 -5159 651 5089
1282 5089 2320 -1090 -1445 -2779 -3285 2021 6082 1223 -4592 -3215 -816 -892 2405 5992 61 -8392
1298 -8392 -4801 4166 3927 -19 1088 -272 -6597 -4325 6276 7068 -2476 -4993 -683 -1279 -1650 5510
1314 5510 6926 -4119 -8831 428 5807 944 129 2851 -3123 -8363 1128 10756 3680 -6264 -3661
1329 -3661 895 -1207 812 7231 3009 -8191 -7662 2747 6624 3370 906 -2656 -7247 -4013 5687
1344 5687 8056 635 -5275 -5498 -3365 1496 7175 6109 -2489 -8858 -6463 1436 7675 6797 -1344
1359 -1344 -7898 -6126 -2 4327 6370 4277 -4387 -10558 -3765 7221 7878 1571 -2444 -5282 -6822
1374 -6822 656 10347 6644 -4942 -6862 -1378 -50 2468 8746 4576 -9495 -10270 3966 8567
1388 8567 827 -580 1568 -5619 -8355 5278 13251 434 -10300 -3997 1669 -712 3287 8290
1402 8290 -1474 -12472 -4280 8326 5627 -531 314 -3342 -10241 -2483 12094 8925 -5811 -8682
1416 -8682 -2377 -329 2466 8628 4786 -7888 -10578 -990 5754 6621 5387 -1813 -10915 -7076 6114
1431 6114 9777 3140 -1400 -4389 -8092 -2792 9685 10402 -1566 -7552 -4652 -2450 2116 10028 6674
1446 6674 -7367 -10212 496 4620 1857 4482 3458 -8710 -11211 4700 12062 454 -5504 49
1460 49 -2266 -6978 3690 12586 -725 -13029 -3438 5987 539 412 7324 -862 -13759 -3851 12575
1475 12575 5981 -6688 -2266 1615 -6753 -3507 12673 9914 -9445 -11221 2371 4199 98 5872
1489 5872 5572 -8972 -11865 4216 11213 2423 -1408 8 -6524 -8179 5680 13644 1797 -8331
1503 -8331 -4658 -1216 -995 5566 9301 -1111 -10531 -4972 3011 3755 4524 3779 -5208 -10259 -883 7804
1519 7804 3862 -871 -674 -4585 -7181 2617 10771 2210 -7273 -3588 35 -2415 2265 9032 421
1534 421 -10916 -3997 6960 3079 -1488 3346 461 -9772 -4126 10864 7287 -6201 -4268 2547
1548 2547 -2409 -2663 8992 7761 -8777 -9963 4492 6084 -1539 2502 5498 -6990 -11323 5139
1562 5139 12742 -592 -6809 652 -940 -7016 2541 12573 1278 -11585 -4633 4212 952 735
1576 735 6041 -141 -10571 -4819 7146 5473 -1194 -491 -1579 -6922 -2297 8160 6323 -3700
1590 -3700 -4882 -1154 -1373 823 6374 3280 -5808 -5485 1437 2605 1629 3743 853 -6383 -4287 4885
1606 4885 5388 -769 -1461 -235 -3159 -1640 5545 4959 -3218 -4412 190 230 21 4489 2902 -5927
1622 -5927 -5799 3367 4464 -1026 297 2069 -4595 -6105 4398 7954 -1771 -5870 254 430 -3126
1637 -3126 2218 6873 -1377 -8137 -1438 4287 641 4 3369 -1332 -7154 -911 6763 2459 -3008
1652 -3008 -251 241 -3780 -452 6216 2798 -4274 -2451 1423 -354 409 4635 1011 -5423 -1906
1667 -1906 4276 1181 -2174 2016 2020 -4564 -2995 5118 3527 -3798 -1937 2406 -1118 -2571 3322 3179
1683 3179 -4021 -3292 3198 1377 -2995 1142 3273 -3601 -4474 3711 3805 -3879 -2379 3781 -398 -5022
1699 -5022 1822 5575 -2716 -5393 2835 3551 -3848 -1414 5135 98 -5794 1027 5708 -1966 -4358
1714 -4358 3653 3506 -4654 -2085 5877 1412 -5703 166 5518 -1089 -4393 2323 3310 -3096 -1631
1729 -1631 4123 331 -4483 635 3928 -1836 -2941 3060 1539 -4775 -1163 5326 732 -4885 -197
1744 -197 2980 -1996 -2398 3678 1967 -4784 -2338 3514 877 -2481 1361 1976 -3944 -3322 4022 3495
1760 3495 -2791 -1867 1848 -979 -2356 3094 3964 -2563 -3980 1161 1955 -421 1775 2501 -2904 -4138
1776 -4138 2100 3969 -474 -886 1159 -2019 -3645 2673 5918 -750 -4948 -641 1531 -933 881
1791 881 4060 -593 -5679 -1688 3653 2093 -219 482 -1919 -4688 -180 5427 2329 -3291 -2507 -546
1807 -546 -1407 717 4579 1661 -4919 -4141 1071 2455 1778 2054 -917 -5327 -2595 4187 4318 -369
1823 -369 -1447 -1163 -3029 -1086 5259 5185 -2356 -5429 -1236 1679 1829 3087 2078 -3425 -5332 106
1839 106 4513 3007 394 -1753 -4057 -2939 3019 5654 1008 -3585 -3048 -1566 62 3704 4470 -1428
1855 -1428 -6374 -3301 2270 3516 2228 239 -3634 -5392 -490 5070 3681 -986 -2986 -3225 -2498
1870 -2498 2036 6154 2639 -4498 -5356 -437 2851 3377 2772 -888 -5153 -3801 2376 5282 2733 -702
1886 -702 -3467 -4444 -532 5393 5380 -951 -4775 -3034 -243 2317 4548 2934 -3287 -6205 -1719 3950
1902 3950 4417 1627 -1710 -4544 -3802 1492 5422 3030 -2158 -4442 -3457 -243 3875 4698 -120 -5322
1918 -5322 -4571 59 3543 3786 1074 -3287 -5201 -1783 3495 4667 1686 -2237 -4601 -3269 2104
1933 2104 5863 3046 -2713 -4614 -2262 963 3730 4348 483 -4868 -4772 764 4587 3855 572 -3131
1949 -3131 -4799 -1611 4107 5236 927 -3110 -3627 -2170 1034 4736 4089 -2236 -6093 -2712 2553
1964 2553 3638 2132 -125 -3477 -4887 -649 4640 4063 -1018 -3828 -3310 -1349 2015 4750 2149
1979 2149 -3915 -5379 -735 3302 2957 1299 -796 -3707 -4020 1069 5776 3398 -2391 -4389 -2024
1994 -2024 677 2991 3950 1003 -3870 -4601 -26 4015 3652 870 -2126 -3896 -2225 2609 5100 1807
2010 1807 -2935 -3550 -1327 887 2832 3358 -71 -4549 -3830 1455 4163 1949 -1007 -2452 -2952 -1259
2026 -1259 2440 3693 519 -3273 -3373 -747 1720 3119 1829 -1945 -4284 -1774 2474 3213 887
2041 887 -1280 -2300 -2259 16 3142 3401 -365 -3689 -2987 835 3480 2655 -157 -2256 -2279 -963 1760
2058 1760 3777 2121 -2273 -3918 -870 2396 2599 1362 -325 -2697 -2968 693 3769 1968 -1431
2073 -1431 -1957 -1435 -1258 1244 3791 933 -3915 -3092 1310 1854 94 813 639 -2987 -3395 1890 4032
2090 4032 -43 -2755 -970 -319 -794 1436 2948 -554 -3537 -918 1751 624 312 1606 -602 -3651
2106 -3651 -763 3902 2252 -1885 -1457 509 -620 -478 2511 2476 -1701 -2991 15 1743 1116 889
2122 889 153 -1861 -1837 808 2180 704 -414 -884 -1461 -660 1378 1762 -32 -1362 -1336 -792 568 1866
2140 1866 564 -1785 -1402 194 -52 -26 1553 754 -2505 -2000 1855 1770 -1191 -632 1336 -532 -2255
2157 -2255 918 2843 -527 -2274 646 1311 -1107 -170 2249 4 -2540 435 2689 -399 -1957
2172 -1957 1320 1618 -1882 -1026 2703 1136 -2600 -693 2316 189 -1728 713 1398 -1599 -1464 1770
2188 1770 1198 -1767 -661 1403 -392 -1838 738 1911 -1071 -1981 571 1137 -707 -742 583 42
2204 42 -890 4 506 -112 -280 17 -144 65 583 -135 -823 219 909 -152 -462 669 214 -1056 75
2223 75 1680 298 -1236 82 777 -810 -181 2151 698 -2438 -914 1944 610 -1085 794 1149
2239 1149 -2049 -1912 2071 2176 -1246 -1203 634 -826 -1581 1749 2417 -1795 -2670 851 910 -1503 393
2256 393 2664 -1093 -4027 124 3399 124 -1821 503 296 -2201 -269 2999 893 -2280 -779
2271 -779 863 -466 177 2406 323 -2987 -913 2406 953 -814 815 530 -2253 -910 2918 1894
2287 1894 -1647 -1123 399 -776 -64 2787 1252 -3006 -2058 1755 969 -811 1284 1159 -3141 -3070 2458
2304 2458 3393 -1113 -1874 231 -1085 -1947 1994 3378 -1222 -3495 -380 782 -452 1450 2637 -1895
2320 -1895 -4476 251 3582 542 -1170 885 -324 -3206 -255 4397 1918 -2743 -1714 566 -269
2335 -269 488 2932 1000 -3249 -1992 1914 1595 -78 994 457 -2839 -2091 2872 3257 -948 -2248
2351 -2248 -443 -274 -177 1900 1964 -1335 -2817 -647 1092 1166 1373 123 -2601 -2536 972 2499 697
2368 697 -731 -1057 -1909 -1260 1724 2741 -4 -2288 -1804 -511 799 2349 1548 -1592 -2761 -431
2384 -431 1467 1320 1317 522 -2016 -2569 680 3150 1561 -814 -1329 -1252 -577 1740 2612 255 -1959 -1515
2402 -1515 -330 630 2021 1960 -1345 -3357 -743 2203 1570 13 -191 -1173 -2316 -262 2694 1852 -1191
2419 -1191 -2154 -1255 -428 1240 2197 282 -2581 -2135 340 1275 996 900 -598 -2561 -1461 1597 2462
2436 2462 495 -1050 -1529 -1338 361 2387 1659 -913 -1763 -770 -30 1099 2303 934 -2252 -2364 723
2453 723 2216 1127 174 -467 -1679 -1398 1242 2650 767 -1338 -1760 -1027 441 2052 1622 -1040 -2246
2470 -2246 -952 441 999 1370 587 -1835 -2614 -170 1953 1360 -274 -1091 -1666 -1022 1051 2102 354
2487 354 -1457 -1287 -641 67 1510 1995 -495 -2576 -1221 1297 1622 669 -21 -913 -1438 -209 1682
2504 1682 1644 165 -947 -1360 -761 1231 2204 493 -1624 -1182 125 530 978 1353 -140 -2138 -1400
2521 -1400 1085 1639 432 -367 -918 -1490 -426 1643 1423 -584 -1460 -891 -512 350 1485 859 -1504
2538 -1504 -2031 -148 1066 724 327 -222 -1324 -1244 479 1561 682 -447 -912 -1012 -71 1552 1480 -574
2556 -574 -1501 -334 516 338 809 1004 -430 -1644 -522 1344 1291 122 -497 -831 -617 589 1322 448
2574 448 -578 -722 -471 -142 795 1074 -98 -1377 -853 370 619 462 140 -806 -1218 -194 840 511
2592 511 -141 -326 -796 -947 214 1239 352 -1101 -805 99 114 182 674 221 -1023 -825 545 797 228
2611 228 -57 -314 -633 -62 1001 632 -367 -370 162 -176 -153 980 904 -621 -945 251 946 155 -167 130
2631 130 -123 -515 88 700 185 -441 -254 -253 -214 199 534 -304 -913 -372 307 62 -282 -110 -106 -352 -297 166
2653 166 224 -103 -266 -309 -107 308 377 -260 -360 71 311 -88 -91 324 55 -312 -61 421 344 -102 -207 61
2675 61 258 286 258 9 -150 109 196 79 48 247 -31 -420 -30 661 404 -516 -448 200 210 -184 51 180
2697 180 -191 -649 -128 336 207 -303 -317 -333 -304 146 511 -103 -815 -405 373 231 -202 175 296 -512 -831
2718 -831 354 1163 131 -859 -352 310 214 108 460 187 -541 -408 388 624 348 108 -222 -537 17 931
2738 931 668 -330 -475 57 33 67 606 505 -541 -1042 -165 758 506 -67 -429 -599 -476 205 686 286
2758 286 -490 -743 -553 59 563 621 -268 -911 -743 102 677 571 -230 -694 -484 -106 157 595 698 -328
2778 -328 -1265 -468 1178 975 -266 -565 149 -87 -346 660 1107 -81 -1057 -215 735 582 328 263 -471
2797 -471 -820 217 1210 404 -598 -334 -189 -469 55 1036 478 -1177 -1164 204 726 222 6 -261 -832
2816 -832 -708 437 956 319 -447 -676 -662 -199 856 907 -392 -1104 -524 230 447 379 279 -158 -784 -534
2836 -534 594 1155 358 -789 -744 308 571 196 361 465 -375 -977 234 1307 446 -774 -317 132
2854 132 -185 176 1008 141 -1190 -481 817 351 -402 275 405 -1140 -1014 1192 1201 -957 -1234 247 213
2873 213 -581 301 957 -490 -1427 -100 788 -8 27 406 -592 -1401 351 1535 41 -958 25 356 -694
2892 -694 -108 1447 575 -1242 -703 778 499 -85 395 289 -762 -484 805 575 -218 132 147 -708 -346
2911 -346 1060 625 -828 -482 513 -108 -445 633 522 -857 -708 512 281 -589 198 460 -920 -879
2929 -879 927 760 -1185 -709 1007 48 -1359 212 1481 -516 -1699 429 1272 -437 -755 839
2945 839 172 -1285 147 1503 -63 -1151 413 871 -901 -454 1600 661 -1576 -598 1490 373
2961 373 -976 389 1093 -689 -1182 824 1058 -608 -480 586 -122 -895 374 949 -435 -858 319
2978 319 364 -763 -320 744 90 -1019 -227 613 -65 -553 41 197 -284 -226 46 -13 -101 -21 -150 -271 247
2999 247 377 -384 -421 376 426 -345 -142 427 28 -400 218 537 -125 -261 398 63 -497 337 865 -156
3019 -156 -779 278 705 -381 -488 722 554 -812 -591 644 330 -506 28 389 -369 -536 298 282 -537
3038 -537 -158 408 -356 -761 276 646 -443 -746 253 406 -501 -403 511 127 -651 -203 516 150 -327 93
3058 93 126 -248 -66 366 40 -219 75 224 -72 1 406 231 -312 -107 390 286 -48 -24 -7 -74 65 241
3080 241 -44 -120 93 -117 -448 -25 616 104 -753 -412 469 117 -462 -35 244 -332 -564 105 323 -100
3100 -100 -192 -110 -335 -232 262 250 -395 -445 148 157 -289 19 421 -33 -557 -22 477 212 -220 -61 53 -79
3122 -79 127 436 126 -212 -104 149 -28 108 441 114 -580 -202 567 405 -217 -131 217 -100 -283 130 471
3143 471 -19 -526 -342 88 257 90 -92 -392 -237 68 27 -132 56 -44 -455 -417 201 414 -107 -452 -176
3164 -176 -25 38 239 224 -229 -399 53 199 -38 218 343 -225 -592 184 889 177 -449 -155 299 15 -57
3185 -57 454 363 -312 -346 153 271 184 147 -178 -554 -118 514 187 -359 -103 181 -375 -398 552 502 -615 -792
3207 -792 190 339 -143 -63 224 -355 -712 195 541 -113 -408 -30 -168 -388 254 821 -173 -885 -74 596
3227 596 27 -240 370 145 -600 -299 657 501 -131 -162 -121 -138 284 715 82 -596 -147 475 -17 -160 583
3248 583 342 -762 -637 605 686 -124 -379 77 -242 -236 370 385 -452 -450 -15 -69 -180 361 288 -677 -777 261
3270 261 652 -115 -384 114 -219 -447 259 714 41 -445 -179 -13 -53 359 507 -283 -693 183 681 19
3290 19 -59 379 -17 -679 90 1010 395 -563 -273 272 60 146 490 107 -534 -253 411 273 -77 300 -48
3311 -48 -781 -277 810 528 -589 -611 59 -71 -175 220 309 -380 -736 -96 250 229 110 -72 -693 -371 469
3332 469 532 -193 -335 1 -174 -202 420 596 -164 -522 -112 269 296 360 147 -520 -335 449 503 -25 -3 71
3354 71 -302 -400 540 857 -88 -810 -32 262 27 143 450 -181 -809 -107 603 198 -220 -27 -407 -702 39
3375 39 949 79 -928 -445 266 -79 -197 536 428 -891 -852 424 715 -31 -364 -132 -397 -261 455 630
3395 630 -74 -515 -115 111 -5 437 522 -161 -814 -135 773 553 -164 -245 -64 -54 69 352 525 -96 -547
3416 -547 -281 250 622 251 -335 -525 -199 159 385 338 -114 -577 -468 -14 446 315 -6 -393 -662 -239
3436 -239 586 594 -260 -646 -241 -118 -105 421 623 -229 -1032 -382 642 527 -132 -132 -122 -481 -188 697 666 -281
3458 -281 -510 -38 177 203 617 403 -566 -772 247 915 241 -279 95 44 -537 -106 926 546 -681 -771
3478 -771 192 455 14 -16 82 -414 -648 158 750 75 -489 -277 -123 -262 71 698 112 -948 -583 424
3498 424 522 -207 -43 154 -441 -656 311 941 87 -642 -231 199 19 213 504 107 -508 -337 381 472 120
3519 120 155 61 -389 -250 537 618 -35 -413 9 136 -100 60 443 100 -557 -420 303 427 -50 -256 -144
3540 -144 -61 -166 -16 225 -5 -381 -279 -32 2 31 108 -76 -356 -330 159 290 -204 -361 67 156 -340 -205
3562 -205 450 314 -518 -405 457 434 -157 -205 340 55 -352 19 492 224 -274 -52 203 -69 42 503 260
3583 260 -439 -321 306 275 -137 136 385 -250 -729 115 702 192 -475 -129 65 -251 -213 405 487 -394 -693
3604 -693 -58 190 35 82 107 -471 -622 73 525 95 -314 23 -52 -583 13 930 484 -710 -627 374 518
3625 518 -120 81 419 -219 -667 119 887 336 -399 -260 41 -39 345 650 46 -705 -352 435 394 3 146
3646 146 49 -648 -484 618 881 -88 -814 -462 -50 31 372 410 -234 -856 -591 170 570 383 -124 -714 -658
3667 -658 -2 659 509 -90 -504 -474 -219 327 711 404 -473 -795 -284 517 748 182 -416 -428 -126 207 478
3688 478 695 181 -724 -703 255 924 457 -241 -403 -332 -159 592 720 -47 -726 -408 -28 149 473 492 -374
3709 -374 -1099 -440 813 695 -307 -433 -240 -485 -283 694 773 -381 -1128 -497 390 447 361 76 -619 -816
3729 -816 -52 730 521 -50 -294 -550 -574 352 997 408 -623 -662 1 426 457 422 -7 -600 -549 273 721
3750 721 473 -82 -450 -495 95 637 515 -153 -519 -302 -62 261 418 275 -350 -736 -289 411 521 86
3770 86 -476 -572 -124 350 271 55 -130 -351 -489 -87 594 511 -290 -727 -208 197 339 275 112 -348 -524 -30
3792 -30 386 393 99 -125 -265 -311 263 678 189 -437 -244 204 108 80 265 148 -349 -396 196 493 128 -220
3814 -220 -136 -102 -73 59 190 -53 -227 -147 -58 -12 112 90 -218 -397 -33 297 72 -324 -143 126 -53 -263
3836 -263 16 223 -89 -298 -89 223 59 -54 -116 -57 69 125 74 -85 -44 129 114 -31 -47 256 98 -139
3858 -139 -32 326 225 -131 -209 142 238 58 -86 -96 90 11 27 76 120 -73 -242 -114 154 261 -25 -269
3880 -269 -302 -16 70 78 -12 -91 -168 -307 -95 221 211 -136 -427 -242 93 111 148 -62 -239 -261 21 206 214 74
3904 74 -153 -279 -57 370 412 84 -302 -151 69 277 262 216 -53 -291 -314 211 557 338 -196 -418 -130 180
3926 180 397 167 -48 -334 -324 -32 248 500 131 -493 -569 -5 374 315 -2 -350 -454 -241 185 387 153
3947 153 -261 -442 -274 40 438 410 -244 -597 -255 262 423 276 66 -259 -359 -88 399 612 68 -382
3967 -382 -385 -18 372 488 228 -227 -436 -30 213 389 300 -68 -539 -450 235 588 287 -277 -341 -173 -31 233
3989 233 369 45 -403 -442 -126 318 488 96 -380 -495 -130 297 299 -6 -215 -335 -281 14 389 358 -101 -509
4011 -509 -376 150 442 303 -152 -301 -165 10 161 352 295 -185 -490 -78 293 415 124 -116 -245 -190 155
4032 155 324 178 -12 -197 -123 -32 105 409 139 -390 -299 132 127 -43 22 78 -225 -389 49 334 55 -199
4054 -199 -228 -228 -107 77 175 -22 -280 -179 -37 -59 116 278 -7 -411 -329 268 358 -30 -51 -29 -120 -137 152 442
4078 442 240 -239 -345 -33 273 389 162 -25 -151 -102 93 308 325 66 -171 -334 -172 242 439 69 -407
4099 -407 -442 -49 138 168 110 7 -309 -566 -80 560 423 -206 -533 -292 -39 159 372 187 -319 -606 -180
4120 -180 311 356 234 -131 -504 -411 234 694 243 -346 -340 -162 -44 289 651 283 -571 -698 146 749 429
4141 429 -72 -255 -336 -236 335 694 367 -490 -629 -260 330 588 536 -256 -894 -541 395 675 292 -132 -446
4162 -446 -622 -321 523 808 22 -888 -824 -2 554 479 198 -453 -851 -527 393 878 391 -432 -730 -527 132
4183 132 720 730 -71 -887 -497 280 635 460 216 -411 -798 -265 806 948 102 -739 -634 14 412 622
4203 622 452 -247 -881 -482 471 867 311 -388 -762 -513 145 773 618 -325 -976 -546 172 552 560 120 -685
4224 -685 -1054 -325 860 949 6 -815 -705 -255 319 730 590 -366 -1101 -590 469 882 529 -124 -702 -760
4244 -760 -7 944 843 -199 -750 -450 -20 407 849 594 -532 -1105 -205 829 652 -13 -231 -445 -474
4263 -474 75 879 608 -427 -813 -324 255 453 419 53 -780 -755 58 737 363 -340 -421 -544 -388 360 889
4284 889 250 -912 -818 16 580 374 147 -119 -705 -590 324 970 492 -298 -619 -370 104 651 649 -8 -681
4305 -681 -491 64 448 415 253 -278 -616 -416 428 797 245 -466 -552 -145 144 396 304 17 -369 -490 -23
4326 -23 432 429 -144 -381 -378 -101 228 342 36 -431 -491 1 150 148 187 -38 -447 -327 239 596 83 -381 -196
4349 -196 53 -111 60 428 166 -442 -344 264 437 104 -5 2 -258 -232 231 478 -32 -226 -9 -113 -55 240
4371 240 448 32 -500 -167 356 192 -85 118 86 -257 -328 189 320 33 -209 -208 -204 -81 154 194 -67 -298
4393 -298 -131 -45 -80 70 295 -88 -420 -257 208 190 7 -35 -63 -111 -138 65 230 206 -90 -238 -115 142 297
4416 297 156 -52 -6 -50 -44 193 337 126 -175 -102 26 163 233 147 -107 -299 -60 177 89 0 5 -92 -387 -124
4440 -124 469 340 -264 -414 -57 107 -38 87 145 -175 -413 -153 276 200 77 -165 -285 -323 213 430 76
4461 76 -268 -222 -36 -31 107 416 104 -510 -394 98 354 267 -4 -149 -263 -126 217 352 154 -162 -198 -149
4483 -149 99 383 319 -50 -320 -208 126 262 146 -19 -178 -262 -142 209 317 36 -362 -282 -9 238 97
4504 97 4 -101 -244 -196 67 219 118 -147 -291 -230 19 314 213 -117 -378 -90 156 128 83 157 1 -273
4526 -273 -200 310 382 63 -173 -99 18 36 256 175 35 -118 -98 55 97 273 157 -182 -226 37 253 54 -25
4549 -25 -23 -132 -182 -78 178 125 -61 -178 -202 -75 113 110 -101 -191 -76 -78 -98 85 130 -27 -272 -145 124 50 -14
4574 -14 31 -30 -208 -109 111 176 132 -9 -73 -211 27 309 241 -65 -177 24 54 71 239 309 -60 -359 -36 295
4598 295 303 75 -91 -258 -218 77 314 186 -95 -198 -254 -195 195 426 42 -431 -385 -17 200 142 117 -171 -441
4621 -441 -275 117 364 278 -79 -454 -451 34 447 357 -135 -326 -307 -61 305 443 237 -275 -522 -129 404 589
4643 589 241 -256 -472 -188 319 537 294 -67 -424 -415 -7 665 531 -123 -600 -416 57 431 477 155 -431
4664 -431 -636 -199 331 598 258 -432 -733 -406 307 694 243 -413 -575 -390 117 471 645 2 -766 -681
4684 -681 98 697 672 17 -596 -648 -91 525 682 167 -439 -631 -355 332 872 466 -411 -789 -377 444 750
4705 750 411 -179 -611 -577 71 735 780 -47 -719 -809 -8 751 712 37 -618 -715 -229 518 699 324 -515 -891
4727 -891 -455 393 870 417 -445 -915 -588 284 751 514 -56 -698 -763 -72 805 815 -10 -866 -712 -83 631
4748 631 773 214 -574 -831 -289 498 841 470 -320 -836 -458 458 970 584 -307 -791 -431 243 657 664 74
4769 74 -626 -799 -74 733 821 69 -802 -737 -118 537 687 176 -467 -786 -372 374 773 429 -311 -903 -605
4790 -605 207 860 555 -299 -733 -522 -43 496 664 150 -697 -866 -58 784 752 76 -431 -613 -352 362
4810 362 805 395 -399 -772 -407 255 697 567 -125 -727 -508 275 750 487 -91 -478 -530 -210 475 793
4830 793 201 -661 -687 -116 423 531 160 -383 -680 -331 299 573 285 -180 -537 -495 113 542 451 -181 -618
4851 -618 -412 90 433 300 83 -355 -499 -251 357 607 212 -367 -567 -96 297 397 274 -151 -500 -391
4871 -391 156 523 321 -60 -304 -447 -69 467 523 29 -387 -354 27 81 288 310 -98 -612 -315 359 441 57
4893 57 -216 -213 -237 -80 228 323 -53 -445 -378 -70 161 247 128 -246 -361 -110 314 223 27 -45 -130 -247 19
4916 19 303 327 -138 -429 -152 245 179 139 101 -82 -232 -34 260 335 43 -140 -125 -118 108 284 252 -153 -312
4939 -312 -89 132 76 145 55 -75 -370 -147 308 313 -148 -253 -108 -37 -41 92 184 -103 -391 -150 167 184 71
4962 71 13 -129 -266 -78 276 208 -85 -103 -61 -62 -34 213 232 -148 -314 -31 262 176 10 29 -14 -74 -63 117 266
4987 266 72 -149 -73 20 47 113 102 -95 -210 -32 165 100 50 34 -1 -225 -52 203 221 -166 -277 -81 75
5010 75 -30 -32 102 -1 -327 -121 168 162 7 -132 -54 -70 -25 146 203 -17 -143 -26 9 44 154 180 -17 -236
5034 -236 -40 264 157 -74 43 127 -99 -101 177 319 32 -179 -29 99 31 29 158 13 -138 -63 59 28 9
5057 9 64 -1 -222 -168 77 179 -96 -153 0 -51 -204 -83 84 36 -185 -174 -9 56 -15 -11 9 -19 -137 17 112
5082 112 92 42 -26 -109 -38 76 159 120 -107 -166 -5 210 81 44 -34 -19 -118 62 256 205 -56 -201 -65 80
5106 80 132 131 185 -112 -348 -103 320 204 5 -169 -269 -218 63 318 198 -168 -325 -158 -35 63 250 100
5128 100 -426 -519 60 367 254 -114 -137 -271 -268 144 477 151 -235 -380 -167 194 350 301 -73 -372 -241 263
5150 263 420 236 -8 -237 -297 -78 432 512 73 -472 -407 -52 354 460 198 -256 -487 -191 248 518 239
5171 239 -257 -586 -414 127 562 327 -185 -527 -371 7 375 468 26 -496 -587 -154 414 547 102 -441 -587
5192 -587 -151 372 521 229 -233 -584 -315 258 674 344 -174 -645 -379 199 607 547 -48 -586 -424 -19
5212 -19 528 637 187 -447 -668 -82 602 718 185 -463 -539 -226 283 651 409 -285 -742 -446 213 669 468
5233 468 -228 -743 -560 72 551 533 -1 -593 -668 -68 538 693 123 -571 -754 -130 504 672 292 -402 -590
5254 -590 -305 259 645 438 -272 -666 -459 356 765 522 -158 -554 -512 20 621 630 74 -544 -563 -170 549
5275 549 783 242 -566 -702 -204 457 647 254 -237 -629 -434 163 702 480 -222 -682 -500 83 556 550 -131
5296 -131 -694 -542 -11 444 508 119 -423 -682 -180 480 692 144 -425 -545 -241 275 729 363 -236 -542
5316 -542 -352 169 640 498 5 -627 -431 152 555 454 12 -463 -540 -80 431 622 124 -347 -612 -174
5336 -174 276 604 197 -311 -527 -204 236 440 275 -43 -531 -439 75 482 343 -179 -446 -420 -54 296 393
5357 393 63 -344 -434 -149 193 439 215 -250 -591 -153 274 444 150 -148 -298 -243 49 371 350 -34 -327
5378 -327 -267 -9 371 414 88 -345 -247 -7 224 344 116 -150 -333 -228 160 315 152 -249 -290 -121 42
5399 42 225 212 -67 -253 -226 -1 220 245 -38 -318 -341 -49 229 187 9 -109 -184 -212 111 239 159 -107 -193
5422 -193 -118 51 257 169 -102 -227 -64 83 89 200 74 -51 -153 -74 177 305 13 -114 -95 -123 137 198 77
5445 77 -70 -77 -111 -11 21 78 43 -165 -163 55 143 6 -64 -3 -145 -142 -1 186 109 -146 -118 -60 56 36 60 4 -115
5472 -115 -92 -30 53 78 57 11 -157 -33 131 138 52 -73 2 -4 14 49 142 57 -41 -113 -33 55 107 8 -89 22 -54 5
5500 5 82 127 46 -122 -67 -40 31 26 10 -36 -132 -64 49 29 -53 27 -18 -177 -148 100 174 -50 -196 -33 41 -20 -22 121
5528 121 -36 -164 -55 78 154 -25 38 -105 -133 -32 173 116 4 -107 -74 -56 14 139 160 -68 -167 -66 102
5551 102 150 94 13 -33 -79 -51 100 165 62 -129 -146 -76 61 139 82 -84 -83 -51 33 88 13 -15 -73 -210 -83 172
5577 172 171 22 -246 -132 41 42 -26 115 9 -184 -203 59 214 165 -109 -73 -49 7 175 159 19 -107 -58 -8
5601 -8 82 204 119 -63 -222 -91 234 304 55 -56 -104 -60 2 137 224 2 -319 -285 -28 179 196 81 -171 -260
5625 -260 -176 150 244 68 -81 -255 -242 -48 177 194 -99 -325 -206 90 234 128 83 -78 -327 -185 191 395
5647 395 106 -240 -255 -40 125 245 240 -135 -266 -207 114 279 217 7 -272 -272 100 378 300 -20 -263 -287 -47
5670 -47 215 257 63 -175 -378 -186 296 509 212 -293 -351 -212 136 354 197 -101 -420 -284 54 329 383
5691 383 -39 -393 -450 -26 420 380 -13 -289 -366 -160 130 423 290 -192 -450 -191 288 422 257 -27 -346
5712 -346 -345 68 380 393 -2 -302 -305 -129 389 443 95 -382 -433 -43 332 343 127 -240 -397 -297 189 503 213
5735 213 -162 -424 -271 165 387 310 -138 -429 -379 13 388 372 38 -357 -480 -139 348 512 98 -350 -427
5756 -427 -104 175 386 183 -142 -438 -272 127 536 386 -120 -364 -251 96 353 371 53 -384 -430 36 359
5777 359 441 138 -220 -483 -234 280 439 174 -309 -331 -158 97 299 302 -59 -504 -307 134 433 252 -125
5798 -125 -433 -314 -10 322 343 72 -360 -438 -103 253 382 129 -283 -393 -136 225 401 112 -146 -223 -255
5819 -255 56 394 350 -92 -381 -248 149 402 248 36 -315 -268 -28 312 380 5 -254 -356 -84 193 331
5840 331 241 -211 -415 -185 144 312 141 -118 -310 -285 33 288 291 -47 -343 -233 13 240 237 18 -202 -340
5862 -340 -169 161 203 147 -232 -330 -81 147 210 146 -99 -180 -196 102 218 202 2 -204 -158 9 231 228 -19 -201
5886 -201 -150 0 134 130 75 -90 -214 -87 150 219 63 -147 -160 -64 107 181 88 -137 -113 -116 -15 112 134 40 -218
5911 -218 -185 -13 127 85 -98 -27 -72 -76 38 130 70 -139 -217 -65 88 71 137 3 -104 -6 87 152 33 19 4
5936 4 -15 -18 32 138 51 -66 -61 12 10 -11 24 -35 -58 -20 -1 106 55 40 1 -68 0 61 -20 -39 -49 -71 -30 -19 -13 27 36 -73
5968 -73 -83 -41 -23 21 -11 23 11 -95 -5 27 109 68 7 -123 -9 42 70 16 33 -90 -61 11 24 50 124 33 -58 -37
5996 -37 82 115 23 -26 -12 -83 28 111 151 82 -116 -114 -6 113 75 -8 -109 -137 -50 99 154 114 -89 -183 -102 -2
6022 -2 149 153 -66 -209 -105 73 76 104 48 -125 -185 -67 78 188 59 -112 -187 -23 86 167 80 -27 -101 -91 45
6047 45 203 206 -33 -157 -122 87 216 187 19 -135 -173 30 145 160 99 -92 -176 -150 105 279 118 -171 -220 -123
6071 -123 25 169 150 -96 -170 -249 -15 156 125 -3 -268 -238 -16 194 177 67 -77 -212 -135 61 219 158 -55
6094 -55 -252 -147 70 213 190 10 -167 -185 29 243 237 76 -174 -176 -57 236 288 90 -182 -214 -10 119 230
6117 230 224 3 -204 -130 65 251 212 -57 -266 -126 22 180 185 -113 -198 -222 -65 161 249 146 -204 -332 -164
6140 -164 160 184 125 -78 -279 -201 100 232 127 -51 -237 -322 5 268 269 24 -171 -184 -37 167 219 143 -67
6163 -67 -256 -145 114 273 232 -141 -249 -136 78 299 195 -60 -152 -209 32 220 245 42 -296 -258 -69 243
6185 243 233 41 -145 -207 -172 90 271 194 -100 -329 -263 32 288 156 -68 -260 -188 74 189 210 46 -175
6207 -175 -249 -110 164 320 110 -246 -259 -74 207 229 187 -88 -270 -142 86 303 262 4 -260 -265 -17 272
6229 272 207 40 -286 -221 -49 182 213 97 -158 -301 -211 134 339 144 -240 -314 -141 89 274 204 -50 -289
6251 -289 -309 36 324 197 12 -266 -216 -105 182 248 64 -146 -264 -125 82 249 134 -205 -323 -209 137
6272 137 332 70 -77 -229 -204 10 299 312 18 -249 -208 30 244 324 62 -174 -295 -37 194 258 136 -144
6294 -144 -270 -173 100 337 153 -102 -332 -202 80 269 133 5 -152 -302 -94 202 238 49 -247 -201 -93
6315 -93 171 243 64 -154 -237 -107 151 209 124 -26 -202 -147 54 311 192 -73 -178 -90 89 161 150 59 -134
6338 -134 -172 7 181 156 6 -71 -188 -72 87 211 121 -144 -120 -54 71 166 153 -12 -204 -176 29 150 81
6361 81 -56 -205 -207 1 97 133 28 -159 -197 -117 96 162 63 -138 -130 -47 43 129 134 2 -30 -124 32 132 95 36 -116
6388 -116 -105 94 159 107 -10 -7 -26 -25 19 102 75 -114 -98 9 15 84 95 -18 -87 -98 -21 66 8 -61 -24 -70 -71 -2 19
6417 19 -21 -94 -73 57 -5 -49 -29 56 -8 -55 -25 55 7 -52 -38 17 15 18 49 -55 80 8 8 45 96 -53 14 3 5 51
6447 51 25 -39 -38 16 63 0 -86 57 -24 -4 -46 45 -39 -9 -22 -9 19 -31 -81 -45 45 39 -59 5 0 -56 -39 -2 -10 -39 -71 -106
6479 -106 -46 111 83 -33 -83 -43 16 30 0 45 29 -123 -56 14 70 117 -11 -99 -35 48 109 76 5 -65 -51 8 104 120
6507 120 109 -86 -115 -42 54 167 111 -120 -101 -43 35 94 39 27 -85 -85 -2 134 91 8 -145 -163 -81 106 32 -7 -68
6534 -68 -190 -118 64 127 114 -101 -199 -106 76 101 53 -76 -180 -102 25 172 239 -13 -187 -160 -1 136 190 88
6558 88 -119 -130 -39 116 121 23 -89 -158 -122 73 143 117 -58 -239 -112 98 188 120 -44 -130 -159 -28 125 160 -27
6583 -27 -168 -188 -68 168 164 82 -150 -176 -89 90 173 67 -116 -205 -152 2 196 79 -114 -139 -145 66 193 130 49
6608 49 -164 -178 -20 216 245 30 -90 -131 -70 126 232 79 -92 -155 -118 61 242 161 -64 -262 -216 -26 173
6631 173 177 -114 -132 -176 -8 148 248 36 -165 -249 -85 192 218 81 -162 -271 -141 73 227 93 -57 -186
6653 -186 -184 -16 240 226 -11 -239 -177 -11 164 207 53 -152 -221 -75 184 249 118 -145 -295 -88 195 220 139
6676 139 -86 -198 -189 77 227 215 -18 -178 -224 35 162 142 16 -191 -227 22 156 200 31 -115 -208 -187 92
6699 92 232 101 -120 -262 -116 101 197 124 -44 -176 -171 44 193 192 -30 -196 -261 -51 163 267 11 -146 -183
6722 -183 -37 161 207 169 -28 -280 -133 127 199 197 -25 -219 -138 11 213 202 11 -161 -173 -32 151 195 34
6745 34 -194 -239 -74 183 181 62 -116 -226 -131 89 163 125 -118 -244 -157 57 211 139 -93 -229 -206 -38 133
6768 133 193 62 -143 -189 -58 190 182 39 -152 -120 -93 98 189 104 -103 -227 -115 41 218 167 -58 -198 -123
6791 -123 99 174 120 28 -106 -176 8 127 158 -2 -182 -217 -115 127 216 96 -131 -207 -51 41 125 153 -66 -203
6815 -203 -98 -72 182 105 -48 -132 -67 -9 127 169 15 -127 -113 -63 116 156 60 -104 -69 -40 108 138 101 -58 -103
6840 -103 -62 34 121 107 -44 -111 -6 -30 154 145 23 -138 -61 -26 21 71 31 -116 -123 -50 43 55 58 -41 -92 -78 -46 91
6868 91 12 -2 -80 -100 -45 19 151 -17 -139 -72 18 89 65 -4 -24 -43 -11 65 129 41 -64 -69 45 85 55 82 -43 -41
6896 -41 -36 51 33 41 37 -14 -52 64 46 43 -10 -60 31 -7 38 55 -2 -46 -18 -15 -9 35 -15 -35 -106 7 11 -30 19 43 -31 -35 -18
6929 -18 10 37 40 -15 -63 -54 -6 40 -32 -8 53 39 -100 -23 38 36 76 17 39 76 9 0 78 10 23 45 45 -43 45 89 11 46
6961 46 43 34 14 64 65 -13 -35 -87 13 91 48 -7 -20 -60 -9 27 33 -26 -22 -75 -88 15 5 -16 -102 -107 -79 53 13 21 -35 -73
6993 -73 -62 17 70 40 -11 -73 -53 24 63 38 14 -39 12 24 71 49 -10 -50 -65 29 141 89 54 -61 -76 -58 106 177 47
7022 47 -46 -64 -53 -15 19 75 -12 -120 -112 49 83 8 -27 -98 -86 -30 44 122 57 -108 -116 -149 67 107 77 -116 -225 -116
7050 -116 30 36 111 25 -154 -173 -73 119 76 57 -153 -64 -33 73 144 11 -22 -134 -27 25 144 106 -62 -217
7074 -217 -117 122 113 32 -36 -167 -93 -70 131 102 5 -169 -161 -49 171 120 -19 -142 -121 -42 76 125 82 -97 -166
7099 -166 -122 57 168 70 -113 -184 -115 54 208 85 -19 -145 -115 -45 134 108 20 -123 -179 -43 105 178 66
7122 66 -95 -174 -141 124 191 149 -39 -160 -115 115 194 150 16 -141 -161 33 117 119 45 -80 -172 -37 125 251 38
7147 38 -174 -220 -53 84 136 42 -88 -239 -109 78 141 72 -61 -218 -147 -38 161 156 -11 -190 -191 -16 106 213
7171 213 52 -63 -198 -36 161 209 92 -120 -94 43 42 134 128 -49 -201 -131 68 214 183 4 -170 -185 24
7194 24 163 129 -28 -213 -162 -42 62 137 80 -133 -189 -112 56 194 49 -95 -184 -121 4 123 8 -26 -123 -202
7218 -202 12 172 129 -25 -124 -161 -9 136 135 96 -100 -154 -80 72 190 82 -110 -104 -80 99 159 109 -31 -119 -163
7243 -163 64 112 101 -51 -149 -69 -7 155 121 -66 -112 -129 -19 45 122 48 -105 -157 -44 92 102 56 -103 -207 -133
7268 -133 90 134 31 0 -103 -129 -16 104 158 -14 -114 -132 11 81 160 -15 -125 -82 -29 62 167 92 -63 -125
7292 -125 -30 52 192 90 -67 -117 -40 72 62 83 -40 -128 -60 -15 72 121 32 -69 -95 -35 18 83 -22 -73 -19 -96
7318 -96 -8 40 20 -105 -84 -72 64 74 52 -37 -106 -86 -51 1 95 53 -1 -96 84 69 111 6 -9 -65 18 25 54 92 -64
7347 -64 -64 -60 79 33 41 -37 -73 -21 18 25 16 -4 -26 7 -65 40 -66 -11 -46 -44 -7 16 21 -56 -19 -37 17 -10 53 58 -9 -20 -32
7380 -32 1 -6 -28 -4 0 57 -23 -16 30 -18 -86 -32 -39 35 13 -82 -3 -41 4 55 -37 -8 35 2 39 33 -17 1 13 -36 31 -4 -11
7413 -11 -36 -21 25 108 12 -55 -3 13 43 20 58 19 -95 -107 36 74 -54 -125 -94 -74 12 45 -1 11 -39 -12 -55 34 83
7442 83 -14 -4 -47 -25 63 -34 13 -31 -105 27 -1 0 82 -73 -81 -2 -15 -8 61 -28 -84 -10 1 65 86 0 -20 -6 -48 18 35
7473 35 46 -87 -37 -48 34 118 -5 -47 -72 -14 -3 84 16 -45 -171 -85 3 108 56 -7 -77 -18 11 24 97 -45 -30 -91
7501 -91 -34 41 142 37 -105 -118 -38 71 91 81 -5 -82 -81 9 100 156 9 -100 -101 41 96 104 -1 -88 -100 -44 77
7528 77 127 43 -48 -92 -49 38 69 -52 -113 -101 -77 2 69 116 26 -47 -81 31 38 109 -37 -103 -67 27 59 66 9 9 -51 -79
7558 -79 67 109 96 -13 -100 -51 23 81 71 -52 -71 -53 14 22 159 51 -122 -89 39 128 169 -11 -45 -80 -14 45 98
7585 98 52 -95 -112 4 122 47 103 -32 -124 -111 21 50 58 -23 -82 -66 -64 74 74 6 -92 -123 -62 80 55 34 -29 -94
7613 -94 -26 12 31 60 -16 -100 -72 41 129 36 -14 -84 -80 -26 4 99 23 -41 -53 -35 23 142 38 -50 -95 -60 75 135 85
7642 85 -36 -69 -63 -23 87 85 -24 -80 -99 2 111 76 19 -169 -113 -1 16 106 60 -19 -92 -49 19 118 17 -68 -85
7669 -85 -117 101 91 83 23 -22 -102 16 153 71 -11 -121 -117 -8 114 100 -25 -47 -166 -98 6 172 92 -47 -140 -39
7695 -39 -15 84 93 -28 -78 -72 0 28 34 16 -69 -114 -7 70 45 40 -70 -161 -74 82 115 29 -21 -81 -63 49 46 70 -59 -144
7725 -144 -54 45 36 59 -23 -34 -45 16 92 125 23 -107 -63 24 50 139 41 -32 -23 -3 21 26 50 9 -24 -68 61 80 62 -38
7755 -38 -97 -72 -6 88 54 89 -127 -80 -18 -11 39 7 -2 -70 6 91 -5 1 -36 -93 -36 7 56 34 -51 -114 -14 44 83 17 -47
7786 -47 -64 15 61 64 68 15 -26 -52 -60 77 110 -10 -29 8 36 51 19 -17 -1 -22 -12 -6 56 28 36 -70 -56 31 14 23 6 18
7818 18 -56 -36 33 24 -20 -47 -36 -54 23 -34 -40 -59 69 -25 11 38 10 -35 3 -31 8 -5 17 -2 -22 -18 66 74 -14 41 28 25
7850 25 128 60 30 -42 -18 15 7 37 21 20 19 54 86 49 39 -30 7 8 33 47 -4 -8 -24 -40 -30 61 -31 -50 -5 40 -15 -41
7882 -41 21 22 -39 -14 24 35 -57 -12 -74 64 19 -31 -25 -8 -29 3 29 48 19 -89 -23 16 57 97 4 -14 -40 29 95 41
7912 41 47 13 -47 -55 -1 148 72 -55 -29 -50 36 72 79 -8 -107 -70 -2 -5 30 47 -27 -62 -3 57 30 -14 -142 -147 -25 42 20
7943 20 15 -30 -62 -71 -32 21 131 -47 -126 -85 9 52 91 -27 -80 -80 -45 75 121 33 -84 -73 -31 100 152 23 -30 -45
7971 -45 -11 -35 100 104 -12 -83 -50 28 63 105 -33 -126 -66 -7 102 77 10 -78 -121 -39 25 52 5 -51 -126 -21 69 52
7999 52 56 -47 -112 -77 50 89 89 -35 -96 -58 75 152 100 -2 -95 -103 38 71 52 51 -43 -71 -50 69 153 40 -19 -94
8027 -94 -21 148 120 94 -93 -83 -61 38 42 -3 -42 -128 -55 -5 93 102 -9 -116 -91 -41 93 2 -57 -97 -184 -24 72 65 -4
8056 -4 -44 -78 -43 20 51 90 -37 -81 -108 72 149 102 -10 -70 -65 -6 44 116 -35 7 -29 -22 36 83 56 2 -51 -36 9 106
8086 106 44 -38 -17 -61 54 64 107 46 -95 -54 55 82 39 -49 -70 -32 -72 63 42 60 -15 -137 -43 5 101 48 -48
8113 -48 -120 -56 -1 25 45 22 -145 -6 20 9 52 42 -56 -94 57 73 -42 12 -68 -49 28 65 95 65 14 -27 4 -20
8141 -20 36 92 -12 3 -57 5 58 114 37 -49 -89 -48 63 91 81 -34 -111 -62 90 58 -27 -47 -33 -9 25 7 14 -34 -63
8170 -63 -33 -50 55 38 -47 -44 -10 28 26 63 54 -39 -107 2 -38 104 100 -9 29 -62 28
8191B8
$$ Imaginary data points
##PAGE= N=2
##DATA TABLE= (X++(I..I)), XYDATA
0 0 0 0 0 0 0 0 0 0 0 0 0 0 6 0 4 -8 8 -8 8 -8 12 -14 14 -16 20 -21 22 -28 28 -34 36 -42 44 -50 57 -61 68 -74
38 -74 83 -91 101 -111 123 -137 151 -171 190 -216 244 -278 324 -380 455 -559 705 -932 1310 -2018
58 -2018 3620 -8695 54606 304280 90240 -151670 -8968 57191 -129276 -83032 187506
69 187506 134594 -146660 -128246 65571 39990 -22582 89931 81735 -127075 -142124 64485
80 64485 102163 -14540 3597 45893 -64668 -94582 64680 103003 -45747 -71059 35751
91 35751 19461 -41718 35592 73089 -59273 -106554 31043 85366 -5664 -23405 18299 -34091
103 -34091 -63987 43365 93176 -15955 -79037 -22116 3754 2819 63793 68168 -53849 -109930
115 -109930 -21722 38299 36697 73416 52239 -94763 -131752 36709 118171 5774 -36288
126 -36288 26746 -31995 -112843 25018 172282 47819 -115972 -55953 21329 -34095 -4943
137 -4943 118264 55025 -120587 -82691 73187 53012 -30040 22423 40257 -78855 -86073 70638
149 70638 99630 -31683 -58492 16558 -2540 -42869 31692 73391 -24213 -76917 1203 41036
161 41036 -3005 -3720 19726 -23803 -48535 19051 56895 2163 -31051 -10779 -16732 -20348 34501
174 34501 56148 -13600 -56693 -13266 19869 12115 22821 21548 -32955 -53419 6789 46461
186 46461 22799 8349 -307 -46117 -52186 27050 66579 8421 -27016 -3466 -14383 -30723
198 -30723 31216 69389 -12912 -74029 -12046 31980 -6617 4804 58250 4412 -84077 -31273
210 -31273 62498 24647 -36632 6217 25659 -43539 -39603 54005 48912 -44068 -40036 27146 7771
223 7771 -29484 19733 43771 -27625 -52322 16815 35857 -14343 -11074 24597 -4144 -34198
235 -34198 10821 38009 -10184 -32113 6497 13638 -11769 5048 27637 -6173 -32246 503
247 503 20723 -1752 -3324 14196 -4727 -24107 6573 29086 -430 -19036 -558 82 -13186
260 -13186 7986 27787 -137 -22703 -2621 5110 -11693 985 22948 -3066 -29257 461
272 461 23123 -5155 -13885 15583 6992 -29025 -10033 28636 6441 -24057 3194 20560 -14848
285 -14848 -20559 21209 18468 -23178 -11772 24088 2157 -26345 5416 26764 -10019 -21839
297 -21839 16644 16837 -22219 -11504 26354 8447 -24464 -2422 20535 -5408 -16117 14531
309 14531 15901 -17014 -13305 14798 5557 -12588 5689 15075 -13030 -18964 12304 16306 -10597
322 -10597 -9410 9275 -1747 -14881 5929 18448 -5016 -16990 691 5468 -5081 3352 12889
335 12889 -5910 -19070 704 14369 1010 -4029 4957 -3352 -15195 1760 20120 4850 -13669
348 -13669 -5526 2718 -3061 3395 16630 4275 -17703 -11704 7420 8715 4314 6583 -2179 -16949
362 -16949 -7168 15820 14324 -3705 -7366 -4144 -8498 -2304 17050 16428 -8207 -19657 -6833 4691
376 4691 7645 10320 3696 -13753 -16683 2304 15106 8421 -1238 -7267 -14434 -10878 10142 22871
390 22871 7527 -13983 -16645 -6188 4521 13276 12665 -3227 -17715 -11511 6555 15814 11358
403 11358 -1222 -15165 -17332 -237 19290 19047 1659 -13551 -16366 -6620 10511 20715 10011
416 10011 -11878 -19662 -6439 11606 18457 10071 -7725 -20764 -15207 5619 21458 17682 -966
429 -966 -19067 -20990 -3536 17933 20857 1656 -18162 -18899 -2806 14222 18945 7068 -13348
442 -13348 -24198 -13143 10820 25145 16024 -7980 -24595 -17893 5729 22582 16468 -4844 -19888
455 -19888 -16181 1725 19346 21612 3361 -20494 -25452 -4732 20851 26391 8596 -15132 -24539
468 -24539 -11206 13589 26249 13617 -11151 -23991 -14470 8353 25440 20130 -5612 -27316
480 -27316 -21366 4746 24010 21247 2134 -19447 -26569 -7796 21420 28116 4103 -21827 -24261
493 -24261 -7145 13840 25442 15244 -13361 -31891 -17763 12358 26709 17356 -4120 -24375
505 -24375 -25466 929 29183 24759 -5689 -25048 -18680 -842 16985 25846 11042 -20016 -31324
518 -31324 -7465 22121 26774 9671 -12505 -25998 -16421 13811 32387 15860 -14752 -26041
530 -26041 -14523 6036 24580 25565 -511 -30050 -27269 4440 27645 22467 790 -20165 -26336
543 -26336 -8546 20725 30123 7661 -21877 -29017 -9794 16792 28330 14341 -13761 -30830
555 -30830 -20490 8673 30346 23227 -6528 -29021 -22728 2756 23239 24143 4189 -23292 -30165
568 -30165 -4303 26227 26973 4025 -15063 -21781 -15213 8683 31435 19729 -15964 -28694 -7677
581 -7677 13135 17859 14494 -735 -24292 -23602 9389 30706 15128 -7825 -15582 -17578 -9025 18769
595 18769 32225 2941 -29716 -20469 6658 14548 13096 11040 -9718 -32698 -15317 24841 30135
608 30135 1610 -15609 -16519 -16358 -833 28213 27231 -11295 -33149 -13960 9872 16006 16664 7279
622 7279 -19244 -31610 -5066 27215 26004 2771 -14565 -20373 -13227 8464 25135 15651 -8512
635 -8512 -20731 -13384 5355 21200 17118 -5214 -19834 -12271 2750 12396 16014 6943 -14105
648 -14105 -21176 -1125 17424 12201 -394 -6230 -11999 -10439 9110 21683 3407 -17942 -11723
661 -11723 2229 3219 6983 13562 -2080 -23943 -12112 16379 16093 -2176 -5073 -5102 -14548 -5449
675 -5449 21930 20106 -11917 -21030 -2103 3851 976 14591 16703 -14673 -30231 674 24902
688 24902 8624 -5554 2292 -3697 -20017 -3327 27589 17820 -15539 -17386 1362 2101 -917
701 -917 12716 14263 -10539 -21704 -688 15302 6473 -1924 381 -4138 -11257 -1420 13607 8685
715 8685 -7068 -8498 304 1251 -1541 2951 5682 -3012 -9243 -832 7832 1747 -6383 -1792 3914
730 3914 -917 -3525 3609 3876 -6454 -6181 6585 7414 -4171 -4714 3007 -933 -5598 5914 11959
745 11959 -4432 -14083 1348 10401 -1789 -4064 9111 4091 -14356 -7851 13180 9324 -7032
758 -7032 -2641 6036 -4741 -10025 6794 13305 -3534 -9656 2675 3088 -7249 -881 11192 2818
772 2818 -9996 -3776 4410 -1696 -3976 5568 6540 -4731 -8143 -1173 1830 1260 3563 3155 -3085
787 -3085 -6398 -3656 1050 6139 7077 -1045 -8548 -4302 2345 1590 3139 8487 1141 -13098 -8524
802 -8524 8612 9576 -548 -21 1010 -9123 -8252 10269 13707 -4154 -8824 2473 -55 -7744
816 -7744 4880 15350 -2489 -16549 -706 11124 -1082 -4841 7097 1781 -13514 -3318 14571
829 14571 3546 -12295 -1504 7718 -5235 -6918 11114 7535 -15779 -11221 13558 10849 -8505
842 -8505 -4528 6077 -5287 -11281 8761 17506 -3782 -15840 -2119 5694 19 4157 10908 -2557
856 -2557 -17765 -7177 11680 11837 2190 -2402 -6839 -10495 -1554 12627 12440 -900 -10173 -9443 -2313
871 -2313 7185 11795 5145 -6349 -11520 -6998 3593 12708 9274 -5114 -13160 -6327 3119 6303
885 6303 6870 3456 -7551 -13375 -2536 10571 8712 -894 -5679 -7500 -5678 4986 12842 3316
899 3316 -10185 -8019 944 2116 3499 8531 1840 -13323 -10669 8583 13862 1068 -5900 -4088
913 -4088 -5916 -3828 10296 15510 -1543 -15526 -7431 4654 5548 6146 7513 -3577 -16618 -7540
927 -7540 13224 15144 -15 -7854 -6879 -6753 -1178 12738 14432 -3872 -17360 -9069 4848 8379
941 8379 6845 3381 -7022 -14959 -5232 11718 13214 411 -8534 -9455 -6094 3527 13974 9324
955 9324 -7945 -14793 -4519 5604 7454 7345 2659 -9677 -14250 270 15248 10662 -3532 -9510
969 -9510 -8121 -3063 7582 14735 5435 -10544 -12813 -2347 6062 9557 8656 -1723 -14147 -10358
983 -10358 6803 14560 6152 -4206 -9294 -9701 -1275 11773 13011 -770 -11917 -10239 -2364 6688
997 6688 12586 5858 -10086 -14887 -2400 8788 8669 4453 -2441 -12425 -11816 5088 16579 6975
1011 6975 -7282 -9760 -6175 -1164 9059 13601 446 -14616 -10613 3175 9026 8835 5123 -6978
1025 -6978 -16554 -5770 13514 14975 1482 -6927 -8593 -8077 1415 15281 12687 -5744 -14651 -6828
1039 -6828 3047 8906 11698 3213 -13073 -15143 1426 12972 8449 717 -4712 -11162 -9178 6687
1053 6687 16665 5329 -10677 -12028 -3794 3864 9882 9332 -2830 -14097 -9490 3935 10737 8293
1067 8293 231 -9892 -12226 -546 11946 10102 -987 -8041 -8901 -3794 7095 13590 4870 -9445
1081 -9445 -11952 -2812 6296 10448 7853 -3364 -13130 -8038 6207 12144 6241 -1964 -8274 -9707
1095 -9707 -1137 11355 12343 -249 -10716 -9649 -1442 7310 10667 3937 -7557 -10905 -3566 5142
1109 5142 8868 6148 -3476 -12250 -7999 5759 11682 4640 -4130 -7644 -7398 -1357 8810 10816 -307
1124 -307 -10649 -8350 433 6486 7857 3168 -6310 -10464 -2641 7627 8898 2563 -4024 -7799 -5586
1139 -5586 3477 10342 6214 -3577 -8014 -4770 1903 7539 7078 -973 -8014 -5876 1579 6087 6082 2109
1155 2109 -5084 -8916 -2586 7144 7959 490 -4931 -5106 -2852 1750 6481 4709 -3225 -7672 -3855
1170 -3855 2785 5854 4048 -1529 -6255 -5106 1029 5123 4163 311 -3864 -5663 -1820 4821 5865
1185 5865 241 -4460 -3892 -1052 2112 4779 3617 -2229 -5577 -2001 2970 3631 2195 340 -2856
1200 -2856 -4254 151 5430 3625 -1909 -3041 -559 270 506 2653 2458 -1969 -4188 -612 2914 1904
1216 1904 -195 -742 -1300 -1528 594 2325 401 -1892 -987 50 -616 -6 1833 450 -2755 -1617
1232 -1617 1927 1278 -1565 -584 1338 -502 -1915 703 2020 -976 -1987 1233 1728 -1173 -1015 1693
1248 1693 865 -1256 279 1714 -774 -1840 1237 2502 -266 -1226 675 573 -915 733 2488 50
1264 50 -2742 -1533 991 1985 1765 212 -2395 -2466 584 2110 1047 755 -189 -3683 -3893 2175 5578
1281 5578 1038 -3522 -2625 -1417 -913 2853 4974 -617 -6092 -2994 1846 1719 2173 3582 -1681 -8018
1297 -8018 -2677 6889 5224 -1703 -1732 -746 -4159 -1644 7319 6369 -4448 -6533 617 2250 344 4173
1313 4173 4377 -5361 -8454 2354 8011 890 -2681 462 -2217 -5604 2832 10401 1401 -9165 -4453
1328 -4453 3300 1532 613 4396 435 -8647 -5702 5928 8003 651 -3612 -4244 -4925 -478 7318
1343 7318 6556 -2946 -7741 -4048 1022 4435 6187 2351 -5949 -8749 -2216 6049 8337 3210 -5160
1358 -5160 -8563 -2982 4629 6628 4192 -221 -6512 -8199 734 10214 7034 -2687 -5994 -4274 -2322
1373 -2322 3904 9849 3496 -8241 -7800 1504 4113 2983 4829 413 -10394 -8194 7068 10345
1387 10345 -1040 -4955 -711 -3276 -4789 6230 11292 -2955 -13059 -3245 5878 2434 1533 4404
1401 4404 -3318 -11351 -1530 11226 5785 -4514 -3704 -2531 -5587 1275 12550 6316 -9591 -9953
1415 -9953 1313 4902 3788 5271 737 -9608 -8441 4074 9661 5027 -98 -5303 -9297 -2640
1429 -2640 9796 9932 -1057 -6393 -5053 -3858 1537 10269 7398 -6279 -10504 -2593 2866 4575
1443 4575 7101 2143 -10061 -9728 3633 8239 1427 -145 -185 -7817 -7887 7307 12697 -1917 -9628
1458 -9628 -1298 1020 -3340 3732 10204 -2730 -13823 -1769 10035 2910 -2159 3233 -1498 -11211
1472 -11211 -1212 14171 5695 -9744 -4894 3761 -1938 -1410 10778 6906 -11972 -11493 6042 8702
1486 8702 8 1230 2138 -8450 -9152 7454 12893 -294 -6935 -2456 -3448 -3883 7282 11892 -2257
1501 -2257 -12322 -4523 3366 2656 4327 5304 -4380 -11444 -2608 7227 5315 1179 -529 -6077 -7925
1516 -7925 2302 9995 3112 -4591 -3178 -2674 -3242 4498 9943 -87 -9834 -3713 3648 1339 2006
1531 2006 6201 -1224 -10570 -2328 9690 4485 -3953 -251 319 -6813 -1746 11339 6344 -8730
1545 -8730 -6416 4030 1254 -1919 6194 4950 -9844 -9574 6859 8897 -2437 -1988 2693 -5691
1559 -5691 -8724 6630 12756 -2834 -10659 -489 2389 -3551 2572 10255 -1190 -13140 -3673 8061
1573 8061 3495 -1141 2457 -1275 -9059 -2327 9746 6031 -4030 -3504 -934 -3397 363 8636 4813
1588 4813 -6219 -6281 1026 2217 1892 4621 1246 -6645 -4764 3933 4854 811 679 -753 -5581 -2632
1604 -2632 6254 5505 -2774 -3860 -256 -987 -376 4813 3396 -4980 -5333 1472 2532 275 2205 986
1620 986 -5929 -4775 4818 5572 -2067 -2478 835 -2939 -3974 4959 7434 -3223 -7455 559 3188
1635 3188 -1248 1428 5222 -2133 -8043 -199 6858 1735 -1855 1209 -1112 -5429 628 7724 2192
1650 2192 -4848 -1564 1459 -1676 153 5597 1785 -5569 -2899 2902 1420 -159 2672 -38 -5475
1665 -5475 -1682 5019 1815 -3247 144 1720 -3648 -2601 5051 3303 -4613 -3097 2851 318 -2412
1680 -2412 2303 2776 -3969 -3444 3687 2454 -3029 -96 3017 -2539 -3905 3894 4426 -3774 -3196 3815
1696 3815 1077 -4283 1337 5564 -2301 -5500 2962 4732 -3025 -2210 4663 857 -5425 622 6083
1711 6083 -1266 -4948 2888 4153 -4122 -2691 5405 1678 -5867 -651 5648 -696 -5064 1615 3847
1726 3847 -2848 -2526 3553 847 -4367 98 4211 -1354 -3632 2305 2159 -3973 -1320 5141 914
1741 914 -5314 -757 3924 -782 -2507 2914 2157 -4347 -2199 4348 1847 -2814 381 2235 -2709
1756 -2709 -2347 4571 3847 -3274 -2798 2293 678 -1628 2448 3380 -2957 -4115 2075 3337 -393 96
1772 96 1260 -2593 -3401 2738 4407 -1176 -2683 468 -803 -2442 2704 5012 -1986 -5990 -322 3239
1788 3239 105 -88 2354 -1268 -5456 -626 5028 2182 -1960 -1257 -1385 -2759 1281 5555 1473 -4696
1804 -4696 -2831 1266 922 1180 3413 444 -5139 -3083 3371 4079 959 -107 -1641 -3943 -596 5439
1820 5439 4068 -2140 -3273 -731 -691 632 4883 3381 -4214 -5889 458 3960 2105 948 -249
1835 -249 -3926 -4106 1983 5517 1742 -2451 -3122 -2786 -571 4050 4697 -1166 -5304 -2669 869 1994
1851 1994 3111 2263 -3160 -6206 -1106 4808 4073 202 -1995 -3601 -3091 2001 6057 2615 -3254 -3809
1867 -3809 -1402 639 3527 5098 340 -5924 -4367 2354 4973 2714 137 -2590 -4565 -1506 4474
1882 4474 5295 474 -3523 -3821 -2112 1903 5640 3334 -3646 -5862 -1477 2600 3317 2864 21 -4779
1898 -4779 -5327 815 5699 3533 -1338 -3881 -3884 -1283 3441 5217 866 -4426 -4570 -1045 2517 4345
1914 4345 2790 -2442 -5695 -2561 3077 4903 2444 -1341 -4062 -3549 1085 5254 3967 -931 -3990
1929 -3990 -3653 -336 4127 5398 716 -4697 -4404 222 3504 3796 2053 -2083 -5409 -2907 3231 5508
1945 5508 1894 -2352 -4212 -3200 908 5047 3931 -1796 -5069 -2978 380 2781 4008 1456 -4195
1960 -4195 -5933 -548 4727 3742 -108 -2470 -3548 -2756 1688 5442 2685 -3195 -4635 -1593 1501
1975 1501 3420 3595 12 -4843 -4152 1887 5095 2471 -871 -2282 -2957 -1536 3085 5699 1470 -4460
1991 -4460 -4423 68 3093 3307 2002 -1322 -4522 -3200 2200 4976 2227 -1845 -3596 -2897 -33 3785
2007 3785 4065 -566 -4749 -3389 604 2543 2482 1228 -1976 -4679 -2251 3199 4379 405 -3048 -2836
2023 -2836 -1297 811 3163 2821 -1159 -4093 -2306 1385 3111 2390 67 -2855 -3387 252 3879 2968
2039 2968 -562 -2422 -1963 -467 1605 3319 1937 -2055 -3950 -1461 2706 3812 1241 -1988 -2834
2054 -2834 -1381 863 2613 2795 106 -3565 -3490 705 3598 2120 -579 -1952 -2639 -1671 1919 3739
2070 3739 703 -3071 -2557 -340 432 1610 2627 -415 -4340 -2406 2691 2851 -412 -668 -101 -2268
2086 -2268 -1950 2722 4133 -859 -3685 -684 1272 450 1287 2150 -1036 -3393 -182 2969 1194 -398
2102 -398 497 -678 -2687 208 4225 1782 -2964 -2061 1046 541 -239 1755 1376 -2439 -2912 841 2593
2119 2593 741 -522 -862 -1700 -1180 1437 2143 -7 -1546 -1267 -727 126 1647 1341 -978 -1872 -819
2136 -819 301 1059 1542 29 -2070 -1183 970 885 100 946 350 -2175 -1367 2462 2250 -1293 -1215 1245
2154 1245 77 -1671 1001 2783 -595 -2515 623 1983 -684 -629 1741 82 -2382 270 2671
2169 2671 -309 -2312 809 1716 -1655 -1230 2244 1015 -2798 -1046 2411 419 -2088 119 1466
2184 1466 -1246 -1545 1663 1301 -1945 -1091 1537 56 -1633 616 1853 -914 -1944 819 1664 -548
2200 -548 -860 701 402 -624 107 789 155 -309 203 234 192 551 61 -589 321 1022 -88 -607 475
2219 475 415 -867 73 1575 159 -1593 -124 1017 -333 -448 1370 300 -2447 -880 2204 873
2235 873 -1578 -113 917 -1625 -1655 2204 2092 -1840 -1964 764 156 -1013 1450 2019 -1952 -2770 1259
2252 1259 1975 -977 -88 2095 -896 -3337 729 3976 293 -2557 64 1070 -1248 16 2953
2267 2953 698 -2750 -866 1762 414 46 1507 38 -2831 -676 2918 1226 -1633 -200 540
2282 540 -1648 -602 2796 1465 -2568 -1803 909 227 -136 1873 522 -3260 -1943 2362 1734 -1188
2298 -1188 -56 680 -2497 -2179 3065 3420 -1857 -2951 397 314 -841 1826 2766 -1773 -3685 396
2314 396 2400 433 630 1575 -1852 -3729 1301 4548 535 -2323 44 350 -2003 425 4275 1199
2330 1199 -3660 -2058 1634 1014 287 1836 162 -3443 -1666 2739 2070 -918 -473 -1 -2147 -1237
2346 -1237 3042 2798 -2045 -3202 -79 955 256 1226 1077 -1983 -2737 293 2155 1097 108 -796 -2247
2363 -2247 -1417 2008 2829 44 -1732 -1072 -663 141 2198 2394 -921 -2683 -992 1082 1733 1834 468
2380 468 -2141 -2305 749 2482 1317 124 -586 -1885 -1553 1686 3316 620 -2150 -1835 -415 541
2396 541 1744 1786 -901 -2701 -1142 905 1298 1366 559 -2080 -3041 296 3055 1334 -1203 -1215 -896 -1168
2414 -1168 577 2769 1139 -2214 -2330 -206 1054 1545 1460 -503 -2652 -1335 1672 2050 656 -161
2430 -161 -1016 -1824 -311 2498 2450 -435 -1889 -1183 -121 1275 2291 788 -1850 -1887 86 1066 1260
2447 1260 1320 -235 -2605 -1805 1590 2591 289 -1173 -1147 -1224 -466 1646 2195 -403 -2305 -1597 73
2464 73 1213 1716 498 -1832 -2251 -129 1510 1107 464 -419 -1992 -1771 953 2576 965 -1195 -1478
2481 -1478 -853 191 1777 1894 -276 -1876 -920 535 1049 1440 1162 -1057 -2409 -324 2233 1719 -106
2498 -106 -894 -902 -809 551 1842 1085 -776 -1472 -927 184 1469 1654 -493 -2250 -1058 874 1049 498
2516 498 424 -834 -2084 -819 1692 1647 -366 -1260 -972 -740 412 1711 987 -1310 -1775 -299 580 839
2534 839 1156 261 -1706 -1563 756 1777 712 -330 -557 -852 -384 1177 1717 187 -1046 -790 -225
2551 -225 516 1565 970 -1047 -1546 56 1186 592 287 294 -768 -1478 11 1663 1070 -664 -1077 -646
2569 -646 -62 738 1042 -131 -1203 -912 -102 276 763 556 -731 -1525 -575 849 762 114 -445 -805 -738
2588 -738 327 1151 467 -423 -484 -380 -214 717 1294 112 -1143 -559 704 666 263 469 34 -832 -421
2607 -421 931 1018 -30 -415 -229 -309 235 901 395 -632 -611 215 138 -30 643 457 -848 -1089 418 1040
2627 1040 -145 -640 -178 -170 -448 70 587 -28 -633 -341 -36 -88 170 318 -353 -832 -88 661 208 -267
2647 -267 -50 29 -146 -95 408 353 0 -186 -135 159 454 374 -193 -295 247 363 12 -81 244 145 -170 -3
2669 -3 517 321 -268 -260 83 229 120 32 -219 -213 40 104 -62 -205 -23 -117 -451 -80 467 44 -749 -555 255
2692 255 223 -300 -184 43 -242 -432 49 539 164 -430 -238 36 47 318 445 -148 -681 -129 675 480 -239
2713 -239 39 361 -275 -438 610 1120 -16 -926 -302 616 479 71 191 73 -469 -218 524 645 49
2732 49 -350 -438 -331 184 784 275 -766 -661 90 233 6 185 15 -786 -854 200 839 304 -511 -598 -360
2753 -360 -9 445 536 82 -658 -576 -108 518 813 319 -463 -755 -175 623 889 345 -407 -633 -132 400 503
2774 503 477 295 -451 -917 87 1462 952 -598 -724 265 194 -104 504 780 -377 -1210 -63 1002 527
2793 527 -255 -310 -568 -627 322 1045 50 -1037 -509 121 -88 103 736 100 -1372 -925 748 984 -34
2812 -34 -407 -396 -552 -163 842 960 -53 -778 -528 -83 440 967 595 -595 -1013 -107 873 804 232 18
2832 18 -322 -519 10 899 1044 -44 -1014 -507 574 733 28 -89 99 -368 -694 378 1155 107 -1093
2851 -1093 -470 373 40 39 516 -133 -1212 -455 978 466 -682 -192 229 -855 -658 1180 1164 -1066 -1348
2870 -1348 532 810 -373 92 832 -438 -1228 285 1248 194 -243 264 -297 -835 574 1615 -28
2887 -28 -1251 -35 800 -145 -111 1208 421 -1323 -615 1082 723 -373 -62 114 -682 -467 774 597
2905 597 -516 -315 29 -448 -215 877 400 -1049 -678 556 122 -453 312 434 -814 -729 789 548
2923 548 -609 -147 517 -612 -668 982 874 -1058 -759 1082 463 -1163 142 1506 -330 -1495 531
2940 531 1620 -312 -897 712 507 -987 165 1522 -12 -1292 294 1070 -541 -581 1304 576 -1595
2957 -1595 -685 1628 538 -1157 -29 927 -648 -1192 815 1151 -777 -834 483 108 -824 182 983
2974 983 -453 -1015 261 665 -507 -313 725 118 -900 -168 819 150 -520 56 430 -153 -190 246 172
2993 172 -69 190 56 -132 292 442 -162 -305 466 583 -200 -253 424 164 -322 207 502 -89 -269 296
3013 296 79 -425 85 711 -265 -903 151 716 -379 -618 506 421 -896 -671 635 415 -581 -177 281
3032 281 -277 -432 328 374 -402 -217 423 -109 -534 308 755 -311 -694 308 604 -314 -339 638 319 -524
3052 -524 -185 667 292 -354 10 377 -76 -7 379 137 -223 87 295 -27 -54 329 162 -354 -166 386 167
3073 167 -219 -220 -45 -77 -28 112 -107 -202 -5 -117 -347 25 534 19 -767 -233 578 225 -509 -66 302 -182
3095 -182 -461 259 467 -30 -295 -27 58 33 320 277 -251 -337 328 430 -129 43 366 35 -433 79 654
3116 654 242 -327 -121 173 18 121 283 -5 -369 -154 155 29 18 222 -32 -587 -270 488 209 -456
3136 -456 -351 94 -20 -350 121 350 -144 -523 -232 262 249 -89 -207 -290 -109 202 167 21 8 -7 -292 -151
3158 -151 431 545 -141 -431 -84 310 247 264 180 -198 -242 286 392 59 126 244 -231 -469 243 834 98 -747
3180 -747 -214 404 103 -130 189 167 -444 -416 234 291 -88 -116 -246 -430 16 544 151 -606 -293 164 -181
3201 -181 -285 348 304 -617 -779 326 624 -105 -219 202 -122 -423 343 669 1 -401 13 64 -134 307
3221 307 710 -185 -810 169 771 132 -278 146 173 -418 -126 684 432 -399 -260 23 -77 220 520 -151
3241 -151 -700 -200 498 -15 -304 281 111 -766 -540 634 696 -455 -684 -20 -8 -168 315 270 -440 -558
3261 -558 203 223 -54 190 266 -590 -589 458 789 -84 -450 163 107 -171 241 667 -55 -541 -57 351 166
3282 166 247 365 -351 -624 324 770 -68 -414 145 60 -403 77 950 206 -887 -409 455 188 -57 172
3302 172 -78 -675 -231 519 177 -280 -162 -195 -612 -275 691 456 -766 -610 217 308 -121 141 251 -416
3322 -416 -478 130 502 296 -15 -182 -359 -25 630 595 -294 -376 137 132 -19 403 425 -233 -587 85 486 298
3344 298 92 -67 -403 -186 526 545 -136 -269 -12 -190 -291 415 635 -404 -880 -20 496 0 -69 81
3364 81 -371 -708 51 665 95 -423 -262 -218 -345 301 894 -37 -939 -321 627 278 -165 365 286 -704 -651
3385 -651 788 940 -124 -476 -68 33 35 496 537 -221 -474 58 409 204 242 306 -354 -721 59 869 460
3406 460 -503 -454 -10 44 92 240 126 -444 -639 -106 384 433 -100 -646 -545 44 314 309 10 -320 -575 -222
3428 -222 332 534 199 -295 -446 -328 151 765 597 -428 -612 -97 296 252 383 386 -367 -847 67 1013 613
3449 613 -318 -350 -18 -19 138 732 465 -425 -634 21 420 268 253 67 -596 -715 431 853 -27 -628 -158
3470 -158 87 -381 -85 715 287 -914 -820 403 613 -76 -311 -56 -304 -514 323 698 -40 -694 -191 201
3490 201 10 181 520 -74 -867 -374 717 620 -183 -171 130 -249 -318 500 885 -63 -783 -127 496 300 133
3511 133 330 14 -564 -162 525 520 -31 -194 -144 -280 -45 496 416 -353 -675 -106 154 -20 -9 194 -108 -612
3533 -612 -302 429 379 -250 -474 -131 4 -70 14 194 -12 -372 -230 168 177 11 43 -92 -210 -80 292 364
3555 364 -149 -317 179 342 -65 -54 506 381 -385 -328 496 509 -198 -191 320 96 -317 30 546 153 -434 -119
3577 -119 172 30 -69 260 127 -473 -401 318 308 -260 -132 127 -284 -565 117 686 -3 -623 -223 182 -104
3598 -104 -113 359 243 -502 -624 227 491 124 -39 58 -297 -397 310 744 133 -361 5 96 -202 138 784
3619 784 312 -783 -468 705 755 -114 -144 302 -75 -460 212 810 38 -676 -288 115 143 227 294 -180 -841
3640 -841 -282 578 397 -245 -239 -118 -527 -333 630 689 -399 -926 -344 282 261 139 98 -403 -745 -158 534
3661 534 700 108 -391 -548 -321 497 876 305 -388 -583 -182 242 619 568 83 -638 -618 130 827 702 -79
3682 -79 -659 -404 183 375 384 241 -239 -761 -471 572 919 75 -585 -541 -143 137 567 427 -349 -870 -325
3703 -325 348 349 235 72 -552 -978 24 1078 605 -589 -721 -118 12 112 689 492 -549 -1056 -106
3722 -106 743 620 155 -229 -619 -484 489 978 341 -363 -436 -187 14 631 853 51 -837 -647 275 632
3742 632 362 -30 -286 -571 -252 535 675 125 -490 -576 -296 330 588 184 -513 -657 -203 210 321 278 -109
3763 -109 -545 -540 71 562 422 -196 -643 -408 203 475 275 -115 -252 -273 -144 213 623 380 -487 -627 70
3784 70 524 434 143 -73 -252 -258 261 555 205 -146 -248 -241 -50 402 574 -37 -643 -310 273 340 -40 39 65
3807 65 -377 -329 192 451 -9 -445 -246 18 43 105 67 -143 -271 -106 74 130 96 55 -223 -343 61 410 80
3830 80 -249 -65 195 20 -103 90 301 44 -220 36 328 106 -4 -68 35 133 143 67 -85 -7 133 122
3852 122 -72 -51 199 131 -163 -59 247 155 -233 -181 133 243 -19 -247 -101 91 -52 -78 10 -34 -104 -238 -78
3875 -78 216 142 -114 -306 -194 93 149 5 -70 -158 -149 -27 24 344 87 -234 -377 21 293 276 52 -132 -161
3898 -161 -80 205 268 206 -92 -302 -203 78 405 339 -131 -387 -119 262 316 70 1 -226 -314 -186 254 446 15
3921 15 -483 -463 -25 348 361 -50 -409 -361 -194 63 277 333 -105 -536 -434 163 567 200 -244 -408 -268 34
3943 34 410 389 68 -388 -344 -25 390 528 217 -405 -502 13 471 495 41 -165 -232 -167 146 519 349 -281
3965 -281 -493 -300 214 435 315 -108 -422 -376 62 290 277 57 -339 -483 -196 379 573 -63 -544 -332 -47
3986 -47 198 277 191 -178 -485 -338 184 402 282 -149 -438 -331 161 462 279 -118 -256 -201 -87 245 411
4007 411 212 -196 -450 -140 415 537 112 -293 -318 50 183 256 257 117 -288 -399 79 427 321 -160 -297
4028 -297 -187 7 144 215 16 -238 -271 -121 24 228 258 -93 -436 -266 208 277 -45 -37 4 -140 -249 224
4050 224 373 117 -268 -195 97 101 124 199 -51 -288 -128 47 112 141 170 -89 -335 -83 398 394 -87 -183 -63 65
4074 65 -75 165 351 126 -342 -315 115 337 166 -20 -290 -206 3 112 173 93 -130 -306 -349 29 316 246
4096 246 -137 -460 -373 132 285 162 -68 -160 -285 -328 153 588 284 -418 -534 11 260 296 255 74 -374 -415
4118 -415 119 564 399 -18 -222 -322 -97 407 689 42 -504 -355 105 232 390 514 -52 -745 -509 476
4138 476 791 127 -523 -487 -214 40 425 557 -77 -728 -584 60 579 490 116 -628 -787 -162 690 670 -84
4159 -84 -556 -464 -285 224 749 628 -210 -1014 -515 513 804 328 -193 -550 -578 -65 827 892 9 -706 -672
4180 -672 -3 597 782 406 -489 -905 -259 669 788 141 -324 -544 -597 34 888 727 -405 -992 -492 289
4200 289 588 421 -33 -609 -827 -227 754 709 -96 -709 -684 -183 557 767 215 -618 -942 -218 563 667 280
4221 280 -246 -796 -678 310 1149 723 -456 -937 -370 380 646 670 234 -668 -920 -112 952 955 109 -604
4241 -604 -652 -358 452 1041 514 -579 -913 -176 420 498 528 79 -831 -977 120 1038 558 -425 -668 -371
4261 -371 -143 260 785 218 -760 -890 82 654 485 75 -198 -765 -492 434 891 122 -646 -483 -193 79
4281 79 493 703 -100 -975 -543 594 834 313 -117 -321 -432 -137 606 934 133 -670 -588 -28 422 670
4301 670 363 -338 -698 -267 442 595 204 -118 -450 -548 -84 645 643 -122 -780 -458 58 426 294 85 -319
4322 -319 -479 -371 185 571 195 -332 -469 -201 167 369 252 -87 -446 -313 241 409 212 -5 -74 -278
4342 -278 -157 409 575 -54 -467 -48 255 108 126 353 124 -405 -333 423 524 -23 -240 -22 -109 -52 315
4363 315 355 -139 -338 -63 45 45 209 303 -201 -604 -101 389 167 -268 -48 6 -298 -253 204 359 -98 -324
4385 -324 -218 -85 58 263 205 -182 -265 40 188 90 121 197 -32 -353 -56 320 319 -13 2 -22 -61 20 167 277
4409 277 110 -105 -165 4 248 213 80 -101 -145 -54 -65 148 132 -31 -198 -214 117 136 48 -18 -221 -266 7 219
4433 219 -1 -104 -87 -154 -329 -59 390 146 -453 -452 66 290 30 42 62 -211 -286 125 323 141 -73 -148 -183
4456 -183 -136 356 473 0 -416 -106 150 166 176 265 35 -324 -248 261 499 179 -211 -245 -158 52 270 284 2
4479 2 -315 -272 -20 162 244 67 -304 -449 -160 243 263 -48 -194 -262 -164 -31 185 199 -89 -413 -254 162 349
4502 349 169 -61 -144 -245 -85 182 281 53 -252 -272 3 143 320 200 -147 -269 -25 293 250 98 39 -50
4524 -50 -280 -70 345 351 -63 -287 -107 63 152 172 87 -155 -183 -129 48 158 185 -62 -303 -249 75 287 -44
4547 -44 -170 -67 -125 -147 43 157 104 -192 -237 -89 55 225 82 -124 -150 33 89 55 167 166 -43 -193 -9
4570 -9 228 238 31 -3 -43 -62 0 211 267 49 -57 -51 -54 131 298 123 -190 -225 23 135 89 123 89 -177 -353
4595 -353 -32 350 263 -96 -194 -290 -119 145 265 18 -203 -280 -196 0 179 321 -94 -524 -268 184 363 122
4617 122 -123 -280 -305 -75 299 387 117 -264 -449 -178 351 592 230 -300 -377 -119 228 416 326 72 -420
4638 -420 -347 183 494 436 -42 -364 -456 48 474 459 56 -353 -462 -225 286 623 230 -576 -743 -253 328
4659 328 495 237 -275 -515 -506 159 616 432 -109 -578 -613 -8 655 706 -96 -687 -534 -2 446 484 291 -340
4681 -340 -719 -403 559 854 331 -310 -689 -345 344 704 547 -191 -634 -438 72 639 747 125 -642 -733
4701 -733 -4 757 633 -62 -536 -645 -275 403 714 315 -457 -867 -515 399 812 381 -322 -844 -502 282
4721 282 716 578 -204 -766 -678 -6 806 794 -79 -774 -826 -118 754 811 172 -477 -779 -348 397 989 529
4742 529 -403 -941 -406 485 868 488 -300 -696 -602 192 851 701 -10 -625 -773 -107 802 940 99 -713
4762 -713 -779 -96 482 682 256 -439 -779 -472 311 931 488 -441 -897 -476 260 727 501 -214 -704 -639 -7
4783 -7 704 694 16 -639 -766 -149 686 874 202 -628 -713 -105 532 682 369 -260 -779 -488 422 947 526
4804 526 -296 -685 -434 134 636 651 42 -681 -587 37 660 662 219 -521 -747 -211 602 701 106 -338 -551 -362
4826 -362 121 672 505 -266 -823 -553 218 609 331 -211 -509 -494 -18 522 535 109 -445 -553 -159 378 591
4847 591 271 -386 -591 -111 510 527 168 -237 -413 -403 111 602 559 -63 -574 -312 220 554 324 107 -332
4868 -332 -512 -103 417 494 94 -345 -431 -241 199 500 316 -277 -505 -275 135 250 216 9 -309 -485 -100
4889 -100 486 384 -125 -357 -204 -60 140 271 254 -178 -457 -167 224 337 190 5 -320 -221 149 440 226
4910 226 -110 -198 -106 -58 142 362 257 -245 -407 -22 300 284 -42 -63 -134 -176 30 301 232 -98 -278 -170 -38
4933 -38 92 184 111 -194 -288 -25 273 148 -83 -73 -146 -300 29 307 192 -217 -307 8 84 73 137 144 -121 -267
4957 -267 -91 265 267 -18 -49 -154 -148 12 262 154 -25 -157 57 54 54 229 172 -181 -336 47 285 123 -170
4980 -170 -48 -38 -128 -8 260 179 -89 -224 -61 54 108 32 -13 -178 -246 -31 210 83 -87 -93 -97 -136 -44 250
5004 250 143 -193 -303 17 165 37 -13 -9 -52 -183 -24 218 182 -27 -142 -47 5 51 184 201 -138 -169 30
5027 30 121 68 46 97 -73 -232 -25 230 134 -139 -111 72 37 -138 102 257 -42 -213 -60 114 -42 -60 117
5050 117 28 -163 -96 54 24 -108 10 3 -108 -123 142 153 -97 -147 72 76 -64 -15 202 20 -168 -84 94 225
5074 225 -4 15 18 -4 -20 61 127 104 -48 -53 -53 139 100 69 6 -182 -143 92 172 72 -19 -89 -105 -125 61 257 102
5101 102 -237 -300 -60 123 82 55 -46 -161 -230 -49 270 159 -92 -281 -142 -86 150 313 59 -347 -313 44
5123 44 218 190 194 21 -343 -358 228 537 121 -269 -249 -128 14 293 380 91 -392 -335 45 324 374 151 -241
5146 -241 -453 -79 409 439 57 -211 -262 -191 53 396 388 -182 -597 -329 250 447 195 -256 -407 -404 -12 430
5168 430 370 -6 -398 -526 -118 396 510 112 -448 -500 -143 389 511 234 -243 -534 -313 265 732 419 -183
5189 -183 -575 -354 188 631 449 -52 -458 -469 -78 489 688 128 -457 -589 -99 509 616 194 -442 -635
5209 -635 -147 330 602 354 -184 -696 -502 164 756 470 -266 -724 -483 144 516 495 13 -614 -628 -41 539
5230 539 648 130 -452 -711 -168 532 660 304 -365 -602 -312 291 699 437 -225 -644 -544 232 798 556
5250 556 -111 -634 -529 63 610 652 23 -505 -660 -204 571 751 148 -475 -607 -211 382 728 350 -379
5270 -379 -658 -437 196 684 481 -184 -720 -574 187 699 442 -152 -540 -571 -82 568 680 137 -601 -660 -145
5291 -145 447 671 284 -313 -621 -164 383 619 334 -206 -538 -438 172 684 580 -187 -673 -439 116 579
5311 579 494 105 -456 -489 -81 443 572 125 -419 -661 -152 433 658 203 -340 -508 -328 223 512 371 -130
5332 -130 -646 -459 50 434 400 -168 -542 -511 12 413 369 -28 -328 -464 -150 366 603 125 -389 -430 -155
5353 -155 209 497 310 -156 -478 -268 139 430 422 71 -447 -405 77 535 367 -5 -266 -236 -75 225 480
5374 480 190 -273 -393 -179 267 414 165 -206 -450 -290 145 291 156 -113 -245 -323 -79 336 323 -51 -353
5395 -353 -293 -53 146 213 22 -192 -331 -170 147 238 161 -91 -246 -203 136 250 135 -85 -174 -231 24 230
5417 230 312 27 -200 -153 24 136 250 148 -175 -260 34 162 136 20 -11 -144 -151 34 252 215 -119 -195 -99
5440 -99 8 39 180 13 -124 -192 -69 59 75 58 -9 -279 -109 84 185 -22 -80 30 14 -35 35 147 139 -135
5464 -135 -123 24 108 81 4 21 -84 -69 -30 157 39 82 -54 -81 65 104 141 55 -99 -70 92 100 82 54 -27 -64
5490 -64 -132 -52 135 97 -95 -91 -5 7 -64 18 16 5 -191 -140 58 49 4 -131 -89 -136 -41 48 55 -81 -27 -24 -38 -45 144 129
5520 129 -120 -166 -65 117 40 106 92 73 -121 -30 184 196 36 -49 -71 -57 111 204 133 -104 -108 1 87 71 133 106
5546 106 -100 -253 -30 144 169 -74 -108 -103 -19 57 118 108 -11 -184 -186 88 92 114 5 -104 -166 -73 136 103 79 -41
5572 -41 -78 -114 -34 142 175 4 -224 -11 158 132 13 -13 20 -92 18 134 243 11 -164 -117 49 90 201
5595 201 51 -90 -151 -55 114 107 83 -63 -161 -236 -46 250 147 -66 -256 -128 17 137 134 117 -140 -312 -173
5618 -173 109 296 69 -126 -196 -264 26 283 192 -44 -187 -265 -29 164 274 168 -145 -318 -15 274 204 75
5640 75 -69 -188 -211 44 297 326 -54 -240 -190 93 301 271 20 -204 -215 -25 247 318 63 -160 -291 -210 123
5663 123 359 213 -190 -320 -123 135 197 152 -37 -342 -358 3 337 302 -72 -412 -298 6 252 310 36 -284
5685 -284 -318 -198 261 416 84 -201 -355 -208 184 465 269 -185 -422 -211 128 251 421 91 -345 -433 -34
5706 -34 429 355 108 -267 -398 -206 234 401 228 -227 -435 -220 111 298 238 -153 -478 -334 186 395 268
5727 268 -100 -364 -323 -45 368 391 86 -361 -409 -86 369 406 99 -254 -433 -208 222 484 192 -187 -407
5748 -407 -270 140 479 401 -137 -493 -264 199 449 352 -42 -344 -383 -53 312 516 90 -432 -503 -103 304
5769 304 420 144 -238 -417 -190 206 475 204 -138 -430 -320 33 402 407 -153 -550 -337 74 323 281 71
5790 71 -269 -460 -154 327 470 136 -328 -360 -132 194 319 180 -169 -443 -228 99 389 286 -92 -373 -348
5811 -348 86 384 361 -77 -301 -226 17 248 363 164 -293 -390 -141 302 363 108 -178 -321 -198 150 361
5832 361 251 -155 -358 -295 51 333 290 -31 -415 -326 32 304 218 -45 -205 -210 -101 208 355 132 -222 -366
5854 -366 -140 214 326 188 -116 -212 -165 122 300 223 -14 -293 -201 36 219 243 -1 -209 -245 -1 190 172
5876 172 48 -130 -196 -74 79 332 84 -170 -343 -125 122 190 39 -70 -167 -199 50 161 185 -93 -177 -228
5898 -228 -44 168 135 -23 -163 -153 -20 58 78 66 -68 -228 -208 43 209 102 -79 -105 -24 67 38 52 32 -103
5922 -103 -66 38 109 147 79 3 -49 8 70 78 -4 -3 -88 -102 -47 93 60 -22 -82 -76 31 75 11 -40 -32 -38 -70 17 1 23 33
5953 33 -92 -49 -1 40 -16 -32 43 14 -70 -1 16 13 -37 -69 -47 21 68 50 22 51 -52 11 32 14 93 45 -16 -73 2 97
5983 97 54 64 10 27 18 -4 51 81 44 -19 -118 39 47 77 18 -173 -84 -55 15 34 28 -35 -133 -217 21 150 70 -82 -146
6012 -146 -40 9 88 -2 -27 -101 -157 -80 72 142 64 -118 -229 -23 128 149 35 -67 -106 -21 35 152 161 -13 -125
6037 -125 -105 101 169 206 20 -120 -139 82 72 132 62 -76 -289 -70 162 206 51 -155 -188 -96 65 137 131 -78
6061 -78 -136 -220 3 165 103 -24 -232 -236 -48 148 93 35 -123 -194 -159 91 242 77 -145 -254 -144 82 225
6084 225 182 -12 -153 -171 28 176 218 79 -164 -207 29 203 233 43 -147 -139 -28 111 157 159 -99 -219 -181 24
6108 24 262 184 -104 -237 -181 17 175 147 -46 -273 -201 -141 164 249 52 -190 -256 -116 83 185 94 -119 -291
6131 -291 -128 -32 245 221 -55 -237 -213 -5 275 196 -22 -209 -194 -17 214 238 126 -148 -208 -72 171 327
6153 327 215 -145 -281 -83 173 244 172 -37 -212 -269 47 271 223 -21 -222 -307 -16 267 287 30 -203 -250
6175 -250 -107 124 250 160 -149 -383 -277 109 290 140 -81 -344 -235 -62 237 256 -44 -303 -356 -33 200
6196 200 296 69 -159 -319 -128 194 268 187 -129 -197 -211 89 303 262 -3 -256 -223 105 290 187 -22 -208
6218 -208 -264 -35 213 299 98 -194 -343 -159 212 221 63 -146 -296 -218 108 242 160 -96 -262 -253 -47 238 251
6241 251 -10 -325 -296 69 250 267 104 -139 -304 -170 278 397 116 -167 -227 -176 112 321 231 -133 -242 -173
6263 -173 81 289 301 107 -232 -288 -61 305 282 40 -183 -201 -115 146 248 124 -130 -291 -120 129 225 133
6285 133 -65 -276 -172 39 252 184 -86 -246 -184 -11 206 128 -54 -274 -336 -34 264 264 54 -186 -275 -62
6307 -62 57 281 143 -119 -304 -159 139 290 167 -41 -232 -243 32 212 224 -69 -168 -158 -54 134 223 51
6329 51 -188 -247 -74 180 138 47 -98 -181 -249 84 228 173 -72 -218 -120 15 142 128 -25 -207 -259 -64 138
6352 138 109 34 -96 -226 -110 95 143 46 -173 -238 -74 33 149 133 14 -242 -123 27 141 133 -66 -56 -121
6375 -121 9 89 142 54 -87 -129 -53 78 148 61 -43 -83 -93 82 145 70 -82 -26 -59 -13 14 103 10 -70 -105 -10 109
6402 109 52 -35 -65 -39 -94 16 141 32 -128 -109 -17 3 67 100 -47 -59 -78 43 46 -5 -23 12 -69 -59 87 106 11
6429 11 5 -22 46 37 26 36 3 -21 49 22 -38 13 -42 29 -11 3 -2 19 59 -84 -18 6 -60 -14 40 22 2 -68 -31 38 18
6460 18 -42 26 -36 80 -47 25 18 6 44 43 -3 -40 2 53 -11 -50 60 -15 -10 76 42 -87 -82 -7 51 52 -18 37 -32 16 -40
6491 -40 68 64 39 -81 -105 -18 77 83 50 -60 -112 33 68 76 75 52 -112 -79 55 76 95 -57 -123 -2 19 65 74 12 -90
6520 -90 -105 -82 48 85 47 -48 -162 -116 122 131 55 -86 -107 -62 17 100 76 39 -121 -104 14 159 95 -13 -148 -102
6546 -102 -22 108 103 86 -46 -158 -57 131 226 81 -116 -192 -11 108 162 74 -37 -178 -126 -27 117 188 -20 -167
6570 -167 -186 -36 150 153 -16 -120 -167 -111 151 199 68 -58 -162 -165 78 187 79 -51 -143 -81 -26 178 190 6
6594 6 -164 -167 -45 151 211 -4 -93 -172 -34 183 177 67 -64 -126 -120 84 247 154 -60 -226 -154 86 207 100 -62
6619 -62 -172 -112 -25 143 168 100 -147 -240 -73 125 248 -3 -123 -204 -94 33 220 163 -41 -230 -173 84 181
6642 181 165 -85 -242 -133 29 209 208 -18 -195 -180 -72 129 290 142 -147 -249 -69 103 205 97 -42
6663 -42 -201 -89 46 211 173 -68 -198 -180 -15 231 225 10 -199 -208 -54 143 196 62 -127 -214 -51 126 217
6686 217 96 -107 -255 -150 180 192 147 -101 -217 -205 23 195 249 32 -271 -249 4 208 198 37 -114 -151
6708 -151 -75 106 274 152 -28 -168 -155 128 272 144 -99 -241 -85 30 209 189 28 -162 -236 -24 212
6729 212 186 55 -190 -225 -47 147 197 16 -154 -223 -160 43 199 147 -113 -287 -176 116 166 145 -28 -150 -138
6752 -138 10 167 207 32 -184 -183 -27 200 167 81 -122 -190 -29 144 156 96 -71 -204 -71 87 304 118 -80
6775 -80 -176 -161 36 159 152 0 -176 -137 -1 186 214 41 -181 -174 -14 110 142 0 -171 -107 -133 87 165 101 -38
6800 -38 -238 -113 10 176 137 -67 -136 -123 42 207 122 2 -66 -160 -32 71 219 77 -105 -120 -65 105 252
6823 252 63 -45 -36 -23 31 125 126 12 -146 -101 -9 91 153 -22 -64 -112 -82 49 112 36 -38 -140 -49 113 133 60
6849 60 -95 -89 -40 9 71 84 -14 -146 -128 -8 91 147 -26 -102 -51 -10 129 125 21 -47 -47 5 6 47 159 26 -84 -26
6877 -26 61 62 86 -33 -49 -5 -10 93 129 -12 -109 -48 -22 99 52 17 -48 -31 -3 20 62 15 -4 -39 -46 35 49 -21 -127
6906 -127 -23 -23 -48 14 -23 -18 -22 -12 0 -66 46 -11 -24 -53 20 43 -3 -39 14 -46 94 -28 -1 35 51 18 1 -21 37
6935 37 39 -20 -26 123 39 -11 33 68 86 60 8 92 66 -9 54 18 46 31 -31 -113 -12 17 -18 2 -61 -34 -1 -12 -28 56
6965 56 -35 -104 -28 82 -4 -45 -91 -7 61 42 -27 -22 -53 -49 -2 38 29 30 -35 -38 -37 73 117 12 -8 -34 -8 21 38 64 70 -13
6997 -13 -75 15 134 120 10 -35 -50 -25 87 91 114 -38 -79 -84 12 54 32 11 -80 -80 -27 64 58 -13 -122 -104 -82 25 167
7026 167 71 -112 -155 -48 52 68 23 -79 -56 -88 92 138 61 -25 -110 -22 63 137 85 -3 -119 -53 62 154 96 15
7052 15 -77 -129 -37 129 206 72 -146 -112 -21 101 111 149 -4 -87 -66 -61 156 182 -30 -149 -160 -13 159 84 -3 -82
7078 -82 -171 -100 69 91 44 -100 -167 -168 50 143 86 -51 -138 -77 53 155 73 -40 -171 -134 51 187 155 -25 -147
7103 -147 -154 -75 148 142 70 -144 -86 0 138 188 95 -44 -150 -109 103 171 101 34 -98 -85 18 161 133 71 -177 -139
7129 -139 -62 99 129 3 -188 -206 -43 146 155 89 -49 -198 -57 13 204 159 -28 -176 -143 33 143 171 -19
7152 -19 -145 -159 -99 87 217 18 -180 -150 -66 149 206 92 -118 -152 -28 52 182 162 -56 -129 -132 1 215 155
7176 155 -27 -138 -157 87 164 154 -16 -163 -185 -33 137 177 49 -135 -200 -115 90 172 105 -67 -235 -133 31
7199 31 112 138 -15 -143 -148 2 138 112 -56 -163 -77 -51 147 153 89 -123 -142 8 77 181 83 -101 -189 -66 95
7224 95 184 81 -15 -80 -105 72 167 116 -2 -133 -110 -33 139 184 1 -71 -87 -41 125 100 112 -60 -180 -72 115
7249 115 169 56 -129 -137 -148 14 110 59 -49 -129 -138 10 148 158 -15 -103 -168 32 138 152 -3 -45 -80 -20 86
7274 86 157 23 -108 -119 -108 112 195 106 -67 -20 -78 64 107 117 14 -82 -91 -15 122 150 57 -133 -91 -4 70 136 18
7301 18 -53 -127 -45 36 18 15 -106 -118 8 60 69 12 34 -104 -54 -29 140 60 -40 -9 -49 19 93 156 12 -87 -83 -18 17
7330 17 70 77 46 -64 -44 68 125 51 -10 -22 26 61 124 60 18 -43 -2 42 63 59 10 -25 -57 -15 84 -27 -45 9 -96
7359 -96 -42 24 40 19 -37 -24 -46 87 71 -1 -26 -71 12 -25 -25 -30 -15 0 -12 39 -3 27 -29 -63 28 14 27 -18 -7 17 -6
7390 -6 -47 -6 32 58 0 6 52 25 78 -55 18 27 4 -55 14 -1 12 -23 44 18 -12 -86 -7 19 66 -5 -48 -37 -7 -21 11
7421 11 39 -12 23 -30 -57 -23 37 63 -33 -36 53 7 66 -14 -9 14 4 -21 53 29 -4 -68 -65 -9 99 48 -63 -44 -61 65
7451 65 70 66 24 -60 -64 3 74 77 10 -73 -52 -38 31 71 10 -1 -56 -14 -20 81 17 -62 -88 -65 9 43 33 5 -47 22 -27 -2
7483 -2 104 35 -20 -92 0 33 158 51 -94 -70 39 91 43 66 -6 -86 -86 43 108 119 11 -85 -45 18 154 88 -44
7510 -44 -38 -77 -16 89 41 47 -88 -103 16 114 69 10 -87 -104 -30 14 84 82 14 -59 -89 19 58 12 -52 -80 -74 70 166 94
7540 94 37 -67 -79 22 66 116 49 -52 -158 8 116 90 55 -30 -73 -37 -5 126 96 17 -84 -77 -19 44 120 -2
7566 -2 -116 -102 21 102 119 96 -43 -78 -81 42 136 99 -12 -117 -88 11 112 110 2 -81 -144 -15 81 83 -56 -169 -110
7593 -110 -15 100 64 -19 -74 -31 -31 48 95 52 -64 -106 -50 -12 73 136 -12 -57 -111 -43 92 165 108 -82 -138 23 33
7620 33 148 121 -7 -114 -105 40 162 48 -31 -71 -101 -16 79 72 -66 -151 -95 -68 35 73 -64 -118 -79 -64 94 89 56
7647 56 -59 -119 -67 57 71 141 -28 -108 -10 14 75 32 12 -131 -189 62 59 127 51 -122 -57 19 87 131 18 -47 -93
7674 -93 -44 40 112 43 -36 -154 -50 -4 83 41 -28 -56 -78 52 115 161 -36 -67 -86 -37 112 74 12 -78 -104 -21 16 74
7702 74 64 -57 -168 -77 7 96 94 17 -70 -84 -22 66 90 46 -79 -30 11 122 110 6 39 -104 40 80 82 -14 -37 -64
7730 -64 -40 56 119 86 -9 -9 18 77 67 72 -43 -83 -36 -15 100 45 -38 -35 -96 -52 77 83 1 -47 -99 -27 25 40 40 -73 -166
7761 -166 -58 10 78 126 30 -73 -20 -6 50 14 13 -13 -11 41 59 99 45 -28 -5 72 108 68 8 -90 5 71 33 26 84 -35
7791 -35 -17 -46 -34 105 36 24 -75 14 39 55 35 -64 -33 -50 -18 53 30 -23 -32 -30 3 18 62 6 -53 34 2 15 -38 20 -30
7822 -30 47 19 -30 78 53 17 7 -16 18 28 -18 64 56 -6 -32 26 57 32 -52 39 13 83 85 -74 47 78 20 -21 71 21
7852 21 22 40 -14 -3 -24 -29 27 -2 -4 8 -32 -138 -5 -35 5 -58 -14 -26 -54 -48 16 25 22 -38 -44 -29 25 31 -35 25 -38 43 12
7885 12 -7 39 -67 -52 -6 5 106 6 -26 -30 -21 18 37 62 -42 -61 -14 22 49 39 64 -38 -27 47 0 8 -35 -52 -60 -45
7915 -45 -6 8 40 -61 -62 -43 88 63 25 -66 -75 -40 23 4 60 -17 -42 -55 18 65 61 -35 -130 -70 14 110 26 65 -90 -86 -9
7946 -9 63 111 93 -75 -44 45 70 116 96 1 -48 -37 25 87 64 -33 5 -76 13 109 103 -30 -87 -70 -41 34 36 31 -38 -121 30
7977 30 16 57 78 -65 -110 -20 83 97 -45 -58 -83 -75 17 134 66 -27 -109 -75 51 93 90 -18 -37 -21 -20 79 35 28 -131
8006 -131 -48 -59 95 110 75 -56 -52 9 119 107 87 27 -86 -37 69 97 101 23 -59 -46 25 149 46 14 -120 -96 -99
8033 -99 84 31 14 -37 -140 -98 77 102 29 -43 -55 1 -27 73 50 -26 -49 -73 -5 75 126 -10 -44 -110 13 98 92 19
8061 19 -97 -35 -19 38 102 67 -19 -86 -55 34 68 8 -58 -90 -31 41 67 82 72 -81 -62 -37 112 48 15 -42 -32 20 10
8090 10 74 43 -100 -81 -56 -17 48 -30 -69 -96 10 27 21 4 -40 -42 -107 -68 34 76 57 -23 -71 7 29 -19 33 -50 -54 -14
8120 -14 46 66 67 39 -116 -25 58 42 62 -6 1 7 16 35 44 61 7 -72 56 71 51 24 -34 -68 -11 103 52 -10 -36 -19 -45
8151 -45 53 39 98 -19 -119 -21 -9 62 18 40 -105 -22 29 -10 68 8 -14 -91 34 18 57 82 -30 -30 25 -19 59 66 21
8180 21 -68 -112 8 79 91 -48 -85 -19 -15 -32 -9
8191i
##END NTUPLES=NMR FID
##END=
