##TITLE=1H_IPBDP2309
 CDCl3, 8 sc, 
 23.9.2020
##JCAMPDX= 6.0         $$ Bruker NMR JCAMP-DX V2.0
##DATA TYPE= NMR FID
##DATA CLASS= NTUPLES
##ORIGIN= UXNMR, Bruker Analytische Messtechnik GmbH
##OWNER= root
$$ XWIN-NMR		Version 3.5
$$ Wed Sep 23 12:55:12 2020 Russian Standard Time (UT+4h)  she@DPX200
##.OBSERVE FREQUENCY= 200.1315066352
##.OBSERVE NUCLEUS= ^1H
##.DELAY= (6, 6)
##.ACQUISITION MODE= SIMULTANEOUS
##.ACQUISITION SCHEME= undefined
##.AVERAGES= 8
##.DIGITISER RES= 18
##SPECTROMETER/DATA SYSTEM= spect
##.PULSE SEQUENCE= zg30
##.SOLVENT NAME= CDCl3
##.SHIFT REFERENCE= (INTERNAL, CDCl3, 0, 15.7039)
##AUDIT TRAIL= $$ (NUMBER, WHEN, WHO, WHERE, WHAT)
$$ ##TITLE= Audit trail, XWIN-NMR		Version 3.5
$$ ##JCAMPDX= 5.01
$$ ##ORIGIN= Bruker BioSpin GmbH
$$ ##OWNER= she
$$ F:/spectra/data/she/nmr/H-F/1/audita.txt
$$ ##AUDIT TRAIL=  $$ (NUMBER, WHEN, WHO, WHERE, WHAT)
(   1,<2020-09-23 12:52:29.03 +0400>,<she>,<DPX200>,
      <created by zg, POWCHK disabled, PULCHK disabled
       configuration hash MD5:
       00 E9 B6 7A A2 85 ED C7 34 08 36 98 17 FE 4E 26
       data hash MD5: 16K
       94 53 42 86 FB 98 A6 09 16 F8 D3 7C ED B4 EC CD>)
$$ ##END=
$$ 
$$ hash MD5
$$ AF BB 9A 3B 89 0C DB 8E BC A4 BA 43 46 4C F6 4D
##$RELAX= 
##$RELAX= 
##$RELAX= 
##$RELAX= 
##$RELAX= 
##$RELAX= 
$$ Bruker specific parameters
$$ --------------------------
##$DU= <F:/spectra>
##$EXPNO= 1
##$NAME= <H-F>
##$PROCNO= 1
##$TYPE= <nmr>
##$USER= <she>
##$AMP= (0..31)
100 100 100 100 100 100 100 100 100 100 100 100 100 100 100 100 100 100 
100 100 100 100 100 100 100 100 100 100 100 100 100 100 
##$AQSEQ= 0
##$AQ_mod= 1
##$AUNM= <au_zg>
##$AUTOPOS= <>
##$BF1= 200.13
##$BF2= 200.13
##$BF3= 200.13
##$BF4= 200.13
##$BF5= 200.13
##$BF6= 200.13
##$BF7= 200.13
##$BF8= 200.13
##$BYTORDA= 1
##$CFDGTYP= 0
##$CFRGTYP= 5
##$CHEMSTR= <none>
##$CNST= (0..31)
1 1 145 1 1 1 1 1 1 1 1 1 1 1 1 1 1 1 1 1 1 1 1 1 1 1 1 1 1 1 1 1 
##$CPDPRG= <>
##$CPDPRG1= <>
##$CPDPRG2= <>
##$CPDPRG3= <>
##$CPDPRG4= <mlev>
##$CPDPRG5= <mlev>
##$CPDPRG6= <mlev>
##$CPDPRG7= <mlev>
##$CPDPRG8= <mlev>
##$CPDPRGB= <>
##$CPDPRGT= <>
##$D= (0..31)
0 1.2 0 0 0 0 0 0 0 0.06 0 0.03 0 0 0 0 0.0002 0 0 0 0 0 0 0 0 0 0 0 0 
0 0 0 
##$DATE= 1600851148
##$DBL= (0..7)
120 120 120 120 120 120 120 120 
##$DBP= (0..7)
150 150 150 150 150 150 150 150 
##$DBP07= 0
##$DBPNAM0= <>
##$DBPNAM1= <>
##$DBPNAM2= <>
##$DBPNAM3= <>
##$DBPNAM4= <>
##$DBPNAM5= <>
##$DBPNAM6= <>
##$DBPNAM7= <>
##$DBPOAL= (0..7)
0.5 0.5 0.5 0.5 0.5 0.5 0.5 0.5 
##$DBPOFFS= (0..7)
0 0 0 0 0 0 0 0 
##$DE= 6
##$DECBNUC= <off>
##$DECIM= 32
##$DECNUC= <off>
##$DECSTAT= 4
##$DIGMOD= 1
##$DIGTYP= 9
##$DL= (0..7)
0 120 120 120 120 120 120 120 
##$DP= (0..7)
150 150 150 150 150 150 150 150 
##$DP07= 0
##$DPNAME0= <>
##$DPNAME1= <>
##$DPNAME2= <>
##$DPNAME3= <>
##$DPNAME4= <>
##$DPNAME5= <>
##$DPNAME6= <>
##$DPNAME7= <>
##$DPOAL= (0..7)
0.5 0.5 0.5 0.5 0.5 0.5 0.5 0.5 
##$DPOFFS= (0..7)
0 0 0 0 0 0 0 0 
##$DQDMODE= 0
##$DR= 18
##$DS= 0
##$DSLIST= <SSSSSSSSSSSSSSS>
$$ [...]
##$SUBNAM2= <"">
##$SUBNAM3= <"">
##$SUBNAM4= <"">
##$SUBNAM5= <"">
##$SUBNAM6= <"">
##$SUBNAM7= <"">
##$SUBNAM8= <"">
##$SUBNAM9= <"">
##$SW= 16.880792210976
##$SWIBOX= (0..15)
0 0 2 0 0 0 0 0 0 0 0 0 0 0 0 0 
##$SW_h= 3378.37837837838
##$TD= 16384
##$TD0= 1
##$TE= 0
##$TE2= 300
##$TE3= 300
##$TEG= 300
##$TL= (0..7)
0 120 120 120 120 120 120 120 
##$TP= (0..7)
150 150 150 150 150 150 150 150 
##$TP07= 0
##$TPNAME0= <>
##$TPNAME1= <>
##$TPNAME2= <>
##$TPNAME3= <>
##$TPNAME4= <>
##$TPNAME5= <>
##$TPNAME6= <>
##$TPNAME7= <>
##$TPOAL= (0..7)
0.5 0.5 0.5 0.5 0.5 0.5 0.5 0.5 
##$TPOFFS= (0..7)
0 0 0 0 0 0 0 0 
##$TUNHIN= 0
##$TUNHOUT= 0
##$TUNXOUT= 0
##$USERA1= <user>
##$USERA2= <user>
##$USERA3= <user>
##$USERA4= <user>
##$USERA5= <user>
##$V9= 5
##$VALIST= <valist>
##$VCLIST= <CCCCCCCCCCCCCCC>
##$VD= 0
##$VDLIST= <DDDDDDDDDDDDDDD>
##$VPLIST= <PPPPPPPPPPPPPPP>
##$VTLIST= <TTTTTTTTTTTTTTT>
##$WBST= 1024
##$WBSW= 4
##$XGAIN= (0..3)
0 0 0 0 
##$XL= 0
##$YL= 0
##$YMAX_a= 138950
##$YMIN_a= -117226
##$ZGOPTNS= <>
##$ZL1= 120
##$ZL2= 120
##$ZL3= 120
##$ZL4= 120
##$ABSF1= 10
##$ABSF2= 0
##$ABSG= 5
##$ABSL= 3
##$ALPHA= 0
##$AQORDER= 0
##$ASSFAC= 0
##$ASSFACI= 0
##$ASSFACX= 0
##$ASSWID= 0
##$AUNMP= <proc_1d>
##$AZFE= 0.1
##$AZFW= 0.1
##$BCFW= 1
##$BC_mod= 2
##$BYTORDP= 1
##$COROFFS= 0
##$CY= 11.3945322036743
##$DATMOD= 1
##$DC= 2
##$DFILT= <>
##$DTYPP= 0
##$F1P= 16.9975609425685
##$F2P= -3.02152046262296
##$FCOR= 0.5
##$FTSIZE= 0
##$FT_mod= 4
##$GAMMA= 1
##$GB= 0.15
##$INTBC= 1
##$INTSCL= 1
##$ISEN= 128
##$LB= 0.24
##$LEV0= 0
##$LPBIN= 0
##$MAXI= 10000
##$MC2= 0
##$MEAN= 0
##$ME_mod= 0
##$MI= 1.114404
##$NCOEF= 0
##$NC_proc= 0
##$NLEV= 6
##$NOISF1= 3.799351
##$NOISF2= 2.8
##$NSP= 1
##$NTH_PI= 0
##$NZP= 0
##$OFFSET= 15.70392
##$PC= 1
##$PHC0= -10125.81
##$PHC1= 9.8009
##$PH_mod= 1
##$PKNL= yes
##$PPARMOD= 0
##$PSCAL= 0
##$PSIGN= 0
##$REVERSE= no
##$SF= 200.130013532006
##$SI= 16384
##$SIGF1= 3
##$SIGF2= 2
##$SINO= 400
##$SIOLD= 16384
##$SREGLST= <1H.CDCl3>
##$SSB= 0
##$STSI= 0
##$STSR= 0
##$SW_p= 3612.71676300578
##$SYMM= 0
##$S_DEV= 0
##$TDeff= 0
##$TDoff= 0
##$TI= <>
##$TILT= no
##$TM1= 0
##$TM2= 0
##$TOPLEV= 0
##$USERP1= <user>
##$USERP2= <user>
##$USERP3= <user>
##$USERP4= <user>
##$USERP5= <user>
##$WDW= 1
##$XDIM= 8192
##$YMAX_p= 0
##$YMIN_p= 0
$$ End of Bruker specific parameters
$$ ---------------------------------
##NTUPLES= NMR FID
##VAR_NAME=  TIME,          FID/REAL,        FID/IMAG
##SYMBOL=    X,             R,               I
##VAR_TYPE=  INDEPENDENT,   DEPENDENT,       DEPENDENT
##VAR_FORM=  AFFN,          ASDF,            ASDF
##VAR_DIM=   8192,          8192,            8192
##UNITS=     SECONDS,       ARBITRARY UNITS, ARBITRARY UNITS
##FACTOR=    0.000296,      1,               1
##FIRST=     0,             0,               0
##LAST=      2.424536,      0,               0
##MIN=       0,             -117226,         0
##MAX=       2.424536,      138950,          0
$$ Real data points
##PAGE= N=1
##DATA TABLE= (X++(R..R)), XYDATA
0 0 0 0 0 0 0 0 0 0 0 0 0 0 0 0 -8 8 -8 8 -16 16 -16 24 -24 32 -40 40 -48 56 -67 80 -88 104 -116 132 -149 168
36 168 -188 212 -237 267 -297 331 -364 404 -448 496 -548 605 -665 735 -809 892 -980 1081
54 1081 -1192 1320 -1458 1620 -1805 2020 -2274 2579 -2955 3429 -4050 4904 -6165 8250 -12639
69 -12639 44494 -30538 75332 63983 -36341 138950 4557 39129 92973 -24795 69787
80 69787 42806 589 77225 -2346 31528 39080 -4180 37717 5990 -4525 23424 -2653
92 -2653 4125 18697 -13536 -15351 13503 -32418 4365 21231 -47388 24752 -15372 -49130 52585
105 52585 -45814 -1089 43151 -70417 44025 -2463 -39532 69167 -44684 15527 41158
116 41158 -46938 61757 -5597 -11116 58027 -36441 39217 27461 -23820 56452 -16286 3553
128 3553 41242 -22723 30911 13678 -18070 25539 -4909 -5628 19585 -9669 -7029 11279 -16370
141 -16370 -5489 11678 -28368 1489 111 -33715 20171 -20840 -20525 18985 -44887 8857 1032
154 1032 -37702 30456 -32356 -11906 22529 -45553 25673 -5234 -30399 37326 -35152 4401
166 4401 21462 -37753 30751 -8294 -16562 32149 -25142 8511 13901 -23081 21004 -2865 -8231
179 -8231 17995 -11839 1235 9059 -10490 6252 5188 -10412 7879 -265 -11241 13907 -8786
192 -8786 -4435 15014 -19662 9079 4950 -20534 22329 -12899 -6791 22243 -26705 14805 4937
205 4937 -22616 28220 -17136 -1857 21853 -26988 19292 1693 -17832 26950 -16748 1970
217 1970 17815 -22212 18097 736 -13062 21414 -11841 801 14409 -15042 10447 4851
229 4851 -11951 14930 -3678 -5704 15335 -10664 2453 11600 -14423 11707 3153 -12797 18494
242 18494 -9010 -2819 17971 -18374 11970 6261 -17074 21917 -9583 -3640 19963 -19848 12588
255 12588 6642 -17600 22884 -9594 -3990 19935 -19312 12109 7196 -16560 20622 -7142 -5454
268 -5454 19424 -15221 7586 9895 -16094 16318 -1590 -7938 18543 -11130 1995 12289 -14609
281 -14609 12847 3395 -11121 17778 -8758 -1764 15959 -15322 10808 5677 -14743 18769 -6560
294 -6560 -5128 18288 -16582 7332 9427 -16498 18201 -4155 -9324 18180 -14507 4624 11772
307 11772 -16176 13870 -1880 -10636 17542 -11179 1712 11665 -16315 11641 903 -11057
319 -11057 16736 -10086 -1995 13157 -15240 9741 4248 -14137 15203 -7439 -4766 15567 -13804
332 -13804 5590 6349 -14999 13668 -2866 -7025 15210 -12442 2124 9127 -13750 12221 -466
345 -466 -9199 14460 -9486 670 11368 -13363 9154 2017 -10263 14962 -6771 -2101 11494
358 11494 -13089 7246 4777 -10637 13070 -5695 -5314 11850 -11692 5011 5743 -12668 10540
371 10540 -4315 -6802 11775 -10892 1432 6071 -12962 8732 -1719 -8674 10668 -9763 -624
384 -624 7761 -11627 7203 -105 -9434 10426 -6725 -1333 9421 -10763 5782 2400 -9072
397 -9072 11293 -4182 -2599 10100 -9358 4736 4966 -8808 9852 -2685 -4361 10242 -7983
410 -7983 2695 5169 -9675 7510 -1721 -5771 8974 -7960 -445 5095 -10493 5715 -862
423 -862 -8054 8003 -7628 -2484 6055 -10527 4162 491 -9009 8031 -5777 -3209 7418 -9552
437 -9552 3939 2476 -8033 8718 -3744 -2667 8409 -7595 4240 4449 -6942 8767 -1806
450 -1806 -2772 9000 -5950 3134 5418 -6650 6984 -143 -4175 7954 -4843 245 5711 -7199
464 -7199 4480 692 -6343 6768 -4569 -2371 5888 -8132 2691 1553 -8251 6659 -4400
477 -4400 -3927 6737 -8767 2265 2474 -8600 7050 -3449 -3986 7498 -7804 2463 3566 -7614
491 -7614 7247 -2068 -3293 7607 -5824 2157 4455 -6063 6036 62 -3488 6999 -3547
504 -3547 349 5351 -5142 4074 2089 -4527 6296 -1881 -1800 6353 -5227 2419 3662 -6262 6398
519 6398 -1355 -3650 7481 -6084 1646 4552 -7533 6464 -1214 -4594 7751 -6302 1151 4401
533 4401 -7424 5749 -1280 -4313 6489 -5565 558 3599 -6366 4171 -729 -4213 5047 -4096
547 -4096 -834 3553 -5323 2031 916 -4909 3952 -1831 -3073 4611 -4473 125 3226 -5777 3771
562 3771 -47 -4409 5889 -4105 -312 4828 -6253 4481 572 -4613 6956 -4217 137 5208
576 5208 -6196 4866 594 -4256 6569 -3704 70 4615 -5355 3755 577 -3792 4895 -2715
590 -2715 -723 3491 -4109 1646 1133 -3793 3070 -1177 -2452 3303 -3269 -347 2422 -4490 2070
605 2070 248 -4078 4036 -2891 -1659 3867 -5209 2208 1079 -4828 4875 -2877 -1568 4464 -5318
620 -5318 2614 1246 -4575 5061 -2726 -1170 4230 -4647 2442 1099 -3649 4165 -1944 -1060 3367
635 3367 -3343 1400 1351 -2916 2789 -785 -1643 2853 -2225 145 2191 -3062 1734 615 -2794 3234
651 3234 -1512 -1275 3405 -3370 1400 1731 -3679 3618 -1242 -1688 4003 -3501 1491 1849 -3724 3821
667 3821 -1327 -1353 3842 -3461 1594 1553 -3316 3447 -1145 -1367 3266 -2909 935 1577 -2942 2317 -508
684 -508 -1747 2474 -1946 -167 1673 -2579 1128 407 -2244 2197 -1301 -1118 2214 -2611 790 1027
700 1027 -2881 2412 -1026 -1619 2880 -2805 665 1555 -3171 2642 -690 -1732 3075 -2540 546 1719
716 1719 -2772 2462 -389 -1524 2813 -2020 519 1758 -2303 1996 47 -1424 2476 -1311 -23
731 -23 2016 -2033 1376 644 -1705 2238 -791 -633 2126 -1841 798 1112 -2039 2023 -500 -1163 2309
748 2309 -1971 328 1332 -2363 1815 -409 -1539 2223 -1886 -33 1458 -2384 1399 -88 -1710
763 -1710 1905 -1569 -353 1368 -2097 997 121 -1711 1704 -1223 -586 1524 -1883 695 510 -1797
779 -1797 1585 -689 -830 1732 -1657 468 1018 -1764 1468 -320 -1045 1853 -1332 239 1236 -1711
795 -1711 1341 29 -1103 1763 -1065 31 1343 -1603 1096 312 -1179 1654 -890 -191 1433 -1399
811 -1399 851 548 -1270 1513 -532 -512 1470 -1334 576 724 -1378 1336 -339 -754 1439 -1186
827 -1186 262 852 -1459 1062 -154 -1013 1306 -1024 -30 830 -1457 698 5 -1061 1125 -859
843 -859 -313 875 -1332 608 126 -1170 1049 -715 -486 1011 -1260 448 451 -1181 1074 -419 -554
860 -554 1185 -996 373 630 -1040 1013 -129 -520 1151 -725 227 749 -873 904 129 -605 1113
877 1113 -597 46 847 -832 581 364 -754 991 -273 -249 925 -803 350 480 -826 795 -190
894 -190 -484 865 -782 202 482 -999 744 -247 -611 963 -911 61 462 -1036 579 -185 -662 726
912 726 -702 -113 395 -807 264 -105 -575 406 -453 -229 267 -538 37 22 -563 329 -179 -471 380 -563
932 -563 -110 349 -721 288 14 -707 607 -389 -230 560 -775 407 133 -571 741 -387 -39 512
950 512 -645 506 -26 -347 589 -377 136 333 -310 429 -7 -147 351 -145 67 206 -53 45 93 -18
970 -18 36 137 -139 67 50 -206 277 -191 -161 289 -481 227 2 -357 400 -414 -78 247 -578 287 -126 -375
992 -375 231 -473 80 -10 -369 210 -358 -46 45 -332 148 -264 -18 70 -183 167 -144 -4 64 -171 263 -65
1014 -65 96 234 -218 410 -17 68 454 -210 349 119 -23 439 -41 242 269 -70 411 124 155 326 34
1035 34 386 161 137 193 61 218 71 178 89 65 192 -145 231 22 -192 351 -261 38 245 -373 373 -166
1057 -166 -189 376 -434 175 29 -390 353 -352 -50 237 -451 233 -87 -366 359 -256 -32 109 -318 131
1077 131 -43 -135 98 -44 -95 185 -60 -5 229 -182 145 213 -161 286 36 -96 399 -231 113 326 -399
1098 -399 481 -63 -171 524 -314 289 259 -367 492 -67 -109 535 -362 204 246 -317 482 -143 -137 370 -317 164
1120 164 189 -395 256 -63 -332 362 -278 -98 166 -427 121 55 -387 277 -301 -265 311 -590 44 87 -613
1141 -613 389 -332 -274 350 -568 139 70 -591 395 -233 -330 417 -562 134 171 -477 393 -158 -252 385 -360
1162 -360 19 345 -437 338 118 -372 559 -283 -15 496 -487 276 257 -509 653 -171 -167 681 -526 332
1182 332 280 -507 651 -255 -89 703 -552 341 251 -565 679 -198 -202 643 -628 169 286 -593 485 -87
1202 -87 -442 526 -399 -164 426 -656 269 87 -647 509 -343 -283 510 -754 209 286 -835 682 -325
1221 -325 -401 739 -895 243 309 -889 758 -291 -493 825 -786 176 471 -821 727 -149 -436
1238 -436 807 -645 137 445 -628 538 36 -436 783 -368 -30 700 -641 471 317 -552 718
1255 718 -129 -288 804 -578 155 587 -794 758 -64 -554 967 -746 128 655 -911 730 12
1272 12 -669 982 -724 -20 637 -1005 692 -40 -736 908 -635 -184 634 -908 446 102 -789 749
1290 749 -504 -288 626 -785 201 276 -788 604 -193 -529 779 -661 16 607 -918 594 23 -724
1308 -724 907 -565 -114 727 -861 553 234 -723 1070 -449 -152 905 -835 584 344 -745 960
1325 960 -313 -263 889 -746 404 496 -745 828 -177 -359 884 -655 142 582 -793 664 -56
1342 -56 -603 862 -598 -43 630 -922 479 51 -775 783 -514 -278 680 -933 317 205 -905
1359 -905 784 -512 -419 708 -877 207 332 -923 663 -270 -582 816 -801 132 460 -897 675
1376 675 -93 -617 906 -630 -23 701 -909 571 159 -672 965 -547 -68 811 -776 515 245
1393 245 -730 869 -386 -213 898 -814 422 367 -764 924 -291 -278 843 -713 229 481 -823
1410 -823 676 -38 -498 799 -642 69 575 -796 536 67 -712 822 -572 -156 754 -940 473
1427 473 183 -890 902 -489 -342 814 -949 305 321 -915 832 -401 -478 887 -931 309 371
1444 371 -874 793 -292 -445 822 -753 119 540 -913 678 -59 -564 823 -514 -18 660 -727
1461 -727 436 236 -639 884 -309 -241 861 -737 399 511 -821 887 -209 -461 1013 -753 288
1478 288 593 -930 875 -126 -507 1085 -795 210 624 -954 797 -70 -604 897 -665 65 548
1495 548 -868 620 41 -666 765 -490 -97 654 -805 340 249 -771 690 -279 -381 741 -721
1512 -721 73 459 -877 580 -95 -684 952 -661 -59 633 -980 648 67 -750 982 -686 -126
1529 -126 769 -985 576 171 -792 956 -550 -182 739 -919 452 213 -722 805 -360 -233 765
1546 765 -673 270 358 -743 710 -93 -359 755 -574 63 520 -792 599 124 -635 871 -400
1563 -400 -89 759 -780 488 237 -755 773 -398 -306 781 -891 328 291 -873 787 -389 -421 789
1581 789 -890 187 329 -923 675 -334 -502 761 -762 120 354 -871 525 -85 -553 642 -615
1598 -615 -41 502 -785 480 119 -646 708 -378 -216 663 -666 282 305 -665 654 -196 -283 794
1616 794 -651 305 478 -776 726 -61 -435 901 -588 176 571 -756 709 -15 -473 861 -627
1633 -627 66 594 -781 525 52 -574 807 -425 -113 615 -731 430 108 -590 626 -318 -238 569
1651 569 -616 188 224 -720 545 -179 -433 647 -557 59 422 -760 451 -78 -590 719 -487 -126
1669 -126 558 -790 458 96 -667 731 -482 -166 624 -783 422 141 -697 742 -391 -163 734
1686 734 -679 383 260 -614 665 -194 -234 654 -529 253 361 -653 573 -22 -325 634 -365 96
1704 96 462 -560 489 123 -475 713 -301 -74 629 -612 348 256 -603 719 -222 -293 669 -656 314
1723 314 323 -703 682 -243 -337 689 -674 185 280 -753 611 -172 -438 621 -585 111 356 -688
1741 -688 445 -62 -461 559 -448 -90 431 -614 363 140 -529 597 -272 -153 545 -584 301 265
1759 265 -575 570 -126 -316 679 -499 154 398 -582 533 -84 -354 711 -466 48 416 -615 503
1777 503 51 -395 705 -482 41 467 -595 424 66 -399 639 -330 -119 469 -546 288 125 -529
1795 -529 474 -290 -269 422 -548 71 241 -572 360 -224 -412 485 -533 -68 311 -703 324 -65 -528
1814 -528 532 -501 -120 365 -701 340 -13 -526 493 -346 -86 481 -611 245 113 -508 529 -225
1832 -225 -166 495 -524 266 270 -475 530 -125 -216 552 -421 123 361 -494 438 -64 -318 532 -371 14 373
1853 373 -541 340 -8 -442 512 -359 -111 413 -575 237 101 -541 443 -289 -189 430 -523 133 157 -554
1873 -554 469 -177 -239 484 -462 96 285 -496 397 -53 -303 530 -365 -8 343 -488 367 -27 -401 470
1893 470 -335 -39 380 -497 213 39 -423 464 -267 -119 376 -487 173 178 -444 443 -102 -189 482 -406 84
1914 84 237 -420 393 -38 -272 454 -262 80 388 -404 352 51 -321 454 -224 -37 406 -378 313 138
1934 138 -343 501 -266 -99 411 -500 218 141 -409 416 -177 -135 368 -401 97 107 -381 332 -90 -227 327
1955 327 -309 19 240 -375 268 30 -271 330 -262 -62 311 -358 224 115 -374 392 -241 -92 361 -396
1975 -396 188 144 -352 461 -129 -92 458 -312 225 195 -410 402 -136 -114 353 -333 136 168 -285 332 5 -119
1997 -119 338 -140 57 230 -294 166 28 -221 343 -153 -87 284 -257 163 170 -309 291 -141 -139 414 -328 106
2019 106 204 -388 301 -149 -180 331 -382 45 146 -411 309 -116 -264 346 -348 71 142 -328 219 -81 -175
2040 -175 235 -251 0 166 -297 160 41 -218 205 -133 -77 239 -244 122 134 -220 278 -68 -159 314 -248
2061 -248 126 257 -347 282 9 -169 424 -251 74 227 -326 319 -13 -188 375 -254 69 265 -286 219
2081 219 -68 -158 259 -143 49 157 -254 139 29 -193 185 -60 -156 234 -217 29 77 -327 139 7 -171
2102 -171 209 -256 -36 200 -345 186 -66 -192 241 -280 -31 218 -302 239 17 -174 312 -260 -39 225
2122 225 -289 199 24 -137 254 -129 -33 198 -161 97 35 -157 164 -26 -66 195 -182 64 212 -151 112
2143 112 38 -174 204 -137 -59 159 -260 97 96 -221 300 -171 -50 230 -234 130 50 -220 274 -193 -20 195
2165 195 -217 151 1 -164 189 -90 -29 122 -192 127 17 -155 157 -93 -84 107 -121 -58 36 -122 88 -24
2187 -24 -159 56 -105 -102 84 -194 18 47 -182 149 -91 -125 147 -174 78 40 -254 211 -121 -58 190 -166
2209 -166 209 98 -158 218 -79 34 147 -122 152 40 -23 155 -67 43 97 -39 99 15 -31 92 14 -48
2231 -48 78 -58 -14 47 -100 33 -10 -52 56 -74 -34 100 -161 10 36 -179 99 -114 -131 118 -137 71 16
2254 16 -135 122 -97 -79 87 -167 109 -12 -108 165 -63 -30 52 -116 42 73 -77 73 -36 -48 102 -118
2276 -118 38 28 -73 66 42 -2 75 -24 3 72 -50 103 39 -101 117 -20 -36 109 -70 30 29 -102 123 -28
2300 -28 -27 57 -79 114 47 -79 105 -39 -34 57 -140 95 -18 -59 108 -62 -1 52 -128 -7 -35 -130 89 -70
2324 -70 -92 -23 -113 3 -33 -85 25 -32 -52 112 -40 -8 50 -55 41 -48 -83 75 -117 -8 22 -108 52 -37 -36 15
2350 15 -44 -73 53 -84 47 -1 -53 101 -72 19 83 -44 41 23 -41 84 -14 25 101 -92 89 18 -20 71 -37
2375 -37 5 21 -65 -36 40 -71 15 -4 1 25 -83 32 -38 -92 24 -72 -60 55 -88 -39 -42 -113 21 -115 -33 34 -82
2402 -82 -56 21 -84 -20 -26 -62 40 -101 -42 17 -117 97 10 -55 123 -55 -37 52 -63 37 21 -72 67 -76 -3
2427 -3 64 -37 66 -37 -36 80 -65 34 74 -121 79 47 -99 123 -22 -17 127 -81 90 75 -81 55 10 25
2451 25 90 -91 22 54 -33 105 -21 -10 88 -78 -13 39 -98 64 -6 -125 105 -87 18 106 -145 80 -4 -67
2475 -67 90 -136 -48 98 -160 105 -1 -189 137 -94 -19 59 -118 46 48 -127 71 -68 -62 199 -119 58 58
2498 58 -121 130 17 -58 99 -55 18 85 -115 148 -56 -47 161 -59 26 100 -88 122 83 -86 162 -62 -76
2521 -76 120 -182 73 79 -138 132 -53 -136 145 -136 61 87 -190 128 -69 -151 161 -182 32 34 -185 130 -21
2544 -21 -107 173 -131 13 80 -148 123 -2 -127 111 -138 -60 107 -125 102 11 -187 109 -108 -20 151 -172
2566 -172 81 36 -152 159 -21 -42 164 -138 23 127 -150 139 -30 -108 257 -136 29 118 -178 116 21 -119
2588 -119 204 -109 50 135 -156 134 15 -118 206 -117 -35 151 -121 151 104 -181 181 -92 -46 126 -160
2609 -160 118 64 -162 158 -53 -129 176 -165 -35 75 -242 126 -25 -216 183 -128 -25 143 -245 90 12
2630 12 -188 241 -194 -12 118 -262 142 23 -116 228 -135 -37 141 -191 124 52 -163 149 -63 -14 132
2651 132 -124 42 131 -161 131 15 -107 216 -77 54 179 -193 126 27 -132 173 -59 -73 193 -170 165
2672 165 36 -127 244 -114 -64 220 -194 104 108 -242 194 -68 -70 203 -241 91 73 -214 133 -69 -62 130 -163
2695 -163 -21 84 -220 140 -139 -129 234 -140 -29 118 -156 130 51 -190 233 -119 -35 179 -162 156 31
2716 31 -168 224 -89 -85 243 -189 102 90 -273 192 -95 -61 281 -152 119 104 -242 204 -24 -151 243 -199
2738 -199 63 129 -218 217 13 -128 225 -111 10 198 -225 96 146 -152 209 -87 -69 175 -218 65 115
2759 115 -177 176 -76 -132 252 -235 50 162 -200 160 -53 -98 189 -192 17 190 -245 146 -59 -221 280
2780 280 -227 19 182 -267 198 20 -212 210 -89 -66 217 -246 105 93 -230 235 -120 15 233 -190 54
2801 54 115 -217 145 -37 -153 271 -159 58 206 -197 173 -71 -141 184 -168 -35 182 -272 156 4 -241
2822 -241 214 -154 2 222 -213 126 101 -246 255 -131 -119 243 -242 96 87 -277 226 -74 -137 280 -212 53
2844 53 154 -262 180 -11 -196 262 -186 -54 157 -199 202 28 -210 249 -117 -34 200 -275 173 -9 -212
2865 -212 249 -184 -60 200 -227 102 124 -224 232 -19 -131 252 -162 61 143 -247 233 -36 -44 250 -212
2886 -212 67 159 -272 139 52 -149 238 -144 -39 192 -242 166 88 -220 232 -176 -81 230 -280 67 65 -207
2908 -207 219 -108 -148 232 -208 48 117 -286 178 -51 -156 245 -191 -11 160 -225 150 13 -196 227 -236
2929 -236 -18 242 -276 170 9 -235 244 -135 -20 255 -202 82 121 -229 269 -107 -59 252 -232 73 156
2950 156 -221 195 -2 -110 267 -189 36 204 -242 221 -22 -114 316 -151 6 186 -221 188 62 -205
2970 -205 252 -110 -3 162 -209 119 77 -238 210 -128 -65 228 -259 68 78 -232 179 -156 -143 223 -240
2991 -240 71 149 -199 207 -10 -186 269 -181 -23 165 -313 157 -12 -205 251 -145 -47 171 -215 127 20
3012 20 -157 271 -154 -48 245 -208 131 165 -188 234 -53 -68 229 -177 50 146 -246 209 -1 -111 285
3033 285 -116 -14 172 -202 210 8 -166 263 -156 -46 208 -210 120 80 -189 255 -152 -49 241 -235
3053 -235 104 70 -216 269 -116 -83 194 -196 41 117 -290 220 -54 -155 208 -204 16 158 -264 157 13
3074 13 -199 264 -204 -50 213 -221 108 66 -248 254 -99 -107 212 -267 89 108 -267 292 -90 -55 301 -243
3096 -243 129 105 -231 226 -68 -124 268 -224 38 145 -206 228 17 -148 238 -170 5 197 -256 181 58
3117 58 -181 274 -104 -101 228 -247 167 69 -278 250 -58 -162 234 -228 30 143 -259 223 -51 -163 218
3138 218 -206 35 137 -278 235 -31 -203 252 -176 17 142 -222 166 -42 -197 249 -192 -65 183 -173
3158 -173 106 34 -194 209 -67 -81 226 -212 111 59 -263 150 -47 -110 285 -226 62 146 -208 189 26 -163
3180 -163 233 -134 -14 183 -259 182 28 -188 280 -157 -25 235 -234 174 86 -214 235 -91 -54 188 -222
3201 -222 46 130 -185 173 -62 -88 246 -213 -4 105 -230 130 -29 -192 245 -182 -1 155 -255 142 -54
3222 -54 -195 234 -174 -80 212 -233 125 18 -196 231 -143 -98 220 -242 111 67 -302 227 -71 -48 196 -163
3244 -163 76 100 -259 214 -91 -150 214 -188 17 141 -256 118 39 -163 225 -125 18 184 -184 105 37
3265 37 -147 208 -121 -103 187 -214 93 98 -234 201 -99 -75 225 -237 49 134 -219 160 -38 -95 209 -171
3287 -171 26 127 -219 127 -45 -181 155 -130 -36 150 -202 96 -19 -216 169 -117 -27 94 -202 34 23
3308 23 -199 182 -93 -48 215 -151 63 88 -190 161 -28 -118 184 -170 -13 107 -187 173 33 -172 249
3329 249 -113 -8 191 -207 105 25 -159 269 -73 -18 182 -212 160 48 -130 246 -77 -76 177 -161 30
3350 30 104 -166 159 -62 -81 130 -136 11 74 -219 88 -5 -178 217 -153 -47 158 -189 106 -18 -184 263
3372 263 -74 -56 158 -156 46 48 -194 160 -107 -81 170 -135 60 95 -155 148 -40 -104 235 -154 -5 140
3394 140 -187 137 11 -108 167 -128 5 125 -175 134 -1 -171 216 -145 31 178 -182 161 60 -128
3414 -128 130 -68 -45 203 -138 96 78 -154 123 -38 -22 191 -103 48 69 -145 167 15 -111 189 -148
3435 -148 -25 157 -144 99 0 -93 139 -88 -23 126 -202 57 69 -144 181 -114 -129 146 -156 77 58 -170
3457 -170 150 -42 -45 216 -169 52 80 -205 154 -29 -25 176 -163 19 105 -168 152 31 -136 127 -107 -60
3479 -60 171 -187 92 53 -75 187 -123 -54 91 -135 81 47 -148 74 -14 -112 117 -147 93 69 -207 134
3501 134 -9 -110 157 -72 30 85 -183 96 21 -153 132 -103 -20 65 -201 68 43 -128 106 -99 -38 159
3523 159 -158 44 51 -173 136 -99 -67 140 -119 40 79 -136 148 71 -55 174 -119 4 130 -152 115 -22
3545 -22 -60 136 -76 15 134 -121 43 38 -144 175 -89 -68 128 -193 20 84 -151 99 -90 -93 78 -184 82
3568 82 94 -116 121 -8 -74 156 -93 89 74 -104 78 1 -116 157 -89 -53 68 -87 20 -4 -116 136
3590 136 -97 -100 91 -73 13 54 -107 122 -67 -34 97 -70 -49 18 -125 61 -18 -62 130 -127 -1 82 -109
3613 -109 39 -50 -122 130 -61 39 116 -88 84 80 -62 163 -67 -27 79 -84 71 61 -115 137 -36 -49 186
3636 186 -65 28 49 -95 89 -16 -66 115 -108 13 13 -112 33 -34 -80 84 -25 -5 94 -133 44 29 -120
3659 -120 108 -47 -10 76 -95 79 -22 -84 47 -56 -69 92 -70 -6 62 -106 67 -13 -98 101 -42 44 68
3682 68 -127 43 2 -19 141 -35 -2 88 -62 55 38 -79 94 -29 42 75 -89 33 73 -58 101 -40 -22
3705 -22 16 -73 3 31 -119 58 -16 -30 73 -64 13 45 -14 92 -9 -90 129 -66 16 24 -95 38 43 -81 74
3730 74 -73 -88 84 -95 -26 -15 -70 75 -28 -32 69 -14 -8 64 -72 89 -56 -101 115 -87 51 55 -84 63 19
3755 19 -1 93 -43 -15 122 -107 32 4 -33 67 -71 26 57 -65 40 54 -60 59 -70 -9 68 -121 12 41
3779 41 -94 110 33 -25 76 -51 37 46 -90 91 25 -20 86 -32 -6 17 -52 16 -4 -91 60 -11 -27 59 -121 11
3805 11 9 -39 18 2 -45 54 -23 9 77 -100 105 -21 -65 55 -115 18 58 -81 1 -30 -64 20 -17 12 82 -61 42
3832 42 -23 -62 49 -42 16 92 -75 -17 18 -41 86 -49 3 103 -51 32 -7 -72 -4 12 -41 28 -61 34 54 -45 53
3859 53 -21 -28 61 -20 18 24 -36 0 12 -67 29 -8 23 88 -56 30 15 -53 50 0 -32 94 -62 5 -4 -61 81 16 -68
3888 -68 69 -40 -28 34 -82 38 16 -95 133 23 2 84 -61 29 -36 -59 83 -5 -19 50 -87 17 71 -40
3912 -40 58 -12 2 36 -46 -26 50 4 19 -35 -52 41 9 17 15 -61 69 36 -61 83 -7 -6 52 -45 49 -5 -32 63 1 15 81
3943 81 -40 12 -34 -45 14 -33 -3 52 -31 -20 25 -61 30 12 -46 18 -15 23 -9 -30 39 -14 -73 16 -42 -18 -21 -36 45 12
3973 12 -28 55 -2 -3 61 -37 -23 -48 -22 63 -30 -9 72 -1 8 4 -10 42 55 -48 0 -11 13 13 -22 38 23 15 23 -29 -3 76 -38
4006 -38 15 21 -8 -20 36 -26 35 -32 -65 41 -53 -11 -23 -48 -13 -60 -28 27 -68 9 21 -45 5 5 3 11 -61 5 13 -64 36 -32
4038 -32 -10 22 -14 8 -22 -73 33 -24 -18 -11 9 48 21 6 42 -43 24 36 -5 4 14 -9 8 11 -4 26 -32 -36 47 -7 -37 -10
4070 -10 18 40 -22 9 -3 -43 -42 21 -18 33 -12 10 26 -22 -48 23 -9 21 9 -32 -6 4 -3 47 -33 28 17 -43 6 -30 -51
4101 -51 31 -49 -9 63 -40 12 16 -28 12 -10 2 63 -10 36 6 -43 6 -27 -36 7 -51 -38 17 -11 -4 -6 -27 32 -29 -26 3 -11
4133 -11 -18 8 -1 -29 -4 4 69 -52 65 32 75 54 -41 5 6 -26 -8 -37 -55 27 -36 30 0 5 4 37 -13 29 -21 -46 35 -15
4165 -15 -57 6 -57 22 -27 -5 30 29 -61 1 -43 28 42 15 1 -27 -47 21 -29 13 4 -19 11 -13 -9 -26 -31 -28 29 -22 55 -6 29
4198 29 39 5 15 71 18 42 3 19 31 -10 10 26 14 83 -13 -46 27 -38 -42 10 7 42 -41 7 28 17 9 -7 -24 40 43 -16
4230 -16 25 18 -32 5 -5 1 11 -62 74 -24 -42 27 -52 -12 -51 -40 -24 -24 -31 -3 8 -46 -37 -26 25 18 -24 -12 19 -45 29 -32 41
4263 41 -23 -88 -3 -17 -35 -9 16 -61 27 -28 -9 32 7 49 57 12 34 -30 4 45 -73 8 -43 -27 49 -1 43 34 -62 39
4293 39 0 0 30 -28 33 6 -45 32 -6 1 13 -30 -21 30 -16 24 30 -53 85 -35 -46 -5 -52 -7 44 -43 44 -42 -30 50 -3
4324 -3 -11 50 -63 10 -18 7 -54 -24 -28 -16 5 30 -24 -12 23 -23 -14 24 -68 6 66 1 39 10 -17 72 -10 40 50 -56 44
4355 44 -31 5 56 -8 59 30 -49 38 -8 -51 15 -1 -8 59 -66 26 42 26 72 -23 -70 34 -32 -15 15 -63 31 0 -5 10
4385 10 -59 -14 10 -59 44 -24 -42 13 -30 -9 36 -31 -16 10 -25 40 -21 24 -21 -54 39 8 8 28 7 -6 54 -28 16 12 -21
4416 -21 49 5 -13 -17 -80 35 30 -55 18 -25 8 58 -56 10 -16 30 51 57 -34 17 -19 -26 72 -1 13 -8 14 43 -16 -44 48
4447 48 19 47 -4 -43 41 -14 -2 87 -64 54 18 -36 25 32 -14 63 -30 -61 2 -27 -8 -13 0 -5 28 28 -4 3 -36 -9 -73 66
4479 66 -47 -28 59 -39 -14 19 -30 -61 26 -18 28 2 23 9 -16 -5 22 -41 33 -25 -29 25 -98 8 56 -32 52 7 37
4508 37 -8 -18 -11 37 36 73 -49 -25 90 -53 7 83 5 5 68 16 18 -18 19 2 -5 39 2 10 75 -9 2 -38 -74 18 -32 -29
4540 -29 46 4 -29 50 -39 5 54 -28 35 -8 -14 40 -55 10 25 -105 53 1 -83 4 -55 20 8 -28 7 -9 25 63 -21 27
4570 27 62 6 16 42 -11 68 -35 52 28 -31 -20 3 -35 4 -28 16 75 -70 38 0 -62 45 11 5 57 -14 -34 -21 -44
4599 -44 28 -26 -39 28 15 9 -22 -44 29 -16 13 47 16 -36 37 -48 26 47 22 18 23 -69 34 -12 6 5 -56 79 -40 -34 1
4630 1 -21 7 -1 -91 22 36 -24 54 9 -23 48 -46 35 17 -29 18 -3 36 5 -18 1 29 -60 30 -46 21 92 -25 65 -8
4660 -8 -3 45 -26 -17 11 -12 27 16 -57 21 -9 -63 10 0 30 -16 -50 36 37 31 59 -39 13 70 -21 -23 6 -53 33 4 -51 49 -14
4693 -14 7 4 7 65 -1 -34 -33 -35 -18 49 -68 3 -10 20 31 1 -4 48 -63 -30 -35 -24 -5 -22 -9 9 -50 48 68 -46 43 -47
4725 -47 -49 -5 -64 26 29 0 53 -65 -44 59 -50 -3 54 -35 -16 -18 -53 28 -2 -36 -24 -12 15 39 -17 9 -33 -18 -19 -3 -5
4756 -5 28 -77 33 -6 -31 40 -79 21 -1 -19 -15 9 -23 34 -7 -48 -33 -27 11 29 -19 16 19 36 28 -20 27 -20 -40 17 0
4787 0 -67 13 9 -33 54 -58 17 -70 -94 27 -13 -30 16 -9 -2 -32 -14 16 -4 -8 -13 -1 42 53 9 40 -6 46 40 -38 30 47
4819 47 32 24 3 -42 36 -41 -7 -21 -60 -19 -10 -18 59 -103 16 16 -20 52 -24 -30 15 -58 -12 42 -2 12 49 16 49 6 2 11 -41
4852 -41 14 -27 -91 36 -27 -26 39 9 33 -39 -39 -26 30 -1 -52 -44 -16 -20 6 1 24 -22 -10 -13 32 44 16 34 0 -34 43 26 -5
4885 -5 38 -13 43 -18 45 42 -18 51 53 -2 17 23 -37 38 12 16 38 -41 12 43 13 -50 -27 19 -7 -17 -33 15 -61 58 -11 16
4917 16 -3 6 23 15 -54 39 38 -57 32 10 3 43 -52 26 -17 -40 14 -27 1 47 -29 -59 45 7 17 -4 10 12 2 -5 9 -15 0
4950 0 54 19 53 18 -31 10 1 21 -45 -41 3 16 -21 20 -4 7 31 10 -20 -9 -11 34 15 23 16 21 -5 3 8 66 5 -22 17 33 -21
4985 -21 -23 23 42 1 -45 23 -20 46 -16 -53 40 -13 14 77 -37 31 21 -43 36 26 43 47 4 29 17 3 -1 9 -1 -8 1 40
5017 40 64 -36 -13 -23 -4 50 -31 -8 18 -26 17 36 -15 22 -1 36 49 14 3 32 -38 48 29 -22 22 -21 -20 -18 -6 9 -8
5048 -8 -20 -20 -50 27 7 -30 -13 -10 -10 26 -15 28 41 -53 70 -35 -6 54 -12 11 -4 -29 16 7 -40 26 -27 23 15 13 -18 9 -4
5081 -4 -26 -27 -2 73 -40 52 27 -38 32 -20 -29 13 -22 25 28 -2 1 -36 5 7 -25 -11 6 -29 42 13 1 47 -59 -11 24 -14
5113 -14 21 5 -30 -57 -74 -2 24 -14 -15 61 -13 36 -7 -33 20 4 -18 83 -3 4 -15 -51 24 -11 -19 -25 -8 -50 34 -2 71 39
5145 39 -9 20 -52 -16 2 -80 -21 -67 11 -11 -12 52 37 -9 41 -43 -27 15 -50 -46 14 -17 22 6 18 3 32 2 32 -48 11
5176 11 -44 -66 24 -26 -7 4 -9 -20 -12 -52 55 0 -34 64 -6 18 44 -27 26 8 -28 57 -10 2 41 -8 -15 -11 1 -20 -13 23
5208 23 -8 -36 -19 -22 -17 47 -41 20 36 -19 11 -43 7 -7 -9 -11 -7 -9 3 20 5 4 -46 -57 -24 -3 -4 9 -4 -23 10 60 38 17
5242 17 -39 22 -11 50 33 -28 33 29 -6 18 3 -39 23 32 8 -19 2 49 -26 -45 12 0 28 -11 -19 46 -52 41 19 -2 -23 -1
5274 -1 7 28 -25 16 6 -14 25 -70 -6 53 37 0 24 10 28 48 -36 -4 3 -77 -17 1 30 -39 13 26 23 -37 45 -1 -33 -43
5306 -43 -2 -10 -19 31 -27 2 14 58 21 32 36 -42 20 17 37 -23 7 10 -19 -4 12 31 -16 14 23 17 49 25 2 -25 -7 19 -55 25
5340 25 14 -14 1 -50 16 -22 -7 20 49 21 29 15 -36 -14 3 38 22 15 -22 13 35 12 6 -10 73 -31 -36 -11 -6 5 19 -15
5372 -15 73 -55 22 12 -31 5 -53 -10 20 18 4 45 -3 -4 -4 55 11 5 2 58 -49 -42 -11 5 -9 -32 17 41 18 -4 -11 24 39
5405 39 4 -34 24 4 45 44 15 -16 19 15 28 23 -60 32 -26 21 35 63 -13 -39 34 10 -26 -40 -28 18 39 -22 27 0 -25 15
5437 15 -12 -6 -7 1 29 4 7 -18 1 -23 37 19 70 25 10 14 46 -18 33 6 26 -17 -75 29 7 48 16 -18 -11 32 -2 -17 4
5470 4 16 22 22 -14 -10 -54 0 -21 -48 23 32 30 -32 65 11 42 -2 54 78 -24 61 -23 -14 -13 6 -13 -10 -6 28 31 -45 23 65 -3 -21
5505 -21 2 -72 1 5 21 -33 34 9 3 39 -17 3 5 -10 70 32 -31 10 3 -20 9 -8 -5 8 -50 35 31 -30 -7 -47 -4 24 -20
5538 -20 47 -3 -22 -4 12 41 -13 -18 -19 -6 7 34 -4 9 27 -41 -31 14 3 -10 -7 2 12 -48 20 10 -19 85 3 -27 0 24
5570 24 -58 25 -8 38 21 -37 -34 16 -31 39 -1 36 28 8 -4 -34 34 -13 7 -13 33 5 10 -11 -22 9 26 38 -14 37 -46 8
5602 8 19 9 -35 3 5 -31 48 -28 -34 10 -59 -35 1 10 -22 -17 27 29 26 -36 18 13 50 5 -32 10 -43 -14 44 14 -26 -36 -16 48
5636 48 -47 -1 27 13 1 -2 -43 -3 14 24 -12 -26 28 32 -5 6 52 -16 -17 -9 5 20 22 43 -27 -14 -31 20 -35 26 21 -14 43
5669 43 -8 7 19 24 0 5 -4 0 14 -22 -15 -25 -13 -38 5 0 -13 -24 38 -20 4 8 43 -22 8 -2 -10 4 41 6 -5 8 -32 -8
5703 -8 15 -25 38 -8 6 34 -33 87 -9 40 -51 -45 40 22 12 31 -30 -9 -18 -39 7 -21 14 -2 20 20 32 -11 -24 15 -58 -43
5735 -43 18 27 -4 -34 -57 36 -8 8 34 -31 26 -13 -48 -24 9 32 -6 -53 -47 -4 12 -39 20 7 28 -2 -12 -44 0 14 -9
5766 -9 22 -13 47 -3 -5 -20 -23 50 23 -4 20 21 -39 -15 18 30 48 4 -4 35 11 28 10 -33 29 28 -2 -15 9 33 -15 1 -2 -30
5800 -30 -21 -1 -7 -11 -5 -42 -19 -39 -71 -27 3 -29 -43 -18 -16 -30 6 -28 -2 -19 10 7 -52 -16 -17 -11 45 56 -9 -18 18 -33 -36 21 -10
5835 -10 -66 -16 -8 43 11 -61 50 19 -31 -21 35 -5 -5 13 3 -23 -34 24 28 11 3 -41 54 10 6 -29 -10 -29 -23 32 -25 -4 29
5868 29 25 14 10 -11 -46 -4 -3 -32 -16 30 -5 -3 9 26 16 -8 5 50 37 6 25 -56 -57 20 16 17 11 -13 -2 -20 -1 15 -13 61
5902 61 -22 -31 14 0 28 -32 -11 30 -20 -25 -6 -36 -36 25 42 27 -42 -2 32 39 16 37 7 50 -6 -19 18 -13 -15 -2 7 -35 -14
5935 -14 -15 -15 8 -20 41 -11 -8 -82 -54 53 -60 -3 22 26 7 -16 -7 -27 -36 -46 48 -39 28 -1 32 -3 -34 26 9 73 -9 11
5967 11 -21 58 -68 -11 0 -62 14 17 -61 -3 -37 -24 14 28 38 -51 24 36 22 10 -1 -8 -10 54 24 -9 11 5 -2 -22 -3 2 42
6000 42 11 -15 36 20 -15 7 45 29 7 16 24 -5 -24 19 3 16 -10 -16 15 18 1 7 -11 -10 -7 8 12 54 15 23 54 5 6 21 19 -21
6036 -21 5 9 35 46 30 15 16 21 22 46 -43 -34 -17 70 31 -15 18 -64 42 9 27 27 -34 -14 26 41 61 58 -4 -20 17 11 23 0
6070 0 50 24 36 18 -13 11 6 18 8 4 -3 10 -27 -44 -43 -61 25 3 21 -4 -31 -21 -39 3 -16 -26 26 -50 -33 -89 21 -55
6102 -55 4 3 -8 -53 -33 64 58 8 -49 18 -38 0 -21 14 9 -9 34 16 -24 -4 20 -29 5 -24 13 -55 -11 33 3 -11 -21 19
6134 19 -31 9 -52 -35 5 15 45 21 -26 18 -43 26 39 -21 -9 3 -19 -7 -47 -18 30 9 -61 11 -4 30 2 35 33 -25 31
6165 31 -19 -8 59 -19 -57 5 6 -42 10 -34 10 8 9 18 -23 -25 -16 -54 -12 2 -62 23 -14 -2 5 -19 41 14 -20 -28 4 4 -5 2 -33 68
6201 68 -30 -11 36 -19 37 -5 -24 -7 25 22 -10 13 13 0 22 -7 26 6 31 20 34 23 -30 13 -31 -10 26 -53 6 27 1
6232 1 -4 -26 22 -26 7 15 15 27 -22 -38 -8 13 -4 -6 43 -14 10 4 -6 30 4 27 -6 -52 27 1 -22 -13 -7 10 -5 -44 15 -21
6266 -21 -47 -23 -43 -48 -17 36 -17 -18 -33 24 -11 -6 3 -4 51 -4 -20 44 3 -22 -6 3 -32 -6 -17 0 -29 -34 -5 -2 -21 10 47 25
6300 25 36 -45 30 11 -7 13 -56 -17 19 -17 21 19 -9 15 67 -6 44 -18 70 52 -51 4 -36 21 5 9 13 26 45 35 29 30
6332 30 -17 46 -12 83 -3 21 -21 -12 -16 -39 5 -17 -47 -11 -5 -2 37 6 -28 1 -6 12 4 -13 -2 35 -19 -6 -26 8 8 34 42 -13
6366 -13 48 50 50 -17 14 1 55 -36 -35 15 -48 30 -7 -1 -37 -69 -35 30 -19 19 -43 -9 0 26 7 26 -34 3 1 -6 -40 -49 20 1
6400 1 -61 -17 -2 -65 16 -43 -12 -2 -52 -50 0 -5 -48 -10 -56 79 -6 -28 5 -59 16 -4 25 5 -29 24 -44 -38 -87 32 18
6431 18 5 18 -10 46 39 35 55 40 27 -33 -20 -11 -32 -8 -14 -45 8 7 -8 -23 -14 9 -11 -2 -42 -18 -49 -11 3 46 -6 -39 40 -29
6465 -29 5 -76 -30 19 31 -7 5 -55 -4 23 -13 49 26 -7 -21 11 -26 45 23 -7 4 5 -13 -53 -45 -42 -26 5 -2 -36 1 41
6497 41 23 11 63 -12 54 39 37 -4 -37 12 37 13 40 19 21 2 -49 -56 46 8 26 -34 -2 11 41 13 16 -34 -47 -24 17 -6
6529 -6 25 -18 2 35 19 -56 -12 -26 -2 8 -14 -21 -16 3 -12 12 -18 -21 24 2 -10 0 28 -21 12 -10 18 -41 -1 -1 39 15 17
6562 17 -3 -1 -40 -14 -24 -20 4 -5 -49 -17 -21 58 -4 -14 -35 -7 -21 59 -24 -19 -59 -27 4 -23 -26 -27 -6 -21 23 -16 -4 13 13 0
6596 0 -7 -43 14 3 30 -4 18 3 -19 2 0 -31 -24 -4 -62 -30 -15 -3 -38 75 -31 1 23 -35 22 9 -12 -38 -14 10 -36
6627 -36 41 -35 -37 -17 36 22 -33 -58 -29 -60 25 16 -18 21 29 -36 -21 16 -36 -5 24 -36 0 -1 -35 14 -20 11 -32 19 29 -6
6659 -6 -30 -5 -41 -42 -17 -17 32 -21 34 -41 46 -1 10 40 -39 -22 34 3 -17 -20 35 -6 3 26 -29 13 -1 -14 9 -28 12 -16 -47
6692 -47 46 2 -26 37 7 19 11 -14 -2 39 -21 3 -29 14 8 5 -32 -40 -36 15 -36 48 -12 8 -10 -12 -26 24 -26 10 -9 -16 1 9
6726 9 25 -46 -27 -1 37 -10 19 38 -13 -14 -6 -34 17 -9 8 -29 28 26 9 -6 -41 -19 -42 32 -68 39 -1 14 -26 29 4
6757 4 -43 8 -31 20 -6 -63 -9 -11 9 -6 -25 -3 -26 -1 -57 34 28 5 -1 23 10 33 22 -37 -4 27 20 0 15 32 8 -19 27
6790 27 12 4 18 4 -11 7 31 -18 -14 -8 -34 15 -9 7 -19 -36 -27 45 18 11 -33 43 -6 19 1 14 0 -3 -34 -3 -27 -12 57
6823 57 -48 15 -8 30 21 -28 12 1 -21 28 30 -31 23 -24 -13 -28 26 38 -36 33 0 -43 -7 -9 9 -48 -1 9 12 -9 -31 -29
6855 -29 1 36 21 -1 -22 7 -6 104 -14 -3 12 -37 -31 -57 -33 -33 -29 0 10 16 -25 16 -2 -29 -13 -4 33 8 -70 -18 -23 27
6887 27 -5 0 -34 1 2 -11 -10 33 31 24 -38 9 -2 -5 -9 -2 -19 39 65 14 -17 17 -36 -9 12 2 -12 4 15 23 -29 -9 32 10 -9
6922 -9 -28 33 -23 26 -7 -3 -21 -41 8 -17 -1 -4 -14 27 54 -3 13 14 -4 -6 -9 -2 29 13 -44 -44 -21 5 -14 -3 46 10 5 4 -41
6957 -41 5 -28 9 -3 16 -8 31 -2 -29 -24 8 -11 -25 10 -37 8 -24 -34 -39 2 -61 35 1 17 7 -10 26 38 2 38 12
6988 12 33 0 -28 20 8 14 -67 10 49 48 31 24 -40 11 -21 35 -24 -16 -41 -21 8 -11 19 11 40 27 -30 3 4 30 18 -59 35
7021 35 12 -13 -25 -7 -1 7 29 -40 -29 -21 1 44 7 -2 -16 -11 18 -35 12 -16 -33 12 -2 -27 64 -10 -30 -12 -4 -32 -14 -8 -8 2
7055 2 -56 18 -11 15 -2 -2 -3 -38 -15 14 2 34 -13 16 33 -48 -8 -19 6 7 -25 -28 17 -6 -28 16 -28 -45 8 -13 48 -35 -7
7088 -7 -24 9 -9 16 -1 26 20 -13 0 33 -53 14 11 45 -12 31 11 4 -23 10 -34 -19 -8 -7 8 14 31 8 -24 2 9 -11 38 66
7122 66 13 -19 80 -29 -33 12 24 19 -11 -37 -13 -43 51 45 -60 2 0 -13 4 -26 -17 -20 27 0 0 -28 -27 12 -5 -56 -8 6 43
7155 43 -4 2 5 42 -6 -29 14 -42 -3 -1 -7 -45 -24 36 -9 25 -53 -34 23 5 -47 8 8 -25 -14 0 27 -5 -17 3 11 32 -10
7188 -10 46 -50 20 19 -3 41 -64 8 -1 32 -13 -23 -11 -22 -16 10 7 10 -22 -35 -5 14 -14 29 -41 -9 38 -28 36 20 11 -9 21
7221 21 -3 -27 -29 -58 -20 11 -41 -13 60 14 20 10 -44 -19 -6 0 -41 -17 -17 15 -39 -30 -32 -23 -7 77 16 -1 -36 6 12 12 -6 6 6
7256 6 32 -39 40 -1 13 -38 18 4 52 -7 62 43 32 -3 -20 19 -4 10 -9 -7 43 -35 9 -34 0 -23 7 -22 1 12 -70
7287 -70 -4 -46 -18 24 15 7 -14 7 -5 18 -17 27 3 -33 29 10 48 4 0 -15 0 13 -11 21 -13 -39 26 -35 19 67 16 0
7319 0 -37 -30 -18 -3 -25 -4 9 -4 -21 -41 -23 10 -30 -2 18 29 41 23 13 8 -5 -10 35 -12 25 41 -5 -31 -20 -22 36 -19 -16
7352 -16 6 -29 -51 46 5 -51 36 -11 -11 -20 -53 23 -25 -16 17 -3 -15 -7 -59 10 -14 5 -3 20 -19 -50 3 16 -24 31 -16 26 -41
7385 -41 35 19 -10 37 -28 4 18 -45 -22 -47 -21 -88 2 14 18 -20 -12 -13 8 21 -7 5 -18 -13 -4 -2 -2 -9 -27 -50 -38 13 -51 -49 -15
7420 -15 32 13 4 19 22 -19 33 -16 -38 -17 -36 -19 9 -8 10 -41 20 -36 -54 -15 -12 35 58 4 -8 -23 0 -21 -33 -27 5 -27
7452 -27 41 -4 3 -39 -19 -5 -19 -41 26 -24 -5 -56 13 20 -11 4 -2 -4 28 -1 3 22 6 -29 -40 -30 -4 -21 -67 -38 -7 23 -18
7485 -18 -22 -36 -9 -13 -17 -3 6 22 6 -36 -13 15 11 18 -5 -14 -19 -26 -33 -1 23 -9 -30 -23 -37 38 -47 15 -19 -5 1 2 42 -47 3 -25 -26
7522 -26 -6 -38 -46 -44 -32 35 -30 -35 14 -6 19 19 4 -19 24 10 -5 -31 36 0 -23 0 26 31 36 20 -24 -38 -34 20 14 19 16 -24 25
7557 25 -23 -25 -48 5 -44 -36 0 -10 -5 4 27 31 -53 -26 19 -9 38 27 -11 27 18 4 16 18 -8 1 23 -20 -61 -7 -34 47 -5 -9 -11
7592 -11 -18 -14 -19 -26 13 -8 -58 -3 -29 -12 -15 33 30 -24 -4 19 -13 -74 14 23 8 13 -16 -29 -1 -30 -14 4 4 21 15 7 9 -21 30 -18
7628 -18 -67 6 36 -23 32 -23 -14 -13 -15 -3 2 -20 -11 -26 -5 24 -6 5 17 -3 9 32 20 3 -24 7 -39 -10 -3 46 28 19 89 -4
7662 -4 -38 8 -28 6 -5 -10 -13 1 -3 7 1 35 28 -29 -29 -16 -18 19 19 -18 -31 11 -5 -40 -7 -24 -6 -42 13 11 34 -40 20 -36 -31 5
7698 5 -20 -19 19 -16 14 39 18 -19 0 -27 8 6 -42 23 -34 -85 25 25 -82 0 63 0 1 0 27 29 47 -16 23 -23 -21 2 -31
7731 -31 12 -5 -9 16 28 -42 -24 -29 -1 -51 -31 -33 31 -18 -1 -17 -66 8 0 3 -1 -15 -8 -26 14 17 16 -39 -41 -33 -16 -31 44 -70 38
7766 38 32 40 9 -32 45 23 -16 19 21 -10 4 -23 54 -15 81 25 24 6 -9 -90 49 24 -32 34 -21 0 21 -37 -4 13 -10 -73
7798 -73 -11 20 58 -7 -21 20 49 -9 -11 3 39 -9 -7 -34 -17 7 21 39 2 -51 -15 -40 22 20 -35 -11 -19 12 -41 -30 -42 30
7830 30 -4 7 -4 -20 -11 2 27 35 2 -2 -13 -41 7 2 -33 -47 -63 22 12 5 -32 4 22 -9 -34 2 -7 -46 20 -11 28 -5 -8 3
7864 3 -10 -31 -40 -38 -28 -51 -60 7 11 -35 34 10 26 56 15 37 -26 -4 -10 39 -15 16 -2 11 42 -52 -10 -16 28 -27 -12 -9 19 48
7898 48 -8 -17 25 9 -29 15 26 21 -28 -36 32 -26 -53 1 -42 7 -41 56 31 -45 5 -4 1 -31 55 40 3 24 52 -15 -5 17 10
7931 10 0 3 -35 -14 -23 59 -17 32 15 5 -2 -2 18 2 5 17 -38 -12 -46 -36 12 -14 -7 4 44 -7 16 -37 -3 -4 1 -32 -33 15 35
7966 35 -16 8 -21 21 -1 -25 14 -6 18 12 -5 32 -7 -23 -17 26 12 50 16 -2 -3 -63 -24 -42 31 11 -10 24 18 -34 17 3
7998 3 4 -10 8 -14 -42 53 -10 -35 -4 -55 25 22 30 -10 32 52 -14 -23 -33 -20 -8 -10 9 -38 -34 1 6 21 20 15 -9 9 -17 -23 4 -17
8034 -17 -18 -5 -28 -30 -54 17 24 -24 18 -28 -45 -21 -14 -9 34 -1 16 -47 -34 25 -10 -21 -11 -14 10 32 22 35 -33 30 9 -1 -24
8067 -24 0 -27 11 10 -17 5 14 -19 0 -58 -11 28 24 13 10 27 16 -28 -17 -70 -8 -13 -45 -15 -6 38 25 35 -15 -47 -16 9 12 24
8101 24 -25 38 -5 -10 -7 -9 -26 10 -43 -21 -13 5 20 -68 -23 -25 -26 25 -35 5 -17 -12 31 -17 -26 -12 -19 -25 -10 15 11 23 -19 -1 -8 20
8137 20 -11 -3 2 0 22 29 4 1 -27 14 23 31 1 -35 32 -38 8 24 -8 -45 14 12 -41 -19 -27 -20 22 -21 -24 -19 1 3 30 -20 -6 22 25
8174 25 5 -59 -18 -16 27 -2 42 -2 19 4 -6 12 14 11 10 -19 20
8191B0
$$ Imaginary data points
##PAGE= N=2
##DATA TABLE= (X++(I..I)), XYDATA
0 0 0 0 0 0 0 0 0 0 0 0 0 0 0 -7 8 -8 8 -8 13 -16 16 -24 24 -32 32 -40 48 -49 56 -66 80 -88 98 -112 128 -143
36 -143 160 -177 199 -221 245 -271 301 -333 366 -405 446 -492 542 -596 655 -723 797 -879 973
55 973 -1079 1200 -1340 1502 -1699 1936 -2229 2605 -3100 3788 -4799 6434 -9472 16897 -69078
70 -69078 -71747 48029 -117226 34794 -2476 -85059 46286 -61707 -25071 37381 -60100
81 -60100 26173 -10555 -30848 28364 -28676 1410 5305 -28922 12122 -4214 -13868 5150 -16664
94 -16664 -31515 4019 -21655 -25757 17647 -53025 -24956 114 -79915 14452 -26984 -73229
106 -73229 28682 -83822 -37055 11014 -99222 14790 -41793 -74539 26930 -82093 -17166
117 -17166 -2882 -83148 20480 -46152 -36986 24078 -66715 5598 -11440 -49972 29800 -31134
129 -31134 -12566 17041 -38831 6388 2624 -21649 14176 -5071 -16264 10842 -6208 -12644
141 -12644 15453 -15249 -11312 17071 -28015 7136 5055 -36399 21374 -24443 -17598 24045 -44375
154 -44375 10354 -6211 -42802 28330 -36479 -10322 17908 -52531 19884 -14827 -34354 30783
166 30783 -40725 -739 11872 -41180 22900 -14093 -20574 22568 -27072 3546 9682 -21997
178 -21997 13892 -5195 -10441 13378 -8136 -430 9991 -9146 2223 7998 -11126 9665 4040
191 4040 -12241 17252 -8657 -4602 18538 -20238 11725 6601 -21316 24809 -14041 -6419 22535
204 22535 -27827 15985 3143 -22644 27209 -19403 -2470 19172 -27711 17486 -889 -18475
216 -18475 23698 -18583 -109 14646 -22842 14339 -1006 -14477 17180 -12256 -2887 12056
228 12056 -15789 6013 4428 -14508 11669 -4123 -9578 13936 -11996 -1362 11226 -17485
240 -17485 9045 2282 -16140 17773 -11307 -5596 16691 -21199 10111 4650 -18906 20290 -11912
253 -11912 -5962 18223 -21851 11000 5107 -19352 20591 -11386 -5740 18011 -20458 9262 5844
266 5844 -18135 18014 -7472 -8222 16726 -16794 4234 9200 -17090 13330 -3009 -11734 15341
279 15341 -12123 -429 11596 -17239 8944 1003 -14666 16065 -10291 -4811 13709 -18684
291 -18684 7635 4509 -17799 15857 -8975 -9030 16635 -18080 4624 7125 -20340 14138 -5415
304 -5415 -10754 16495 -16051 204 8243 -18496 11956 -2092 -12489 14503 -13941 -1332 10421
317 10421 -17161 9678 -601 -13991 14722 -10372 -3621 12264 -17438 6628 3529 -14820
329 -14820 14787 -7422 -7648 12936 -15082 4203 7343 -15221 11576 -4591 -9864 13975 -12118
342 -12118 1285 8257 -15662 9550 -1140 -10359 13454 -10464 -2096 9959 -14222 8217 1655
355 1655 -12354 12244 -8160 -3368 11792 -12747 5451 3216 -13001 11827 -4924 -5156 11786
368 11786 -12634 2991 5127 -12655 10484 -3644 -7818 10819 -11012 708 6380 -13397 7277
381 7277 -2352 -9421 10391 -9556 -2071 6105 -13381 5361 -114 -10091 9373 -8301 -4103 7648
395 7648 -11885 4766 2100 -10496 9153 -5423 -4037 9591 -9449 3598 4666 -9217 9640
408 9640 -1753 -4112 10336 -7335 3030 6804 -7766 8870 18 -5082 10266 -5714 1563
421 1563 7623 -8700 6839 788 -6920 9540 -5648 -1560 7191 -9802 4404 1310 -8997
434 -8997 7857 -5871 -3836 6741 -10081 2732 1226 -9651 6858 -5026 -4361 6955 -9069
447 -9069 2015 2582 -8908 6940 -2704 -4228 7685 -6637 1520 4825 -7082 6312 361 -4424
461 -4424 8258 -4032 326 6601 -6313 5405 2437 -5207 8260 -2907 -1425 7617 -6805
474 -6805 4097 3391 -7039 8009 -3103 -3105 7821 -7745 2972 3374 -8067 7259 -3148 -3994
488 -3994 7404 -7636 2155 3286 -7791 6262 -2366 -4078 6694 -6072 968 3854 -6613
501 -6613 4651 -306 -4535 6005 -3842 -828 4903 -5701 2873 1892 -5488 5595 -2165 -2874 6235
516 6235 -5959 1672 3453 -7111 5981 -1742 -4300 7286 -6579 1050 4265 -8015 6084
529 6084 -1486 -4805 7327 -6362 965 4077 -7317 5438 -1144 -4162 6217 -5109 519 3752
543 3752 -5905 3991 -131 -3989 5095 -3286 -995 4070 -4754 1771 1860 -4875 4057 -1136 -3318 5068
559 5068 -4292 -68 3658 -5975 3762 -3 -4734 5953 -4422 -597 4679 -6735 4299 166
573 166 -4939 6601 -4497 -196 4804 -6351 4406 356 -4217 6111 -3671 -111 4337 -4995
587 -4995 3449 830 -3510 4549 -2077 -958 3639 -3499 1474 1778 -3617 3067 -522 -2571 3743
602 3743 -2843 -516 2996 -4442 2180 688 -4338 4248 -2824 -1618 4119 -5259 2297 1059 -4869
617 -4869 4859 -2839 -1463 4434 -5283 2713 1245 -4343 5006 -2481 -958 4249 -4123 2522 1339
632 1339 -3189 4038 -1278 -742 3654 -2494 1549 1815 -2535 2883 67 -1394 3321 -1602 4 2806
648 2806 -2729 1922 1221 -2851 3489 -1246 -1369 3626 -3521 1316 1699 -3836 3628 -1271 -1957 3736
664 3736 -3829 1332 1538 -3878 3604 -1686 -1684 3393 -3555 1335 1382 -3430 3015 -1206 -1540 3000 -2742
681 -2742 628 1548 -2718 2079 -163 -1762 2426 -1514 -296 2058 -2227 1240 731 -2204 2479 -924
697 -924 -884 2626 -2392 1003 1484 -2740 2870 -644 -1455 3247 -2568 879 1965 -2953 2842 -421
713 -421 -1590 3155 -2274 703 1858 -2636 2409 -206 -1418 2742 -1880 324 1736 -2279 1758
728 1758 111 -1598 2277 -1305 -321 1891 -2050 1047 696 -1920 2019 -851 -995 2041 -2056 537
744 537 1096 -2263 1832 -605 -1443 2126 -2006 236 1284 -2413 1741 -315 -1620 2214 -1763 -33
760 -33 1466 -2280 1362 2 -1691 1972 -1383 -241 1546 -1897 1087 349 -1528 1905 -909 -466
776 -466 1802 -1647 890 828 -1531 1837 -382 -769 1948 -1350 533 1281 -1570 1649 -38 -919 1978
793 1978 -1111 286 1379 -1474 1331 162 -1030 1803 -946 -42 1403 -1556 989 295 -1264 1563
809 1563 -901 -378 1294 -1558 586 430 -1478 1302 -696 -767 1296 -1478 342 584 -1565 1100
825 1100 -404 -883 1332 -1263 12 877 -1464 974 -89 -981 1292 -967 -53 928 -1266 798
841 798 187 -917 1221 -673 -163 1070 -1235 726 371 -1025 1264 -376 -305 1170 -1100 542 647
858 647 -1045 1146 -219 -446 1242 -899 341 736 -968 964 -81 -534 1166 -685 170 776 -963
875 -963 753 95 -662 992 -579 -123 761 -997 399 254 -939 730 -401 -499 779 -918 117
892 117 313 -1036 635 -380 -698 750 -1040 17 376 -1132 641 -400 -774 742 -972 -27 455
909 455 -1043 443 -172 -657 736 -582 -84 423 -643 330 -1 -358 487 -231 -73 475 -324 294 371
928 371 -418 528 105 -257 753 -263 67 630 -539 508 357 -514 853 -317 -35 770 -607 488
946 488 154 -487 685 -386 52 495 -624 409 -58 -375 492 -435 47 190 -444 206 -82 -199 89
965 89 -234 -106 30 -130 -96 56 -231 -117 78 -204 44 -44 -341 287 -271 -87 306 -474 265 -5 -349
986 -349 469 -316 81 330 -379 402 -40 -65 407 -237 324 112 -83 429 -149 223 93 -55 404 -73 220
1007 220 141 -25 259 -129 183 109 -57 306 -132 172 242 -239 400 -113 -37 302 -271 295 -12 -134 271
1028 271 -185 76 98 -249 152 -155 -74 36 -221 43 -152 -48 -108 -67 -24 -239 47 -153 -133 79 -363 47
1050 47 -141 -313 287 -455 -30 72 -499 332 -290 -215 286 -518 165 -9 -419 326 -364 -12 245 -419 255
1071 255 -65 -290 311 -228 -20 193 -191 148 54 -87 122 25 -80 207 -76 -17 242 -183 77 145 -267
1092 -267 301 -65 -221 422 -328 92 209 -471 378 -174 -259 381 -497 167 132 -446 289 -271 -262 324 -508
1113 -508 67 26 -537 213 -332 -277 154 -456 -117 135 -467 160 -139 -386 272 -332 -178 244 -466 67 50
1134 50 -454 346 -211 -237 401 -528 197 172 -469 518 -279 -125 475 -460 223 254 -420 501 -86 -219 565
1155 565 -328 200 276 -360 430 22 -204 467 -272 85 425 -445 392 55 -349 608 -288 -71 495 -520
1175 -520 304 235 -531 615 -295 -251 551 -672 251 112 -631 495 -330 -311 513 -677 186 188 -700 571
1195 571 -379 -370 572 -631 109 226 -662 390 -59 -540 525 -361 -200 429 -628 285 128 -639 582
1214 582 -309 -210 660 -600 357 337 -749 797 -254 -310 903 -752 341 489 -783 848 -155 -358
1232 -358 980 -619 263 471 -796 758 -63 -340 794 -563 165 518 -632 556 45 -518 695
1249 695 -375 -150 621 -726 248 259 -710 601 -157 -487 782 -709 80 450 -992 634 -170 -582
1267 -582 892 -760 -16 568 -1024 654 -146 -779 961 -784 -46 623 -986 601 11 -709 824
1284 824 -522 -163 714 -793 439 176 -676 792 -354 -222 756 -628 272 462 -722 718 -50
1301 -50 -481 951 -564 89 696 -824 639 85 -622 917 -476 -134 858 -915 591 263 -816
1318 -816 1004 -531 -204 824 -907 434 310 -842 838 -382 -426 865 -854 274 378 -867
1334 -867 696 -286 -518 768 -710 50 487 -922 614 -118 -692 813 -646 -132 621 -872 390
1351 390 122 -806 773 -453 -300 711 -905 361 263 -842 767 -352 -362 809 -792 250 421
1368 421 -890 776 -205 -480 934 -768 186 628 -833 736 71 -523 926 -543 -30 796 -818
1385 -818 669 213 -680 991 -408 -97 768 -803 549 288 -743 960 -416 -245 859 -778 398
1402 398 333 -808 784 -245 -436 762 -768 93 440 -860 620 -72 -585 784 -635 -86 550
1419 550 -928 452 77 -820 837 -598 -232 750 -936 438 204 -869 823 -484 -368 891 -863
1436 -863 309 435 -902 937 -340 -391 904 -768 338 488 -788 812 -158 -402 955 -671 172
1453 172 582 -748 700 9 -505 876 -401 -97 704 -763 452 347 -703 878 -309 -344 849
1470 849 -786 263 446 -882 801 -254 -518 988 -860 189 500 -1021 796 -198 -619 949
1486 949 -847 87 538 -1016 671 -163 -732 852 -740 -58 561 -942 474 3 -694 701 -504
1503 -504 -271 649 -784 242 261 -826 671 -191 -420 824 -663 55 520 -871 596 10 -620 940
1521 940 -620 16 736 -936 709 130 -685 1016 -552 -74 833 -892 652 184 -747 1006 -482
1538 -482 -132 750 -788 447 223 -710 800 -340 -353 730 -750 174 401 -815 574 -151 -517 688
1556 688 -603 -89 522 -863 424 65 -711 748 -527 -211 703 -897 308 203 -851 810 -421
1573 -421 -343 828 -968 319 353 -881 766 -354 -365 862 -831 248 463 -817 732 -239 -413
1590 -413 807 -638 142 458 -733 566 -27 -472 783 -460 28 599 -694 473 209 -548 764
1607 764 -301 -255 703 -689 292 401 -712 720 -112 -399 777 -614 158 445 -815 659 -83 -472
1625 -472 841 -650 109 524 -883 611 -50 -626 774 -621 4 488 -829 468 14 -622 662
1642 662 -505 -219 510 -758 285 93 -637 578 -358 -266 570 -612 157 347 -657 515 -107 -414
1660 -414 679 -579 50 510 -709 540 77 -521 790 -470 -71 702 -707 501 171 -508 871
1677 871 -382 -106 696 -731 474 213 -600 828 -325 -257 717 -624 330 301 -660 628 -211 -296 593
1696 593 -541 96 330 -654 478 -92 -412 590 -483 -66 492 -693 321 90 -539 654 -352
1713 -352 -185 560 -689 246 166 -746 661 -330 -349 680 -668 254 279 -693 642 -270 -349 682 -682
1732 -682 132 320 -700 554 -75 -387 602 -563 128 373 -640 421 -32 -447 578 -355 -72 483
1750 483 -521 289 166 -553 526 -241 -252 557 -559 179 289 -646 527 -138 -373 633 -516 40
1768 40 367 -708 509 -120 -436 613 -538 76 421 -745 480 -65 -477 610 -507 -79 416 -700
1786 -700 344 48 -526 526 -384 -189 414 -604 214 77 -566 431 -232 -283 475 -502 66 287 -556
1805 -556 461 -123 -376 589 -498 16 364 -596 360 9 -495 619 -387 -68 446 -610 357 30
1823 30 -444 588 -310 -55 537 -560 317 149 -453 560 -196 -146 553 -424 191 316 -467 530 -97 -238
1843 -238 585 -341 91 342 -467 400 16 -298 528 -337 -3 434 -488 304 40 -479 483 -345 -176 418
1863 418 -569 212 63 -509 431 -258 -261 388 -597 137 171 -545 414 -144 -276 432 -410 99 318 -490 429
1884 429 -25 -305 558 -304 66 432 -424 374 94 -316 546 -223 -16 465 -364 294 185 -276 519 -180
1904 -180 -82 480 -374 185 211 -377 424 -103 -254 488 -330 95 298 -440 348 -70 -286 435 -297 17 339
1925 339 -487 294 52 -395 444 -346 -25 380 -446 252 124 -377 410 -298 -136 379 -476 187 94 -385
1945 -385 429 -219 -148 341 -423 105 155 -376 291 -50 -219 387 -249 31 295 -405 252 -7 -289 376 -236
1966 -236 -29 379 -327 246 152 -378 424 -173 -42 349 -392 259 165 -363 478 -189 -82 406 -346 164 183
1987 183 -377 386 -144 -164 356 -309 104 195 -324 242 -40 -192 262 -233 -34 189 -334 158 66 -282 247
2008 247 -148 -105 292 -367 106 156 -436 342 -147 -216 293 -375 104 172 -385 354 -148 -178 384 -353 144 165
2030 165 -332 297 -124 -218 336 -257 112 170 -265 229 -61 -199 323 -160 -27 206 -218 157 89 -190 239
2051 239 -71 -81 308 -257 108 236 -308 298 -33 -219 347 -305 23 196 -380 304 -41 -176 358 -325
2071 -325 66 197 -337 259 -72 -207 301 -330 3 161 -270 190 -64 -155 189 -213 -60 115 -175 112
2091 112 83 -196 148 -67 -172 199 -228 -20 133 -250 186 12 -200 246 -178 -22 225 -304 202 -16
2111 -16 -194 306 -243 9 233 -280 231 51 -215 372 -172 22 245 -223 233 51 -91 235 -97 -48 194
2132 194 -150 115 64 -126 187 -36 -111 184 -126 9 154 -170 128 48 -224 221 -145 -126 165 -268 100
2153 100 3 -261 179 -183 -134 131 -349 82 -14 -217 201 -186 -40 130 -282 99 -14 -212 215 -110 -24
2174 -24 144 -130 77 13 -95 148 27 -74 109 -51 -31 143 -112 97 137 -113 236 8 -2 173 -170 79
2196 79 63 -173 191 -71 -98 222 -230 121 86 -151 134 -69 -46 149 -159 107 12 -132 200 -84 -18 113
2218 113 -127 81 51 -57 104 14 -65 52 -52 4 50 -63 63 41 -105 45 -18 -71 66 -95 45 6 -116
2241 -116 67 -60 -111 104 -184 32 21 -203 59 -134 -59 40 -198 109 19 -152 130 -122 59 106 -122 67
2263 67 53 -35 132 -63 -2 112 -46 109 41 -49 123 -4 -21 153 -58 55 65 -13 60 27 -61 110 9 -1
2287 -1 133 -82 21 24 -97 77 -58 -25 111 -85 52 5 -194 104 -52 -20 41 -110 37 -4 -89 77 -58
2310 -58 21 46 -140 -14 44 -77 75 -65 -20 70 -74 6 0 -59 55 29 -22 75 -109 11 29 -60 71 -64 -25
2335 -25 69 -39 26 58 -87 56 36 -88 106 -69 14 87 -67 113 78 -5 60 -17 32 33 -95 57 26 -83 108
2360 108 -91 -30 55 -95 13 -19 -80 89 -24 24 97 -68 -5 0 -37 50 -84 -51 63 -56 35 31 -79 79 -78
2385 -78 -67 85 -77 -14 -4 -64 78 -13 -55 28 -110 -7 68 -89 90 -22 -15 60 -63 33 41 -31 53 -51 -32 92
2411 92 -61 23 76 -87 71 52 37 100 -78 47 127 -78 75 18 -16 130 -30 17 79 -85 115 16 -65 143
2435 143 -66 -21 95 -143 60 105 -79 102 -67 -48 71 -88 2 20 -115 30 -85 -113 103 -69 16 33 -109
2458 -109 90 -29 -55 88 -74 -47 123 -143 59 19 -89 107 -127 20 103 -132 81 -44 -67 140 -131 -17
2480 -17 161 -118 105 80 -102 111 -70 -18 152 -129 87 73 -54 150 -31 -58 111 -93 56 76 -120 155
2502 155 5 -92 109 -47 15 120 -124 158 20 -78 170 -114 6 103 -158 74 68 -182 170 -45 -10 161
2524 161 -187 -10 2 -124 167 -37 -103 136 -195 34 85 -266 92 -69 -158 160 -110 0 44 -216 94 -24
2546 -24 -111 168 -117 1 68 -111 146 17 -79 181 -86 -22 94 -108 89 23 -69 185 -37 -34 201 -97 77
2569 77 77 -147 131 12 -85 232 -140 45 122 -174 154 -11 -121 228 -135 -53 151 -231 114 -21 -189 244
2591 244 -150 -28 74 -177 118 -19 -145 90 -103 -64 152 -154 46 10 -145 123 -85 -72 187 -149 28
2612 28 39 -221 187 -5 -116 186 -137 51 118 -185 110 12 -120 133 -150 -17 182 -236 162 65 -81 224
2634 224 -82 6 173 -200 150 44 -110 155 -90 -64 201 -179 119 78 -138 151 -104 -16 150 -125 106
2655 106 111 -157 187 -24 -99 198 -114 20 112 -224 99 58 -220 180 -149 -109 196 -190 113 19 -216 199
2677 199 -122 -46 192 -205 119 94 -230 218 -130 -75 193 -189 103 59 -238 156 7 -129 191 -194 25
2698 25 123 -246 181 -4 -82 228 -82 53 128 -134 82 30 -197 162 -101 -43 231 -230 151 114 -233 232
2720 232 -83 -152 241 -164 49 150 -241 195 -43 -79 258 -220 68 168 -268 162 44 -175 220 -160 18
2741 18 142 -262 130 4 -175 192 -148 -29 155 -227 101 43 -178 223 -77 -119 215 -222 24 90 -255
2762 -255 205 -38 -166 237 -198 52 68 -272 193 -34 -149 269 -111 -22 195 -274 173 -40 -189 301 -152
2783 -152 8 174 -227 198 58 -189 205 -67 -65 272 -212 138 143 -207 238 -58 -88 249 -166 49 90 -219
2805 -219 273 -38 -208 240 -199 52 221 -212 176 -32 -163 224 -146 -55 237 -275 144 61 -217 259 -149
2826 -149 -46 206 -305 113 80 -202 198 -80 -119 244 -242 89 116 -211 150 -68 -129 249 -197 -13 205
2847 205 -269 159 26 -129 235 -169 2 200 -219 125 53 -185 242 -90 -41 214 -220 157 41 -213 277
2868 277 -82 -73 285 -183 98 141 -261 204 -97 -77 299 -208 63 153 -204 175 -5 -158 213 -120 38 188
2890 188 -292 192 -14 -162 196 -202 -30 165 -337 133 14 -264 241 -168 -81 227 -229 124 94 -254 177
2911 177 -75 -128 240 -209 92 157 -260 218 -14 -151 279 -211 12 120 -234 223 -5 -207 258 -178 -33
2932 -33 195 -215 244 67 -207 267 -87 -75 253 -244 100 102 -238 271 -98 -56 281 -262 114 133 -208 224
2954 224 -61 -154 257 -214 8 178 -268 175 -63 -214 289 -125 18 150 -211 155 44 -239 215 -155
2974 -155 -113 205 -243 136 60 -230 213 -72 -128 238 -238 14 123 -236 198 -84 -151 252 -202 41 192
2995 192 -322 218 -47 -161 292 -160 -29 203 -242 173 45 -211 298 -197 -25 225 -211 103 54 -197
3015 -197 316 -65 -56 219 -184 65 104 -214 171 -28 -116 234 -196 54 195 -280 207 25 -145 243 -168
3036 -168 14 175 -303 199 -26 -224 241 -147 4 234 -303 126 77 -286 206 -167 -101 216 -200 91 104
3057 104 -198 206 -60 -128 228 -240 49 119 -212 175 -71 -160 249 -203 17 205 -270 163 -14 -211 290
3078 290 -119 -57 227 -251 156 56 -240 247 -72 -26 244 -215 128 121 -244 245 -110 -139 257 -162 64 162
3100 162 -250 303 -58 -164 252 -209 52 204 -199 192 11 -161 239 -180 -3 200 -176 171 60 -186
3120 -186 246 -75 -111 201 -294 128 60 -254 186 -113 -145 245 -226 98 130 -299 227 -53 -177 238 -182
3141 -182 55 154 -215 178 -26 -167 279 -109 38 228 -238 208 12 -191 271 -110 -57 211 -172 154 112
3162 112 -196 233 -90 -79 239 -180 70 101 -195 167 -60 -145 240 -172 17 198 -262 176 -16 -139 292
3183 292 -139 -53 191 -310 132 0 -233 265 -143 -76 186 -249 149 20 -182 201 -105 -102 223 -210 56
3204 56 99 -217 187 -120 -140 155 -152 27 163 -231 121 11 -165 201 -168 3 200 -225 149 20 -157
3225 -157 253 -83 -3 189 -265 145 68 -167 243 -58 -38 251 -257 104 94 -234 278 -3 -117 230 -183
3246 -183 65 120 -186 195 -10 -108 209 -217 12 160 -202 147 35 -179 236 -100 -63 193 -247 94 63
3267 63 -200 175 -121 -65 202 -244 109 169 -212 186 -81 -127 214 -189 39 104 -237 199 -70 -155 183 -177
3289 -177 -12 90 -260 177 40 -215 184 -94 18 158 -264 110 41 -138 196 -89 -61 229 -171 77 107
3310 107 -213 245 -61 -112 223 -189 60 112 -173 201 -35 -147 197 -175 7 141 -218 178 -14 -205 241
3331 241 -136 59 139 -186 89 62 -177 181 -117 -53 183 -199 39 102 -204 152 -49 -93 215 -167 74 124
3353 124 -140 181 -44 -119 253 -163 4 114 -204 156 -11 -139 141 -151 -55 154 -187 160 39 -152 219
3374 219 -74 -45 208 -147 98 137 -144 216 -20 -68 173 -142 94 93 -207 141 -39 -116 180 -114 72 121
3396 121 -216 85 -13 -106 240 -162 9 151 -164 117 -6 -61 166 -140 -83 123 -141 34 34 -195 161 -62
3418 -62 -63 149 -174 29 46 -144 116 -126 -101 195 -132 46 69 -181 169 -15 -154 216 -144 -3 146 -152
3440 -152 106 -4 -117 178 -104 -22 202 -132 109 54 -155 202 -108 -68 138 -185 34 91 -174 154 -89
3461 -89 -115 189 -124 33 104 -131 125 18 -95 179 -141 -37 147 -179 92 22 -171 187 -130 1 178
3482 178 -196 125 -1 -104 143 -70 -12 154 -166 66 52 -196 141 -29 -89 116 -144 18 124 -124 95
3503 95 -48 -43 223 -98 -18 120 -186 87 41 -63 164 -59 -64 148 -108 69 53 -115 187 -93 -59 123 -107
3526 -107 65 46 -176 151 -18 -70 167 -82 24 115 -137 105 -37 -63 163 -122 2 93 -135 71 -15 -108
3548 -108 145 -77 -27 132 -131 33 -13 -146 157 -82 -26 102 -132 93 35 -138 143 -73 -84 109 -62 29
3570 29 65 -159 108 19 -84 91 -99 13 130 -130 58 -1 -98 102 -68 22 131 -117 81 71 -99 166
3592 166 -33 8 142 -121 90 26 -112 94 -24 -69 131 -96 28 71 -150 153 40 -90 113 -125 -9
3613 -9 84 -122 61 2 -86 118 -89 -48 173 -135 84 75 -89 111 -16 -32 37 -99 -26 73 -56 131 -61 -82
3637 -82 71 -68 92 59 -99 56 -17 -110 112 -55 11 89 -120 81 -2 -145 74 -100 -56 99 -58 94 51
3660 51 -91 71 -86 -26 114 -74 62 118 -86 111 -36 -15 79 -43 26 39 -63 47 -32 -50 99 -60 -6
3683 -6 45 -128 76 -5 -20 87 -84 -26 88 -105 52 34 -84 149 -30 -33 111 -73 -1 86 -106 132 -33 -15
3707 -15 73 -31 22 40 -53 50 -12 -43 91 -52 35 54 -117 27 21 -63 97 -72 -4 56 -96 49 14 -99 40
3732 40 -61 14 55 -72 95 28 -71 98 -41 -107 72 -77 30 40 -17 83 23 -79 126 -41 16 60 -20 106
3756 106 38 -57 143 -66 -28 22 -139 55 49 -80 77 4 -20 66 -39 32 46 -45 21 -29 -83 90 -90 65 106
3781 106 -49 35 20 -73 74 -59 68 75 -132 75 -4 -47 87 -14 7 47 -30 27 -14 -35 74 -47 -28 83 -25
3806 -25 84 2 -33 100 -16 -17 76 -73 21 42 -64 67 0 -44 104 -35 -25 68 3 21 -7 -20 123 -54 -16 89
3832 89 -82 39 -4 -39 14 -1 -17 46 -40 12 27 -47 86 1 -24 46 20 -19 30 -3 63 12 -24 65 -55 2 32 -29
3860 -29 62 -5 -64 26 -24 -45 20 -72 12 9 -92 53 -5 -2 31 -36 54 24 -52 41 -12 -24 92 -40 7 92 -56 36 19
3889 19 -89 44 -19 -7 51 -31 32 -40 -3 38 -14 -29 -16 -49 8 45 -85 58 37 -19 24 -2 58 51 -43 61 -64 4
3917 4 67 -21 -22 25 1 75 13 -23 48 -13 -28 27 -34 83 -8 -96 17 -26 -51 43 -72 26 22 -16 18 -8 -77 25 -56 31
3947 31 -39 -96 41 32 -54 17 -55 -24 68 -43 42 2 -6 45 -55 -15 25 -47 17 36 -18 68 -16 24 12 -32 35 -20 40 -19
3977 -19 11 -7 30 -26 -1 -16 -91 53 8 -10 26 -41 25 17 -67 41 -11 -18 44 -19 -18 9 5 40 42 -32 36 20 -95 30 -28
4008 -28 -30 3 -25 52 35 -17 14 -7 -14 0 -73 14 25 19 43 -43 17 41 5 60 -4 -38 54 -23 -46 59 -42 14 -9 -10 25
4039 25 31 25 82 8 8 78 -20 8 21 -28 -13 -48 39 3 6 6 -5 -8 82 -17 3 55 -36 24 -14 0 16 -5 -3 54 -54 20 29 -9
4073 -9 36 -24 -40 8 45 14 33 -7 3 -1 -61 23 1 -63 0 -58 -5 18 -22 28 0 6 71 -28 11 -32 -5 -14 -1 -39 31 -45
4105 -45 32 33 -31 3 -25 -25 12 6 8 13 -46 28 16 -3 49 53 2 15 -41 -31 37 -20 11 22 14 9 -21 -22 41 5 4 -5 -24 13 -60 -16
4141 -16 63 0 18 -9 -3 4 -23 -44 39 -56 -43 9 -37 36 0 -23 -50 -39 -28 14 -44 -4 16 -1 -12 -34 55 -12 -45 -1 8 -3
4173 -3 28 -11 -29 60 -73 42 -15 -55 59 -22 -51 45 -32 39 -13 -17 17 25 26 9 -6 -39 25 -6 67 14 -18 39 8 49 -39
4204 -39 -41 10 -1 -23 55 -18 -24 20 -62 39 47 -3 30 -75 -16 42 -70 -8 -1 -48 48 -11 -7 68 31 -21 -3 -3 -10 33 -13 17
4236 17 5 -53 45 -16 23 47 -38 50 13 -47 -22 -4 -11 -2 -4 5 -37 1 -15 -17 8 21 -63 -8 -4 -31 30 5 25 46 -33 32 26 -23
4270 -23 -6 -9 8 23 -22 17 4 -7 -43 -10 37 -15 -1 4 28 -11 -1 -45 -33 64 -5 -2 17 -6 7 -30 -24 26 -23 28 31 -45 -1
4303 -1 36 -76 22 -25 -9 37 -17 -4 13 -23 73 -47 -3 43 -50 8 -12 14 35 7 -28 64 -31 -29 15 -63 33 43 -42 65
4333 65 -9 -2 -20 -30 26 27 -12 -18 -14 -43 92 -19 18 39 -27 3 -37 -34 79 -42 -16 3 -7 19 44 -94 27 29 7 22
4363 22 -56 36 53 -27 27 -36 -14 23 -52 -30 56 -13 61 -22 -29 17 -79 33 -19 -59 16 13 -33 38 18 -8 24 -35 42 -22 14
4394 14 45 -32 -19 44 -9 -2 -31 -54 51 17 -11 77 -26 32 30 -67 43 24 -36 51 -15 18 30 -60 16 16 -39 17 -63 -14
4424 -14 7 -73 40 7 -58 53 37 2 41 -59 69 17 50 62 -54 29 67 -66 10 24 -66 42 13 -51 27 -53 -25
4451 -25 -8 -14 -2 -51 -23 -47 -49 -27 32 -18 -17 -1 -14 45 -6 -24 0 -7 9 76 -51 64 -25 -57 48 -73 -23 -29 -62 61
4481 61 -1 -63 83 -19 49 -12 -39 73 10 -32 41 -34 -35 -6 -34 84 1 15 58 -54 15 27 -30 80 -12 -6 40 -23
4509 -23 -32 33 -62 28 10 -47 62 -2 -8 12 -12 -4 32 -69 19 -1 -27 91 -104 13 8 -32 3 -2 -86 -13 -14 10 46 -13 -2
4540 -2 -2 -24 -21 77 -22 -11 -56 -12 45 -49 70 -42 -25 58 -30 14 42 -69 -25 18 -29 40 -28 30 43 -51 12 -42 -35 42 16
4571 16 -17 -6 -50 46 -10 -38 28 -15 -31 -3 -62 19 22 -30 58 -35 11 22 -1 -25 55 -18 58 12 -54 75 -40 11 -6 -5
4601 -5 50 -23 -65 2 -34 -28 40 -60 10 -6 -14 12 -8 -15 16 -39 -4 -32 9 40 55 -73 45 -54 20 -18 -68 17 -1 46 33
4632 33 -44 -37 64 -35 71 20 36 32 -47 4 58 -36 -2 60 15 55 -23 20 30 -67 12 49 11 65 13 23 10 -49 -12 62
4662 62 -36 79 4 -63 -24 -34 41 20 27 14 -3 -55 56 -56 -5 62 -48 35 -64 -55 70 -26 -20 21 -46 23 2 -58 20
4691 20 -10 -38 77 -10 63 35 -24 28 22 -30 2 -52 19 37 9 25 -19 14 66 -14 -3 12 -35 0 5 -56 9 2 -21 17 -42
4722 -42 36 35 -41 46 25 16 63 10 27 -4 19 15 -22 -3 55 -42 -79 22 -48 -11 3 25 16 -62 0 -2 5 37 -36 -34 64 -28 8
4755 8 37 -88 11 -29 -6 -23 -23 -25 47 -15 -1 -21 -52 18 16 -6 45 -25 -32 50 -14 -25 25 -46 6 -16 -16 74 -30 13 36 -18
4787 -18 54 16 15 59 -69 18 4 -15 23 -20 -21 26 1 4 37 1 67 20 4 -11 -53 11 -13 -35 40 -3 -31 28 -38 7 32
4818 32 -23 -2 17 -24 43 32 -25 30 -45 -11 -17 -74 3 -27 -81 -10 -7 25 32 -28 63 12 14 22 -6 27 53 -22 16 -6 -22 59 -3
4851 -3 -7 10 3 5 19 -18 31 2 -6 28 -2 11 51 32 63 8 -13 56 -12 40 5 -1 -28 -15 -44 0 -12 16 -3 -30 -8 10 -51
4884 -51 17 -63 -13 20 -10 34 25 10 30 -37 -7 26 -17 23 -70 -16 20 -2 -58 55 -15 30 -53 -6 9 -65 3 9 -13 5 10
4915 10 -10 27 38 1 24 4 -45 26 -58 61 -6 -69 -30 -9 15 3 -12 4 -26 -32 33 -40 0 -1 -10 -16 43 -12 34 7 17 14
4947 14 -23 40 42 -13 3 -6 -34 47 -11 0 -10 -9 13 10 -20 -23 -20 -2 57 13 -7 6 -7 -13 -17 -6 -34 -49 -18 20 -19 -31 60 -36
4981 -36 35 8 6 52 -7 17 9 -16 20 9 12 9 -76 -4 17 -42 34 -19 -15 35 -41 21 28 -2 55 -55 -10 54 -58 39 54 -10
5013 -10 -43 -32 -30 16 -19 -3 24 38 17 -9 17 47 -40 1 -20 -24 36 39 -64 -12 45 -24 -7 -12 51 50 -51 68 16 47 -8
5044 -8 -56 -6 28 -56 53 -23 -14 29 -50 -2 -19 -2 42 -3 15 50 -8 43 48 16 12 8 -19 17 35 -13 -4 6 -4 21 -2 72 -17
5077 -17 7 54 -2 -5 -34 -16 -4 3 -12 -9 -5 16 39 -10 80 20 -16 20 18 13 -27 -43 -8 60 11 -10 -11 -45 -4 -34 12 1 -21 50
5111 50 -32 -29 23 -28 36 32 -13 56 14 -30 -23 -27 -4 -30 -22 31 -6 -21 11 -4 -5 30 -42 51 0 -14 19 -6 17 -11 -14 -1 -18 -47
5145 -47 55 -34 -6 46 -63 -3 2 12 -20 0 42 32 24 -32 16 -23 -20 -1 -4 -21 -56 -33 -37 -2 29 -33 -52 -1 -56 0 -1 -35
5177 -35 30 0 -18 39 -18 -13 38 -14 -1 1 -10 -7 35 -4 11 -34 -10 8 -79 56 -54 19 23 0 -11 25 4 -14 -11 -50 56
5208 56 -30 14 -39 -39 52 -35 -24 -18 -14 -18 40 -5 -3 16 11 -17 6 -10 68 4 15 6 3 17 -43 -20 -21 37 8 -23 -5 12 28 -29 -49
5243 -49 1 18 -29 18 74 10 -30 -2 3 -5 73 -2 -6 -24 -52 44 -10 -21 -4 -50 -12 15 -59 13 -4 -41 27 -5 44 -19 -48 46
5275 46 -37 27 -4 10 -11 14 39 -5 -24 16 43 -11 -27 -1 -13 0 -38 -6 14 54 5 43 22 -10 -4 -22 58 -33 7 36 -4
5306 -4 2 29 2 -19 -38 -18 -20 -27 -5 29 -3 27 -56 -4 -36 -29 4 -32 -13 65 2 2 18 -38 1 31 12 32 60 9 -28 -38 27
5339 27 40 -25 -35 37 -35 37 0 1 -6 -5 17 1 0 -18 18 -19 -3 14 -70 -37 -8 37 -12 -10 -24 -43 17 1 7 14 18 -8 0 -3 -45
5374 -45 0 -24 -22 0 -17 27 -24 42 65 -18 -33 25 -3 39 9 16 -22 -6 23 41 -21 -8 36 -27 -7 15 -2 38 -8 -20 13
5405 13 -4 -7 -15 -12 42 10 -39 -43 9 -26 -8 20 24 -26 18 16 8 -32 36 27 -11 -19 -43 17 -57 34 65 1 0 -29 11 18 0 -18 13 -14
5441 -14 -3 12 -17 33 -32 -27 3 11 -14 -11 -9 15 -11 4 -24 -3 -34 -7 32 -45 -10 46 31 9 -47 -23 -11 31 -9 12 -16 -17 49
5474 49 -3 21 29 -4 22 -54 8 21 22 -16 24 13 11 16 -26 -19 -44 -32 -10 16 -14 -43 -73 -6 18 -17 -27 -14 -10 -21 11 -25 26
5507 26 26 -30 19 -38 -24 -32 -52 6 -42 -41 -22 -36 35 50 6 15 13 58 11 -18 4 -28 -28 -45 32 -18 4 15 -2 27 34 3 31 20
5541 20 -9 56 52 16 2 -1 10 17 -39 37 23 4 -11 20 -13 -30 -8 -8 -59 37 -26 15 31 16 40 -26 40 22 -29 8 19 -45
5573 -45 44 -25 11 23 14 -12 15 -25 9 -63 14 -7 -33 19 35 27 6 16 -27 -42 26 -11 5 -28 7 34 40 4 -24 -16 10 3 -16
5606 -16 28 4 0 -6 -13 -62 57 37 48 21 -5 -34 11 20 -24 14 27 35 0 1 16 -7 -27 -9 -40 37 -25 -21 18 30 -4 -8 -10 -11 10
5641 10 -45 15 17 -4 -50 -4 6 -10 -41 -10 27 23 19 4 13 49 -32 -25 -4 40 16 17 41 20 24 -4 -20 -28 -7 6 5 24 49 23 38
5676 38 -11 -1 28 -20 15 47 18 2 1 7 -8 3 -12 -37 36 32 -14 44 12 50 16 -6 60 -58 32 19 -30 19 41 -68 -45
5707 -45 -16 1 -3 -11 21 20 12 16 39 28 -21 16 42 27 13 7 -63 14 -25 8 -29 31 -14 -45 6 -13 -63 6 40 41 19 -17 -22 -19 23
5742 23 -40 -3 13 -8 53 -45 -8 -8 -10 -25 -6 29 12 13 32 42 17 -4 -19 6 4 -10 7 -52 -17 -30 27 43 37 7 -47 -15 -23
5775 -23 -2 -40 32 -45 12 -9 -11 6 -2 23 31 27 18 13 3 -31 28 17 -48 21 22 2 -19 43 32 22 35 -39 23 -23 35 8 -11 -12
5809 -12 14 -15 -21 -1 2 -5 20 -41 42 -62 -30 -35 2 -16 -2 -9 -33 -15 -9 -4 10 14 -6 3 17 -56 20 20 29 10 11 -13 -17 -30 -30 43 -28
5846 -28 -49 25 -20 -44 51 57 29 37 6 8 -4 -39 -33 10 39 6 -41 -18 -46 21 8 25 43 -13 -48 39 32 35 -3 -15 -15 -10 28 -40
5880 -40 -24 -14 -24 -32 0 -54 -3 -10 -76 -23 15 -25 -22 -22 -20 16 23 45 -50 -10 -47 11 25 0 -44 -23 6 43 -34 34 5 20 -14
5913 -14 4 28 -20 30 -10 -38 12 15 49 59 9 20 7 -7 -23 16 17 17 -20 -4 29 -43 -45 -14 -18 13 -19 -39 47 26 22 -2 48
5946 48 1 41 32 18 -5 26 23 48 14 -8 69 32 7 37 9 38 -19 -3 0 9 -28 19 48 31 -28 52 -23 -24 -9 -20 62 -6 9
5979 9 -12 -19 13 -13 -46 -11 22 63 5 -40 -1 1 -48 -12 29 -29 -47 -1 -2 47 -23 -1 30 33 38 -37 38 -44 -1 -16 33 -1 43
6012 43 13 23 -38 10 34 19 -11 -12 -48 26 29 8 -31 -15 41 24 10 14 3 -9 36 18 8 57 2 37 7 -20 25 1 -23 26
6044 26 3 12 -34 -1 19 41 43 -20 -19 68 0 -19 16 0 8 44 -20 35 2 2 69 13 3 30 -55 -12 13 6 14 -33 -24 17 -43 16
6078 16 -22 27 -22 -4 -28 -2 -24 5 46 -28 2 -3 -53 5 -5 -34 5 39 -11 31 -28 29 46 -29 -8 -4 37 8 6 -8 57 12
6110 12 -19 21 15 18 -39 -32 27 13 57 -8 12 10 2 19 37 2 51 20 -5 -7 0 -7 23 -52 9 -20 -30 9 -14 -25 -8 -31 -4 9
6144 9 19 27 4 57 -14 36 39 -25 -42 15 39 -31 -12 16 -27 -25 -43 -39 41 24 29 0 -41 37 -20 39 -33 -27 -6 41 33 -18 14 -41
6178 -41 -22 29 -16 16 58 -10 -3 -30 -41 -38 16 -8 33 26 7 16 -31 13 15 44 4 55 -13 25 -9 -12 53 -24 10 22 47 2 12
6211 12 -1 29 12 -2 38 -31 19 -17 -51 -10 0 -22 -37 -11 -16 -9 -28 5 18 27 8 18 2 46 -64 -4 26 -53 17 19 -33 10
6243 10 -18 -26 11 21 13 20 -28 -4 27 -49 -5 -72 1 36 -3 12 16 50 -15 23 -40 18 16 -47 24 17 -15 11 35 18 -56 64 -13
6276 -13 -16 -28 32 -13 22 3 9 6 23 15 15 -2 34 18 54 -15 29 -28 -39 -25 -3 -25 18 1 0 18 21 3 -36 41 37 72 -52 4
6310 4 29 -25 19 53 40 -27 -51 1 42 -2 39 25 56 39 -43 -11 -35 -50 -29 -27 -15 -15 -4 -25 -33 -7 17 -50 -28 -11 -22 12
6342 12 -19 55 8 28 8 -6 14 -29 43 -41 33 -2 -52 3 -10 22 46 -12 8 -27 -24 89 41 -6 15 -3 17 -30 -59 -2
6372 -2 6 -36 -34 4 -8 33 0 12 -34 37 5 -29 25 -42 -58 -4 27 -1 18 -30 11 24 46 20 4 28 5 3 -62 -27 -29 31 24
6405 24 46 59 -23 15 4 3 37 -6 -41 -13 -38 -27 -27 -2 -8 -33 9 -9 -11 -58 9 -34 -17 -14 -15 35 -19 -49 -29 14 13 -4 9 -34
6439 -34 -16 -20 9 26 4 13 1 2 -26 -79 6 -17 -1 24 -22 -14 17 -2 22 -19 -5 39 -32 -5 31 -27 31 -8 -18 6 54 -13
6471 -13 -12 20 59 72 27 -15 7 48 54 10 -8 -21 -20 32 16 2 83 -16 48 24 -10 -39 -26 -43 48 -61 -18 41 -41 -8 14
6502 14 12 -20 46 -13 25 -13 -8 38 15 -18 -3 -25 -45 15 -12 47 -9 -42 30 27 21 -7 -10 28 -2 -33 4 15 40 -56 -14 3 -8
6535 -8 11 -44 -6 37 -2 -37 30 -72 39 22 26 -29 -40 -12 4 -39 6 19 -3 10 -4 6 -5 -23 -4 -23 13 -15 -36 -41 52
6566 52 4 21 7 -21 16 16 -21 48 -17 -47 48 44 3 25 -39 -26 33 -4 37 20 27 -22 -26 4 -34 0 25 -29 1 54 16 1
6598 1 21 -12 6 18 -6 18 49 13 21 -11 3 23 -27 -29 -1 26 -14 -3 -13 23 18 20 -12 -17 8 5 -4 32 -6 24 6 6 32 -8 47
6633 47 -45 -52 26 32 5 20 -13 -2 -17 -64 32 -9 22 1 32 36 -12 31 -10 -74 -38 26 -18 -32 -37 5 -39 17 25 -28 -24 -3 -11 -59
6667 -59 5 44 7 -21 30 -25 -3 -2 2 -14 -15 15 -13 -14 17 -24 31 20 40 -38 37 6 63 -21 -7 -20 -31 49 26 -35 -42 -28 -23
6700 -23 10 -12 -4 -27 -24 10 -49 13 -26 -41 48 0 52 -3 23 -18 20 1 -12 -3 -18 60 3 9 -14 -37 21 9 -38 6 7 -27 18
6733 18 -19 10 -27 12 -1 13 43 -33 46 16 -34 5 -42 -2 -49 1 -2 33 -14 12 -25 68 -4 -47 23 37 19 -40 -17 43 -7
6764 -7 10 12 10 46 -45 61 40 -4 24 12 -21 7 40 -27 -44 14 1 48 -12 -19 15 -50 6 -48 7 -30 -13 52 -45 -2 70 -6
6796 -6 -4 9 -13 -9 58 -4 -30 -9 15 -11 16 -21 -2 25 -10 -52 -10 -2 -56 50 35 -15 50 17 7 47 -10 -37 -25 32 36 -16
6828 -16 -11 17 -8 -26 7 8 28 4 9 13 -32 4 -8 15 24 22 -28 12 9 -34 28 -42 20 4 -26 -1 37 5 -8 -26 -25 -32 14 32 9
6863 9 21 -18 10 2 58 -82 -19 -38 -17 65 -39 -3 -9 -4 33 12 16 -20 -54 28 13 34 7 -10 26 23 49 -3 -21 -26 -25 81 -2
6896 -2 19 -7 4 8 -8 36 -20 -9 -14 18 -50 9 -23 1 -12 17 44 8 29 8 13 0 24 -5 23 24 1 44 -35 -54 35 8 -50
6929 -50 -18 21 18 -20 21 14 -9 13 -1 -2 -3 10 10 -5 -32 -40 -11 -2 30 43 23 33 -14 5 27 -33 -20 24 20 44 30 14 49 7
6963 7 -19 20 24 -10 -19 -10 17 -10 -14 -10 36 -28 1 -27 9 5 5 -22 46 3 4 16 -1 14 5 -32 -15 21 29 -27 5 6 42 11 -1 -2 29
7000 29 14 -14 62 10 -10 10 51 33 28 0 7 -5 24 47 -11 6 -72 1 24 -16 -3 -3 16 14 -29 -13 87 3 -10 13 12 27
7032 27 8 58 -25 48 21 -6 9 5 -17 -13 37 -5 23 5 -16 50 41 -1 65 -22 63 -13 19 -7 -27 30 28 -6 -33 8 -20 -9
7064 -9 6 -2 -11 1 24 -15 12 -30 -13 23 51 -30 28 19 -1 54 -25 -18 -8 -22 14 -9 -24 5 -44 -37 -38 57 22 -55 27 -48 25 31
7098 31 -18 68 -68 -34 16 -3 18 -30 17 32 -29 28 -22 46 61 -9 -3 1 -4 -42 -22 -12 -11 4 -21 32 -4 58 -7 -43 -11 -16
7130 -16 -21 33 -10 -31 21 -11 22 -9 33 1 -5 41 -32 15 -21 -33 19 24 -17 -10 67 37 46 -51 -1 13 -17 12 26 53 -2 30 43
7163 43 1 -34 45 -1 -30 2 8 -15 32 16 -2 -12 1 29 8 14 56 -53 2 39 -2 15 -2 85 -5 23 6 -17 -6 28 -58
7194 -58 59 -6 -8 -36 9 -8 15 26 14 6 27 -17 13 -4 -27 -46 -19 -34 14 1 27 -11 -7 56 -8 -4 -20 10 0 2 -12 8
7226 8 -3 27 8 17 45 37 -38 -11 61 -33 -20 17 20 2 4 -26 18 -30 2 -17 -46 -9 36 -37 -65 22 -53 -6 26 -23 18 28 29
7259 29 58 -1 -22 14 26 -11 0 -21 30 13 -3 8 20 2 -36 39 11 2 -12 45 6 11 16 1 7 -22 -54 15 28 46 5 -21
7291 -21 39 0 1 28 -5 -1 6 49 -43 5 -6 -37 -5 -47 36 -49 -2 46 -19 3 4 33 14 33 -6 -7 -2 -5 47 3 30 -11 2 -42
7325 -42 4 14 35 2 -33 27 1 -15 15 16 -16 16 -27 3 -7 12 66 45 4 -13 -25 -29 -26 18 -27 -17 -27 -54 -33 1 15 13
7357 13 -4 14 9 -11 -25 -52 -8 -7 -18 -51 48 7 -32 27 -6 -12 -13 -1 20 -37 -51 6 36 -8 -27 12 -44 -19 -23 -7 -34 2 78
7390 78 44 -12 13 0 -8 23 7 30 24 14 -8 17 21 -12 -52 40 -36 -35 -23 -14 -21 -40 2 23 2 -27 38 14 29 -6 -7 7 2 -17
7424 -17 3 3 -43 58 -43 29 14 -64 -47 -26 42 -35 3 29 -7 -14 -24 -51 4 -43 11 22 19 7 -35 -35 -18 10 31 50 -59
7455 -59 -28 9 -17 26 -8 -1 -10 -2 9 9 7 -12 20 -39 17 -40 -15 -46 0 46 -9 -13 -38 -24 39 -24 29 -26 -6 23 25 -21 10 36
7489 36 -5 13 16 5 17 15 -38 -13 1 -15 -7 -1 27 30 26 -4 -3 9 -64 21 19 -18 -17 -22 28 -37 -6 -5 -35 -9 -21 -43 57 3 -36
7524 -36 39 -23 -24 -1 -22 -22 -1 28 14 -20 2 51 -9 6 -14 17 -39 -46 -9 21 -18 31 3 66 57 -18 53 12 36 38 -24 -44 -5
7557 -5 -19 -16 -10 -22 7 -4 31 14 28 -11 35 -16 -10 -38 -4 -3 18 65 -5 9 -15 -49 15 -14 -4 -4 14 6 2 38 -18 -14 13 0 -33
7592 -33 53 -37 21 17 -37 2 32 -58 39 -31 -30 28 61 37 2 5 -12 53 8 -8 -36 27 -27 -13 52 -26 -48 20 24 -20 29 4
7624 4 -62 -43 23 11 9 4 9 -7 18 -10 -5 -7 41 -16 19 34 -9 4 -46 47 -20 -51 20 -50 64 38 6 -34 23 -34 30 40 -17
7657 -17 -9 -1 17 -13 11 -62 -3 -16 -15 12 -3 -22 2 -20 -15 -8 4 23 -38 67 29 67 2 -7 33 30 -39 2 8 -40 -29 39 -19 -18
7691 -18 9 48 -24 13 -27 -32 5 -43 -8 -27 -1 -10 -6 -23 45 -53 33 -9 31 13 37 21 -13 17 -51 -11 5 4 9 -3 -3 21 44
7724 44 35 32 -26 -2 1 20 15 25 -77 17 -34 -22 6 -11 14 12 -4 -16 -49 14 -23 -10 -36 36 33 44 -4 4 -31 -14 44 -30 36
7757 36 2 43 37 -14 -3 -40 -17 -31 13 -11 -6 -33 72 24 -23 37 -43 6 25 -27 53 -26 -28 20 -59 -57 -37 67 14 58 -34
7788 -34 -20 -5 -22 83 -15 28 7 -20 25 7 25 10 47 -47 -30 8 -39 -6 22 -53 -59 3 -21 2 38 -14 5 -45 -5 12
7818 12 19 24 -1 -6 -30 -23 -3 -18 13 -29 -59 16 47 33 -4 -39 57 -40 44 42 -15 -5 9 30 -12 14 62 11 11 13 30 -1 -20 15
7852 15 39 51 17 15 -59 -1 -13 -6 11 34 -43 -7 -37 -20 -41 -19 15 14 39 38 11 17 -36 -14 33 42 32 -16 -36 -27 -11 18 57 -12
7886 -12 -10 -8 -25 -13 -32 -18 13 -6 -19 33 26 -7 -13 -14 4 37 3 2 18 22 -18 -17 -9 -36 18 -11 -4 24 33 42 15 20 16 -2 -15 11 -21
7923 -21 9 -33 47 1 -1 53 -27 44 -23 15 -29 10 -10 -9 15 31 -33 50 -36 -6 -12 -2 20 50 9 19 -12 -31 -17 -15 35 1
7955 1 3 36 -4 -23 6 19 15 -9 -3 23 -17 21 -48 -28 -18 28 27 32 -26 21 -11 -26 7 37 76 -20 -13 30 -18 43 22 14 37 13
7989 13 16 78 26 -37 -25 15 -32 -19 35 -6 -10 -27 5 2 35 3 6 12 -41 -13 -11 -21 17 -4 -14 60 10 55 56 28 -42 3 20 46
8023 46 35 37 28 -15 -21 -26 15 2 -62 -50 28 -33 15 -3 6 16 2 -32 24 4 -9 -47 5 17 -23 21 24 1 -6 17 21 -15 -10 -11 -40
8058 -40 20 20 14 23 2 2 -11 2 18 59 -14 -34 -11 9 -9 -13 10 8 65 10 41 34 -18 -26 -9 -2 -15 8 23 -17 27 -25 14 -12 -26
8093 -26 43 5 -1 29 50 4 -11 -14 -15 26 -8 44 52 -10 51 21 25 6 21 23 19 -7 24 22 21 5 28 27 -24 -36 15 -30 -31 8 52 -4
8129 -4 -32 85 -29 -17 -32 -14 -26 -3 6 -16 18 6 -37 -7 37 16 7 13 28 40 18 -32 16 14 62 33 -19 -6 8 22 40 -23
8161 -23 -3 48 72 -5 -14 21 32 -17 -34 -18 -18 17 -9 -12 12 -5 17 5 -50 38 -24 -19 34 28 16 27 -10 21 50 11
8191A1
##END NTUPLES=NMR FID
##END=
