##TITLE=1H_IPB2506
 CDCl3, 8 sc, 
 26.6.2019
##JCAMPDX= 6.0         $$ Bruker NMR JCAMP-DX V2.0
##DATA TYPE= NMR FID
##DATA CLASS= NTUPLES
##ORIGIN= UXNMR, Bruker Analytische Messtechnik GmbH
##OWNER= root
$$ XWIN-NMR		Version 3.5
$$ Wed Jun 26 15:38:09 2019 Russian Standard Time (UT+4h)  she@DPX200
##.OBSERVE FREQUENCY= 200.13155
##.OBSERVE NUCLEUS= ^1H
##.DELAY= (6, 6)
##.ACQUISITION MODE= SIMULTANEOUS
##.ACQUISITION SCHEME= undefined
##.AVERAGES= 8
##.DIGITISER RES= 18
##SPECTROMETER/DATA SYSTEM= spect
##.PULSE SEQUENCE= zg30
##.SOLVENT NAME= CDCl3
##.SHIFT REFERENCE= (INTERNAL, CDCl3, 0, 15.7039)
##AUDIT TRAIL= $$ (NUMBER, WHEN, WHO, WHERE, WHAT)
$$ ##TITLE= Audit trail, XWIN-NMR		Version 3.5
$$ ##JCAMPDX= 5.01
$$ ##ORIGIN= Bruker BioSpin GmbH
$$ ##OWNER= she
$$ F:/spectra/data/she/nmr/H-F/1/audita.txt
$$ ##AUDIT TRAIL=  $$ (NUMBER, WHEN, WHO, WHERE, WHAT)
(   1,<2019-06-26 15:36:58.10 +0400>,<she>,<DPX200>,
      <created by zg, POWCHK disabled, PULCHK disabled
       configuration hash MD5:
       00 E9 B6 7A A2 85 ED C7 34 08 36 98 17 FE 4E 26
       data hash MD5: 16K
       76 CF C6 E1 F0 31 98 96 C6 B5 22 BD 49 8C C7 CC>)
$$ ##END=
$$ 
$$ hash MD5
$$ 90 9B F7 4E 5B F5 AD E1 EB 00 83 5E D3 53 D0 BF
##$RELAX= 
##$RELAX= 
##$RELAX= 
##$RELAX= 
##$RELAX= 
##$RELAX= 
$$ Bruker specific parameters
$$ --------------------------
##$DU= <F:/spectra>
##$EXPNO= 1
##$NAME= <H-F>
##$PROCNO= 1
##$TYPE= <nmr>
##$USER= <she>
##$AMP= (0..31)
100 100 100 100 100 100 100 100 100 100 100 100 100 100 100 100 100 100 
100 100 100 100 100 100 100 100 100 100 100 100 100 100 
##$AQSEQ= 0
##$AQ_mod= 1
##$AUNM= <au_zg>
##$AUTOPOS= <>
##$BF1= 200.13
##$BF2= 200.13
##$BF3= 200.13
##$BF4= 200.13
##$BF5= 200.13
##$BF6= 200.13
##$BF7= 200.13
##$BF8= 200.13
##$BYTORDA= 1
##$CFDGTYP= 0
##$CFRGTYP= 5
##$CHEMSTR= <none>
##$CNST= (0..31)
1 1 145 1 1 1 1 1 1 1 1 1 1 1 1 1 1 1 1 1 1 1 1 1 1 1 1 1 1 1 1 1 
##$CPDPRG= <>
##$CPDPRG1= <>
##$CPDPRG2= <>
##$CPDPRG3= <>
##$CPDPRG4= <mlev>
##$CPDPRG5= <mlev>
##$CPDPRG6= <mlev>
##$CPDPRG7= <mlev>
##$CPDPRG8= <mlev>
##$CPDPRGB= <>
##$CPDPRGT= <>
##$D= (0..31)
0 1.2 0 0 0 0 0 0 0 0 0 0.03 0 0 0 0 0 0 0 0 0 0 0 0 0 0 0 0 0 0 0 0 
##$DATE= 1561549017
##$DBL= (0..7)
120 120 120 120 120 120 120 120 
##$DBP= (0..7)
150 150 150 150 150 150 150 150 
##$DBP07= 0
##$DBPNAM0= <>
##$DBPNAM1= <>
##$DBPNAM2= <>
##$DBPNAM3= <>
##$DBPNAM4= <>
##$DBPNAM5= <>
##$DBPNAM6= <>
##$DBPNAM7= <>
##$DBPOAL= (0..7)
0.5 0.5 0.5 0.5 0.5 0.5 0.5 0.5 
##$DBPOFFS= (0..7)
0 0 0 0 0 0 0 0 
##$DE= 6
##$DECBNUC= <off>
##$DECIM= 24
##$DECNUC= <off>
##$DECSTAT= 4
##$DIGMOD= 1
##$DIGTYP= 9
##$DL= (0..7)
0 120 120 120 120 120 120 120 
##$DP= (0..7)
150 150 150 150 150 150 150 150 
##$DP07= 0
##$DPNAME0= <>
##$DPNAME1= <>
##$DPNAME2= <>
##$DPNAME3= <>
##$DPNAME4= <>
##$DPNAME5= <>
##$DPNAME6= <>
##$DPNAME7= <>
##$DPOAL= (0..7)
0.5 0.5 0.5 0.5 0.5 0.5 0.5 0.5 
##$DPOFFS= (0..7)
0 0 0 0 0 0 0 0 
##$DQDMODE= 0
##$DR= 18
##$DS= 0
##$DSLIST= <SSSSSSSSSSSSSSS>
##$DSPFIRM= 0
$$ [...]
##$SUBNAM2= <"">
##$SUBNAM3= <"">
##$SUBNAM4= <"">
##$SUBNAM5= <"">
##$SUBNAM6= <"">
##$SUBNAM7= <"">
##$SUBNAM8= <"">
##$SUBNAM9= <"">
##$SW= 24.9336996594482
##$SWIBOX= (0..15)
0 0 2 0 0 0 0 0 0 0 0 0 0 0 0 0 
##$SW_h= 4990.01996007984
##$TD= 16384
##$TD0= 1
##$TE= 0
##$TE2= 300
##$TE3= 300
##$TEG= 300
##$TL= (0..7)
0 120 120 120 120 120 120 120 
##$TP= (0..7)
150 150 150 150 150 150 150 150 
##$TP07= 0
##$TPNAME0= <>
##$TPNAME1= <>
##$TPNAME2= <>
##$TPNAME3= <>
##$TPNAME4= <>
##$TPNAME5= <>
##$TPNAME6= <>
##$TPNAME7= <>
##$TPOAL= (0..7)
0.5 0.5 0.5 0.5 0.5 0.5 0.5 0.5 
##$TPOFFS= (0..7)
0 0 0 0 0 0 0 0 
##$TUNHIN= 0
##$TUNHOUT= 0
##$TUNXOUT= 0
##$USERA1= <user>
##$USERA2= <user>
##$USERA3= <user>
##$USERA4= <user>
##$USERA5= <user>
##$V9= 5
##$VALIST= <valist>
##$VCLIST= <CCCCCCCCCCCCCCC>
##$VD= 0
##$VDLIST= <DDDDDDDDDDDDDDD>
##$VPLIST= <PPPPPPPPPPPPPPP>
##$VTLIST= <TTTTTTTTTTTTTTT>
##$WBST= 1024
##$WBSW= 4
##$XGAIN= (0..3)
0 0 0 0 
##$XL= 0
##$YL= 0
##$YMAX_a= 181992
##$YMIN_a= -163347
##$ZGOPTNS= <>
##$ZL1= 120
##$ZL2= 120
##$ZL3= 120
##$ZL4= 120
##$ABSF1= 10
##$ABSF2= 0
##$ABSG= 5
##$ABSL= 3
##$ALPHA= 0
##$AQORDER= 0
##$ASSFAC= 0
##$ASSFACI= 0
##$ASSFACX= 0
##$ASSWID= 0
##$AUNMP= <proc_1d>
##$AZFE= 0.1
##$AZFW= 0.1
##$BCFW= 1
##$BC_mod= 2
##$BYTORDP= 1
##$COROFFS= 0
##$CY= 11.3945322036743
##$DATMOD= 1
##$DC= 2
##$DFILT= <>
##$DTYPP= 0
##$F1P= 18.9103706918063
##$F2P= -1.10871071338519
##$FCOR= 0.5
##$FTSIZE= 0
##$FT_mod= 4
##$GAMMA= 1
##$GB= 0.15
##$INTBC= 1
##$INTSCL= 1
##$ISEN= 128
##$LB= 0.24
##$LEV0= 0
##$LPBIN= 0
##$MAXI= 10000
##$MC2= 0
##$MEAN= 0
##$ME_mod= 0
##$MI= 1.114404
##$NCOEF= 0
##$NC_proc= 0
##$NLEV= 6
##$NOISF1= 3.799351
##$NOISF2= 2.8
##$NSP= 1
##$NTH_PI= 0
##$NZP= 0
##$OFFSET= 15.70392
##$PC= 1
##$PHC0= -8657.891
##$PHC1= 15.80097
##$PH_mod= 1
##$PKNL= yes
##$PPARMOD= 0
##$PSCAL= 0
##$PSIGN= 0
##$REVERSE= no
##$SF= 200.130013532006
##$SI= 16384
##$SIGF1= 3
##$SIGF2= 2
##$SINO= 400
##$SIOLD= 16384
##$SREGLST= <1H.CDCl3>
##$SSB= 0
##$STSI= 0
##$STSR= 0
##$SW_p= 3612.71676300578
##$SYMM= 0
##$S_DEV= 0
##$TDeff= 0
##$TDoff= 0
##$TI= <>
##$TILT= no
##$TM1= 0
##$TM2= 0
##$TOPLEV= 0
##$USERP1= <user>
##$USERP2= <user>
##$USERP3= <user>
##$USERP4= <user>
##$USERP5= <user>
##$WDW= 1
##$XDIM= 8192
##$YMAX_p= 0
##$YMIN_p= 0
$$ End of Bruker specific parameters
$$ ---------------------------------
##NTUPLES= NMR FID
##VAR_NAME=  TIME,          FID/REAL,        FID/IMAG
##SYMBOL=    X,             R,               I
##VAR_TYPE=  INDEPENDENT,   DEPENDENT,       DEPENDENT
##VAR_FORM=  AFFN,          ASDF,            ASDF
##VAR_DIM=   8192,          8192,            8192
##UNITS=     SECONDS,       ARBITRARY UNITS, ARBITRARY UNITS
##FACTOR=    0.0002004,     1,               1
##FIRST=     0,             0,               0
##LAST=      1.6414764,     0,               0
##MIN=       0,             -163347,         0
##MAX=       1.6414764,     181992,          0
$$ Real data points
##PAGE= N=1
##DATA TABLE= (X++(R..R)), XYDATA
0@%%%%%%%Qj6J6j6K4l2L8m6N6o4P2q8J04j27J51j69J93k24K60l00L41l88M39m93
$$ 0 0 0 0 0 0 0 0 8 -8 8 -8 16 -16 22 -24 32 -32 40 -48 56 -71 80 -89 104 -120 140 -160 181 -207 232 -261
31b61N54o22O97p79Q70r68J074j193J322j465J625j798J989k204K445k712L016
$$ -261 293 -329 368 -411 459 -509 565 -628 694 -771 854 -944 1045 -1159 1286 -1426 1590
48A590l367L772m241M799n481O328p414Q866j0918J4057j9514L1607j02411N3582
$$ 1590 -1777 1995 -2246 2553 -2928 3400 -4014 4852 -6066 7991 -11523 20084 -82327 -28745
62b8745K07173j94984j25565J79416J30327k05739j10155J73522R5284j73732
$$ -28745 178428 -16556 -142121 37295 167622 -38117 -148272 25250 120534 -53198
72e3198o4405J64068P1100j46221n6904J16953M5972j12983m5044R7966N8062
$$ -53198 -117603 46465 117565 -28656 -85560 31393 77365 -35618 -80662 17304 75366
83G5366q2707o0084P1703P0543o9444q0147O6084Q9628p2487r7729Q0221J05841
$$ 75366 -7341 -67425 4278 74821 5377 -74770 -8686 80942 8455 -89274 -9053 96788
95I6788r1365j08575J04752J10492j16655j04950J27505R1203j45317q0566J57840
$$ 96788 5423 -103152 1600 112092 -4563 -109513 17992 109195 -36122 -116688 41152
106D1152P0602j59797n0255J62495K8852j66162j4251J58728l998j48815K3484
$$ 41152 111754 -48043 -98298 64197 93049 -73113 -87364 71364 67366 -81449 -57965
117e7965J43597l1486j30735L5503J10551m4691r7722M8458Q9916m1699p8009
$$ -57965 85632 54146 -76589 -41086 69465 24774 -72948 -24490 65426 23727 -54282
128e4282L5507O8882k9731o6955J9480O6231r183o6985M417P5094K39q7303n922
$$ -54282 -18775 50107 20376 -46579 -27099 39132 29949 -37036 -32619 42475 42714 -44589 -50511
141e0511R7983P810j07528l178J18370n125j29902J4581J38941k5504j44239L8816
$$ -50511 47472 55282 -52246 -55424 62946 57821 -72081 -57500 81441 55937 -88302 -49486
153d9486J46291n2587j45022O5002J38541p8477j30004R0796J22006r7766j11526
$$ -49486 96805 44218 -100804 -35802 102739 24262 -105742 -14946 107060 9294 -102232
164a02232R9634R6793j01108q3220J00626P2591r5775o3005Q8699N5656q0902
$$ -102232 -2598 94195 -6913 -90133 10493 83084 -12691 -75696 13003 68659 -12243
175a2243n2442P0529N1033n9882n0050N2929N3379m8255o0672M3662O8731m1039
$$ -12243 -64685 5844 56877 -3005 -53055 -126 53253 4998 -55674 -12012 56719 15680
187A5680p5555M2210Q2640m5985q8532N2548R2634o1492r5513P1744R6547q0920
$$ 15680 -59875 -17665 64975 18990 -69542 -16994 75640 14148 -81365 -9621 86926 6006
199F006r3676Q9651Q6959r8862p8193J07263O8697j12796n8354J14759M6865j14455
$$ 6006 -87670 1981 88940 -9922 -88115 19148 87845 -24951 -83305 31454 78319 -36136
211c6136l5204J11505K4290j06769j4649J00539P443r3711l712Q5111J934p6012
$$ -36136 -71340 40165 64455 -42314 -56963 43576 51019 -42692 -46404 38707 40641 -35371
223c5371j518O8549K773o3567o499O0063J1591n8239j7081N8604K2231o0619k6126
$$ -35371 -36889 31660 34433 -29134 -35633 24430 36021 -22218 -39299 19305 41536 -19083 -45209
236d5209O4806K8133p0956k8685P8446K8256q5355k5516R1482K0374r6695j3102
$$ -45209 19597 47730 -23226 -51911 26535 54791 -30564 -56080 35402 55776 -40919 -54021
248e4021J01253M826j04189M121J05304j2698j04099K1020J00526k8840r5365
$$ -54021 47232 52058 -52131 -48010 57294 44596 -59503 -38483 62043 33203 -62162
259f2162L5852Q9485m1222q3150M4052P6339m4920o9359M4078O2660m2254n7470
$$ -62162 -26310 63175 21953 -61197 -17145 59194 14274 -55085 -11007 51653 9399 -48071
271d8071L9307N3906l5666n2397L1117N2343k6804n3360K3203N5472k1300n8956
$$ -48071 -8764 45142 9476 -42921 -11804 40539 13735 -39625 -16422 39050 17750 -41206
283d1206K0707O3430k1448o8033K3309P2263k6724p5240L1435P7245l7464p7817
$$ -41206 -20499 42931 21483 -46550 -23241 49022 22298 -52942 -21507 55738 18274 -59543
295e9543M4172P7313n0526p5216N6478P1379o1291o6089O5607O0080o8800n3408
$$ -59543 -15371 61942 11416 -63800 -7322 64057 2766 -63323 2284 62364 -6436 -59844
307e9844P0440M7081p0425m0825O8820L5175o6171l0137O2837K6331n9231k4072
$$ -59844 10596 57677 -12748 -53573 15247 50422 -15749 -45886 16951 43282 -15949 -40021
319d0021N5302K3233n1695k3420M8381K4375m6155k5991M4889K8005m5068l0397
$$ -40021 15281 38514 -13181 -36601 11780 36155 -10000 -35991 8898 36903 -8165 -38562
331c8562M6154L2436m8187l4083N1093L4453n4683l3916N8698L2338o2740l0031
$$ -38562 7592 40028 -8159 -42242 8851 43304 -11379 -45295 13403 45741 -16999 -47030
343d7030O6460K6657o9407k2269P1633J7351p2937j2008P3376O841p2726j871
$$ -47030 19430 46087 -23320 -45589 26044 43395 -29542 -41550 31826 38667 -34059 -35930
355c5930P1140k411o8539O285O5454r163o1990J1098N8800j2159n5563J2284N2774
$$ -35930 35210 32799 -35740 -29455 35999 26836 -35154 -24056 34744 22585 -32978 -20694 32080
368C2080j1659n0469J0546M9083r361m8479P953M8699o832m9583N988N0906n863
$$ 32080 20421 -30048 -19502 29581 20220 -28259 -20306 28393 21561 -28022 -22034 28872 23009
381B3009n2772O406N4596p747n6552R745N8065j2382n9259J5390N9655j8878n9494
$$ 23009 -29763 -23357 31239 23492 -33060 -23315 34750 22368 -36891 -21501 38154 19276 -40218
394d0218K2474N8658k6201n6936K9395N4693l2173n1946L4493M8879l6143m5640
$$ -40218 -17744 40914 14713 -42223 -12828 41865 9692 -42254 -7761 41118 4975 -40665
406d0665L7279M2482l7506l9480L7414L6898l6770l4621L5915L2942l4763l1818
$$ -40665 -3386 39096 1590 -37890 -476 36422 -348 -34969 946 33888 -875 -32693
418c2693L3846L1197l2797l1120L2328L1244l1974l1644L2219L2188l3099l2682
$$ -32693 1153 32350 -447 -31567 761 32005 31 -31613 606 32794 -305 -32987
430c2987L4197L3016l5708l3087L7527L2626l9604l1862M1659L0590m3864k8901
$$ -32987 1210 34226 -1482 -34569 2958 35584 -4020 -35882 5777 36367 -7497 -36398
442c6398M5518K6864m7127k4473M8184K1808m8844j9315M9197J6629m9212j4039
$$ -36398 9120 35984 -11143 -35616 12568 34376 -14468 -33783 15414 32043 -17169 -31208
454c1208M8651J1884m7872r854M6826Q293m5716o887M4558O031m3487n507M2804
$$ -31208 17443 29327 -18545 -28399 18427 26720 -18996 -25883 18675 24706 -18781 -24288 18516
467A8516N006m1979m599M1585M457m1387m116M1487L852m1802l261M2139K606
$$ 18516 23522 -18457 -23056 18529 22986 -18401 -22517 18970 22822 -18980 -22241 19898 22504
480B2504m2540j682M3047M67m3428Q40M3861k442m4067L968M4143n888m3924P518
$$ 22504 -20036 -21718 21329 21796 -21632 -20792 23069 20627 -23440 -19472 24671 18783 -25141 -17623
494a7623M3457r323m2874J0968M2129j2506m1367J3769M0266j5013l9159J6005
$$ -17623 25834 16511 -26363 -15395 26734 14228 -27139 -13370 26896 11883 -27276 -11271
506a1271L8148j6932l7217J7724L6275j8416l5221J8848L4371j9274l3696J9972
$$ -11271 26877 9945 -27272 -9548 26727 8311 -26910 -8062 26309 7035 -26661 -6689
518f689L2942k0447l2314K0924L2023k1498l1443K2082L0976k2601l0555K3649
$$ -6689 26253 5806 -26508 -5584 26439 4941 -26502 -4420 26556 3955 -26600 -2951
530b951K9868k4333k9212K5047K8738k5785k8068K6422K7377k7096k6583K7898
$$ -2951 26917 2584 -26628 -1581 27157 1372 -26696 -274 27103 7 -26576 1322
542A322K5564k8556k4753K9129K3915k9663k3070L0086K1932l0612k0909L1124
$$ 1322 26886 -1670 -26423 2706 26621 -3042 -26112 3974 25906 -4706 -25615 5509
554E509J9792l1644j8908L1993J7881l2275j6747L2399J5480l2538j4314L2738
$$ 5509 25301 -6343 -25251 6742 24623 -7652 -24399 8000 23480 -9058 -23372 9366
566I366J3170l3012j1985L2887J1147l2775j0042L2567Q994l2365p970L2283P177
$$ 9366 22536 -10476 -22461 10426 21573 -11202 -21244 11323 20317 -12048 -20018 12265 19442
579A9442l2130o394L1886N991l1675n246L1464M664l1369m136L1663L598l1827
$$ 19442 -12688 -19082 12804 18795 -12880 -18126 13338 18002 -13367 -17503 14160 17758 -14069
592a4069l146L1979K640l2138j840L2309Q78l2616N5L2986j050l3369K065L3414
$$ -14069 -17215 14764 17404 -14734 -16574 15735 16613 -16003 -15948 17038 15988 -17381 -15316 18098
606A8098l368l3284M790L3018o295l2809P629L2247q764l1679R820L0745j1032
$$ 18098 14730 -18554 -13764 19254 12959 -19850 -12221 20026 11262 -20417 -10597 20148 9116
619I116k9519J1842K8587j2766k7612J3340K6650j3433k5646J3356K4753j3420
$$ 9116 -20403 -8561 20026 7260 -20352 -7012 19638 6205 -19441 -6085 18668 5248
631E248k3927J3591K3465j3589k3227J3625K3213j3382k3288J3555K3229j3924
$$ 5248 -18679 -5088 18377 4788 -18439 -4814 18399 5017 -18271 -4716 18513 4589
643D589k3166J4767K3335j5591k3659J6494K3691j7355k3429J8467K2776j9829
$$ 4589 -18577 -3810 19525 3934 -19725 -3231 20460 3105 -20324 -1857 20919 1090
655A090k2107K1287K1331k2553k0459K3413J9211k3970j7774K4493J5983k4977
$$ 1090 -21017 270 21601 -952 -21411 2002 21213 -2757 -20531 3962 19945 -5032
667e032j4559K5271J3314k5303j2123K4592J1150k3975j0084K3314R258k2901
$$ -5032 -19591 5680 18994 -6309 -18432 6160 17310 -6665 -16749 6565 15823 -7078
679g078q832K2510Q826k2004r104K1563R267k1279r232K1513R319k2110r401K2939
$$ -7078 -15910 6600 15426 -6578 -15682 5881 15148 -6131 -15363 6150 15469 -6641 -16042 6897
693F897R627k3552r638K4401R030k5142q045K6103O978k7126n842K7911M615k8174
$$ 6897 16524 -7028 -16666 7735 16765 -8377 -16422 9681 16659 -10467 -16309 11602 16217 -11957
707a1957l118K7996J416k7746M97K7332k077k6903L310K5934m228k4654M943K3145
$$ -11957 -15075 12921 14337 -13409 -12912 14420 12343 -14560 -11250 14684 10456 -14198 -9255 13890
721A3890n707k1813O127K0859o336k0139N873J9476n328j8813M929J8329m736
$$ 13890 8183 -13630 -7503 13356 7020 -13119 -7246 12230 6902 -11911 -6982 11347 6611
734F611j8385M660J8855m423j9610M350K0134m365k0692N180K1102o234k1755
$$ 6611 -11774 -7114 11741 7318 -12292 -7942 12192 7827 -12865 -7685 13417 7183 -14572
747a4572P609K2375q853k2553J0082K2416j1449k1640J3095K0748j4716j9819
$$ -14572 -6963 15412 6559 -15994 -5912 16504 5055 -16585 -3490 17258 2542 -17277
759a7277J6050J8868j7009j7474J7352J5779j7431j4141J7751J2507j7657j1526
$$ -17277 -1227 17641 632 -16842 510 16289 -1142 -15283 2468 14975 -2682 -14208
771a4208J7231J0738j6444j0169J5419R565j4670r086J4065R215j3905r826J3675
$$ -14208 3023 13761 -2683 -12852 2567 12132 -2538 -11624 2441 11656 -2249 -12075 1600
784A600J0540j3503j1187J3542J1455j4116j1553J5014J1827j6254j2031J7450
$$ 1600 12140 -1363 -12550 992 12447 -1669 -13222 1792 13619 -2635 -14666 2784
796B784J1932j8279j1358J9216J0192k0186q774K1191P600k1983o269K2154M994
$$ 2784 14716 -3563 -14921 4295 14487 -5699 -14473 6718 14318 -7665 -13934 8220 13214
809A3214k1877l339K1425J722k0874l05K0336n94j9503R87J8446j304j7136J455
$$ 13214 -8663 -12002 9423 11145 -9729 -10034 10302 9708 -9795 -8808 9638 8334 -8802 -7347
823g347J6191j664j5496J405J5150q24j5030J17J4805M23j4889o72J5240O94j6183
$$ -7347 8844 7180 -8316 -6911 8239 7415 -7615 -7498 7307 7730 -7159 -7831 7409 8103 -8080
838h080n02J7051M06j7965j01J8537o93j8954J883J9465l339j9945M732K0021
$$ -8080 -8582 8469 8875 -9090 -9191 9346 8653 -10301 -8418 11047 7708 -12237 -7505 12516
852A2516n843j9703P093J8865q294j7820R558J6864j0505j5884J1108J4796j1065
$$ 12516 6673 -13030 -5937 12928 4634 -13186 -3628 13236 2731 -13153 -2045 12751 1686
865A686j3522J0862J2268j0690j1178J0566J0435j0064j0189R406J0028q476j0026
$$ 1686 -11836 -974 11294 604 -10574 -8 10427 363 -9826 -420 9608 1132 -8894
878h894P920J0071p826j0302P845J0853p997j1646Q211J2139q649j2378R333J2433
$$ -8894 -974 9097 1271 -9031 -1186 9667 1670 -9976 -1765 10374 1725 -10653 -1320 11113
892A1113j0512j2367J1564J2370j2802j2021J3655J1383j4367j0332J5067R127
$$ 11113 601 -11766 -202 12168 -634 -12655 1000 12383 -1984 -12316 2751 11878
904A1878j5901p912J6393O870j6355n885J6022M839j5487l737J5016K883j4545
$$ 11878 -4023 -11935 4458 11328 -5027 -10912 5110 9949 -5538 -9275 5741 8624 -5921
917e921k345J4013K096j3113k197J2490K193j1868k156J1571K504j1728k906J1919
$$ -5921 -8266 5747 7843 -5270 -7467 5023 7216 -4652 -6808 4763 7267 -4461 -7367 4552
931D552L451j2186l683J2391L702j3038l394J3768L068j4564k744J5283K172j5706
$$ 4552 8003 -4183 -7866 4525 8227 -4811 -8205 5563 8631 -5933 -8677 6606 8778 -6928
945f928j383J5898L00j6161Q83J6170k010j6096K813J5773l684j4970M391J4128
$$ -6928 -8311 7587 7887 -8274 -7391 8779 6769 -9327 -6514 9259 5575 -9395 -5004 9124
959I124n111j3314N541J2714n818j2055N817J1360n593j0674N476J0104n209r957
$$ 9124 4013 -9301 -3760 8954 3136 -8919 -3102 8258 2665 -8009 -2533 7571 2362 -7595
973g595N117R951m805r998M422J0294m271j0457M427J0695m706j1101N201J1484
$$ -7595 -2478 7473 2668 -7330 -2908 7386 3115 -7342 -2915 7780 3074 -8027 -2826 8658
987H658n636j1857O234J1857o817j1760P715J1419q583j1190R371J0773j0039
$$ 8658 3022 -8835 -2601 9256 2439 -9321 -1606 9813 1230 -9960 -589 10184 145
1000A45j0106J0350R349j0745q483J1074P618j1250o981J1213O257j0874n770
$$ 145 -9961 389 9738 -1007 -9490 1584 9202 -2048 -9029 2184 8441 -2433 -8203
1013h203J0561N159j0185m770R923M635r797m524R436M695r161m667Q931M784
$$ -8203 2358 7517 -2668 -7438 2485 7120 -2677 -7201 2235 6930 -2231 -6898 2033 6817
1027F817r106m720R363M824r567m963R941M978j0275m856J0764M485j1121m031
$$ 6817 -2289 -7009 2354 7178 -2389 -7352 2589 7567 -2708 -7564 3200 7685 -3436 -7467
1041g467J1633L547j2078k947J2208K361j2267j691J2287Q95j2116l12J2063l72
$$ -7467 4166 7713 -4365 -7312 4896 7257 -5010 -6701 5586 6481 -5635 -5947 6116 5744
1055E744j1750P18J1404j200j0957J527J0564j943j0092J862R917j849r812J834
$$ 5744 -6006 -5288 6116 4916 -6041 -4514 6050 4107 -5985 -4123 5794 3945 -5867 -4033
1069d033R596j837r402J843R345j842r501J918R638j947r765K086R973k389j0112
$$ -4033 5563 3726 -5676 -3833 5512 3670 -5831 -3913 5725 3778 -5987 -3901 6072 3683 -6429
1084f429K849J0227l173j0262L581J0344m094j0290M743R925n026r810N551R494
$$ -6429 -3580 6647 3474 -6788 -3207 7137 3043 -7247 -2504 7421 2395 -7415 -1864 7630
1098G630o041r013O283Q693o545q189O700P742o859p390O957O961o912o656O788
$$ 7630 1589 -7424 -1141 7552 1007 -7182 -482 7260 401 -6989 -32 6929 17 -6639 149
1113A49O417o798o162O694N963o650n941O694N850o720n846O831N743o899n810
$$ 149 6566 -232 -6394 300 6263 -387 -6328 366 6216 -504 -6350 481 6224 -675 -6485
1128f485P202N595p367n469P567N396p849n241Q184M987q414m629Q701M256q843
$$ -6485 717 6312 -1055 -6524 1043 6439 -1410 -6651 1533 6520 -1894 -6523 2178 6434 -2409
1143b409l950R111L539r137l198R250K744r185k325R083K050r103j722R010J442
$$ -2409 -6359 2752 6291 -2846 -6044 3206 5950 -3235 -5560 3523 5573 -3530 -5252 3758 5200
1158E200q798j239Q676R73q560q33Q565N80q481m86Q405L98q468k78Q543l0q456
$$ 5200 -3598 -4837 3839 4812 -3748 -4581 3984 4564 -3917 -4403 4002 4400 -4068 -4346 4197 4167 -4289
1175d289J40Q471k47q584M54Q589p46q596J037Q520j271q511J540Q453j735q447
$$ -4289 -4149 4322 4075 -4509 -4055 4534 3788 -4808 -3771 4749 3478 -5033 -3493 4960 3225 -5222
1191e222K124Q308k411q181K726Q089k945p894L166P635l306p521L506P414l678
$$ -5222 -3098 5210 2799 -5382 -2656 5433 2488 -5406 -2240 5395 2089 -5432 -1926 5488 1810
1206A810p121L815P013l998o822M121O692m280o595M481O438m613o346M787O145
$$ 1810 -5311 -1496 5517 1519 -5303 -1182 5510 1230 -5365 -884 5554 941 -5405 -618 5527
1221E527m917o062N049N983n301n840N452N652n604n504N686N324n808n189N928
$$ 5527 610 -5452 -403 5580 279 -5561 -109 5543 -61 -5565 121 5445 -363 -5552 376
1236C76N016o143m669O071M664o296m449O389M294o572l979O575L793o627l650
$$ 376 5392 -751 -5420 651 5315 -981 -5430 959 5253 -1319 -5298 1277 5070 -1557 -5207
1251e207O804L522o957l190O913L062o975k860P150K556p097k315P187K076p232
$$ -5207 1597 5119 -1838 -5028 1885 4947 -2028 -4888 2262 4818 -2279 -4594 2593 4669 -2563
1266b563j858P224J641p205j479P229J161p093j011P168P02p061n39O994L87o977
$$ -2563 -4421 2803 4444 -2761 -4240 2989 4150 -2943 -3954 3214 3916 -3145 -3684 3310 3697 -3280
1282c280l10O957J42o906o0O880j74o817K41O822l96o819N38O889p65o893R86
$$ -3280 -3590 3367 3509 -3397 -3457 3423 3249 -3568 -3327 3495 3099 -3720 -3182 3707 2942 -3951 -2965
1299b965O908j144o959J286P067j651o900J833O877k075o785K408O698k640o569
$$ -2965 3943 2799 -4160 -2874 4193 2542 -4358 -2525 4352 2277 -4508 -2100 4598 1958 -4611
1314d611K892O467l048o306L305O020l423n867L582N710l709n508L763N308l767
$$ -4611 -1719 4748 1700 -4606 -1301 4719 1296 -4571 -989 4721 1012 -4496 -733 4575 808
1329H08n132L724N033l812m924L926M781l915m882M024M729m004m697M020M710
$$ 808 -4324 -600 4433 621 -4303 -377 4404 489 -4393 -369 4360 356 -4341 -321 4389
1344D389m238m749M494M562m600m540M786M498n043m303N326M082n501l851N653
$$ 4389 151 -4598 -104 4458 -142 -4682 104 4602 -441 -4744 582 4664 -837 -4688 965
1359I65L598n828l299N948L003n985k631N927K414o023k068N985J967n969j691
$$ 965 4563 -1265 -4564 1384 4387 -1598 -4229 1698 4112 -1911 -3979 2006 3973 -1996 -3687
1374c687N761J557n629j365N585J237n412j305N423J322n492j259N441J229n585
$$ -3687 2074 3631 -1998 -3363 2222 3459 -1953 -3258 2165 3487 -2005 -3264 2177 3406 -2179
1389b179j140N674J076n814j044N991Q42o090p16O160N11o334j93O449q4o597
$$ -2179 -3319 2355 3431 -2383 -3427 2564 3406 -2684 -3400 2760 3271 -3063 -3256 3193 3109 -3488
1405c488M18O567p54o460J109O355j527o122J711O012j907n889K143N641k249
$$ -3488 -3070 3497 2743 -3717 -2608 3747 2220 -3902 -2191 3821 1914 -3975 -1832 3809 1560
1420A560n260K271N037k318m828K368M711k276m645K177M603k065m605K117M492
$$ 1560 -3700 -1429 3608 1290 -3538 -1170 3541 1265 -3380 -1203 3400 1335 -3270 -1153 3339
1435C339k034m716K231M814k280m898K406M899k597m966K884M946l185n002L537
$$ 3339 1305 -3411 -1180 3634 1354 -3544 -1138 3761 1164 -3802 -918 4028 843 -4159 -622
1450f22M970l805m892M073M523m337m221M670L865m814l676M910L413m963l014
$$ -622 4348 543 -4349 -276 4247 -90 -4311 359 4224 -590 -4266 644 4057 -906 -3920
1465c920M844K698m845k388M859K140m667k074M518J993m288j917M102K053m144
$$ -3920 924 3622 -1223 -3611 1248 3388 -1279 -3353 1165 3158 -1130 -3047 1055 3108 -1036
1480a036j983M180J995m121k179M167K326m423k171M433K176m646k142N042K030
$$ -1036 -3019 1161 3156 -965 -3144 1023 3349 -1074 -3245 1188 3364 -1282 -3424 1618 3648
1495C648n252j913N415J715n610j343N690Q92n822n32N935J76n875Q5N707m41
$$ 3648 -1604 -3517 1898 3613 -1997 -3340 2350 3242 -2580 -3112 2823 2999 -2876 -2791 2916 2475
1511B475n490P27N279r28n157J145M854j077m611J083M276j038m109R49M064r44
$$ 2475 -3015 -2288 2991 2063 -3094 -1949 2905 1828 -2783 -1700 2576 1538 -2571 -1622 2442 1498
1527A498m049Q87M033o77m087O01M197o42m292P37M525q15m819J086M926j207
$$ 1498 -2551 -1664 2369 1692 -2395 -1794 2403 1761 -2531 -1794 2731 1916 -2903 -1817 3109 1902
1543A902n041J528N059j885n011K207N029k582m980K925M804l177m533L347M142
$$ 1902 -3139 -1611 3448 1563 -3448 -1241 3788 1206 -3774 -849 3955 778 -3755 -408 3734
1558C734l569l772L719L491l794l275L702K920l571k627L361K500l326k356L198
$$ 3734 165 -3607 112 3603 -191 -3466 236 3156 -415 -3042 319 2819 -507 -2863 335
1573C35K324k970k509K952K491k799k548K745K682k904k771L117K946l240l041
$$ 335 2659 -311 -2820 132 2623 -176 -2724 21 2703 -201 -2972 145 3091 -149 -3190
1588c190L410K972l591k988M071K711m269k557M534K441m763k132M924J683n004
$$ -3190 220 3192 -399 -3387 684 3395 -874 -3431 1103 3544 -1219 -3351 1573 3256 -1748
1603a748j173M920R67m978o69M853M76m729k19M470o4m205J86M048k90l937K58
$$ -1748 -2921 1999 2966 -2012 -2681 2172 2648 -2081 -2300 2170 2106 -2099 -1913 2135 1845 -2092 -1834
1620a834L762j37l596OL464Pl435q5L603J08l719k59L928K58m049k09M192P6m472
$$ -1834 1928 1791 -1805 -1799 1665 1672 -1763 -1848 1755 1863 -1856 -2115 1813 2071 -1978 -2187 2005 2081 -2391
1639b391K69M655m76m777O92M811q99m771J254M640j527m660J988M497k232m198
$$ -2391 -2122 2533 2057 -2720 -2028 2783 1884 -2887 -1633 3007 1480 -3180 -1192 3305 1073 -3125
1655c125K342L985k488l645K527L382k644l112K679K920k576k869K440K681k209
$$ -3125 -783 3202 714 -2931 -404 2978 334 -2778 -99 2821 245 -2624 -184 2497 288
1670B88k612K182K464k078k567J957K700j946k801J892K999k079k996K140L141
$$ 288 -2324 -142 2322 244 -2323 -366 2334 388 -2413 -521 2478 399 -2597 -457 2684
1685B684k466l190K646L271k859l166L064L019l336k873L732K550l848k384L993
$$ 2684 218 -2972 -326 2945 86 -3080 -16 3003 -333 -3206 526 3076 -772 -3156 837
1700H37K112l995j753L975J489l961j244M001J022l866q39L658P39l469o24L396
$$ 837 2949 -1046 -2799 1176 2665 -1296 -2540 1461 2483 -1383 -2222 1436 2175 -1294 -1918 1478
1716A478N02l293m90L172O32l211p24L102Q16l045q42L103Q43l224r13L412R05
$$ 1478 1980 -1313 -1803 1369 2001 -1210 -1934 1168 1984 -1061 -1903 1200 2043 -1181 -2094 1318 2223
1733B223l617q85L762O97l829n45M004K07m049p3M173r5m292M69M160p36m038
$$ 2223 -1394 -2279 1483 2180 -1649 -2194 1810 2017 -2032 -2105 2068 1973 -2319 -1850 2310 1574 -2464
1750b464R21L946j205l687J348L545j381l374J408L182j430k982J492K939j571
$$ -2464 -1543 2403 1198 -2489 -1141 2404 1023 -2351 -943 2239 809 -2173 -681 2258 687
1765F87k795J484K714j320k701J262K671j293k619J256K809j297l007J435K969
$$ 687 -2108 -624 2090 770 -1931 -669 2002 709 -1910 -654 2155 858 -2149 -714 2255
1780B255j384l193J686L008j707l136J982L101k232l082K418K979k579k778K595
$$ 2255 871 -2322 -636 2372 665 -2471 -489 2612 380 -2702 -284 2695 116 -2662 -67
1795f7K690k811k519K976K262k965k182L005J944k952j747K939J565k895j437
$$ -67 2623 -188 -2707 269 2531 -434 -2616 389 2333 -619 -2366 573 2138 -757 -2194
1810b194K841J382k723j320K727J224k494j361K627J289k620j314K622J412k750
$$ -2194 647 2029 -694 -2014 713 1937 -557 -1918 709 1998 -622 -1936 686 2098 -652
1825f52j351K752J394k826j400L003J291l117j195L229J086l373r69L453P24l439
$$ -652 -2003 749 2143 -683 -2083 920 2211 -906 -2101 1128 2214 -1159 -2128 1325 2049 -1390
1841a390n91L489M32l585j89L509L9l418J30L227k04l195L32L097m70l002M85
$$ -1390 -1981 1508 1940 -1645 -1834 1675 1714 -1704 -1574 1653 1449 -1746 -1414 1683 1213 -1789 -1304
1858a304K966n22k875N46K783n01k827O03K851o35k811N89K951p12k866O84K851
$$ -1304 1662 1140 -1735 -1189 1594 1093 -1734 -1131 1720 1085 -1726 -1137 1814 1102 -1764 -1080 1771
1875A771p06k919Q34K986r01k976R75K990j154k965J358K895j458k900J640K785
$$ 1771 1065 -1854 -1020 1966 1065 -1911 -936 2054 900 -2065 -707 2188 730 -2170 -530 2255
1891B255j656k781J826K617j930k520K020K347j991k327K083K047k079j939K001
$$ 2255 599 -2182 -356 2261 331 -2189 -169 2178 187 -2140 -57 1990 -89 -2028 -27
1906b7J978k072j865K057J756k025j790K063J758j999j774K088J788k248j650
$$ -27 1951 -121 -1986 71 1827 -198 -1988 75 1833 -166 -1940 148 1936 -312 -1962
1921a962K277J663k257j780K402J624k451j432K411J497k507j461K642J330k681
$$ -1962 315 1978 -279 -2059 343 1967 -484 -1916 495 1992 -515 -1976 666 1996 -685
1936f85j182K707J128k841r33K851P85k809o86K846N89k866m89K817M11k792l85
$$ -685 -1867 840 1968 -873 -1806 1045 1830 -979 -1665 1181 1770 -1096 -1585 1232 1643 -1149 -1534
1953a534K695L35k682l02K698J97k634k16K630K06k707p5K687K5k682L2K626M
$$ -1534 1161 1496 -1186 -1488 1210 1407 -1227 -1443 1187 1393 -1314 -1389 1298 1323 -1359 -1327 1299 1303
1971A303k735O9K744j58k812L69K779m74k643M36K779o38k741P23K669p57k639
$$ 1303 -1432 -1363 1381 1223 -1589 -1220 1559 1085 -1558 -1122 1657 1019 -1722 -999 1670 913 -1726
1988a726R65K486q57k553R45K572j080k419J026K447j171k346J171K379j282k274
$$ -1726 -761 1725 868 -1685 -740 1832 752 -1667 -641 1806 635 -1711 -540 1839 557 -1717
2004a717J308K209j368k140J336K209j495k159J600J971j521k024J595J959j602
$$ -1717 -409 1800 432 -1708 -372 1837 342 -1817 -217 1754 233 -1791 -196 1763 161
2019A61j985J807J834j823j823J807J753j829j729J943J550j923j530K004J530
$$ 161 -1824 -17 1817 -6 -1829 -22 1731 -98 -1827 116 1666 -257 -1787 217 1747
2034A747k043j475K131J312j974j442K217J236k113j241K143J193k220j063K211
$$ 1747 -296 -1771 360 1672 -302 -1744 473 1709 -404 -1645 498 1691 -529 -1592 619
2049F19J020k195r98K240R44k338p86K330P98k417p15K394O82k410n70K370M45
$$ 619 1639 -556 -1554 686 1630 -708 -1494 836 1634 -783 -1498 896 1578 -832 -1402 968 1413
2066A413k404l99K475K87k439k13K383J51k391j4K272J8k385J08K297k3k276N4
$$ 1413 -991 -1390 1085 1372 -1067 -1280 1103 1254 -1137 -1151 1121 1139 -1246 -1138 1159 1136 -1140 -1086
2084a086K242j75k219K42K228k39k251K41K222k93k162L89K184m23k252N39K214
$$ -1086 1156 981 -1238 -996 1232 993 -1258 -1017 1205 912 -1250 -861 1323 900 -1352 -813 1401
2101A401o25k220P43K237q11k208Q90K188r73k103R65K099j044k015J082J969
$$ 1401 776 -1444 -701 1536 725 -1483 -593 1595 622 -1481 -516 1583 539 -1476 -394 1575
2117A575j188j898J251J789j271j749J285J701j310j677J311J634j381j519J384
$$ 1575 387 -1511 -260 1529 258 -1491 -206 1495 185 -1492 -181 1453 72 -1447 -63
2132f3J473j381j517J345J558j421j498J434J503j486j442J564J419j585j436
$$ -63 1410 29 -1488 -143 1415 -6 -1504 -70 1433 -53 -1495 69 1488 -97 -1533
2147a533J685J387j716j351J788J282j892j163J986J045j960r84K009Q62k021
$$ -1533 152 1539 -177 -1528 260 1542 -350 -1513 473 1518 -442 -1426 583 1445 -576
2162e76p43J951O95j922o75K032M90j994m04J954L55j883l37J773M21j840l63
$$ -576 -1319 632 1327 -595 -1270 762 1252 -742 -1146 808 1163 -720 -1057 716 1137 -703 -1066
2179a066J813L18j793l33J821L49j876l47J883K24j840k16J912J58j950j35K113
$$ -1066 747 1065 -728 -1061 760 1109 -767 -1114 769 993 -847 -1063 849 1007 -943 -1078 1035
2196A035L4k131jK119j32k066K56K029k46k086M53J936m62j972N98J884p03j678
$$ 1035 1069 -1062 -1063 1056 924 -1142 -886 1143 897 -1189 -736 1200 738 -1234 -636 1248 545 -1133
2214a133P49J613p65j668P90J589o66j562P01J478p38j414O25J501p25j483O85
$$ -1133 -384 1229 464 -1204 -414 1175 509 -1053 -352 1126 388 -1026 -401 1100 375 -1108 -423
2231d23J582o95j481P26J504q92j582R39J528r40j581J027J554j108j538J242
$$ -423 1159 464 -1017 -291 1213 321 -1261 -322 1206 266 -1315 -288 1266 158 -1380 -138
2247a38J526j262j538J451J315j404j369J532J134j489r93J533Q89j553q09J575
$$ -138 1388 126 -1412 39 1354 -50 -1419 113 1247 -242 -1235 298 1187 -366 -1175 400
2263D00P33j461p64J481P41j534n71J347P30j434o44J380O55j372o72J335O81
$$ 400 1133 -328 -1092 389 1130 -404 -975 372 1102 -332 -976 404 1059 -313 -985 350 1031
2280A031j454o02J389P20j493o72J535P04j644n56J648M11j673m01J735L91j830
$$ 1031 -423 -1025 364 1084 -409 -1081 454 1158 -486 -1042 606 1017 -656 -1057 678 1069 -761
2297g61l08J831J70j781n3J787j18j707J74J705k22j689K52J676l90j438L22J492
$$ -761 -1069 762 932 -849 -902 885 767 -940 -766 939 717 -972 -720 956 566 -872 -550 942
2315I42m61j399M29J361l86j370L58J387l58j306L61J306l34j323L02J365l36
$$ 942 481 -918 -489 872 486 -884 -526 861 503 -803 -442 864 530 -793 -491 874 538
2332E38j409L56J500m39j467M67J526o12j491O13J590p91j511Q38J450r52j348
$$ 538 -871 -515 985 546 -921 -454 1072 460 -1031 -418 1172 381 -1130 -292 1158 206 -1142
2349a142J079J190j083j242J169J188j160j079J161R23j151q69J118P74j053p97
$$ -1142 -63 1127 44 -1198 -29 1159 -1 -1080 81 1004 -147 -1016 102 876 -177 -974
2365i74J077P51r91p40J013P39r65p87J010P63r46q83J024Q47j022q28J049Q79
$$ -974 103 854 -137 -877 136 875 -90 -877 133 896 -50 -933 91 938 -84 -912 137 1016
2383A016j154q64J318P70j322q02J368P72j439o42J456N21j503m18J493L62j573
$$ 1016 -138 -1002 316 1086 -236 -1038 330 1102 -337 -979 477 998 -505 -923 570 932 -641
2400f41k67J529K10j473j12J437Rj377M8J281J4j349R8J251q3j144M4J142j06
$$ -641 -908 621 831 -642 -754 683 692 -685 -637 644 658 -691 -593 658 575 -569 -525 617 511
2419E11j156J0J218n0j129l1J175L9j109k1J210l6j291L4J360j22j319J40J384
$$ 511 -645 -635 583 533 -596 -627 548 587 -522 -543 667 631 -660 -626 734 612 -707 -567 817
2438H17k76j393M00J295l93j320N34J347o25j263O22J169p02j081P73J013q26
$$ 817 541 -852 -452 843 450 -870 -336 1011 386 -877 -255 914 212 -869 -96 917 91
2455I1j014Q23Q88p35q60P56P90p08q47P87P82p67p30O47Q05o67q42P17Q29p43
$$ 91 -923 -100 788 53 -807 -51 739 31 -816 -29 753 -14 -744 -97 708 41 -801 -84 745 2
2475Bp90P27Q33p74q55Q11R37r21q83J068O73r39p82J024Q10j160o52J077O16
$$ 2 -788 -61 772 -2 -857 -46 891 -30 -913 155 828 -111 -893 131 941 -219 -871 206 822
2494H22j081n48J193L78j183k81J150L46j157k98J075K56j088j79J091J76j132
$$ 822 -259 -807 386 764 -419 -700 450 796 -361 -659 416 672 -416 -595 496 672 -460
2511d60l7R18J87j040j58J013J73j039j22R74K34j075k76J139J10r92j93J114
$$ -460 -497 421 608 -432 -590 423 596 -443 -565 409 643 -432 -708 431 541 -451 -644 470
2529D70Q1j055p9J158J3j173kJ143j2j225J70J204k90j087L24J136l89j108L79
$$ 470 551 -504 -583 575 588 -585 -587 556 544 -681 -511 693 403 -684 -360 776 387 -721 -342
2548c42J037l51j018M64Q68l73r00M48Q66m75q28M24Q30m69p92N05O65l19q65
$$ -342 695 344 -674 -210 658 285 -615 -167 699 224 -604 -180 650 181 -611 -106 559 240 -625
2567f25M66Q32m92q43N41Q37n34r10N49Q40n78q09O59Q08p47p74P12P92p77p53
$$ -625 -159 673 181 -662 -121 716 182 -728 -179 661 83 -726 -67 741 -6 -780 -68 724 -53 -806
2587h06Q03P23p95p17R38N31q84m76Q67M56q03m74Q48N45r79l68Q77L78q88l65
$$ -806 -3 720 -75 -792 146 677 -207 -683 184 640 -163 -637 211 756 -223 -591 286 664 -224 -589
2607e89Q44L43q89k97Q18L70q06k86P78M20r57l37Q68L13r05k02Q52K72r53j93
$$ -589 255 598 -291 -588 230 600 -206 -492 286 706 -251 -588 280 593 -312 -514 338 610 -343 -536
2627e36R45J54r60j67J057M1r97qR36Rr61m3J018m8r88J03R28r4r88K03R70k06
$$ -536 409 563 -397 -564 493 534 -463 -471 465 474 -487 -530 488 440 -548 -445 483 389 -599 -396 574 368
2649C68r86K27Q97k19q63K98Q24k38q21K39P94k20p60K23Q08k81q16K25R09l90
$$ 368 -618 -391 506 287 -576 -278 546 308 -513 -274 520 300 -460 -237 571 290 -526 -301 608 218
2669B18p61M30P24l75p91L99P35l98p35M47P75n67o84N64P38o65o37N49O74o21
$$ 218 -543 -113 611 236 -555 -156 579 181 -554 -107 668 101 -583 -19 719 54 -583 -34 640 19
2689A9o44O14N89n92o30O34O00o67n41O66N03o34n07O42M97o30m74O60M43o75
$$ 19 -625 -11 578 -14 -644 -10 590 -77 -618 48 551 -83 -590 52 549 -81 -555 105 548 -127
2709a27m22O56M31o99l49O23L95p24l62Q48K46o97l12P46L19p75l07Q38J99p26
$$ -127 -549 107 538 -161 -510 113 508 -216 -578 270 516 -181 -493 253 572 -203 -510 328 527 -199
2729a99k41P77K23q51j81Q31J40p98j32Q22P0p94j02P56Q6p29q5P70J1p24m0P39
$$ -199 -440 337 560 -291 -472 359 499 -299 -431 391 461 -333 -435 321 407 -322 -407 363 374 -350 -390 349
2751C49K4p69NP73j4q48J10P41p5p33J13P75j23q52K38P64j78q20K88O57j81o93
$$ 349 373 -396 -391 382 368 -480 -370 371 296 -437 -324 451 328 -524 -286 478 300 -520 -232 425 244 -449
2773d49K25P75l15p12K90O70l12o53L45O27l31o10L66O17l69o10L63N82l40o77
$$ -449 -224 551 236 -476 -186 484 172 -481 -136 491 160 -450 -84 533 164 -446 -83 499 159 -518
2793e18M62O03m50n05L39N28m61m84M80N42m38n95M69N49n80m96O21N00o46m39
$$ -518 -56 547 97 -408 -69 459 -2 -486 -6 536 98 -497 -28 521 -59 -555 66 566 -80 -519
2813e19N43M09n41m17N83L86n38m20O97K65n46l38N62K96n19l11N47K97o05k38
$$ -519 24 433 -108 -525 58 444 -94 -514 183 448 -98 -436 126 422 -97 -408 139 436 -169 -407
2833d07O08K73o62j84N91K12o31j85N87K63n68k94O88J22o47j37O71J74p19j65
$$ -407 201 474 -188 -372 219 431 -200 -385 202 465 -103 -397 291 413 -234 -371 300 474 -245 -410
2853d10P29Q8p33l2P19Np09jO69k6o40Q3O64j40o35P5O53j30o32J37O14j33n91
$$ -410 319 407 -326 -358 361 366 -343 -344 325 299 -341 -258 406 266 -369 -294 359 229 -403 -266 348 215 -376
2876c76J41N68j19n64J04N95j68n39J68N55j26n65J51N27j68n85K24O04k46n64
$$ -376 -235 333 214 -350 -246 349 181 -358 -190 365 239 -326 -175 352 184 -401 -177 427 181 -383
2896c83K77N70k79o31L94N19l60n33L99M52l60m60L68M25l85m18M41M03m93l62
$$ -383 -106 464 185 -446 -52 467 107 -426 -27 425 65 -395 -27 398 13 -405 36 439 -54 -416
2916d16M28M28n51l07M79L34m73k88L74K72l65l26L93L81m01l42M31L34l98l60
$$ -416 12 440 -111 -418 61 395 -78 -366 8 280 -85 -411 -18 363 -38 -380 51 385 -13 -373
2936c73M76K64m58k61N24K19m70l53N89K93o26j54N17K16n26j70N21J97n99j48
$$ -373 103 367 -91 -352 172 391 -79 -432 157 450 -176 -330 187 403 -123 -293 228 425 -174 -322
2956c22N55J13n69o6N40J15n44j37N52L9n20m2N63j9n10M4M71k4n22j0N76q1m43
$$ -322 233 346 -223 -289 251 366 -178 -315 237 276 -244 -286 277 258 -252 -208 263 239 -283 -293 283 202 -241
2979b41k6M95Jn20L4N43n7n10L9N43n6n69J17N02j03m79J49N00j65n01J94N24
$$ -241 -267 228 229 -291 -257 286 229 -281 -242 301 245 -324 -207 295 192 -287 -138 362 197 -304 -110 414
3001D14k63n09L03M31l05m48L56M10l18l99K52M64l69l27K97L56l23l06K61L83
$$ 414 151 -358 -55 376 71 -377 -21 389 71 -328 -76 388 19 -308 -11 345 22 -284 -23 360
3021C60k68m26K77L70k75l51L18L33k90m07L87K83k68l61K76M32l91l47L74L92
$$ 360 92 -334 -57 313 38 -313 5 338 48 -359 28 311 43 -318 -42 390 -1 -348 26 418
3041D18m97k81L76L37m12l26N00K56m64k20M69K23n38j34L81K18m68o3L69K64
$$ 418 -79 -360 16 353 -59 -385 115 371 -93 -313 156 379 -159 -293 88 306 -162 -225 144 408
3061D08n73n7M41N1l98j71M47J20m53mL54Q6l57j41M21N8l99r4M87J3l97j08N20
$$ 408 -165 -222 219 270 -128 -299 148 268 -185 -189 165 251 -106 -247 174 232 -167 -261 226 239 -158 -266 254
3084B54N6n49QM97q6m44K2N19k7n55J20M09n2n71K13N65k59l89J46L77r6m11J75
$$ 254 310 -239 -231 266 180 -264 -242 277 250 -305 -185 224 172 -399 -186 379 120 -269 -123 254 158 -253 -78
3107g8L60k10l25J19M26j62m02J93L29j29l53J79L04j48l08J54L49k03l59J53
$$ -78 282 72 -253 -134 292 130 -272 -79 250 121 -232 -53 251 103 -205 -51 298 95 -264 -111
3127a11L89j91l51K11L57j86l83J70M52l69k98K94L65l25k89K91K47k91k68L47
$$ -111 278 87 -264 -53 304 118 -265 -95 357 -12 -310 -16 349 24 -265 26 273 -18 -286 61
3147F1K66l51k48L50K09m09j61M26J10l74j68L83J20k61k17M04P9k45j65L00J31
$$ 61 327 -24 -272 78 287 -122 -283 143 253 -121 -289 94 214 -47 -264 140 219 -26 -191 109 240
3168B40k10k73L21J57l09r3K31K22m29jK35J85k78j91L15J41m04n4M27L0n16O
$$ 240 30 -243 78 235 -74 -167 64 286 -143 -144 91 276 -2 -193 122 263 -141 -195 232 262 -254 -248
3190b48L89Q7m22p7M37Q7m89O1L97j07l23lM11J5m63Q2L83j08k87L4K95Nl91J09
$$ -248 141 228 -194 -271 166 253 -236 -175 222 115 -208 -211 200 215 -248 -166 217 109 -178 -144 151 156 -235 -126
3214a26L22q5k64N8K49K3l17P8L22j15l78J72K84o7l93J31L33j40l34R1M08j59
$$ -126 196 111 -153 -95 154 177 -140 -62 260 145 -233 -61 223 156 -237 -106 227 87 -247 -156 252 93
3236I3l46J38L75k07k65J93L02k70k56K09L04j97l22K15K28k35k40K90K09k53
$$ 93 -253 -115 260 53 -212 -19 283 13 -243 -34 270 73 -249 -34 194 -41 -281 9 218 -35
3256c5j94K87J07j39k31J37L03k04k19J78K14k29k90L46K39k88k20K85J50k74
$$ -35 -229 58 165 26 -205 -68 235 31 -188 -10 204 -25 -315 31 270 -18 -238 47 197 -77
3276g7j70K97K49k97j60K43J63k82j73M02J0k82j38K83K03l75r2K97J26l77j7
$$ -77 -247 50 299 2 -158 85 248 -34 -207 195 205 -77 -215 68 271 -104 -196 101 227 -150 -167
3297a67L39J3l38PL16K7l19p7K49J51l19r1L85k3l56M7K83K0k97n1M17j21k51
$$ -167 172 185 -153 -146 170 197 -122 -199 50 201 -118 -209 176 153 -203 -156 127 147 -150 -201 216 95 -156
3320a56K5K77ol48J16K77l3l22M1K79k3l55R6L27p0k86M2M31k28k78K12K84k38
$$ -156 -131 146 140 -208 -92 185 152 -170 -129 150 127 -228 -132 195 125 -161 -119 312 84 -194 18 302 64
3343F4k26J15L25j99k66J39K10r2k74J97K00j85k05J46J85r8k48J92K09j49k57
$$ 64 -162 -47 278 79 -187 -48 162 70 -204 -7 193 8 -197 -51 134 36 -212 -20 189 40 -217
3364b17J00L09j47k53K01K06j68k64K23K41j82k51K03J75k15j69J96K74l05j86
$$ -217 -117 192 45 -208 -7 199 31 -233 -10 231 49 -202 1 176 -39 -208 -12 262 -43 -229
3384b29L02J39k53j71K45J98k96j25K89Q1k22o9J52J88k34j27K88N8k50j45K64
$$ -229 73 212 -41 -212 33 231 -65 -190 99 180 -42 -111 41 229 -5 -132 156 214 -36 -181 83
3405H3J09k75j11L18N5k47q8K45M6k14q0K72K6k36p1K87j1k56j3L30K1l37j7K54
$$ 83 192 -83 -194 124 179 -68 -156 89 135 -79 -159 113 139 -97 -168 119 108 -148 -161 169 190 -147 -164 90
3429I0M3k70J3K36rj97J7K06j6k64P6K30l8k53P6K31J9l45O9K87r7k82J38K10
$$ 90 133 -137 -124 112 103 -94 -77 129 113 -151 -75 155 117 -136 -60 171 190 -155 -86 201 104 -178 -40 170
3453A70p8k58R2K41p2j96K2K73j40k09P9K17l6k80J80J24q8k24J21J98j24j58
$$ 170 92 -166 -74 167 95 -101 -79 194 54 -155 -76 141 105 -175 5 129 41 -183 -62 136 12 -146
3475a46J08J80j61j92J70K31j78k36J91K25j68k27J89J84j76k10J85K16j89k45
$$ -146 -38 142 -19 -211 -41 190 12 -224 -33 192 24 -203 -14 170 -6 -216 -31 185 -4 -249
3495b49L17J05j54j54J50J86k82o3J27J67j80j09K22J45k78j22K30J52k50j36
$$ -249 68 173 19 -135 15 201 -81 -144 -17 150 -30 -139 83 228 -50 -172 58 210 -40 -176
3515a76K95Q3k33j68K98J51l07k4J97M3k46m5J59J14k54j01L18N4k50m8L01j0
$$ -176 119 202 -31 -199 99 250 -57 -81 116 159 -87 -132 27 141 -113 -214 104 158 -92 -140 161 151
3537A51l05L2K79k7k83k3K76pk75P2K03M4l06J8K94m7k07j8K14N7l16Q4K51J1
$$ 151 -154 -122 157 130 -153 -176 100 93 -182 -110 93 137 -169 -151 143 96 -111 -129 85 142 -174 -90 161 172
3561A72l05M0L12j13k59R4K01n7j60k6K87j00k18J01J81r3j61P7J58m0k12P6J96
$$ 172 -133 -93 219 106 -153 -59 142 85 -75 -101 186 86 -132 -31 150 57 -104 -27 131 91 -121 -45 151
3584A51q8k11J42J81j68j55N5K34j09k19J92J79j68j50J21J66j53k42K26K15k22
$$ 151 63 -148 -6 175 7 -148 -93 141 32 -187 5 184 16 -134 -13 153 0 -242 -16 199 -23
3605b3k09K07J75j47j90K05J33j54k00K03J88j79j83K18J13j93j26K73O0j86j05
$$ -23 -232 -25 150 3 -187 18 151 -3 -203 0 188 9 -174 44 157 -36 -162 111 171 -15 -120
3626a20J62R2j58j10J56Q7j57q2K86mk50l9J94Q4k61k5K17N6k16r4K67J0j81o6
$$ -120 42 134 -24 -134 22 109 -48 -130 156 152 -98 -137 57 141 -120 -145 72 128 -88 -182 85 95 -86 -152
3650a52K76Nk63N3J76L3k45K3K23K9l77L9L00%j87oJ70Qj48k8J33J4k01J31J21
$$ -152 124 129 -134 -81 95 128 -117 -94 129 158 -219 -180 120 120 -67 -73 97 105 -43 -71 62 76 -125 6 127
3675A27m5j37MJ48k4j63N3J92m8k55N6J95%j86N2J66p5k36J45J53m4k09O3K22
$$ 127 82 -55 -51 97 73 -90 -37 155 107 -148 -92 103 103 -83 -31 135 60 -176 -31 122 78 -131 -68 154
3699A54j10k06J87J34j25k38J43J82p3k46J73J53j58j05R5J89j39j85K27O1j05
$$ 154 44 -162 25 159 34 -204 -61 121 48 -198 -25 128 -30 -135 -40 149 10 -175 52 113 8
3720Hp0O2J76j42k16K19R5j10j17J65P0j45j38J49Q2j35o1J47Q2j89j28K60Q9
$$ 8 -62 0 176 34 -182 37 132 22 -95 70 140 -5 -143 6 88 -47 -108 39 121 -68 -196 64 153
3743A53k46k7J98P6j57j41J90R6k25jJ19Q0j92l9J92P6k16k7J41P2j52p4K16K9
$$ 153 -93 -120 78 154 -3 -144 46 142 -83 -84 35 115 -77 -116 76 152 -64 -91 50 122 -30 -104 112 141
3767A41j55q3J21K5j03m7K03o0r7r7L09l1j82l3K03kk32jK16pk38J7L02o7k25
$$ 141 -14 -97 24 49 -54 -101 102 42 -55 -152 157 126 -56 -89 114 112 -120 -121 95 88 -150 -133 169 102 -123
3792a23M7K44o3k35J27J53m7j63N9K04j91j24Q0J42q8j53L3K14m3j94J12J52r7
$$ -123 -76 168 105 -130 -3 150 103 -60 -1 203 12 -112 -32 110 22 -131 -98 116 73 -121 -9 143 46
3815D6j66K7K67j39j88J70P8p5j61O9K29j12j51Q2J54j41j24J61J01r3j79J67
$$ 46 -120 -93 174 35 -153 17 95 20 -141 -72 157 45 -106 -24 130 -11 -135 26 127 34 -145 22
3837B2J39j71o4P6J44j51j19J15J57j69j25J54P4q0r9J34N0r4n6J93j3j45q1J66
$$ 22 161 -10 -74 2 146 -5 -124 -9 148 -21 -146 8 82 2 -97 37 87 -7 -63 130 117 -28 -109 57
3861E7N4j21r2J39P0j63l5J56P9j33j27J06J66k61P5R7J43k09j44J76Q0j42p4
$$ 57 111 -10 -102 37 107 -56 -91 65 144 11 -116 -10 156 -105 -30 67 210 1 -143 33 113 -29 -103
3884a03J77N4k25jJ65n4j03L1R6Nj42N0J58lk16N9J45n3j07L9J04m0j9j09J94
$$ -103 74 128 -97 -98 67 13 -90 -59 37 42 -100 -50 108 105 -111 -52 93 40 -67 -28 76 36 17 -92 102
3909A02l9j57P0K6J5j15Q8J12q7j27K2J81O1k85Q8K04q6k09K0K48k5k37j0K83
$$ 102 63 -94 -24 2 17 -98 -10 102 15 -112 -90 91 152 -133 -45 159 73 -136 -116 132 107 -130 -140 143
3933A43r0k30J14J92j35j20J76J12j52q6N6K01j03k09R5J19p6p0L9J90k03PJ14
$$ 143 53 -177 -63 129 -6 -126 50 162 10 -76 -20 181 78 -131 -36 83 7 -63 -24 166 -37 -30 84
3956H4M5j31n7R1L2o5r9J18M7o9r7J70J30j85j34J56Q9p5j05Q4R6j78m4J26Q6
$$ 84 129 -2 -59 32 64 -1 -100 18 65 -4 -101 69 199 14 -120 36 125 50 -55 29 125 -53 -97 29 115
3981A15j71p9J77O2j69k6J85K4j47j6R1K7j15m0K19j7j83L0R4M2k07k1K20jj85
$$ 115 -56 -135 42 104 -65 -91 94 118 -29 -45 46 73 -42 -82 137 120 -63 -33 61 103 -104 -125 95 94 -91
4006i1M1J33K2j21n4Q5K5p6K9O5N4j65j6J21M5j53j9J76L4k42N5Q7J2j37N8J31
$$ -91 -50 83 105 -16 -70 15 40 -36 -7 58 112 -53 -69 52 97 -56 -75 101 135 -107 -52 35 47 -90 -32 99
4032I9n8j20K5J54p3m3l5J31o7p7O5L9pj54Q0J22l4j71J40J33j28j41R5J21j10
$$ 99 41 -79 -54 100 27 -16 -51 80 13 -64 1 40 33 -121 -41 81 47 -124 16 149 21 -120 -25 96 -14
4057a4p1N8J13j04r0J18P2q7k8K9J25q3j05L7J58j18j41J41J36j14j86J29J76
$$ -14 -85 -27 86 -18 -108 10 82 -5 -33 -4 121 38 -67 -30 128 10 -131 10 146 32 -154 -25 151
4080A51r2j57R4L1l4j41J90L8j25q0J46J24j84J3O0P0j37k5J61q0q6l5J65J3j29
$$ 151 59 -98 -4 27 -7 -148 42 80 -45 -125 21 145 -39 -26 34 104 -33 -58 103 23 -63 -98 67 80 -49
4105d9p8Q8J75k12J1J51o0j25OJ01R9j44J8R4K5j44l1J45J5k14J5J90K4j78J4
$$ -49 -127 -39 136 -76 -65 86 26 -99 -93 8 107 -37 -19 75 100 -44 -75 70 85 -129 -114 76 100 -78 -64
4130f4J30k8n5o1J04qj07O8Q7%j37R8R4j18n4RO0Lj09P0N9N5p5j03J92o9j11L6
$$ -64 66 38 -17 -78 26 18 -89 -21 66 66 -71 27 121 3 -51 -42 18 21 -88 -18 41 96 21 -82 110 41 -70 -34
4158c4J17n1j00P6R4p2j65J06Q5jj23P0Q5o7r5M0R0K9j40J08O1q6p2RJ08m2n7
$$ -34 83 32 -68 8 102 30 -135 -29 56 55 -68 2 87 20 -75 -35 55 84 -56 52 113 27 -45 -36 72 30 -27
4185b7K6M3k3j39J20J03j29m7J15l8l9K7k8J41j21p4J11N3o8n5L6L8Rj50J03R7
$$ -27 -1 42 19 -120 0 103 -26 -73 42 4 -35 -8 -36 105 -16 -90 21 74 6 -49 -13 25 34 -116 -13 84
4211H4n0n6M5P7j93P6N3M9q6j02J33Q2j41k6O5N8j62M1M9O1n0k0J4J34j59K4Q0
$$ 84 34 -22 23 100 -93 -17 36 85 -1 -103 30 112 -29 -55 10 68 -94 -53 -4 57 7 -13 1 135 -24 0 80
4238H0p1l6j7J73l5p8n1J35l4j16L0J08M9k20O1Q8l6j31P2J22o4j02N9P2nj55
$$ 80 9 -27 -44 129 94 16 -35 100 66 -50 -20 88 137 -83 -22 66 30 -101 -29 93 29 -73 -14 58 53 -102
4264a02M6J28m1r5K8J18q3k7J7O0p6K6j8R4q7m1P6M0pj07Q5j9j5k0L5N7m6p5N8
$$ -102 -56 72 31 -64 -36 82 -1 -28 -11 49 -27 -1 -19 75 -12 -53 23 63 56 -51 34 15 0 -20 15 72 26 -49 9
4293IN2M6j90J03J13j22k7j0J49o3j39O9J26j68O4M4J9j15J9Q0l6k7n7K8R7r3
$$ 9 61 107 -83 20 133 11 -16 -26 123 60 -79 -10 116 -52 12 56 75 -40 -21 59 23 -4 -61 -33 64 -29
4319b9n8J02N4q7o6O9J10q4o5J02K7r9qL9P7j08k7J28m8o8m0J96q3m9j5L0L9j8
$$ -29 -87 15 69 -18 -84 -15 95 11 -54 48 75 -24 -32 7 84 -24 -51 77 29 -39 -79 117 34 -15 -30 0 39 21
4347B1m2N6M0r4PJ13q1k9o9J57k5j15P3J33j13m0j0J32l0j03k6Q4l4p6j8J18j6
$$ 21 -21 35 75 -19 -12 101 20 -9 -78 79 54 -61 12 145 32 -8 -18 114 84 -19 -45 39 5 -71 -89 29 13
4374A3q5M8J45j06j11Q8L5k8o2L5Q7Mj29j2J15n3p2P0N2l6m4OP1l7j0pL1No8P9
$$ 13 -72 -24 121 15 -96 -8 27 -1 -63 -28 59 63 -66 -78 37 -16 -88 -18 34 -2 -46 -40 31 -6 -16 -23 8 13 -55 24
4404B4O6j00m7L8R4j0l0rM1J1j20M2J25r5m5j1R5j11J1P9M7r5q6J26M3q3n5J08
$$ 24 90 -10 -57 -19 75 65 35 26 67 78 -42 0 125 30 -15 -26 69 -42 -31 48 95 0 -86 40 83 0 -55 53
4432E3K7r2k1L0Q6r0q8O0J06k7j12P3nl7m3J57j8q6J4P3k3n3l1J50o2j3j21K07
$$ 53 80 -12 -33 -3 83 -7 -95 -35 71 44 -68 5 0 -37 -80 77 59 -27 -13 60 37 -16 -47 103 41 28 -93 114
4460A14m2q9l3N6R6k00J39L6l1l6o0Q0M0j62J03K6Lo3n4J21Jo2J3J08l2q0J0L3
$$ 114 72 -17 -50 6 102 -98 41 77 46 10 -50 30 70 -92 11 37 40 -23 -77 44 45 -17 -4 104 72 -8 2 35
4488C5Jq4rJ78l2k01O2Q6kj11K9J02j3m7k1J03l9m7k5R2l4j4m0Q7j4n3JoN0p3
$$ 35 36 -48 -57 121 89 -112 -50 36 34 -77 -48 54 41 -6 -27 76 37 -10 -35 57 23 9 -31 56 42 -11 -10 -16 34 -39
4518c9j4J10n1j0j2J8O5j33J2J19m2o9N8P4r0Nk4L6k8K3nR6j30KN2Rk0q4O5Q5
$$ -39 -53 57 6 -4 -16 2 67 -66 -54 65 23 -46 12 86 -4 1 -23 13 -15 8 3 99 -31 -29 23 32 12 -72 -7 78
4548G8k8p5%J9lo2N6L8Kk2K3K4n3mK8K1q5K0O5M8p5p4N3N4p8rN8M3p5q8J65J9
$$ 78 50 -25 -25 -6 -9 -71 -15 23 25 3 26 50 -3 -7 21 42 -43 -23 42 90 15 -59 -6 48 -30 -39 19 62 -13 -101 64 83
4580H3p5n7O0O4j61M3P6m5jLL9j7k5PN8l7l5J3O6m3q3M4N3k6n5M6J10q5j32M8
$$ 83 8 -49 11 75 -86 -43 33 -12 -13 -10 29 12 -13 -6 52 15 -20 -7 59 16 -67 -23 30 4 -51 -5 105 20 -112 -64
4610f4Q2j9l9L8O2m8q2PN7N0p3o5J36J6l2m5J02o9k1MO1o8KnK0L0m4M0K9J1j67
$$ -64 18 -1 -40 -2 60 12 -70 -63 -6 44 -29 -94 42 58 26 -19 83 14 -7 -3 58 -10 -8 -13 7 37 -7 33 62 73 -94
4641i4J23l7k5P2rK0l6p6R6N6j06l6Q2R5j07m2N0KK9o4K1k3K4p2R8M1n8j0o2L8
$$ -94 29 -8 -33 39 30 50 14 -62 34 90 -16 -52 30 125 18 -24 26 28 57 -7 14 -9 15 -57 41 82 24 14 -48 -10
4671a0j7KP0j4p5l9Q7K1l7K0KK4k7j1J1J4q4k5Q3J6rl2O5K2p4j0N2K4q5L1K5l2
$$ -10 -27 -25 45 31 -44 -83 4 25 -12 8 10 34 7 -4 7 21 -63 -88 -5 11 2 -30 35 57 -17 -27 25 49 -36 -5 20 -12
4703a2m0k0J02m8N6l6K0K0p8J4N5j8k9RK3O0o6l4K5N5j13N4P7r6Mj8Q7k6ml8N7
$$ -12 -52 -72 30 -18 38 2 22 42 -36 -22 33 15 -14 -5 18 78 12 -22 3 58 -55 -1 76 -20 -16 -34 53 27 23 -15 42
4734D2m6J5m3N3m2N6p3j7R8q5Q0m6Q8j12O2L3J7j03K9mm7J0L1M1j6q3K2J7Q7n9
$$ 42 -4 11 -32 21 -21 35 -38 -55 43 -42 38 -8 80 -32 30 63 80 -23 6 2 -45 -35 -4 37 21 -62 -40 -23 64 5
4764Ej8J7O3o2J0M0j0n1l1J03r9L7J6l6L4K6l3k0k0L5N3%j43N9j3Q7j4l7L5j2
$$ 5 -13 4 67 5 15 55 45 -6 -37 66 -33 4 20 -16 18 44 11 -9 -29 6 59 59 -84 -25 -38 49 35 -2 33 21
4794B1j3M4k5L4nq5O5Rj6o0K0L5o5k6P2N5q7J8L0J1j3o5P4rj3k7K2J13o8j10R1
$$ 21 8 52 27 61 56 -29 36 45 29 -31 -11 24 -41 -67 5 60 -27 -9 21 32 19 -46 28 19 6 -21 1 114 46 -64 27
4825B7K1q4NP7Np2KJ7l0l1L8P7n3QK3l%j2m1O8n6q6R9qP2r3Q2l4Lk1j7M3J3j14
$$ 27 48 -36 -31 46 51 -21 -19 -2 -32 -63 -25 52 -1 7 30 27 27 15 -26 42 -14 -100 -1 -9 63 -30 52 18 21 0 -17 26 39 -75
4859g5Q3Jn2K4K4N2j28J15o0O0k5n3P1K4pl0M4k4j9Mn0O2q9M0%R6j00pk4M3m3
$$ -75 8 9 -43 -19 5 57 -71 44 -16 44 19 -34 37 61 54 24 68 44 25 29 -21 41 -48 -8 -8 88 -12 -19 -43 0 -43
4890d3K7N0L0o0o8K4J19l9j4M4j2n5j2M6J6k7J0j07P5Kj3K9qJ8n9P1l3Ll4M4p9
$$ -43 -16 34 64 4 -64 -40 79 40 26 70 58 3 -9 37 53 26 36 -71 4 6 -7 22 14 32 -27 44 11 14 -20 24 -55
4921e5P9l8L5j9j6K1%qk4J8l9L8j8J1N7n5j1m1Q8K9p4j4K3L8l3RKM3q0M0qj0M5
$$ -55 24 -14 21 2 -14 7 7 -1 -25 -7 -46 -8 -26 -15 42 -13 -24 -65 23 52 -22 -36 -13 25 -8 1 3 46 -34 6 -2 -12 33
4954C3K2p2L5M7l4r7L4O3QK2j07Q6n2J8l3O6n4J0j6M7p4N6Rl4m0J04j12M3j1R7
$$ 33 55 -17 18 65 31 -66 -32 31 39 61 -46 40 -12 6 -27 39 -15 -5 -21 26 -48 8 17 -17 -57 47 -65 -22 -33 64
4984F4l0o4M4p3N3l5O3K0m9k1L4m8Nj6J9M4K0j09N0J8mpM2k7L3r2M1O4pp1N6R
$$ 64 34 -30 14 -59 -6 -41 22 42 -7 -28 6 -42 -37 -53 -34 10 30 -79 -29 -11 -15 -22 20 -7 26 -66 -25 39 32 -39 17 26
5016B6j4Mo3Q0j6r3J48L1j15M6qn1KK4J4Nkojk6M2p9M8J7J1rj22J21jl8N6o1K4
$$ 26 12 16 -47 33 17 -76 72 103 -12 34 26 -25 -23 1 15 20 18 12 11 -15 27 -52 -4 13 24 15 -107 14 13 -25 31 -30 -6
5049fOrJ9j6%P5n7o9jN1Jm6P5nlj1QL8mk0q0J31m6j9l2P9q8lO2K7o1l6k9J19j4
$$ -6 0 -9 10 -6 -6 69 12 -57 -58 -7 -6 -52 23 18 15 4 12 50 46 26 -54 77 31 12 -20 59 -29 -32 30 57 -4 -40 -69 50 36
5084C6J5Mj4qj9j7j0L6J18r6k6n1lK9mK0jK7l0L2n2J04r2J9o8O3j0Mm1K9K5J1
$$ 36 51 55 41 33 14 -3 -13 23 141 45 19 -32 -35 -6 -10 10 9 36 6 38 -14 90 -2 17 -51 12 2 6 -35 -6 19 30
5116C0m2J2M1o2P6K0n3N8k9j06Q1K9p1L2O4l0q2M8J5Rk2l0rM4K2omJ4l2j4Nl5
$$ 30 -12 0 41 -21 55 75 22 80 51 -55 26 55 -16 16 80 50 -32 16 31 40 18 -12 -21 23 45 39 35 49 17 3 8 -27
5148b7j1kM8N6l9J0p5j6J0M3j1l7K5NP1m9nk3M0j00J21j1K3L0r3K3M9n5QlM4q7
$$ -27 -38 -40 8 64 25 35 -40 -56 -46 -3 -14 -51 -26 -21 50 1 -4 -27 13 -87 34 23 46 76 -17 6 55 0 8 5 49 -38
5180c8j6J11%m7m6L7K4P2j21O9m6J5k4Km6kM9J2K0K1q3L1l1M9Njrr3J26n9M8m4
$$ -38 -54 57 57 10 -36 1 25 97 -24 45 -1 14 -10 -8 -54 -56 -7 5 25 46 -37 -6 -37 12 17 16 7 -86 40 -19 29 -15
5212a5n8L5K7Rk0L0m8J1mM0l7L3k8Q6q2N6j4L1k4m0nJ6L8q0K7L8j2j06J16L7K1
$$ -15 -73 -38 -11 -2 -22 8 -40 -29 -33 7 -30 3 -25 61 -21 35 21 52 28 -12 -17 -1 37 -43 -16 22 10 -96 20 57 78
5243G8r4KQj1m4P8K0Plp3J21j10J9ML3K2j24J9O7m4N6jpo2j7M7L3L8j7o9L3Rk3
$$ 78 -16 -14 -6 -17 -61 17 37 44 41 -32 89 -21 -2 2 35 57 -67 -48 19 -25 31 30 23 -39 -56 -9 24 62 45 -24 9 18 -5
5276eQj9L5k7J2J1o0N1J9r3Q6m0k0lKK3J9lj4P7k2l3j5l4O9k5O8o8M3k7j5l4N4
$$ -5 3 -16 19 -8 4 15 -45 6 25 -68 18 -22 -42 -45 -43 -20 -1 -4 -18 59 37 4 -11 -45 24 -1 67 -1 42 15 0 -34 20
5309B0l0j0N4m0O6m6k0N5m6m5R4ol6l8Q9k2q1NL5k6N8n3pP2o3J0K1n6P1n3K1N8
$$ 20 -10 -20 34 -6 60 14 -6 49 3 -42 52 46 10 -28 61 39 -42 -37 -2 -28 30 -23 -30 42 -21 -11 10 -46 25 -28 -7 51
5341E1n3j4JM0k9N3m3o0K5J1P3o4J6K9r9P7Lk4m0K6K1lK0J1n4M3OK8l5j4k1J01
$$ 51 -2 -16 -15 25 -4 49 6 -54 -29 -18 55 -9 7 36 -63 14 17 -7 -47 -21 0 -3 17 28 -26 17 23 51 16 2 -19 82
5373H2n3k8K4M1m6j8L7k9j6ok1OJ6l0PqO4q2J7L4M4p7R1n1n6Q1Jk8K6n4N0m9R3
$$ 82 29 1 25 66 20 2 39 10 -6 -12 -33 -27 -11 -41 -34 -42 22 -60 -43 -9 35 -42 49 -2 -58 23 24 -4 22 -32 18 -31 62
5406F2p1K3J2Jo7PP2l9R0o9M3o5NmJ1PL8J2q5j9k6R4qN6o8mM5o3J8J8ql2OJ1l
$$ 62 -9 14 26 27 -40 -33 39 0 90 21 64 -1 4 0 11 18 56 68 -17 -36 -62 32 24 80 12 8 53 -10 8 26 18 -14 -8 3 0
5441@M1k3Mpk5OL8k9k5L5Prm2L4j3O2k7km2M0K9j08M8k0M4l6K2O3m1n8L0L8k4
$$ 0 41 18 22 15 -10 -4 34 5 -20 15 22 13 -29 5 -8 54 27 25 -17 23 52 -56 -8 -28 16 -20 2 65 24 -34 -4 34 10
5474A0L8l1j7Mk3P0j0m2K4n2R5q0oN0k5n9L4J07m8k9n0N1j4l1lJ6M1rK4l0LJ4
$$ 10 48 17 0 4 -19 51 41 -1 23 -29 66 -14 -20 30 5 -54 -20 87 39 10 -40 11 -3 -34 -37 -21 20 11 35 5 8 22
5506B2%l0J8Lk4rl4P0N0n2O7o9kJ5Pl8L1Ol1QN9j39J3J02j3j7J6K2o7N1k0KJ1
$$ 22 22 -8 10 13 -11 -20 -54 16 66 14 81 12 10 25 32 -6 25 31 0 8 67 -72 -59 43 30 13 29 51 -16 35 15 17 28
5539B8q3O8L6l8LK7l8j5M0q3O6m2m3N9M2m8J8N3k7J3m2O2o9rL1J3l2oK1j0K6j4
$$ 28 -55 13 49 11 14 41 3 -12 28 -55 11 -31 -74 -15 27 -21 -3 50 23 36 -6 56 -13 -22 9 22 -10 -16 5 -5 21 7
5571Gn3j3P1O3j4p5M5M6o6l0n5J16r1QK2P1p4K9J4p3J2L9m9L1N8p8K0N1J1p8K8
$$ 7 -46 -59 12 75 61 -14 31 77 11 -19 -74 42 -49 -41 -19 52 -22 7 21 -52 -40 -1 -50 -19 39 -39 -19 32 43 -35 -7
5602gM8m0l6L7J3j2J4jr0L1O2K8lK4m7n1L0K5Jp7J02m6K2K5l6j7k2J5O1r1M4K9
$$ -7 41 1 -35 2 15 3 17 16 -74 -43 19 47 44 68 21 -30 0 25 26 -51 51 5 27 52 16 -1 -23 -8 53 -38 6 35
5634C5l8j5L2j8qL9k7j1OKn7Q7l7K7kK7o7O8q5L7m1O3L4m3n5P6qj4l6L3L6n9J8
$$ 35 -3 -18 14 -4 -12 27 0 -11 -5 -3 -60 27 -10 17 15 42 -25 43 -42 -5 -46 17 51 8 -47 29 21 7 -29 4 40 -19 -1
5667aJ6Kk3qQ4o4kK8K1m4m7L8M5p6O5k8l6K0QJ1MN9k8lk9n8RK7K2L1Nnp1R3m5
$$ -1 15 17 -6 -14 70 6 4 32 53 9 -38 0 45 -31 34 6 -30 -10 -2 9 13 72 44 41 12 -46 -37 -10 12 43 48 43 -28 65 20
5702B0l5N7l4PJ5o0P5M7o6L0l5K0ol8Mk2Nj3N9n0L0j7l3P1o3O1n3k6P6k0l2M7
$$ 20 -15 42 8 15 30 -30 45 92 26 56 21 41 35 -3 1 -21 -16 -29 30 -20 10 -7 -40 31 -32 29 -24 -50 26 6 -26 21
5734B1prnJj2Qk0QN3lj00Q4om2K1K5r1J23m7Ml5M3%m9K7K0j0K0j4J7k8O8ll2o9
$$ 21 14 5 0 1 -11 -3 -23 -15 38 35 -65 19 13 -29 -8 17 -74 49 2 6 -29 14 14 -35 -8 12 2 22 8 25 -3 65 62 30 -39
5769c9M1l2j7mPM5l5M3J0m8K3J2jK5o6O0l7j2k8L5M8j1km7L9K8p3M0R1j53R7j8
$$ -39 2 -30 -47 -51 -44 1 -34 9 19 -29 -6 6 5 30 -36 24 -13 -25 -53 -18 30 19 17 -30 9 37 -36 4 95 -58 39 21
5801B1l3nl1O0m0O2l9n1P7o7J8P5m2J7K5l7K4n2ON7p9O8n0L9m9R4n9m9M5M3n3
$$ 21 -12 -17 -48 12 -28 34 -5 -56 21 -46 -28 47 5 22 47 10 34 -18 -12 45 -34 34 -16 23 -26 68 9 -40 5 48 -5
5832ej9L9jnl6O0M9q6J1ll1J09m4L3j14Q5Pk4k4j0L1m0K7k6J7J4q3Q3J7J5k7m2
$$ -5 -24 15 14 9 -27 33 82 -4 7 4 -27 82 38 71 -43 42 49 25 1 -9 22 -18 9 -17 0 14 -69 14 31 46 19 -23
5864b3N2m%J7l2j2j2k6N1N0o8L2k3nJ3n5O0m0l7K8O3k9Pm4J1K4k0jjK5K0Rr8P6
$$ -23 29 25 25 42 10 -2 -14 -40 11 61 -7 25 2 -3 10 -45 15 -25 -62 -34 29 0 7 -37 -26 -2 -22 -23 -24 1 21 30 -68 8
5898Hn5R8M1j09K2No1O3mL8l3n5k6NN3Q2j30O1M9k3l7J8RJ2OpnJ2m0M8o4mRQr
$$ 8 -47 51 92 -17 5 10 -51 12 8 46 13 -42 -68 -63 -10 72 -58 3 52 29 -8 10 19 31 37 30 25 37 -3 45 -19 -23 -14 -6 -15
5933a5o7Q6KM8k9Rm7J1K1l7K0J3n2RL7J6m8N4K1j00P3k3MN9j58Q7N2n7o5Q0O7
$$ -15 -82 4 6 54 25 34 -13 -2 19 -18 2 15 -37 -28 9 25 -23 31 52 -48 25 2 6 65 -93 -6 46 -11 -76 4 71
5964G1p2K8oKk2M5l4J0q5N6L0N4q4l4J31r8m2P8K2J3r7L9nlk3m7J12pL1Nn1NO
$$ 71 -1 27 21 23 1 46 12 22 -63 -7 23 77 -7 -41 90 -8 -50 28 50 63 -34 5 0 -3 -26 -73 39 32 63 68 17 22 28
5997B8L4j0n6JJ6nl1L6k5J8l8J5K9p6k2J7N1l2L8mk9k8N3m9R0j6k8P0p0l1N3p3
$$ 28 62 52 -4 -3 13 8 -23 13 -12 6 -32 -17 12 -64 -86 -69 -18 -50 -12 -16 -45 -73 -20 -69 21 5 -23 47 -23 -54 -1 -74
6029g4M4k3K4L9kl2J9N6k5N5q3l8P4k5L5l4l7M5k1j6J1O4k9l9o0N0k2O3M4q4J8
$$ -74 -30 -53 -29 10 8 -24 -5 51 26 81 -2 -40 34 9 44 10 -27 18 -3 -19 -8 56 27 -12 -72 -22 -44 19 63 -21 -3
6060cqL3L0Ooj5K9o4m5N5kJ5RK6m6j8J1rj5Qj1QlK9l0P0Oj03O4L1m0Q8j16K1N8
$$ -3 -11 22 52 58 52 37 66 2 -43 12 10 25 34 60 14 -4 7 -2 -17 -9 -20 -12 -15 14 -16 54 60 -43 21 52 12 100 -16 5 63
6095F3m9L4N1q3P1kn8Lm3m0J07p2k4M5Mnl3J6j6M5k6P0l1m0L5L6q8M2j2p4j7J06
$$ 63 14 48 99 16 87 85 27 30 -13 -53 54 -18 -42 3 7 2 -31 -15 -31 14 -12 58 27 -13 22 58 -30 12 0 -74 -91 15
6127A5o2P4m5L3k7j3J6R7m0Rm8k6L2k2K1rj1o9P9L2m9J2m9O8p2Q0m6K1JL9K1J2
$$ 15 -47 27 -18 15 -12 -25 -9 88 48 57 9 -17 15 -7 14 5 -6 -75 4 36 -13 -1 -50 18 -54 26 -20 1 2 41 62 74
6159G4o7M8n1j0K1n7Q2o9J07q8K0o8M2K0K9l8K1Jn0M1o3R3n8J7m2R5j26O0j8J04
$$ 74 7 55 4 -6 15 -42 40 -29 78 -10 10 -58 -16 4 33 -5 16 17 -33 8 -55 38 -20 -3 -45 50 -76 -16 -34 70
6189G0o9K6j7m9L8m3N7K5n8o4P7L3km1O0m1l1k3R4j4o9mN6N2j29J9M8j3M5k7n7
$$ 70 1 27 10 -39 -1 -44 13 38 -20 -84 -7 26 24 -17 43 2 -29 -52 42 28 -41 -45 11 63 -66 -47 1 -12 33 6 -51
6220e1P4l0K5L7r8M2l6R0K2j06N7l5n3R6Mj8K8n8L4%p6O2j8l1m4R4m7oN1pk0k2
$$ -51 23 -7 18 55 -43 -1 -37 53 75 -31 26 -9 -62 34 38 20 48 -10 24 24 -52 10 -8 -39 -83 11 -36 -42 9 2 -18 -40
6252d0R5r2P1j28J11MLM4o7j5QL6LJ4n4ok4J7qN7n3J4k8L8J8j1j9NK4L1r3Q8m4
$$ -40 55 -37 34 -94 17 21 24 68 1 -14 -6 30 33 47 -7 -13 -37 -20 -28 29 -24 -10 -38 0 18 7 -12 -7 17 48 -45 43 -1
6285aLJ4k3m1K7N6j10O6M1M3o7m5Q5k6K9k0n3L2rj4K3l0K3M7p9L2%k1N0o4K7m1
$$ -1 2 16 -7 -48 -21 35 -75 -9 32 75 8 -37 48 22 51 31 -22 10 1 -13 10 -20 3 50 -29 3 3 -18 32 -32 -5 -46
6317d6J7M8l8K4j4P1o4OM6j0k2Rl8L8n5O3m6qQM2J5m2l3J2NM3j8j7J4o3P8l7J6
$$ -46 -29 19 -19 5 -9 62 -2 4 50 40 18 27 -11 27 -28 35 -11 -19 -11 31 46 4 -29 -17 -12 31 13 -4 10 -53 25 -12 4
6350DJ1k7K0j8K9J3o6L6O8k1l6plK4l6JO2n2m5J9J5L3Lk3K0kp6O4L1k4l8L5l7
$$ 4 15 -12 8 -10 19 32 -34 2 70 49 13 6 3 27 -9 -8 54 2 -43 -24 -9 24 27 4 24 22 -54 10 41 17 -21 14 -23
6383b3K4jnmr3J13jL9K2n4M2o0qJ1nK8K0n9POL9pn1J2QJl4n9N1L4m9O5J3l0k0
$$ -23 1 0 -5 -9 -102 11 10 49 71 17 59 -1 -9 2 -3 25 45 -14 -7 -1 38 31 -20 -8 0 1 -33 -92 -41 -7 -56 9 22 -8 -28
6418b8%J5OQk1P7p5J3k2O6o4M8k1pMo1O3N2p4J5K1p9L1K2O0k5nk4K2ol5NJ9M8
$$ -28 -28 -13 -7 1 -20 57 -18 -5 -27 39 -25 23 2 -5 -1 -62 1 53 -21 -6 15 -64 -33 -11 49 24 19 -5 17 11 -24 -19 0 48
6452D8n3K2j5J8lq7O2m8M7M4L2q8jJL4j0RJ7J8p6NJ4nJO2n6j7jl7N6n0oj0L9K7
$$ 48 -5 17 2 20 17 -70 -8 -56 -9 35 67 -21 -22 -21 13 3 12 29 47 -29 -24 -10 -15 -14 48 -8 -25 -26 -63 -7 -57 -63 -73 -34 -7
6487gL4j4oK3k1p6R1On2j5Q4Jj1rq0M1k5L4o1J06k9J0k0L7l7m9M2J4k4Jl8N2L5
$$ -7 27 13 7 30 9 -67 24 30 -22 -37 47 48 37 28 -52 -11 -36 -2 -63 43 14 24 4 41 4 -45 -3 11 -13 -12 -50 2 37
6520C7o5PL5%jN5j4p9jP6k7n4RL8o0Q0k7j1m1lM2K3ln4J22j07l0M5J%L8k9o0O2
$$ 37 -28 -21 14 14 13 68 54 -25 -26 50 23 -31 -22 16 -44 36 9 -2 -43 -46 -4 19 16 -38 84 -23 -53 -8 -7 -7 31 2 -58 4
6554Dk4nN8n9j0M6m1k8P5j2k5J9o8J40o0L0J5k2m1j2j5M9J7l7J8m2mN0rJ8on3
$$ 4 -20 -25 33 -26 -36 10 -31 -59 16 4 -21 -2 -70 70 10 40 55 33 -8 -20 -35 14 31 -6 12 -30 -34 16 7 25 19 -34
6586c4M5K3m4O5m6jL2k8l4K2k5J1l2L8Pj7PJ4%o5N9j2L3K8o9M9k9l4Pj7NpN4J5
$$ -34 11 34 -10 55 9 8 40 12 -22 0 -25 -14 -46 -8 -1 -18 -11 3 3 -62 -3 -15 18 46 -23 26 -3 -37 -30 -47 -42 -49 5 20
6620B0o2M7P7j16K9L9n4L9Ok0j5j7K7j8LL3k3Mlj0J8o8Q6k5nN1l9m5%oN0j3lj0
$$ 20 -42 5 82 -34 -5 34 -20 19 25 5 -10 -27 0 -18 -15 18 -5 -1 -4 -14 4 -64 22 -3 -8 43 4 -41 -41 -47 3 -10 -13 -23
6654b3m3J36r7K5Lk1Q4qjj5k9l6L4rJ8M0j40J02k9%l3N3K9mo9K7O5m4n3m4J15
$$ -23 -66 70 -27 -2 1 -20 64 56 55 40 11 -25 9 0 18 58 -82 20 -9 -9 -42 11 40 36 -33 -6 59 15 -38 -82 33
6685C3m3k2J4N1m1kj1M7K5l1l2R2n3j9Pk7K3j7%Ll4K0R6j05L3J9m4m4R1m7N9j1
$$ 33 -10 -32 -18 33 -8 -10 -21 26 51 20 -12 80 27 8 15 -12 11 -6 -6 -3 -37 -17 79 -26 7 26 -18 -62 29 -18 41 30
6717C0l2N7m3M5o1m5R5q5O5n3L7j1L4l9L9n8ON2p1J16p4rmm1R4l6K5K1q4M0K3
$$ 30 -2 55 12 57 -4 -49 46 -39 26 -27 10 -1 33 -6 33 -25 -19 33 -38 78 4 -5 -9 -50 44 8 33 54 -30 10 33
6748C3m1j4L1qJ6l9O0k5J9p2K0K8Pk6L9j2k6OJ7j4Jm2K7K1Pl2Q4p8JK9n9L1K6
$$ 33 -8 -22 9 1 17 -22 38 13 32 -40 -20 8 15 -11 28 16 -10 -4 13 -1 0 -42 -15 6 13 -19 65 -13 -12 17 -42 -11 15
6781A5L2r4M0n3N9J8m6oJ2j3O3%n9L0ml4P5nQp9M1N1j2j60R0k1P4o5M2L5k2J3
$$ 15 47 -47 -7 -60 -1 17 -29 -35 -23 -36 27 27 -32 -2 -6 -40 35 30 38 -41 0 51 39 -121 -31 -52 22 -43 -1 34 12 25
6813B5p7L0J3N3p8L2N2o1L8l8o3P1qJ6QJ1j9J5j06R8n3M8l4K1nK4j9j0K6K2j5
$$ 25 -52 -22 -9 44 -34 -2 50 -11 27 -11 -74 -3 -11 5 13 24 5 20 -86 12 -41 7 -27 -6 -11 13 -6 -16 10 32 17
6844A7n3QJ6k7QJ2K6J2Nj2J7j4j7Lk4R9m9j9p1Q8m6L5Rml8L7n0oN9n7J05j03O7
$$ 17 -36 -28 -12 -39 -31 -19 7 19 24 12 29 15 -2 1 -23 76 27 8 -63 25 -21 14 23 19 -19 18 -32 -38 21 -36 69 -34 33
6877C3j9k0Nk1k7O2j1l%j9j8M8l8%oN8n8M3m0K6l9kN7k2N3l9MK7o5K8j1O7n3Q5
$$ 33 14 -6 -1 -22 -49 13 2 -1 -1 -20 -38 10 -28 -28 -34 24 -34 9 -31 -5 -44 -46 11 -11 42 3 7 34 -31 -3 -14 53 0 85
6911H5q5j3R3q9JJ5K0j10M3J9L6Om8Q2n4J9j1K3o7L5Rk6Mk0J9J5J11r3n5N0l2
$$ 85 0 -13 80 -9 -8 7 27 -83 -40 -21 15 21 -27 55 1 20 9 32 -35 0 9 -17 -13 -33 -14 1 112 19 -36 14 -18
6942a8J1k8j1L4L2J3l9k6j5K4k4Q8ql7K2n2j1L3l3QP4pk6OMM6m0qn1k8J18oq6
$$ -18 -7 -35 -46 -12 20 33 -6 -32 -47 -23 -47 41 33 -4 18 -34 -45 -12 -45 -37 37 30 4 10 14 60 20 12 -39 -67 51 45 -41
6975d1k7N0M7o7j8O7k2K3q7Q9k0mj6N0k8j8M0K9k1k7K0k9Q4j6p6O7l8j8j1l5J01
$$ -41 -68 -18 29 -38 -56 11 -11 12 -75 14 -6 -10 -26 24 -4 -22 18 47 26 -1 19 -10 74 58 -18 49 11 -7 -18 -53 48
7006D8l7L1l7K9n6J0P3o6%n4N3Q3j43M6rL6J7j08P2N5r7Q9n4K6m0M4j2m1O9o5
$$ 48 11 42 5 34 -22 -12 61 -5 -5 -59 -6 77 -66 -20 -29 7 24 -84 -12 43 -54 35 -19 7 -33 11 -1 -42 27 -38
7036c8K6N2K0j07L0N2n3o5Q2K9L7p5k7K7l7O2j2K6o4M6m7K7l3Q7l5n1J8N8o0K5
$$ -38 -12 40 60 -47 -17 35 -18 -83 -1 28 65 -10 -37 -10 -47 15 3 29 -35 11 -36 -9 -42 45 10 -41 -23 35 -25 0
7066@Po6L8k1O0m8J00q1O3n2k1m5L3M7J8k7k9J0Lq5N2j1J06k9n5J6Nj5P6p5O3
$$ 0 7 -59 -21 -42 18 -30 70 -11 52 0 -21 -66 -33 14 32 5 -24 -14 -11 -96 -44 -55 51 22 -33 -17 -12 -27 49 -26 37
7097C7jL1k6p2j5K5K6k4K6m0L2K3J9n9K1Mm2%QO2k7n2J1Q5r6j9N0L5l7M3k9kM7
$$ 37 36 67 41 -31 -46 -21 5 -19 7 -33 -1 22 41 -18 3 7 -35 -35 -27 35 8 -44 -33 52 -44 -63 -13 22 -15 28 -1 -3 44
7130D4j9J0m6Pm5j7J20l2p4K4P4lm3KKKM7k2l2kL4n5M2l1j9Q6m3k9m8P4K9n8N0
$$ 44 25 35 -11 -4 -49 -66 54 22 -52 -28 46 43 0 2 4 6 53 31 -1 -3 31 -24 18 -13 -32 54 11 -18 -66 8 37 -21 29
7163B9no9oN3K3m9lL2j1K7l3O2j8k5J3%M0p2K9M7q1O3mr9M4M2J1rm8PL8n4PJ7
$$ 29 24 -45 -51 2 25 -24 -27 5 -6 21 -12 50 32 7 20 20 60 -12 17 64 -17 46 42 -57 -13 29 40 31 -17 -10 28 -26 -19 -2
7197bL4n7L2L1K2p4J8j4qJ6J0L1l2K2m2J6n4M5L9j7q6J03q8N6L4m3M1lOr5M1J
$$ -2 32 -25 7 38 60 -14 4 -10 -18 -2 8 39 7 29 -13 3 -51 -6 33 16 -70 33 -55 1 35 -8 33 30 36 -59 -18 -17
7229a7j3MK4JN3q3J5K8Mn5OQJ02j09LO8o6K4o6J18j02Q3k7l3OO8k1o1K5kPM0k8
$$ -17 -30 -26 -2 -1 52 -31 -16 12 16 -39 -33 -25 77 -32 -29 39 -27 -3 -69 49 -53 30 3 -30 -24 44 23 -38 -13 -15 -8 32 4
7262Dm7K8J7L9o9N4r3O4L2q0J1Q5o7l1oL7L2k4MK5k4M3l7K5j8P7m8K7n4oP6q9
$$ 4 -43 -15 2 41 -28 26 -67 -3 29 -51 -40 45 -22 -53 -59 -22 10 -14 -10 15 -9 34 -3 22 4 81 33 60 6 0 76 -13
7294a3J10p7J9n0R6j17K2k5N4k8K7j8K6l7pRM5qm1j2K9l1k9O0k1k1K4Mk7M5J5
$$ -13 97 20 39 -11 85 -32 -10 -35 19 -9 18 0 26 -11 -18 -9 36 28 -13 -25 4 -27 -56 4 -17 -38 -14 -10 -37 8 23
7325B3j8Jj0j13J09L3l1JP%J0l0K3J3j6M9p1J00j30QR0m6K9j5l6P1o5Q9o5l0N
$$ 23 5 6 -4 -117 -8 25 -6 -5 2 2 12 -18 5 18 2 51 -20 80 -50 -42 48 2 31 16 -20 51 -14 75 10 -20 -15
7356a5k6P3l6k6P3q2P4l8L6m6K4l4l5M9P1p4n1L1o9P3qJ5N2m4M4q3N0M7n2L7l5
$$ -15 -41 32 -4 -30 43 -39 35 -3 33 -13 11 -23 -58 -9 62 -12 -63 -32 -101 -28 -36 -21 31 -13 31 -52 -2 45 -7 30 -5
7387ep1L0k2O4o4R6Pj9l6j3J9O9l9J1j1n9M7L2J4j03M1K9J5o4K8J7J3m7P4r6M7
$$ -5 -76 -46 -68 -4 -68 28 35 16 -20 -33 -14 55 16 27 16 -43 4 36 50 -53 -12 17 32 -32 -4 13 26 -21 53 -43 4
7418DJ2l6j0mRKM8m7M3l8K7K8j9jk5L6p2K4jN8ln8NP4j1n4j0j9P8o5l8R5j2o4
$$ 4 16 -20 -30 -34 -25 -23 25 -22 21 -17 10 38 19 18 -7 29 -43 -19 -20 38 35 -23 -18 56 45 -9 -19 -38 40 -25 -63 32 20 -44
7452d4P1j3n5J06k3m2Q7o1m5K5l2K9J8l2k9O2r3M6L4l5Q6j21M2RonO7j09PR8q1
$$ -44 27 14 -41 65 42 0 87 26 -19 6 -26 3 21 -11 -40 22 -71 -25 9 -26 60 -61 -19 -10 -16 -21 46 -63 -56 42 -39
7483c9J0J07q6k2JM3j4M2%pnp4M0K1l3RJ9oMk0K3pj1P6j23L2L0m2P6o8Q1o6J6
$$ -39 -29 78 -8 -30 -29 14 0 42 42 35 30 -44 -4 17 -16 -7 12 6 10 -10 13 6 -5 71 -52 -20 10 -32 44 -24 57 -9 7
7516GN2r8J2N5k9L9j6k1l0M9L2Or7K4J2k4M4J7Mj34J19p2Q1lJ6J2k1p6P1o2M8
$$ 7 59 -39 -27 28 -1 38 22 1 -29 20 52 58 -39 -15 -3 -27 17 34 38 -96 23 -49 32 29 45 57 36 -40 31 -31 17
7547A7l5J0j7O0m6MK6l5qM6k1m3M9n1L8k2L6L2J1r2J7O6n3j2K0J1p3M4L6o1K1
$$ 17 -18 -8 -25 35 -11 -7 19 -16 -24 22 1 -42 7 -44 -6 -28 8 40 51 -41 -24 42 -11 -23 -3 8 -65 -21 15 -46 -25
7578b5M6j6J9J8j23j3O8P0r0K9QJJ2l9P0q0J00m9j4jLK6o2N5MRl0J6%N0o3Mj7
$$ -25 21 5 24 42 -81 -94 -26 44 -46 -17 -9 -8 4 -35 35 -45 55 6 -8 -9 -6 20 -42 13 17 26 -4 12 12 62 -1 3 -14
7611a4j6J9rk3M1k1l9O6LK3n5K0k0O7j00L9L4m4N4o6mK6K7Pk3j8J4mlK9n5N9j7
$$ -14 -30 -11 -20 -43 -2 -23 -62 4 7 30 -25 -5 -25 42 -58 -19 15 -29 25 -41 -45 -19 8 15 -8 -26 -12 -16 -19 10 -45 14 -3
7644ck2O9n8LRM3n0J8j0l0Q0n9N0j2l3P6n3J3NOl2l0M5n6pJ20m1m3K9p1jj1P1
$$ -3 -25 44 -14 -11 -2 41 -9 9 -1 -31 49 -10 40 28 -5 71 18 31 36 42 10 -20 25 -31 -38 82 41 -2 27 -44 -45 -56 15
7677A5K6jj0mpl4Q3l1k7n7OM7k2j7K6L7Nk1p1N0L6j4m7K8l4l4O1N4k3L4m1j6R3
$$ 15 41 40 30 26 19 -15 68 37 10 -47 -41 6 -16 -33 -7 30 35 14 -57 -7 29 15 -32 -4 -38 -72 -11 43 20 54 13 -3 90
7710I0o1mp1J9K8K1k3L0j5K0J0m9rJ8j1pO0n6j0k5N2L1j5m0M8j6o5NJ6J1M7lp6
$$ 90 29 25 -46 -27 1 22 -1 29 14 34 44 -5 -14 4 -7 -14 46 -10 -20 -45 7 38 23 -17 31 15 -50 -45 -29 -18 29 26 -50
7743e0L3kM8p4N9l6m5%PL4M3j0N0o9pj8j4O2l8Q5l6J7Nql2KKn7O9oM2K7l0j07
$$ -50 -17 -19 29 -45 14 -22 -67 -67 -60 -26 17 7 57 -12 -19 -37 -51 11 -27 58 22 39 44 36 4 6 8 -49 20 14 56 83 53 -54
7777e4Q6n1mO7o7Q7l9j3M1m7N3m6J4k5nj2N4o2R0m4L8nmj05R3n9M8m9j7J10q1
$$ -54 32 -19 -23 44 -23 64 25 12 53 6 59 13 27 2 -3 -15 39 -23 67 23 61 56 52 -53 40 -19 29 -20 -37 73 -8
7808hJ2J5L1m7m7N3K1oQk7k7M4K8o0M8m0M6j7l0L9Lq3J7J0j6L9m2M2r5N2N6l7
$$ -8 4 19 50 3 -44 9 30 24 32 5 -22 22 50 -10 38 -2 44 27 -3 36 39 -44 -27 -17 -33 6 -36 6 -89 -37 19 -18
7840a8K9o8O6%k1M9%r3R7nkr9O5K8n5Q6j03P0Ro2L0l1J1J7K1p3L5N0j5l4N2o0
$$ -18 11 -57 9 9 -12 37 37 -56 41 36 34 -65 0 28 -27 59 -44 26 35 -27 3 -28 -17 0 21 -52 -17 33 18 -16 36 -24
7872b4K7M3K5r9R1p9rO0mj1l3L7J9p4R3p2K0m7Ql7M9L1M2o8k1Q8j07KJ40o3k8
$$ -24 3 46 71 -28 63 -16 -25 35 31 20 -13 24 43 -31 62 -10 10 -37 -29 -66 -17 14 56 -12 -33 55 -52 -50 90 27 -1
7903aj6k5P5n1m4J3R5r1Q4k7J8n5O2l6k2N9j6kK9j09J5N5m6J4K3J9l9j1R2m2j1
$$ -1 -17 -42 33 -18 -62 -49 46 -45 39 12 30 -25 37 1 -21 38 22 20 49 -60 -45 10 -36 -22 1 20 -19 -30 62 20 9
7934Ip0K0L0k4J8L6l3N6k6jl2K1P6o7m7N8k2qN6j8J9M0p9l0N0kl7N4j0p0J28p2
$$ 9 -61 -41 -11 -35 -17 19 -14 42 16 15 -17 4 80 13 -34 24 2 -6 50 32 51 91 12 -18 32 30 -7 47 37 -33 95 23
7966B3J8j27O8%l1O2l5K1kK9j9j5J2k2N6j5n3PqP3m1kK9j5k5k5N7l4L9o2J22q8
$$ 23 41 -86 -18 -18 -49 13 -22 -1 -3 26 7 -8 4 -18 38 23 -30 -23 -31 42 1 -1 28 13 -12 -37 20 -14 25 -37 85 -3
7998cL1k4q7O0k5O3l0K4m1N2p8O3pMJ4m2K7J07q1M2o7N8m7m2M2k2jl0Q2k6k1j0
$$ -3 28 4 -83 -23 -48 15 -15 9 -32 20 -58 5 -2 2 16 -26 1 108 27 69 2 60 13 -29 13 -9 -10 -40 42 16 -5 -15
8030a5QL3rJ1qj8kMm1O0M7%j20M8Ool4k9P7m5k1M6L5L5m4p6R4k7O4n8j8k2L5L8
$$ -15 -7 26 17 28 20 2 0 4 -37 23 70 70 -50 -2 4 -2 -36 -65 12 -33 -54 -8 27 62 18 -58 36 9 73 15 -3 -25 10 48
8064D8k8j3l0Q0k4m7K1J4k9K0rk2L0k6jL1r2Q0K3m9N9qj01Q8JJ2m8K1M6j8mm3
$$ 48 20 7 -23 57 33 -14 7 21 -8 12 3 -19 11 -15 -16 15 -77 3 26 -23 36 28 -73 15 16 28 -20 1 47 29 25 -18
8096a8R4j11L1n3P4k5K2M1j18L9P6m9j9K3Qmnk1M7Kr7L2N1l9M0MOm7M7j8OmmO
$$ -18 76 -35 -4 -57 17 -8 14 55 -63 -24 52 3 -16 7 15 11 6 -15 32 34 -63 -31 20 -19 21 25 31 -16 31 13 19 15 11 17
8130A7l8O2o4k7Q1q3R6p7O4p1K9OK0j3p5P7j4m3M6K1K1l6L0j3m7O7p8L3j9j7K2
$$ 17 -21 41 -23 -50 31 -52 44 -33 31 -40 -11 -5 15 2 -73 4 -10 -53 -7 14 35 -1 29 16 -31 36 -42 -9 -28 -45 -23
8161b3L2J4k7oL8j1L0n2J0k8N7J8p2L5j6N5q5Q8m0l1%O2n8l8R5n2J4lj5K1
$$ -23 9 23 -4 -10 28 17 47 -5 5 -23 34 52 -20 15 -1 54 -31 57 17 -14 -14 48 -10 -48 47 -5 9 6 -9 12
8191A2
$$ Imaginary data points
##PAGE= N=2
##DATA TABLE= (X++(I..I)), XYDATA
0@%%%%%%%%%%%%%%%%MmNj3J6j6J6j6J6j7K2k7K8k9L5m1M3m5N1n9O5p0P7q6R5j05
$$ 0 0 0 0 0 0 0 0 0 0 0 0 0 0 0 0 0 4 0 5 -8 8 -8 8 -8 8 -9 13 -14 14 -15 20 -21 22 -23 28 -31 34 -36 41 -45 50 -55
42e5J16j29J44j61J78j99K29k62L04l60M31n29O70q87J242j888L286p377L8034
$$ -55 61 -68 76 -85 93 -106 123 -139 165 -195 236 -293 377 -510 732 -1156 2130 -5247 32787
61C2787J49205j73221j60856J81518J25856j97886j20750J90387J05877j71209
$$ 32787 181992 8771 -152085 29433 155289 -42597 -163347 27040 132917 -38292
71c8292p6382J70230O6999j58027o6161J29138N0460j14023m2966J06915N2258
$$ -38292 -114674 55556 122555 -35472 -101633 27505 77965 -36058 -79024 27891 80149
82H0149r0068n9329P5754O4398p0654p5546O7014Q5019o8557r3539P6230J02374
$$ 80149 -9919 -69248 6506 70904 250 -75296 -8282 76737 8180 -85359 -9129 93245
94I3245q5340j07538R7850J09727j11318j09157J21448R8523j36071q4929J53123
$$ 93245 7905 -99633 -1783 107944 -3374 -112531 8917 107440 -28631 -113560 39563
105C9563P6549j59572o1627J60545L8614j65319k1064J63873O162j53119J4662
$$ 39563 116112 -43460 -105087 55458 94072 -71247 -92311 71562 77724 -75395 -60733
116f0733J46271k8823j38713L2959J20598l9840j02733M8124R4144m5786q4281
$$ -60733 85538 56715 -81998 -49039 71559 31719 -71014 -22890 71254 25468 -58813
127e8813L8081P2489l2967o7335K5061O6766j3716o5970O296O9995k380q1043
$$ -58813 -20732 51757 18790 -48545 -23484 43282 29566 -36404 -30108 39887 37507 -43536
139d3536l307R2803P606j02642o226J12566o71j24304R578J34905j9852j42053
$$ -43536 -46843 45960 53566 -49076 -55302 57264 56593 -67711 -58133 76772 56920 -85133
151h5133L2014J45480m5953j46258N8843J42362p1595j34250Q5047J26022r5133
$$ -85133 -53119 92361 46408 -99850 -41007 101355 29760 -104490 -19443 106579 11446
162A1446j17351R8925J04489j00203q9565J01491P7650r8557o7820R2296N8883
$$ 11446 -105905 -6980 97509 -2694 -92259 9232 86882 -11675 -79495 12801 71684
173G1684q4987n3506P6033N1816o4895n0163N6025N1039n0601n6610M5910O4752
$$ 71684 -13303 -66809 9224 61040 -3855 -54018 2007 53046 2445 -54165 -8255 56497
185E6497m1876p2057M1133P9033m3805q5817M8911R0803n6768r4276O6592R6310
$$ 56497 14621 -57436 -16303 62730 18925 -66892 -17981 72822 16054 -78222 -11630 84680
197H4680p6456r5721Q5245R0570r4208q2703J03148P3546j10446o3884J14170
$$ 84680 8224 -87497 -2252 88318 -5890 -88593 14555 88101 -22345 -86229 27941
208B7941N2747j15018m0970J13293K9579j09306j9314J03854J0635r7322n180
$$ 27941 80688 -34330 -75300 37993 67572 -41734 -61048 42806 53441 -43881 -49061
219d9061Q9612K763q0625j437P2012J732o5719m247O1564R102n8867j4281N8244
$$ -49061 40551 43314 -37311 -38748 33264 34996 -30723 -34970 26594 35696 -23171 -37452 20792
232B0792J9813n9429k4425O2523K7413o7607k8442P4553K8722q2007k7177Q8515
$$ 20792 40605 -18824 -43249 19274 46687 -20920 -49362 25191 53913 -28094 -55271 33244
244C3244K3282r4231j6998R9149Q977j02977l12J05060q504j05180J6912J02580
$$ 33244 56526 -37705 -54703 44446 53423 -49554 -49866 55194 46690 -58490 -41578 61002
256F1002k5077r8171L2458R2523l8876q6428M2863P9823m4803p2802M4729O5791
$$ 61002 35925 -62246 -29788 62735 23859 -62569 -19706 60117 15314 -57488 -12759 53032
268E3032m3343n9873M0907N5515l7637n2939L3506N2159k8891n2649K4818N4337
$$ 53032 9689 -50184 -9277 46238 8601 -44338 -10832 41327 12436 -40213 -15395 38942
280C8942k2073n6929K0785O1207k0910o5729K2243P0325k4781p3846K8922P6409
$$ 38942 16869 -40060 -19275 41932 21022 -44707 -22464 47861 23080 -50766 -21844 54565
292E4565l4306p7667M0820P7707m7369p6418N3538P3531n8929o8970O3598O3101
$$ 54565 20259 -57408 -16588 61119 13750 -62668 -9130 64401 5472 -63498 100 63201
304F3201o7382n6731O9821N0166p0649m3942O9707L7853o7542l2539O4450K8040
$$ 63201 -4181 -60912 8909 59075 -11574 -55516 14191 52044 -15498 -48037 16413 44453
316D4453o1094k5096N7347K3408n3539k3197M9843K3807m7073k5105M5319K6967
$$ 44453 -16641 -41737 15610 39018 -14521 -37718 12125 35932 -11141 -36246 9073 36040
328C6040m4805k9228M5455L1546m7075l3367M9585L4353n2746l4190N6678L3245
$$ 36040 -8765 -37993 7462 39008 -8067 -41434 8151 42504 -10242 -44432 12246 45491
340D5491o0664l1275O4750K8328o7920k4587P0727J9948p2380j4747P3394R400
$$ 45491 -15173 -46448 18302 46630 -21290 -45877 24850 44798 -27582 -42329 31065 40465
352D0465p3203m295P2058k74o9971M309O7047p702o3830J0200O0339j1683n7215
$$ 40465 -32738 -37033 35025 34751 -35220 -30911 36136 28434 -35396 -25196 35143 23460 -33755
365c3755J2254N4149j2036n1588J1076M9646j0006m8639Q647M8420p442m9049
$$ -33755 -21501 32648 20612 -30976 -19900 29746 19740 -28899 -20252 28168 20726 -28323
377b8323O301N0172n815n1810N979N3625p007n5539Q661N7367j0965n8728J3901
$$ -28323 -22022 28150 22335 -29475 -23496 30129 23122 -32417 -23756 33611 22646 -36082 -22181
390b2181N9543j7047n9672K0681N9138k4234n7836K7809N5944l0788n3399L3388
$$ -22181 37362 20315 -39357 -18676 40462 16228 -41608 -13799 42145 11357 -42042 -8654
402h654N0512l5325m7228L6784M3948l7462m0786L7510L8114l7154l5635L6315
$$ -8654 41858 6533 -40695 -3911 40037 2575 -38211 -701 37413 259 -35376 939
414I39L3721l5334l2318L4237L1385l3274l1115L2459L1162l2148l1417L2049
$$ 939 34660 -674 -32992 1245 32630 -644 -31759 700 31862 -286 -31703 346
426C46L1742l2518l2535L3492L2904l4894l3141L6596L2880l8484l2436M0610
$$ 346 32088 -430 -32965 527 33431 -1463 -34604 1992 34872 -3612 -36048 4562
438D562L1370m2713k9822M4625K7898m6243k5754M7717K3209m8539k0561M9087
$$ 4562 35932 -6781 -36603 8022 35920 -10323 -36077 11640 34849 -13690 -34251 14836
450A4836J7979m9177j5310M8916J3054m8272j0858M7406R111m6239p544M5121
$$ 14836 32815 -16362 -31672 17244 30298 -17974 -28832 18574 27685 -18554 -26098 19023
462A9023O479m4113n562M3097N145m2311m796M1755M485m1425m291M1308M058
$$ 19023 25502 -18611 -24173 18924 24069 -18242 -23038 18717 23202 -18223 -22514 18794 22852
475B2852m1598l700M1985L011m2477k235M2877J059m3342J40M3733j662m4088
$$ 22852 -18746 -22446 19539 22550 -19927 -22162 20715 21774 -21568 -21428 22305 20643 -23445
488b3445L249M4046m930m4019O672M3686q411m3166J0104M2595j1772m1786J3240
$$ -23445 -20196 23850 18920 -25099 -18427 25259 16848 -26318 -16214 26381 14609 -27177 -13937
501a3937M0804j4378l9740J5490L8737j6436l7624J7253L6811j8032l5729J8726
$$ -13937 26867 12489 -27251 -11761 26976 10540 -27084 -9831 26980 8948 -26781 -8055
513h055L4751j9042l4023J9605L3364k0163l2710K0764L2178k1227l1717K1827
$$ -8055 26696 7654 -26369 -6764 26600 6437 -26273 -5509 26669 5442 -26275 -4448
525d448L1220k2465l0601K3065L0130k3917k9646K4667K9041k5448k8434K6074
$$ -4448 26772 4307 -26294 -3229 26901 2984 -26662 -1995 27046 1598 -26836 -762
537g62K7655k6744k6922K7437K5995k8214k5231K8787K4371k9347k3511K9856
$$ -762 26893 149 -26773 664 26659 -1555 -26786 2001 26372 -2975 -26486 3370
549C370K2405l0328k1342L0783K0314l1291j9370L1831J8354l2122j7229L2352
$$ 3370 25775 -4553 -25895 4888 25202 -6089 -25459 6372 24726 -7396 -24625 7727
561G727J6144l2484j4838L2698J3714l2902j2575L2959J1660l2789j0589L2650
$$ 7727 23871 -8613 -23451 9247 22961 -9941 -22516 10443 22103 -10686 -21275 11375
573A1375R534l2448q426L2338P546l2259o761L1999O319l1822n666L1474N019
$$ 11375 20909 -11539 -19965 12373 19919 -12340 -19101 12898 19217 -12605 -18271 13203 18222
586A8222l1455m405L1601L759l1675l489L1827K946l2026k250L2065J376l2471
$$ 18222 -13233 -17638 13963 17722 -13953 -17442 14385 17331 -14695 -16945 15120 16496 -15975
599a5975m29L2862o04l3191J522L3386k701l3314M048L3044n520l2859O966L2579
$$ -15975 -16404 16458 15854 -17337 -15815 17571 14870 -18444 -14396 18648 13128 -19731 -12765 19814
613A9814q240l2033R372L1327j0405l0200J1501K9029j2286k8140J3218K7103
$$ 19814 11574 -20459 -11087 20240 9835 -20365 -8864 20165 7879 -20261 -7043 20060
625B0060j3346k6178J3365K5234j3353k4291J3547K3573j3504k3405J3642K3224
$$ 20060 6714 -19464 -6099 19135 5782 -18509 -4962 18611 5107 -18298 -4656 18568
637A8568j3402k3281J3411K3150j3706k3069J4245K3230j5196k3468J5976K3712
$$ 18568 5166 -18115 -4704 18446 4740 -18329 -4084 19146 3950 -19518 -3542 20170
649B0170j6908k3633J7826K3158j9164k2469K0479K1713k1907k0939K2974J9937
$$ 20170 3262 -20371 -2545 20613 1449 -21020 -541 21172 -735 -21674 1300 21237
661B1237k3805j8470K4255J6908k4824j5289K5224J3950k5327j2762K5031J1649
$$ 21237 -2568 -21038 3217 20125 -4699 -19988 5236 19186 -6141 -18903 6128 17777
673A7777k4263j0598K3619R720k3108q957K2753Q781k2231q984K1837R169k1368
$$ 17777 -6486 -17084 6535 16255 -6853 -15810 6943 15724 -6507 -15491 6346 15515 -5853
686e853r259K1326R248k1742r369K2548R585k3386r590K4001R431k4703q716K5606
$$ -5853 -15112 6214 15462 -6280 -15649 6899 16484 -6902 -16492 7509 16940 -7763 -16479 9127
700I127P493k6594o505K7628N189k8092l971K8145K321k7981m56K7528j332k7071
$$ 9127 16620 -9974 -16479 11149 16338 -11754 -15725 12420 14741 -13240 -13696 13832 12500 -14571
714a4571K715K6351l742k5298M631K3812n332k2473N927K1420o304k0525O176
$$ -14571 -11856 14495 10753 -14545 -9914 13898 8566 -13907 -7980 13440 7136 -13389 -7213
727g213J9704n509j9114N260J8359m775j8203M596J8708m616j9199M396K0023
$$ -7213 12491 6982 -12132 -6872 11487 6712 -11491 -6895 11813 7197 -12002 -7606 12417
740A2417m416k0458M820K0881n708k1425O990K2105q332k2547R533K2566j0737
$$ 12417 8001 -12457 -7637 13244 7536 -13889 -6899 15206 6874 -15673 -6140 16426 5689
753E689k2188J2256K1267j3912k0317J5378J9411j6587j8251J7152J6653j7390
$$ 5689 -16499 -4243 17024 3112 -17205 -1827 17584 997 -17254 -102 16551 -839
765h39j4961J7509J3313j7690j2087J7671J0952j6828j0512J5895R897j4954r406
$$ -839 -15800 1709 15022 -2668 -14755 2916 13868 -2960 -13472 2423 12320 -2634 -12040
778a2040J4387R139j4014r489J3875J0178j3547j0962J3557J1280j3699j1457
$$ -12040 2347 11486 -2528 -12017 1858 12036 -1511 -12473 1084 12364 -1335 -12792
790a2792J4520J1732j5714j1882J6898J2042j7850j1744J8778J0817j9652r559
$$ -12792 1728 13460 -2254 -14136 2762 14804 -3046 -14790 3988 14805 -4847 -14406
802a4406K0821Q147k1636o968K2138N713k2113m175K1584K530k1095r98K0527
$$ -14406 6415 14562 -7074 -14042 8096 13809 -8304 -12479 9105 11635 -9460 -10458 10069
815A0069j20j9955P48J8945j132j7662J309J6491j559j5794J573J5325j263j5071
$$ 10069 9949 -10006 -9258 9687 8555 -9107 -7798 8693 7134 -8660 -7087 8238 6975 -8096
829h096N50J4866K02j4890n22J4958P32j5588o28J6591N85j7647k89J8256j71
$$ -8096 -7546 7320 7522 -7368 -7890 7068 7800 -7788 -8416 8175 8760 -8887 -9176 9080 8909
844H909j8746J277J9210k634j9634M061K0045n263k0022O440J9463p634j8412
$$ 8909 -9837 -8560 10650 8016 -11618 -7557 12488 7225 -12797 -6357 13106 5472 -12940
857a2940Q961J7315j0134j6352J0915J5352j1097j4240J1057J2794j0782j1611
$$ -12940 -3979 13336 3202 -13150 -2235 13117 2020 -12220 -1163 11631 849 -10762
869a0762J0628J0690j0430j0173R752J0101r040j0069Q252R892p842j0078P792
$$ -10762 -134 10556 126 -10047 -295 9806 766 -9303 -1051 8841 999 -9079 -1287
882a287J0566q028j1243Q178J1993q507j2331Q978J2418r817j2441J1009J2353
$$ -1287 9279 1251 -9992 -1814 10179 1672 -10659 -1681 10737 920 -11521 -512 11841
895A1841j2133j2274J3204J1827j3935j0962J4787R679j5444q502J6213P349j6350
$$ 11841 -292 -12566 638 12465 -1470 -12432 2355 12034 -3410 -11912 4301 11650 -4700
908d700o405J6263N427j5815m185J5160L249j4696k517J4235K180j3676k169J2906
$$ -4700 -11105 5158 10585 -5230 -9415 5745 8994 -5702 -8219 6016 8196 -5480 -7649 5257
922E257K199j2174k267J1835K262j1712k609J1766L150j2119l637J2382L752j2735
$$ 5257 7456 -4718 -6985 4850 7112 -4600 -7209 4557 7707 -4412 -8049 4333 8085 -4650
936d650l648J3346L273j4167k980J4994K447j5500j777J5762R08j6004L23J6016
$$ -4650 -8298 5048 8321 -5846 -8826 6168 8615 -6885 -8662 7100 8008 -7996 -7673 8343
950H343j343j6118K401J5924l218j5349L957J4615m651j3759N340J3035n731j2329
$$ 8343 7000 -9118 -6717 9207 5989 -9360 -5403 9212 4561 -9198 -3858 9177 3446 -8883
964h883N794J1759n644j1051N539J0335n336r943N119R934m906j0063M613J0171
$$ -8883 -3089 8670 3026 -8025 -2486 7849 2513 -7430 -2311 7623 2717 -7346 -2733 7438
978G438m323j0365M324J0530m560j0889M968J1274n455j1662N912J1838o579j1700
$$ 7438 3115 -7250 -2926 7604 3044 -7845 -2877 8397 2942 -8720 -2808 9030 2451 -9249
992i249P160J1587q103j1359R003J0886r630j0501J0195R786j0575q885J0914
$$ -9249 -2089 9498 1395 -9964 -961 9925 295 -10206 -11 9775 -800 -9685 1229
1005A229P923j1102p277J1287O640j1023o054J0791N380j0365m820J0046M620
$$ 1229 9152 -1950 -9227 2060 8700 -2323 -8377 2414 7794 -2571 -7391 2655 7275
1018G275r890m457R535M572r197m616R000M783r048m768R187M830r424n014R806
$$ 7275 -2615 -7072 2463 7035 -2162 -6778 2222 7005 -2043 -6811 2376 7206 -2218 -7232 2574
1033B574N000j0084m946J0483M667j0974m264J1410L761j1833l264J2087K628
$$ 2574 7574 -2510 -7456 3027 7694 -3280 -7544 3866 7627 -4206 -7470 4617 7245
1046G245j2238j947J2162J312j2234n86J2179j29j1929N52J1580r68j1165J461
$$ 7245 -4993 -6940 5222 6534 -5700 -6286 5893 5764 -6165 -5613 5967 4999 -6166 -4705
1060d705J0707j718j0383J825J0121j887r879J931R639j841r413J905R272j821
$$ -4705 6002 4284 -6099 -4274 5847 3960 -5919 -3988 5651 3810 -5603 -3698 5574 3753
1074C753r385J939R521j912r698J927R969k247r989K553J0197l009j0261L408
$$ 3753 -5632 -3693 5828 3916 -5782 -3855 6114 3867 -6122 -3569 6628 3619 -6642 -3234
1088c234J0310l850j0243M281J0076m802r870N319R607n853r240O100Q897o377
$$ -3234 7076 3226 -7017 -2736 7340 2538 -7332 -2013 7594 1741 -7499 -1399 7498 1121
1102A121q506O561Q002o752p595O932P151o952o857O894O544o804o249O663O111
$$ 1121 -7385 -824 7178 426 -7169 -237 6914 -38 -6895 -1 6543 -261 -6510 153 6264
1117F264o713n919O665N884o643n868O804N788o791n862P079N675p208n635P559
$$ 6264 -449 -6368 297 6181 -462 -6330 474 6262 -529 -6391 688 6363 -845 -6480 1079
1132A079N498p763n285P999N100q230m810Q558M474q808m158R054L645r066l283
$$ 1079 6577 -1186 -6471 1528 6628 -1602 -6412 2146 6620 -2188 -6346 2708 6353 -2713 -5996
1147e996R044K966r159k565R164K118r091j845R030J598q979j297Q770J066q666
$$ -5996 3048 6014 -3145 -5710 3454 5572 -3519 -5364 3666 5264 -3715 -5012 3758 4824 -3842
1162c842q98Q620O29q491n94Q448M23q435l49Q517J39q434jQ502k03q481L58Q546
$$ -3842 -4740 3880 4509 -3982 -4576 3872 4295 -4140 -4489 4028 4167 -4267 -4268 4234 4031 -4450 -4092 4454
1180D454o07q525Q79Q554j134q584J484Q480j581q516J990Q412k323q185K460
$$ 4454 3847 -4678 -3799 4755 3621 -4963 -3479 5001 3420 -5096 -3106 5306 2983 -5202 -2742
1195b742Q200k757q075L128P767l215p664L457P468l699p292L848P114l987o975
$$ -2742 5458 2701 -5374 -2246 5521 2306 -5358 -1901 5567 1868 -5424 -1576 5538 1551 -5424
1210e424M116O786m276o682M444O510m540o444M597O330m805o111N024N873n118
$$ -5424 -1308 5478 1202 -5480 -1036 5474 934 -5510 -913 5417 612 -5499 -475 5398 280
1225B80n876N298N693n399n576N589N433n764n229N871N082o023m841O177M652
$$ 280 -5596 -298 5395 -4 -5580 9 5442 -322 -5551 320 5402 -621 -5462 715 5367
1240E367o243m482O322M382o404m185O511M026o677l717O705L599o802l361O896
$$ 5367 -876 -5358 964 5346 -1058 -5243 1268 5294 -1383 -5100 1605 5204 -1598 -4959 1937
1255A937L110o956k902P023K692p124k498P138K315p258j960P196J761p198j616
$$ 1937 5047 -1909 -4811 2212 4904 -2220 -4718 2420 4735 -2523 -4483 2713 4474 -2724 -4340
1270d340P197J346p263j045P164Q74p147o89P003N12o985l20O917K30o922o4O877
$$ -4340 2857 4203 -3060 -4105 3059 3933 -3214 -3903 3100 3612 -3373 -3693 3224 3454 -3468 -3532 3345
1287C345l7o840K24O772k88o872M92O918o71o909R00O981j143o903J249P030j470
$$ 3345 3308 -3532 -3308 3464 3176 -3696 -3204 3714 3043 -3866 -2966 4015 2872 -4031 -2782 4248 2778
1304B778p042J727O915j894o894K291O792k609o601K715O540k966o365L167O110
$$ 2778 -4264 -2537 4378 2484 -4410 -2119 4673 2064 -4537 -1822 4718 1752 -4613 -1446 4664
1319D664l332n965L551N747l645n556L769N246l722n205L743N090l836m959L820
$$ 4664 1332 -4633 -1082 4665 1020 -4536 -767 4479 757 -4448 -705 4385 549 -4410 -590
1334e90M885l913m800L923M764l938m770M085M683m172m730M421M605m538m562
$$ -590 4295 382 -4418 -495 4269 331 -4439 -354 4329 157 -4573 -152 4453 -85 -4647
1349d647M771M473m886m379N217M147n461l909N633L723n740l494N892L114n850
$$ -4647 124 4597 -289 -4668 549 4696 -765 -4674 959 4682 -1058 -4552 1340 4454 -1396
1364a396k846N936K505n938k235N933J992n837j867N808J667n732j478N697J218
$$ -1396 -4242 1694 4199 -1739 -3974 1959 3951 -1886 -3753 2055 3722 -2010 -3488 2209 3427
1379C427n532j290N521J226n487j227N453J197n463j208N508J153n760r61N852
$$ 3427 -2105 -3395 2126 3352 -2135 -3362 2091 3288 -2175 -3383 2125 3278 -2482 -3443 2409
1394B409R96o021r41O180P03o319l24O473l9o554L44O519n18o509Q69O402j209
$$ 2409 3405 -2616 -3557 2623 3326 -2993 -3317 3156 3117 -3437 -3093 3426 2908 -3601 -2732 3670 2461
1411B461o220J616O032j841n900K031N708k148n389K184N239k371m932K379M661
$$ 2461 -3759 -2143 3889 2048 -3852 -1821 3887 1739 -3650 -1466 3773 1402 -3530 -1151 3510
1426C510k187m729K263M643k141m685K124M583k227m545K153M778k242m865K290
$$ 3510 1323 -3406 -1143 3500 1359 -3326 -1202 3381 1154 -3391 -1238 3540 1298 -3567 -1277
1441a277M907k462n046K786M943k985n014L347N030l718m869L974M668m175m467
$$ -1277 3630 1168 -3878 -1092 3851 866 -4148 -801 4229 511 -4358 -384 4284 109 -4358
1456d358M491M115m773l752M862L566m992l140M949K799m835k545M801K342m758
$$ -4358 133 4248 -525 -4277 585 4151 -841 -3981 968 3767 -1068 -3613 1188 3530 -1228
1471a228k161M646K073m406k025M211K031m130j926M071J995m190k096M208K221
$$ -1228 -3389 1257 3330 -1076 -3101 1110 3141 -989 -2915 1156 3151 -1039 -3135 1073 3294
1486C294m263k298M372K281m597k263M929K068n109k046N351J812n534j513N648
$$ 3294 -969 -3267 1105 3386 -1211 -3474 1455 3523 -1586 -3632 1719 3531 -2003 -3516 2132
1501B132J135n746p15N794M16n877j28N852k77n565N57N335q09n210J121M956
$$ 2132 3267 -2479 -3194 2600 3016 -2861 -2989 2863 2586 -2979 -2422 2913 2104 -3106 -1985 2971
1517B971j178m653J096M460j087m191J043M090j028m036R54M154r21m022P16M109
$$ 2971 1793 -2860 -1764 2696 1609 -2582 -1539 2551 1523 -2513 -1559 2595 1674 -2348 -1632 2477
1533B477o38m289P21M455q15m694R67M921j172n076J342N113j676n092K111N033
$$ 2477 1839 -2450 -1729 2726 1911 -2783 -1816 3105 1933 -3143 -1801 3312 1636 -3456 -1345 3688
1549C688k501m993K733M920l052m633L251M324l477m023L766L511l701l384L736
$$ 3688 1187 -3806 -1073 3847 795 -3838 -587 3737 260 -3763 3 3514 -187 -3571 165
1564A65L078l586k800L410K591l309k369L250K304l195k251K933K544k905k491
$$ 165 3243 -343 -3143 267 2858 -451 -2820 430 2734 -461 -2712 221 2765 -140 -2631
1579b631K723K599k785k677K971K851l129l051L330L102l507l039L835K824m117
$$ -2631 92 2691 -94 -2771 200 3051 -78 -3129 201 3303 -204 -3243 592 3416 -701
1594g01k589M352K519m705k262M743J944m880j555M971J139m976q39M968N69m868
$$ -701 -3290 1062 3581 -1124 -3386 1357 3301 -1579 -3134 1837 2976 -2000 -2839 2129 2698 -2170
1610b170l38M641k6m264Q7M163k36l978K35L856k06l707Q8L567Ml502J9L490J16
$$ -2170 -2508 2133 2107 -2157 -2070 2093 1857 -2121 -1886 1970 1764 -1943 -1855 1712 1716 -1786 -1767 1723 1839
1629A839l721r4L820K48l940k73M129J73m296M6M509k76m710N02M849p78m753
$$ 1839 -1882 -1976 1844 2092 -1848 -2121 2008 2181 -2115 -2069 2440 2164 -2546 -2044 2805 2027 -2726
1646b726J078M579j371m594J771M536k084m386K237M122k374l825K561L476k677
$$ -2726 -1648 2931 1560 -3034 -1263 3273 1189 -3197 -960 3162 788 -3037 -476 3000 323
1661C23l205K637L013k554k931K479K679k294k575K192K554k154k584K014K809
$$ 323 -2882 -245 2768 214 -2717 -238 2441 147 -2428 -236 2318 164 -2420 -406 2403
1676B403k018k891J951K885j909k912K088L026k304l142K610L163k785l156L001
$$ 2403 385 -2506 -555 2330 421 -2491 -403 2623 319 -2823 -213 2950 165 -2991 10
1691A0L066l203k891L464K693l754k487L894K299m038j912M006J712m037j339
$$ 10 3076 -127 -3018 446 3139 -615 -3102 792 3091 -947 -2859 1147 2859 -1178 -2517
1706b517L950J098l991q54L833P39l663o85L523N53l339n34L193N77l183o84L072
$$ -2517 1433 2531 -1460 -2314 1519 2258 -1405 -2090 1433 1986 -1353 -1887 1306 1883 -1300 -1984 1088
1723A088Q25l075q45L111Q44l084r79L379Q61l587q57L735P76l853o10M013L52
$$ 1088 1913 -1162 -2007 1104 1948 -1136 -2115 1264 2125 -1462 -2319 1416 2192 -1661 -2271 1742 2094
1740B094l998j00M128j26m260M11M145n79m029Q61L869j050l794J248L691j366
$$ 2094 -1904 -2004 2124 1998 -2262 -1851 2294 1715 -2314 -1453 2416 1366 -2428 -1180 2511 1145
1756A145l458J456L230j467l081J481K897j467k880J449K829j324k848J287K756
$$ 1145 -2313 -857 2373 906 -2175 -694 2203 736 -2144 -695 2134 810 -2038 -751 2005
1771B005j274k690J200K796j249k922J327L040j463l041J487L077j660l097J815
$$ 2005 731 -1959 -759 2037 788 -2134 -807 2233 770 -2271 -784 2293 633 -2464 -649
1786f49L147k062l112K280L043k491k865K622K734k823k539K902K381k938k231
$$ -649 2498 436 -2676 -396 2647 156 -2709 -87 2647 -176 -2715 187 2568 -370 -2601
1801b601L077K054l082j797K979J647k848j589K868J497k804j420K774J307k668
$$ -2601 476 2530 -552 -2349 630 2277 -571 -2160 708 2205 -599 -2019 755 2062 -606
1816f06j335K626J315k622j296K578J387k629j465K782J339k766j368K858J362
$$ -606 -1941 685 2000 -622 -1918 660 2047 -582 -2047 735 2074 -692 -2060 798 2160
1831B160l027j278L164J160l374r80L337R09l466o98L454M90l497k68L539J03
$$ 2160 -867 -2145 1019 2179 -1195 -2175 1162 2071 -1395 -2093 1361 1851 -1646 -1914 1625 1728
1847A728l451RL415k50l215K77L275m71l094M98K992m75k956N91K852n39k827
$$ 1728 -1723 -1714 1701 1451 -1764 -1487 1788 1317 -1777 -1279 1713 1238 -1718 -1127 1725 1186 -1641
1864a641N70K808n85k797N99K845o36k819N71K885o57k928P79K915q79k943R96
$$ -1641 -1071 1737 1152 -1645 -1046 1799 1163 -1656 -1085 1800 1143 -1785 -1006 1909 1030 -1913 -917
1881i17K982j170k954J273K911j442k844J524K840j757k705J828K592j855k535
$$ -917 2065 895 -2059 -786 2125 683 -2161 -637 2203 446 -2259 -431 2161 306 -2229
1896b229J957K411k017k267K025K227k167k074K090J970j994j916K032J856k051
$$ -2229 -272 2139 122 -2145 -120 2107 -60 -2134 -44 1926 -68 -1984 48 1904 -147
1911a47j813K026J887k071j738K031J766k136j772K239J712k243j636K277J672
$$ -147 -1960 66 1953 -118 -1856 175 1941 -195 -1967 272 1984 -259 -1895 382 2054
1926B054k394j584K470J506k541j459K579J379k691j212K655J166k806j008K783
$$ 2054 -340 -1924 546 2052 -489 -1948 631 2010 -681 -1893 762 1928 -878 -1886 897
1941H97R61k838q38K799O72k779n65K761N05k720n05K776L41k650l40K647K60
$$ 897 1858 -980 -1818 981 1653 -1126 -1691 1070 1575 -1145 -1650 1126 1467 -1183 -1523 1124 1384
1958A384k642k26K689J25k670q2K653P7k608o6K698K4k758J88K663k54k663L00
$$ 1384 -1258 -1484 1205 1330 -1340 -1422 1231 1308 -1300 -1366 1332 1356 -1402 -1214 1449 1195 -1468 -1168
1976a168K721l93k677M58K700n66k662O86K577p01k582P55K594q38k579R60K442
$$ -1168 1553 1160 -1517 -1059 1641 1075 -1587 -901 1676 975 -1607 -852 1742 904 -1675 -715 1727
1993A727r57k528J119K426j129k415J208K333j309k249J197K357j365k241J444
$$ 1727 770 -1758 -639 1787 658 -1757 -549 1784 475 -1774 -577 1780 415 -1826 -382
2008c82K070j413k125J514K041j514k037J599J957j607j916J698J892j754j868
$$ -382 1688 275 -1850 -336 1705 191 -1846 -247 1710 103 -1813 -115 1777 23 -1845
2023a845J875J739j858j727J959J671j972j560K022J479k053j431J993J479k114
$$ -1845 30 1769 -89 -1816 143 1814 -158 -1718 304 1783 -270 -1701 292 1771 -343
2038c43j343K099J297k082j239K196J120k293r25K138J020k214r67K167R33k249
$$ -343 -1686 413 1710 -372 -1611 585 1705 -588 -1513 625 1645 -569 -1536 631 1564 -685
2054f85q53K297P47k316p13K340O28k279o52K380N26k316n08K374K72k302l10
$$ -685 -1538 759 1506 -810 -1523 817 1445 -834 -1486 894 1420 -896 -1404 970 1242 -1060 -1370
2071a370K431J17k232j90K262J78k355L3K304k4k291O5K289j13k339J81K246j61
$$ -1370 1061 1178 -1054 -1244 1018 1196 -1159 -1126 1178 1154 -1137 -1072 1217 1104 -1235 -1054 1192 1031
2089A031k272L11K248l28k236L06K317m21k272M77K223n44k225O00K251p38k222
$$ 1031 -1241 -930 1318 990 -1246 -940 1377 956 -1316 -839 1384 840 -1385 -785 1466 728 -1494
2106a494Q51K187q38k234R98K149j142k092J203K001j258j851J180J809j198j806
$$ -1494 -643 1544 706 -1528 -530 1619 477 -1615 -412 1589 331 -1520 -340 1469 271 -1535
2122a535J256J743j305j665J296J590j214j676J289J650j347j548J367J493j422
$$ -1535 -279 1464 159 -1506 -210 1380 166 -1510 -221 1429 82 -1466 -99 1394 -28
2137b8j378J351J558j498j525J544J423j491j436J649J368j699j352J769J338
$$ -28 -1406 -55 1503 5 -1520 24 1447 -44 -1480 169 1537 -162 -1514 255 1593
2152A593j863j220J892J168j975j040J957R81k056p87K012O98j943p01J964N55
$$ 1593 -270 -1490 402 1570 -405 -1445 512 1493 -563 -1350 662 1360 -583 -1284 680 1235
2168A235j959m92J932M65j950m02J822M53j805m41J871L25j821l73J838L99j888
$$ 1235 -724 -1216 716 1181 -769 -1171 651 1104 -701 -1142 729 1054 -767 -1140 698 1097 -791
2185g91l08J839L41j873l33J920K67j962j43J961J37k036q8K130j01j996J47K036
$$ -791 -1099 740 1081 -792 -1125 795 1062 -900 -1043 918 1055 -981 -1069 1061 960 -1036 -889 1147
2203A147l08k012L99J985m20k004N74J880o36j747O40J765p81j664P20J682p55
$$ 1147 839 -1173 -774 1211 791 -1213 -639 1241 605 -1142 -502 1263 482 -1182 -462 1220 465
2220D65j540O18J544p12j482O90J521p09j496P04J451o92j501O96J509o71j635
$$ 465 -1075 -457 1087 375 -1107 -417 1104 395 -1101 -397 1054 362 -1139 -443 1066 395 -1240
2237a240Q67J543q73j642J028J619j104j563J158J582j274j425J304J347j407
$$ -1240 -373 1170 297 -1345 -317 1302 198 -1365 -207 1375 101 -1324 -20 1327 -80
2252h0j272J469J230j533j134J621R42j562q61J572Q29j490q30J514O85j445n91
$$ -80 -1352 117 1347 -186 -1320 301 1243 -319 -1180 392 1221 -269 -1099 415 1100 -345 -936
2269i36J359O81j507n71J352O70j413o37J329O95j399o18J406O28j439p32J563
$$ -936 423 1104 -403 -974 378 1048 -365 -1002 327 1022 -377 -995 411 1039 -400 -1132 431
2286D31O62j540o66J518O58j696m85J751L89j835k58J846J85j828j5J740Qj789
$$ 431 1093 -447 -1113 405 1063 -633 -1118 633 1022 -813 -1071 775 960 -868 -883 857 865 -924
2304i24L9J915k65j713K38J720l60j529K83J509l20j466M15J306l44j314L61J269
$$ -924 -885 1030 765 -948 -710 1010 650 -879 -596 913 593 -873 -458 848 504 -810 -449 820
2322H20j98j400K46J328l35j268L26J389l43j482L58J452l70j409M16J464n32
$$ 820 622 -778 -532 796 461 -807 -481 908 565 -917 -559 893 523 -886 -470 994 462
2339D62j526O35J591q77j478Q23J567r23j435R06J372j034j242J111J249j209
$$ 462 -1064 -429 1162 285 -1193 -370 1197 274 -1161 -255 1117 83 -1159 -48 1201 -8
2355hj106J102J009j059q91J043Q95j111q10J139P22j045o99R13Q02r52p29R40
$$ -8 -1114 -12 997 -62 -953 90 985 -126 -936 203 925 -120 -819 94 896 -56 -785 155
2373A55P52r36q36R61Q68j059q74J047R46j185p92J162Q17j273p80J297Q27j417
$$ 155 907 -29 -865 96 964 -95 -969 78 1024 -161 -953 209 1026 -247 -1027 270 1097 -320
2391c20p26J456N88j497m85J566L33j489m17J628J87j401j90J451K1j418O3J310
$$ -320 -1046 410 998 -499 -984 582 915 -574 -991 637 824 -577 -767 684 705 -713 -650 660
2409F60Pj403J14J211l8j159P6J077p2j067N5J205j70j102J8J185Pj187kJ232
$$ 660 667 -736 -622 589 551 -608 -532 545 473 -594 -539 666 496 -606 -588 597 604 -583 -585 647
2429F47K6j283O7J293j16j399K07J403k35j422L33J416m50j451N82J348o25j271
$$ 647 673 -610 -543 750 634 -765 -558 845 610 -812 -479 937 487 -964 -382 966 341 -930
2447i30O15J210p37j052P13J146q08j085Q00J015p85j000P81P86o19p72O69P58
$$ -930 -315 895 158 -894 -181 965 157 -928 -128 887 102 -898 -117 669 50 -722 -53 705
2465G05p08p82P15P58o37q07O69P93o94p55O26R08p98q04P96R08q87q05Q59P94
$$ 705 -3 -785 -70 688 51 -756 -87 706 12 -743 -117 791 -7 -811 -15 893 6 -799 60 854
2485H54r38q18J130O73j038p40J089O79j131n84J182M60j270l51J211L36j187
$$ 854 -84 -902 228 901 -137 -877 212 891 -240 -824 358 818 -452 -803 408 744 -443
2502d43l60J238K11j076j88J016K21r97k61J042J20r62j36R75J77j064q9R06K28
$$ -443 -803 435 646 -430 -618 398 619 -378 -639 403 523 -439 -575 400 577 -487 -576 330 558
2521E58r61k04J019J79j069j48J104J90j169r3J122O1j155N9J121l8j218J48J168
$$ 558 -403 -607 412 591 -478 -626 478 668 -501 -594 528 589 -566 -507 614 576 -642 -494 674
2540F74k01j124K33J149l21j146M04J082m48r54M45Q88m91q48M77Q80m95q79M23
$$ 674 473 -651 -418 731 410 -736 -332 750 302 -652 -207 681 190 -658 -181 699 204 -675 -252
2559b52Q65m50p98M36Q03m33q13M82P87m23r20M27R61o08p48N91P56o09q04O06
$$ -252 613 163 -635 -199 604 171 -642 -160 627 204 -716 -289 672 64 -684 -93 663 54 -750 -144
2579a44Q60o32q24P54P23p44p24P89O81p54o66Q75N63q90n25Q19N31q48m62R10
$$ -144 716 84 -740 14 737 -7 -731 58 739 -15 -681 194 757 -133 -658 161 692 -156 -618 292
2599B92L51q15m19Q51L93q28m25Q29L29p73l69Q33L86q65l34Q60K84q87k61Q09
$$ 292 643 -172 -591 260 653 -175 -600 229 558 -215 -584 249 635 -230 -564 296 580 -307 -568 241
2619B41L08q11l11Q68K88r67j65Q98J97r11k10R74P4r86p4J028M9j032J9R64P3
$$ 241 549 -262 -573 295 583 -384 -549 349 546 -365 -575 399 473 -513 -587 441 490 -542 -523 441 514
2640E14j057J11J032j68r26J47Q93j62q64J62Q83k43q36J81Q97k76p81K56Q26
$$ 514 -543 -432 600 432 -494 -347 546 384 -480 -318 565 322 -514 -333 564 288 -493 -237 589
2659E89k17r15K69Q09k67p85K80P96k88q74L78Q16m08q16M51P42l57p73L89P94
$$ 589 372 -543 -274 535 268 -517 -237 559 271 -603 -225 591 183 -633 -182 560 203 -570 -181 613
2679F13n29p30M54Q18n69p08N06P57o34o40O38O25o26n73N76O10o17n26N85N43
$$ 613 84 -646 -192 626 57 -651 -145 612 -22 -662 -24 601 -25 -598 -22 588 -29 -555 30 573
2699E73o84n29P10M99o92m96P42N11p58m63P12M72p50l67O40M26o67l93O96M11
$$ 573 -111 -640 70 569 -123 -619 123 634 -124 -587 125 597 -153 -520 120 546 -121 -514 182 593
2719E93q24l30Q54K54p03l33P24K78p37l15Q39J64p73j80P78J53q29j09P69J44
$$ 593 -231 -561 293 547 -156 -489 235 513 -224 -539 300 464 -309 -489 289 442 -387 -496 273 417
2739D17p68j30P85J06p93n9P58P3p88k0P48k2o87j7P67rp90K5Q31o7p55J53O96
$$ 417 -351 -481 304 410 -383 -442 316 389 -399 -419 329 307 -380 -397 370 361 -429 -404 427 360 -395 -242 454
2762D54j10q00J76P68j50p52J65P30k55o59K59O39k57p07L10O94l39o00K78O99
$$ 454 344 -456 -280 488 338 -414 -249 481 226 -433 -174 465 208 -499 -189 505 166 -434 -156 543
2782E43l87o85L94N89l94n44L14O86m45n80L76N68l60n61L86O08m55n92M73N73
$$ 543 156 -529 -135 454 60 -484 -170 516 71 -509 -133 435 75 -486 -100 508 53 -539 -66 507
2802E07n01n97N24N97n32n54N71M96o11m26N97M71o13m79O56L65n75l11N16M07
$$ 507 6 -591 -67 530 -2 -556 15 511 -100 -526 71 542 -71 -550 106 471 -104 -415 101 508
2822E08o14l36O00L08n70k88N81K40o05j91N98J59n46k75N73K38n24j87N44J82
$$ 508 -106 -442 158 466 -104 -392 189 429 -176 -367 231 390 -156 -431 142 380 -144 -331 213 395
2842C95o33k15O57J63n26k69P13J41p54j24P31J30o96j16P34J8o82o7P12jo32
$$ 395 -238 -453 204 367 -159 -428 285 426 -328 -452 279 409 -287 -403 331 349 -333 -400 312 311 -321
2863c21m5O65l4o13Q4O35j21n48O8N40j01n91J50O05j42n85J60O04j78o18K67
$$ -321 -366 299 265 -348 -264 371 250 -298 -230 310 209 -382 -232 373 231 -354 -194 410 232 -386 -119
2884a19N06k46n09K11N52j82o44L13N90l05o10K84N88k61o15L67N18l53n43L91
$$ -119 387 141 -368 -157 395 213 -431 -118 472 167 -443 -159 429 168 -447 -80 438 85 -458 -67
2904f7M71l10n58M33M61m04n16M67M42l97m97N00L66m48l83M54L66m17l49M27
$$ -67 404 94 -464 -31 430 26 -490 -23 419 22 -475 25 391 -57 -440 14 380 -37 -386 41
2924D1L78m88l89N09L64m90k82M35L35m54k72M15L40n16k70N06K04m43k62N11
$$ 41 419 -69 -458 51 415 -75 -357 78 413 -41 -313 102 442 -74 -344 162 366 -77 -339 172
2944A72K40m97k59N02K44o29j38N08K30n59j95N48J66n46n7N89Oo33L8N39On30
$$ 172 412 -85 -344 158 402 -227 -365 143 373 -186 -381 167 333 -213 -270 319 325 -308 -270 269 275 -255
2966b55j4M44Ml99oL99M6m39k4M38rn05P2M91lm84k4N50k0n39K9N61k3n52M2N54
$$ -255 -269 175 179 -220 -226 173 219 -220 -244 194 185 -320 -248 243 240 -244 -268 282 262 -277 -248 313 290 -262 -220 334
$$ [...]
8191C6
##END NTUPLES=NMR FID
##END=
