##TITLE=1H_IPB2406
 CDCl3, 8 sc, 
 24.6.2019
##JCAMPDX= 6.0         $$ Bruker NMR JCAMP-DX V2.0
##DATA TYPE= NMR FID
##DATA CLASS= NTUPLES
##ORIGIN= UXNMR, Bruker Analytische Messtechnik GmbH
##OWNER= root
$$ XWIN-NMR		Version 3.5
$$ Mon Jun 24 15:38:37 2019 Russian Standard Time (UT+4h)  she@DPX200
##.OBSERVE FREQUENCY= 200.13155
##.OBSERVE NUCLEUS= ^1H
##.DELAY= (6, 6)
##.ACQUISITION MODE= SIMULTANEOUS
##.ACQUISITION SCHEME= undefined
##.AVERAGES= 8
##.DIGITISER RES= 18
##SPECTROMETER/DATA SYSTEM= spect
##.PULSE SEQUENCE= zg30
##.SOLVENT NAME= CDCl3
##.SHIFT REFERENCE= (INTERNAL, CDCl3, 0, 15.7039)
##AUDIT TRAIL= $$ (NUMBER, WHEN, WHO, WHERE, WHAT)
$$ ##TITLE= Audit trail, XWIN-NMR		Version 3.5
$$ ##JCAMPDX= 5.01
$$ ##ORIGIN= Bruker BioSpin GmbH
$$ ##OWNER= she
$$ F:/spectra/data/she/nmr/H-F/1/audita.txt
$$ ##AUDIT TRAIL=  $$ (NUMBER, WHEN, WHO, WHERE, WHAT)
(   1,<2019-06-24 15:37:24.59 +0400>,<she>,<DPX200>,
      <created by zg, POWCHK disabled, PULCHK disabled
       configuration hash MD5:
       00 E9 B6 7A A2 85 ED C7 34 08 36 98 17 FE 4E 26
       data hash MD5: 16K
       7A 8C 50 77 01 29 20 4F 58 99 7A C7 EF 97 23 04>)
$$ ##END=
$$ 
$$ hash MD5
$$ A2 A4 A1 26 03 AC 22 86 D1 E1 2D E7 D0 67 CF 39
##$RELAX= 
##$RELAX= 
##$RELAX= 
##$RELAX= 
##$RELAX= 
##$RELAX= 
$$ Bruker specific parameters
$$ --------------------------
##$DU= <F:/spectra>
##$EXPNO= 1
##$NAME= <H-F>
##$PROCNO= 1
##$TYPE= <nmr>
##$USER= <she>
##$AMP= (0..31)
100 100 100 100 100 100 100 100 100 100 100 100 100 100 100 100 100 100 
100 100 100 100 100 100 100 100 100 100 100 100 100 100 
##$AQSEQ= 0
##$AQ_mod= 1
##$AUNM= <au_zg>
##$AUTOPOS= <>
##$BF1= 200.13
##$BF2= 200.13
##$BF3= 200.13
##$BF4= 200.13
##$BF5= 200.13
##$BF6= 200.13
##$BF7= 200.13
##$BF8= 200.13
##$BYTORDA= 1
##$CFDGTYP= 0
##$CFRGTYP= 5
##$CHEMSTR= <none>
##$CNST= (0..31)
1 1 145 1 1 1 1 1 1 1 1 1 1 1 1 1 1 1 1 1 1 1 1 1 1 1 1 1 1 1 1 1 
##$CPDPRG= <>
##$CPDPRG1= <>
##$CPDPRG2= <>
##$CPDPRG3= <>
##$CPDPRG4= <mlev>
##$CPDPRG5= <mlev>
##$CPDPRG6= <mlev>
##$CPDPRG7= <mlev>
##$CPDPRG8= <mlev>
##$CPDPRGB= <>
##$CPDPRGT= <>
##$D= (0..31)
0 1.2 0 0 0 0 0 0 0 0 0 0.03 0 0 0 0 0 0 0 0 0 0 0 0 0 0 0 0 0 0 0 0 
##$DATE= 1561376243
##$DBL= (0..7)
120 120 120 120 120 120 120 120 
##$DBP= (0..7)
150 150 150 150 150 150 150 150 
##$DBP07= 0
##$DBPNAM0= <>
##$DBPNAM1= <>
##$DBPNAM2= <>
##$DBPNAM3= <>
##$DBPNAM4= <>
##$DBPNAM5= <>
##$DBPNAM6= <>
##$DBPNAM7= <>
##$DBPOAL= (0..7)
0.5 0.5 0.5 0.5 0.5 0.5 0.5 0.5 
##$DBPOFFS= (0..7)
0 0 0 0 0 0 0 0 
##$DE= 6
##$DECBNUC= <off>
##$DECIM= 24
##$DECNUC= <off>
##$DECSTAT= 4
##$DIGMOD= 1
##$DIGTYP= 9
##$DL= (0..7)
0 120 120 120 120 120 120 120 
##$DP= (0..7)
150 150 150 150 150 150 150 150 
##$DP07= 0
##$DPNAME0= <>
##$DPNAME1= <>
##$DPNAME2= <>
##$DPNAME3= <>
##$DPNAME4= <>
##$DPNAME5= <>
##$DPNAME6= <>
##$DPNAME7= <>
##$DPOAL= (0..7)
0.5 0.5 0.5 0.5 0.5 0.5 0.5 0.5 
##$DPOFFS= (0..7)
0 0 0 0 0 0 0 0 
##$DQDMODE= 0
##$DR= 18
##$DS= 0
##$DSLIST= <SSSSSSSSSSSSSSS>
##$DSPFIRM= 0
$$ [...]
##$SUBNAM2= <"">
##$SUBNAM3= <"">
##$SUBNAM4= <"">
##$SUBNAM5= <"">
##$SUBNAM6= <"">
##$SUBNAM7= <"">
##$SUBNAM8= <"">
##$SUBNAM9= <"">
##$SW= 24.9336996594482
##$SWIBOX= (0..15)
0 0 2 0 0 0 0 0 0 0 0 0 0 0 0 0 
##$SW_h= 4990.01996007984
##$TD= 16384
##$TD0= 1
##$TE= 0
##$TE2= 300
##$TE3= 300
##$TEG= 300
##$TL= (0..7)
0 120 120 120 120 120 120 120 
##$TP= (0..7)
150 150 150 150 150 150 150 150 
##$TP07= 0
##$TPNAME0= <>
##$TPNAME1= <>
##$TPNAME2= <>
##$TPNAME3= <>
##$TPNAME4= <>
##$TPNAME5= <>
##$TPNAME6= <>
##$TPNAME7= <>
##$TPOAL= (0..7)
0.5 0.5 0.5 0.5 0.5 0.5 0.5 0.5 
##$TPOFFS= (0..7)
0 0 0 0 0 0 0 0 
##$TUNHIN= 0
##$TUNHOUT= 0
##$TUNXOUT= 0
##$USERA1= <user>
##$USERA2= <user>
##$USERA3= <user>
##$USERA4= <user>
##$USERA5= <user>
##$V9= 5
##$VALIST= <valist>
##$VCLIST= <CCCCCCCCCCCCCCC>
##$VD= 0
##$VDLIST= <DDDDDDDDDDDDDDD>
##$VPLIST= <PPPPPPPPPPPPPPP>
##$VTLIST= <TTTTTTTTTTTTTTT>
##$WBST= 1024
##$WBSW= 4
##$XGAIN= (0..3)
0 0 0 0 
##$XL= 0
##$YL= 0
##$YMAX_a= 638769
##$YMIN_a= -714399
##$ZGOPTNS= <>
##$ZL1= 120
##$ZL2= 120
##$ZL3= 120
##$ZL4= 120
##$ABSF1= 10
##$ABSF2= 0
##$ABSG= 5
##$ABSL= 3
##$ALPHA= 0
##$AQORDER= 0
##$ASSFAC= 0
##$ASSFACI= 0
##$ASSFACX= 0
##$ASSWID= 0
##$AUNMP= <proc_1d>
##$AZFE= 0.1
##$AZFW= 0.1
##$BCFW= 1
##$BC_mod= 2
##$BYTORDP= 1
##$COROFFS= 0
##$CY= 11.3945322036743
##$DATMOD= 1
##$DC= 2
##$DFILT= <>
##$DTYPP= 0
##$F1P= 18.9103706918063
##$F2P= -1.10871071338519
##$FCOR= 0.5
##$FTSIZE= 0
##$FT_mod= 4
##$GAMMA= 1
##$GB= 0.15
##$INTBC= 1
##$INTSCL= 1
##$ISEN= 128
##$LB= 0.24
##$LEV0= 0
##$LPBIN= 0
##$MAXI= 10000
##$MC2= 0
##$MEAN= 0
##$ME_mod= 0
##$MI= 1.114404
##$NCOEF= 0
##$NC_proc= 0
##$NLEV= 6
##$NOISF1= 3.799351
##$NOISF2= 2.8
##$NSP= 1
##$NTH_PI= 0
##$NZP= 0
##$OFFSET= 15.70392
##$PC= 1
##$PHC0= -8500.559
##$PHC1= 16.60097
##$PH_mod= 1
##$PKNL= yes
##$PPARMOD= 0
##$PSCAL= 0
##$PSIGN= 0
##$REVERSE= no
##$SF= 200.130013532006
##$SI= 16384
##$SIGF1= 3
##$SIGF2= 2
##$SINO= 400
##$SIOLD= 16384
##$SREGLST= <1H.CDCl3>
##$SSB= 0
##$STSI= 0
##$STSR= 0
##$SW_p= 3612.71676300578
##$SYMM= 0
##$S_DEV= 0
##$TDeff= 0
##$TDoff= 0
##$TI= <>
##$TILT= no
##$TM1= 0
##$TM2= 0
##$TOPLEV= 0
##$USERP1= <user>
##$USERP2= <user>
##$USERP3= <user>
##$USERP4= <user>
##$USERP5= <user>
##$WDW= 1
##$XDIM= 8192
##$YMAX_p= 0
##$YMIN_p= 0
$$ End of Bruker specific parameters
$$ ---------------------------------
##NTUPLES= NMR FID
##VAR_NAME=  TIME,          FID/REAL,        FID/IMAG
##SYMBOL=    X,             R,               I
##VAR_TYPE=  INDEPENDENT,   DEPENDENT,       DEPENDENT
##VAR_FORM=  AFFN,          ASDF,            ASDF
##VAR_DIM=   8192,          8192,            8192
##UNITS=     SECONDS,       ARBITRARY UNITS, ARBITRARY UNITS
##FACTOR=    0.0002004,     1,               1
##FIRST=     0,             0,               0
##LAST=      1.6414764,     0,               0
##MIN=       0,             -714399,         0
##MAX=       1.6414764,     638769,          0
$$ Real data points
##PAGE= N=1
##DATA TABLE= (X++(R..R)), XYDATA
$$ plain form
0 0 0 0 0 -8 8 -8 8 -16 24 -32 32 -40 56 -70 80 -96 121 -145 166 -196 235 -274 314 -362 421 -483 545
27 545 -621 710 -799 900 -1009 1137 -1273 1416 -1578 1760 -1957 2168 -2401 2662 -2951 3259
43 3259 -3611 4004 -4441 4928 -5485 6130 -6873 7741 -8783 10061 -11658 13722 -16521
56 -16521 20547 -26849 38171 -64805 253114 -106320 -651847 162026 410841 -301083 -535405
67 -535405 368973 638769 -178494 -523876 206787 388205 -361162 -514659 346102 567204
77 567204 -206632 -438092 265784 363446 -394246 -490010 333959 496463 -241272 -377082
87 -377082 319542 353894 -407747 -461313 328912 432773 -278358 -330794 365545 345252 -411872
98 -411872 -420883 334760 371345 -314907 -289083 399438 325184 -409028 -365303 346463 308181
$$ packed form
0@%%%qJ6j6J6k4M0n6O4p2R6j26J50j76K17k66L11l62M31n09N88o76P83r04J028
27E45j166J331j509J699j909K146k410K689k994L338l717M125m569N063n613O210
43C259o870P615q445R369j0413J1615j3003J4614j6524J8844k1719K5380l0243
56a6521L7068m7396O5020j02976L17919l59434n45527Q13873K48815p11924k34322
67e35405R04378K69796q17263l45382P30663J81418p49367j53497Q60761K21102
77E67204p73836k31460P03876R7662p57692r5764Q23969J62504p37735j35810
87c77082O96624L4352p61641n3566P90225J03861p11131n2436O96339k0293p57124
98d11872r011P55643L6585o86252K5824O88521p4254p34212M3725P11766l8282
$$ plain form
109 308181 -348103 -248332 420322 292421 -404993 -304930 357996 247996 -374138 -211423
119 -211423 428163 252100 -401955 -249203 368402 195989 -395562 -181525 428451 212473
129 212473 -401300 -200674 377640 152785 -411361 -154502 424830 172454 -400457 -154429
139 -154429 386382 113170 -418811 -122948 418976 128978 -397357 -105927 391329 75279
149 75279 -415745 -85000 408399 84529 -386938 -58130 389319 39364 -402902 -45214
159 -45214 393227 42641 -372982 -15138 381102 7574 -384847 -9820 375484 5770
169 5770 -358053 19414 368674 -20997 -367254 20596 357512 -28403 -346235 48416
179 48416 354648 -49359 -351994 49679 339966 -62287 -335992 74594 339183 -77936
$$ packed form
109C08181o56284R9771O68654j27901o97414J00063O62926j10000o22134J62715
119b11423O39586j76063o54055J52752O17605j72413n91551K14037O09976k15978
129B12473o13773K00626N78314k24855n64146K56859N79332k52376n72911K46028
139a54429N40811k73212n31981K95863N41924k89998n26335K91430M97256l16050
149G5279m91024L30745M93399l23870m71467L28808M47449l49955m42266L57688
159d5214M38441l50586m15623L57844L96240l73528l92421L75027L85304l69714
169E770l63823L77467L49260l89671l46257L87850L36916l85915l17832L94651
179D8416L06232m04007l02635M01673K90287m02253k73705M10586K64589m17119
$$ plain form
189 -77936 -336596 77833 322612 -93860 -322955 100474 320560 -105696 -317399 106527
199 106527 303505 -122166 -305117 126100 300030 -130050 -294666 133456 283407 -145373
209 -145373 -282693 149345 278828 -151209 -269865 157525 263433 -163706 -259388 168496
219 168496 256351 -167910 -245009 176265 242185 -179031 -235219 183982 232162 -182854 -220454
230 -220454 191117 217496 -192316 -210122 196129 204844 -196641 -195315 202170 190033 -204475
241 -204475 -184867 205049 176608 -207958 -170430 209692 162926 -213414 -160125 211118 149208
252 149208 -216035 -146015 215017 137947 -219131 -134921 216298 124989 -220697 -121463 220218
263 220218 114548 -222371 -110051 221799 103014 -223478 -97884 224701 93682 -223707
$$ packed form
189g7936k58660M14429K44779m16472k29095M23429K20086m26256k11703M23926
199A06527J96978m25671j82951M31217J73930m30080j64616M28122J49951m28780
209a45373j37320M32038J29483m30037j18656M27390J05908m27139r5682M27884
219A68496Q7855m24261p7099M21274O5920m21216n6188M19201M8180m15016l7600
230b20454M11571K6379m09812j7806M06251Q715m01485J326L97485j2137l94508
241b04475J9608L89916k8441l84566L7528L80122m6766l76340N3289L71243o1910
252A49208l65243P0020L61032p7070l57078Q4210L51219r1309l45686R9234L41681
263B20218j05670l36919J12320L31850j18785l26492J25594L22585j31019l17389
$$ plain form
273 -223707 -86646 225507 82417 -224388 -75278 227159 73109 -224029 -64567 226743
283 226743 61590 -224477 -53468 226688 51214 -223611 -43087 225527 39252 -223604
293 -223604 -33004 223608 28771 -222047 -22777 220685 17553 -220132 -13592 217245
303 217245 7238 -217386 -4168 213432 -2645 -213847 4668 209309 -11620 -209333
313 -209333 13571 204711 -20202 -204265 22264 199858 -28358 -198894 30996 195169
323 195169 -35915 -193506 39651 190500 -43049 -187202 47789 185726 -50370 -181609
333 -181609 55907 180767 -57646 -175881 63723 175021 -64904 -170629 70502 170056
343 170056 -71881 -164875 77083 163881 -78806 -159669 83008 158062 -85140 -154303 88644
$$ packed form
273b23707J37061L12153j43090l06805J49110L02437j54050k97138J59462K91310
283B26743j65153k86067J71009K80156j75474k74825J80524K68614j86275k62856
293b23604J90600K56612j94837k50818J99270K43462k03132k37685K06540K30837
303B17245k10007k24624K13218K17600k16077k11202K18515K04641k20929j97713
313b09333K22904J91140k24913j84063K26529J77594k28216j70536K29890J64173
323A95169k31084j57591K33157J50849k33549j44153K34991J37937k36096j31239
333a81609K37516J24860k38413j18235K39604J11298k39925j05725K41131R9554
343A70056k41937r2994K41958Q6798k42687q0863K42677P5054k43202o9163K42947
$$ plain form
354 88644 151228 -91650 -148610 93444 144700 -97139 -142660 98128 137878 -102772 -136321
365 -136321 102627 131031 -106978 -129806 106979 124539 -111096 -123004 111086 118210 -114180
376 -114180 -116587 114722 112060 -117009 -109084 118243 105497 -119079 -101392 121063 98577
387 98577 -121138 -93702 123357 91336 -122539 -86158 125572 84083 -123985 -78579 126119
398 126119 76740 -125523 -71310 127504 69192 -126518 -64698 127726 61829 -127316 -58027
409 -58027 127853 54946 -127779 -51990 127587 47982 -128460 -45534 126916 41466 -128612
420 -128612 -39895 127154 35056 -128529 -33616 126586 28919 -128548 -27356 126464 23002
431 23002 -127448 -21124 126166 17165 -126494 -14961 125573 11594 -125356 -8590
$$ packed form
354H8644O2584k42878n6960K42054N1256k41839m5521K40788L9750k40650l3549
365a36321K38948K8404k38009k2828K36785J7560k35635j1908K34090P124k32390
376a14180k407K31309k662k29069P925K27327j2746k24576J7687K22455k2486
387I8577k19715K7436K17059l2021k13875L6381K11730m1489k08068M5406K04698
398A26119m9379k02263N4213J98814n8312j95710O1820J92424o5897j89145O9289
409e8027J85880p2907j82725P5789J79577p9605j76442Q2926J72450q5450j70078
420a28612Q8717J67049r2098j63585R4913J60202r7667j57467J01192J53820j03462
431B3002j50450J06324J47290j09001j43659J11533J40534j13979j36950J16766
$$ plain form
441 -8590 124831 6353 -123602 -2652 123657 1232 -121859 3251 122252 -4339
451 -4339 -119474 8582 120093 -9349 -117143 13716 117397 -14590 -114758 18408
461 18408 114363 -20171 -112426 23047 111314 -25104 -109337 27320 107454 -29797 -106464
472 -106464 31243 103858 -33964 -102826 35015 100061 -38344 -99746 38560 95985 -41797
483 -41797 -95874 42135 92669 -45221 -91993 45832 89278 -48241 -88205 49060 85685
494 85685 -51338 -84392 52626 82328 -53802 -80237 55844 79091 -56585 -76073 59390
505 59390 75338 -59207 -72460 61605 71946 -61498 -68613 64072 68094 -64025 -65308 66234
517 66234 64043 -66114 -61347 67837 59687 -68386 -57427 69305 55523 -70356 -53739 70785
$$ packed form
441h590J33421j18478j29955J20950J26309j22425j23091J25110J19001j26591
451d339j15135J28056J11511j29442j07794J30859J03681j31987j00168J33166
461A8408R5955j34534r2255J35473Q8267j36418q4233J36657Q0134j37251p6667
472a06464J37707P2615j37822o8862J37841O5046j38405o1402J38306N7425j37782
483d1797n4077J38009N0534j37890m6772J37825M3446j37519l9964J37265L6625
494H5685j37023l3054J37018K9702j36130k6435J36081K3247j35676j9488J35463
505E9390J5948j34545j3253J34065J0341j33444p115J32685M022j32119j283J31542
517F6234k191j30157M767J29184q150j28073J0959J26732j3782j25879J6617J24524
$$ plain form
529 70785 50806 -72215 -49922 71816 46671 -73257 -45704 72587 42524 -73999 -41862
540 -41862 73127 38895 -74406 -38002 73881 35121 -75265 -33610 73960 31197 -74423
551 -74423 -29283 74303 27416 -74092 -25128 74244 23395 -73732 -20787 74396 19982 -73150
563 -73150 -17016 73991 15753 -72598 -12839 73588 12162 -71756 -9287 72781 8569 -71795
575 -71795 -6155 71894 4797 -70712 -2706 70917 1185 -70512 386 69302 -2249 -69691
587 -69691 3444 68633 -5544 -68793 6401 67566 -8940 -67520 9302 65915 -11802 -66059
599 -66059 12700 64694 -14682 -64589 15521 63165 -17102 -62600 18342 61545 -19362 -60784
611 -60784 21164 59867 -22084 -58448 23474 57811 -24510 -56185 26033 56244 -26101 -53961
$$ packed form
529G0785j9979j23021K2293J21738k5145j19928K7553J18291l0063j16523L2137
540d1862J14989l4232j13301L6404J11883l8760j10386M1655J07570m2763j05620
551g4423M5140J03586m6887j01508M8964R9372n0849r7127N2945R5183n4414r3132
563g3150N6134R1007n8238q8351N9759Q6427o1426q3918O2469Q2068o4212q0364
575g1795O5640P8049o7097p5509O8006P3623o9732p1697P0898O8916p1551o7442
587f9691P3135O5189p4177o3249P5194O1165p6506n8580P6822N6613p7717n4257
599f6059P8759N1994p9376m9907Q0110M7644q0267m5498Q0942M3203q0907m1422
611f0784Q1948L8703q1951l6364Q1922L4337q2321l1675Q2218L0211q2345k7860
$$ plain form
623 -53961 28341 53742 -27962 -51802 29934 51454 -30254 -49693 31389 49177 -31658 -47537
635 -47537 33358 46388 -33746 -45252 34198 43942 -34722 -43378 35231 41764 -36524 -41002 36422
648 36422 39153 -37771 -38820 37169 36673 -38617 -36213 38552 34124 -39803 -33873 39436 32211 -40727
662 -40727 -31429 40543 30145 -41370 -29031 41809 27794 -41878 -26886 42827 25890 -42331
674 -42331 -23961 43431 23636 -42862 -21651 43703 21185 -43411 -19249 44290 18938 -44025
686 -44025 -16944 44332 16626 -43897 -14925 44299 14085 -43941 -12886 43895 11505 -44079
698 -44079 -10895 43830 9621 -43658 -8850 43102 7021 -43409 -6653 42553 4889 -42984
710 -42984 -4586 42003 3145 -42365 -2760 41628 1353 -41518 -594 41047 -683 -40539
$$ packed form
623e3961Q2302K5401q1704k3840Q1736K1520q1708j9439Q1082J7788q0835j5879
635d7537Q0895J3030q0134j1506P9450R744p8664q656P8609O533p8288m478P7424
648C6422K731p6924j049P5989m96p5290K404P4765m428p3927N930P3309p225p2938
662d0727R298P1972j0398p1515J2339P0840j4015o9672J4992O9713j6937o8221
674d2331J8370O7392j9795o6498K1211O5354k2518o4596K4162O3539k5352o2963
686d4025K7081O1276k7706o0523K8972N9224l0214n8026L1055N6781l2390n5584
698d4079L3184N4725l4209n3279L4808N1952l6081n0430L6756M9206l7664m7873
710d2984L8398M6589l8858m5510L9605M4388m0275m2871M0924M1641m1730l9856
$$ plain form
722 -40539 1204 40332 -2323 -39622 3513 39416 -3649 -38624 4864 38781 -5281 -37489
734 -37489 6842 37843 -7032 -36726 8500 37013 -8642 -36223 10092 36012 -10372 -34883
746 -34883 11508 35031 -11851 -34155 12695 33798 -13347 -33395 13991 32451 -14901 -32220
758 -32220 15505 31416 -16370 -30847 16563 29980 -17898 -29717 17802 28591 -18581 -28576
770 -28576 18708 27082 -19733 -26995 19552 26041 -20512 -25709 20623 24571 -21172 -24131 21398
783 21398 23414 -21760 -22160 22278 21991 -21989 -21065 22663 20655 -22401 -19380 23621 19345 -23294
797 -23294 -18136 24028 17808 -23435 -16683 24047 16339 -24056 -15277 24275 14855 -24470 -14026
810 -14026 24690 13271 -24710 -12913 24653 11934 -25377 -11403 24993 10214 -25403 -10178
$$ packed form
722d0539M1743L9128m2655l7299M3135L5903m3065l4975M3488L3917m4062l2208
734c7489M4331L1001m4875k9694M5226K8513m5655k7581M6315K5920m6384k4511
746c4883M6391K3523m6882k2304M6850K1103m7145k0048M7386J8460m7352j7319
758c2220M7725J5911m7786j4477M7410J3417m7878j1819M7519J0789m7172r995
770b8576M7284Q374m6815p262M6547O489m6553n197M6332L948m5743k959M5529
783B1398K016m5174m00M4438k87m3980R24M3728k008m3056L021M3001m276m2639
797b3294N158M2164o220m1243O752M0730p708m0395Q779L9552r420l9325J0444
810a4026L8716j1419l7981J1797L7566j2719l7311J3974L6396j4779l5617J5225
$$ plain form
822 -10178 24758 8773 -25459 -8940 24908 7550 -25493 -7553 25118 6359 -25360 -6030
834 -6030 25035 5297 -25576 -4817 25441 4158 -24853 -3658 25014 3300 -24957 -2179
846 -2179 24885 1747 -24663 -843 25154 784 -24361 742 24120 -745 -23934 1424
858 1424 23877 -2082 -23440 2603 23391 -2704 -22848 3517 22397 -3635 -22050 4454
870 4454 21639 -4582 -21906 4825 21261 -5904 -21208 5975 20333 -6676 -20844 6859
882 6859 19932 -7305 -19836 7474 19314 -8319 -19217 8407 18706 -8886 -18541 9174
894 9174 18021 -9628 -17526 10221 17786 -10305 -16831 10771 16574 -10519 -15830 11504 15688 -11462
908 -11462 -14911 12133 15155 -12252 -14248 12700 14444 -12753 -13834 13090 13621 -13023 -13320 13507
$$ packed form
822a0178L4936j5985l4232J6519L3848j7358l3043J7940L2671j8759l1719J9330
834f030L1065j9738l0873K0759L0258k1283k9011K1195K8672k1714k8257K2778
846b179K7064k3138k6410K3820K5997k4370k5145K5103K3378k4865k3189K5358
858A424K2453k5959k1358K6043K0788k6095k0144K6365J8880k6032j8415K6504
870D454J7185k6221j7324K6731J6436k7165j5304K7183J4358k7009j4168K7703
882F859J3073k7237j2531K7310J1840k7633j0898K7624J0299k7592r655K7715
894I174Q847k7649p898K7747P565k8091o526K7602N803k7093n311K7334M184k7150
908a1462l449K7044L022k7407j996K6948J744k7197j081K6924N31k6644k97K6827
$$ plain form
922 13507 12594 -13543 -12350 13625 11897 -14100 -11658 14235 11150 -14650 -10510 14463 9826 -14843
936 -14843 -9708 14557 9053 -14887 -9227 14550 8553 -14866 -8056 15091 7188 -15352 -7297
949 -7297 15003 6990 -15243 -6610 15434 6173 -14961 -5233 15295 5699 -15147 -4631 15306
962 15306 4501 -15446 -4278 15353 4006 -14999 -3319 15059 3076 -14948 -2769 15235
974 15235 2421 -14959 -1810 14994 1529 -14906 -1406 14796 1048 -14788 -567 14558
986 14558 74 -14969 214 14249 -826 -14551 485 14196 -1156 -14726 1318 13980
998 13980 -1701 -14007 2038 13923 -2098 -13782 2601 13546 -2795 -13443 3395 13399
1010 13399 -3389 -13042 3748 13051 -4001 -12372 4075 12611 -4415 -12001 5082 12202 -4629
$$ packed form
922A3507r13k6137J193K5975j728k5997K442K5893l085k5800M140K4973m637k4669
936a4843N135K4265n504k3940N660K3777n997k3419O810K3147p903k2540Q055
949g297K2300q013k2233Q633K2044r261k1134R728K0528r596k0846J0516J9937
962A5306j0805j9947J1168J9631j1347j9005J1680J8378j1983j8024J2179J8004
974A5235j2814j7380J3149J6804j3465j6435J3500J6202j3748j5836J4221J5125
986A4558j4484j5043J5183J4035j5075j3725J5036J3711j5352j3570J6044J2662
998A3980j5681j2306J6045J1885j6021j1684J6383J0945j6341j0648J6838J0004
1010A3399j6788r653J6790R303j7052q371J6447Q536j7026p586J7083P120j6831
$$ plain form
1023 -4629 -11699 5394 11605 -5204 -11131 5673 11332 -5758 -10697 5896 10982 -5880 -10569
1036 -10569 6403 10156 -6493 -10271 6416 9704 -6667 -9796 6908 9269 -7120 -9249 6951
1049 6951 8765 -7502 -9021 7412 8507 -7760 -8268 7408 8136 -7897 -7716 7913 7936 -8049
1063 -8049 -7468 7888 7231 -8155 -6948 8405 6859 -8489 -6640 8811 6153 -8386 -5848 8670
1077 8670 6109 -8629 -5271 8615 5654 -8793 -5136 8711 4802 -8834 -4565 9078 4294
1090 4294 -9003 -4135 8428 4019 -9117 -3716 8939 3643 -9228 -3342 8842 3089 -8713
1103 -8713 -3060 8694 2788 -8884 -2648 8650 2314 -8631 -2131 8719 1534 -8769 -1873
1116 -1873 8453 1395 -8671 -1445 8469 1043 -8622 -1183 8096 619 -7984 -441 8528 700
$$ packed form
1023d629p070J7093O211j6809n927J6804N659j7090m939J6593N086j6862m689
1036a0569J6972L753j6649l778J6687L288j6371l129J6704K361j6389k129J6200
1049F951J814j6267j519J6433J095j6267n08J5676P28j6033J81J5629K3j5985
1063h049N81J5356o57j5386J207J5353j546j5348J849J5451k658j4539K538J4518
1077H670k561j4738L358J3886k961j4447L657J3847l909j3636M269J3643m784
1090D294j3297M868J2563m409j3136N401J2655n296j2871N886J2184n753j1802
1103h713N653J1754n906j1672O236J1298o336j0945O500J0850p185j0303O896
1116a873J0326p058j0066P226R914p426r665P439R279p477q603P543Q969p828
$$ plain form
1130 700 -8044 -245 8116 272 -8211 -1 8282 -260 -7777 431 8260 -519 -7867 1125 7969
1145 7969 -870 -7797 920 7741 -1469 -7532 1357 7716 -1587 -7823 1564 7347 -1863 -7414 1795
1160 1795 6981 -2195 -7094 2117 6872 -2274 -7000 2537 6692 -2577 -6537 2653 6422 -2605 -6659
1175 -6659 2804 6283 -3051 -6144 3165 6070 -3513 -5798 3504 5650 -3494 -5659 3694 5620 -3516
1190 -3516 -5624 3463 5692 -3653 -5128 3911 5128 -3688 -5175 4102 4916 -3825 -4800 4054 4532 -4111
1206 -4111 -4669 3923 4505 -4147 -4185 4303 4239 -4440 -4047 4471 3737 -4437 -4177 4477 3731 -4979 -3465
1223 -3465 4274 3217 -4710 -3490 4747 3004 -4716 -3080 4719 2793 -4588 -2937 4927 2662 -4851
1238 -4851 -2555 4875 3019 -4470 -2509 4776 2464 -4718 -2172 4907 2506 -4766 -1858 4970 2431
$$ packed form
1130G00q744P799Q361p844q483Q210Q283q542p517Q208P829q779p348Q992O844
1145G969q839o927Q717O821r210o063Q889O359r303o236R387N783r210n551R209
1160A795N186r176m899R211M755r146m726R537M155r269l960R190L769r027m054
1175f659R463L479r334l093R309K905r583k285R302K146r144k165R353J926r136
1190c516k108R087K229r345j475R039J217q816j487R277Q14q741r75Q854M78q643
1206d111n58Q592N82q652l8Q488o4q679L93Q518p34q174K60Q654p46q710J514
1223c465P739j057p927J220Q237j743p720J636P799j926p381J651P864k265p513
1238d851K296P430j856p489J961P285k312p182K546P079k401p272K908O828k539
$$ plain form
1253 2431 -4780 -2025 4944 1928 -4717 -1350 4980 1622 -4824 -1516 4788 1271 -4782 -1411 4859
1268 4859 742 -4681 -1076 4614 787 -4671 -976 4637 575 -4725 -499 4815 338 -4554 -380
1283 -380 4662 179 -4632 38 4458 94 -4360 88 4403 -391 -4702 38 4319 -288 -4001
1298 -4001 287 4400 -416 -4117 637 4149 -384 -4340 883 4517 -622 -4066 667 4112 -872
1313 -872 -4112 946 4235 -1239 -3933 1241 3990 -1226 -4183 1117 3767 -1527 -3807 1366 3645
1328 3645 -1568 -3603 1631 3483 -1890 -3852 1466 3522 -1843 -3463 1473 3239 -2079 -3248 1952
1343 1952 3382 -1965 -3157 2037 3386 -2065 -3092 2144 3305 -2074 -3086 2087 2821 -2349 -2749
1358 -2749 2408 2861 -2247 -2351 2253 2962 -2354 -2432 2229 2309 -2567 -2427 2779 2446 -2600 -2390 2353
$$ packed form
1253B431p211K755O969l016o645L367O330l358o446L308O304l517o053L371O270
1268D859m117n423L605N690l827n458L695N613m062n300M226N314m477m892M174
1283c80N042m483m811M670M420m364m454M448M315m794m311M740M281m607l713
1298d001M288M113m816l701M754L512m533l956N223L634n139l444M733L445m984
1313h72l240N058L289n474k694N174K749n216k957N300K650n294k280N173K279
1328C645n213k035N234J852n373j962N318K056n365j620M936J766n318j169N200
1343A952J430n347j192N194J349n451j027N236J161n379j012N173P34n170m00
1358b749N157M53n108j04M604P09n316p8M661Q0m876J40N206l33n046K10M743
$$ plain form
1375 2353 2507 -2580 -2302 2586 2167 -2728 -2158 2953 1959 -2883 -1974 3059 1829 -2926 -2165 2791 1953
1392 1953 -2746 -1837 2821 1473 -2862 -1386 2891 1426 -3133 -1442 2851 1230 -3122 -1412 3000
1407 3000 1111 -2959 -928 3116 996 -2736 -852 2871 702 -3057 -1018 2858 908 -3258 -785
1422 -785 3123 999 -2622 -406 2923 429 -2938 -568 3294 673 -2818 -307 3241 162 -2895
1437 -2895 -185 2899 405 -2957 -320 2859 180 -2945 212 2940 -40 -2952 10 2803 -222
1452 -222 -2858 -103 2747 -98 -2775 309 2720 -409 -3109 504 2933 -514 -2757 489 2685
1467 2685 -577 -2661 467 2875 -879 -2880 664 2476 -463 -2709 966 2505 -611 -2504 661
1482 661 2605 -743 -2376 872 2363 -1138 -2502 834 2219 -1286 -2349 1170 2276 -1422 -2535
$$ packed form
1375B353J54n087K78M888m19m895N70N111r94m842R09N033j230m755P61M956q38
1392A953m699R09M658j348m335J476M277j465m559J691M293j621m352J710M412
1407C000j889m070K031M044k120l732J884L723k169l759K039L876j950m166K473
1422g85L908k124l621K216L329k494l367K370L862k621l491K511L548l079l057
1437b895K710L084k494l362K637L179k679l125L157K728k980k912K962K793l025
1452b22k636K755K850k845k677L084K411l129k700L613K429l447k243L246K196
1467B685l262k084L128K408l754k001L544J812k939k246L675J539l116j893L165
1482F61J944l348j633L248J491l501j364L336J385l505j063L519J106l698j113
$$ plain form
1497 -2535 1273 2151 -1322 -2154 1175 2115 -1164 -2360 1503 1966 -1315 -2180 1229 1727 -1749 -1942 1643
1514 1643 1757 -1483 -1836 1418 1910 -1610 -1670 1631 1647 -1969 -1597 1777 1611 -1619 -2001 1939 1756 -1484
1532 -1484 -1738 1976 1679 -1717 -1519 2048 1343 -2040 -1399 2082 1330 -1767 -1171 1820 1233 -1889 -1569
1549 -1569 2010 1256 -2096 -1134 2070 651 -2078 -893 1792 695 -2115 -841 2116 949 -2114
1564 -2114 -1092 1913 690 -2020 -794 1875 731 -1888 -586 1949 411 -2134 -644 2164 230
1579 230 -2162 -639 2469 481 -2211 -315 2268 606 -1874 -476 2125 340 -2081 -177 2050
1594 2050 214 -2100 -130 2041 29 -2211 107 1970 -211 -2019 317 2052 -342 -2365 -13
1609 -13 2170 -594 -2192 409 2115 -452 -2160 371 2128 -497 -2279 736 2063 -840 -2160
$$ packed form
1497b535L808Q78l473q32L329R40l279j196L863M63l281q65L409M98l476j93L585
1514A643J14l240l53L254M92l520o0L301J6l616L72L374j66l230l82L940j83l240
1532a484k54L714k97l396J98L567p05l383O41L481p52l097N96K991n87l122L20
1549a569L579p54l352R62L204j419k729J185K685j097k810J274K957j167l063
1564b114J022L005j223k710J226K669j144k619J302K535j538k545J490K808j934
1579B30k392J523L108j988k692J896K583j662k480J398K601j785k421J904K227
1594B050j836k314J970K171k012k240K318J863k181j808K336J735k394k023K352
1609a3K183k764j598K601J706k567j708K531J757k625j782L015J327k903j320
$$ plain form
1624 -2160 262 1683 -544 -2045 606 2038 -433 -1814 857 1733 -866 -1790 781 1610 -537 -1746
1640 -1746 761 2176 -1000 -1517 1015 1799 -729 -1467 896 1526 -1277 -1813 1191 1726 -928 -1609 1250
1657 1250 1390 -1581 -1753 1067 1757 -1414 -1359 1405 1010 -1299 -1522 1302 1437 -1569 -1400 1491 1363
1674 1363 -1260 -1177 1530 1070 -1496 -1252 1259 1094 -1557 -1059 1613 1098 -1572 -871 1634 1200 -1640
1691 -1640 -1145 1460 1234 -1458 -1027 1659 1023 -1436 -756 1378 1136 -1578 -528 1717 441 -1607
1707 -1607 -868 1491 777 -1943 -385 1528 526 -1645 -298 1757 150 -1620 -380 1810 452
1722 452 -1377 -427 2027 -60 -1663 -71 1597 409 -1730 -245 1559 15 -1860 -63 1709
1737 1709 194 -1758 -27 1713 115 -1389 -55 1665 -21 -1588 478 1683 -101 -1656 147
$$ packed form
1624b160K422J421k227j501K651J432k471j381K671Q76k599r24K571Q29k147j209
1640a746K507J415l176n17K532P84k528p38K363O30k803n36L004N35k654o81K859
1657A250J40k971j72K820O90l171N5K764l95k309k23K824J35l006J69K891j28
1674A363k623Q3K707m60k566K44K511j65k651M98K672n15k670P01K505m34k840
1691a640M95K605k26k692M31K686o36k459O80K134k42k714J050K245j276k048
1707a607P39K359p14k720J558J913j002k171J347K055j607j770J240K190j358
1722D52j829R50K454k087j603J592J668j188k139J485J804j544j875J797J772
1737A709j515j952J731J740j598j504J334J720j686j567K066J205j784j555J803
$$ plain form
1752 147 1881 -252 -1637 128 1876 -335 -1860 350 1392 -206 -1581 499 1420 -173 -1447
1767 -1447 267 1702 -377 -1404 717 1473 -582 -1304 607 1569 -76 -1183 743 1440 -951 -1553
1783 -1553 420 1562 -829 -1356 815 1311 -1022 -1156 850 1207 -937 -1218 932 1101 -762 -1077 982
1800 982 1008 -815 -996 1084 1203 -935 -1280 986 599 -1462 -905 1052 1132 -951 -1003 1241 1255 -914
1818 -914 -1205 1102 790 -1193 -991 951 940 -1008 -617 1221 704 -1223 -1025 1033 1129 -1261 -985 1541
1836 1541 559 -1107 -560 1067 573 -1173 -711 1177 532 -1260 -856 1440 427 -1136 -469 1275 478
1853 478 -1349 -636 1369 208 -1291 -460 1493 240 -1436 -304 1224 328 -1152 -139 1390 316
1869 316 -1662 -93 1211 162 -1391 -33 1301 156 -1266 -313 1321 79 -1067 179 1243
$$ packed form
1752A47J734k133j385J765J748k211j525K210J042j598j375K080R21j593j274
1767a447J714J435k079j027K121P56k055p22J911R62j645j107J926O97k391o02
1783a553J973J142k391n27K171M96k333j34K006L57k144k81K150J69j863l15K059
1800I82K6j823j81K080J19k138l45K266l87k061N57J957Q0k083n2K244J4k169
1818i14k91K307l12j983K02J942j1j948L91J838n17j927J98K058R6k390K76K526
1836A541r82j666N47J627m94j746M62J888o45j792M04K296j013j563O67J744p97
1853D78j827P13K005j161j499Q31J953j253j676J132J528q96j480J013J529j074
1869C16j978J569J304j049j553J358J334j145j422R53J634j242j146J246J064
$$ plain form
1884 1243 -232 -1330 -53 1353 260 -1167 -35 1164 -184 -1397 264 883 -370 -1412 291
1899 291 1095 -300 -1518 201 1446 -309 -1288 227 949 -249 -986 402 976 -158 -1126 727 1334
1916 1334 -385 -993 183 1183 -439 -1038 468 1164 -764 -1046 367 886 -767 -829 344 1006 -414
1933 -414 -789 588 976 -465 -781 499 859 -460 -1152 1092 535 -778 -828 860 765 -767 -902 852
1951 852 802 -885 -836 875 780 -700 -784 913 658 -723 -568 694 460 -601 -769 756 714 -801 -657
1970 -657 882 904 -1125 -292 810 600 -853 -636 990 626 -1056 -521 1089 374 -995 -475 1012
1987 1012 688 -870 -368 1111 48 -915 -285 950 421 -1096 -400 766 352 -807 -405 1287 410
2004 410 -1000 -172 962 310 -710 -131 861 26 -942 6 653 92 -1039 71 1038 103 -1018 -182
$$ packed form
1884A243j475j098J277J406j093j427J132J199j348j213J661O19j253j042J703
1899B91Q04j395j218J719J245j755r79J515P22j198p37J388N74j134r68J853O07
1916A334j719o08J176J000j622n99J506O96j928k82J413N19j653o2J173O62j420
1933d14l75J377L88j441l16J280L60j319o92K244n57j313n0J688r5j532j35J754
1951H52n0j687M9J711r5j480q4J697k55j381J55J262k34j061j68J525m2j515J44
1970f57J539K2k029Q33J102k10j453K17J626l64j682N35J610p15j369N20J487
1987A012l24j558N02J479j063r63O30J235n29j517O96J166m14j159M02J692q77
2004D10j410Q28J134o52j020N79R92q35r68R48O47n61j131J110R67r35j121Q36
$$ plain form
2022 -182 839 -134 -787 -111 670 -177 -1102 -54 993 195 -1066 -29 875 -103 -993 260 623 2
2040 2 -907 250 775 -46 -716 241 868 -307 -873 195 735 -137 -925 121 794 -145 -908 95 627
2059 627 -172 -851 131 691 -114 -853 343 750 -250 -885 157 730 -318 -1018 311 786 -433 -704
2077 -704 425 439 -290 -622 320 766 -354 -535 617 486 -287 -701 471 660 -444 -529 476 851 -405
2096 -405 -351 443 594 -491 -615 338 452 -306 -532 304 561 -124 -188 725 566 -294 -736 297 581 -559
2116 -559 -247 363 349 -607 -371 807 218 -690 -226 547 545 -554 -521 659 336 -744 -457 658 424 -253
2136 -253 -413 726 524 -286 -297 586 186 -459 -341 714 219 -333 -134 471 187 -546 -541 622 211 -655
2156 -655 -68 558 110 -483 -165 652 197 -533 -355 341 117 -241 -257 620 -42 -306 -120 407 -39 -555
$$ packed form
2022a82J021r73o53O76P81q47r25J048J047p98j261J037R04r78q90J253L63o21
2040Br09J157N25q21o70R57O27j175n66J068N40q72p88J046O73r39p63J003N32
2059F27p99o79R82N60q05p39J196M07j000o35J042N73j048p00J329M75j219k71
2077g04J129J4p29l32R42M46j120j81J152j31p73m14J172J89j104q5J005L75j256
2096d05N4P94J51j085j24R53J14p58k26Q36K57o85o4R13j59q60m42J033K84j140
2116e59L12O10j4r56K36J178n89r08M64P73kj099L3J180l23j080K87J115k34o77
2136b53j60J139k02q10j1Q83m00o45J18J055m95n52J99O05k84p33NJ163m11q66
2156f55N87O26m48n93L18Q17m55p30J78O96k24l58j6Q77o62k64J86N27m46n16
$$ plain form
2176 -555 -301 599 101 -539 130 402 -264 -752 -32 814 234 -499 43 756 60 -571 -251 319 31 -381
2196 -381 108 537 55 -701 50 217 -67 -603 79 496 -39 -637 68 349 -161 -316 172 434 -2 -790
2216 -790 126 592 114 -542 156 659 -180 -463 415 352 -173 -488 101 645 -100 -755 -9 638 27 -513
2236 -513 58 601 134 -615 -47 16 -36 -529 261 263 -360 -547 28 690 -100 -316 -241 648 -233 -340 -9 281
2258 281 -194 -301 170 543 -10 -123 -126 242 -55 -277 1 470 -418 -190 437 473 -395 -454 163 446 -170
2279 -170 -356 207 458 145 -265 132 461 55 -344 443 312 -108 -315 208 312 -87 -207 61 225 -204
2299 -204 -346 80 374 -268 -289 161 458 -403 -163 -1 644 -24 -219 212 489 -315 -219 163 488 -381 -391
2320 -391 218 215 -80 -507 -2 322 -219 -368 271 458 -34 -213 177 436 -156 -281 198 346 -202 -174 313
$$ packed form
2176e55K54R00m98o40O69K72o66m88P20Q46n80p33N42P13o96o31L20N70k88m12
2196c81M89M29m82p56P51J67k84n36O82M17n35n98P05K81n10j55M88K62m36p88
2216g90R16M66m78o56O98N03q39k83Q78o3n25l15N89N44p45o55P46O47o11n40
2236e13N71N43m67p49N68O3n2m93P90Ko23j87N75O62p90k16P5Q89q81j07L31K90
2258B81m75j07M71L73n53j13lL68k97k22K78M69q88K28O27L6q68n9O17K83o16
2279a70j86N63K51l13m10L97L29m06l99P87j31m20k07N23J04l99j20K68J64m29
2299b04j42M26K94o42k1M50K97q61K40J62O45o68j95M31K77q04R6L82L25q69j0
2320c91O09lk95m27N05L24n41j49O39J87m92j79L90K59n92j25M79J48n48K8M87
$$ plain form
2341 313 204 -131 -287 374 329 206 -170 230 92 -729 -191 73 204 -84 -206 325 709 -418 -25 262
2361 262 153 -139 -163 102 190 -536 -253 424 175 -136 -88 -38 318 -340 -142 312 -51 40 -212 236 309 -232
2383 -232 -257 228 177 -384 -226 313 369 -56 -206 441 198 -196 -36 396 65 -268 -255 10 -23 -396 -58 198
2405 198 441 -468 -62 480 163 -178 -61 467 232 -413 -115 549 104 -594 -182 471 -74 -228 -157 161
2425 161 339 -144 -436 290 59 -298 -346 406 276 -467 55 218 217 -249 -116 387 40 -597 -479 165 152
2446 152 -269 -59 541 192 -542 -29 321 -138 -423 -39 206 142 -242 104 426 -155 -230 -56 160 -22 -348
2467 -348 -111 435 -56 -123 36 484 133 -328 264 190 256 -348 -164 310 107 -344 300 420 -33 -246 178
2488 178 232 -379 -489 237 337 -177 -550 -177 336 -75 -438 327 334 -81 -147 -56 486 -273 -337 347 427 -395
$$ packed form
2341C13j09l35j56O61m5j23l76M00j38q21N38K64J31k88j22N31L84j127L93K87
2361B62j09k92k4K65Q8p26K83O77k49l11M8N0L56o58J98M54l63R1k52M48P3n41
2383b32k5M85n1n61J58N39N6m25j50O47k43l94J60M32l31l33J3K65l3l73L38K56
2405A98K43r09M06N42l17l41J17N28k35o45K98O64m45o98M12O53n45j54P1L18
2425A61J78m83k92P26k31l57m8P52j30p43N22J63jm66J33N03l47o37J18O44j3
2446A52m21K10O00l49p34N13L50m59k85L84K45o4l84L46L22n81p5J74K16j82l26
2467c48K37N46m91o7J59M48l51m61N92p4O6o04J84M74k03m51O44J20m53k13M24
2488A78N4o11j10P26J00n14l73L73N13m11l63P65Pm15o6R1N42p59o4O84Q0q22
$$ plain form
2510 -395 -292 67 656 -374 -295 205 335 -209 -524 88 259 19 -374 366 307 -45 -312 -72 443 -443
2530 -443 -346 391 429 62 -181 104 354 -377 -201 100 258 -75 -593 456 210 -361 -497 413 -72 -40 -21
2551 -21 229 341 102 -461 520 513 -216 -3 192 140 -276 -302 319 311 77 -373 604 748 -487 -150 340 293
2573 293 -395 -174 356 134 -414 -336 444 344 -74 69 489 40 -56 -113 284 205 -74 -8 490 163 -573 -74
2595 -74 392 221 -520 25 501 175 -437 -168 329 -14 -304 55 336 88 -144 -115 456 232 -342 5 588
2616 588 60 -108 -85 428 -109 -792 -109 339 -157 -415 192 348 62 -59 139 181 -87 -356 8 751 -54
2637 -54 -476 -84 407 8 -496 -112 377 -45 -495 350 202 -303 -277 173 259 -236 -269 133 335 -314 -524
2658 -524 160 350 -177 -272 450 591 -164 -178 -6 275 -329 -549 60 582 -163 -409 591 342 -324 -237 234
$$ packed form
2510c95J03L59N89j030P9N00J30n44l15O12J71k40l93P40n9l52k67K40N15q86
2530d43R7P37L8l67k43K85K50p31J76L01J58l33n18J049k46n71j36R10m85L2J9
2551b1K50J12k39n63R81pp29K13J95n2m16k6O21qk34m50R77J44j235L37M90m7
2573B93o88K21N30k22n48P8P80j00m18J43M20m49r6n7L97p9k79O6M98l27p36M99
2595g4M66j71p41N45M76l26o12K69M97l43k90L59K81k48k32K9N71k24n74L47N83
2616E88n28j68K3N13n37o83O83M48m96k58O07J56k86j21J98M2k68k69L64P43q05
2637e4m22L92M91l99n04L84M89m22m50Q45j48n05K6M50Q6m95l3M02K02o49k10
2658e24O84J90n27r5P22J41p55j4J72K81o04k20O09N22p45k46J000k49o66Q7M71
$$ plain form
2679 234 311 -256 -495 239 374 -26 -402 165 183 -15 -363 30 356 -194 -421 15 431 -524 -406 327 154
2700 154 -90 -445 578 305 -359 -65 325 560 -127 -6 449 342 -458 -337 501 198 -256 -229 400 290
2720 290 -613 -479 395 222 -239 -109 431 239 -383 -364 594 374 -684 -278 407 376 -327 -201 309 -30
2740 -30 -424 -105 422 205 -405 116 203 269 -291 -428 580 300 -314 -256 570 20 -264 -104 279 338 -332
2761 -332 -85 518 31 -617 -144 417 344 -261 -110 606 9 -318 -58 599 95 -544 -67 225 -86 -465
2781 -465 -96 525 46 -440 37 294 -235 -708 374 699 268 -568 131 259 108 -398 338 435 2 -591
2801 -591 98 358 33 -674 -142 692 -62 -179 -226 474 286 -420 131 526 -174 -296 284 325 117 -389 289
2822 289 316 -129 -511 -94 624 -149 -406 198 380 -352 -400 306 507 -165 -243 -112 278 -297 -284 368 742
$$ packed form
2679B34P7n67k39P34J35m00l76N67J8j98l48L93L26n50k27M36M16r55J18P33j73
2700A54k44l55J023k73o64K94L90K35o87J21M55j07q00J21Q38l03m54K7O29j10
2720B90r03J34Q74j73m61J30N40j92o22J9R58k20j058M06O85l1p03J26N10l39
2740c0l94L19N27k17o10N21Q7O6n60j37J008k80o14N8Q26n50k84J60L83N9o70
2761c32K47O03m87o48M73N61p3o05J51P16n97l27K60O57n04o39M77K92l11l79
2781d65L69O21m79m86M77K57n29m73J082L25m31q36O99J28j51n06P36R7m33n93
2801e91O89K60l25p07N32Q34p54j17m7P00j88p06N51L95p00j22N80M1k08n06O78
2822B89K7m45l82M17P18p73k57O04J82p32m8P06K01o72p8J31L90n75J3O52L74
$$ plain form
2843 742 -689 -480 141 353 -313 -189 370 507 -111 -329 261 532 -440 -681 194 327 -202 -188 373 348
2863 348 -484 -372 290 419 -740 -451 285 213 -195 -224 393 92 -410 -238 238 135 -388 -384 567 483 -514
2884 -514 -286 316 250 -164 -202 550 20 -305 -371 556 329 -632 -364 310 413 -466 -344 543 82 -606 -246
2905 -246 273 243 -567 -285 347 -164 -138 -162 226 222 -536 -271 278 178 -507 -152 444 317 -212 -141 596 -58
2927 -58 -795 -137 519 -32 -133 233 513 262 -507 99 339 -166 -625 29 215 79 -498 -387 497 -121
2947 -121 -808 -34 647 39 -515 -43 364 278 -409 45 554 -108 -795 -119 716 -11 -518 229 723 54
2967 54 -353 -154 1128 -40 -467 243 452 -209 -942 69 454 -201 -583 516 363 -201 -333 193 467
2986 467 -232 -547 310 251 -365 -553 356 678 -250 -423 206 263 -341 -242 266 405 -237 -609 261 268 -26 -536
$$ packed form
2843G42j431K09O21K12o66J24N59J37o18k18N90K71r72k41Q75J33n29J4N61k5
2863C48q32J12O62J29j159K89P36p2m08k9O17l01n02J72M76j03n23MR51q4r97
2884e14K28O02o6m14l8P52n30l25o6R27k27r61K68O74J03q79J22Q87m61o88L60
2905b46N19l0q10K82O32n11K6k4L88mp58K65N49j00o85L55N96j27n29P1P37o54
2927e8p37O58O56n51j01L66K80k51p69O06K40n05m59O54J86j36n77J11Q84o18
2947a21o87P74O81o08n54M72M07q6o87M54N09o62o87O76Q35p27n07P47M94o69
2967E4m07J99J282j168m27P10K09o61p33J011L85o55l82J099j53n64j32N26K74
2986D67o99l15Q57n9o16j88R09L22r28j73O29N7o04R9N08J39o42l72Q70Pk94n10
$$ plain form
3008 -536 215 473 -155 -266 275 473 -112 -235 338 328 -453 -442 171 91 -438 -197 503 395 -337 -416 477
3029 477 454 -144 -482 596 393 -387 -384 396 429 -522 -319 258 449 -805 -534 674 158 -160 -100 380 461
3050 461 -323 -103 618 248 -421 -89 488 479 -538 -351 578 320 -467 -337 646 99 -439 -128 449 226
3070 226 -553 -177 760 104 -307 -75 677 547 -699 -20 395 105 -431 -547 398 372 -465 -86 390 125
3090 125 -786 -237 460 -189 -133 104 219 -117 -438 -149 344 235 -636 -208 554 23 -370 -453 650 -194
3110 -194 -496 201 598 -420 -532 -13 598 206 -375 64 403 -136 -688 345 434 -28 -712 208 395 -225
3130 -225 -425 261 462 21 -634 269 215 -37 -476 247 569 -349 -480 152 882 -48 -493 241 400 -422
3150 -422 -421 -7 362 -119 -404 236 572 -300 -219 355 219 -205 -598 462 568 -321 -587 90 185 -305 -228
$$ packed form
3008e36P51K58o28j11N41J98n85j23N73j0p81J1O13q0n29K41P00j08p32p9Q93
3029D77k3n98l38J078k03p80LP80L3r51K03N77J91j254K71J208n16l18O0M80Q1
3050D61p84K20P21l70o69L32N77rj017J87R29k58p87J30R83n47n38L11N77k23
3070B26p79L76R37o56m11K32P52j30j246O79M15k90n36j16R45k6q37L79M76k65
3090A25r11N49O97o49N6K37J15l36l21K89M93j09q71M28P62n31l93q3J103q44
3110a94l02O97L97j018j12N19O11l92n81M39L39n39n52J033Q9m62o84R20J87o20
3130b25k00O86K01m41o55R03n4k52m39P23L22r18j31O32P30r30m45P34J59q22
3150d22JM14L69m81k85O40L36q72Q1N74j36m24l93J060J06q89k66O77R5m90P7
$$ plain form
3171 -228 288 347 -306 -445 475 304 -413 -253 239 302 -384 -328 592 611 -392 -254 794 354 -604 -529 246
3192 246 521 -709 -232 286 164 -348 -155 584 135 -437 -336 399 197 -475 -212 657 536 -466 -151
3211 -151 469 363 -380 -322 512 117 -958 -394 519 118 -363 -397 118 85 -462 -217 349 92 -562 56 291
3232 291 175 -211 -32 562 202 -308 -110 553 430 -638 -251 529 448 -277 -211 620 -138 -296 -267 461 37
3253 37 -458 -225 304 174 -328 -126 473 -5 -521 -4 394 225 -246 -101 599 -106 -411 -185 804 148
3273 148 -513 171 498 162 -698 81 321 -216 -348 -154 594 -184 -172 -149 295 147 -590 149 406 93 -468
3294 -468 -14 297 -391 -485 222 199 -69 -441 204 549 -19 -587 434 350 -239 -518 216 322 -427 -480 168
3315 168 362 -93 -200 253 507 -187 -124 242 284 51 -397 200 120 -156 -417 56 557 -160 -393 179 462
$$ packed form
3171b28N16N9o53j39R20j71p17J60M92O3o86N6R20J9j003J38J048m40r58P5P75
3192B46K75j230M77N18j22n12J93P39m49n72J01P35k02o72K63Q69j21j002L15
3211a51O20j06p43N8Q34l95j075N64R13m01m81l4N15l3n47K45N66k57o54O18K35
3232B91j16l86J79N94l60n10J98O63j23j068L87P80q1p25O6Q31p58j58K9P28m24
3253C7m95K33N29j30n02K02N99m78n16N17L98j69m71J45P00p05l05K26R89o56
3273A48o61O84L27l36q60P79K40n37j32J94P48p78J2K3M44j48p37P39K57l13n61
3294d68M54L11o88r4P07k3k68l72O45L45n68n68J021q4n89k79P34J06p49n3O48
3315A68J94m55j07M53K54o94O3L66M2k33m48N97q0k76k61M73N01p17k33N72K83
$$ plain form
3336 462 -147 -283 302 354 17 -438 138 395 -348 -363 93 185 -180 -276 442 518 -451 -141 129 -60 -191 -35
3358 -35 247 407 -415 140 257 331 -138 -18 243 320 -488 -331 65 218 -420 -142 510 522 -342 -78 320
3379 320 195 -343 -242 366 195 169 -56 133 28 -380 -86 373 129 -296 1 334 243 -66 -195 502 -86
3400 -86 -83 -89 291 304 -506 -200 348 573 -237 -8 466 -60 -311 -274 323 27 -361 -251 194 -48 -399 -180
3422 -180 267 213 -245 -40 82 29 -224 -56 485 1 -341 -42 344 -157 -305 188 105 -145 -292 -65 405
3443 405 53 -296 67 274 -3 -313 163 278 234 -176 -84 252 -158 -579 228 362 -345 -449 -149 175 307
3464 307 -88 -20 305 99 -278 -113 394 -18 -356 26 145 74 -164 -68 259 -201 -62 147 153 222 -207 204
3486 204 235 -79 -177 153 184 -169 -395 294 280 -334 -236 201 331 -322 -256 318 70 -101 -158 66 189 -287
$$ packed form
3336D62o09j36N85N2l37m55N76K57p43j5M56R2l65r6P18P6r69L10K70j89j31J56
3358c5K82J60q22N55J17P4m69J20K61P7q08J57L96J53o38K78O52J2q64K64L98
3379C20j25n38J01O08j71k6k25J89j05m08K94M59k44m25K97L33r1l09j29O97n88
3400h6LoL80J3q10L06N48K25q10K29M74n26k51L7N97k96l88J10M45k42l51K19
3422a80M47n4m58K05J22n3k53J68N41m84l42K99L86n01j48M93q3k50j47K27M70
3443D05l52l49L63K07k77l10M76J15m4m10R2L36m10m21Q07J34p07j04L00L24J32
3464C07l95O8L25k06l77J65N07m12l38L82J19p1k38R6L27m60J39K09OO9m29M11
3486B04L1l14r8L30L1l53k26O89j4o14R8M37J30o53O6N74k48j71n7K24J23m76
$$ plain form
3508 -287 -260 182 192 -309 -188 544 340 -406 50 264 163 -147 -53 161 4 -311 158 -84 -60 -121 -268 144
3530 144 104 -131 -220 130 -293 -112 -324 339 402 -174 -5 66 130 -393 -253 460 -89 -359 -48 386 209 -66
3552 -66 -130 211 16 -280 -384 -81 -65 81 -276 203 200 -44 36 406 116 -122 -193 151 -385 -210 -68 29 135
3575 135 -212 180 -149 -25 -219 -256 18 32 -173 194 -6 -303 -249 -193 240 -187 -268 39 345 56 73 104
3597 104 371 -55 -109 70 42 156 -108 -124 389 -13 135 -235 -40 -143 -229 99 118 -224 -152 26 251 -396
3619 -396 -92 232 243 -44 -241 217 -109 -106 -41 -25 -163 62 -340 31 225 131 87 127 388 59 -98 413 136
3642 136 -302 -58 97 45 47 118 274 -178 -245 -195 -24 -121 -181 97 -227 -91 52 63 -22 18 42 -82 104 118
3666 118 -193 -82 -30 -91 -303 187 120 -126 -356 -30 128 -190 -313 -89 203 -170 -110 -77 367 -114 5 -254
$$ packed form
3508b87K7M42J0n01J21P32k04p46M56K14j01l10R4K14j57l15M69k42K4o1j47M12
3530A44m0k35q9L50m23J81k12O63O3n76J69P1O4n23J40P13n49k70L11M34j77k75
3552f6o4L41j95k96j04L03J6J46l57M79lk44Q0L70k90k38p1L44n36J75J42R7J06
3575A35l47L92l29J24j94l7K74J4k05L67k00k97N4N6M33m27q1L07L06k89J7L1
3597A04K67m26n4J79k8J14k64j6N13m02J48l70J95j03q6L28J9l42P2J78K25o47
3619c96L04L24J1k87j97M58l26LO5J6j38K25m02L71J94r4m4M0K61l29j57N11k77
3642A36m38K44J55n2KP1J56m52o7N0J71r7o0K78l24J36J43J1q5M0K4j24J86J4
3666A18l11J11N2o1k12M90o7k46k30L26J58l18j23K24K92l73O0L3M44m81J19k59
$$ plain form
3688 -254 223 189 -411 113 -94 139 -234 -163 82 230 -360 -8 154 218 26 134 -3 -198 -281 -256 191 86
3710 86 -18 162 171 169 -32 131 152 -225 -278 -259 11 204 -189 -253 232 -227 -112 -75 289 -559 -220 172 238 -338
3734 -338 -109 -51 146 -204 26 32 243 -341 -18 -15 130 -163 -255 74 287 141 -426 -38 -63 7 322 193 46
3757 46 -248 180 -76 -189 -46 -200 -93 -63 -55 -449 41 42 191 -234 111 -26 145 -166 -126 -101 -94 -314 236
3780 236 208 -57 336 -135 -44 -175 146 161 25 -87 36 7 39 -71 -146 135 -36 -287 -17 32 226 283 -115
3803 -115 61 218 -182 -169 87 -127 -232 -26 -224 -102 -119 399 21 47 28 187 -158 219 170 95 31 210
3825 210 -434 6 61 216 -270 -92 232 -7 -64 -47 -272 -39 -18 11 61 151 -6 335 333 224 -151 -126 110
3848 110 10 -15 -21 227 109 -128 -192 -47 86 258 39 132 432 174 -113 182 19 -71 -202 145 44 254
$$ packed form
3688b54M77l4o00N24k07K33l73P1K45J48n90L52J62O4j92J08j37j95q3K5M47j05
3710H6j04J80Rkk01J63K1l77n3J9K70J93l93o4M85m59J15L7L64q48L39L92O6n76
3734c38K29N8J97l50K30OK11n84L23LJ45k93r2L29K13j46n67L88k5P0L15j29j47
3757D6k94M28k56j13J43j54J07L0Ql94M90JJ49m25L45j37J71l11M0K5Pk20N50
3780B36k8k65L93m71R1j31L21J5j36j12J23k9L2j10p5K81j71k51K70M9J94N7l98
3803a15J76J57m00J3K56k14j05K06j98J22j7N18l78K6j9J59l45L77m9p5o4J79
3825B10o44M40N5J55m86J78L24k39n7J7k25K33K1K9N0R0j57L41kj09l75K5K36
3848A10j00k5oK48j18k37o4J45J33J72k19R3L00k58k87K95j63r0j31L47j01K10
$$ plain form
3870 254 118 40 -127 -78 16 -92 -132 -159 65 -286 -200 -298 83 169 -170 -285 -276 40 -217 84 -142 70 189
3893 189 -445 -2 83 -49 57 -17 -160 77 -64 56 154 -332 -64 87 263 182 141 99 61 -502 -206 215
3915 215 227 9 -480 15 41 57 105 448 -28 103 -34 279 296 -119 122 -18 -54 -106 -156 -38 328 -29 -183
3938 -183 17 112 -147 166 21 246 -199 -37 32 296 -19 -78 147 350 110 7 0 -10 19 -132 -72 362 -149
3961 -149 -78 388 -104 -135 -62 16 28 -188 -231 200 112 -154 -201 92 -117 -181 197 312 -97 -116 -193 27 -66 175
3985 175 17 -149 -27 -231 -226 271 10 162 -60 9 172 -44 -176 -72 -124 69 30 -150 138 -229 -55 133
4007 133 178 -141 -337 -10 142 -133 195 41 -108 -214 171 28 265 231 -271 17 -123 -336 104 59 209
4028 209 13 -38 46 -73 -446 78 363 105 274 -151 -436 133 -81 13 -133 38 138 23 282 -92 -43
$$ packed form
3870B54j36p8j67M9R4j08m0k7K24l51Q6r8L81Q6l39j15RL16k57L01k26K12J19
3893A89o34M43Q5j32J06p4j43K37j41J20R8m86K68J51J76q1m1m2l8n63K96M21
3915B15J2k18m89M95K6J6M8L43m76J31j37L13J7m15K41j40l6n2n0J18L66l57j54
3938a83K00R5k59L13j45K25m45J62O9K64l15n9K25K03k40j03pj0K9j51O0M34n11
3961a49P1M66m92l1P3P8J2k16m3M31q8k66m7K93k09o4L78J15m09j9p7K20r3K41
3985A75j58j66J22k04NM97k61J52k22O9J63k16j32J04n2J93l9j80K88l67J74J88
4007A33M5l19j96L27J52k75L28j54j49j06L85j43K37l4n02K88j40k13M40m5J50
4028B09j96n1Q4j19l73N24K85k58J69m25k85N69k14R4j46J71J00j15K59l74M9
$$ plain form
4049 -43 -241 -67 11 -33 -210 -22 87 -294 304 109 -137 -567 23 -75 -263 53 32 204 126 8 -9 227
4071 227 -38 -182 -146 -312 -373 -48 355 75 21 312 23 16 -209 57 -93 123 -149 12 -99 65 -52 -306
4093 -306 86 -62 109 135 216 -6 116 63 245 91 -61 7 39 -94 -50 -214 100 103 -175 61 239 -42 -21
4116 -21 -33 428 13 -261 182 -164 -137 -166 -194 97 -39 -163 3 -274 -54 -55 184 19 -140 -209 172 -160 -158
4139 -158 -56 -84 158 -37 -298 -38 312 72 79 63 -128 -52 38 -108 -37 -229 -108 284 116 85 -107 -183 128
4162 128 68 -120 140 132 81 143 -3 160 14 -108 11 -136 -42 -102 -13 -75 -291 -111 -40 295 160 198 51 -80
4186 -80 51 -55 137 56 -45 -67 -106 24 -4 34 53 217 -42 -133 98 302 -108 0 83 -76 -377 121 143
4209 143 255 -63 -64 11 -269 -101 -120 80 90 27 -394 -133 604 -117 187 10 178 -30 331 124 421 -56
$$ packed form
4049d3j98J74P8m4j77J88J09l81N98j95k46m30N90r8j88L16k1J72p8j18j7K36
4071B27k65j44L6j66o1L25M03k80n4K91k89pk25K66j50K16k72J61j11J64j17k54
4093c06L92j48J71K6Q1k22J22n3J82j54j52O8L2j33M4j64L14Lk78K36J78k81K1
4116b1j2M61m15k74M43l46K7k9k8K91j36j24J66k77K20jK39j65j59o9L81l32K
4139a58J02k8K42j95k61K60L50k40Pj6j91P6R0j46P1j92J21L92j68l1j92p6L11
4162A28o0j88K60qn1O2j46J63j46j22J19j47R4o0Q9o2k16J80P1L35j35L8j47j31
4186h0J31j06J92q1j01k2l9J30k8L8J9J64k59r1K31K04m10J08Q3j59l01M98K2
4209A43J12l18jP5k80J68j9K00J0o3m21K61P37p21L04j77J68k08L61k07K97m77
$$ plain form
4231 -56 -121 17 130 -123 -77 -40 171 148 -388 306 57 189 88 120 64 -52 -2 102 21 -249 234 -60 -321
4254 -321 -215 -37 195 -219 121 132 11 -89 31 107 -189 217 1 -199 163 -35 -148 -204 310 29 -63
4275 -63 -210 -91 -92 -133 310 74 -303 -165 -116 21 156 71 234 221 -104 -55 153 293 126 -17 27 125 157 120
4299 120 -116 42 -136 -91 68 233 -195 -234 8 -70 -285 -249 202 402 -116 -248 92 79 -157 -410 220 -196
4321 -196 138 182 0 -11 -295 -62 192 163 -285 183 13 -51 -239 55 -85 127 194 161 100 149 -47 -62 -36
4344 -36 32 -84 -216 13 -25 -225 32 78 151 -228 -80 112 92 -2 -150 37 -53 -80 -436 335 -17 -172 -192
4367 -192 -95 80 91 -33 56 -109 160 -108 16 207 32 -143 127 -132 64 -135 98 -276 -53 7 -206
4388 -206 13 -92 -3 -79 38 -319 9 334 34 -71 55 173 110 100 -82 -52 65 -181 231 -92 -23 -15 139
$$ packed form
4231e6o5J38J13k53M6L7K11k3n36O94k49J32j01L2n6j16N0J04q1k70M83k94k61
4254c21J06J78K32m14L40J1j21j00J20P6k96M06k16k00L62j98j13n6N14k81r2
4275f3j47J19jm1M43k36l77J38M9J37J35q5J63j3l25M9K08J40j67j43M4R8L2l7
4299A20k36J58j78M5J59J65m28l9K42p8k15L6M51K00n18j32L40j3k36k53O30m16
4321a96L34M4j82j1k84K33K54k9m48M68j70o4j88K94j40K12O7l3o1M9j96j5K6
4344c6O8j16j32K29l8k00K57M6P3l79J48J92k0r4j48J87r0k7l56P71l52j55k0
4367a92R7J75J1j24Q9j65K69k68J24J91j75j75K70k59J96j99K33l74K23O0k13
4388b06K19j05Q9p6J17l57L28L25l00j05J26J18o3j0j82L0J17k46M12l23O9QJ54
$$ plain form
4411 139 241 -5 -155 100 170 -82 -68 251 152 143 -29 122 192 -88 -133 63 13 -91 -124 131 261 78 40
4434 40 165 -6 -361 -43 -82 -39 45 -106 -220 241 -169 8 367 13 -37 42 75 143 111 -327 -137 94 42
4457 42 -31 -136 -28 -6 -19 -20 333 -2 62 487 76 -371 -383 162 -148 216 18 123 -147 -212 -180 12 -301
4480 -301 -432 220 -79 -83 -207 145 108 168 -221 34 78 -29 32 -85 40 254 -107 38 301 22 114 -453
4502 -453 -207 -135 -46 -228 -12 -88 -115 182 -81 -66 -181 51 385 123 -221 233 63 -186 -17 -124 263 -101
4524 -101 -244 -20 -13 -8 -228 -100 59 78 -172 -26 -159 -13 29 -483 226 144 212 104 -58 -153 -126 47 298
4547 298 -81 -115 -191 -6 -194 -141 192 163 34 -348 2 197 78 -162 -208 -4 -93 -113 216 170 -10 -304 30
4570 30 42 102 -193 182 -4 -193 -34 -24 -17 108 86 250 59 101 133 138 132 225 129 247 223 57 147 276 63 -60
$$ packed form
4411A39J02k46j50K55P0k52J4L19r9rj72J51P0k80m5J96n0j04l3K55J30j83l8
4434D0J25j71l55L18l9M3Q4j51j14M61m10J77L59l54n0P9L3O8l2m38J90K31n2
4457D2p3j05J08K2j3jL53l35O4M25m11m47j2N45l10L64j98J05k70o5L2J92l13
4480c01j31O52k99mj24L52l7O0l89K55M4j07O1j17J25K14l61J45K63k79R2n67
4502d53K46P2Q9j82K16p6k7K97k63J5j15K32L34k62l44M54j70k49J69j07L87l64
4524a01j43K24PNk20J28J59J9k50J46j33J46M2n12P09q2O8j08j62r5K7J73K51
4547B98l79l4p6J85j88N3L33k9j29l82L50J95j19k40m6K04q9k0L29m6j80k94L34
4570C0J2O0k95L75j86j89J59J0PJ25k2J64j91M2L2NoR3r6J18k4j66R0J29k13j23
$$ plain form
4596 -60 -111 346 214 -90 -92 -341 18 -432 196 -119 -266 -186 260 150 138 -272 -150 486 56 80 -28 74
4618 74 -153 -34 105 180 1 -58 107 36 163 -126 -302 145 -246 132 -92 5 -201 -327 -187 -2 -112 -57
4640 -57 123 48 256 153 -16 180 99 175 238 -85 -9 -234 -121 -138 -22 -123 123 278 -86 294 167 87 -111
4663 -111 -22 -206 33 14 127 79 213 -141 -74 155 63 -309 -268 61 159 -44 -133 136 191 -60 160 40 121
4686 121 90 -53 -217 -283 -133 -70 -186 259 -293 11 56 99 -72 -19 -120 -152 102 -99 -159 -183 7 81 58 3
4710 3 -7 -167 9 146 57 -251 -79 -31 -31 -397 13 -136 -159 -92 -4 -99 -68 32 -20 281 83 -135 -141 -299 -65
4735 -65 -43 329 -214 86 -27 190 167 -209 411 -69 -153 -54 35 -61 92 -251 -42 -201 179 -22 -111 334 166
4758 166 102 -349 287 -86 -398 67 -170 19 -92 129 226 238 18 -13 245 63 108 -90 11 106 238 -92
$$ packed form
4596f0n1M57j32l04kk49L59m50O28l15j47Q0M46j10j2m10J22O36m30K4j08J02
4618G4k27J19J39P5j79n9J65p1J27k89j76M47l91L78k24R7k06j26J40J85j10N5
4640e7J80p5K08j03j69J96q1P6O3l23P6k25J13j7J16j01K46J55l64L80j27q0j98
4663a11Q9j84K39j9J13m8J34l54O7K29r2l72M1L29R8k03q9K69N5k51K20j20Q1
4686A21l1j43j64o6J50O3j16M45n52L04M5M3j71N3j01l2K54k01o0k4J90P4k3n5
4710Cj0j60J76J37q9l08J72M8%l66M10j49k3O7Q8r5L1J00n2L01j98k18oj58K34
4735f5K2L72n43L00j13K17k3l76O20m80q4R9Q9r6J53l43K09j59L80k01q9M45j68
4758A66o4m51O36l73l12M65k37J89j11K21R7J2k20l1K58j82M5j98J01R5J32l30
$$ plain form
4780 -92 85 287 157 86 -67 382 172 32 74 164 139 -73 19 383 -168 5 -183 34 157 -212 31 172
4802 172 -54 -52 294 -174 144 -180 111 61 140 -85 70 7 -103 29 -82 215 24 141 174 -148 113 238
4824 238 -2 34 -87 141 -314 73 244 13 126 55 -293 -6 -163 49 -75 -123 -192 110 205 177 160 -125
4846 -125 -198 117 -217 150 -108 48 181 -165 188 146 268 68 401 -113 82 102 77 -142 40 38 98 -192
4868 -192 307 58 -222 334 139 299 -108 172 -259 -151 214 -236 -324 -266 357 -114 -114 131 200 104 -48 142
4890 142 187 303 15 -200 187 -3 -168 -281 -66 1 58 305 -187 177 267 -276 284 76 -124 100 -131
4911 -131 -182 83 147 81 -146 -268 255 -94 73 -20 168 -120 -76 36 230 62 -2 -221 17 379 146 9
4933 9 -122 263 -289 -80 128 248 -59 -220 20 81 -85 -9 -201 -200 109 23 363 -99 29 -41 86 44 44 -159
$$ packed form
4780i2J77K02j30p1j53M49k10j40M2R0k5k12R2L64n51J73j88K17J23l69K43J41
4802A72k26KL46m68L18l24K91n0P9k25J55o3j10J32j11K97j91J17L3l22K61J25
4824B38k40L6j21K28m55L87J71k31J13p1l48K87j57K12j24m8o9L02R5k8j7k85
4846a25p3L15l34L67k58J56J33l46L53m2J22k00L33n14J95K0k5k19J82kO0k90
4868a92M99k49k80N56j95J60m07K80m31J08L65m50q8N8O23m71%K45O9r6j52J90
4890A42M5J16k88k15L87j90j65j13K15O7N7K47m92L64R0n43N60k08k00K24k31
4911a31n1K65O4o6k27j22N23l49J67r3J88k88M4J12J94j68o4k19K38L62k33j37
4933Ij31L85n52K09K08J20l07j61K40O1j66P6j92JL09q6L40m62J28p0J27m2%k03
$$ plain form
4957 -159 154 185 213 159 55 -74 -103 -199 319 48 -13 67 25 -1 -66 -242 -9 -98 -17 132 -110 87 -124 -301
4981 -301 -41 129 -10 -292 206 -22 -50 -229 125 -95 176 -5 -454 193 42 139 -135 -8 -193 569 -148
5002 -148 -164 -207 188 78 -72 188 -58 -45 -251 -4 -175 128 221 -34 -78 314 129 -69 -102 190 -214 -179
5024 -179 27 8 181 -199 -115 192 -232 23 46 -31 -354 46 -115 -17 220 -112 187 99 -37 280 208 24
5046 24 -92 84 89 22 -58 131 359 31 -2 184 160 143 -177 -272 111 27 -212 33 338 190 -182 -73 133
5069 133 112 -56 75 -34 73 -123 85 12 209 -323 -204 -181 52 49 -280 267 -85 24 10 167 254 138
5091 138 84 350 -72 -230 -13 48 -39 -262 105 -12 20 154 -125 208 -50 -183 -102 -204 194 -35 -311 146
5113 146 -267 -156 104 322 291 -106 -143 270 -137 140 -175 397 -50 255 -143 301 129 -164 142 194 121
$$ packed form
4957a59L13L1K8n4j04j29k9r6N18k71o1Q0m2k6o5j76K33q9Q1J49k42J97k11j77
4981c01K60J70j39k82M98k28k8j79L54k20K71j81m49O47j51R7k74J27j85P62p17
5002a48j6m3L95j10j50K60k46J3k06K47j71L03R3k55m4L92j85j98l3K92m04L5
5024a79K06j9J73l80Q4L07m24K55K3p7l23M00j61R8K37l32K99q8j36L17p2j84
5046B4j16J76No7q0J89K28l28l3J86k4j7l20r5L83q4k39K45L05j48l72J09K06
5069A33k1j68J31j09J07j96K08p3J97n32J19K3K33ll29N47l52J09j4J57Q7j16
5091A38n4K66m22j58K17O1q7k23L67j17L2J34k79L33k58j33Q1j02L98k29k76M57
5113A46m13J11K60K18l1l97l7M13m07K77l15N72m47L05l98M44j72k93L06N2p3
$$ plain form
5134 121 -12 106 -153 232 -301 -82 -69 268 -41 -109 200 169 23 -71 17 -187 -137 93 162 66 27 150 212
5157 212 7 -220 309 -88 -112 101 95 -85 -127 -112 -91 61 133 14 -3 397 59 -17 229 -41 158 -287 -34
5180 -34 119 -101 -26 -117 -56 -101 -236 20 -149 193 -191 224 213 -51 85 -8 26 187 -454 186 169 -72 -110
5203 -110 -165 233 -21 42 212 54 30 94 57 146 -258 -38 185 -121 -312 -63 -6 -3 -150 13 -44 88 -351
5226 -351 -16 100 -49 -213 141 182 9 104 15 121 36 -138 294 199 76 -72 79 344 -50 53 -71 43
5248 43 131 140 -248 153 -61 -17 183 74 0 -366 -144 -116 -189 -337 117 327 31 15 -68 169 174 -85 5 70 23
5273 23 -61 157 39 40 -192 245 91 -81 -349 229 49 -96 -49 -3 236 -367 -175 57 34 109 26 -20 23 -461
5297 -461 -258 62 161 238 -124 146 -57 -14 -271 -64 460 -34 70 -157 103 149 -401 67 -310 -214 179 5
$$ packed form
5134A21j33J18k59L85n33K19J3L37l09o8L09l1j46r4Q8k04N0K30O9r6l9J23O2
5157B12k05k27N29l97k4K13oj80m2J5K1J52P2j19j7M00l38p6K46k70J99m45K53
5180c4J53k20P5r1O1m5j35K56j69L42l84M15j1k64J36r3L4J61o41O40j7k41l8
5203a10n5L98k54O3J70j58k4O4l7Q9m04K20K23l06j91K49N7Lj47J63n7J32m39
5226c51L35J16j49j64L54M1j73R5q9J06q5j74M32r5j23j48J51K65l94J03j24J14
5248D3Q8Rl88M01k14M4K00j09p4l66K22K8p3j48M54K10k96j6q3K37Nk59R0O5m7
5273B3q4K18j18Jk32M37j54j72k68N78j80j45M7M6K39o03J92K32k3P5q3m6M3m84
5297d61K03L20R9P7l62K70k03M3k57K07N24m94J04k27K60M6n50M68l77R6L93j74
$$ plain form
5319 5 -136 -193 -10 148 -178 -86 -6 125 -60 313 -10 333 113 -264 -129 266 -7 -132 -6 123 -294 -212
5341 -212 305 209 155 -198 77 277 0 -120 -38 222 -56 -137 -86 84 14 -260 195 -22 76 -17 -105 177 -250
5364 -250 -210 234 323 -282 -278 -250 -183 -439 147 -79 -39 -339 -10 136 59 -153 -273 351 -151 16 -146 85 -158
5387 -158 -231 -231 166 289 -211 -82 -3 58 -82 35 130 80 11 150 201 356 -259 -190 65 -145 109 102 -24 278
5411 278 -229 -47 -53 40 -583 -87 -128 -71 34 -41 212 -55 -182 -247 72 -210 -96 -266 211 182 -142 191 276
5434 276 186 -259 -213 343 231 -45 51 387 84 -317 44 175 79 -415 -302 333 -141 -317 -146 283 -58
5455 -58 -75 -243 220 -71 -58 -203 29 -24 -58 -198 85 261 -317 102 307 -127 -173 175 368 145 -88 18
5477 18 83 -93 -202 -42 21 225 -108 234 115 243 -327 -87 63 -194 -18 248 234 -124 -331 -159 -119 -76
$$ packed form
5319Ej41n7J83J58l26R2Q0J31j85L73l23L43k20l77J35L95k73j25J26J29m17Q2
5341b12N17r6n4l53K75K00k77j20Q2K60k78q1N1J70p0k74M55k17R8r3q8K82m27
5364b50M0M44Q9o05MK8O7k56N86k26M0l00L29J46p7k12j20O24n02J67j62K31k43
5387a58p3%L97J23n00J29P9O1j40J17R5n0o9J39N1J55o15O9K55k10K54pj26L02
5411B78n07J82oR3o23M96m1N7J05p5K53k67j27o5L19k82J14j70M77k9l24L33Q5
5434B76r0m45M6N56j12k76R6L36l03m01L61J31r6m94J13O35m74j76J71M29l41
5455e8j7j68M63k91J3j45K32n3l4j40K83J76n78M19K05m34m6L48J93k23k33J06
5477A8O5j76j09J60O3K04l33L42j19J28n70K40J50k57J76K66j4l58k07J72M0M3
$$ plain form
5499 -76 -264 434 281 -6 -217 4 174 -377 -178 14 -32 -318 -201 422 102 -29 -252 -139 103 -140 -23
5520 -23 -36 168 -64 46 365 227 -22 0 140 407 172 -23 127 60 -170 -7 -126 41 -425 -196 104
5541 104 -26 -66 7 153 301 -370 40 53 189 148 -48 -66 12 -326 -122 84 -158 -141 15 127 -278 -138
5563 -138 139 152 88 -312 -311 87 103 -348 -1 55 -181 -299 -20 119 166 -191 -351 -139 -21 -81 106 32 -272
5586 -272 -386 129 -31 -387 -267 231 311 12 21 -181 292 10 -67 59 123 -27 -269 41 136 -171 -377 9
5608 9 260 -143 -212 4 182 -381 45 5 17 238 -236 -69 298 -125 -254 159 469 -129 -127 86 23 27 -287
5631 -287 383 161 -329 -352 -41 177 -213 -190 245 93 -18 -34 281 8 -214 -185 -36 203 186 -321 106 144
5653 144 -78 -4 -48 -14 -179 -196 49 -92 -43 -26 126 325 -227 -74 113 83 91 -5 575 29 -96 -179 471 179
$$ packed form
5499g6j88O98j53k87k11K21J70n51J99J92m6k86J17O23l20j31k23J13K42k43J17
5520b3j3K04k32J10L19j38k49K2J40K67k35j95J50o7k30J63j19J67m66K29L00
5541A04j30m0P3J46J48o71M10J3J36m1j96j8P8l38K04K06k42J7J56J12m05J40
5563a38K77J3o4m00JL98J6m51L47N6k36j18K79J39M7l57j60K12J18o0J87p4l04
5586b72j14N15j60l56J20M98Q0k99Rk02M73k82p7J26O4j50k42L10R5l07k06L86
5608IK51m03o9K16J78n63M26m0J2K21m74J67L67m23j29M13L10n98KK13o3Ml14
5631b87O70k22m90k3L11K18l90K3M35j52j11j6L15k73k22K9J49K39j7n07M27L8
5653A44k22P4m4L4j65j7K45j41M9J7J52J99n52J53J87l0Qr6N80n46j25q3O50k92
$$ plain form
5677 179 -19 -40 95 58 -181 80 126 327 284 -190 82 322 -44 362 113 -19 -270 367 33 142 -2
5698 -2 2 193 -229 -280 69 315 -80 -496 100 279 234 65 -123 232 -12 129 15 18 -315 -19 133 282 -378
5721 -378 -141 110 -239 54 78 -283 64 -155 102 -146 129 18 -210 -81 -73 -24 -124 -333 318 -60 3 329
5743 329 130 8 -282 -101 213 -54 -60 -124 82 -119 -314 299 84 -163 -189 101 445 208 83 56 102 10
5765 10 -66 207 403 97 -97 -61 132 60 -256 31 243 238 -153 156 -13 -137 -27 -112 189 -84 -156 -104 -8
5788 -8 -10 -187 351 13 -282 -258 20 110 -276 -34 263 170 -41 -93 -1 283 -210 -117 196 -25 -211 361 -143
5811 -143 365 92 35 509 195 -199 20 37 -10 -219 -250 -69 -79 139 -71 30 74 -271 -75 23 30 -115 -216
5834 -216 383 302 61 -125 18 48 -210 -214 296 0 142 1 -79 -44 -198 127 256 -261 -233 76 149 -8 -450
$$ packed form
5677A79j98k1J35l7k39K61M6K01m3m74K72K40l66M06k49j32k51O37l34J09j44
5698bMJ91m22n1L49K46l95m16N96J79m5j69j88L55k44J41j14Ll33K96J52J49o60
5721c78K37K51l49K93K4l61L47k19K57k48K75j11k28J29QM9j00k09O51l78O3L26
5743C29j99j22k90J81L14k67oo4K06k01j95O13k15k47k6K90L44k37j25k7M6r2
5765A0p6K73J96l06j94L6J93p2l16K87K12nl91L09j69j24J10q5L01k73p2N2R6
5788hkj77N38l38k95K4K78R0l86K42K97r3k11n2R2K84m93R3L13k21j86N72n04
5811a43N08k73n7M74l14l94K19J7m7k09l1J81j0K18k10J01M4l45J96R8Pj45j01
5834b16N99q1k41j86J43L0k58mN10k96J42j41q0L5j54L25J29n17K8L09P3j57m42
$$ plain form
5857 -450 -58 -13 51 -87 -88 250 -20 211 -4 149 303 -253 -90 42 64 -284 -144 -19 -90 -407 60 86
5879 86 57 -125 -115 175 56 -333 139 144 38 -361 -51 153 -195 -153 120 47 98 81 -120 112 -217 -299 -25
5902 -25 118 -148 -154 370 248 87 -73 -10 113 59 -235 -19 -31 -113 -158 212 157 -26 -106 325 7 -263 -299 -67
5926 -67 0 -34 -50 183 -62 -245 -70 280 78 -3 59 99 183 114 -388 301 19 -264 -42 8 159 -198 -73
5949 -73 224 208 84 -266 111 172 106 -278 -244 169 157 -358 -6 -75 -294 -50 429 338 -369 -22 395 130 -171
5972 -171 24 241 155 74 143 332 -108 -65 -53 -13 140 -286 -108 177 361 -57 191 30 0 -286 -69 -23 57
5995 57 -200 89 -144 78 -176 -109 86 100 -399 -11 413 -63 -378 195 79 -164 -116 -42 60 -325 -486 53
6017 53 -98 -233 44 -64 73 -76 -192 259 162 -21 -95 126 77 -539 -32 -230 204 69 -312 139 103 -213
$$ packed form
5857d50L92M5O4j38jL38k70K31k15J53J54n56J63J32K2l48J40J25p1l17M67K6
5879H6k9j82J0K90j19l89M72Nj06l99L10K04l48M2K73p3N1j7k01K32l29q2K74
5902b5J43k66oN24j22j61j60O3J23n4k94K16j2q2m5L70n5j83q0M31l18k70l6K32
5926f7O7l4j6K33k45j83J75L50k02q1O2M0Q4o9n02O89k82k83K22N0J51l57J25
5949g3K97j6j24l50L77O1o6l84L4M13j2n15L52o9k19K44M79r1p07L47M17k65l01
5972a71J95K17q6q1O9J89m40M3J2M0J53m26J78K85J84m18K48j61l0k86K17M6Q0
5995E7k57K89k33K22k54O7J95J4m99L88M24m76l15N73j16k43M8P4J02l85j61N39
6017E3j51j35K77j08J37j49j16M51r7j83p4K21m9o16N07j98M34j35l81M51l6l16
$$ plain form
6039 -213 -198 -396 467 -327 6 24 76 53 -148 238 20 -150 -327 13 154 -215 -161 251 226 -238 -286 25
6061 25 56 123 -154 -57 252 -437 -190 356 -118 -81 -182 191 80 -564 44 79 77 -279 88 87 -177 -238 -384 -11
6085 -11 -125 -293 13 39 168 -293 -237 -294 82 -308 -269 72 323 -185 -192 135 -110 -329 -346 305 123 -258 -256
6108 -256 249 -40 -125 -52 58 211 -121 90 26 -140 -190 34 87 -320 -211 -124 206 111 -263 -230 352 18 -112
6131 -112 -8 251 85 -126 -213 167 182 -172 -6 135 111 -176 -60 186 334 -160 123 287 67 -8 -215
6152 -215 152 16 -137 -40 35 160 -32 190 86 -83 -331 -107 247 -174 -78 -38 360 193 291 142 -216 -113
6174 -113 -71 25 222 -192 -260 -9 45 187 113 268 0 -116 -366 -16 27 -165 211 -3 279 -63 -15 -14 -20 134
6198 134 -244 16 126 70 -265 9 152 -16 -104 63 271 -94 93 309 -93 -289 -134 88 10 -37 -113 303
$$ packed form
6039b13J5j98Q63p94L33J8N2k3k01L86k18j70j77L40J41l69N4M12k5m64m8L11
6061B5L1O7k77R7L09o89K47N46m74L7j01L73j11o44O08L5kl56L67jk64o1j46L73
6085a1j14j68L06K6J29m61N6n7L76l90L9L41K51n08pL27k45k19j7O51j82l81K
6108b56N05k89q5P3J10J53l32K11o4j66n0K24N3m07J09Q7L30r5l74L3N82l34j30
6131a12J04K59j66k11q7L80J5l54J66J41k4k87J16K46J48m94K83J64k20p5k07
6152b15L67j36j53R7P5J25j92K22j04j69k48K24L54m21R6M0L98j67R8j49l58J03
6174a13M2R6J97m14o8K51N4J42p4J55k68j16k50L50M3j92L76k14K82l42M8JoJ54
6198A34l78K60J10n6l35K74J43j68q8J67K08l65J87K16m02j96J55K22p8m7p6M16
$$ plain form
6220 303 86 78 -299 240 -2 -183 -94 289 -195 -54 179 158 164 -302 -396 -92 326 -121 111 50 -122 108 233
6243 233 -120 -216 -169 -230 22 142 -66 -72 -12 15 2 106 66 124 -238 -84 93 123 34 -57 342 34 88 -62 210
6268 210 -65 -277 -214 132 124 -93 309 457 -165 -324 -51 -126 75 239 -20 209 49 -35 4 -37 9 -45 29
6291 29 71 -21 -112 -195 -159 122 -46 -7 245 -321 88 -87 -377 -109 -81 136 346 205 95 148 151 -109 -46 -125
6315 -125 -63 -217 -203 -170 224 -56 142 -38 -86 117 -237 122 357 -139 -169 45 179 203 -144 -38 133 -8
6337 -8 71 100 414 -38 3 -60 -363 4 3 31 196 72 -61 59 -83 -260 -161 216 12 120 164 -26 302 -275
6361 -275 117 31 -35 -257 243 256 78 -234 58 32 31 94 -18 126 -38 38 -229 -20 -135 -232 190 -175 -120
6384 -120 37 109 -64 -231 -12 -207 80 30 -86 70 -148 -64 -19 -125 352 40 -217 -21 271 192 -113 218
$$ packed form
6220C03k17ql77N39k42j81Q9L83m84J41K33k1Om66r4L04M18m47K32o1j72K30J25
6243B33l53r6M7o1K52J20k08oO0K7j3J04m0N8l62J54J77L0q9r1L99l08N4j50K72
6268B10k75k12O3L46qk17M02J48o22j59K73p5K01J64k59K29j60q4L9m1M6n4P4
6291B9M2r2r1q3L6K81j68L9K52n66M09j75k90K68K8K17K10j41j10N3Lk60O3p9
6315a25O2j54J4L3L94k80J98j80m8K03l54L59K35m96l0K14J34K4l47J06J71j41
6337hP9K9L14m52M1o3l03L67jK8J65j24j33J20j42j77R9L77k04J08M4j90L28n77
6361b75L92q6o6k22N00J3j78l12K92k6jO3j12J44j64P6k67K09j15r7M22l65N5
6384a20J57P2j73j67K19j95K87n0j16J56k18Q4M5j06M77l12k57J96K92p9l05L31
$$ plain form
6406 218 445 -121 127 22 -96 183 -254 147 199 -156 54 -25 98 -69 192 -100 367 151 -218 -30 100
6427 100 78 -44 -9 34 276 -30 -106 244 199 -87 -152 -98 64 -321 62 82 -380 -42 -200 -51 -103 3 -60
6450 -60 201 -270 -237 90 312 18 -218 -79 187 75 -65 -46 170 358 166 190 -245 -95 -306 -180 53
6471 53 475 88 -303 154 89 96 194 55 -228 -176 -28 169 74 148 170 84 -322 -396 -273 8 -131 5 30 14
6495 14 -13 250 -32 -36 46 68 -212 135 -156 214 -38 -52 -261 -163 -72 99 -438 -211 8 -82 166 74 -45 89
6519 89 -265 74 69 -106 73 -60 -106 106 2 -184 -101 174 -158 -8 172 73 132 142 292 1 22 75 -43
6542 -43 -229 -355 161 94 112 -310 29 189 251 -309 108 108 285 73 215 218 -21 -174 -64 254 110 -80 -87
6565 -87 27 125 -171 178 -42 -394 257 59 -184 11 -48 178 168 -131 125 -63 226 -227 -41 -81 66 199
$$ packed form
6406B18K27n66K48j05j18K79m37M01N2l55K10p9J23j67K61k92M67k16l69J88J30
6427A00k2j22L5M3K42l06p6L50m5k86o5N4J62l85L83K0m62L38j58J49n2J06o3
6450f0K61m71L3L27K22k94k36J39K66j12j40J9K16J88j92K4m35J50k11J26K33
6471E3M22l87l91M57o5PR8j39k83N2J48J97r5P4K2q6m06p4J23K81j39J36K5j6
6495A4k7K63k82mQ2K2k80L47k91L70k52j4k09R8R1J71n37K27K19r0K48r2j19J34
6519H9l54L39nj75J79j33m6K12j04j86Q3K75l32J50J80r9N9J0J50k91K1N3j18
6542d3j86j26N16o7J8m22L39J60O2n60M17%J77k12J42Lk39j53J10L18j44j90p
6565h7J14R8k96L49k20l52O51j98k43J95n9K26j0k99K56j88K89m53J86m0J47J33
$$ plain form
6587 199 236 -242 -27 -91 -219 81 -452 -87 -171 164 50 -70 8 306 227 197 34 263 -124 -16 -250 -192
6609 -192 174 -61 -176 -25 45 -95 -13 210 441 -104 -108 14 327 -190 113 149 -74 -169 -238 23 -17 -89 -170
6632 -170 306 82 113 -236 334 62 0 150 -296 131 -208 -10 -55 152 -90 163 177 30 -250 -216 54 -245
6654 -245 72 235 38 321 79 -23 223 -37 -20 -211 -50 -155 122 -21 250 -136 48 -92 159 -71
6674 -71 147 49 147 156 -206 -60 -4 85 -217 -82 -92 -279 84 -98 127 220 -435 -23 22 -4 -186 -150 145 216
6698 216 4 101 42 224 115 93 -13 -59 97 -23 273 -92 81 -45 122 -354 -123 170 -87 6 -166 199
6720 199 -127 119 -31 -65 114 -196 -30 -138 155 -189 -91 81 22 -267 -341 -347 -53 -181 -55 295 239 -85
6742 -85 -306 -151 39 76 21 198 -79 79 -462 -140 137 -243 -47 -51 182 260 -163 341 -57 -57 29 182 189 -112
$$ packed form
6587A99L7m78K15o4j28L00n33L65q4L35j14j20P8K98p9l0j63K29l87J08k34N8
6609a92L66k35j15J51P0j40Q2K23K31n45mJ22L13n17L03L6k23r5o9K61m0p2q1
6632a70M76k24L1l49N70k72o2J50m46M27l39J98m5K07k42K53J4j47k80L4K70k99
6654b45L17J63j97K83k42j02K46k60J7j91J61j05K77j43K71l86J84j40K51k30
6674g1K18r8R8Rl62J46N6Q9l02J35j0j87L63j82K25R3o55M12M5k6j82L6K95P1
6698B16k12R7n9J82j09k2j06m6J56j20K96l65J73j26J67m76K31K93k57R3j72L65
6720A99l26K46j50l4J79l10J66j08K93l44R8J72n9k89p4oK94j28J26L50n6l24
6742h5k21J55J90L7n5J77k77J58n41L22K77l80J96mK33P8m23N04l98%Q6J53Pl01
$$ plain form
6766 -112 -130 32 44 -204 147 158 111 82 246 196 243 116 -217 -30 -482 161 -242 270 66 -216 -37 -35 -59
6789 -59 -52 -56 47 43 -175 -55 26 161 -303 300 -9 182 176 -181 -182 121 -76 -149 -119 -130 -139 44 69 247 -15 -53
6815 -53 266 -336 -10 52 79 133 -269 -203 130 -46 -215 -334 71 126 -56 0 -221 67 -84 -141 145 320 -82
6838 -82 24 -118 -24 -45 105 206 -99 89 17 -31 -191 -75 34 72 10 285 -67 123 -150 -55 71 69 -300
6861 -300 -353 129 156 -71 38 -73 -167 42 146 176 -109 28 -172 207 -265 -200 -181 29 226 -39 105 -318
6883 -318 383 -109 -54 -57 188 124 96 -113 133 -128 25 141 -37 24 239 -67 175 113 -142 39 3 -265 91
6906 91 164 246 9 -58 139 268 261 -302 -184 217 -375 4 153 -368 -190 21 106 155 127 32 -8 -121 -188 192
6930 192 -227 -186 223 -29 -29 46 -19 -84 85 -154 -126 -328 -308 17 -14 121 43 30 -43 -73 -112 198 5 175 251
$$ packed form
6766a12j8J62J2k48L51J1m7k9J64n0M7j27l33J87m52O43m03N12k04k82J79Kk4
6789e9PmJ03mk18J20Q1J35m64O03l09J91ol57jL03j97p3L0j1rJ83K5J78k62l8
6815e3L19o02L26O2K7N4m02O6L33j76j69j19M05N5j82N6k21K88j51n7K86J75m02
6838h2J06j42R4k1J50J01l05J88p2m8j60J16J09L8o2K75l52J90k73R5J26kl69
6861c00n3M82K7k27J09j11r4K09J04L0k85J37k00L79m72O5J9K10J97k65J44m23
6883c18P01m92N5lK45o4k8k09K46k61J53J16j78O1K15l06K42o2k55J81l6k68L56
6906I1P3Q2k37o7J97J29pn63J18M01n92L79J49n21J78K11Q5M9k8r5m0j13o7L80
6930A92m19M1M09k52%P5o5o5J69k39K8k02K0L25l1J35p8j3p3l0l9L10j93J70P6
$$ plain form
6955 251 130 -243 -125 62 -195 -14 -81 58 -174 13 -231 211 -194 -124 243 316 -302 109 57 156 349 105
6977 105 -37 150 -27 -117 0 45 -110 -310 -286 127 370 22 34 -101 48 -54 157 -86 -109 -156 -81 -129 116
7000 116 -214 -57 -422 -32 -104 -70 140 -111 -72 -162 397 173 79 195 -271 24 -71 99 143 182 -98 -2 -119
7023 -119 96 -130 -11 -156 206 105 -92 -117 -215 184 -41 126 -268 -142 -31 84 22 66 -120 -1 -172
7044 -172 169 -20 -284 24 -37 57 349 -367 112 -62 173 353 90 -23 -217 -34 132 93 61 -83 -247
7065 -247 173 200 -194 82 1 203 47 276 -378 241 -11 88 72 -106 -149 -48 49 -171 -66 45 122 -152
7087 -152 9 -117 152 -295 -96 -4 149 -250 257 -154 107 18 6 88 -180 -166 -343 -155 147 106 -66 -113
7109 -113 -52 177 7 -146 -138 -194 -42 80 147 77 -94 -71 -126 10 0 9 -105 19 -98 -123 -51 51 -83 -7 -226
$$ packed form
6955B51j21l73J18J87k57J81o7J39k32J87k44M42m05P0L67P3o18M11n2R9J93k44
6977A05j42J87j77r0J17M5j55k00K4M13K43l48J2j35J49j02K11k43k3m7P5m8K45
7000A16l30J57l65L90p2L4K10k51L9r0N59k24r4J16m66K95r5J70M4L9k80R6j17
7023a19K15k26J19j45L62j01j97k5r8L99k25J67l94J26J11J15o2M4j86J19j71
7044a72L41j89k64L08o1R4K92p16M79j74K35J80k63j13j94J83J66l9l2j44j64
7065b47M20K7l94K76q1K02j56K29o54O19k52R9j6j78m3J01R7k20J05J11P7k74
7087a52J61j26K69m47J99R2J53l99N07m11K61q9j2Q2k68J4j77J88L02m1j72m7
7109a13O1K29j70j53Qn6J52J22O7p0j71K3n5J36j0Rj14J24j17k5P2J02j34P6k19
$$ plain form
7134 -226 111 -48 353 -280 127 -48 231 77 -140 101 94 -156 -169 -344 40 42 172 -88 67 53 114 -13
7156 -13 -38 4 -21 -13 -88 277 189 45 -56 26 -119 -111 99 111 31 287 -101 -291 -84 64 -156 -68 97 -128 -206
7181 -206 168 148 235 161 44 -109 -92 165 -287 231 456 285 -66 267 -146 7 -162 -191 -204 -117 3 -263
7203 -263 36 -102 -126 -92 -83 -122 90 -67 143 6 98 -307 -144 266 22 278 96 -25 -13 -90 -35 -233 148
7226 148 -217 -191 -141 -59 24 100 -78 -77 -216 150 32 -15 257 -16 -36 -200 -24 -295 116 6 4 -176 206 -21
7250 -21 -265 267 -23 366 -133 43 87 121 -25 -90 -164 155 -2 143 115 67 95 -16 -95 -208 -19 299 -109
7273 -109 137 -7 46 235 -171 74 133 21 -134 161 245 274 64 289 -11 -31 -158 287 -210 94 -34 180
7295 180 45 211 -94 -64 -103 45 -50 -265 393 57 -53 -178 52 138 -63 -208 -30 -113 55 -18 12 106 -101
$$ packed form
7134b26L37j59M01o33M07j75K79j54k17K41pk50j3j75L84KJ30k60J55j4O1j27
7156a3k5M2k5Qp5L65q8j44j01Q2j45QK10J2q0K56l88j90K07J48k20Q8J65k25p8
7181b06L74k0Q7p4j17j53J7K57m52N18K25j71l51L33m13J53j69k9j3Q7J20k66
7203b63K99j38k4L4Rl9K12j57K10j37R2m05J63M10k44K56j82j21J2p7N5j98L81
7226A48l65K6N0Q2Q3P6j78Jj39L66j18m7K72k73k0j64J76k71M11j10kj80L82k27
7250b1k44N32k90L89m99J76M4L4j46o5p4L19j57J45k8m8K8j11p9j13J89L18m08
7273a09K46j44N3J89m06K45N9j12j55K95Q4K9k10K25l00k0j27M45m97L04j28K14
7295A80j35J66l05L0l9J48r5k15O58l36j10j25K30Q6k01j45J78q3J68p3L0R4k07
$$ plain form
7318 -101 68 215 -29 -180 44 -184 -97 114 -84 -137 -19 -45 -300 14 106 -273 -185 -30 -148 -221 0 -228
7340 -228 -80 -53 -38 -3 -87 -28 -116 -44 151 -311 3 30 -376 -170 -139 69 -31 121 -74 61 -36 -46 203 176
7364 176 13 73 -177 71 -177 41 197 291 302 -102 -75 -90 -43 -121 332 -20 -162 -81 11 85 -79 208 -88
7387 -88 150 99 186 275 -168 -421 177 24 261 137 252 -33 -26 255 -127 362 -36 -372 -55 19 34 80 -97
7410 -97 -230 -141 -122 -141 123 -39 -70 -306 43 -195 -173 -66 179 -195 -287 58 -198 159 -21 -37 129 -94 134
7433 134 -81 167 130 78 -241 143 249 -167 113 -83 -131 -103 29 213 193 0 -133 110 21 -344 -201 117
7455 117 31 -164 -229 -137 30 59 191 -101 40 -248 -127 358 92 -56 -212 182 -62 -56 1 48 -1 -168 225
7478 225 144 91 -194 -225 -200 74 282 -60 -74 -203 -338 -48 -60 -108 -156 -162 146 90 -158 3 124 153 356 -337
$$ packed form
7318a01J69J47k44j51K24k28Q7K11j98n3J18k6k55L14R2l79Q8J55j18p3K21k28
7340b28J48K7J5L5q4N9q8P2J95m62L14K7m06K06L1K08j00J52j95J35r7j0K49k7
7364A76j63O0k50K48k48K18J56R4J1m04K7j5M7p8M53l52j42Q1R2P4j64K87k96
7387h8K38n1Q7Q9m43k53N98j53K37j24J15k85PK81l82M89l98l36L17P4J5M6j77
7410i7j33Q9J9j9K64j62l1k36L49k38K2J07K45l74r2L45k56L57j80j6J66k23K28
7433A34k15K48l7n2l19L84J06m16K80j96m8K8J32J84k0j93j33K43q9l65J43L18
7455A17q6j95o5R2J67K9J32k92J41k88J21M85k66j48j56L94k44ON7M7m9j67L93
7478B25q1n3k85l1K5K74K08l42j4j29j35K90j2m8m8oL08n6k48J61J21K9K03o93
$$ plain form
7502 -337 354 -119 -312 235 117 -289 179 103 126 -285 -182 -25 86 39 88 114 -2 -111 -109 345 60 -87
7524 -87 98 -212 61 30 1 35 52 63 62 52 295 229 -142 97 -205 43 -269 -41 -9 -33 60 -119 39 -241
7548 -241 102 -50 -417 8 -17 52 -49 57 -55 202 107 -9 -211 -82 47 -67 159 146 159 318 306 218
7570 218 -77 7 -343 -88 112 118 235 14 -123 -67 -71 -63 -140 74 -71 4 -87 -123 51 -198 158 212 -73 -31 403
7595 403 -194 -2 -17 195 -258 -3 262 -38 -245 83 302 -97 -156 116 -119 411 1 -78 -77 -20 -205 -29
7617 -29 2 -135 -151 99 135 -181 31 -211 -90 -3 13 160 -81 143 -153 -21 -7 -109 265 -73 -118 10 -22
7640 -22 -76 106 -169 16 105 14 152 122 -206 -22 99 -136 32 54 58 -65 -18 264 124 -198 136 90 62 195
7664 195 66 -48 97 -29 -107 205 296 -217 -86 128 76 88 -47 62 -290 276 -334 -257 -65 -97 -51 351
$$ packed form
7502c37O91m73j93N47j18m06M68p6K3m11J03J57J11m7M9K6j16j09KM54k85j47
7524h7J85l10K73l1k9L4J7J1jj0K43o6l71K39l02K48l12K28L2k4R3j79J58k80
7548b41L43j52l67M25k5O9j01J06j12K57r5j16k02J29J29j14K26j3J3J59j2q8
7570B18k95Q4l50K55K00OJ17k21j37N6mQp7K14j45P5r1l6J74k49L56N4k85M2M34
7595D03n97J92j5K12m53K55K65l00k07L28K19l99n9K72k35N30m10p9JN7j85J76
7617b9L1j37j6K50L6l16K12k42J21Q7J6J47k41K24k96J32J4j02L74l38m5J28l2
7640b2n4J82k75J85Q9r1J38l0l28J84J21k35J68K2Mj23M7K82j40l22L34m6k8J33
7664A95j29j14J45j26p8L12R1n13J31K14n2J2j35J09l52N66o10P7J92l2M6M02
$$ plain form
7686 351 -54 -306 94 -111 31 230 205 371 95 -121 -17 142 -60 111 -2 54 -74 -47 270 212 -45
7707 -45 55 214 -31 -54 -59 -80 101 199 -128 115 195 -202 105 24 -172 98 -233 -58 -155 -68 -52 265 213 133
7731 133 135 -104 35 -193 180 273 173 76 -134 193 43 -175 -40 94 -52 185 81 104 186 58 -203 80
7753 80 172 1 -229 17 9 4 -94 94 -36 -37 -22 94 -29 231 -214 -312 113 -208 -91 -29 301 212 -105 147
7777 147 -44 -88 182 179 -170 -85 -20 26 251 -51 64 -186 -80 -62 168 296 188 -54 -104 18 -122 -274 -28
7800 -28 -45 -68 38 -121 -71 -22 100 -143 137 -57 -201 -31 -7 32 -120 198 111 32 -59 -51 27 0 233 345 41
7825 41 20 128 -35 188 -32 -430 -326 154 26 228 -46 -18 -264 16 289 -142 332 -298 -28 -167 -41
7846 -41 137 -162 -171 219 -20 29 74 99 -273 -169 37 -100 10 137 -115 -266 -105 -97 131 -298 -203 -322 -61
$$ packed form
7686C51m05k52M00k05J42J99k5J66k76k16J04J59k02J71j13N6j28K7L17n8k57
7707d5J00J59k45k3nk1J81R8l27K43Q0l97L07q1j96K70l31J75r7Q7J6L17n2q0
7731A33Kk39J39k28L73R3j00r7k10L27j50k18J35J34j46K37j04K3Q2j28k61K83
7753H0R2j71k30K46qnr8J88j30jJ5J16j23K60m45r8M25l21J17O2L30q9l17K52
7777A47j91m4K70ll49Q5O5M6K25l02J15k50J06J8K30J28j08k42n0J22j40j52K46
7800b8j7k3J06j59N0M9J22k43K80j94j44J70K4L9j52L18q7p9r1QP8k7K33J12l04
7825D1k1J08j63K23k20l98J04M80j28K02k74K8k46K80K73m31M74o30K70j39J26
7846d1J78k99rL90k39M9M5K5l72J04K06j37J10J27k52j51J61QK28m29R5j19K61
$$ plain form
7869 -61 81 101 -20 -21 -214 -44 -118 -149 121 -54 -200 -70 -225 -72 64 53 90 226 129 110 -195 20 93 191
7893 191 -361 -45 173 -242 263 100 -143 154 -61 117 -210 -327 288 -124 183 84 -118 -7 39 -119 161
7914 161 38 57 211 89 28 184 127 -63 -5 37 -9 -14 -76 -77 -120 -27 68 167 42 40 -269 391 -219 -240 312 -61
7940 -61 272 271 -44 263 195 217 22 239 24 -73 122 56 -177 172 117 201 -56 72 -178 -182 106 185 9 53
7964 53 211 -160 -8 -72 -9 104 71 206 -47 -211 34 192 -30 -262 160 -181 -134 -274 254 -22 -213 -53
7986 -53 2 348 -117 -132 112 -164 136 -8 -28 10 -76 -128 27 106 -170 25 339 28 195 -51 127 -6 104
8009 104 56 -105 247 16 20 -181 99 -23 24 10 18 -12 -84 42 -1 73 -73 163 -78 -417 -82 240 -119 -28
8033 -28 61 -7 -56 11 77 201 229 24 6 -1 37 40 51 136 350 -15 -152 -99 289 -114 31 77 -136 -3 -27 162
$$ packed form
7869f1J42K0j21jj93J70p4l1K70j75j46J30j55J53J36j1L7J36r7j9l05K15P3R8
7893A91n52L16K18m15N05j63k43K97k15J78l27j17O15m12L07r9k02J11M6j58K80
7914A61j23J9J54j22o1J56n7j90N8M2m6no2jm3R3R5R9j25kl09O60o10k1N52l73
7940f1L33jl15L07o8K2j95K17k15r7J95o6k33L49n5Q4k57J28k50mK88P9j76M4
7964E3J58l71J52o4O3J13l3J35k53j64K45J58k22k32M22l41M7j40N28k76j91J60
7986e3N5L46m65j5K44k76L00j44k0L8q6n2J55P9k76J95L14l11J67k46J78j33J10
8009A04m8j61L52k31Mk01K80j22M7j4Ql0p2J26m3P4j46K36k41l39L35L22l59R1
8033b8Q9o8m9O7O6J24K8k05j8pL8LJ1Q5K14l65j37N3L88m03J45M6k13J33k4J89
$$ plain form
8059 162 -21 10 0 -100 187 -74 259 -105 104 115 123 -13 -66 -185 -168 157 -110 -17 162 258 -72 -135 -5
8082 -5 95 -10 -99 -4 -22 -119 49 -194 -99 -67 -287 -171 -59 80 -83 326 -74 -138 -157 159 355 171 -137
8105 -137 147 53 87 433 215 -14 -41 24 41 -12 4 167 5 449 245 9 -167 89 -59 -33 111 -118 140
8128 140 -118 92 95 111 -221 231 183 81 252 -261 -41 150 229 107 -106 184 50 78 204 -96 118 44
8150 44 -41 203 177 32 141 -41 -213 34 155 -3 -97 -119 -259 -104 18 162 -150 217 75 88 -238 -192
8172 -192 161 -114 14 -197 155 -52 140 -5 -186 178 30 -97 82 -76 -93 32 57 -66 36
$$ packed form
8059A62j83L1j0j00K87k61L33l64K09J1Qj36n3j19J7L25k67R3J79R6l30o3J30
8082eJ00j05q9R5j8r7J68k43R5L2k20J16J12J39j63M09m00o4j9L16J96j84l08
8105a37K84r4L4L46k18k29k7O5J7n3J6J63j62M44k04k36j76K56j48K6J44k29K58
8128A40k58K10LJ6l32M52m8j02J71n13K20J91P9j22k13K90j34K8J26l00K14p4
8150D4q5K44k6j45J09j82j72K47J21j58r4k2j40J55J22J44l12L67j42J3l26M6
8172a92L53k75J28k11L52k07J92j45j81L64j48j27J79j58j7J25K5j23J02
8191C6
$$ Imaginary data points
##PAGE= N=2
##DATA TABLE= (X++(I..I)), XYDATA
$$ plain form
0 0 0 0 0 8 -8 0 -8 8 -16 15 -16 24 -32 32 -40 56 -64 72 -83 104 -120 135 -157 186 -211 236 -269 313 -353
29 -353 393 -441 498 -557 619 -690 772 -856 946 -1047 1165 -1290 1422 -1577 1751 -1940
45 -1940 2150 -2392 2674 -2999 3371 -3822 4373 -5059 5936 -7112 8777 -11298 15536 -24001
59 -24001 47237 -236190 -714399 127484 488572 -211540 -452697 380001 603244 -272246
69 -272246 -615318 156607 421325 -288711 -437213 386492 564846 -266844 -520046 207360
79 207360 369238 -343291 -421622 387902 518642 -270127 -439533 262594 340445 -380183
89 -380183 -408556 385157 470765 -282446 -374699 314396 320730 -404118 -388454 382598 414938
100 414938 -304475 -318295 357091 296071 -418678 -354169 379720 348464 -331080 -266229 386805
$$ packed form
0@%%%Qj6QqJ6k4L1l1M0n6O4p2R6j20J36j55J87k24K55k92L43l97M47n05N82o66
29c53P46q34R39j055J176j309J462j628J802j993K212k455K712k999L328l691
45a940M090m542N066n673O370p193Q195r432J0995j3048J5889k0075K6834l9537
59b4001P1238k83427m78209Q41883L61088p00112k41157Q32698K23243q75490
69b72246l43072P71925K64718p10036j48502Q23705J78354q31690k53202P27406
79B07360J61878p12529p8331Q09524J30740p88769j69406P02127P7851p20628
89c80183k8373P93713Q5608p53211r2253O89095O334p24848J5664P71052L2340
100D14938p19413j3820O75386o1020p14749O4509P33889l1256o79544O4851O53034
$$ plain form
111 386805 263064 -425152 -309696 376965 280679 -356325 -219994 405228 227473 -426156
121 -426156 -263038 377148 221502 -377143 -181709 416227 195143 -422497 -216894 380731
131 380731 173036 -392430 -148358 423130 164765 -416558 -170564 386236 130121 -401335
141 -401335 -112962 425082 130042 -407645 -120837 390106 88302 -402538 -75319 418740
151 418740 90388 -394793 -71272 386270 46740 -395498 -38814 403426 49268 -379341
161 -379341 -28031 375392 9351 -384123 -7952 383113 11438 -363974 7317 361688
171 361688 -23218 -370849 19025 362485 -23340 -350834 38435 348042 -52381 -357107
181 -357107 46318 344386 -56340 -338031 67619 335723 -79043 -341130 75251 328015
$$ packed form
111C86805j23741o88216J15456O86661r6286o37004J36331O25222j77755o53629
121d26156J63118O40186j55646n98645J95434N97936k21084o17640K05603N97625
131C80731k07695n65466K44072N71488k58365n81323K45994N56800k56115n31456
141d01335K88373N38044k95040n37687K86808N10943l01804m90840L27219M94059
151D18740l28352m85181L23521M57542l39530m42238L56684M42240l54158m28609
161c79341L51310M03423l66041l93474L76171L91065l71675l75412L71291L54371
171C61688l84906l47631L89874L43460l85825l27494L89269L09607m00423l04726
181c57107M03425K98068m00726k81691M05650K68104m14766k62087M16381K52764
$$ plain form
191 328015 -86574 -322491 97724 321837 -104190 -320479 104769 310294 -113690 -302702
201 -302702 125694 303844 -127304 -297102 132516 289771 -138136 -281350 149984 282991
211 282991 -148063 -272806 155430 267471 -159078 -259573 168230 259770 -166908 -249805
221 -249805 172438 243747 -177403 -238108 182051 234201 -183039 -226433 186019 217825 -193051
232 -193051 -214952 193542 206712 -197423 -201173 197541 190814 -205029 -189308 203361 179117
243 179117 -207481 -174915 207705 165249 -212811 -162565 211217 154246 -213751 -147804 215447
254 215447 141888 -217162 -136402 218226 130759 -218109 -122397 221679 119354 -220212 -111561
265 -111561 223185 108095 -221526 -98965 225755 96856 -223397 -89145 225461 85538
$$ packed form
191C28015m14589k35917M20215K24113m26027k16289M25248K05525m23984j89012
201c02702M28396J78150m31148j69798M29618J57255m27907j43214M31334J33007
211B82991m31054j24743M28236J12041m26549j00495M27803R1540m26678q2897
221b49805M22243P1309m21150o0705M20159N2150m17240m3394M12452L1806m10876
232a93051k1901M08494J3170m04135l750L98714o727l95843J5721L92669k4244
243A79117l86598L2566L82620m2456l78060N0246L73782n6971l67997O5947L63251
254B15447p3559l59050Q0760L54628q7467l48868R5712L44076j02325l39566J08651
265a11561L34746j15090l29621J22561L24720j28899l20253J34252L14606j39923
$$ plain form
275 85538 -224251 -78047 226818 74787 -225127 -68569 225778 63043 -225857 -57524
285 -57524 225599 51924 -225734 -47960 223768 40334 -225389 -37536 222441 29663
295 29663 -223583 -27174 220185 19099 -221758 -16659 217366 9297 -218242 -6515
305 -6515 214715 183 -214052 3230 211529 -8345 -209457 12697 207209 -16849
315 -16849 -204024 21743 202851 -24660 -198814 30579 198178 -32259 -193242 38657
325 38657 192901 -40142 -188007 46518 187241 -48275 -182566 53906 181833 -56116
335 -56116 -177494 61167 175960 -64081 -173080 67724 170105 -71503 -167925 73737
345 73737 163919 -78718 -162488 80185 157876 -85203 -156811 85921 151654 -90860 -150744
$$ packed form
275H5538l09789J46204L04865j52031k99914J56558K94347j62735k88900J68333
285e7524K83123j73675k77658J77774K71728j83434k65723J87853K59977j92778
295B9663k53246J96409K47359k01086k40857K05099K34025k08069k27539K11727
305f515K21230k14532k14235K17282K08299k19874k01112K22154J94512k24058
315a6849j87175K25767J81108k27511j74154K29393J67599k30437j60983K31899
325C8657J54244k33043j47865K34525J40723k35516j34291K36472J27927k37949
335e6116j21378K38661J14793k40041j08999K40804J02381k41608r6422K41662
345G3737R0182k42637q3770K42673P7691k43079p1608K42732O5733k42514n9884
$$ plain form
356 -150744 91683 145684 -96169 -144355 96943 139593 -100526 -137608 102289 133627 -104971
367 -104971 -130410 106989 127467 -109160 -123752 111434 121050 -111850 -116671 115091 114969 -115272
379 -115272 -110019 118215 108208 -117663 -102651 121125 100802 -120278 -95546 123003 93446
390 93446 -122288 -88246 124393 85474 -124382 -81089 125214 77512 -125752 -74082 125805
401 125805 69689 -127456 -67741 126374 62688 -128225 -60512 126760 55794 -128759 -54602
412 -54602 126891 48786 -128607 -47253 126940 43098 -128331 -40817 127590 37186 -128139
423 -128139 -34660 127633 31245 -127199 -28155 127912 25535 -126562 -21599 127639
433 127639 19971 -125753 -15145 126670 14252 -124788 -9619 125625 8495 -123573
$$ packed form
356a50744K42427N4001k41853m8186K41298M2650k40119l7082K39897L1338k38598
367a04971k5439K37399K0478k36627j4592K35186R616k32900m821K31762j22k30241
379a15272N253K28234j0007k25871J5012K23776k0323k21080K4732K18549k9557
390I3446k15734L4042K12639l8919k09856M3293K06303m7702k03264N1670J99887
401A25805n6116j97145N9715J94115o3686j90913O7713J87272p0966j84553P4157
412e4602J81493p8105j77393Q1354J74193q3842j71429Q7514J68407r0404j65325
423a28139R3479J62293r6388j58444R9044J56067j02377j52097J04963J49238
433A27639j07668j45724J10608J41815j12418j39040J15169J35244j17130j32068
$$ plain form
443 -123573 -4095 124204 2310 -122459 1384 122153 -3271 -120484 6585 120179
453 120179 -8894 -118731 11537 117224 -14631 -116566 16344 114200 -19566 -114122
463 -114122 20807 111062 -24522 -111085 25552 107670 -29548 -107545 30010 104549 -33371
474 -33371 -104054 34212 101348 -36576 -100255 38141 97862 -40101 -96194 42044 94547
485 94547 -43334 -91765 45738 91253 -46695 -88242 49558 87635 -49446 -84406 52570
496 52570 83922 -52592 -80945 55827 79954 -55539 -76926 58442 76185 -58807 -73611
507 -73611 60847 72205 -61743 -70027 62848 68173 -64395 -66410 65029 64439 -66330 -63066
519 -63066 66675 60014 -68602 -59014 68383 55687 -70575 -55284 70159 52211 -71616
$$ packed form
443a23573J19478J28299j21894j24769J23843J20769j25424j17213J27069J13594
453A20179j29073j09837J30268J05687j31855j01935J32910R7856j33766r4556
463a14122J34929R0255j35584q6563J36637Q2118j37218p7997J37555P4539j37920
474c3371p0683J38266O7136j37924o3679J38396N9721j37963n6093J38238N2503
485I4547j37881m8431J37503M5515j37948m1547J37800L8077j37081l4960J36976
496E2570L1352j36514k8353J36772K4127j35493k1387J35368J7743j34992j4804
507g3611J34458J1358j33948q284J32875N325j32568k015J31439n90j30769L264
519f3066J29741o661j28616R588J27397j2696j26262J5291J25443j7948j23827
$$ plain form
530 -71616 -51123 71368 48294 -72576 -46637 72688 44555 -73197 -42599 73832 40364
541 40364 -73864 -37889 74292 36569 -73454 -33819 74978 32501 -74262 -29775 74915
552 74915 28768 -73908 -25792 75265 24558 -73475 -21687 74493 20333 -73739 -17857 73833
564 73833 16414 -72966 -14048 73052 12496 -72930 -10992 72205 8575 -72335 -7667 71197
576 71197 4903 -71748 -4235 70163 1504 -70741 -940 69607 -1846 -69879 2502 69038
588 69038 -4841 -68794 5803 67676 -7697 -67702 9097 66662 -10817 -65968 12086 65613
600 65613 -13279 -64359 15256 64345 -15907 -62421 18324 62866 -18319 -60594 20743 60379
612 60379 -21123 -58964 23146 59010 -23642 -56713 25325 56337 -25987 -55070 27250 54180
$$ packed form
530g1616K0493J22491k3074j20870K5939J19325k8133j17752L0598J16431l3468
541D0364j14228L5975J12181l7723j10023L9635J08797m2477j06763M4487J04690
552G4915m6147j02676M8116J01057n0707r8033N1788R6180n4160r4072N5882R1690
564G3833n7419q9380N8918Q7100o0556q5426O1938Q3197o3630q0910O4668P8864
576G1197o6294p6651O7513P4398o8659p2245O9801P0547p1453o8033P2381O6536
588F9038p3879o3953P4597O1873p5373o0005P6799N7565p7479n5151P8054N3527
600F5613p8892n1080P9615M9089q0252m6514Q0745M4542q1185m2275Q1337L9636
612F0379q1502l7841Q2110L5864q2652l3071Q2038L1012q2324k9083Q2320K6930
$$ plain form
624 54180 -28357 -52964 28793 51798 -30154 -50658 30582 49198 -32042 -48610 32368 46539
636 46539 -33580 -46361 33028 44135 -34879 -43986 34769 42005 -36192 -41684 36128 39843 -36982
649 -36982 -38950 37545 37578 -38279 -36599 38808 35448 -39204 -34117 39816 33436 -39885 -31585 41140
663 41140 31017 -40716 -29152 41780 28757 -41644 -26834 42319 26601 -42483 -24832 43248
675 43248 23812 -43181 -22722 43424 21423 -43705 -20306 43336 18824 -44159 -18263 43706
687 43706 16575 -44038 -15867 43841 14377 -44504 -13659 43683 11901 -44264 -11453 43516
699 43516 9795 -43925 -9211 43352 7700 -43428 -7036 42972 5543 -42931 -4793 42941
711 42941 3694 -42003 -2697 42073 2182 -41428 -765 41105 524 -40513 881 40532
$$ packed form
624E4180q2537k4607Q1757K3005q1952k0504Q1240J8616q1240j6568Q0978J4171
636D6539q0119j2781P9389J1107p9014r107P8755P236p8197n492P7812L715p6825
649c6982j968P6495L3p5857J680P5407l360p4652N087P3933o380p3321Q300P2725
663D1140j0123p1733J1564P0932j3023p0401J4810O9153j5718o9084J7651O8080
675D3248j9436o6993K0459O6146k2001o5128K3399O3642k4512o2983K5896O1969
687D3706k7131o0613K8171N9708k9464n8881L0845N7342l1782n6165L2811N4969
699D3516l3721n3720L4714N2563l5652n1128L6392N0008l7429m8474L8138M7734
711D2941l9247m5697L9306M4770l9891m3610M0663M1870m0581m1037M1394L9651
$$ plain form
723 40532 -1576 -39621 2956 39548 -3432 -38820 4467 38916 -5112 -38160 6341 37888
735 37888 -6827 -37417 7484 36703 -8299 -36480 9160 35564 -10408 -35597 10676 34695
747 34695 -11885 -34692 12252 33560 -13684 -33668 13781 32438 -14775 -32520 15207 31707
759 31707 -16095 -31313 16637 30654 -16765 -29860 17596 29393 -18005 -28652 18845 28182
771 28182 -18959 -27023 19689 26947 -20003 -25530 20638 25254 -20369 -23972 21391 23875 -21196
784 -21196 -22968 22037 22583 -21987 -21422 22741 21142 -22844 -20122 22861 19468 -23273 -18926 23691
798 23691 17808 -23897 -17437 23694 16357 -24350 -16015 24157 14863 -24580 -14888 24379 13313
811 13313 -24948 -13100 24659 12018 -24996 -11817 24986 10819 -25419 -10017 25354 9319
$$ packed form
723D0532m2108l8045M2577L6592m2980l5388M3287L4449m4028l3048M4501L1547
735C7888m4715l0590M4901K9219m5002k8181M5640K6404m5972k5189M6273K4019
747C4695m6580k2807M6944K1308m7244j9984M7449J8657m7213j7745M7727J6500
759C1707m7802j5218M7950J4017m7419j3095M7456J1797m7398j0647M7497R337
771B8182m7141q064M6712P258m6950n527M6168M616m5623l603M5363K484m5071
784b1196j772M5005N46m4570N65M4163j599m3986K722M2983l393m2741M347M2617
798B3691n883m1705O460M1131p337m0707Q335M0172r294l9443R692L9267j1066
811A3313l8261J1848L7759j2641l7014J3179L6803j4167l6238J5402L5371j6035
$$ plain form
823 9319 -25069 -8860 25657 8160 -25128 -7093 25491 7093 -25127 -6008 25564 6140
835 6140 -25306 -4853 25735 4489 -25109 -3628 25235 3487 -24992 -2445 25055 1806
847 1806 -25007 -1245 24549 672 -24728 -56 24521 -700 -24190 1175 23915 -1883
859 -1883 -23618 2209 23095 -2777 -23261 2773 22640 -3755 -22538 3884 22098 -4832
871 -4832 -21869 4798 21016 -5651 -21201 5855 21108 -6285 -20419 6661 20400 -6865
883 -6865 -19973 7633 19841 -7431 -18834 8552 19000 -8530 -18482 9329 18571 -8842 -17713
896 -17713 9691 17809 -9927 -17005 10751 16881 -10959 -16350 11210 15702 -11574 -15549 11835
909 11835 15040 -12120 -14832 12173 14487 -12545 -14012 12493 13362 -13279 -13282 13267 12691 -13974
$$ packed form
823I319l4388J6209L4517j7497l3288J8035L2584j8398l2220J9119L1572j9424
835F140l1446K0453L0588k1246k9598K1481K8863k1748k8479K2547K7500k3249
847A806k6813K3762K5794k3877k5400K4672K4577k5221k3490K5365K2740k5798
859a883k1735K5827K0886k5872k0484K6034J9867k6395j8783K6422J8214k6930
871d832j7037K6667J6218k6667j5550K7056J5253k7393j4134K7080J3739k7265
883f865j3108K7606J2208k7272j1403K7386J0448k7530r952K7811R242k7413q871
896a7713K7404Q118k7736p078K7756O130k7840n391K7560M492k7276l975K7384
909A1835L205k7160k712K7005K314k7032j467K6505Q69k6641lK6549n76k6665
$$ plain form
923 -13974 -12688 13535 12024 -14308 -11915 14063 11271 -14502 -10786 14087 10139 -14662 -10104
936 -10104 14794 9497 -14635 -9010 15092 9124 -14749 -8208 15351 8054 -15135 -7518 15311
949 15311 7196 -14850 -6611 15445 6581 -15129 -5681 15668 5529 -15028 -5112 15158 4696
962 4696 -14913 -4238 15059 3742 -15265 -3548 14899 3289 -15249 -3084 14948 2334
974 2334 -15160 -2348 14926 1573 -15225 -1443 14943 1112 -14812 -936 14952 -56
986 -56 -14866 -31 14406 -378 -14267 553 14335 -1207 -14237 1259 14283 -1417 -14327
999 -14327 1849 14014 -2092 -13504 2478 13796 -2352 -13221 3449 13254 -2983 -12774
1011 -12774 3786 13052 -3919 -12753 4118 12575 -4087 -12303 4637 12064 -4970 -12079 4948
$$ packed form
923a3974J286K6223j511k6332K393K5978k792k5773L716K4873l948k4801M558
936a0104K4898n297k4132N625K4102n968k3873O541K3559p297k3189P617K2829
949A5311q115k2046Q239K2056q864k1710R448K1349j0139k0557R916K0270j0462
962D696j9609J0675J9297j1317j9007J1717J8447j1610j8538J2165J8032j2614
974B334j7494J2812J7274j3353j6798J3782J6386j3831j5924J3876J5888j5008
986e6j4810J4835J4437j4784j3889J4820J3782j5542j3030J5496J3024j5700j2910
999a4327J6176J2165j6106j1412J5982J1318j6148j0869J6670R805j6237r791
1011a2774J6560R266j6971q834J6871Q457j6662q216J6940P427j7034p109J7027
$$ plain form
1024 4948 11761 -5512 -11662 5441 11210 -5688 -11246 5927 10822 -6437 -10809 5983 10266
1037 10266 -6625 -10474 6021 9703 -6740 -10003 6789 9797 -6831 -9358 6918 8947 -7395
1050 -7395 -8847 7141 8728 -7220 -8350 7695 8063 -7532 -7783 7858 7994 -7789 -7548 8352
1064 8352 7309 -7987 -6964 8388 7223 -8044 -6485 8635 6358 -8439 -5920 8591 6002
1077 6002 -8861 -5616 8631 5508 -8814 -5241 8670 4884 -8873 -4923 8761 4199 -8898
1090 -8898 -4687 8897 4385 -9023 -3818 8638 3676 -9301 -3360 8711 3278 -8983 -3037
1103 -3037 8709 2807 -8918 -2595 8642 2264 -8721 -2297 8708 2165 -8611 -1833 8470
1116 8470 1553 -8422 -1369 8713 1530 -8597 -1255 8770 1018 -8260 -955 8700 662 -8378
$$ packed form
1024D948O813j7273o150J7103N769j6898n558J7173M895j7259m372J6792M283
1037A0266j6891l849J6495L682j6443l263J6792L008j6628k527J6276K029j6342
1050g395j452J5988J587j5948j130J6045L68j5595k51J5641J36j5783K41J5900
1064H352j043j5296J023J5352j165j5267J559J5120k277j4797K519J4511k589
1077F002j4863L245J4247l123j4322L573J3911l786j3757L950J3684m562j3097
1090h898M211J3584m512j3408N205J2456m962j2977N941J2071n433j2261N946
1103c037J1746n902j1725O323J1237o378j0985O424J1005o543j0776O778J0303
1116H470o917r975P053J0082p183j0127P342J0025p752r278P305R655q038r040
$$ plain form
1130 -8378 -495 8451 451 -8187 60 8200 -56 -8030 -302 7949 -290 -8003 558 7990 -784
1145 -784 -7928 877 7601 -1025 -7696 1251 7568 -1533 -7863 1432 7382 -1698 -7373 1522 7306
1160 7306 -2187 -7301 2057 7034 -2107 -6667 2570 6719 -2120 -6511 2803 6778 -2764 -6223 3176
1175 3176 6459 -2851 -6359 3090 5939 -2973 -5869 3266 6029 -3324 -5695 3401 5854 -3478 -5716
1190 -5716 3233 5668 -3807 -5558 3724 5100 -3477 -4992 3625 5016 -4144 -4568 4112 4970 -4089
1205 -4089 -4598 4102 4451 -4152 -4574 3957 3988 -4165 -4455 4044 4186 -4535 -3838 4700 3930 -4525 -3565
1222 -3565 4447 3378 -4583 -3539 4780 3298 -4756 -3291 4681 2930 -4618 -2603 4842 2803 -4949
1237 -4949 -2407 4820 2874 -4659 -2586 4889 2279 -5029 -2329 4711 2132 -5118 -1956 4930 1943
$$ packed form
1130h378P883Q946q000q638Q247Q140q256p974P728Q251q239p713Q561P432q774
1145g84p144Q805O724q626o671Q947O317r101o330R295N950r080n675Q895N784
1160G306r493n114R358M977r141m560R237M149q839m391R314L975r542l459R399
1175C176L283r310l508R449K849q912k896R135K763r353k371R096K453r332k238
1190e716Q949K435r475j751R282J376q577j515Q617J391r160m24Q680Q58r059
1205d089n09Q700L49q603m22Q531L1q153k90Q499J42q721O97Q538p70q455R60
1222c565Q012j069p961J044Q319j482q054J465P972j751p548K015P445k039p752
1237d949K542P227j946p533K073P475k610p308K700P040k579p250L162O886k987
$$ plain form
1252 1943 -5056 -1825 4763 1823 -4901 -1924 4798 1463 -4998 -1413 5184 1319 -4518 -1525 4966
1267 4966 1009 -4525 -757 4970 848 -4557 -1003 4645 829 -4747 -405 4472 630 -4558 -612
1282 -612 4916 839 -4566 -310 4710 395 -4601 93 4488 160 -4314 89 4692 -248 -4325
1297 -4325 558 4498 -455 -4442 226 4456 -865 -4178 656 4294 -586 -4056 641 4332 -683
1312 -683 -4181 1170 4326 -812 -3975 1048 3778 -1150 -3593 1326 3882 -1343 -4019 1558 3535
1327 3535 -1638 -3768 1516 3737 -1394 -3752 1461 3637 -1595 -3492 1510 3728 -1614 -3606 1907
1342 1907 3526 -1834 -3434 1803 3138 -2159 -3017 2038 3101 -2012 -2919 2036 3080 -2480 -3136 2382
1358 2382 2724 -2139 -2802 2456 2624 -2324 -3097 2142 2334 -2407 -2474 2559 2480 -2290 -2101 2571 2065 -2396
$$ packed form
1252A943o999L231O588k940o724K977O722l335o461L585O597l865n837K993O491
1267D966l957n534L768N727m122n405L554N648l816n576M342M877l842n188L946
1282f12N528m077n405M256N020m315m996M694M395m328m474M403M603m940m077
1297d325M883L940m953l987M668M230n321l313M834L638m880l470M697L691n015
1312f83l498N351L156n138l163N023K730m928k443M919K556n225k676N577J977
1327C535n173k130N284K221n131k358N213K176n232j897N002K218n342j992N513
1342A907J619n360j600N237J335n297q58N055J063n113r07M955J044n560o56N518
1358B382L42m863o63N258J68m948p73N239J92m741o7N033p9m770J89M672n06m461
$$ plain form
1376 -2396 -2084 2362 2210 -2779 -2281 2880 1846 -2826 -2214 2759 2092 -2836 -1865 3088 1915 -2897
1392 -2897 -1524 2748 1784 -2859 -1516 2825 1521 -2836 -1214 2905 1615 -2900 -1197 2969 1279
1407 1279 -3084 -1119 3155 1080 -2800 -849 3039 959 -2958 -729 2971 1047 -3265 -1125 2933
1422 2933 738 -3029 -510 2947 736 -3037 -674 2746 366 -3108 -814 2928 376 -2947 -260
1437 -260 2914 -39 -2972 -476 2920 -115 -2696 -413 3035 225 -3084 -91 3003 -81 -2850
1452 -2850 268 2856 -327 -2753 257 2758 -193 -2681 521 2858 -89 -2719 371 2577 -696
1467 -696 -2659 722 2743 -668 -2808 664 2998 -569 -2593 961 2466 -729 -2431 950 2413
1482 2413 -951 -2708 994 2434 -874 -2404 1088 2349 -1372 -2634 1137 2095 -1490 -2533 1139
$$ packed form
1376b396L12M446j52m989M98N161j034m672O12M973o67m928R71M953j173m812
1392b897J373M272r64m643J343M341j304m357J622M119j290m515J703M166j690
1407A279m363J965M274k075l880J951L888k080l917K229L700j924m312K140M058
1422B933k195l767K519L457k211l773K363L420k380l474K294L742k552l323K687
1437b60L174k953k933K496L396l035k581K283L448k810l309K993L094l084k769
1452b850L118K588l183k426L010K501k951k488L202K337k947k630L090K206l273
1467f96j963L381K021l411k140L472K334l567k024L554J505l195j702L381J463
1482B413l364j757L702J440l308j530L492J261l721j262L771R58l585j043L672
$$ plain form
1497 1139 2023 -1175 -2293 1231 2322 -1177 -2285 1235 2530 -1231 -1934 1354 2085 -1481 -2150 1579
1513 1579 2150 -1624 -2052 1543 2245 -1405 -1672 1700 1695 -1624 -1959 1813 1697 -1703 -1947 1783 1593 -2005
1531 -2005 -1817 1784 1746 -1685 -1368 1776 1428 -2137 -1429 1656 1325 -2128 -1419 2300 1266 -2523 -1332
1548 -1332 1986 1021 -2164 -1233 1877 953 -1835 -983 1955 874 -2127 -983 2252 944 -2259 -797
1564 -797 2339 811 -2175 -916 2224 871 -2314 -483 2095 677 -1820 -508 2351 458 -2404
1579 -2404 -491 2147 281 -2188 -218 2109 507 -2445 -351 1986 207 -2356 -149 2229 227
1594 227 -2034 -159 2290 -164 -2151 330 1832 -264 -2188 195 2257 -47 -1853 333 1841
1609 1841 -214 -2299 -229 1994 -277 -2104 300 2023 -541 -1941 515 2134 -297 -2080 518
$$ packed form
1497A139Q84l198j118L524J091l499j108L520J295l761p03L288P31l566o69L729
1513A579N71l774m28L595P02l650k67L372nl319l35L772j16l400k44L730j90l598
1531b005J88L601l8l431L17L144l48l565P08L085l31l453P09L719j034l789J191
1548a332L318r65l185R31L110r24k788Q52K938j081l001J144L235j308l203J462
1564g97L136j528k986J259L140j353l185J831K578j418k497J312K859j893k862
1579b404J913K638j866k469J970K327j602k952K094K337j779k563K207K378k002
1594B27k261J875K449k454j987K481J502k096j924K383K062k304j806K186J508
1609A841k055k085K070K223k271j827K404J723k564j400K456J619k431j783K598
$$ plain form
1624 518 1875 -630 -2068 879 1981 -498 -2105 673 1971 -650 -1595 718 1996 -816 -1730 1184
1640 1184 1636 -938 -1757 824 1753 -903 -1736 876 1538 -1176 -1652 1273 1771 -1311 -1601 1102 1816
1657 1816 -1188 -1698 1365 1538 -1272 -957 1124 1497 -1040 -1422 1343 1381 -1534 -1367 1229 1586 -1253
1674 -1253 -980 1265 1518 -1333 -1041 1561 1247 -1537 -1408 1408 1037 -1649 -1109 1704 1052 -1504 -1029
1691 -1029 1667 1031 -1543 -929 1469 940 -1488 -991 1498 614 -1624 -1135 1532 739 -1510 -908 1568
1708 1568 651 -1621 -360 1236 646 -1609 -682 1735 564 -1464 -938 1986 244 -1576 -336 1644
1724 1644 145 -1537 -391 1814 329 -1613 -143 1764 174 -1802 -602 1680 281 -1546 -74
1739 -74 1523 123 -1863 74 1763 65 -1805 207 1700 -283 -1760 273 1580 -41 -1563
$$ packed form
1624E18J357k505j438K947J102k479j607K778J298k621r45K313J278k812r14K914
1640A184M52k574q19K581R29k656q33K612O62k714m76K925M98l082k90K703P14
1657A816l004n10L063J73k810L15K081L73k537l82K765L8k915J67K596L57k839
1674a253K73K245K53k851K92K602l14k784J29K816l71k686N40K813o52k556M75
1691a029K696o36k574O14K398n29k428M97K489q84k238M89K667p93k249O02K476
1708A568r17k272J261J596n90k255R27K417j171k028N26K924j742j820J240J980
1724A644j499j682J146K205j485j942J470J907j590j976J200K282j399j827J472
1739g4J597j400j986J937J689j698j870K012J493j983j477K033J307j621j522
$$ plain form
1754 -1563 35 1831 -224 -1689 351 1448 -177 -1756 482 1352 -310 -1662 319 1650 -348
1769 -348 -1463 536 1356 -582 -1056 377 1304 -646 -1471 546 1358 -919 -1325 641 1179 -998 -1285
1786 -1285 920 1142 -787 -1239 632 1357 -839 -1247 791 1417 -983 -1157 1072 1162 -739 -896 856
1803 856 1030 -1119 -830 1158 954 -1362 -753 1172 1037 -970 -905 1423 1138 -1200 -859 1007 1131 -995
1821 -995 -808 1438 1009 -1116 -782 1153 665 -1243 -555 1412 931 -1642 -893 1420 282 -1431 -819
1838 -819 1517 700 -1350 -798 1348 811 -1244 -482 1141 382 -1119 -675 759 285 -1116 -360 1682
1855 1682 328 -1184 -145 1351 327 -1182 -436 1310 315 -1516 -14 1442 -43 -1294 -23
1870 -23 1351 300 -1632 -8 1544 178 -1187 37 1570 138 -1108 -1 1610 88 -1320
$$ packed form
1754a563J598J796k055j465K040J097j625j579K238Q70j662j352J981J331j998
1769c48j115J999Q20j938m74J433R27j950q25K017Q12k277m06J966N38k177k87
1786a285K205K22j929m52J871P25k196m08K038O26k400j74K229R0j901j57J752
1803H56J74k149K89J988k04k316O09J925j35k007O5K328k85k338L41J866J24k126
1821i95J87K246m29k125L34J935m88j908O88J967m81k573P49K313j138j713O12
1838h19K336q17k050N52K146n37k055P62J623p59j501M44J434m74j401P56K042
1855A682j354j512J039J496j024j509P46J746r95j831J502J456j485j251J271
1870b3J374j051j932J624J552j366j365J224J533j432j246J107J611j522j408
$$ plain form
1885 -1320 30 1535 126 -1471 545 1130 -427 -1359 -53 999 -8 -1403 32 1281 -4
1900 -4 -1066 16 1089 -201 -1307 236 1253 -274 -895 388 1245 -504 -1193 452 1236 -379 -1210
1917 -1210 565 1137 -538 -1110 467 1280 -447 -1001 442 1024 -634 -1042 528 1086 -578 -915 579
1934 579 879 -586 -749 509 708 -622 -792 893 851 -888 -989 620 603 -262 -1054 564 1012 -935
1952 -935 -509 905 728 -895 -434 1034 716 -742 -861 673 548 -730 -858 1096 698 -965 -421
$$ packed form
1885a320J350J505j409j597K016N85j557r32J306J052j007j395J435J249j285
1900dj062J082J073j290j106J543J017j527o21J283Q57j749o89J645P84j615q31
1917a210J775N72j675n72J577Q13j727n54J443N82j658m08J570N58j664l37J494
1934E79L00j465j63J258J99j330j70J685m2j739j01J609j7q65p92J618M48j947
1952i35M26J414j77j623M61J468l18j458j19J534j25j278j28J954l98j663N44
$$ [...]
8191b72
##END NTUPLES=NMR FID
##END=
