##TITLE=1H_IDB0811
 CDCl3, 8 sc, 
 11.11.2019
##JCAMPDX= 6.0         $$ Bruker NMR JCAMP-DX V2.0
##DATA TYPE= NMR FID
##DATA CLASS= NTUPLES
##ORIGIN= UXNMR, Bruker Analytische Messtechnik GmbH
##OWNER= root
$$ XWIN-NMR		Version 3.5
$$ Mon Nov 11 13:54:47 2019 Russian Standard Time (UT+4h)  she@DPX200
##.OBSERVE FREQUENCY= 200.1315
##.OBSERVE NUCLEUS= ^1H
##.DELAY= (6, 6)
##.ACQUISITION MODE= SIMULTANEOUS
##.ACQUISITION SCHEME= undefined
##.AVERAGES= 8
##.DIGITISER RES= 18
##SPECTROMETER/DATA SYSTEM= spect
##.PULSE SEQUENCE= zg30
##.SOLVENT NAME= CDCl3
##.SHIFT REFERENCE= (INTERNAL, CDCl3, 0, 15.7039)
##AUDIT TRAIL= $$ (NUMBER, WHEN, WHO, WHERE, WHAT)
$$ ##TITLE= Audit trail, XWIN-NMR		Version 3.5
$$ ##JCAMPDX= 5.01
$$ ##ORIGIN= Bruker BioSpin GmbH
$$ ##OWNER= she
$$ F:/spectra/data/she/nmr/H-F/1/audita.txt
$$ ##AUDIT TRAIL=  $$ (NUMBER, WHEN, WHO, WHERE, WHAT)
(   1,<2019-11-11 13:53:03.01 +0400>,<she>,<DPX200>,
      <created by zg, POWCHK disabled, PULCHK disabled
       configuration hash MD5:
       00 E9 B6 7A A2 85 ED C7 34 08 36 98 17 FE 4E 26
       data hash MD5: 16K
       3A FD 66 88 1A F8 D7 F6 52 7A C9 75 31 89 2E D3>)
$$ ##END=
$$ 
$$ hash MD5
$$ 0A 70 80 94 2F 86 DD 50 1F 97 5C A8 F1 64 53 4B
##$RELAX= 
##$RELAX= 
##$RELAX= 
##$RELAX= 
##$RELAX= 
##$RELAX= 
$$ Bruker specific parameters
$$ --------------------------
##$DU= <F:/spectra>
##$EXPNO= 1
##$NAME= <H-F>
##$PROCNO= 1
##$TYPE= <nmr>
##$USER= <she>
##$AMP= (0..31)
100 100 100 100 100 100 100 100 100 100 100 100 100 100 100 100 100 100 
100 100 100 100 100 100 100 100 100 100 100 100 100 100 
##$AQSEQ= 0
##$AQ_mod= 1
##$AUNM= <au_zg>
##$AUTOPOS= <>
##$BF1= 200.13
##$BF2= 200.13
##$BF3= 200.13
##$BF4= 200.13
##$BF5= 200.13
##$BF6= 200.13
##$BF7= 200.13
##$BF8= 200.13
##$BYTORDA= 1
##$CFDGTYP= 0
##$CFRGTYP= 5
##$CHEMSTR= <none>
##$CNST= (0..31)
1 1 145 1 1 1 1 1 1 1 1 1 1 1 1 1 1 1 1 1 1 1 1 1 1 1 1 1 1 1 1 1 
##$CPDPRG= <>
##$CPDPRG1= <>
##$CPDPRG2= <>
##$CPDPRG3= <>
##$CPDPRG4= <mlev>
##$CPDPRG5= <mlev>
##$CPDPRG6= <mlev>
##$CPDPRG7= <mlev>
##$CPDPRG8= <mlev>
##$CPDPRGB= <>
##$CPDPRGT= <>
##$D= (0..31)
0 1.2 0 0 0 0 0 0 0 0.06 0 0.03 0 0 0 0 0.0002 0 0 0 0 0 0 0 0 0 0 0 0 
0 0 0 
##$DATE= 1573465982
##$DBL= (0..7)
120 120 120 120 120 120 120 120 
##$DBP= (0..7)
150 150 150 150 150 150 150 150 
##$DBP07= 0
##$DBPNAM0= <>
##$DBPNAM1= <>
##$DBPNAM2= <>
##$DBPNAM3= <>
##$DBPNAM4= <>
##$DBPNAM5= <>
##$DBPNAM6= <>
##$DBPNAM7= <>
##$DBPOAL= (0..7)
0.5 0.5 0.5 0.5 0.5 0.5 0.5 0.5 
##$DBPOFFS= (0..7)
0 0 0 0 0 0 0 0 
##$DE= 6
##$DECBNUC= <off>
##$DECIM= 24
##$DECNUC= <off>
##$DECSTAT= 4
##$DIGMOD= 1
##$DIGTYP= 9
##$DL= (0..7)
0 120 120 120 120 120 120 120 
##$DP= (0..7)
150 150 150 150 150 150 150 150 
##$DP07= 0
##$DPNAME0= <>
##$DPNAME1= <>
##$DPNAME2= <>
##$DPNAME3= <>
##$DPNAME4= <>
##$DPNAME5= <>
##$DPNAME6= <>
##$DPNAME7= <>
##$DPOAL= (0..7)
0.5 0.5 0.5 0.5 0.5 0.5 0.5 0.5 
##$DPOFFS= (0..7)
0 0 0 0 0 0 0 0 
##$DQDMODE= 0
##$DR= 18
##$DS= 0
##$DSLIST= <SSSSSSSSSSSSSSS>
$$ [...]
##$SUBNAM2= <"">
##$SUBNAM3= <"">
##$SUBNAM4= <"">
##$SUBNAM5= <"">
##$SUBNAM6= <"">
##$SUBNAM7= <"">
##$SUBNAM8= <"">
##$SUBNAM9= <"">
##$SW= 24.0689530833862
##$SWIBOX= (0..15)
0 0 2 0 0 0 0 0 0 0 0 0 0 0 0 0 
##$SW_h= 4816.95568400771
##$TD= 16384
##$TD0= 1
##$TE= 0
##$TE2= 300
##$TE3= 300
##$TEG= 300
##$TL= (0..7)
0 120 120 120 120 120 120 120 
##$TP= (0..7)
150 150 150 150 150 150 150 150 
##$TP07= 0
##$TPNAME0= <>
##$TPNAME1= <>
##$TPNAME2= <>
##$TPNAME3= <>
##$TPNAME4= <>
##$TPNAME5= <>
##$TPNAME6= <>
##$TPNAME7= <>
##$TPOAL= (0..7)
0.5 0.5 0.5 0.5 0.5 0.5 0.5 0.5 
##$TPOFFS= (0..7)
0 0 0 0 0 0 0 0 
##$TUNHIN= 0
##$TUNHOUT= 0
##$TUNXOUT= 0
##$USERA1= <user>
##$USERA2= <user>
##$USERA3= <user>
##$USERA4= <user>
##$USERA5= <user>
##$V9= 5
##$VALIST= <valist>
##$VCLIST= <CCCCCCCCCCCCCCC>
##$VD= 0
##$VDLIST= <DDDDDDDDDDDDDDD>
##$VPLIST= <PPPPPPPPPPPPPPP>
##$VTLIST= <TTTTTTTTTTTTTTT>
##$WBST= 1024
##$WBSW= 4
##$XGAIN= (0..3)
0 0 0 0 
##$XL= 0
##$YL= 0
##$YMAX_a= 321221
##$YMIN_a= -644078
##$ZGOPTNS= <>
##$ZL1= 120
##$ZL2= 120
##$ZL3= 120
##$ZL4= 120
##$ABSF1= 10
##$ABSF2= 0
##$ABSG= 5
##$ABSL= 3
##$ALPHA= 0
##$AQORDER= 0
##$ASSFAC= 0
##$ASSFACI= 0
##$ASSFACX= 0
##$ASSWID= 0
##$AUNMP= <proc_1d>
##$AZFE= 0.1
##$AZFW= 0.1
##$BCFW= 1
##$BC_mod= 2
##$BYTORDP= 1
##$COROFFS= 0
##$CY= 11.3945322036743
##$DATMOD= 1
##$DC= 2
##$DFILT= <>
##$DTYPP= 0
##$F1P= 19.5091578491511
##$F2P= -0.509923556040331
##$FCOR= 0.5
##$FTSIZE= 0
##$FT_mod= 4
##$GAMMA= 1
##$GB= 0.15
##$INTBC= 1
##$INTSCL= 1
##$ISEN= 128
##$LB= 0.24
##$LEV0= 0
##$LPBIN= 0
##$MAXI= 10000
##$MC2= 0
##$MEAN= 0
##$ME_mod= 0
##$MI= 1.114404
##$NCOEF= 0
##$NC_proc= 0
##$NLEV= 6
##$NOISF1= 3.799351
##$NOISF2= 2.8
##$NSP= 1
##$NTH_PI= 0
##$NZP= 0
##$OFFSET= 15.70392
##$PC= 1
##$PHC0= -9610.148
##$PHC1= 11.20088
##$PH_mod= 1
##$PKNL= yes
##$PPARMOD= 0
##$PSCAL= 0
##$PSIGN= 0
##$REVERSE= no
##$SF= 200.130013532006
##$SI= 16384
##$SIGF1= 3
##$SIGF2= 2
##$SINO= 400
##$SIOLD= 16384
##$SREGLST= <1H.CDCl3>
##$SSB= 0
##$STSI= 0
##$STSR= 0
##$SW_p= 3612.71676300578
##$SYMM= 0
##$S_DEV= 0
##$TDeff= 0
##$TDoff= 0
##$TI= <>
##$TILT= no
##$TM1= 0
##$TM2= 0
##$TOPLEV= 0
##$USERP1= <user>
##$USERP2= <user>
##$USERP3= <user>
##$USERP4= <user>
##$USERP5= <user>
##$WDW= 1
##$XDIM= 8192
##$YMAX_p= 0
##$YMIN_p= 0
$$ End of Bruker specific parameters
$$ ---------------------------------
##NTUPLES= NMR FID
##VAR_NAME=  TIME,          FID/REAL,        FID/IMAG
##SYMBOL=    X,             R,               I
##VAR_TYPE=  INDEPENDENT,   DEPENDENT,       DEPENDENT
##VAR_FORM=  AFFN,          ASDF,            ASDF
##VAR_DIM=   8192,          8192,            8192
##UNITS=     SECONDS,       ARBITRARY UNITS, ARBITRARY UNITS
##FACTOR=    0.0002076,     1,               1
##FIRST=     0,             0,               0
##LAST=      1.7004516,     0,               0
##MIN=       0,             -644078,         0
##MAX=       1.7004516,     321221,          0
$$ Real data points
##PAGE= N=1
##DATA TABLE= (X++(R..R)), XYDATA
0 0 0 0 0 0 0 -8 0 -8 8 -8 16 -17 24 -25 33 -45 49 -60 73 -87 97 -118 135 -157 176 -208 236 -266 304 -344
30 -344 386 -436 491 -549 609 -683 760 -843 936 -1041 1147 -1272 1409 -1561 1726 -1916
46 -1916 2127 -2367 2641 -2961 3334 -3779 4323 -5003 5877 -7057 8741 -11357 16009 -26778
60 -26778 101891 -92027 -298523 71928 321221 165298 -141507 -46585 277122 315825 -97043
71 -97043 -408051 -222492 197537 259639 -52304 -252239 -65214 137844 -21144 -354322
81 -354322 -353735 9151 248534 46102 -287607 -309436 -61958 30087 -163141 -308348 -132769
92 -132769 134420 104635 -199369 -368496 -201225 37034 25577 -153999 -187665 -19121 74770
103 74770 -77921 -276344 -236019 -4173 114801 -6334 -163119 -142045 -18189 -5612 -120324
114 -120324 -170517 -56476 77733 53426 -96502 -181422 -112597 -2475 9921 -58257 -82385
125 -82385 -23346 20292 -35275 -129156 -134646 -33186 59026 40422 -52169 -100693 -59566 -4976
137 -4976 -18638 -68435 -55401 32226 82005 10352 -104705 -116123 -9163 75731 40567 -36136
149 -36136 -25896 52928 61538 -39332 -111724 -35654 104707 128204 13237 -73162 -20801 67433
161 67433 42675 -56923 -61553 63513 147849 62739 -82689 -93138 28723 93244 13241 -69293
173 -69293 -11261 102543 86537 -56172 -127677 -30201 90226 63876 -53773 -76221 26075
184 26075 83329 -7022 -117095 -80929 50437 83820 -22608 -100589 -32919 66402 36197
195 36197 -80658 -105701 -718 74929 13664 -80575 -58883 41017 57677 -40903 -107194 -41275
207 -41275 58854 50533 -37214 -58999 15030 55668 -15246 -95443 -58679 49754 80561 4944
219 4944 -52283 -13193 37804 858 -71505 -53212 51458 103984 37121 -48934 -42594 17432
231 17432 20562 -32277 -32170 53742 114303 56315 -50424 -70874 2965 52714 22082 -5001
243 -5001 45797 105518 64337 -46024 -83691 -1112 87974 79357 22031 22488 69972 60708 -24634
256 -24634 -71788 -515 108857 122640 41966 -11883 18058 51085 13673 -34851 4261 103539
268 103539 132999 49454 -39431 -29873 36603 53858 15360 10743 69244 103530 43422 -47287
280 -47287 -55338 22450 81217 59624 15016 19228 46906 26855 -33349 -49063 14722 83749
292 83749 75517 10296 -27871 -12385 5570 -8152 -17165 16885 62104 55127 -5188 -54584 -47768
305 -47768 -7963 18206 21725 23605 26432 9713 -29256 -58047 -46137 -2849 34787 42815 24778
318 24778 -5314 -35981 -52588 -42531 -10437 22095 37713 34203 13458 -23042 -59407 -63034
330 -63034 -20646 34349 54061 30943 586 -13710 -25994 -47737 -50492 -3774 63001 80132
342 80132 26090 -38606 -49962 -20011 -5645 -13576 4543 59837 85491 27599 -61688 -80551
354 -80551 -14639 46619 40009 11571 28504 63028 34981 -50260 -86549 -15178 82516 93139
366 93139 25270 -14247 15941 39054 -7618 -60528 -20731 84283 123450 45924 -43832 -35753
378 -35753 32068 45142 -7502 -20883 51946 114313 65593 -42229 -70783 8816 79110 51659
390 51659 -9821 1529 67582 73080 -11445 -73214 -21290 77524 91582 12892 -38211 3684
402 3684 58010 28801 -43305 -43441 40211 92044 37455 -48620 -51449 19820 53577 4429 -44405
415 -44405 -12627 53176 49442 -28082 -73623 -25086 46812 42881 -23339 -52240 -7529 34358
427 34358 4044 -56192 -55374 9534 48581 7280 -57194 -59043 -4314 23790 -12108 -53644 -34945
440 -34945 18153 25509 -30134 -74732 -47373 14016 26331 -21602 -57386 -30587 14371 6713
452 6713 -46904 -68231 -20899 33826 20981 -41816 -67422 -22969 23585 2073 -54426 -57895
464 -57895 3806 43002 -848 -69175 -65516 3631 37270 -12219 -68564 -43781 28467 39317
476 39317 -33321 -87153 -43313 35574 34942 -42260 -78091 -15752 51204 18185 -72018 -87339
488 -87339 -2199 60999 12457 -71117 -61882 26075 56692 -22116 -96041 -51564 52919 69674
500 69674 -20609 -81511 -24536 58833 37347 -58709 -79832 17203 98393 48212 -59604 -70649
512 -70649 22609 74840 10408 -63784 -23474 81130 95509 -8101 -86626 -33345 69174
523 69174 74953 -10215 -45676 26461 93140 41639 -64492 -74876 27969 101783 51889 -37041
535 -37041 -35222 40223 58846 -18665 -78100 -22517 78795 87076 -7149 -74339 -33839 36528
547 36528 26434 -41131 -50736 25358 78738 23362 -74439 -87278 -7469 50028 15405 -41694
559 -41694 -27545 32359 34412 -40707 -92231 -43271 46692 63295 -3063 -52723 -24314 22559
571 22559 6632 -48317 -48037 25525 79033 38505 -43525 -61348 -3299 41898 18807 -18452
583 -18452 2081 56790 58314 -9535 -60590 -24833 52660 74860 27804 -10086 12378 46008
595 46008 24962 -26788 -26597 40552 92535 62270 -7812 -28770 11211 41865 21051 -4549
607 -4549 20704 69660 67054 2790 -46581 -21768 39476 59287 27943 5829 24813 41509
619 41509 11094 -35609 -31130 28413 73018 52327 1739 -15882 3586 12878 -5537 -13452 19660
632 19660 60547 54219 1936 -37734 -26273 9422 23881 15037 15410 31774 31727 -2373 -39057
645 -39057 -35424 4440 36387 33223 11563 -1510 -5499 -15614 -30017 -27409 -918 26789 27096
658 27096 -155 -29276 -39445 -32736 -22196 -12723 -2228 5425 574 -19773 -43343 -53037 -41499
671 -41499 -18187 -780 -11 -13399 -28837 -38347 -42068 -41010 -31466 -12338 4542 3306 -18111
684 -18111 -40457 -43312 -28090 -11872 -5260 -2191 3010 2958 -11275 -30133 -31585 -9844 15181 20990
698 20990 9011 -1028 -1151 -1049 -7599 -9114 5753 26981 31827 14955 -3819 -6217 3593 10677
712 10677 11054 13851 21173 23284 12292 -2858 -6880 3748 16622 20336 15501 10208 7288 4032
726 4032 931 1125 6033 12248 15707 13841 6737 -1032 -2443 4987 14067 14414 7547 4394 9756 13739
742 13739 7300 -948 4309 19665 24013 8915 -5650 1453 20984 24849 7678 -4082 8246
755 8246 24798 16956 -6551 -9666 16572 35332 16675 -15631 -17419 10695 24294 2904 -18256
768 -18256 -3497 25032 19087 -21178 -41907 -13175 24577 19628 -17015 -29436 -3499 13452
780 13452 -12962 -46093 -31575 17397 34193 -4728 -45189 -34873 1986 6256 -23474 -31801
792 -31801 4815 35989 11541 -40900 -52141 -9354 27288 14948 -14303 -9028 19936 18602
804 18602 -22358 -46768 -14993 36318 44185 6688 -20779 -8945 9504 -1501 -22369 -10827
816 -10827 28712 45862 15691 -26623 -34306 -9146 9892 6225 907 10759 20063 4531 -27004
829 -27004 -40487 -20492 10665 23652 13515 -2918 -13402 -19141 -23256 -22084 -10771 7777 21277
842 21277 16983 -6746 -32843 -38732 -18522 7887 17496 10397 3747 3680 -4146 -25358 -37140 -13745
856 -13745 29948 47874 20104 -18170 -24239 -4178 2476 -11026 -7753 29353 57573 30030 -30146
869 -30146 -51909 -12119 33112 30543 3075 6919 36527 32053 -22669 -60869 -23932 48050 67235
882 67235 18734 -23019 -7560 20890 1590 -41250 -30632 39032 80297 34597 -40469 -51448
894 -51448 -324 28637 153 -23619 12211 61060 41292 -35759 -72977 -23795 42669 43026
906 43026 -3880 -16835 18877 33327 -13815 -62087 -36348 37799 66308 18773 -32958 -25090
918 -25090 11895 10107 -26987 -31390 18528 58844 31179 -31505 -50315 -11184 24211 12413
930 12413 -12750 -2439 29213 27371 -16824 -47478 -23498 24017 36198 7908 -14321 -4106
942 -4106 11167 -183 -22829 -18939 13877 35631 19596 -12657 -23074 -6330 9881 6849 -2297
955 -2297 2455 16342 16590 -2808 -20794 -14929 8741 23478 15344 -2096 -7125 1442 6660 -1499
969 -1499 -9648 -313 19857 24100 2838 -20346 -16300 8266 19969 5933 -8629 622 18635
982 18635 12720 -14992 -25732 258 30609 24194 -8696 -20861 2224 21489 4828 -21685
994 -21685 -13068 23404 34784 1023 -31457 -17008 21618 26687 -7273 -25107 2435 33100
1006 33100 16855 -25346 -30572 10334 37171 10061 -29641 -22281 19822 30938 -6620 -35537
1018 -35537 -10409 30446 23126 -23466 -38710 1505 37428 15524 -31076 -32584 10056 28543
1030 28543 -6238 -38879 -15329 32117 31374 -19156 -47827 -15413 26878 17796 -22135 -25145 15795
1043 15795 34711 -4214 -48804 -33537 21052 40071 4001 -26581 -7637 22695 8391 -34241
1055 -34241 -37384 12380 50455 26961 -22143 -30893 823 15429 -8703 -25479 3712 43864
1067 43864 35514 -15834 -45486 -20996 16059 16667 -5189 -3525 22807 26427 -10943 -45721 -31861
1080 -31861 12914 33247 13947 -7546 -2983 6723 -7679 -32133 -27314 9923 37036 23671
1092 23671 -9417 -22771 -12153 -4858 -10914 -10415 9980 29338 20579 -9914 -29108 -20469 -642
1105 -642 8761 8803 11274 14613 6806 -12007 -23852 -15414 5152 19113 18382 9315 -890 -9798 -15115
1120 -15115 -12643 -1303 11347 16580 11925 795 -11991 -20130 -17475 -3316 11721 14896 5305
1133 5305 -6717 -13050 -16325 -18498 -13796 1299 15921 13228 -7158 -25461 -25660 -13926 -5678 -3556
1147 -3556 1663 9824 6303 -14576 -33838 -29929 -6260 11368 9835 882 -1752 -3410 -15043 -28311
1161 -28311 -22432 3697 24604 19766 -892 -13692 -12647 -10950 -13402 -7438 12583 29137 21586
1174 21586 -4347 -21662 -16903 -3327 3645 7776 17771 25248 14862 -9709 -24040 -14252 6190
1187 6190 16805 16202 16113 16512 5838 -13839 -22310 -7075 16311 24592 15986 7692 6466 867 -13351
1202 -13351 -18797 -1629 23304 27874 9931 -5886 -4195 829 -6730 -15003 -2632 22365 28054
1215 28054 4637 -19248 -16104 1937 4307 -8999 -9786 11128 24001 4449 -25927 -27929 -1509
1228 -1509 14425 -27 -17138 -6964 14673 9275 -21328 -34959 -10394 17930 11051 -17443
1240 -17443 -23231 603 14123 -7191 -32331 -21445 11968 20049 -8026 -29955 -13819 14127
1252 14127 9994 -19484 -27919 -361 22663 7245 -23429 -22928 7123 20825 -1624 -25140 -13145
1265 -13145 16761 19617 -7583 -23191 -3960 20616 13769 -13035 -18483 5373 22809 8477
1277 8477 -14594 -12000 11327 19813 1509 -14813 -5037 15649 16507 -2328 -11774 1035 15962
1290 15962 11215 -5049 -8301 4571 13896 7116 -4072 -3174 7171 10935 2612 -5825 -3235 5545
1304 5545 8760 4636 253 356 2358 1811 -1099 -2843 -924 4194 8107 6171 -1650 -8351 -7135
1319 -7135 -330 3175 464 -1441 3276 7235 291 -13574 -17361 -4491 10305 9665 -1927 -6239
1333 -6239 378 2284 -10164 -20780 -9942 13316 20724 3484 -14779 -12294 202 -679 -12702
1346 -12702 -11047 10764 26166 11913 -16429 -24524 -6493 9056 4077 -5191 4327 20981 15888
1359 15888 -12291 -29866 -14203 13957 20817 6280 -1711 7317 11276 -5673 -24724 -16740 13082
1372 13082 29887 17049 -4627 -8967 -411 -1028 -11990 -11332 9422 27969 20675 -4838 -19261
1385 -19261 -11744 765 2433 239 7279 18059 14865 -4687 -20464 -16258 752 11734 10781
1398 10781 6725 5938 2945 -6332 -14673 -11617 1573 13320 14094 5793 -3360 -8897 -10165 -7556 -1992
1413 -1992 4397 8275 7265 1064 -7959 -14642 -13262 -3390 6881 8328 1321 -5654 -7182 -7609 -10694
1428 -10694 -10930 -2229 9806 10313 -3639 -17147 -16150 -4996 723 -2286 -2858 4718 7933 -4184
1442 -4184 -20585 -19992 -1086 14074 9783 -3196 -5517 459 -1764 -13972 -16684 1155 21136
1455 21136 18675 -2835 -16689 -10168 783 -900 -6527 1571 18605 19844 -2115 -23440 -19335
1468 -19335 1823 12626 5851 525 7738 12388 -2178 -23136 -22764 1256 21180 16496 -307
1481 -307 -5937 -550 -2424 -14986 -18176 379 22515 21649 -577 -17107 -13197 -2565 -2781 -7021
1495 -7021 738 16984 19467 212 -20261 -19648 -2302 9018 6089 2389 7570 11611 1331 -15613
1509 -15613 -18337 -1860 15312 15980 4988 -903 1660 1787 -5581 -10099 -849 14623 18569 7439
1523 7439 -4975 -5934 667 3268 368 909 8431 13863 8383 -3472 -8260 -1423 7414 8315 3318
1538 3318 1524 5548 7308 1763 -4866 -3206 5593 10419 5469 -1921 -2119 3869 6509 1546 -3483
1553 -3483 -480 6629 6949 -423 -5212 -61 8018 7194 -1743 -6338 -581 6551 4525 -2953 -3550 4091
1569 4091 8282 1178 -8559 -7050 3630 9195 2699 -5036 -2901 4554 4072 -5239 -9412 -748 9500
1584 9500 7472 -3975 -9109 -2314 4552 925 -6474 -4805 4698 8027 -1069 -10422 -7695 2966
1598 2966 6007 -1133 -7069 -2970 3962 1879 -6717 -8721 -525 6623 2523 -7143 -9115 -1790 3661
1613 3661 456 -5002 -3508 2142 2058 -5250 -10072 -4912 4477 6652 317 -5831 -5127 -1870 -2579 -5064
1629 -5064 -2713 4987 8993 3500 -6342 -10703 -5991 795 3890 4024 4843 5769 2059 -6126 -11306 -6868
1645 -6868 4332 12221 11221 4581 -841 -3675 -5638 -6416 -2032 7593 15905 14291 3192 -7807
1659 -7807 -10164 -4927 1773 6510 10524 13484 10631 -29 -11556 -13073 -3083 9682 14915 12003
1673 12003 6537 1388 -4826 -10789 -9948 488 13758 18358 10268 -2018 -9065 -9110 -6236 -1974 5347
1688 5347 13193 14416 4947 -8771 -15113 -10258 -391 6468 8890 8401 5012 -2687 -11687 -14470 -7155
1703 -7155 4438 11322 9069 1593 -5309 -9163 -10407 -7981 -1189 6844 9951 5006 -4737 -11784 -11819
1718 -11819 -6451 151 4802 5922 3487 -2205 -8785 -11836 -9053 -1322 6062 7986 3077 -4304 -8932
1733 -8932 -9311 -6305 -1620 3643 7270 6226 -428 -8510 -11214 -6126 2427 7760 7600 4932 1517
1748 1517 -2681 -6842 -6865 234 10166 14192 9341 1085 -3861 -3308 -880 2071 7044 13205 14952 8405
1764 8405 -1751 -6462 -2146 5911 10711 11449 11158 9547 4399 -2884 -6096 -374 9480 14307 11456
1779 11456 5296 1196 -1118 -2994 -3153 1431 8541 11696 7374 -794 -5940 -5606 -2704 -36 2319
1794 2319 4771 4877 917 -5343 -9050 -7291 -2383 1192 1748 296 -1893 -4539 -6751 -7423 -5750 -2629
1810 -2629 -354 -269 -2409 -5392 -7190 -6510 -4462 -2909 -3085 -3721 -3434 -3078 -4207 -6020 -6035 -3353 -1503
1827 -1503 -3141 -6265 -6324 -2940 -304 -2305 -5698 -5526 -2505 -2035 -5190 -6706 -2400 3092 1979 -4760
1843 -4760 -8844 -5128 506 559 -2848 -2009 3253 4824 -2035 -9517 -6952 3214 8555 4328 -1134
1858 -1134 271 4615 2301 -4906 -5515 4760 14727 11585 266 -4728 911 6189 3381 -686 4415
1873 4415 14271 14635 2085 -8365 -4115 8243 12609 6431 2139 7003 11274 4168 -7187 -6749
1887 -6749 6915 17539 12574 103 -3492 2868 5785 -531 -4620 3476 15409 14577 -75 -10914
1901 -10914 -5843 5803 8541 2369 335 7020 10393 1184 -11207 -10358 4038 14624 10182 -686
1915 -686 -3686 1243 2230 -4629 -7819 1660 14047 13482 -637 -12056 -8732 1144 4196 134 -340
1930 -340 6578 9211 -445 -13672 -14610 -1271 10529 9014 -199 -3988 -1099 -1412 -8586 -12345 -3245
1945 -3245 10838 13553 1169 -11856 -12262 -3936 -55 -2820 -2486 5462 10746 2567 -12798 -18158
1959 -18158 -7091 6919 8852 1260 -2460 1059 1362 -7808 -15481 -8753 8040 15729 5998 -8169
1973 -8169 -10493 -3384 -611 -5610 -6747 3676 13931 8549 -8779 -18043 -9206 4297 6067 -1171
1987 -1171 -2644 4675 6613 -4820 -16900 -12332 4990 14229 5846 -6037 -5989 1303 862 -8121 -10361
2002 -10361 2283 15284 11042 -5131 -13204 -4913 5213 3529 -3682 -1202 9514 11655 -1087
2015 -1087 -13282 -8744 5994 11968 4231 -3118 488 7065 3180 -7615 -8858 3109 13672 9387
2029 9387 -2790 -6603 278 5006 -48 -5354 -446 8998 9585 -883 -8950 -5176 3661 5244 -426
2044 -426 -2832 1942 5550 1082 -6645 -6955 640 6098 3257 -2483 -3140 419 1315 -2541 -4930 -1576
2060 -1576 3523 3774 -951 -4167 -2786 169 565 -1344 -1760 271 1752 505 -2187 -2982 -1160 799
2076 799 1070 -383 -1044 -347 562 454 -716 -1536 -647 1158 1736 388 -1007 -115 1790 1868 -391 -1679
2094 -1679 212 3082 3163 483 -904 912 2808 1571 -1203 -621 3245 5464 2998 -1094 -1331 1924
2110 1924 3369 1250 -229 2165 5421 4135 -978 -3372 -171 4068 3883 1203 614 2730 2901 -809
2126 -809 -3817 -1523 3601 5494 2409 -1047 -1116 89 -750 -2589 -1149 2821 5024 1904 -2807 -4304
2142 -4304 -2558 -865 -456 444 2397 2865 -263 -4426 -5668 -3281 -163 1287 1468 1369 -73 -3198
2158 -3198 -6101 -5574 -2009 1425 2249 1137 -278 -2683 -5775 -6912 -4176 812 3295 1941 -1235
2173 -1235 -3175 -4742 -6166 -6259 -2414 2922 4834 1062 -4388 -6374 -5208 -4019 -3296 -470 3704 4958
2189 4958 -285 -7156 -8822 -4557 -4 1076 1041 2639 3096 -1146 -7726 -9173 -2913 4225 5582 2261
2205 2261 -154 -386 -1976 -5916 -6759 -1126 6786 8259 2386 -3499 -4044 -2165 -2133 -2616 922 6911
2221 6911 8303 1935 -5678 -6680 -1861 2090 2460 2392 4790 5600 987 -5903 -6828 -851 5629 6330
2237 6330 3055 1348 1469 -221 -4007 -4638 668 7114 7753 2868 -2173 -2746 -1321 -1230 -990 2039 5911
2254 5911 6048 1000 -4462 -5258 -1905 1636 2689 2744 2877 1804 -1805 -5272 -5156 -1227 2941 4049
2270 4049 2290 -745 -3007 -4504 -4576 -2784 389 2804 3049 425 -3435 -6157 -6047 -3229 372 2442
2286 2442 1706 -234 -2603 -4769 -6165 -5476 -1908 2804 3956 675 -3905 -5808 -4844 -3418 -2570 -310
2302 -310 2855 4009 174 -5982 -8056 -4350 570 2126 1051 1215 2045 -66 -5383 -7806 -3506 3708
2318 3708 6446 2809 -1128 -1432 -551 -2202 -4598 -2328 4751 8572 4672 -2316 -4513 -1267 1677
2333 1677 703 36 3604 7622 5763 -1313 -5637 -2441 3787 5346 2797 1726 4083 5136 874
2348 874 -4070 -3113 3393 7582 5446 726 71 2474 2585 -866 -2479 1076 6180 6209 1308 -2616
2364 -2616 -1469 2042 2060 -977 -1488 2073 4651 2449 -2621 -4153 -732 2408 1180 -2133 -1963 1280
2380 1280 2848 -606 -4772 -4127 162 2244 -337 -3634 -2317 1301 1344 -2992 -6004 -3256 1740 2219
2396 2219 -2046 -4450 -1984 1175 -225 -4812 -5522 -660 3698 1511 -3986 -5280 -1178 1732 -989
2411 -989 -4910 -2922 2671 4125 -1154 -6269 -4395 1749 3326 -837 -3696 -618 3865 2052 -4052
2426 -4052 -5876 159 5784 4003 -2357 -3924 546 3688 519 -3774 -1665 4900 6706 528 -5286
2441 -5286 -3351 3275 5438 1325 -1663 1469 5511 3058 -3516 -4892 1663 8130 6679 59 -2474
2456 -2474 941 3522 451 -2649 608 7613 9131 2211 -4813 -4104 1877 4826 2448 1150 4240
2471 4240 6933 3004 -4803 -7095 -626 6969 7689 2766 -248 986 899 -3081 -5962 -1872 6468 9886
2487 9886 4166 -3732 -5907 -3006 -861 -1709 -774 3984 7459 3380 -5455 -10456 -6589 618 3632
2502 3632 2132 1005 1751 222 -5357 -10044 -7284 1252 7036 4977 -1079 -4477 -4365 -4395 -5647 -4419
2518 -4419 1221 6698 5416 -1971 -8157 -7654 -3226 -224 308 1242 3244 2804 -2412 -8110 -8292 -2255
2534 -2255 3610 4272 1146 -1307 -1761 -3000 -5307 -5627 -1335 4191 5271 780 -4374 -5561 -3230 -1355
2550 -1355 -981 -45 2154 3035 -263 -5187 -6585 -3034 1759 3028 1102 -834 -797 -1309 -3172 -4130 -1415
2567 -1415 3058 4715 1778 -2748 -4103 -2219 -89 473 1021 2804 3699 1277 -2944 -4566 -1623 2742
2583 2742 4648 3306 1465 557 -129 -1673 -2515 -157 4139 6260 4194 218 -2125 -1717 -217 942
2599 942 2220 3955 5113 3279 -799 -3420 -2446 876 3513 3965 3159 2246 677 -1458 -2999 -1943
2615 -1943 1214 4118 4387 2101 -493 -1873 -1863 -1413 -432 1130 2856 2865 872 -1944 -3304 -2351 -341
2632 -341 840 1011 742 645 -48 -1730 -3137 -2793 -702 1123 929 -476 -1351 -854 -934 -1831 -2692 -1923 285
2651 285 1161 -183 -1715 -1695 -448 -639 -2147 -2553 -968 1493 1478 -526 -1977 -1314 -191 -829 -2112
2668 -2112 -1397 1474 3116 1369 -1728 -2740 -1053 272 -145 -325 1419 3224 2550 -1196 -3705 -2336
2684 -2336 986 2447 1785 1172 1720 1709 -662 -3242 -2766 1177 4303 3809 1007 -602 -285 -344 -1436
2701 -1436 -1497 1138 4457 4599 970 -2376 -2514 -301 1268 1156 1477 2922 3365 1066 -2390 -3146 -186
2718 -186 3234 3759 1864 400 408 534 -875 -1887 -13 3434 4513 1906 -1672 -2391 -233 1184 1014
2735 1014 517 1703 2828 1122 -2405 -3918 -1096 2841 3632 1228 -1242 -913 -310 -1332 -2705 -1101
2751 -1101 2970 4466 1271 -3415 -4631 -1946 616 519 129 1521 2773 596 -4068 -6251 -2821 2383
2767 2383 4089 1801 -641 -932 -1072 -3356 -4933 -2282 3193 6031 2904 -2317 -4574 -3232 -1460
2782 -1460 -1158 -453 2700 5273 3013 -3072 -6737 -4599 351 2942 2502 1795 2153 1125 -2656 -5940
2798 -5940 -4507 1432 5722 4742 885 -1614 -1775 -1923 -2846 -2414 1619 5580 5391 494 -3943 -4027 -1046
2815 -1046 772 945 1533 3329 3663 218 -3918 -4731 -914 3305 3755 1677 253 524 96 -2040 -3394
2832 -3394 -1089 3417 4671 1892 -1875 -2455 -451 472 -643 -944 1538 3528 1924 -1887 -3870 -1328
2848 -1328 1909 2035 -142 -929 747 1426 -656 -2899 -1828 1703 3159 736 -2356 -2094 527 1287
2864 1287 -643 -1786 189 2273 1474 -1991 -3261 -676 2253 1797 -702 -1521 52 1225 -675 -2672
2880 -2672 -1451 1818 3054 569 -2399 -2049 278 997 -594 -1163 596 2616 1440 -1635 -2945 -969
2896 -969 1511 1557 -38 -337 977 1532 -291 -2244 -1562 1299 2620 1421 -350 -550 633 743 -581
2913 -581 -1145 195 2312 2313 373 -998 -467 942 901 -165 -445 1003 2341 1551 -288 -1102 -126 1095
2931 1095 806 -271 46 1484 2175 586 -1144 -1396 72 1128 503 -108 631 1579 1088 -941 -2370
2948 -2370 -1314 1006 1805 878 -68 141 428 -746 -2348 -2074 528 2615 2114 -35 -1366 -1122 -881
2965 -881 -1355 -1375 244 2356 2481 14 -2415 -2651 -1355 -110 -15 595 1505 1816 -49 -2578 -3313 -1555
2983 -1555 839 1679 1074 595 177 -772 -2277 -2768 -1420 1237 2648 1630 -221 -1528 -1654 -1459 -1189
3000 -1189 -246 1336 2429 1529 -541 -2270 -2061 -677 660 1256 1327 1109 613 -577 -1789 -1724 -39
3017 -39 1925 2347 1059 -215 -670 -615 -394 -470 409 1717 2238 916 -1015 -1692 -559 867 1245 750
3035 750 821 1072 516 -932 -1744 -443 1593 2204 1080 -491 -790 -106 -153 -735 -256 1393 2123 950
3053 950 -1266 -2307 -1078 774 1006 399 637 1129 465 -1464 -2487 -1209 1328 2483 1406 -247
3069 -247 -833 -570 -1048 -1539 -806 1384 2852 1687 -1027 -2452 -1870 -534 18 228 1051 1896 1249 -1095
3087 -1095 -2989 -2446 -217 1694 1644 833 401 -46 -1106 -2458 -2248 36 2380 2551 758 -1204 -1613
3104 -1613 -1366 -1080 -1002 159 1881 2558 698 -2007 -2922 -1525 218 916 662 883 1269 382 -1660 -3039
3122 -3039 -1915 674 2132 1266 -178 -674 -366 -976 -1932 -1619 580 2341 1669 -717 -2092 -1405 -330
3139 -330 -343 -837 -122 1646 1751 -456 -2361 -2080 41 1245 413 -227 194 1124 398 -1453 -1803 -122
3157 -122 1809 1731 -112 -791 217 1037 270 -912 -370 1469 2067 678 -851 -551 929 1381 395 -433
3175 -433 204 1519 1372 -112 -804 270 1647 1306 -82 -622 440 1345 851 -369 -492 716 1461
3192 1461 570 -663 -684 668 1221 363 -771 -586 687 1053 -228 -1204 -400 1082 1088 -295 -1222 -472
3210 -472 776 648 -496 -1163 -234 1055 559 -864 -1268 41 916 122 -1176 -1218 244 1121 169 -1198
3228 -1198 -1095 392 713 -504 -1354 -515 976 1052 -483 -1645 -746 514 480 -618 -918 320 1253 216
3246 216 -1428 -1732 -88 1285 765 -335 -428 426 495 -911 -1885 -657 1348 1884 433 -954 -917 -294
3264 -294 -231 -788 -584 786 2157 1040 -1020 -2236 -1116 413 747 473 619 1165 873 -784 -2179
3281 -2179 -1507 733 2219 1763 543 -292 -194 -442 -1198 -909 726 2598 2541 655 -1299 -1476 -385 394
3299 394 471 1081 2042 2162 561 -1708 -2252 -476 1610 2235 1501 585 472 58 -1386 -1917 -384 2015
3317 2015 3120 1558 -719 -1399 -801 -413 -493 29 1564 2582 1387 -1257 -2704 -1539 406 1235 874
3334 874 593 810 182 -1351 -2631 -1747 848 2263 1469 -296 -938 -839 -778 -1254 -951 780 2123 1560
3352 1560 -777 -2236 -1752 -258 386 368 426 940 615 -878 -2242 -1873 -2 1722 1532 225 -566 -764
3370 -764 -777 -1207 -1134 148 1708 1843 -101 -1686 -1794 -702 159 337 454 804 910 -163 -1723 -2076
3388 -2076 -618 1215 1657 613 -427 -728 -484 -929 -1356 -360 1228 2075 682 -1246 -1850 -937 179
3405 179 225 186 673 1344 757 -1185 -2197 -1004 895 1553 751 74 -15 194 -674 -1522 -988 941 2112
3424 2112 1245 -364 -1180 -609 81 -181 -363 475 1570 1283 -271 -1481 -1135 456 933 480 -15 623
3442 623 803 32 -1062 -1234 203 1366 1186 59 -454 90 452 -97 -616 -194 743 1176 417 -540 -573
3461 -573 153 452 -48 -422 -3 961 902 -31 -753 -268 522 475 -182 -431 361 1034 683 -427 -875 -229
3481 -229 538 401 -229 -110 746 929 54 -1147 -933 336 948 617 -86 -7 329 106 -855 -1228 -130
3500 -130 1321 1368 151 -707 -566 -21 -294 -743 -295 1077 1478 330 -1275 -1526 -648 429 407 -34 269
3519 269 828 288 -1294 -1830 -899 772 1251 601 -479 -416 -285 -684 -1239 -558 813 1673 633 -872
3537 -872 -1448 -750 -123 56 -20 554 974 490 -909 -1713 -1185 436 1349 793 91 -239 -205 -645 -1130 -569
3557 -569 624 1654 1293 -295 -1330 -1078 -230 110 288 696 1232 785 -509 -1657 -1367 194 1479
3574 1479 1406 599 44 -210 -525 -1105 -715 664 1956 1949 341 -1101 -1379 -614 88 281 963 1650 1497
3593 1497 -85 -1572 -1883 -415 1174 1490 1062 595 382 -465 -1661 -1779 -125 1821 2449 1157 -420
3610 -420 -1143 -1081 -880 -607 279 1590 2103 749 -1344 -2149 -1505 -153 717 825 1039 976 141 -1536 -2293
3629 -2293 -1414 485 1409 1289 251 -518 -717 -1277 -1473 -872 565 1695 1193 -309 -1518 -1558 -929 -305
3647 -305 38 422 1048 744 -651 -1723 -1702 -607 658 887 340 -94 -186 -552 -1085 -1262 -449 798 1286
3666 1286 395 -641 -947 -385 -214 -446 -205 536 974 359 -718 -1124 -510 499 734 34 -345 220 318
3685 318 -259 -861 -537 613 932 329 -639 -571 108 320 -94 -418 174 626 457 -490 -876 -265 666 555
3705 555 -44 -286 40 452 -18 -639 -441 527 971 277 -435 -476 77 180 -16 -273 159 696 647 -232 -781
3726 -781 -318 364 506 126 -94 276 566 203 -387 -593 -41 745 550 100 -34 332 479 6 -624 -391
3746 -391 544 969 506 -194 -177 73 243 -359 -470 13 956 989 191 -583 -492 109 41 -387 -167 732 1119
3767 1119 426 -785 -1170 -527 249 353 36 168 680 457 -733 -1540 -896 409 1040 722 132 -94 -64
3786 -64 -479 -1157 -934 353 1412 1065 30 -805 -696 -347 -529 -367 398 1320 1267 149 -1221 -1304 -351
3805 -351 430 457 561 720 845 70 -1079 -1495 -444 835 1307 753 131 -2 -238 -850 -990 -401 803
3824 803 1507 782 -330 -964 -742 -293 -79 2 474 1031 735 -450 -1245 -922 70 584 475 135 116 122 -267
3845 -267 -994 -833 28 927 887 -147 -655 -433 -120 -295 -394 -97 639 618 -295 -1068 -939 8 538 255 -112
3866 -112 0 245 -27 -786 -844 39 1028 819 -13 -650 -375 -48 -30 -197 34 844 831 -55 -1102 -966 -62
3887 -62 466 576 326 203 285 -161 -1000 -967 10 941 1130 395 -334 -449 -383 -598 -637 80 950 1372 475 -607
3909 -607 -1129 -762 -163 249 444 822 969 497 -807 -1333 -838 288 1015 1035 579 318 58 -584 -871 -583
3929 -583 451 1270 1257 423 -267 -501 -430 -251 -125 525 1267 1257 453 -598 -1020 -362 258 616 486 713
3949 713 737 298 -568 -1013 -469 474 870 639 129 -30 1 -294 -774 -539 296 1026 680 -130 -544 -298 -178
3970 -178 -355 -374 -18 716 545 -186 -798 -802 -70 170 -128 -364 -32 255 22 -696 -782 -288 255 165 -298 -417
3992 -417 -115 104 -172 -647 -482 134 279 -96 -397 -357 -18 166 -111 -448 -222 164 104 -220 -403 -164 342
4013 342 100 -240 -414 -90 186 297 -78 -149 27 256 77 -345 -406 107 467 388 -31 -177 173 179 -145 -433
4035 -433 -183 494 721 275 -182 -225 305 243 -59 -238 380 793 568 -91 -466 -68 224 293 98 124 504
4056 504 786 260 -456 -514 107 511 206 -36 203 587 304 -349 -784 -209 522 685 251 -45 201 307
4076 307 -212 -676 -437 296 725 599 -111 -416 -336 -130 -394 -398 13 657 662 -78 -766 -831 -434 -163 -137 10
4098 10 369 465 -29 -1013 -1240 -707 147 336 183 -150 -3 -267 -711 -1149 -954 -40 773 548 -116 -479 -476
4119 -476 -607 -678 -607 76 697 765 -211 -881 -1020 -547 -23 -94 88 504 669 -8 -865 -1016 -394 433 676
4140 676 169 117 262 63 -494 -764 -302 642 898 465 -193 -317 -162 95 -38 66 537 932 591 -79
4160 -79 -556 -70 501 620 317 238 500 588 144 -346 72 647 1018 511 61 -54 180 422 232 207 435
4181 435 724 445 -113 -306 -87 512 739 356 138 194 204 -120 -343 -79 676 863 500 -150 -506 -320 -27
4202 -27 -10 111 467 556 331 -279 -861 -651 -156 397 435 251 41 -28 -483 -924 -839 -103 675 618 44 -469
4224 -469 -657 -509 -629 -568 -105 595 553 5 -860 -1014 -568 -253 -18 67 253 425 44 -682 -1190 -741 115
4245 115 339 287 -144 -85 -224 -557 -811 -591 153 517 391 -107 -415 -318 -291 -230 -339 24 439 347 -77 -422
4267 -422 -416 -101 93 14 6 203 382 189 -96 -333 -37 370 303 50 131 329 366 138 -170 -161 246 474 352
4290 352 143 252 356 355 146 -208 -36 411 689 401 170 264 401 182 -39 -130 165 669 556 111 -51
4311 -51 48 227 174 -35 129 601 624 398 -271 -347 -22 166 248 -48 79 458 245 -218 -555 -220 153 439
4333 439 -27 -175 -61 -109 -157 -469 -321 -63 382 55 -350 -475 -194 16 -273 -271 -239 63 62 -327 -478 -243
4355 -243 159 114 -205 -470 -332 -135 -22 -357 -252 -103 173 -43 -549 -510 -141 57 146 -32 -150 77 -33
4376 -33 -346 -577 -213 315 510 291 -255 -406 -208 -128 -1 35 476 552 342 -216 -566 -278 121 360 386 368
4398 368 394 279 -200 -605 -425 359 766 763 414 101 -98 -222 -334 -216 274 941 1025 271 -339 -463 -229
4419 -229 71 236 425 714 865 165 -531 -633 -199 488 569 548 417 236 1 -545 -545 -221 596 925 475
4440 475 38 -244 -103 -268 -336 69 440 695 302 -251 -451 -381 -102 82 97 266 261 110 -263 -521 -415 -87
4462 -87 250 131 -141 -114 -221 -313 -426 -293 -94 181 86 -213 -509 -349 -163 -182 -171 -230 -112 -64 -185 -357 -266
4485 -266 -130 148 13 -294 -367 -350 -69 -199 -244 -78 222 109 -186 -354 -301 37 270 49 -52 29 167 89
4507 89 -337 -161 35 376 510 37 -101 -81 45 -5 -149 97 529 435 306 -222 -227 115 165 190 120 289 445
4530 445 242 -176 -220 -60 227 336 171 70 263 192 62 -228 -112 257 368 313 5 2 30 93 -40 -164
4552 -164 -27 274 323 46 -188 -163 -30 -21 -116 -80 -3 314 236 -153 -247 -137 -94 21 34 62 106 127 -34 -308 -358
4577 -358 -110 55 116 85 34 -51 -55 -241 -388 -246 83 384 117 -269 -266 -249 -231 -360 -240 152 285 240 -136 -469
4601 -469 -401 -145 -227 -149 22 273 191 -194 -463 -517 -134 138 322 196 65 86 -131 -395 -332 -19 209 393
4623 393 191 -129 -204 -71 -101 -254 19 328 463 94 -228 -277 -98 145 110 169 343 309 271 -209 -170 63 201
4646 201 345 263 246 106 4 62 86 150 186 442 356 16 -79 -52 133 158 92 69 184 158 2 -224 -184 38 268
4671 268 205 33 -107 -56 -96 -169 -134 -51 215 78 -125 -364 -416 -83 20 -43 40 31 91 -172 -489 -453 -116 264
4695 264 209 43 -149 -215 -291 -308 -289 -59 249 300 -171 -254 -337 -278 -186 -16 33 214 212 -10 -320 -344 -315 -50 104
4720 104 117 87 -39 -94 -340 -306 -75 156 268 311 112 -119 -200 -294 -112 -103 137 394 213 33 -250 -351 -92
4743 -92 150 208 305 325 360 -43 -151 -203 -93 272 368 395 221 249 93 -132 -215 64 298 547 346 146 -33
4766 -33 39 67 21 58 378 477 381 9 -132 -144 -25 260 173 184 236 383 173 -123 -227 142 267 208 171 69
4790 69 122 132 -133 -254 -140 181 288 80 -138 -172 -37 8 15 -198 -14 162 155 -244 -235 -134 -71 -99 -102 -185 6
4815 6 -40 -149 -248 -233 -107 -16 -83 -359 -202 -113 19 -121 -178 -178 -18 -110 -206 -270 -93 -22 10 -218 -337 -190 44
4840 44 -101 -235 -198 -38 218 30 -166 -323 -187 52 6 -82 -91 192 284 0 -269 -130 161 273 143 -77
4862 -77 4 195 42 -179 -158 43 378 333 143 87 48 53 -51 -61 38 362 499 144 82 -16 178 74 50 120 402
4887 402 503 441 -68 -61 -106 146 226 210 192 283 292 -104 -330 -204 210 294 303 183 151 137 -8 -108 -223 243 368
4912 368 283 59 -20 -107 -76 -72 -219 10 227 388 155 -159 -276 -138 -110 22 29 13 95 68 -163 -446 -141 -82
4936 -82 151 127 -9 -34 -87 -192 -327 -301 13 59 219 -39 -252 -294 -230 -283 -256 -98 95 58 -23 -220 -275 -180 -54
4961 -54 28 -97 0 123 -40 -307 -388 -224 101 135 -60 -164 -148 -156 -32 -197 -59 -5 153 77 -53 -101 -49 147
4985 147 -78 39 73 104 25 -68 -62 90 123 222 64 119 78 56 100 40 190 209 202 212 58 -122 -26 233 316 280 212
5012 212 253 129 76 -67 -38 290 332 231 367 -35 -47 -29 -20 95 167 357 301 104 -21 -188 15 147 117 249
5036 249 216 190 49 -232 -183 -148 46 294 220 60 -71 -1 -189 -228 -85 57 236 225 112 -245 -183 -243 23
5059 23 -25 63 294 47 -32 -305 -283 -146 -5 174 135 99 -98 -162 -231 -309 -201 -18 155 135 -10 -25 -74 12 -77
5084 -77 -158 139 221 134 -91 -134 -137 -34 -45 -61 104 29 83 -48 -205 -166 108 32 50 -38 -7 140 176 -11 -191 -96
5110 -96 135 118 2 13 69 24 50 -74 -105 18 132 47 -77 -135 -10 165 28 -89 -67 170 144 50 -53 64
5134 64 174 51 -76 -115 92 224 138 -84 -103 15 215 50 -117 42 138 317 22 -99 -114 129 53 -75
5156 -75 -90 -15 106 213 -16 -325 -62 30 131 -26 -11 -4 36 20 -110 -173 -40 48 16 105 -138 -25 49 29 -110
5181 -110 -133 2 62 -12 -38 -28 -76 -71 -383 -283 -93 111 48 -131 -70 -92 -63 -111 -176 -154 114 173 54 -156 -203 -291
5207 -291 -86 -156 -41 -71 145 79 -145 -235 -302 82 83 16 77 218 27 -99 -302 -172 68 155 231 122 89 -50
5231 -50 -22 -206 -290 -43 238 430 46 -161 -124 -191 -59 -145 -43 180 239 99 -226 -198 -131 -22 113 68 285
5254 285 155 122 -106 -141 -196 51 143 132 116 53 90 -68 -103 -47 101 180 51 21 -53 -19 79 -11 -141 -25 125
5279 125 117 -80 -141 -50 -99 -9 53 39 200 18 -17 58 -45 -44 8 18 -112 -177 174 29 71 -7 -165 -46 -2 -2 -121
5306 -121 -106 -8 224 59 -143 -92 40 -10 -22 -152 -20 131 127 4 -16 -142 61 56 124 1 -64 -26 -87 -135 -53
5331 -53 94 155 39 25 65 20 -39 -158 -59 200 269 260 114 -76 52 1 -123 -55 56 155 152 -64 13 -151 -34
5356 -34 -45 -21 73 173 -18 42 -64 -164 7 13 13 124 115 178 -1 -126 -176 -82 -2 135 132 121 60 -5 40 -132 -109
5383 -109 -21 242 120 181 -33 -129 -135 85 -9 86 77 149 18 15 -27 -145 -125 16 64 72 67 36 80 -119 -111 -164 170 57
5411 57 98 6 96 -84 -58 -97 -3 55 -35 45 41 -29 -13 -96 -99 -104 -69 25 85 -25 -184 -201 -87 -70 -9 24 36 147 34
5440 34 -15 -127 -14 -57 90 -46 -71 -93 12 -69 -144 -117 -110 48 -56 15 -21 44 38 -88 -5 -43 67 74 13 32 -80
5467 -80 -185 84 -39 -155 -116 66 65 -22 -98 -32 -55 -29 4 -89 -10 79 45 80 -126 -89 -35 19 -22 70 217 178 -56
5494 -56 -57 -122 -174 97 -44 93 38 121 133 35 -134 -60 28 129 80 16 39 91 -64 -109 -70 -123 101 160 -42 -97 -42
5521 -42 -38 -106 -70 -67 220 127 -12 -180 -102 -42 14 -3 -52 71 207 0 7 -283 -148 -54 -3 -21 -96 22 106 -147 -179
5548 -179 -42 -85 66 31 -46 -57 117 57 -74 -183 -45 138 106 -23 -85 -119 64 -29 -36 -75 5 122 106 -190 -172
5573 -172 78 44 -24 -45 20 135 194 31 -269 -162 23 51 28 -149 46 140 134 -68 -184 -85 221 221 -99 91
5597 91 11 138 96 -18 -75 105 97 56 55 19 3 96 -132 3 39 147 194 36 -155 2 188 148 82 -93 106
5622 106 165 87 -29 -130 43 79 111 70 27 67 118 61 -55 -63 81 133 -4 -5 81 143 -17 -65 -44 26 105 -7 100
5649 100 -76 157 3 0 -32 -66 3 21 74 -2 55 -60 55 -152 -233 -76 145 198 14 -137 13 18 68 18 -119
5674 -119 -62 143 100 -215 -163 -125 -73 -64 -67 47 52 142 -81 -90 -67 -17 34 88 -52 28 66 19 -104 -300 -151 90 -22
5701 -22 47 -7 10 -49 -1 -183 -70 172 224 109 -83 -167 -29 147 -43 -54 78 61 137 -11 -11 -122 44 -50 -11
5726 -11 98 37 251 -98 -8 -215 43 34 161 -84 24 76 26 101 13 193 190 165 118 20 45 26 70 41 5 143
5752 143 118 181 104 -43 -99 58 143 49 -6 0 19 89 70 -13 -24 -8 111 47 -51 60 94 -13 -48 -23 12 139 -21
5779 -21 67 153 -62 89 -73 -75 18 16 77 -101 -120 -16 24 88 -24 -170 29 57 -59 -50 108 -50 101 -8 -25
5804 -25 -12 20 -31 17 -33 -28 23 -138 -63 -96 -112 -58 70 -104 -56 -56 -32 100 74 32 -48 -58 -12 -110 -217 -216 -36 40 -25
5833 -25 -64 3 -88 -33 -117 -56 -55 53 41 69 -100 -42 -92 -35 -56 -80 42 15 -39 43 -58 26 -18 78 108 57 120 41 8
5862 8 -176 -72 14 123 189 36 158 27 74 -72 -28 124 19 159 -10 -25 65 53 -76 -14 35 150 78 47
5886 47 32 -52 97 52 63 -16 145 134 4 -26 -133 17 8 152 6 88 38 15 6 -91 -169 -69 69 96 59 42 -15
5913 -15 -65 -16 -36 -70 57 68 -20 -69 -95 -14 25 -59 89 7 203 10 -50 -132 14 122 -34 -87 -123 20 9 -38
5939 -38 -188 -122 -19 -64 -99 -196 -22 -24 37 -80 -308 -72 3 13 -118 -221 -154 100 -71 -154 -76 36 -19 -63 24
5964 24 49 111 -50 -40 -173 -12 161 -29 -34 13 81 24 5 -162 -21 27 1 -4 17 34 47 36 92 -142 74 118 46
5991 46 -9 60 8 72 77 -2 110 5 130 197 -33 -97 37 -31 19 93 108 5 142 -24 -30 -115 -65 107 75 63 -34
6018 -34 150 10 30 -114 -50 87 92 -11 -50 -69 109 78 -222 8 -131 43 18 -84 -8 -66 136 65 -11 66 -4
6043 -4 83 39 -184 -35 -46 -11 -45 -21 -36 158 67 -144 -77 -22 45 -10 -15 51 47 -112 -59 -208 -74 58 0 -109 -59
6070 -59 -10 -141 52 -115 33 53 -56 22 -146 62 -82 7 -3 -101 3 104 -90 -21 -33 24 80 49 -76 -16
6094 -16 -19 -4 15 77 28 32 -104 46 -35 33 75 78 51 -113 91 42 151 54 78 9 -3 41 55 -30 -114 128 65 -19 -40
6123 -40 27 88 42 -33 -23 41 97 71 -64 -30 18 75 -44 -17 -1 81 148 87 58 -141 -32 73 -3 48 26 -39 51 -53
6151 -53 -49 -28 57 -34 58 -123 -61 128 -63 -68 -9 -22 67 -18 30 33 -57 46 -46 35 -108 24 103 -64 22 61 -46 -76
6179 -76 -39 120 -62 21 2 -8 -24 -67 -57 -65 -77 -23 9 -37 -35 -64 -108 -49 -16 -16 -40 63 -57 -31 1 -3 -49 -22 70 -26
6209 -26 4 126 -73 5 54 -58 55 42 12 -30 90 -79 -58 15 72 28 8 57 121 -123 -68 35 41 55 30 74 -67
6236 -67 76 44 -3 43 -40 -93 -30 -93 -49 177 2 42 -20 -33 11 93 -70 -9 81 -16 -35 0 11 135 25 -111 86
6263 86 15 96 -18 51 -6 95 16 67 -61 103 128 -8 54 -37 -16 -57 -32 -79 -31 -42 -61 -52 -80 -79 60 -6 -77 13
6291 13 -33 -82 -38 52 4 -34 -100 -79 -31 -80 -59 -56 17 -78 27 -53 6 15 -58 -5 55 -18 120 49 53 20 6 22 -42 -119 -2
6322 -2 73 82 26 -82 -89 47 95 -95 -10 3 37 25 32 -30 -23 -18 101 7 15 85 3 145 -107 -123 -41 88 70 -42 -35 -24
6352 -24 61 96 -106 -42 108 135 13 90 -60 101 39 10 52 11 37 124 -33 -61 -48 4 56 1 -125 112 97 13
6378 13 16 29 36 90 -25 -43 -83 -89 30 -26 128 -48 173 68 55 31 -44 -50 -95 -100 25 -98 107 -4 -122 -117 -79 55
6406 55 6 -82 -113 -21 1 -54 -135 -115 -18 61 -103 -62 -190 -36 71 37 9 -71 -27 6 -51 -146 47 12 -21 -62 -111 14
6434 14 -45 137 -64 -132 -30 -10 -7 -8 -70 -19 -66 -65 -68 -44 -35 -3 21 6 -29 -49 45 -10 45 -33 14 -29 -108 -27 -47 164 8
6465 8 -16 -99 12 50 90 13 -65 121 106 23 -109 -38 87 -1 -20 38 86 122 158 -40 15 42 -36 122 3 -99 10
6492 10 35 4 -15 -40 -41 58 -143 2 -81 -34 -5 9 -55 -123 87 -21 -8 39 77 102 61 -16 9 -17 157 32 -54 -102
6520 -102 -33 -5 -7 -65 -81 111 -44 -76 -8 25 -5 36 -18 -100 -155 13 -66 57 -42 -3 122 -48 24 -73 -58 56 117
6547 117 8 -96 -2 110 -23 -10 8 -79 -81 -127 10 19 -99 86 7 41 94 138 121 -29 48 60 72 -56 -63 -174
6573 -174 -4 -9 78 -19 -31 -99 23 -41 17 19 -83 37 148 38 32 66 -132 -115 -133 -8 -71 -12 49 143 65 30 -44
6600 -44 30 -50 115 124 122 145 -24 32 30 125 -43 41 53 121 -29 -30 20 -10 27 6 -74 -41 24 72 -45 45 76 18 8 -28
6630 -28 -71 42 -114 -62 -85 45 71 -46 0 -32 -20 56 17 -7 84 -33 -3 -87 -71 -10 -16 -38 -58 -119 -97 -109 -74 -167
6658 -167 -90 -5 -85 34 -127 -103 -168 -60 47 53 95 -10 -15 22 -96 22 39 -41 -109 20 -85 61 -9 -36 77
6683 77 10 132 49 9 15 24 -78 124 22 32 62 30 46 35 44 95 10 100 -88 87 26 101 -9 48 57 32 26 101 123
6712 123 -108 -9 -53 -82 11 122 38 19 -38 17 -11 32 -27 85 66 -98 39 -47 29 -15 127 250 36 90 -11
6737 -11 82 88 53 33 30 -21 -85 71 -73 -58 12 91 -69 -44 100 -28 -3 7 9 7 23 7 -76 -129 -73 0 -71 19 -114
6766 -114 80 34 148 -92 -64 91 -31 5 -19 -120 -1 -54 140 -21 -129 0 -84 30 -125 14 -154 -35
6788 -35 18 98 127 -36 -12 58 -29 68 -3 75 -4 43 -7 -13 139 -15 -165 -51 47 -113 26 -5 2 48 73 24 -4 -41
6816 -41 -101 -10 -86 -76 45 49 -53 84 12 165 -32 -27 97 -131 58 118 25 31 -26 -84 1 -21 -30 26 99 -49 19 -64
6844 -64 -9 14 102 -53 -21 -12 47 -42 -59 10 52 68 146 -80 56 163 -1 31 16 -118 73 87 -49 20 -16 -34 49
6871 49 -23 -27 -18 5 -76 -72 -13 -13 53 -19 53 41 11 -20 -72 -43 -4 -57 6 -77 164 57 -52 60 108 11 22 -31 -8 93
6901 93 50 31 85 -70 23 44 -20 -14 -22 -37 7 63 -67 33 148 -13 -37 2 51 -4 -103 26 -25 16 13 45 -24 -2 32
6930 32 -2 -72 -13 -22 -29 -65 -25 138 1 -74 44 -1 38 -67 28 80 -82 -16 -5 -43 -31 -97 -65 9 -43 -101 164 49
6958 49 -65 -54 -9 -2 -30 1 -20 23 -17 60 56 -2 35 7 -41 95 -7 -90 -92 70 -20 86 16 9 -27 -4 -101 -94 -58 2
6988 2 -59 35 -47 -76 -123 -13 -10 -12 -8 -33 -12 25 3 -77 8 28 20 -5 119 12 21 11 79 100 137 71 132 -12 -77 49 1
7019 1 66 86 -183 65 131 -46 9 46 -42 5 -19 -16 -21 -59 37 42 31 -86 -62 -9 -137 -54 103 95 -31 59 73 -21 107
7048 107 -59 15 -71 -5 3 61 46 65 -67 -79 -63 -40 -77 -51 34 -14 45 -23 1 75 64 55 -24 88 -61 69 -13 -115
7076 -115 102 128 -33 -34 58 -84 18 39 0 -54 -97 -122 -93 46 68 -126 60 137 -22 -93 77 -47 -89 43 7
7101 7 45 10 -89 24 6 -60 6 98 -59 -16 107 38 -41 -37 13 -21 98 44 16 33 -10 6 24 -53 76 21 28 -21 -112
7130 -112 -27 -29 -101 62 42 -3 79 -55 14 -50 -26 81 59 105 46 172 41 -36 -62 -30 -36 -83 -59 -30 62 186 3
7157 3 -14 -41 7 52 9 -106 -48 38 -123 -9 -135 -33 41 81 -8 24 27 42 10 -48 -5 -49 4 30 -72 -108 -38 23
7185 23 -58 35 -46 19 -30 20 -4 -23 29 6 79 -78 -72 74 11 63 18 -94 3 95 91 12 -42 59 37 -24 42 52 -47
7214 -47 73 -80 14 13 -47 50 -40 9 1 39 13 12 -51 -49 -31 -119 -68 -99 -43 27 -58 -1 -12 40 -74 3 -52 10 120 -11
7244 -11 40 -5 -72 -89 46 18 7 40 34 -77 -40 76 34 25 58 -6 -5 26 59 16 16 -17 -49 -5 -31 35 -2 34 16 -27 5
7275 5 86 58 -57 -127 57 -123 -22 185 4 98 -45 4 -4 58 -63 -9 31 -57 -49 -57 74 78 -15 -68 -109 -33 89 -6
7303 -6 -53 -19 84 5 13 -21 196 9 -14 -85 -13 -91 104 -10 -1 -3 25 -2 14 -13 12 -49 -11 -45 19 22 159 92 -34
7332 -34 2 -20 -12 -117 -201 -98 31 -81 5 -14 -61 5 107 -16 -6 -31 24 -36 -35 -31 -26 9 -21 -37 11 -120 28 31 40
7361 40 -45 -79 78 19 62 -41 128 35 62 -182 23 39 141 10 37 -11 -15 -71 -66 25 -1 38 -2 -61 -19 -33 16 81
7389 81 5 -72 -1 7 54 -31 -36 14 -78 17 34 -117 -36 28 -47 20 40 68 -16 -22 4 1 20 19 -69 20 -78 -24 111 -34 21
7420 21 -74 46 -18 48 16 -32 18 4 79 -79 56 -52 154 -11 -87 -8 90 -84 -44 -82 90 78 -70 -82 -73 144
7446 144 38 -40 -114 -44 -34 31 47 -61 -6 98 -73 73 -89 40 -12 -21 156 -13 -8 20 8 57 -18 33 54 -69
7472 -69 43 -74 -30 106 57 -69 -56 29 101 102 -72 -23 -44 -21 5 33 39 40 14 45 29 131 9 24 -103 219 20
7499 20 -9 46 4 27 39 43 -30 183 71 -2 18 -19 36 -24 -61 12 -10 26 -62 14 9 71 12 -78 92 7 -65 -116 12
7528 12 -28 -16 30 -9 -105 -1 -25 -148 9 97 -75 69 110 -85 26 -20 -110 89 26 62 9 -103 105 35 -15
7553 -15 27 -84 -7 4 -20 64 75 -42 -16 57 -3 -40 -54 -13 47 29 -62 25 -42 -81 60 19 56 15 -62 -29 -67 52
7581 52 85 -152 -56 12 45 -39 -31 -82 -79 -24 61 -5 26 -98 19 25 136 26 -47 4 -117 109 111 -5 17 29 -36 -74
7609 -74 8 -116 -41 54 -16 2 87 -24 0 -68 -72 -48 133 -62 22 -4 17 61 -51 -7 -6 -28 56 -23 -79 -46 -57 -43 -45
7638 -45 -21 33 -29 -21 -53 -107 11 43 -20 -63 70 3 74 -16 -49 -24 15 -6 -21 145 76 28 -111 131 49 38 21 -17
7666 -17 39 110 50 66 -73 -85 -44 73 7 136 30 -31 -34 50 -24 71 120 44 -118 55 -31 -102 17 -68 -13 -36 -59
7693 -59 -41 -7 -82 39 -28 -51 92 58 20 -51 9 11 64 -26 8 -7 -13 33 74 12 -7 -15 -41 98 -90 12 53 39 -87
7722 -87 3 -58 -22 7 -60 15 -56 26 63 70 -48 -87 -75 -10 -6 41 71 -13 48 -9 58 -76 114 122 -14 42 50 10 21 -10
7752 -10 58 84 34 39 -35 -146 -50 94 -65 52 109 56 8 21 -34 -23 86 76 54 -44 -128 33 175 78 -91 -45 39
7779 39 -17 -1 95 -29 42 -15 -150 7 -35 1 -39 13 -7 -47 52 32 -89 -68 15 74 -28 -79 -111 8 47 -18 -41
7806 -41 10 -37 -90 -72 -80 -54 -19 18 100 -50 50 -28 35 68 -92 -63 43 31 40 -15 -36 -63 -21 -35 -10 26 2 -110 2
7835 2 -60 -49 -17 -3 -41 32 53 -69 48 -71 -51 23 -40 -7 -40 -68 70 -60 -157 -75 -72 16 -37 53 44 -42 5 1 -78 42
7865 42 -129 -24 156 -25 3 -51 1 86 14 -56 118 45 -12 24 -98 60 98 -48 -4 -67 -17 92 -7 -30 -43 -66
7891 -66 138 31 -67 88 122 -27 -186 -79 54 -73 44 71 -36 -20 -81 125 -53 -17 -34 53 -76 -4 41 38
7915 38 -75 27 -71 -8 103 -58 65 -36 -99 -15 0 -74 -106 23 46 112 34 -79 26 1 -108 -91 -60 -13 -54
7940 -54 -178 -120 28 -87 -65 -27 -29 80 126 81 -76 34 97 -52 5 -4 81 13 45 11 -99 -106 -26 -132 103 -103
7966 -103 -46 74 -103 -19 -130 90 -89 -125 18 -93 -81 -51 85 42 -44 89 106 16 -107 -49 -16 -124 66 154
7990 154 -56 39 -80 -39 120 36 -42 0 22 99 37 101 100 -48 -93 68 65 -38 105 3 -68 -85 -58 4 -30 67 62
8017 62 25 -21 -25 -90 -10 -37 70 95 53 1 27 -41 -28 -38 163 -24 -41 63 -119 15 34 5 -87 106 12 78 -1
8044 -1 -103 115 56 -84 -18 -103 -100 181 73 12 -7 34 -123 47 -15 43 -84 42 -47 -23 -110 49 36 -73 -37 77
8070 77 44 -46 -110 -12 63 -48 -1 25 84 99 3 -4 -128 2 83 -153 -72 5 -30 148 -12 -125 25 99 17 2 -52
8097 -52 143 5 91 -86 30 73 56 8 26 0 -3 -8 9 -62 3 58 40 72 37 -4 46 57 62 22 48 99 125 43 -37 35
8127 35 25 75 25 -5 26 -156 -51 -70 -141 16 83 52 35 -46 -16 34 35 38 -8 26 -13 24 -131 -72 15 68 -38 -58 -30
8156 -30 21 -104 59 92 -73 -87 -85 -82 -32 104 19 -56 0 -123 48 -71 -23 -79 34 6 -11 -35 41 -107 -29 70 -202
8183 -202 -44 100 90 -81 -137 -154 -38 60
8191F0
$$ Imaginary data points
##PAGE= N=2
##DATA TABLE= (X++(I..I)), XYDATA
0 0 0 0 0 8 -8 8 -8 16 -16 18 -32 34 -41 50 -66 75 -91 113 -132 154 -181 212 -245 279 -326 373 -423 481
28 481 -546 612 -694 780 -873 975 -1089 1214 -1349 1498 -1666 1840 -2040 2261 -2504 2769
44 2769 -3069 3406 -3785 4217 -4718 5296 -5980 6807 -7821 9108 -10796 13128 -16562
57 -16562 22151 -32823 60646 -287318 -644078 -120616 68032 -138833 -453634 -310865 -29772
68 -29772 -61498 -464029 -620803 -299439 115443 59274 -310632 -467911 -219960 -23193 -184626
79 -184626 -441826 -327079 49438 184381 -116299 -421875 -338587 -28554 50280 -148284
89 -148284 -251896 -51789 156544 42789 -260514 -330052 -73716 159138 85783 -121500
99 -121500 -137887 32031 90067 -75686 -218542 -104463 132037 180801 -4212 -157125 -93634
110 -93634 49528 52559 -59066 -81812 40957 134511 55773 -99513 -133953 -15512 96907
121 96907 78033 -10665 -32875 26435 56258 -4096 -70636 -35231 75660 131210 66008 -37464
133 -37464 -59053 9871 68800 49163 2959 20556 89115 100467 10095 -77814 -42134 80938
145 80938 138014 66787 -20509 -5195 66475 60401 -31184 -66738 31672 144306 113066 -27734
157 -27734 -94019 -14018 75380 39883 -50784 -36666 77282 115959 -1827 -127336 -90787
168 -90787 50078 94439 -4945 -80067 -13178 80910 36461 -98215 -124804 3605 108008
179 108008 47437 -75755 -77413 31776 70240 -28197 -110887 -41422 86681 87699 -34729
190 -34729 -93719 -6278 83890 34943 -73849 -68344 48762 103279 19358 -68376 -27574 70389
202 70389 67324 -33315 -73390 14737 103896 67921 -29366 -39969 38772 68707 -4036 -61599
214 -61599 -840 100410 98157 363 -50906 2649 56953 22063 -33795 1659 95076 110282
226 110282 15476 -63408 -30025 46733 52518 3710 8011 78410 102504 19262 -73584 -54921
238 -54921 44245 89737 43972 6272 42220 76136 19406 -71276 -65418 42725 116802 73378
250 73378 -6068 -11787 31117 19924 -46601 -58192 31384 116740 84571 -22116 -68319 -19215
262 -19215 24911 -3517 -36842 8353 83182 70426 -34081 -103419 -57608 27114 39303 -8379
274 -8379 -19464 24087 34538 -34288 -100996 -70545 23879 64750 14859 -43493 -39080 -9293
286 -9293 -23880 -65105 -55697 14666 60084 19089 -57791 -80595 -41094 -7546 -14151 -20893 5825
299 5825 29834 1619 -59653 -83759 -44669 10300 28936 13334 -2818 -11350 -28026 -51556
311 -51556 -53173 -17693 28945 47041 26185 -10858 -39449 -49218 -37927 -7308 28130 45494
323 45494 35411 9053 -19579 -42638 -48327 -21570 30667 68296 56074 8223 -27703 -30525
335 -30525 -21300 -17313 -410 44430 82040 59916 -13124 -64379 -44494 10117 34177 25065 31289
348 31289 59877 53123 -15932 -79819 -55785 33954 85739 54190 6322 9690 30985 527
360 527 -60615 -56799 34291 110482 79154 -13310 -49693 -7598 22731 -12078 -41918 10465 93817
373 93817 88360 -15147 -90629 -50534 33021 42635 -12165 -22725 38986 70430 -762 -93842
385 -93842 -83091 18463 75581 24157 -45037 -30637 27646 19235 -59214 -90838 -15685 70999
397 70999 51456 -44072 -83605 -26195 26634 -7957 -69338 -51169 29682 54189 -21262 -96361
409 -96361 -71030 11502 33712 -25461 -67183 -27086 29246 8314 -66790 -87347 -19433 44085
421 44085 18174 -54149 -69456 -13945 22475 -14704 -64801 -46162 19958 39672 -16920 -72081
433 -72081 -51630 11860 30376 -13887 -48772 -20478 27360 20273 -36231 -61750 -15890 42081
445 42081 36072 -20675 -46621 -9166 32568 15687 -33517 -37699 16603 56730 24326 -38243
457 -38243 -45731 10438 49144 16885 -34397 -23781 37133 57897 1651 -54444 -28861 44033
469 44033 61378 1176 -44698 -6488 58948 50521 -24869 -57233 4881 75417 53537 -26618
481 -26618 -44523 26785 79058 29492 -50665 -39325 53831 96044 27481 -48511 -19643 67841
493 67841 78651 -6358 -57981 8873 102766 88456 -13543 -55894 18551 92950 54318 -35792
505 -35792 -32829 68001 119672 40403 -60656 -42443 61469 96651 17990 -45551 7717 96665
517 96665 78561 -33002 -82456 -208 96581 74812 -21950 -46369 29765 77413 10650 -78386
529 -78386 -54270 57314 102465 22084 -67028 -46065 34873 43167 -33024 -68871 3200 86715
541 86715 59046 -47325 -91088 -22683 51395 30781 -35448 -33435 39049 67203 -5176 -85082
553 -85082 -60999 36530 79182 23563 -35963 -14454 41498 32860 -35174 -57911 12926 90789
565 90789 74864 -9177 -48391 -2670 47892 29116 -17535 -4365 63230 87937 23976 -50465
577 -50465 -39979 35643 73766 36379 -5034 14644 56931 42054 -23854 -49482 8408 79310
589 79310 74009 6688 -30133 -241 33528 11929 -28423 -13296 49921 74487 18579 -50891
601 -50891 -50312 6721 37261 10544 -16240 5692 39092 18483 -44472 -69334 -19603 42690
613 42690 43641 -4775 -31385 -11841 3498 -22688 -51978 -28539 30747 51916 6608 -49108
625 -49108 -53272 -18527 -1216 -15223 -19189 8594 30592 3998 -50201 -70127 -35083 9708
637 9708 16749 -4150 -14029 -7140 -13564 -42972 -60784 -36561 8656 26595 3023 -30141 -41622
650 -41622 -36401 -34515 -35337 -22892 2400 15613 -1599 -35653 -55178 -46223 -23196 -6027 659
663 659 2184 -1099 -13281 -31358 -41400 -31852 -6921 16407 22405 9665 -9661 -20976 -19186
676 -19186 -9746 1661 14905 27935 31844 18465 -4941 -16691 -4678 19707 34996 33721 27102
689 27102 23765 18532 6253 -2463 7453 32944 49363 40797 18750 6358 9668 14565 13305 15242
703 15242 28079 39653 31529 7874 -7511 -1387 14541 21726 18498 15896 16978 13465 1403
716 1403 -8810 -4657 10568 20859 17286 6602 -496 -1635 -1296 -598 2480 7910 11628 10112 4479
731 4479 -2484 -5986 -2482 6726 12947 9303 414 -2384 3118 6146 -56 -5690 646 12241 10671
746 10671 -6070 -16366 -5194 12335 10153 -9715 -18590 -4356 9008 -1829 -22431 -19639 5629
759 5629 15336 -9636 -37224 -28908 2727 11293 -13537 -31385 -13817 10018 -1969 -37496 -43348
772 -43348 -5756 26148 9512 -29583 -35048 -3906 11309 -13801 -36286 -12155 31745 32390 -15038
785 -15038 -46134 -20798 21235 21801 -8969 -13706 19888 37843 3739 -40385 -31927 20676 49092
798 49092 22421 -12648 -6891 19341 13922 -21354 -30318 10782 51941 38581 -11011 -34155 -11738
811 -11738 12186 3566 -12975 605 31099 30430 -10470 -44837 -33642 4117 22528 10799 -1997
824 -1997 1735 4623 -11626 -33241 -29223 2198 29718 27419 3310 -16653 -20490 -15014 -8476 90
838 90 12668 23693 22951 6673 -16762 -29064 -16554 12897 34647 31113 11847 -955 -1745 -4463
852 -4463 -13226 -10011 18524 49608 44593 2486 -31765 -23158 8230 19466 7468 8814 33609
865 33609 40860 1087 -48246 -44242 12006 52015 33215 -4898 -6404 16065 7048 -36726 -49614
878 -49614 3575 64735 55330 -11318 -48984 -21188 14065 -389 -31017 -10344 48736 60906
890 60906 -4797 -70485 -54462 13607 40085 4558 -20379 10377 42095 7651 -59792 -67021
902 -67021 3350 62745 40779 -19011 -30961 5993 17002 -24857 -52690 -9463 57147 58268
914 58268 -8400 -55225 -30269 15773 14254 -18563 -16257 28868 49221 4526 -52467 -48522 6790
927 6790 39515 17154 -13337 -4455 21125 11297 -28754 -41765 -2901 41044 36408 -4216 -25481
940 -25481 -8812 9597 87 -16481 -6009 23944 32355 4366 -26527 -24963 1600 18051 10025
953 10025 -2120 777 10352 5948 -12234 -21295 -6075 17532 22971 5650 -13202 -13722 -1049
966 -1049 5037 -1989 -7224 2396 16316 11777 -11835 -26851 -12526 13678 19256 -226 -14678
979 -14678 -4257 11065 2516 -20500 -21319 8079 29600 11986 -22163 -26493 1548 18257 -994
992 -994 -23019 -9401 22485 22419 -15337 -38436 -13123 24400 20492 -16318 -28491 2198 26095
1005 26095 2703 -34748 -28360 15118 31854 -3499 -38229 -21056 21009 23023 -17965 -38229
1017 -38229 -5910 29844 12816 -31811 -35238 9655 36290 3796 -39242 -28864 16986 28233
1029 28233 -10354 -35601 -5352 35348 21588 -29860 -44053 -89 38361 18872 -22804 -20566
1041 -20566 19110 28703 -13076 -44559 -14089 39358 42585 -5005 -33178 -7687 22255 6012
1053 6012 -28818 -20070 29285 50080 9583 -38968 -34155 7458 22286 -2887 -16250 11137
1065 11137 37530 14461 -36171 -48140 -7007 31372 22881 -6461 -8060 12364 9668 -24536
1077 -24536 -42869 -12706 32529 38163 4172 -21366 -13727 208 -8369 -22410 -8014 26500
1089 26500 38036 8899 -26561 -29712 -7173 6803 2817 2456 16530 23716 4540 -24619 -30876
1102 -30876 -8452 15598 19793 10344 4224 1875 -6873 -19538 -19999 -2729 17084 21241 8672
1115 8672 -7300 -16047 -17392 -13576 -4705 6944 13359 8807 -3527 -15627 -21438 -19002 -7566 7242
1129 7242 15015 8086 -7703 -18548 -18432 -12814 -7419 449 11478 15643 3522 -17611 -27109 -15347
1143 -15347 3574 11934 9410 7648 8061 103 -16537 -23649 -7305 18996 28986 15902 -407
1156 -407 -4691 -3331 -7673 -10379 2943 26414 34535 16013 -9470 -16882 -6332 3595 6051 11903
1170 11903 24479 27414 9021 -16723 -23332 -6167 13621 18746 15563 15381 12975 -1828 -20892
1183 -20892 -22427 -1708 20280 23263 12069 3105 -1216 -9835 -20647 -17072 4565 23908 20791
1196 20791 1874 -10634 -10656 -10945 -16242 -12902 6627 23509 15574 -9691 -23645 -15617 -4668 -7195
1210 -7195 -10656 1603 18270 12569 -15478 -33154 -19568 3353 5443 -8404 -9196 7436 12018
1223 12018 -10823 -33953 -24157 7248 18755 -1050 -18096 -6596 11700 2631 -23945 -26772
1235 -26772 3692 26702 10971 -18616 -19035 7372 17219 -5343 -23767 -5840 25316 23989 -8107
1248 -8107 -24008 -1228 24626 14944 -13806 -15338 14473 30622 8170 -19730 -11437 19906 27377
1261 27377 444 -18503 -613 26723 21958 -7479 -17284 6624 27302 13967 -12540 -12025 13991
1274 13991 25735 5857 -15336 -6972 16722 19696 -1709 -14733 -461 18564 13779 -6648
1286 -6648 -12566 3462 15984 6729 -9572 -9176 5750 12493 2162 -8777 -5317 5558 6673
1299 6673 -3246 -9395 -3903 5307 5915 -901 -5760 -4407 -1337 -1510 -3784 -3840 -647 2893 3190 -1629
1315 -1629 -8471 -11304 -5958 2117 4461 95 -3080 -293 1471 -5425 -14316 -11136 4553 15369
1329 15369 8370 -6383 -9711 -1602 1303 -7668 -11655 2432 20881 18416 -4455 -19701 -10334
1342 -10334 6082 6473 -3652 -787 16762 21965 732 -23859 -20677 5052 19866 10084 -1988
1355 -1988 3961 14375 4458 -20062 -25461 -121 26235 23104 292 -10170 -1367 2778 -10319
1368 -10319 -19893 -3982 23187 27943 3804 -19432 -17856 -2994 576 -6312 -2957 14214 22287
1381 22287 4518 -21186 -26432 -8598 7964 8204 2232 4243 8394 129 -17438 -24066 -9860
1394 -9860 10043 15867 6629 -3160 -6227 -7956 -12676 -13894 -5182 8115 13414 5760 -7059 -14832
1408 -14832 -14360 -9146 -2820 2788 5847 4254 -1585 -8729 -14023 -13442 -6187 4606 10485 5579 -4928
1423 -4928 -11065 -9066 -5235 -4156 -1814 5557 11780 5936 -9118 -17330 -8837 5954 10499 4280
1437 4280 1009 4938 5028 -6050 -15514 -7118 13342 22144 9743 -6347 -7693 812 1380 -6111 -3911
1452 -3911 12954 24490 12075 -12007 -19656 -5117 9339 7641 1002 6146 16020 9659 -12887
1465 -12887 -25133 -10059 14458 20335 6702 -3220 1312 3686 -8792 -20586 -10156 15597 27144
1478 27144 11502 -9888 -13437 -3555 -1163 -7818 -5512 12681 25652 13477 -12221 -22482 -8999
1491 -8999 6833 7789 2614 7547 16581 11289 -9666 -22467 -10816 11502 19494 10395 1823 3638
1505 3638 4902 -4341 -14534 -8746 10883 22811 14600 -1856 -7603 -2432 555 -3463 -3803 6451
1519 6451 17060 13278 -2396 -12842 -8386 2206 5425 1889 1448 6134 7341 -714 -10561 -10246
1533 -10246 178 8509 6149 -1407 -3614 29 1189 -3912 -8060 -3577 4746 6330 -1038 -8004
1547 -8004 -5894 853 2444 -3171 -6948 -2721 3330 1879 -5758 -8398 -1825 4787 1400 -7515 -9620
1562 -9620 -1989 4387 521 -6761 -6251 1294 3363 -4566 -11681 -6737 4409 6785 -2183 -9570 -5632
1577 -5632 1893 423 -7540 -8788 760 8303 2282 -9624 -11436 -1905 4734 -179 -6988 -4157 4319
1592 4319 4540 -5325 -11814 -5468 5328 6093 -3134 -8010 -2435 3890 930 -6719 -6416 2470 7486
1607 7486 753 -8106 -7057 2062 6391 1388 -4169 -2027 3265 2301 -4269 -6062 1166 8928 7454
1622 7454 -1261 -6457 -3071 2010 2327 420 2713 7861 7845 -87 -8017 -7305 1347 8548 9016 5472
1638 5472 3201 2066 -1697 -6676 -6115 2222 12151 14290 6943 -2626 -6931 -5593 -2786 -1 5252
1653 5252 11734 12905 4576 -7768 -13867 -8895 1372 8454 9567 7875 4900 -1517 -10654 -15039
1667 -15039 -8660 5093 14339 12119 2120 -6191 -9765 -10856 -9903 -3668 7178 14434 10033 -3702
1681 -3702 -15035 -15614 -8374 -915 4039 7611 8772 3265 -8308 -17631 -15512 -3925 7246 9978
1695 9978 5775 4 -5434 -10980 -13664 -9121 1643 11162 11156 2401 -7316 -11509 -9964 -5362 213
1710 213 6229 9609 6603 -2286 -10582 -11961 -5721 2846 8201 8384 4701 -694 -5827 -8320 -5728
1725 -5728 876 8458 11481 7536 -372 -6522 -6907 -2174 3664 7958 9920 8814 3872 -2990 -7037
1740 -7037 -4049 4723 12177 12928 7674 2076 -1449 -2840 -2457 1465 8928 14768 12421 3040 -5406
1755 -5406 -6378 -1221 3933 6838 9017 9860 6376 -2309 -9742 -8847 -29 8028 9054 4919 452 -3004
1771 -3004 -7106 -10471 -8124 225 7769 7253 -707 -8545 -10738 -9210 -7156 -4720 84 4039 2149
1786 2149 -5345 -12862 -13846 -8691 -2953 -623 -378 -902 -2971 -7344 -11419 -10820 -5491 333 2034 -127
1802 -127 -3491 -5795 -6862 -6657 -4781 -1582 1093 1677 -142 -3035 -5052 -4559 -2040 604 1652 797
1818 797 -228 -263 75 -459 -1238 -365 2325 3442 1408 -1205 -118 3572 5167 2376 -714 525 3975
1835 3975 4528 1717 1066 5295 8858 5918 -871 -2371 3631 9170 8114 3832 4111 8061 7717 1043
1851 1043 -3072 2583 12500 14464 6846 281 2354 6906 4959 -275 1646 11284 16386 8500 -3766
1866 -3766 -5550 2896 8991 5515 1240 5148 11203 7560 -5321 -11167 -1883 10832 11606 1977 -3383
1881 -3383 816 3917 -2543 -10224 -5379 8648 13999 3450 -9844 -10189 -909 2872 -2479 -5031
1895 -5031 2677 10270 4339 -10698 -16218 -5511 7361 7277 -1492 -4445 746 2317 -6410 -14174 -7570
1910 -7570 7485 12966 2765 -9815 -10362 -2621 -249 -5076 -5781 3211 10844 4341 -11058 -17343
1924 -17343 -7993 4390 5871 -610 -2693 1731 1730 -7560 -15738 -9872 5662 13348 5663 -6621 -9353
1939 -9353 -4146 -2159 -6171 -6133 3762 13279 8808 -6660 -16126 -9840 2416 6510 2479 877 5621
1954 5621 6471 -3383 -14499 -12117 3482 15239 11225 -770 -5267 -1092 58 -5886 -8249 1617
1968 1617 15387 15213 176 -12944 -10188 1293 5275 805 -99 7734 12339 2471 -12935 -14845
1982 -14845 -118 13403 11065 619 -1841 3959 4368 -5578 -11954 -1796 14725 17609 3617
1995 3617 -8759 -5811 3884 4335 -2708 -2239 9539 16704 6824 -9360 -11978 984 11614 7530
2009 7530 -662 1267 9180 7824 -4933 -12228 -2619 12336 13943 2031 -5766 -1047 5363 1259
2023 1259 -6991 -4786 7535 13618 4507 -8203 -8860 826 5571 247 -4288 786 8081 5003 -5975
2038 -5975 -10830 -3125 6206 5720 -1349 -3691 943 3640 -1544 -7090 -4550 4030 7226 1963 -4439
2053 -4439 -3719 873 1839 -1628 -2901 1206 5097 3284 -1969 -4069 -954 2648 2466 345 -69 1799
2069 1799 2724 898 -1347 -1055 1523 3351 2473 892 122 1118 2013 1670 488 271 1484 2837 2636
2086 2636 997 140 1103 2738 2169 69 -588 1731 3822 2911 -139 -1081 1050 2701 1324 -985
2102 -985 -83 3257 4068 395 -3208 -2194 1660 2552 176 -1387 735 2837 280 -4138 -4686 -133
2118 -133 3485 2047 -1865 -2436 -411 -549 -3556 -4598 -1262 3215 2905 -1810 -4918 -3896 -1717 -1621
2134 -1621 -2533 -949 2151 2002 -2331 -6184 -5555 -1845 411 425 195 587 -390 -3588 -6072 -4731 -586
2151 -586 2342 2353 467 -1134 -2703 -4724 -5027 -2285 1997 3913 2344 -525 -2711 -3973 -4547 -3145
2167 -3145 899 4653 4788 946 -2919 -4027 -3186 -2317 -562 3328 6297 4906 -889 -5512 -4669 -774
2183 -774 1969 2814 4221 5720 3872 -2081 -6649 -4556 2318 6679 5794 3400 2692 1713 -2017 -5584
2199 -5584 -3154 4632 9943 7526 1214 -1843 -1124 -864 -2215 -799 5258 10237 7225 -916 -5822
2214 -5822 -3443 1026 2378 2111 4431 7468 5167 -2305 -7460 -4562 2665 6340 4482 2331 2637
2229 2637 1886 -2612 -6625 -3942 3716 8251 5581 -145 -2538 -1888 -2043 -3449 -1901 3491 7196 4341
2245 4341 -2606 -6440 -4467 -1040 350 654 2217 3794 1237 -4394 -7684 -5063 386 3218 2341
2260 2341 428 -1002 -2593 -4862 -5895 -3217 1533 4234 2461 -1446 -4383 -5038 -4137 -2324 357
2275 357 2590 3139 991 -2625 -5212 -5213 -2530 1530 3926 3607 833 -1907 -3650 -3503 -2548 -58 3686
2292 3686 5844 4227 -617 -4450 -3961 -584 2109 3191 3995 4929 3496 -1242 -5329 -3913 2003 6722
2308 6722 6100 3000 1701 1574 -262 -3270 -2685 3313 9014 8058 1981 -2381 -1503 993 704 -93 2880
2325 2880 7906 8280 1693 -4732 -4131 1288 4663 3217 1916 3921 5501 1888 -4515 -5787 133
2340 133 6098 5578 1263 -875 1075 1346 -2307 -5204 -2029 4419 6213 1432 -3812 -3750 -556 -167
2356 -167 -2690 -3368 554 3875 1841 -4078 -6573 -3387 424 214 -2815 -2960 179 1592 -1843 -6059
2372 -6059 -5539 -966 1779 -554 -3630 -3001 111 571 -3013 -5860 -3541 1225 2156 -1301 -4039 -2162
2388 -2162 1185 520 -3431 -4815 -848 3565 2543 -2193 -3936 -556 2229 470 -3381 -2780 2526
2403 2526 5135 1282 -3927 -3535 1541 3930 605 -2535 26 4804 4363 -1536 -5036 -941 5053
2418 5053 5221 38 -2509 1199 4692 2019 -3359 -2876 3487 7470 3458 -3052 -3421 2123 4717 1091
2434 1091 -2581 252 5706 5053 -1669 -5734 -1472 5493 5827 281 -2620 732 3908 771 -4445
2449 -4445 -3501 3708 7873 3380 -4209 -5225 -277 2538 -244 -2756 692 5640 3967 -3945 -9043
2464 -9043 -4880 2493 4380 453 -2098 -71 1103 -3123 -8708 -7075 1058 6799 3875 -3468 -6325
2479 -6325 -4075 -2742 -4724 -5356 -302 5879 4919 -3398 -10284 -9022 -2898 357 -362 -459 2090 2388
2495 2388 -3277 -10315 -10561 -2902 4704 5210 715 -2452 -2513 -3452 -6702 -7503 -1845 6043 8146 1796
2511 1796 -5477 -7190 -4329 -1718 -1279 577 4797 6504 1748 -5982 -8924 -4578 2032 4590 3282
2526 3282 1937 1727 -36 -4429 -6934 -3475 3691 7524 4886 -557 -3192 -2529 -1791 -2252 -679 3464
2542 3464 6633 4475 -1593 -5680 -3857 433 2998 2764 2354 2991 2247 -1269 -4309 -3016 2030 5980
2558 5980 5157 1251 -1061 -421 11 -407 -54 2919 5845 5135 472 -3358 -2536 1146 3526 3312 2763
2575 2763 3107 2591 -48 -2963 -2452 2045 5682 5430 1871 -719 -1081 -842 -1005 -350 2348 4971 4624
2592 4624 596 -3397 -3925 -1418 1258 2261 2409 2615 1716 -1042 -4088 -4526 -1372 2253 3623 2102
2608 2102 -280 -1984 -2838 -3626 -3045 -789 2126 3233 1385 -1987 -4101 -3863 -2442 -827 208 1053
2624 1053 1266 67 -2446 -4299 -4083 -1682 799 1253 374 -726 -1212 -1721 -2700 -2761 -1394 868 1813
2641 1813 629 -1268 -1903 -1098 -587 -1087 -1259 24 1807 1732 -30 -1496 -922 470 536 -497 -532 1432
2659 1432 2895 1950 -582 -1520 -315 970 693 -76 858 3007 3158 486 -2202 -1971 680 2276 1620
2676 1620 987 1959 2664 830 -2443 -3145 -329 3259 3708 1721 124 336 -20 -1672 -2671 -410 3431
2693 3431 4801 2358 -1389 -2485 -1205 -222 -329 153 2440 3856 2064 -1986 -4191 -2252 999 2328
2709 2328 1504 774 1157 765 -1621 -3717 -2539 1304 3771 2540 -724 -2321 -1478 -838 -1285 -1493 663
2726 663 2947 2353 -1341 -4365 -3261 -43 1644 645 -562 -47 333 -1495 -3950 -3612 125 3366
2742 3366 2227 -1362 -3593 -2368 -910 -1171 -1702 186 2852 2481 -1808 -5372 -4318 -114 2544 1482
2758 1482 49 382 634 -1729 -4777 -4303 664 5066 4323 117 -2795 -2345 -1288 -1946 -1833 1361 5433
2775 5433 5120 -95 -5026 -5033 -1150 1747 1886 2034 3326 3369 -431 -5177 -5743 -982 4332 5327 2605
2792 2605 253 -98 -1115 -3383 -4061 -390 4992 6913 2915 -2156 -3919 -2180 -743 -386 737 3838
2808 3838 5325 2455 -3077 -5616 -3045 1282 3231 2288 1504 1848 917 -2323 -4800 -2976 1885 5000
2824 5000 3448 -351 -1803 -1088 -856 -1997 -1913 1063 4142 3429 -771 -3912 -2952 68 1210 27
2840 27 -299 1288 2109 -239 -3476 -3541 124 2983 1920 -917 -1659 57 782 -1120 -2577 -740 2620
2857 2620 2743 -597 -3148 -1679 1322 1557 -467 -1374 532 2138 542 -2471 -2564 734 3138 1716
2873 1716 -1314 -1797 351 1263 -291 -1587 2 2811 2753 -436 -2783 -1354 1493 1914 110 -399
2889 -399 1234 2302 567 -2080 -2265 642 2963 1984 -128 -574 686 1097 -565 -1650 -173 2442
2905 2442 2742 699 -1262 -837 583 798 -439 -508 900 2336 1407 -762 -1779 -661 904 857 -389
2922 -389 -449 956 1598 199 -1644 -1572 -188 1083 452 -519 -379 816 723 -855 -2264 -1538 409 1250
2940 1250 400 -611 -269 493 -379 -2021 -2429 -410 1737 1706 -73 -1291 -867 -487 -1078 -1799 -744 1682
2958 1682 2549 822 -1852 -2498 -1301 -318 -414 -209 1152 2199 1101 -1806 -3234 -2052 314 1337
2974 1337 1039 729 956 375 -1439 -2966 -2039 766 2694 2274 631 -508 -814 -1194 -1632 -955 921
2991 921 2820 2761 532 -1513 -1906 -1129 41 704 1507 2048 1937 275 -1681 -2381 -786 1189 2231
3008 2231 1739 799 208 -475 -1221 -1263 -292 1538 2542 1752 -88 -1341 -1169 -357 97 455 994 1569 1144
3027 1144 -615 -2016 -1710 190 1431 1358 176 -211 -63 -563 -1346 -1280 275 1897 1572 -404 -1814
3044 -1814 -1484 -302 -31 -236 129 1185 1245 -578 -2410 -2231 -80 1473 1229 11 -365 -100 -535 -1881
3062 -1881 -1991 145 2177 2201 -6 -1669 -1778 -894 -536 -434 364 1882 2064 20 -2457 -2940 -927
3079 -927 839 1261 846 876 775 -432 -2155 -2706 -893 1787 2783 1385 -249 -963 -1079 -1302 -1476 -287
3097 -287 1871 2999 1646 -805 -2506 -1790 -354 261 562 1380 2075 1372 -931 -2768 -2237 9 1909
3114 1909 1904 807 289 274 -652 -1947 -2019 224 2511 2643 675 -1108 -1148 -431 -215 -584 10 2130 2695
3133 2695 1074 -1554 -2061 -359 1208 1142 494 829 1771 1298 -965 -1975 -516 1899 2365 1021 -91
3150 -91 629 1071 378 -903 -759 1377 2700 1580 -409 -932 441 1321 356 -396 316 1686 1825 -18
3168 -18 -1243 -454 1196 1398 46 -625 245 1223 579 -892 -1094 342 1268 620 -783 -1117 117 985
3186 985 142 -970 -734 353 900 -309 -1582 -1015 371 831 -349 -1389 -840 427 473 -718 -1445
3203 -1445 -497 829 443 -855 -1581 -346 810 347 -1042 -1264 18 921 205 -1177 -1199 325 914
3220 914 14 -1191 -804 705 1167 -146 -1248 -607 728 946 -484 -1033 -11 1271 941 -812 -1514
3237 -1514 -159 1234 727 -475 -578 698 1195 -99 -1465 -1037 979 1778 726 -579 -574 370 307 -696
3255 -696 -1011 411 2002 1636 -387 -1593 -879 295 512 84 188 1439 1672 60 -1850 -1784 -14
3272 -14 1610 1646 544 337 547 13 -1266 -1685 -24 2027 2496 1054 -596 -1112 -625 -333 -296 186 1665
3291 1665 2580 1243 -1094 -2425 -1422 443 1339 1097 894 1022 427 -1277 -2584 -1776 664 2367 1820
3308 1820 107 -1029 -992 -1084 -1463 -1294 546 2360 1893 -408 -2556 -2345 -932 154 193 540 1173 1116
3326 1116 -685 -2847 -2864 -604 1514 1460 263 -364 -569 -911 -1881 -2099 -368 2005 2349 382 -1602
3343 -1602 -1976 -919 -323 -312 211 1267 1627 256 -1887 -2491 -945 931 1490 740 81 177 -292 -1433
3361 -1433 -1956 -681 1349 2250 1031 -758 -1375 -863 -359 -314 28 1139 1728 788 -1051 -2145 -1267 479
3379 479 1443 892 453 409 43 -910 -1645 -1054 890 2263 1624 -149 -1182 -897 -358 -228 8 742 1849
3398 1849 1610 -360 -1887 -1519 41 1241 1080 577 665 698 -201 -1527 -1644 147 2019 1873 261 -600
3416 -600 -443 -18 -385 -712 176 1636 1962 485 -1389 -1450 -256 624 504 174 740 1224 511 -1009 -1679
3435 -1679 -451 1117 1353 432 -248 17 202 -417 -1118 -614 792 1537 707 -623 -814 -199 201 -201
3453 -201 -403 75 841 797 -304 -1001 -594 320 449 -128 -492 200 688 354 -678 -999 -247 513 380 -413
3473 -413 -470 204 658 47 -964 -996 -25 735 289 -414 -190 380 314 -579 -1246 -528 754 1090 255 -568
3493 -568 -486 -12 -268 -938 -820 458 1441 798 -722 -1477 -787 26 147 -280 157 977 918 -576 -1833
3512 -1833 -1398 210 1058 582 -56 -72 180 -430 -1316 -1252 195 1481 1392 -61 -1098 -832 -374 -214 -465
3531 -465 311 1420 1234 -35 -1325 -1360 -192 799 808 454 378 654 -210 -1161 -1345 -38 1429 1545 495
3550 495 -516 -614 -331 -361 -257 430 1309 1591 420 -1176 -1506 -628 713 996 736 658 672 -19 -1122 -1450
3570 -1450 -345 1315 1874 945 -280 -968 -650 -523 -612 79 1323 1859 810 -1111 -2016 -1288 171 851
3588 851 759 881 923 129 -1354 -2258 -1277 614 1920 1383 40 -684 -1005 -1248 -1430 -749 958 2028 1392
3607 1392 -533 -2078 -1869 -931 -234 183 962 1412 716 -899 -2502 -2340 -431 1148 1300 647 262 -350
3625 -350 -1217 -1897 -1524 -29 1668 1735 535 -885 -1461 -1131 -907 -399 326 1302 1631 245 -1293 -1865
3643 -1865 -1052 242 884 726 641 679 67 -1003 -1581 -708 670 1555 1166 80 -522 -269 -341 -665 -154
3662 -154 707 1409 1159 -122 -1053 -642 239 446 268 294 774 772 8 -885 -836 236 1074 837 -93 -264 182
3683 182 351 -260 -481 -25 1042 951 6 -726 -301 439 603 47 -117 359 639 270 -690 -677 246 931
3703 931 617 -199 -328 66 412 -57 -499 62 842 913 -74 -701 -353 459 628 98 -68 303 718 336
3723 336 -483 -653 -51 811 575 -26 -76 123 329 28 -667 -435 346 812 292 -124 -410 103 176 -197 -501
3744 -501 -170 592 674 123 -608 -472 43 -92 -317 -392 227 834 552 -456 -1014 -616 81 305 -160 -110 469
3765 469 545 -135 -1214 -943 -4 865 465 -45 15 230 -176 -917 -1177 -139 1159 1248 429 -486 -605 -365
3785 -365 -398 -644 -169 1041 1599 549 -776 -1256 -551 155 137 185 669 981 661 -807 -1638 -933 306
3804 306 1010 743 470 265 154 -567 -1244 -988 350 1505 1094 91 -509 -713 -527 -636 -470 230 1100
3823 1100 1111 -106 -1180 -1257 -377 292 396 375 493 713 -159 -1142 -1343 -402 617 949 309 -214 -254 -254 -425
3844 -425 -868 -336 627 1129 467 -645 -949 -394 174 144 63 264 642 467 -568 -1088 -525 683 940 398
3864 398 -233 -184 163 -99 -475 -396 582 1236 625 -529 -903 -224 367 306 115 321 764 397 -552 -1265 -629
3885 -629 597 1141 498 -150 -232 -46 -330 -871 -307 723 1316 758 -251 -828 -679 -181 -153 104 634 1177
3905 1177 798 -266 -1129 -913 -27 681 804 657 521 353 -280 -1082 -1063 -2 1100 1303 578 5 -462
3924 -462 -506 -393 -470 186 1078 1238 634 -541 -1026 -715 -213 125 308 535 797 394 -737 -1262 -988 -89
3944 -89 645 608 293 25 -118 -480 -1101 -1011 2 793 772 88 -548 -671 -532 -625 -677 -59 614 725 30 -915
3966 -915 -968 -463 2 -67 -226 70 519 167 -636 -1090 -585 220 307 -9 -292 -97 196 -175 -582 -626 212
3987 212 551 249 -208 -243 87 204 -95 -459 -40 398 494 63 -323 -70 411 427 67 -181 89 451 316
4008 316 -32 -166 320 505 104 -148 -272 193 467 471 -41 -45 260 222 57 -263 -66 455 648 389 -254 -92
4030 -92 172 316 -63 -240 103 779 551 -103 -520 -319 209 339 -37 -84 241 609 244 -507 -526 -24 436
4051 436 344 -140 11 207 318 -250 -727 -601 283 533 280 -339 -113 115 -190 -773 -745 -69 563 493 -141
4072 -141 -551 -318 -172 -439 -612 -317 518 605 125 -646 -858 -391 -205 -195 -256 142 520 264 -640 -1049 -699
4093 -699 -83 162 171 57 320 131 -530 -1060 -891 18 649 655 267 -238 -326 -374 -650 -577 -18 916 1035 328
4115 328 -445 -657 -387 -72 39 373 615 945 481 -415 -836 -525 201 831 628 619 534 431 -176 -663 -424
4136 -424 453 1179 868 244 -55 151 159 -185 -15 504 1065 1090 168 -551 -356 227 351 250 290 647 682 300
4158 300 -416 -455 172 763 443 259 -70 158 126 -235 -338 94 577 539 39 -465 -361 114 241 83 -98
4179 -98 121 191 -173 -667 -622 -11 388 255 -200 -468 -459 -366 -542 -576 -106 450 342 -156 -960 -863 -373 -124 -57
4202 -57 20 110 156 -368 -982 -1009 -547 107 626 209 -374 -445 -452 -639 -725 -403 337 648 404 -431 -885 -681 -350
4225 -350 -220 25 477 592 376 -439 -937 -812 135 466 469 328 263 150 -280 -816 -586 114 812 765 387
4246 387 -75 -110 -49 -272 -299 154 873 931 398 -388 -355 63 223 197 380 521 707 426 -107 -441 -34 376
4268 376 563 418 376 497 481 168 -223 -100 350 623 469 101 -15 320 331 82 -53 -80 362 529 396
4289 396 -26 64 107 129 -64 -331 72 370 308 56 -232 -181 19 -53 -228 -342 116 356 188 -221 -560 -297
4311 -297 -57 -95 -253 -62 223 185 -286 -601 -597 -170 152 -123 -227 -267 -43 -260 -508 -553 -227 312 160 -311
4333 -311 -548 -449 -185 -228 -459 -226 95 248 -126 -546 -414 -104 160 -133 -228 18 150 130 -261 -459 -74
4354 -74 240 206 -136 -206 -94 221 148 -83 7 242 340 53 -308 -268 237 452 472 52 -40 4 18 -93 -69 338
4378 338 742 575 128 -196 -256 37 190 373 381 510 368 219 -471 -611 -61 577 672 379 183 92 -133 -241
4400 -241 -389 9 676 876 446 -281 -385 -407 -107 -193 139 581 780 286 -444 -795 -605 42 287 288 337 349
4422 349 -56 -449 -916 -691 151 537 472 44 -211 -239 -435 -538 -428 122 662 474 -146 -656 -625 -479 -242
4443 -242 -157 36 264 190 -166 -750 -795 -295 114 181 97 -31 -99 -216 -515 -623 -226 153 295 87 -289 -379
4465 -379 -201 -189 -273 -45 126 178 5 -235 -432 -253 203 142 140 -14 -45 42 17 -221 -134 254 407 229 -156
4488 -156 -68 55 195 148 144 205 324 326 10 -262 117 297 552 263 49 128 270 150 -101 41 429 602 343
4511 343 -4 -128 81 173 169 227 273 289 318 -95 -261 -192 137 338 83 -52 36 52 24 -327 -286 -14 255 321
4535 321 -74 -144 -43 -33 -33 -166 -39 43 292 -90 -373 -337 -307 -78 -198 -133 -120 180 103 -171 -355 -315 -180 36
4559 36 -227 -123 -23 54 -82 -285 -371 -280 42 13 -36 -50 26 59 -236 -467 -165 68 276 107 -11 -101 -187 -46
4583 -46 -248 -310 24 302 327 10 -400 -357 -112 -158 -178 56 273 418 76 -408 -386 -205 193 258 148 162 263
4606 263 113 -244 -312 -206 213 381 423 199 110 83 -206 -254 28 366 650 469 73 -106 -55 33 12 165 400
4629 400 498 298 81 -279 -253 130 252 290 290 180 124 29 -229 -180 66 404 286 181 -32 -119 -45 -148 14
4652 14 62 143 185 18 -233 -376 -209 174 65 -111 -78 14 -50 -294 -225 -128 41 137 5 -299 -315 -218 -174 -94 -103
4677 -103 29 152 -22 -228 -392 -165 42 160 -36 -61 -111 -101 -198 -328 -178 70 292 32 -155 -291 -173
4698 -173 -152 36 118 268 359 96 -134 -432 -302 12 268 295 302 184 127 -171 -291 -238 173 470 327 146 104
4721 104 -25 -84 -175 -70 255 531 641 274 -83 -183 -65 4 202 312 387 369 235 3 -179 -75 138 354
4743 354 466 429 248 20 -74 -167 -169 129 375 510 234 -205 -49 -64 -203 -36 77 285 390 29 -252 -279
4765 -279 4 67 -6 111 151 130 -91 -285 -430 -79 8 49 -85 38 -27 -190 -218 -433 -367 58 20 -130 -245
4788 -245 -287 -119 -226 -359 -266 -111 -24 26 -208 -363 -292 -104 -32 -232 -111 -103 -38 -50 -181 -250 -203 74 34 -193
4812 -193 63 -217 60 -118 -202 -170 -49 139 -87 -168 -106 59 50 -7 -129 -112 28 49 -155 -131 -83 339 106 -61
4836 -61 -62 -12 107 10 -27 -1 218 242 14 16 -93 261 185 196 -27 82 405 194 -127 -135 163 361 322 98 120
4861 120 168 317 121 -118 3 262 439 211 41 -116 35 188 5 61 174 300 278 -23 -236 -117 143
4882 143 161 83 186 142 216 13 -276 -359 -100 217 121 40 29 -28 -81 -395 -316 -132 166 218 54 -215 -172 -253 -209
4907 -209 -380 -230 172 201 10 -228 -290 -316 -191 -119 -91 46 252 62 -151 -314 -394 -147 -81 19 62 57 79 -79
4931 -79 -470 -268 -206 -61 173 189 -84 -167 -54 -190 -282 -76 179 294 148 -91 -200 -166 -89 -47 0 154 262
4954 262 48 -104 -316 -225 65 226 101 153 219 157 -22 -67 -130 241 332 405 91 7 35 123 -1 99 216 192
4978 192 288 -24 11 -25 114 189 161 89 214 149 49 52 -35 159 274 218 165 3 67 167 203 170 75 188 212 -12
5004 -12 -74 67 31 12 153 73 133 -77 -155 -177 8 -49 111 154 142 -33 -209 -120 -123 23 34 197 146 -32 -231
5029 -231 -382 -245 -80 62 121 6 -118 -200 -240 -283 -260 45 194 197 0 -208 -163 -222 -255 -188 72 288 130 -50
5053 -50 -262 -492 -380 -182 107 33 125 79 -28 -242 -400 -199 83 126 128 140 -41 -170 -214 -281 -120 157 302
5076 302 215 52 -24 -41 -117 -176 -56 145 134 323 114 -158 -142 -71 16 30 66 10 68 93 90 -159 -172 13 191 104
5102 104 32 -130 -11 57 -36 -59 31 265 132 -15 -26 63 67 9 -190 -113 157 240 57 -66 7 49 79 -32 -170
5127 -170 -130 100 101 61 -130 -148 190 60 -35 -25 52 206 52 -237 -237 23 80 30 -57 -129 103 98 -96 -178 -92 86
5153 86 53 -71 -72 58 116 7 -159 -248 -3 54 84 -77 -126 -20 137 -15 -145 -217 -44 140 -50 -51 -135 24
5177 24 32 -155 -219 -150 85 146 -66 -161 5 -44 -51 -169 -59 91 182 189 51 -208 -73 -46 -5 -19 15 314 204 118
5203 118 -176 -66 29 82 246 80 125 143 54 -264 -178 -73 179 156 153 114 177 8 -158 -154 -88 178 204 172 -72
5228 -72 -200 1 -60 -206 -63 212 302 286 11 -131 -33 -27 18 -65 56 221 104 -80 -223 -176 51 256 231 39
5252 39 38 46 -36 -259 -169 -82 211 326 -16 -49 -41 -8 11 -135 -77 137 141 26 -130 -264 -100 10 168 -97 243
5277 243 120 80 -88 -94 -2 56 93 -83 -108 -42 30 -79 -186 -7 35 31 30 -113 -69 32 -22 96 -151 -41 8 12
5303 12 32 -44 -10 128 118 -42 -166 -101 118 -17 26 -153 115 56 -21 -120 -108 -18 147 144 49 16 0 1 -29 -168 -123
5330 -123 176 142 148 -43 -88 -34 49 -31 73 147 155 137 -98 -109 -125 -161 -119 -113 -94 159 46 -142 -288 -215 -33 84
5356 84 96 90 -24 84 -107 -68 -194 57 95 36 51 -100 -14 -71 -96 -168 -144 -71 171 91 -19 -147 -167 17 33 107
5382 107 54 47 100 -80 -231 -130 53 -1 39 10 -3 53 -39 -101 -209 -100 38 20 -7 14 6 -8 -79 -214 -174 2
5408 2 36 140 -75 -62 -224 -91 -86 -36 -158 55 139 -49 -96 -120 -90 -105 5 87 -33 26 -52 -13 -46 -132 18 -36
5434 -36 58 44 31 74 -2 -180 -152 -9 39 52 39 -23 -48 5 -45 36 -98 -30 128 136 43 -27 -7 61 20 -59 -99 40
5462 40 38 -92 -98 -16 -20 90 9 73 9 51 75 100 -187 52 35 90 -103 -56 50 56 7 -31 -86 3 -4 88 -47 -90 238
5491 238 44 -10 -201 -10 -8 1 156 -67 94 160 -12 -22 -209 -61 25 125 15 55 24 -41 39 -102 -113 51
5515 51 231 102 26 -118 -76 45 -93 23 200 128 147 -126 -145 -78 35 137 57 70 -39 189 -33 -135 -158
5538 -158 41 98 157 -36 184 38 -66 -65 -62 -28 125 152 -32 -6 -54 -14 38 -144 -87 128 126 220 -114 -93 -157 43
5564 43 147 22 -18 86 139 67 -135 -85 7 152 4 -191 57 205 149 3 -230 -86 167 74 -6 -156 3
5587 3 88 28 -125 -133 -28 150 20 -57 71 68 141 55 -183 -15 -11 203 35 -35 -20 171 172 -25 -83 -46 133 185 -4
5614 -4 -190 41 162 110 5 -76 14 116 -58 -45 -137 -11 188 -95 36 56 117 203 -34 -240 -190 108 136 13
5638 13 -54 -128 11 123 -222 -154 -30 139 44 -141 -90 15 37 9 -172 -183 89 78 57 -86 -154 -3 -20 -136
5662 -136 -74 -9 159 137 -66 -115 128 21 -35 -46 -37 28 67 -69 -220 -137 -106 64 16 -38 89 -11 13 -2 -187
5687 -187 -108 5 -28 40 -3 -6 145 -71 -62 -157 40 161 157 -26 -24 -149 -10 94 21 13 204 194 75 16 -120 -59
5713 -59 158 -14 -98 153 176 126 -123 -43 30 128 63 130 -19 84 27 -29 -142 -33 7 189 50 102 79 210 149
5738 149 -31 78 -71 176 111 58 8 43 -38 39 -91 -147 52 115 9 -73 -125 -27 114 50 -26 -84 43 -15 -58
5763 -58 -107 -80 -81 -69 71 -22 -86 -75 -52 -5 -43 -165 87 42 3 -141 -72 52 -47 -58 -37 1 35 -13 -67 -90 108 51
5791 51 -86 21 -132 -60 188 -137 -74 -113 53 -16 -128 -49 -36 55 65 121 -108 -24 -114 63 23 -199 18 -1 157
5816 157 -33 -76 -119 51 160 0 42 -83 3 0 -16 -130 -93 54 56 -46 135 24 85 -28 -132 117 88 140
5840 140 75 7 -55 -16 6 -40 38 41 84 128 71 14 -42 -26 57 260 86 18 95 64 -27 -32 39 222 84 -55 -66 -98
5868 -98 -78 -22 -119 -14 93 169 88 -46 29 6 -44 14 -123 -13 -11 3 -116 -55 -74 -7 13 -48 54 112 179 -99 -51
5895 -51 -239 -117 -25 -39 -79 -68 28 -82 -160 -137 -1 94 97 51 -52 -150 68 -106 -35 86 1 -13 30 -110 -114 -15 -89
5922 -89 -44 -105 -204 -40 15 27 -85 -67 -43 82 -84 -127 -133 39 85 -80 57 -19 -29 16 7 71 68 36 77 -74 43
5949 43 91 80 58 84 36 21 178 -1 26 -74 189 117 82 85 66 114 -90 13 -42 153 76 138 91 -50 31 14 64
5976 64 -59 -1 50 131 -39 -2 -28 111 -120 -16 -77 61 125 133 -9 -39 32 46 -13 -17 19 123 91 67 -73 -104 59
6003 59 99 -34 -82 42 108 11 -35 -101 17 67 29 -30 -39 -129 62 -87 -174 -162 66 139 78 -73 -84 33 -69 13
6029 13 -63 -110 163 45 30 -122 -75 23 -53 24 -28 -13 89 -68 -83 -203 -53 -95 -5 -18 -48 51 -39 -69 -164 -58
6055 -58 -18 79 20 -51 -30 -33 -149 -126 -179 96 24 61 -32 -8 -83 1 50 -12 83 60 -10 -9 4 -17 -9 90 96 0 116 148 19
6086 19 10 -71 73 166 75 60 46 31 45 -25 5 122 54 14 -52 23 -97 -27 148 -8 -54 -34 58 80 -44 -21 60 60
6114 60 31 -22 -73 23 174 -35 -50 -50 -44 33 64 -76 -71 2 -6 -13 13 -142 -190 10 6 -8 26 50 173 30 -59 -37 0 -46
6144 -46 93 -97 58 -56 -86 -52 -16 154 60 -84 9 -65 -75 28 -122 -60 -154 -36 16 20 -49 -3 -59 -60 27 -141
6170 -141 -4 33 62 -98 -4 -54 50 -38 32 79 -42 -26 23 62 26 12 4 166 -21 136 100 31 -71 39 15 196
6196 196 105 -13 86 -112 -82 34 41 82 82 31 94 102 0 53 -22 23 27 -25 94 7 19 -117 -9 -151 -47 40 -24
6223 -24 22 7 106 86 25 -53 -39 86 36 -15 -29 -38 -21 -62 0 45 20 -28 71 -54 -22 -15 -37 12 -31 36 38 72 13 -118
6253 -118 1 -108 15 -125 12 -70 5 -30 -73 71 -107 -21 -70 -51 -53 132 65 -41 -4 39 -111 67 -5 -13 -76
6278 -76 -41 -27 17 -176 -72 15 -13 -30 -90 68 -26 -7 -56 -114 -19 10 -11 12 -8 -10 77 -68 -136 -71 68 148 -19 65
6306 65 -157 40 121 -9 -8 101 105 95 -90 21 94 -35 14 -42 56 71 141 -3 -75 -73 -105 -28 -37 40 3 44 68 -105
6334 -105 -86 -2 149 133 47 75 71 129 2 20 -28 23 -16 44 -35 -103 130 -9 11 6 58 13 10 -56 61 -30 -11 80 -15
6363 -15 -29 -107 60 -35 46 -23 -103 -22 -59 198 -81 -47 -4 -151 119 -104 -5 66 -25 -82 12 14 -3 -80 -62 -84 57
6390 57 -51 -28 -117 -58 -59 11 7 -49 -29 50 9 -58 -126 29 -47 34 -156 108 9 -3 -28 -108 -87 23 79 -53 -60 -97 31
6419 31 19 -141 -161 -69 210 12 -29 -12 65 139 -3 -63 -4 54 30 83 -49 -40 16 46 -74 -145 -57 77 59 90 21
6446 21 -60 89 -115 10 -8 28 -40 71 -36 -52 -53 24 -8 -17 -61 39 149 -44 8 -189 -90 -24 112 102 86 44
6472 44 -74 -53 -88 -10 40 10 -21 -111 69 141 -17 -164 -68 29 -76 0 -13 -94 -35 80 22 -84 -97 89 115 -15
6498 -15 -69 64 128 2 40 -128 31 -1 -28 153 -67 -103 -6 42 104 -70 48 27 -15 -65 -56 56 -23 -22 -42 -18 -162
6525 -162 -148 -28 -72 16 79 25 68 -44 -44 -11 217 27 -16 -54 110 9 -69 64 -150 -30 -1 -88 -56 128 125 52
6551 52 -35 74 112 86 36 -30 11 19 38 171 50 17 -69 -16 48 12 113 150 22 -19 -161 13 85 24 -19 -54 99
6578 99 44 37 -123 -148 67 10 123 114 6 -52 -17 -13 30 74 64 -11 -58 -160 -21 6 25 -70 35 -11 25 30 -7 -63 87
6607 87 26 19 -124 -117 17 -9 -36 -43 -59 -144 93 -59 67 -40 105 -87 -11 -22 -25 -78 136 -56 -18 1 -114 -103 -162
6634 -162 -116 17 -48 -74 -165 -23 -84 -9 158 32 -24 9 1 -31 67 -106 -11 36 76 -52 87 173 28 34 -51 -68 82
6661 82 96 4 59 24 98 158 -55 91 -64 -63 -5 133 -25 1 29 88 58 -32 26 13 36 3 9 -91 73 1 -128
6688 -128 -91 0 114 -23 -22 85 45 20 10 16 0 -42 63 139 -87 110 -9 38 19 53 39 84 -13 -47 59 56 48 -29
6716 -29 -64 87 138 -1 -4 -23 -70 54 82 57 23 -10 99 52 -52 -101 161 59 -12 -49 -15 -78 104 -109 -45 -102
6742 -102 85 -2 -27 -29 -76 6 13 -3 -12 22 -96 -88 -83 -2 56 26 -42 -117 25 -66 -96 90 -6 -121 23 -57 86 10 15
6771 15 4 -20 -9 27 -34 -54 20 66 14 -16 -2 137 -47 -89 11 -16 -7 41 -15 20 27 -16 -80 26 -53 70 2 -23 -26
6800 -26 113 12 27 -48 -19 -55 -91 -94 15 62 56 -10 -18 -3 -25 -4 -129 52 -95 130 60 75 29 -77 -111 29 -116
6827 -116 -46 32 -91 20 -56 9 -22 127 8 105 55 117 39 157 -11 28 -117 45 -19 35 -91 4 56 12 -50
6852 -50 -13 18 -38 -12 32 -23 -12 56 -102 34 14 -26 53 50 -66 -34 -64 58 -111 -53 40 1 -1 -102 -38 -40 153 12
6880 12 -118 1 -133 -74 -28 26 -136 14 63 27 -40 -31 74 -20 -126 -13 21 -99 -30 -45 -30 -68 -85 -54 17 -48
6906 -48 -54 87 65 -26 -182 44 19 30 -106 49 -69 -38 -22 -71 55 19 61 43 71 77 92 62 -28 9 -104 41 29
6933 29 -35 19 39 49 3 -41 20 20 18 15 16 -93 48 -30 78 -53 -8 -8 84 -41 -65 64 9 70 -16 -39 62 47 10
6962 10 -80 61 57 13 -13 -50 -56 27 17 -30 66 12 48 -31 62 0 -64 -61 39 -56 79 56 -63 59 9 -46 12 -78 -5
6991 -5 38 -80 128 23 5 -65 -10 104 38 38 33 6 58 -46 18 -179 10 64 22 -127 -122 48 83 22 -106 -5 25
7018 25 -13 -106 33 -40 -18 71 -28 -19 40 -76 -57 -52 32 -19 -42 93 -103 -123 -3 -53 105 -17 -138 -38 -32 44 -17
7045 -17 87 -11 -37 10 40 -3 129 -26 35 -46 9 91 -59 28 -34 124 18 -144 -8 -45 -100 75 -54 95 52
7070 52 85 -8 61 87 31 99 -8 -82 -89 -69 44 -10 27 -47 -4 36 -24 44 -15 106 -38 2 92 -76 -3 -11 48 -38 -40
7099 -40 -8 -157 -13 -97 -67 40 46 14 42 -59 14 -53 16 -17 -52 -9 -52 26 21 -110 -32 61 -54 -29 90 57 -10 -33
7127 -33 -7 -13 27 68 45 14 56 91 -37 120 121 -51 70 -125 -21 -138 -6 12 -29 -20 -82 10 82 34 34 -5 78 6
7155 6 -53 23 14 -109 -88 -46 -101 25 -62 53 8 2 -152 47 -24 15 50 -10 -57 -7 -23 -213 -19 40 76 91 35 -239
7183 -239 -24 43 -135 -43 88 47 -41 82 31 -11 47 -33 72 -28 -9 -74 41 57 66 -44 -29 24 -78 17 21 12 96
7210 96 -38 2 31 39 -17 -28 80 -57 -55 -95 49 4 7 -83 70 -2 38 158 -87 -6 36 106 -30 61 -17 -24 52 15
7238 15 56 -25 -65 181 -37 24 8 22 -135 49 24 34 -60 -3 108 7 12 -19 25 -102 -26 -12 -41 1 -31 33 -133
7265 -133 -13 -71 -5 -13 -40 -17 -31 51 -54 -62 10 -86 56 -1 44 -37 -32 -93 88 -99 -69 46 -38 -34 -29 88 -28 4
7293 4 60 45 62 -7 36 66 118 -34 -104 43 -54 61 -45 -38 -11 -38 -119 77 31 9 15 -10 12 57 -21 -152 -20 42
7321 42 -143 -103 -14 17 15 108 11 61 90 81 -196 10 32 23 61 13 122 100 27 -14 26 16 5 -3 -25 8 -27 89 -36
7350 -36 -2 42 60 -54 16 11 172 92 -123 36 -54 43 -17 62 90 -41 -1 -19 4 52 -35 56 -27 -87 -73 -1 -66 32
7378 32 2 86 51 57 35 54 -3 66 -97 -73 -96 -97 -43 80 -84 -129 61 -39 -104 14 82 53 37 -93 -37 -12 -133
7405 -133 65 104 13 -36 86 46 24 -63 90 -63 1 -76 28 40 -24 -74 -74 9 -77 30 28 11 -106 52 110 17 57
7432 57 -179 -29 -4 69 -91 -22 24 -42 -51 -121 29 -91 73 -68 -45 -24 2 -22 38 54 -81 27 58 52 -122 -107
7458 -107 -135 84 -114 7 -59 -29 65 -60 6 -45 47 56 24 10 26 93 -44 -4 19 -21 -82 -12 -98 38 77 -1 28
7485 28 22 24 51 18 -103 -156 -57 -66 -91 -81 109 -94 176 -33 -83 25 -63 17 -77 94 9 -4 -90 70 -116 0 45
7512 45 -29 -114 -58 199 3 84 -72 21 81 -51 29 52 37 10 40 49 -30 -45 -22 -83 -37 -29 -63 -56 65 -15 9 28 -54
7541 -54 -111 -6 71 38 26 -54 -22 -87 -8 15 47 -53 -139 17 40 40 34 40 -22 -24 -36 49 -21 54 92 -75 50 -48 19 2
7571 2 89 -164 -18 -102 -77 -27 35 -23 31 -11 -73 -81 -31 41 15 48 63 -142 83 73 -35 121 70 13 2 -77 -21 61
7599 61 49 -100 -116 67 49 -35 -35 31 -23 38 -54 26 33 25 8 -22 103 -27 -169 -6 -133 49 41 -10 33 32 -1 -120
7627 -120 -23 44 57 -40 170 29 6 69 -27 9 78 -70 -72 69 -12 79 -13 50 7 24 40 23 -18 -25 31 -183 0 115
7655 115 5 -39 -6 -3 -68 -12 7 -36 34 -82 35 -112 -95 1 -78 -4 63 -5 -14 -19 31 -34 68 -75 38 -106 37
7682 37 -42 -17 -152 -65 -81 -79 -29 -83 4 112 -84 -24 -25 4 68 -23 25 -27 29 54 -32 -17 91 30 -17 -72 57 -9 -80
7711 -80 -29 -35 22 -52 105 22 -32 32 152 57 -46 -76 -88 -11 -5 -46 24 17 15 -16 -83 115 -50 -53 59 -35 -51 53 17
7740 17 128 -12 17 63 8 -123 -12 -8 -28 53 60 5 81 109 -70 -63 88 28 9 22 22 -28 -6 -81 57 30 41 53 -13
7769 -13 151 -118 8 3 -30 -41 -80 -50 -57 5 -2 -154 -30 3 55 -93 -59 -124 55 -12 -143 -37 -21 -37 81 35 -62
7796 -62 14 53 -10 -130 -8 7 15 41 -32 -93 -86 -115 12 5 4 107 -27 -64 7 -41 65 58 202 110 -15 14 6 18 -54
7825 -54 27 1 -3 -19 -57 -66 -5 19 -54 -76 -65 -14 -6 -62 -82 -31 -51 -64 -57 -61 9 -51 99 28 67 -74 36 14 -52 87 50
7856 50 88 -59 31 -6 35 38 -163 -46 -19 115 18 24 65 -14 7 -50 -2 -101 170 130 -12 -55 12 128 43 -20 -19 5
7884 5 43 -43 36 2 46 -53 -72 34 -125 55 55 4 -67 -102 161 -96 -42 98 -18 -91 6 -62 -108 -2 -27 46 -20
7911 -20 119 -11 -76 -41 -113 57 176 -23 -27 12 -88 -36 -116 132 46 68 46 -7 -35 37 -56 16 13 21 -105 -25 -79 -101
7939 -101 -4 -4 -42 -83 -19 -19 209 46 -54 70 79 -22 22 60 39 -43 45 5 -74 -66 -58 16 40 110 51 -91 -84 -102 27
7968 27 101 15 20 -13 -54 -31 -5 16 -32 24 -33 -102 25 9 33 -23 23 90 -83 53 -33 -7 2 -77 -61 -22 16 52 76 71
7998 71 7 -16 -23 -42 -44 -71 30 -50 76 -20 -57 -60 51 -91 -33 -28 -68 -6 61 -78 -21 -176 23 -46 -53 -16 -98 -83 -100
8027 -100 -44 -126 73 -55 38 -43 -8 0 63 -17 -91 -70 74 24 -61 -62 28 37 -59 66 -75 61 2 48 -18 13 -62 -18
8055 -18 8 -55 -19 66 -18 -34 -9 1 -33 -39 58 43 103 -18 18 -133 -43 61 -48 34 113 -47 42 70 129 -68 -35 -11
8083 -11 -27 13 -28 42 55 -32 -87 -22 28 -8 84 105 80 -39 -10 -45 113 -78 59 -1 99 57 -107 67 -37 -1
8109 -1 24 -34 -110 11 71 -33 -26 20 0 10 -38 -19 51 35 -41 -50 57 12 49 21 -37 -114 -15 30 -44 83 68 100 -37
8138 -37 -122 -57 124 -108 21 25 -58 -7 12 -50 -107 15 33 -22 61 -63 -128 161 -62 -67 -11 43 -16 -56 -33 75 81 -23
8166 -23 21 -206 -123 -37 5 -67 -10 -33 -104 71 -23 -23 23 -8 39 -34 56 -80 -37 30 -107 18 99 108 21
8191B1
##END NTUPLES=NMR FID
##END=
