##TITLE=1H_IBTB3005
 CDCl3, 8 sc, 
 31.5.2019
##JCAMPDX= 6.0         $$ Bruker NMR JCAMP-DX V2.0
##DATA TYPE= NMR FID
##DATA CLASS= NTUPLES
##ORIGIN= UXNMR, Bruker Analytische Messtechnik GmbH
##OWNER= root
$$ XWIN-NMR		Version 3.5
$$ Fri May 31 12:40:40 2019 Russian Standard Time (UT+4h)  she@DPX200
##.OBSERVE FREQUENCY= 200.13155
##.OBSERVE NUCLEUS= ^1H
##.DELAY= (6, 6)
##.ACQUISITION MODE= SIMULTANEOUS
##.ACQUISITION SCHEME= undefined
##.AVERAGES= 8
##.DIGITISER RES= 18
##SPECTROMETER/DATA SYSTEM= spect
##.PULSE SEQUENCE= zg30
##.SOLVENT NAME= CDCl3
##.SHIFT REFERENCE= (INTERNAL, CDCl3, 0, 15.7039)
##AUDIT TRAIL= $$ (NUMBER, WHEN, WHO, WHERE, WHAT)
$$ ##TITLE= Audit trail, XWIN-NMR		Version 3.5
$$ ##JCAMPDX= 5.01
$$ ##ORIGIN= Bruker BioSpin GmbH
$$ ##OWNER= she
$$ F:/spectra/data/she/nmr/H-F/1/audita.txt
$$ ##AUDIT TRAIL=  $$ (NUMBER, WHEN, WHO, WHERE, WHAT)
(   1,<2019-05-31 12:39:30.67 +0400>,<she>,<DPX200>,
      <created by zg, POWCHK disabled, PULCHK disabled
       configuration hash MD5:
       00 E9 B6 7A A2 85 ED C7 34 08 36 98 17 FE 4E 26
       data hash MD5: 16K
       A6 67 58 93 33 6B E2 45 E8 3A 2B 11 26 DC 71 64>)
$$ ##END=
$$ 
$$ hash MD5
$$ F2 FF 2C 4F 92 94 CE 38 7A 99 CB AB 0A 8A 85 31
##$RELAX= 
##$RELAX= 
##$RELAX= 
##$RELAX= 
##$RELAX= 
##$RELAX= 
$$ Bruker specific parameters
$$ --------------------------
##$DU= <F:/spectra>
##$EXPNO= 1
##$NAME= <H-F>
##$PROCNO= 1
##$TYPE= <nmr>
##$USER= <she>
##$AMP= (0..31)
100 100 100 100 100 100 100 100 100 100 100 100 100 100 100 100 100 100 
100 100 100 100 100 100 100 100 100 100 100 100 100 100 
##$AQSEQ= 0
##$AQ_mod= 1
##$AUNM= <au_zg>
##$AUTOPOS= <>
##$BF1= 200.13
##$BF2= 200.13
##$BF3= 200.13
##$BF4= 200.13
##$BF5= 200.13
##$BF6= 200.13
##$BF7= 200.13
##$BF8= 200.13
##$BYTORDA= 1
##$CFDGTYP= 0
##$CFRGTYP= 5
##$CHEMSTR= <none>
##$CNST= (0..31)
1 1 145 1 1 1 1 1 1 1 1 1 1 1 1 1 1 1 1 1 1 1 1 1 1 1 1 1 1 1 1 1 
##$CPDPRG= <>
##$CPDPRG1= <>
##$CPDPRG2= <>
##$CPDPRG3= <>
##$CPDPRG4= <mlev>
##$CPDPRG5= <mlev>
##$CPDPRG6= <mlev>
##$CPDPRG7= <mlev>
##$CPDPRG8= <mlev>
##$CPDPRGB= <>
##$CPDPRGT= <>
##$D= (0..31)
0 1.2 0 0 0 0 0 0 0 0 0 0.03 0 0 0 0 0 0 0 0 0 0 0 0 0 0 0 0 0 0 0 0 
##$DATE= 1559291970
##$DBL= (0..7)
120 120 120 120 120 120 120 120 
##$DBP= (0..7)
150 150 150 150 150 150 150 150 
##$DBP07= 0
##$DBPNAM0= <>
##$DBPNAM1= <>
##$DBPNAM2= <>
##$DBPNAM3= <>
##$DBPNAM4= <>
##$DBPNAM5= <>
##$DBPNAM6= <>
##$DBPNAM7= <>
##$DBPOAL= (0..7)
0.5 0.5 0.5 0.5 0.5 0.5 0.5 0.5 
##$DBPOFFS= (0..7)
0 0 0 0 0 0 0 0 
##$DE= 6
##$DECBNUC= <off>
##$DECIM= 24
##$DECNUC= <off>
##$DECSTAT= 4
##$DIGMOD= 1
##$DIGTYP= 9
##$DL= (0..7)
0 120 120 120 120 120 120 120 
##$DP= (0..7)
150 150 150 150 150 150 150 150 
##$DP07= 0
##$DPNAME0= <>
##$DPNAME1= <>
##$DPNAME2= <>
##$DPNAME3= <>
##$DPNAME4= <>
##$DPNAME5= <>
##$DPNAME6= <>
##$DPNAME7= <>
##$DPOAL= (0..7)
0.5 0.5 0.5 0.5 0.5 0.5 0.5 0.5 
##$DPOFFS= (0..7)
0 0 0 0 0 0 0 0 
##$DQDMODE= 0
##$DR= 18
##$DS= 0
##$DSLIST= <SSSSSSSSSSSSSSS>
##$DSPFIRM= 0
$$ [...]
##$SUBNAM2= <"">
##$SUBNAM3= <"">
##$SUBNAM4= <"">
##$SUBNAM5= <"">
##$SUBNAM6= <"">
##$SUBNAM7= <"">
##$SUBNAM8= <"">
##$SUBNAM9= <"">
##$SW= 24.9336996594482
##$SWIBOX= (0..15)
0 0 2 0 0 0 0 0 0 0 0 0 0 0 0 0 
##$SW_h= 4990.01996007984
##$TD= 16384
##$TD0= 1
##$TE= 0
##$TE2= 300
##$TE3= 300
##$TEG= 300
##$TL= (0..7)
0 120 120 120 120 120 120 120 
##$TP= (0..7)
150 150 150 150 150 150 150 150 
##$TP07= 0
##$TPNAME0= <>
##$TPNAME1= <>
##$TPNAME2= <>
##$TPNAME3= <>
##$TPNAME4= <>
##$TPNAME5= <>
##$TPNAME6= <>
##$TPNAME7= <>
##$TPOAL= (0..7)
0.5 0.5 0.5 0.5 0.5 0.5 0.5 0.5 
##$TPOFFS= (0..7)
0 0 0 0 0 0 0 0 
##$TUNHIN= 0
##$TUNHOUT= 0
##$TUNXOUT= 0
##$USERA1= <user>
##$USERA2= <user>
##$USERA3= <user>
##$USERA4= <user>
##$USERA5= <user>
##$V9= 5
##$VALIST= <valist>
##$VCLIST= <CCCCCCCCCCCCCCC>
##$VD= 0
##$VDLIST= <DDDDDDDDDDDDDDD>
##$VPLIST= <PPPPPPPPPPPPPPP>
##$VTLIST= <TTTTTTTTTTTTTTT>
##$WBST= 1024
##$WBSW= 4
##$XGAIN= (0..3)
0 0 0 0 
##$XL= 0
##$YL= 0
##$YMAX_a= 71838
##$YMIN_a= -83780
##$ZGOPTNS= <>
##$ZL1= 120
##$ZL2= 120
##$ZL3= 120
##$ZL4= 120
##$ABSF1= 10
##$ABSF2= 0
##$ABSG= 5
##$ABSL= 3
##$ALPHA= 0
##$AQORDER= 0
##$ASSFAC= 0
##$ASSFACI= 0
##$ASSFACX= 0
##$ASSWID= 0
##$AUNMP= <proc_1d>
##$AZFE= 0.1
##$AZFW= 0.1
##$BCFW= 1
##$BC_mod= 2
##$BYTORDP= 1
##$COROFFS= 0
##$CY= 11.3945322036743
##$DATMOD= 1
##$DC= 2
##$DFILT= <>
##$DTYPP= 0
##$F1P= 18.9103706918063
##$F2P= -1.10871071338519
##$FCOR= 0.5
##$FTSIZE= 0
##$FT_mod= 4
##$GAMMA= 1
##$GB= 0.15
##$INTBC= 1
##$INTSCL= 1
##$ISEN= 128
##$LB= 0.24
##$LEV0= 0
##$LPBIN= 0
##$MAXI= 10000
##$MC2= 0
##$MEAN= 0
##$ME_mod= 0
##$MI= 1.114404
##$NCOEF= 0
##$NC_proc= 0
##$NLEV= 6
##$NOISF1= 3.799351
##$NOISF2= 2.8
##$NSP= 1
##$NTH_PI= 0
##$NZP= 0
##$OFFSET= 15.70392
##$PC= 1
##$PHC0= -8657.924
##$PHC1= 13.60023
##$PH_mod= 1
##$PKNL= yes
##$PPARMOD= 0
##$PSCAL= 0
##$PSIGN= 0
##$REVERSE= no
##$SF= 200.130013532006
##$SI= 16384
##$SIGF1= 3
##$SIGF2= 2
##$SINO= 400
##$SIOLD= 16384
##$SREGLST= <1H.CDCl3>
##$SSB= 0
##$STSI= 0
##$STSR= 0
##$SW_p= 3612.71676300578
##$SYMM= 0
##$S_DEV= 0
##$TDeff= 0
##$TDoff= 0
##$TI= <>
##$TILT= no
##$TM1= 0
##$TM2= 0
##$TOPLEV= 0
##$USERP1= <user>
##$USERP2= <user>
##$USERP3= <user>
##$USERP4= <user>
##$USERP5= <user>
##$WDW= 1
##$XDIM= 8192
##$YMAX_p= 0
##$YMIN_p= 0
$$ End of Bruker specific parameters
$$ ---------------------------------
##NTUPLES= NMR FID
##VAR_NAME=  TIME,          FID/REAL,        FID/IMAG
##SYMBOL=    X,             R,               I
##VAR_TYPE=  INDEPENDENT,   DEPENDENT,       DEPENDENT
##VAR_FORM=  AFFN,          ASDF,            ASDF
##VAR_DIM=   8192,          8192,            8192
##UNITS=     SECONDS,       ARBITRARY UNITS, ARBITRARY UNITS
##FACTOR=    0.0002004,     1,               1
##FIRST=     0,             0,               0
##LAST=      1.6414764,     0,               0
##MIN=       0,             -83780,          0
##MAX=       1.6414764,     71838,           0
$$ Real data points
##PAGE= N=1
##DATA TABLE= (X++(R..R)), XYDATA
0@%%%%%%%%%Qj6J6j6J6k4L2l2M0m8N6o9P7q8J04j20J36j57J81k05K29k56K90l27
33a73L67m10M57n10N68o31O97p70Q54r47J049j162J289j431J591j775J989k239
51a187K535k895L342l917M689n781P462j0410J7090n8962n363P6959p4846l2496
65h3780O5416L2140p8293j3590O9297Q494o7075J2975O3042j5208n6109K9207
77c3484M8260k9780l7312M0909K9258m2180k2833M7351K1110l7842r522M1346
89A5281O685l7565n766L3151M785k3852K098K6146J518k0842k784J7105L416j3502
103E874k398J4082L674j3329l187J5580M437j5210j703J6692l096k3071L008K4848
117B6201m631k3102J2138K5324j8903l0411J8400K6024k4144k3003L0418K1567
$$ plain form
0 0 0 0 0 0 0 0 0 0 0 8 -8 8 -8 8 -16 16 -16 24 -24 32 -37 40 -48 56 -64 72 -85 96 -109 120 -136 154 -173
33 -173 194 -216 241 -269 299 -332 365 -405 449 -498 551 -611 678 -753 838 -937 1052 -1187
51 -1187 1348 -1547 1795 -2122 2567 -3214 4248 -6162 10928 -48034 -53397 23562 -51284 -83780
65 -83780 -18364 13776 -64517 -78107 -8810 -316 -67391 -54416 8626 -6582 -62691 -33484
77 -33484 14776 -15004 -52316 -11407 17851 -24329 -47162 189 21299 -16543 -26065 15281
89 15281 21966 -15599 -21365 11786 16571 -7281 -5183 20963 22481 1639 -1145 15960 19376 5874
103 5874 3476 17558 21232 7903 4716 20296 24733 9523 7820 24512 21416 -1655 1353 26201
117 26201 21570 -1532 10606 35930 17027 -13384 5016 31040 6896 -16107 14311 35878
129C5878l4017j9239L3555J1369l6936o402L6863o23l7886N382L5233j1663l2059
142b0545J8256K9018k4726k8397K5380K1808k9118j6210L3941J4725l4319j2016
154b2203L1561N166l2991j708L3610O98l0588K591K8422n715k7007Q723K5937
167A6496j0419k4566J1959K2624j3550j9381J8563K0605j9618j9891K0125J6421
179A9368k3476j3613K8740J5082k8609j1689K9918P200l3264l931L5525J536l4869
192a2082L724L4777q718l3880J3854L2646j8639l0262K2364K5407k7316k0924
204a9049L1750J7256l3607j2113L3911M460l6522q3L6246m287l3694R364L0839
217B4471j4783k9340J6862K5086j9493k1000K1115J6471k2573j2801K2572R074
$$ plain form
129 35878 1861 -17378 16177 27546 -9390 -15792 21071 20448 -17438 -12056 23177 11514 -20545
142 -20545 -2289 26729 2003 -26394 -1014 20794 -8324 -24534 9407 24132 -10187 -22203
154 -22203 9358 14524 -18467 -20175 13435 14133 -16455 -13864 14558 8843 -18164 -9441 16496
167 16496 6077 -18489 -6530 16094 2544 -16837 1726 22331 2713 -17178 2947 19368
179 19368 -4108 -17721 11019 26101 -2508 -14197 15721 22921 -10343 -14274 21251 22787 -12082
192 -12082 -8358 26419 17701 -16179 -2325 30321 11682 -18580 3784 29191 1875 -19049
204 -19049 12701 29957 -3650 -15763 18148 22608 -13914 -13997 22249 17962 -15732 -6368 24471
217 24471 9688 -19652 -2790 22296 2803 -18197 2918 19389 -3184 -15985 6587 15661
229A5661k1857n796K0116J745j9549K04J8389j198j5755K940J4212m422j3916
242i226M116J2794l677j1337M261J1673m050j2166L767J2442m004j2962M799J4031
256A0461n857j4780P385J5521r159j5735J1443J5188j4480j4850J7146J3395j9730
269d052j1018K2368Q058k5056n227K6473R96k7691L268K8141p795k7864J1839
282g560K6373j6483k4549K0330K1757k3791j8492K6600J4569k8985j0484L0230
294I515O145l0887j708L0873k516l0198O529K8822j0185k6858J3565K4678j6295
307A480k1994J8731J9174k0424j6140K1928J3033k2830j0321K3467P696k3402
319i602m748K3775K161k3682k27K3102j968k2393M413K2256o053k1507P857K0435
$$ plain form
229 15661 -6196 -11992 8124 9869 -9680 -9476 8913 7715 -8040 -5100 9112 4690 -9226
242 -9226 -5110 7684 4007 -7330 -3069 8604 4554 -7612 -3845 8597 4593 -8369 -3570 10461
256 10461 4604 -10176 -2791 12730 3571 -12164 -721 14467 -13 -14863 2283 15678 -4052
269 -4052 -15070 7298 15356 -9700 -14927 11546 12542 -15149 -11881 16260 8465 -19399 -7560
282 -7560 18813 2330 -22219 -1889 19868 -3923 -22415 4185 18754 -10231 -20715 9515
294 9515 15660 -15227 -16935 13938 11422 -18776 -12247 16575 6390 -20468 -6903 17775 1480
307 1480 -20514 -1783 17391 -3033 -19173 2755 15788 -7042 -17363 6104 13800 -9602
319 -9602 -14350 9425 11586 -12096 -12323 10779 8811 -13582 -9169 13087 7034 -14473 -6616 13819
333A3819r766j9578J1680J8894j3085j7424J4943J6223j6318j4463J8071J2798
345A5794j9447j0887K0556Q985k1129n871K2512L917k2945j643K2639j193k2422
358a1134M320K2645o139k1562Q628K0192j1328j9081J3152J7645j4783j5882J6382
371C055J3900j7808j1851J8651R751j9954q103J9745N247k0343k845K0651R90
384A1086k0657M75J9400l665j9684N280J9014p055j7780Q814J6380j1133j5860
397a5385J2330J4079j4173j2653J5430J1002j6691q904J7959P057j8946n231J8958
410D832K602j9573j85K0259j182j9497L707J8710o235j8430Q033J7581r660j5610
424a4648J1946J4554j3352j2801J4597J1044j5950r105J6925P172j7455m861J8497
$$ plain form
333 13819 4053 -15525 -3845 15049 1964 -15460 -517 15706 -612 -15075 2996 15794
345 15794 -3653 -14540 6016 15001 -6128 -11999 10513 14430 -8515 -10158 12481 11288 -11134
358 -11134 -6814 15831 9692 -11870 -3242 16950 5622 -13459 -307 17338 2555 -13327 3055
371 3055 16955 -853 -12704 5947 15698 -4256 -12359 7386 12633 -7710 -10555 10096 11086
384 11086 -9571 -9096 10304 6639 -13045 -7765 11249 4194 -13586 -4772 11608 475 -15385
397 -15385 -3055 11024 -3149 -15802 -372 10630 -6061 -14965 2994 10051 -8895 -14126 4832
410 4832 7434 -12139 -12324 7935 6753 -12744 -9037 9673 3438 -14992 -6959 10622 962 -14648
424 -14648 -2702 11852 -1500 -14301 296 11340 -4610 -13715 3210 10382 -7073 -11934 6563
437F563L244j8472j184J8285j254j8681L114J8559m471j7363O972J6973q864j6444
451a3023J0244J5072j2031j3659J3962J2789j4888j0829J6325R015j7511p304
463a1838J8252N102j8775k528J9622O34j9224J936J8924m701j8823O680J7678
476A2939q690j6043J1201J5044j3007j3510J4234J1081j5952r315J6752P088j7294
489e472m596J7524K452j7849n74J6911j984j6776L631J5789n096j4707O784J3498
503I535q407j2641Q940J0836j0180r485J1041Q460j1430o883J2023N516j2730
516e405m475J2759L057j2938j331J3653N32j3362Q98J3329k419j3430L849J3308
530H025m833j2448O710J2217p843j1326R241J0270j0616r123J1813P929j2582
$$ plain form
437 6563 9807 -8665 -9849 8436 7182 -11499 -8385 10174 5703 -11660 -4688 12285 3421 -13023
451 -13023 -2779 12293 262 -13397 565 13354 -1534 -12363 3962 12977 -4534 -11838
463 -11838 6414 11516 -7259 -9787 9835 10469 -8755 -6819 12105 7404 -11419 -4739 12939
476 12939 4249 -11794 -593 14451 1444 -12066 2168 13249 -2703 -12018 4734 11822 -5472
489 -5472 -10068 7456 9908 -7941 -8515 8396 6412 -10364 -6733 9056 3960 -10747 -3963 9535
503 9535 1128 -11513 -2573 8263 -1917 -11402 -361 8099 -3331 -10214 1809 7325 -5405
516 -5405 -9880 2879 5936 -7002 -8333 5320 5852 -7510 -6612 6717 4298 -9132 -5283 8025
530 8025 3192 -9256 -2546 9671 1828 -9498 -257 10013 -603 -9726 2087 10016 -2566
543b566n821J3640M550j4278k836J4261O64j4517J274J4646k606j3903M457J3042
557A0007o117j2485P403J1477q703j0260R815R201j0520p789J1388O640j2056
570a999n700J2206M330j2509k932J3177K173j2971j088J2908l89j3392J579J3669
584I062k484j3381L990J3390n530j3337P018J2985q692j2585J0406J1851j2159
597E34j0870J4125R622j5874q016J7087N738j8760l599J9920J145k0354J719K0420
611A2837n025k0418P563J9386j0397j7808J3142J5842j5566j3563J7356J0725
623A4074j8748p811J9649M552j9924j465J9790j369j8786M204J7505o757j6067
636a1153Q674J4196j0034j1858J1206R946j1809q033J1794N952j1573m185J1061
$$ plain form
543 -2566 -8387 5253 9803 -4475 -7311 6950 7614 -6903 -5629 9017 6411 -7492 -3035 10007
557 10007 3890 -8595 -1192 10285 1582 -8678 1137 10338 -182 -7971 3417 10057 -1999
570 -1999 -7699 4507 8837 -3672 -6604 6573 8746 -4225 -5313 7595 7206 -6186 -4607 9062
584 9062 6578 -6803 -2813 10577 5047 -8290 -1272 11713 3021 -9564 842 12693 534
597 534 -10336 3789 13411 -2463 -10479 6608 12346 -6414 -10013 9907 11052 -9302 -7583 12837
611 12837 7812 -12606 -5043 14343 3946 -13862 -720 15122 -444 -14007 3349 14074
623 14074 -4674 -12485 7164 11716 -8208 -9673 10117 8748 -10038 -5834 11671 4914 -11153
636 -11153 -2479 11717 1683 -10175 1031 10977 -832 -8865 2929 8881 -2692 -6877 4184
649D184K863j0429j837R512R00q781n27P841J31p486l26O792L35o808l95O851
665B820K86p653n68P812R2q591M80R480j435j0477K290J0873l749j1513N549J1611
681G307p447j1473R459J0853j1287r560J3228Q085j4792o141J6351M039j7133
694h511j222J7899j285j7731M155J7458o541j6405R350J5275j1320j3312J3367
707A177J1435j4772r036J5971O812j6433m220J6750J980j6638L21J6244k361j5347
721h117M123J4334n822j3297P244J2070q369j0808R143R326r920q246J0511P029
735I201j0998n970J1169M771j1590l738J1768K639j2151j522J2037L11j2044P89
749e328J2035k287j1907L658J1497n080j1026O486J0146p987r263R164Q082j0291
$$ plain form
649 4184 7047 -3382 -5219 4293 5193 -3588 -4115 3726 3857 -3629 -3955 2837 3172 -3636 -4031 2820
665 2820 3106 -4547 -5115 2697 2789 -5802 -5322 4158 2723 -7754 -5464 5409 1660 -9853 -4304 7307
681 7307 -140 -11613 -2154 8699 -2588 -12148 1080 9165 -5627 -11768 4583 8622 -8511
694 -8511 -9733 8166 6881 -10850 -6695 10763 4222 -12183 -2833 12442 1122 -12190 1177
707 1177 12612 -2160 -11196 4775 11587 -4846 -9066 7684 9664 -6974 -6653 9591 7230 -8117
721 -8117 -3994 10340 4518 -8779 -1535 10535 2166 -8642 501 9827 -93 -8339 2172 9201
735 9201 -1797 -7767 3402 8173 -3417 -7155 4613 7252 -4899 -6421 5616 5927 -6117 -5328
749 -5328 6707 4420 -7487 -3829 7668 2588 -8438 -1952 8194 207 -9056 108 8190 -2101
763b101o855J1125N224j1811l736J2130K084j2278n05J1829j193j1270K588J0414
777E645l898r576M907Q368n744p207O366O023o723m939O917L977o842l048O707
792I33K371o372j720O274J473n885j116N722J181n450r62N737J138n904r11O381
808B890J045o683n93P497R9q096P75Q851j621r153K935R515m397r568O104R277
824H877p790q673R473P627j1309o206J2768M368j4153k372J4862j07j5367K492
838e510J5246n143j4789P423J3614r831j2175J1790J0235j3654q098J4842N636
851I586j5538l070J5794L69j5598J965J5061m284j3728O283J2384q075j0654R445
865f0Q950j0369o964J1063N096j1157l343J1065J838j0692l80J0198o93r526J575
$$ plain form
763 -2101 -8956 2169 7393 -4418 -8154 3976 6060 -6218 -6723 5106 3913 -7357 -4769 5645
777 5645 1747 -7829 -2922 5446 -298 -7505 -1139 4884 -1839 -6778 139 4116 -2726 -5774 933
792 933 3304 -3068 -4788 1486 2959 -2926 -4042 1680 2861 -2589 -3551 2186 3324 -2580 -3491 2890
808 2890 3935 -2748 -3341 4156 4255 -3841 -3066 5785 4164 -4989 -2054 7461 3064 -6504 -400 8877
824 8877 1087 -7586 1887 9514 -1795 -8001 4767 9135 -5018 -7390 7472 7365 -8002 -5510
838 -5510 9736 4593 -10196 -2773 10841 1010 -11165 625 10860 -2794 -10892 3950 9586
851 9586 -5952 -9022 6772 7141 -8457 -6492 8569 4285 -9443 -3160 9224 1149 -9505 -60
865 -60 8890 -1479 -8443 2620 7716 -3441 -6784 4281 6119 -4573 -4953 5245 4552 -4974 -3399
880c399Q683k249p930K809P242l022o609L015O010l267n638L356N466l577n293
895d403L642N067l984m994M452M985n040m879N550M578o259m167P084L898p871
910b341l231Q442K352q999j233R669L54r964Q30R998k167r831L621R759m717r162
926f620N787Q363o911p517P998O576q651n476R246M085r874k819J0132J838j0167
941d010o90R949p66j0048J853R824k762r411L498Q715m588q415N432P972o103
956D50p393O772O451p703n842Q549N143r030m207R507L129j0286j992J0773J026
971E347j0811L90J0891j945j0921L350J0798m402j0098N901R309p403q527Q655
985E34P572r366o122J0255M612j1096l182J1388J841j1323n5J1157j550j1066
$$ plain form
880 -3399 5284 3035 -4895 -2086 5156 2134 -4475 -1460 4550 1283 -4355 -999 4467 890 -4403
895 -4403 -761 4306 322 -4672 -220 4765 -275 -5154 396 4974 -1285 -5452 1632 5530 -2341
910 -2341 -5572 2870 5222 -3777 -5010 4659 5013 -4951 -4121 5877 3710 -6121 -2500 7259 2542 -6620
926 -6620 -833 7530 619 -6898 1100 7676 -975 -6451 2795 6880 -2994 -5813 4319 6157 -4010
941 -4010 -4700 5249 4483 -5565 -3712 6112 3350 -6061 -2563 6152 1564 -6851 -1419 6553 450
956 450 -6943 -171 6280 -1423 -7265 1284 6427 -2603 -6810 2697 5826 -4460 -6452 4321 5347
971 5347 -5464 -5074 5817 3872 -7049 -3699 7099 2697 -7401 -1500 7809 406 -8121 534
985 534 8106 -1260 -7382 2873 7485 -3611 -6793 4595 6436 -4887 -4942 6215 4665 -6401
999f401K733J0412l898r465N222Q522o333p906O922O661p259n352P685M117q058
1014b398l365P862K503p535j390P441N56p398j37O940k52o365R25O385j439o299
1030c966J509O084j742n661K302N813k800n848K946N843l386n367M188N248m873
1045B90n229N338M715n756m005O630L335p329k918P703J956q108p06Q499l54q847
1061d786J303Q497k590q096L858P837m975p470N816O466o795n322P728M478q338
1076b389l559Q546K248q727p93R044j86q868J187Q437k406p885L693P557m279
1091A620o860M950N928n654n090O431M516o765l601O798K664p093j754P472J018
1106D580p331m17P143o93p083J484O967k101o747K642O187l509n998M142N602
$$ plain form
999 -6401 -3668 6744 2846 -6619 -1397 7125 792 -7114 -192 6469 -790 -6142 1543 5660 -2398
1014 -2398 -5763 2099 4602 -2933 -4323 3118 3674 -3724 -3861 3079 2827 -3538 -2613 3772 2333 -3966
1030 -3966 -2457 3627 1885 -3776 -1474 4339 1539 -4309 -1363 4480 1094 -4273 -85 5163 290
1045 290 -4939 399 5114 -642 -4647 1983 5318 -2011 -4929 2774 4730 -3378 -4084 4415 4061 -4786
1061 -4786 -3483 5014 2424 -5672 -1814 6023 1048 -6422 -606 5860 -935 -6257 1471 5949 -2389
1076 -2389 -5948 2598 4846 -3881 -4674 4370 4184 -4684 -3497 4940 2534 -5351 -1658 5899 1620
1091 1620 -5240 -290 5638 -16 -5106 1325 5841 -924 -4525 2273 4937 -2156 -3910 3562 4580
1106 4580 -2751 -3168 3975 3282 -3801 -2317 4650 2549 -4198 -1556 4631 1122 -4876 -734 4868
1121D868m679n016M987M367n696l856O116L308o487k595O637J578o880q66P207
1136B993J53p072O54O983j665o836K436O672k969o149L841N654m565n226N270
1151A74M814n669m007O255L169o639k472O982J781p073r93P291L8p275N77P264
1167D217j436o976K225O630l041o463L685N988m409n358N052M670n662m153O078
1182A047L480o521k681O788J884p044j162P123M20p047L74P003j159o768J863
1197b400O591k541o137L252N829l837n273M394M810m813m187N237L671n503l027
1212c934N795K414n954j828O114J245o205o50O315n0o334O60O220j288o224J917
1228a787O041k573n989L118N770l776n419M380M943n035m615N533M051o161l403
$$ plain form
1121 4868 189 -4827 160 4527 -1169 -5025 1091 4399 -2088 -4683 1954 3532 -3348 -4214 2993
1136 2993 3146 -3926 -3272 3711 2046 -4790 -2354 4318 1349 -4800 -959 4695 130 -5096 174
1151 174 4988 -681 -4688 1567 4736 -1903 -4375 2607 4388 -2685 -3678 3613 3651 -3624 -3047 4217
1167 4217 2781 -4195 -1970 4660 1619 -4844 -1159 4829 420 -4938 114 4784 -878 -5031 1047
1182 1047 4527 -1994 -4675 2113 3997 -3047 -4209 2914 3334 -3713 -3339 3664 2505 -4263 -2400
1197 -2400 4191 1650 -4487 -1235 4594 757 -4516 -122 4688 -125 -4312 925 4596 -907 -3934
1212 -3934 1861 4275 -1679 -3507 2607 3852 -2353 -3003 3312 3262 -3072 -2412 3808 2520 -3704 -1787
1228 -1787 4254 1681 -4308 -1190 4580 804 -4615 -235 4708 -327 -4942 591 4642 -1519 -4922
1243d922O666K666p082j934P393J048p613o7P836r24p848J844P653k751p312L804
1259a543O976m646o476N553N758o190m939O931M086p513l096P743K116p908j094
1274d242Q062P7p987Q38P764j839p444K657P003l399o560M110N791m707n139N203
1290A88M473n598l836N813L047o102k242O184J706o288j002O267K64o060K15O139
1306C168q24n887J434N624j924n361K554N197k871m872L311M579l868m004M173
1321D29L766m482l150M670K707n037k197N286J633n371j078N429L13n477J77N441
1337C059q32n381J333N092j996m906K328M676k922m432L321M041l901l672M188
1352dL182m507k732M708K311n163j776N438J212n499o74N703R8n812N97N877j133
$$ plain form
1243 -4922 1744 4410 -2672 -4606 2787 3835 -3778 -3845 3991 3067 -4781 -2937 4716 1965 -5347 -1543
1259 -1543 5433 787 -5689 -136 5622 -568 -5507 1424 5510 -2003 -5099 2644 4760 -3148 -4242
1274 -4242 3820 3897 -4090 -3252 4512 2673 -4771 -2114 4889 1490 -5070 -960 4831 124 -5015 188
1290 188 4661 -937 -4773 1040 4087 -2015 -4257 1927 3633 -2655 -3657 2610 2874 -3186 -2971 3168
1306 3168 2344 -3543 -2109 3515 1591 -3770 -1216 3981 1110 -3762 -451 4128 260 -3744 429
1321 429 4195 -287 -3437 1233 3940 -1097 -3294 1992 3625 -1746 -2824 2605 2918 -2559 -2382 3059
1337 3059 2227 -3154 -1821 3271 1275 -3631 -1303 3373 451 -3981 -660 3381 -520 -4192 -4
1352 -4 3178 -1329 -4061 647 2958 -2205 -3981 1457 2669 -2830 -3504 2199 2297 -3515 -2918 2959 1826
1369A826n764J911N711k509n460L222N304l774m897M676M410n237l774N854L168
1384D667o297k357O858J403p102m56P346m50p368J494P187k550o913L627O487
1399E576m586n854N234N079n993m104O443L206o906k239P101J038p012o0O860
1414C783r85o562J799O144k666n545L395M877l959m227M288L510m603k664M762
1429A347K067m795j570M608J047m452m81M325R3m069J10L660m77l393O80L350
1445B050q79l187P85K958j042k884J194L022j397l216J579L000j942l012K335
1460f36L152k730l274L053K997l506k677M117K604m611k292M932J776n247r99
1475c341N749L52n836M05N779j115n701K257N641k940n208L715M795m561m113
$$ plain form
1369 1826 -3938 -2027 3684 1175 -4285 -1063 4241 467 -4430 246 4656 -581 -4355 1499 4667
1384 4667 -1630 -3987 2871 4274 -2828 -3284 4062 3612 -3756 -2262 4925 2375 -4538 -911 5576
1399 5576 990 -4864 370 5449 -544 -4648 1795 5001 -1905 -4144 2957 3995 -3017 -3077 3783
1414 3783 2798 -3764 -1965 4179 1513 -4032 -637 4240 281 -3946 342 3852 -751 -3415 1347
1429 1347 3414 -1381 -2951 1657 2704 -1748 -2229 2096 2189 -1880 -1770 1890 1413 -1980 -1300 2050
1445 2050 1171 -2016 -1231 1727 685 -2199 -1005 2017 620 -2596 -1017 1983 41 -2971 -636
1460 -636 2516 -214 -3488 -435 2562 -944 -3621 496 3100 -1511 -3803 1129 2905 -2342 -3341
1475 -3341 2408 2760 -3076 -2671 3108 1993 -3708 -1451 4190 1250 -3958 -243 4552 -9 -4122
1490d122N330L692n766k910O094K135o492j296O868O03o748K60O407j208o348
1505c501J989O106k558n636L124M844l980m480M563L990n002l300N217K422n820
1520b022j780N956J242o008n72N993l44o147Q90O077j358n708K015N262k714n022
1536d240L256M682l596l951M083L318m662k800N029K316n035j464N334O25n528
1551b633j12N551m14n328J259N178j765n202K083M875k384m202K758L783l155
1566B92l585L259L066l224k427L381J906l575j721L618J276l441q61L577M62l850
1582a847k65L727K13l754J97L937n58m025N15M174p24m087J161M121j436m296
1598b947J746M191k031m003K669L881l203l735L662L307m149k680M726K168n261
$$ plain form
1490 -4122 1208 4900 -866 -3776 2318 4453 -2039 -3335 3533 4136 -2612 -2352 4055 2847 -3501
1505 -3501 -1512 4594 2036 -3600 -476 4368 388 -4092 471 4461 -541 -3841 1376 3798 -2022
1520 -2022 -3802 2154 3396 -2612 -3184 2809 2465 -3682 -2792 3285 1927 -3781 -1766 3496 782 -4240
1536 -4240 -984 3698 102 -3849 234 3552 -1110 -3910 1119 3435 -1600 -3064 2270 2895 -2633
1551 -2633 -2745 2806 2392 -2936 -1677 3501 1736 -3466 -1383 3492 1108 -3094 -336 3447 292
1566 292 -3293 -34 3032 -192 -2619 762 2668 -907 -2628 990 2266 -1175 -2036 1541 2003 -1847
1582 -1847 -2112 1615 1828 -1926 -1729 2208 1650 -2375 -1860 2314 1590 -2497 -1336 2785 1349 -2947
1598 -2947 -1201 2990 959 -3044 -375 3506 303 -3432 230 3537 -612 -3292 1434 3602 -1659
1613a659j664N565Q53n833P2O043r00o214J644O020k563n736L422N393m216m921
1629d694M710M186n250l393N799K453n951j699O142O27o131M09O069j225n673
1644c621K019N352k857m778L515M337l869l857M451L065m574k435M762J925m793
1659a358j201M738O16m604p5M397m08m167Q38L988j254l665J440L434j843l185
1675b309J994K955k331k763K447K436k605k354K809K063l034j877L097J533l270
1690a209j341L380J074l469q91L543M57l652o3L835k81l790O58L741j156l663
1706b827J647L685k004l415K416L163k885k775L304K649l521k198L802J683m059
1721a335j191M276Q43m290k83M213k97m276Q09M260j206m025J706L781k349l726
$$ plain form
1613 -1659 -3323 2242 3095 -2738 -2666 3377 2477 -3737 -2093 3927 1364 -4372 -950 4443 227 -4694
1629 -4694 16 4202 -1048 -4441 1358 3811 -2140 -3839 2303 2930 -3201 -2792 3277 2052 -3621
1644 -3621 -1602 3750 893 -3885 -370 3967 98 -3759 692 3757 -817 -3252 1510 3435 -1358
1659 -1358 -2559 2179 2795 -1809 -1884 2513 2105 -2062 -1224 2764 1510 -2155 -715 2719 876 -2309
1675 -2309 -315 2640 309 -2454 -7 2429 -176 -2530 279 2342 -692 -2569 528 2061 -1209
1690 -1209 -2550 830 1904 -1565 -2456 1087 1544 -2108 -2171 1664 1383 -2407 -1749 1992 836 -2827
1706 -2827 -1180 2505 501 -2914 -498 2665 -220 -2995 309 2958 -563 -2761 1041 2724 -1335
1721 -1335 -2526 1750 2593 -1697 -1980 2233 1936 -2340 -1531 2729 1523 -2502 -796 2985 636 -3090
1737c090K888L356l206k901L527K402m071k088M272J718m366j008M441K88m726
1752b564O2M785m93m488J192M303j851m284K289M076k650l503L249L072l764k760
1768c329L934K390m081j498M383R67m704n03M600J08m387O11M469j332m488J594
1784a266M163j931l803K626L453l146l268L170K724l278k245L713J783m037j605
1799b947L911J055l927l86L989O8m109J14L807n23l700J153L739j491l685J555
1815a377L382j910l001K474K977k733k849K834K411k973k009L559J827l670j688
1830b746L723J105l767m88M145K65m218M6L923n81l911J294M001j491l923J733
1846h90L468k322l093K862L234l273k825L199K194l672j621M112J453m145j047
$$ plain form
1737 -3090 -202 3154 -52 -2953 574 2976 -1095 -3183 1089 2807 -1559 -2567 1874 2162 -2564
1752 -2564 -2502 2283 1790 -2698 -1506 2797 946 -3338 -1049 3027 377 -3126 123 3195 -569 -3329
1768 -3329 605 2995 -1086 -2584 1799 2766 -1938 -2441 2159 2267 -2120 -1509 2960 1628 -2860 -1266
1784 -1266 2897 966 -2837 -211 3242 96 -3172 -2 2722 -556 -2801 912 2695 -1342 -2947
1799 -2947 964 2019 -1908 -2294 1695 1763 -2346 -2232 1575 1052 -2648 -1495 2244 753 -2932 -1377
1815 -1377 2005 95 -2906 -432 2545 -188 -3037 -203 2208 -765 -2774 785 2612 -1058 -2746
1830 -2746 977 2082 -1685 -2173 1972 2237 -1981 -1935 1988 1407 -2504 -1210 2791 1300 -2623 -890
1846 -890 2578 256 -2837 25 3259 -14 -2839 360 2554 -1118 -2739 1373 2826 -1319 -2366
1861b366L981L87m220L06M383m60m247Q33L907j537l765K156L793k160l491K485
1877a5K876k988k477L442K435l477j921L520J265l784r13M131O89m023j77L787
1893B370m70l958Q86M047j080l738J385L412k035l392K472L224k551k909K808
1908D71K359l399k114L563J960l626j392L646P76l970m98M103J71l786K96L751
1924B311r69l880J299L880j561l351K077L080k584l050K996K739k993k211L389
1939A172J751l737j523L894J168l777n38L897j6m065L25L938p29l633J207L512
1955B846j727l486J900L110k179k691K537K361k988k259K995J764l155j200L276
1970A104P97l543o58L374K30l258L03L212o96l270Q13L069j150k811J580K689
$$ plain form
1861 -2366 1615 2002 -2218 -1912 2471 2011 -2236 -1403 2504 967 -2798 -642 3151 991 -2500 -15
1877 -15 2861 -127 -2604 838 3273 -204 -2125 1395 2660 -1124 -2037 2094 2783 -1240 -1417 2370
1893 2370 1900 -2058 -1172 2875 1795 -1943 -558 2854 819 -2573 -101 3123 572 -2337 471
1908 471 2830 -569 -2683 880 2840 -786 -2178 1468 2244 -1726 -2224 1879 2050 -1736 -1440 2311
1924 2311 1342 -2538 -1239 2641 1080 -2271 -194 2886 302 -2748 248 2987 -6 -2217 1172
1939 1172 2923 -814 -2337 1557 2725 -1052 -1590 2307 2291 -1774 -1449 2489 1760 -1873 -666 2846
1955 2846 1119 -2367 -467 2643 464 -2227 310 2671 -317 -2576 419 2183 -972 -2172 1104
1970 1104 1901 -1642 -2300 1074 1304 -1954 -1651 1561 865 -2405 -1592 1477 327 -2484 -904 1785
1986A785j865k557J864K348k007j920K385J723k513j570K528J238k532q37K845
2001I15O74k938l84K942M6k816L85K937o67k941Q54K770j075k694J551K642j848
2018C53k502K083K182k406j963K712J881k971j567L081J100l274o98L502L84l633
2034a736J20L505n23l500R52L522j349l369J770L053k162k849K641K613k883k325
2050b520L159J841l458j318L666J017l836n41L907j29l819N24L796j065l528J317
2066i87L458j930l108K205K781k558k505K845K138l179j664L208J294l353r06
2081b261L419L90l461J0L391m17l203P34L131j117k969J467K804j704k519J982
2097c23K300k164j989K391J741k458j333K534J130k620q56K777O83k698m10K677
$$ plain form
1986 1785 -80 -2637 -773 1575 -432 -2352 33 1756 -757 -2327 201 1439 -1093 -1930 915
2001 915 1589 -1349 -1733 1209 1255 -1561 -1176 1761 1094 -1847 -993 1777 702 -1992 -441 2201 353
2018 353 -2149 -66 2116 -290 -2253 459 2340 -631 -2198 883 1983 -1291 -1989 1513 1897 -1736
2034 -1736 -1616 1889 1366 -2134 -1182 2340 991 -2378 -608 2445 283 -2566 75 2688 -195 -2520
2050 -2520 639 2480 -978 -2296 1370 2387 -1449 -1990 1917 1788 -2031 -1507 2289 1224 -2304 -987
2066 -987 2471 541 -2567 -362 2419 -139 -2644 201 2339 -840 -2504 704 1998 -1355 -2261
2081 -2261 1158 1548 -1913 -1903 1488 1071 -2132 -1398 1733 616 -2353 -886 1918 214 -2305 -323
2097 -323 1977 -187 -2176 215 1956 -502 -1835 699 1829 -791 -1647 1130 1813 -885 -1295 1382
2113A382J84k583RK674k52k673N08K679p74k558R67K485j234k460J483K273j715
2130C95k216J899J942k139j846K271J713k650j570K835J250l058j045L243N40
2145A564l332l09L390p9l517N75L436r53l427J322L298j746l071K140K833k488
2161c64k574K928K242l199j845L499J424l664r24L839N17l904O3L901n37l771
2177b369J123L708j575l405J866L221k214k899K671K461k905k143L193J707l309
2192h69j240L428Q14l459m16L463m5l295M48L298r32l069J326K825j586k599J861
2209d7K319k003k055K287J789k390j570K593J248k544r40K581O88k692l59K639
2225A544J18k609P0K522l52k382N80K279p44k293J010K031j181j969J273J860
$$ plain form
2113 1382 1566 -1017 -1008 1666 1414 -1259 -751 1928 1154 -1404 -437 2048 814 -1646 -163 2110 395
2130 395 -1821 78 2020 -119 -1965 306 2019 -631 -2201 634 1884 -1174 -2219 1024 1564
2145 1564 -1768 -2077 1313 1234 -2283 -1708 1728 775 -2652 -1330 1968 222 -2849 -709 2124 -364
2161 -364 -2938 -10 2232 -967 -2812 687 2111 -1553 -2477 1362 1879 -2025 -1962 1939 1402 -2369
2177 -2369 -1246 2462 887 -2518 -652 2569 355 -2544 127 2588 -317 -2460 733 2440 -869
2192 -869 -2109 1319 2133 -1326 -1742 1721 1676 -1619 -1171 2127 1195 -1874 -548 2277 691 -1908 -47
2209 -47 2272 269 -1786 501 2290 -100 -1670 923 2171 -373 -1313 1268 1956 -736 -1095 1544
2225 1544 1662 -947 -877 1645 1293 -1089 -509 1770 1026 -1267 -257 1774 593 -1376 -103 1757
2241A757j550j724J587J598j857j390J907J200k031j162K141R39k299p40K316
2256F92N66k512l15K586K7k524J76K623n06k620Q74K638j134k453J347K407j618
2273B54k332K134K040k294j722K604J474k748j131L058P56l201l29L323l6l354
2289a504N12L265r06l221J475K972j855k790K151K537k643k149K862J730l089
2304f53j375L249Q10l350l80L350k16l196N14L093r72l018J379K707j736k473
2320b267J999K159k287j791K465J406k459j145K545Q03k605m54K572J62k552K10
2336a239K367l35k306N34K260p84k057Q73J953j037j778J156J680j320j486J408
2352a11J374j472j353J596J226j782j010J916Q11j896p38J964O06k065l97K143
$$ plain form
2241 1757 207 -1517 70 1668 -189 -1579 328 1528 -503 -1665 476 1415 -884 -1624 692
2256 692 1258 -1254 -1569 1017 1044 -1480 -1304 1319 813 -1807 -933 1705 571 -1882 -535 1872 254
2273 254 -2078 56 2096 -198 -1920 684 2158 -590 -1721 1337 2093 -1108 -1437 1886 1850 -1504
2289 -1504 -992 2273 1367 -1854 -379 2593 738 -2052 99 2636 -7 -2156 706 2436 -653
2304 -653 -2028 1221 2031 -1319 -1699 1651 1435 -1761 -1247 1846 874 -2144 -765 1942 206 -2267
2320 -2267 -268 1891 -396 -2187 278 1684 -775 -1920 625 1428 -1177 -1631 941 1103 -1449 -1239
2336 -1239 1128 793 -1513 -979 1281 497 -1560 -687 1266 229 -1549 -393 1287 -33 -1519 -111
2352 -111 1263 -209 -1562 34 1260 -522 -1532 384 1195 -701 -1439 525 1131 -934 -1331 812
2368H12K09k192k5K356l10k291N17K342p44k260J051K201j357j966J640J967j893
2385E7j717K082J513k203j244K528Q69k534n27K627K57k680Q9K727m60k608P29
2402d95K595j186k419J368K316j701k117J883J871k195j588K340J296k565j093
2417a690K645O59k762l46K779m4k803K35K722o13k650Q70K535j229k413J479K236
2434A610j836j988K041J811k278j477K370J165k487q78K626N95k657k22K717q7
2450A025k692L57K650o59k475R18K359j201k180J465K041j553j810J691J607j935
2466c92j389K110J061k085q58K152N84k244l34K280J16k225N1K182k96k165M71
2483i81K107o21j935Q58J812j049j777J260J660j296j563J526J402j602j268J736
$$ plain form
2368 812 1021 -1171 -1196 1160 850 -1441 -924 1418 674 -1586 -535 1666 309 -1657 -17 1950 57
2385 57 -1660 422 1935 -268 -1512 1016 1885 -649 -1176 1451 1708 -972 -883 1844 1384 -1224 -495
2402 -495 2100 914 -1505 -137 2179 478 -1639 244 2115 -80 -1668 672 1968 -597 -1690
2417 -1690 955 1614 -1148 -1494 1285 1241 -1562 -1327 1395 782 -1868 -998 1537 308 -2105 -626 1610
2434 1610 -226 -2214 -173 1638 -640 -2117 253 1418 -1069 -1947 679 1274 -1383 -1605 1112 1025
2450 1025 -1667 -1310 1340 681 -1794 -876 1483 282 -1898 -433 1608 55 -1755 -64 1543 -392
2466 -392 -1781 329 1390 -695 -1553 599 1183 -1061 -1395 885 1001 -1224 -1173 1009 713 -1452 -981
2483 -981 1126 505 -1430 -572 1240 191 -1586 -326 1334 38 -1525 1 1403 -199 -1467 269
2499B69J230j848r68K009O95k098n29K280K95k236q2K346k58k378N89K272q15
2516G73k137R80K163j283k080J532J836j775j606J938J396k232j128K271Q42k361
2532h71o05K486K14k551Q0K476l17k421O56K330q98k224J095K070j339j800J559
2549f0J655j738j417J904J150k030r06K213O47k222l38K230J92k333J72K237l18
2566A038k160N27K028p42j935R93J811j180j716J327J571j540j405J643J187j815
2582c68r79J791Q23j971n97J992L34k028j56K068j56k062K75K010m81j961O77
2599g89J945r63j826J185J673j345j528J616J345j720j107J806R85j845p34J999
2615F97N26j998k85K040J00k015K02K056l87j937O93J861q84j748J094J641j174
$$ plain form
2499 269 1499 -349 -1317 692 1387 -711 -1240 1040 1335 -901 -983 1363 1105 -1273 -684 1588 773
2516 773 -1364 -384 1779 496 -1584 -52 1784 9 -1597 341 1737 -495 -1623 648 1490 -871
2532 -871 -1476 1010 1224 -1327 -1247 1229 912 -1509 -853 1477 579 -1645 -550 1520 181 -1619 -60
2549 -60 1595 -143 -1560 344 1494 -536 -1442 771 1418 -804 -1142 1088 1280 -1053 -881 1356 1038
2566 1038 -1122 -595 1433 691 -1244 -251 1560 380 -1336 -9 1562 22 -1383 260 1447 -368
2582 -368 -1347 444 1267 -704 -1301 691 1025 -1003 -1159 909 753 -1309 -1034 976 495 -1466 -789
2599 -789 1156 193 -1633 -448 1225 -120 -1648 -32 1313 -407 -1514 292 1277 -568 -1302 697
2615 697 1223 -775 -1060 980 1080 -935 -733 1323 936 -1001 -308 1553 669 -1079 15 1656 482
2632D82j464J315J326j546j172J716R95j715p46J803M81j890l19J932J68j989
2648f23J23J901l64j935N71J848p00j793R52J566j109j459J216J355j329j106
2664h86J399R81j657q61J794O29j807l70J741K45j897k0J880j63j834L42J859
2681A375o66j769P49J671r32j609J212J353j285j484J469J251j587j072J737Q29
2697A242j974o90J954M63k011j71K077j50k202K76K091m57j992Q52J821j055j896
2714a822J227J721j371j510J672J295j775j183J873R68k006m94K128M05k282j96
2730a350K228j10k031M43K106o98k068Q58J816r71j667J349J452j428j407J499
2746B1J168j687q40J769O55j834n88J780L11j799p4J874n0j910K35J628m66j584
$$ plain form
2632 482 -982 333 1659 113 -1059 657 1652 -63 -809 994 1475 -415 -734 1198 1366 -623
2648 -623 -500 1401 1037 -898 -327 1521 821 -972 -20 1546 437 -1022 194 1549 220 -886
2664 -886 513 1494 -163 -1024 770 1399 -408 -778 963 1208 -689 -709 1171 1008 -826 -484 1375
2681 1375 709 -1060 -311 1360 428 -1181 31 1384 99 -1385 84 1335 -252 -1324 413 1242
2697 1242 -732 -1422 532 995 -1016 -1187 890 740 -1462 -1186 905 448 -1544 -692 1129 74 -1822
2714 -1822 -595 1126 -245 -1755 -83 1212 -563 -1746 127 1095 -911 -1405 723 1128 -1154 -1350
2730 -1350 878 768 -1263 -820 1286 588 -1480 -622 1194 223 -1444 -95 1357 -71 -1478 21
2746 21 1189 -498 -1338 431 1086 -748 -1336 444 755 -1044 -1118 756 706 -1204 -969 659 193 -1391
2764a391O54J634p00j616P51J438j004j251J226J271j304j143J259R83j443o90
2780a326J648O93j690n13J705K14j704L4J840r8j809K12J781m31j706P10J738
2797A298q81j597J045J371j196j311J517J176j510j057J503Q33j724n82J853M95
2813A233j797l34J803q1j795J64J882k60j729L77J663p41j653R57J678j032j439
2830a104J163J167j365j132J586J076j614q15J655O24j854l92J910L25j916j2
2846f98J939l50j938M97J991p08j744R44J629j269j518J335J424j504j125J739
2862F44P30j787o98J855M52j856j04J842k18k014L92J851n74j634Q65J427j039
2879A34j461J200J182j223r09J366P05j410o84J428M95j267l06J331J59j357p5
$$ plain form
2764 -1391 -737 897 197 -1419 -668 770 -234 -1485 -259 1012 -292 -1435 -176 807 -636 -1326
2780 -1326 322 1015 -675 -1188 517 731 -973 -939 901 803 -1006 -794 987 556 -1150 -440 1298
2797 1298 417 -1180 -135 1236 40 -1271 246 1422 -88 -1145 358 1191 -533 -1115 738 1233
2813 1233 -564 -898 905 824 -971 -807 1075 815 -914 -537 1126 385 -1268 -311 1367 335 -1104
2830 -1104 59 1226 -139 -1271 315 1391 -223 -1038 617 1241 -613 -1005 905 1230 -686 -698
2846 -698 1241 891 -1047 -550 1441 733 -1011 -67 1562 293 -1225 110 1534 30 -1095 644
2862 644 1374 -413 -1111 744 1196 -660 -764 1078 860 -1154 -762 1089 515 -1119 -254 1173 134
2879 134 -1327 -127 1055 -168 -1077 289 994 -416 -1100 328 823 -444 -750 581 740 -617 -692
2896f92J288j5j089J31J113k59j066K64J049k75r98M17J006n26j062N73J014o19
2914B54r80Q37R13q88j040R40R73j124p86J291O55j457p00J521M35j541j65J666
2932H04p7j688J69J694n12j593P33J629j043j468J198J212j323j061J628Q25j687
2949e60p09J787M57j820p2J874j48j863L69J728n84j638Q59J513r80j361J170
2966B2J137j298r62J443P75j456o41J504M66j614k05J502J21j564R4J468k16j544
2984i68M50J446n33j332N76J265p56j223R95J063r95j021J106Q76j170q43J440
3001C76O37j410n34J425M24j512j54J540L1j539J98J532l98j495N65J417o68j343
3019i08Q37J261r92j188J159R61j160p76J210N88j287m95J352K95j367k27J332
$$ plain form
2896 -692 596 581 -508 -377 736 477 -589 -325 724 449 -549 -132 874 348 -714 -141 873 254
2914 254 -726 111 1024 136 -904 36 1009 -115 -901 390 1045 -412 -1112 409 844 -697 -862 804
2932 804 727 -961 -792 902 390 -1203 -470 1159 116 -1352 -154 1058 -265 -1326 302 1127 -560
2949 -560 -1269 518 975 -845 -917 957 809 -1054 -685 1043 459 -1179 -320 1193 213 -1148 22
2966 22 1159 -139 -1101 342 1117 -339 -980 524 990 -624 -829 673 794 -770 -676 792 576 -968
2984 -968 -518 928 395 -937 -361 904 148 -1075 -80 983 -12 -1033 73 949 -221 -1064 376
3001 376 1013 -397 -931 494 918 -594 -748 792 823 -716 -518 1014 616 -879 -314 1103 435 -908
3019 -908 -71 1190 198 -990 169 1130 -30 -806 404 992 -295 -790 562 857 -510 -737 595
3036E95Pj327O8J319k13j235K99J188l86j158M49J095o09j084O31J049p61r55
3054a028R10Q86j005q19J090P53j197o18J316N12j293m03J468J90j482NJ522j08
3072F99j597L58J602n75j512P76J434r26j376J140J293j420r52J456Q64j660o81
3089a077J835L40j840j17J804r9j870M20J678n79j693Q83J508j121j245J157J154
3106A138j355q72J367P13j439n03J447L95j431j74J440l9j380J62J319l03j135
3123f50L69J114m12j122O02J041o33r16O97Q23p04p64P42P75q41o67Q50N75r02
3142b3n28R25N29j102l50J122K32j197k02J230P3j289O9J246k60j257M27J273
3160I18o63j210P09J088q37j015J009R08j179o91J160N94j251l93J304K33j349
$$ plain form
3036 595 602 -725 -657 662 449 -786 -487 701 315 -843 -394 701 92 -992 -361 688 -73 -1028
3054 -1028 -118 768 -237 -1056 34 787 -410 -1028 288 800 -493 -896 572 762 -720 -715 807 699
3072 699 -898 -540 1062 487 -1025 -249 1185 259 -1117 23 1316 -104 -1056 400 1264 -396 -1077
3089 -1077 758 1098 -742 -859 945 846 -1024 -604 1074 495 -1198 -315 1193 72 -1173 -16 1138
3106 1138 -217 -1089 278 991 -448 -951 496 891 -540 -714 726 687 -693 -531 788 485 -650
3123 -650 -281 833 421 -701 -99 942 309 -607 90 913 209 -555 187 962 121 -546 304 879 -23
3142 -23 -551 374 903 -199 -549 573 805 -392 -594 636 709 -580 -511 735 475 -782 -355 918
3160 918 255 -955 -246 842 5 -1010 -1 907 -272 -963 197 791 -460 -853 451 684 -665
3177f65l4J371j67j360L54J312m72j288O61J064p25j014Q15J035j054p73R72P43
3195G75j125n92J151M22j184k97J138K17j213o1J277j73j219K69J125l49j207
3212a046N38J103o77r81P29R42q60q69R79Q14j057o65J136N30j196l40J242K75
3230E97j285o0J315r4j310L01J279k82j264O10J092p46j067Q34R74q85p72J057
3248B94O52j172n39J204M29j257k30J254N1j170m7J312k21j165L14J083m26j101
3266g35N37J004o09q43O24Q10p97p43Q26O68q85m89R16M84j026l91J009L24j043
3285c59j34J150N3j173L9J197k95j044L36J094m48j080N30J012o32r26Q16Q59
3303I95r04q41R85O58j088n38J180M42j225l37J192J01j223M7J269j63j304L01
$$ plain form
3177 -665 -699 672 505 -855 -501 811 339 -949 -288 776 51 -963 -148 887 -167 -940 32 775
3195 775 -350 -942 209 631 -553 -850 288 505 -708 -769 508 335 -884 -615 510 161 -1046
3212 -1046 -508 595 -82 -1063 -334 608 -252 -1121 -142 672 -385 -1050 86 616 -580 -920 322 597
3230 597 -688 -748 567 473 -837 -536 743 461 -803 -193 899 153 -914 -80 894 9 -763 294
3248 294 946 -226 -765 439 868 -389 -619 635 686 -484 -531 781 560 -605 -291 792 366 -735
3266 -735 -198 806 197 -646 -22 788 -9 -752 74 742 -143 -632 284 768 -258 -649 360 684 -359
3285 -359 -493 657 710 -463 -424 773 478 -566 -230 864 416 -664 -134 878 246 -680 136 995
3303 995 91 -750 235 893 -195 -733 447 889 -336 -673 519 620 -603 -556 713 550 -754 -453
3321d53J136m89j047N70J075p96r32P70Q16r48o08R97O86j147m96J096L69j208
3339f09j60J175J30j153R9J104k37j093L23J167m06j099N12R48n57r17P91Q12
3357H30p55p39Q39O55j004n01J056N24j151l46J144J08j169O7J126m4j202J54
3375d08J141l25j152M23J136n61r84O21Q91q64p87Q96P37r46o27R81M92j027m16
3394g79J175J73j064j05J130Nj188J35J177k21j101L97J015m81j027O44R13p14
3412H4p17P52P20q62p17J002O00j057l99J063K39j090j61J133K7j125J5J112k78
3431C41r87L06R82l90r89O09Q09p35p12P26P00q09n63Q86M20r42m11R72L00r99
3451d86j36R12J48j017j8J058j21r48K32R37l42q53M06Q05l71p90M88P42n93o77
$$ plain form
3321 -453 683 194 -853 -283 792 -4 -936 -166 650 -298 -906 91 777 -370 -866 230 599 -609
3339 -609 -769 406 536 -617 -518 586 349 -744 -421 746 340 -759 -247 701 144 -773 18 830
3357 830 75 -664 175 830 -174 -675 381 905 -246 -592 552 660 -509 -442 684 640 -562 -408
3375 -408 733 408 -744 -321 815 254 -730 -109 782 -82 -869 27 764 -182 -809 172 664 -363 -779
3394 -779 396 569 -495 -600 530 535 -653 -518 659 438 -663 -266 749 268 -759 -115 798 84
3412 84 -633 119 839 -23 -740 262 862 -195 -594 469 708 -382 -543 590 617 -508 -493 619 341
3431 341 -646 -340 642 252 -737 -128 681 -54 -766 -40 660 -149 -712 174 594 -348 -759 213 513 -486
3451 -486 -622 290 438 -579 -597 461 340 -608 -376 561 219 -634 -228 577 206 -584 -96 646 53 -624
3471f24O58O16p42n25Q10N44r69m35J003K63j005j90J041Q0j064%J110j59j097
3490f85L07J089m75r86N29R67p24q29Q28P14r07o58J026N33j068l04J020K87j118
3509d54m2J097p2j117K30J063l19j008N67Q56n40r02P16P44p66n90Q67N51j018
3528a37l81R12L10r46j98J022M0r96K3R54j75q41J55Q47k98p95L52P52m74p13
3548e87M61O04m89o66O65M69o51m92P14L80p33l22P90K20q32j51Q42J54r16K3
3568e17Q62n6r14J75R68l05r25M17R36n39q58O24Q08o03p73Q09M68q03m45R48
3588B77L32r87j84R31J20j075J52R91j99q38J21R15l15q62M05Q31n42p37N81O47
3608E64o62o03P12N24p24m46Q36K78p85k74P98K24q39o3Q63J6r42J28R51k10q40
$$ plain form
3471 -624 34 650 -92 -617 193 737 -232 -667 336 599 -406 -596 445 525 -539 -539 571 412 -685
3490 -685 -378 711 236 -750 -221 746 22 -807 21 735 -172 -830 196 729 -339 -643 377 664 -454
3509 -454 -496 601 529 -588 -358 705 386 -622 -55 801 261 -641 75 819 53 -537 330 881 -137
3528 -137 -518 394 704 -242 -440 582 622 -374 -351 603 428 -413 -258 589 291 -504 -152 600 126 -587
3548 -587 -126 478 -11 -677 -12 457 -194 -686 28 408 -325 -647 143 363 -469 -620 222 376 -540 -517
3568 -517 345 289 -625 -450 518 213 -712 -295 641 102 -756 -132 676 73 -700 109 577 -226 -671 277
3588 277 609 -378 -562 369 489 -586 -434 557 358 -480 -359 556 241 -621 -216 615 73 -664 -83 564
3608 564 -98 -701 11 535 -189 -635 201 479 -306 -580 218 442 -397 -460 403 419 -523 -395 556 346 -494
3629d94L38Q60m29q68M89Q72o18p72Q63N88q39n99R86L95r42k96J034J37j103
3648c98j6J011Jj162K54J052m56j020N60R59p20p43P93O42r00n67Q57M78r06l66
3668f47J016R3r68p6R01pq78J62Q74k54p60K19Q05l42p19M37O62n10n35L75O04
3689D52m06n43M95N31n32m08M41M64m89m24N65M27p08l24O63L09p50j78P69Q3
3709D37q25n2Q58k1r65K46Q59k67r48M54Q70o02p40O79O73q19n76Q26M90r32l06
3730f61J019J90j028m2R84n9j007K33R90l48r83M90R16o64p08P13O54p51n21P86
3750B03M04q76k71R03K09q56j65Q85k4p96M8Q05j71p71K49P11k63p45L16O89m03
3771H1o39M71N97n35n05N73M09o33l51O53L36p15l03P89K15p69j84Q39Q8q79M5
$$ plain form
3629 -494 -156 704 275 -593 -104 768 150 -622 241 829 -10 -609 377 772 -170 -466 568 705 -398
3648 -398 -414 597 598 -564 -310 742 286 -734 -174 785 65 -678 115 757 -143 -710 147 625 -281 -647
3668 -647 369 462 -506 -582 319 312 -566 -404 470 216 -544 -325 480 138 -581 -144 518 8 -527 -152 452
3689 452 46 -497 -2 529 -3 -411 30 494 5 -419 146 573 -135 -459 204 513 -237 -415 354 437
3709 437 -388 -440 418 397 -568 -322 537 270 -678 -224 646 44 -696 -17 656 -163 -739 87 577 -355 -661
3730 -661 358 548 -480 -522 462 403 -604 -371 619 271 -712 -222 694 30 -678 35 689 -62 -583 203
3750 203 607 -269 -540 363 572 -284 -449 436 412 -384 -336 469 298 -473 -224 487 224 -521 -205 484 81
3771 81 -558 -87 510 -25 -530 43 452 -181 -532 121 457 -258 -561 228 443 -326 -510 329 417 -462 -417
3792d17Q43j21q82L40Q07l56p60M65O93n69n58N48N86p12m57Q27L56q51k10P58
3812C30K22r13j6Q08J9q41N7Q92l37o78K88O85l70o43M53N48n01n25N12M02n53
3833a61l39N68L10n89k68O10K31o54j39N92J61o50q8O42J00p70N9P45j09o94J57
3854b86P79l02p02M14P09m92o19N64N92o16n49P68L82p56k85Q31J71q52r4Q85
3874E42j05q94J88R80m02r24M63Q51n70p21O08O92p78n71Q57L77q34l17Q77J36
3894D55q26l7P69Oq20Q3P61j47q02L16P05l58o07M33M78l97m59N26M01n61l26
3915d07N19L85o34k17N20K65n66k30O05J60o32j23O63Q8o61l1O53q6o85J54O43
3936C83k17o84L37O01l34o95N47N04n94m93O84M47p33l41O93L32q42j62Q22P8
$$ plain form
3792 -417 426 305 -577 -237 570 214 -546 -81 612 43 -515 33 619 -93 -550 277 633 -218 -428 330
3812 330 552 -361 -377 431 450 -391 -334 558 221 -457 -169 516 146 -497 -44 504 3 -522 -10 392 -161
3833 -161 -500 68 378 -211 -479 131 362 -292 -431 161 322 -328 -416 226 326 -444 -385 360 251 -443 -286
3854 -286 493 191 -511 -97 612 120 -499 65 657 41 -508 260 642 -114 -399 432 603 -249 -343 542
3874 542 437 -457 -269 711 309 -615 -152 699 129 -592 16 708 -70 -641 216 593 -241 -558 319 455
3894 455 -371 -408 361 367 -453 -370 391 244 -558 -242 463 105 -502 -69 409 12 -447 79 480 -81 -407
3915 -407 112 497 -137 -354 166 431 -135 -365 240 400 -232 -355 308 396 -265 -296 357 271 -414 -260 383
3936 383 166 -518 -181 420 86 -609 -62 442 -152 -645 39 486 -247 -588 105 437 -405 -567 255 333
3956C33q91J07Q16q4q85K93Q17l67p40M33O95m87n75N75N14o06l82N80M19p61
3976a96k37P56J82o62j59O45J25p21M1O76p9o67Q3P35k51o66L54N60l77o57N07
3997hN62n30n15N91M02o21l86O82L10p07k62P53J58p82j7P17k3p11O6P71j77p33
4019d60K88P66m05p08M93O11n60n77O07M85o17l27N94L53p63j75P13J33p17j3
4039b79O59Lp53J26O75j86o93K42O87l42o20L72N18m43m86M92M23n20m07N97L15
4060C80o17k72O02K28p14p9N84J61o98O0O70o8p05J64O77k25o23L34N74l38n50
4081d55M28N36n43m27N78L50o02l36O69K28n83k10O83M0n96l2O17o2n75O8O38
4102D14j87o63L06O21l77o11M59M32m32m54N54M19n59l50O03J65n38k39O85J13
$$ plain form
3956 333 -558 -451 365 281 -604 -311 506 139 -601 -168 527 40 -535 40 554 -52 -434 146 565 -196
3976 -196 -433 323 505 -157 -316 329 454 -267 -226 450 371 -296 -213 522 271 -395 -41 519 142 -515 -8
3997 -8 554 24 -491 100 502 -119 -505 177 487 -220 -482 271 429 -353 -370 347 324 -387 -321 450 273 -460
4019 -460 -172 594 189 -519 -26 585 25 -552 55 540 -77 -404 190 543 -220 -395 318 451 -266 -279
4039 -279 380 383 -370 -244 431 245 -448 -206 481 139 -481 -109 409 -34 -520 -28 395 -125 -532 65 380
4060 380 -237 -509 93 321 -393 -472 112 273 -425 -365 305 237 -468 -304 373 148 -475 -141 433 95 -455
4081 -455 -27 509 -34 -461 117 467 -135 -471 198 426 -157 -367 316 356 -240 -272 345 283 -292 -224 414
4102 414 227 -436 -130 491 114 -497 -38 394 -38 -492 62 481 -78 -428 175 340 -198 -437 248 361
4122C61p01j5O18jo36J87N16j37n57J88N44l46m39M05N33m48m58M45M20n16l89
4143d26O14K70o23j49O22J07o70n0O76n4o64J72N99j66o62K62N85k88n23L07M71
4164D10n27l71N32L19m64l71N73J98n80j75O30J20n82p1N85J6o90J18N99q1o34
4185d46K38N67l12n54L47N30l94l81L96M22n88l19O01L36o35j95O66J27o63j07
4205c64O58L9o44P6P03k03o72K29O53k77n93L49N42m67m80M64M80o00l58O45K20
4226D00n80k37O52R8o19o4O55K9o90M5O40q7o78K47N65k32n41L12N11k83m65L54
4248C2M41m69l13L98L43m33l05N35K30n02k69N72J88n47j02O03J4o70P8N83j05
4269C02n60J35N82k12o25K40N79l87n16M79M51n15m55N37L34o46j87O54J16o34
$$ plain form
4122 361 -340 -355 263 262 -374 -187 329 192 -365 -177 367 21 -418 -13 520 72 -386 59 479 -37 -426
4143 -426 188 458 -165 -314 308 415 -255 -305 371 317 -347 -175 424 258 -404 -142 443 155 -368 -61 410
4164 410 -117 -488 44 363 -101 -472 101 299 -281 -456 174 294 -288 -359 226 242 -448 -330 269 188 -446
4185 -446 -208 359 47 -507 -160 370 -24 -405 -9 413 -175 -494 107 443 -192 -387 279 406 -257 -364
4205 -364 294 333 -311 -235 468 265 -407 -178 475 198 -395 -46 496 29 -451 13 493 -107 -465 180 400
4226 400 -180 -417 235 333 -286 -350 305 334 -356 -311 329 242 -436 -189 376 144 -397 -85 426 143 -322 32
4248 32 473 4 -309 89 432 -1 -306 229 459 -43 -312 260 448 -99 -201 402 416 -254 -176 407 302
4269 302 -258 -123 459 247 -378 -138 441 54 -462 17 468 -47 -502 35 369 -277 -464 190 306 -328
4289c28j15O40M0p47K74O04k00o69K47O15l60m68L39N57m90m48N22L74n83k59
4309d55N68K98o58r8O22L7o43O0N69p1n11J31N08k24n31L29M54k83m38L26L82
4330C72l50l68L60L71m31l35M65K72m88j97N09J53m76j54N05J31o26KN66k1o03
4351c43J08N96j75n81K43N78k55n83L80N16n00l98M90M04n43l27N78J91n68j70
4371c59O31J22n88oN67o8n90J99N06k02n38K49M85l02m89M01L45l38l77M44K74
4392C66m76j86L35K39m01k14M34J50n15p1M83j2n01J14M80r3m61J21M67j86n24
4413d51L31M29k88m04L78L76m32l62N30L49o01k35N34K20n49j02O44k4o47P9O54
4434D29j71o61K43O16l25n28L54N41m60m43M60L73n64k73N69K35o40j14O67j2
$$ plain form
4289 -328 -443 197 237 -510 -236 368 168 -501 -254 361 1 -467 -128 429 -61 -509 13 387 -196 -455
4309 -455 113 411 -247 -345 277 314 -329 -269 300 229 -282 -151 357 133 -398 -69 385 102 -336 -10 372
4330 372 22 -346 14 385 -46 -381 84 356 -132 -329 180 333 -143 -297 208 339 -287 -285 281 260 -343
4351 -343 -235 361 186 -395 -152 426 171 -412 -32 484 -16 -414 76 480 -63 -390 188 379 -189 -359
4371 -359 272 394 -194 -200 367 299 -291 -92 414 212 -326 -77 408 106 -383 18 363 25 -352 92 366
4392 366 -110 -296 39 278 -123 -337 97 247 -268 -339 144 132 -369 -255 225 132 -329 -208 259 73 -451
4413 -451 -120 309 21 -383 -5 371 -61 -423 107 456 -145 -380 154 374 -175 -277 367 343 -304 -225 429
4434 429 258 -403 -160 456 131 -397 -43 498 38 -405 55 428 -136 -409 160 395 -245 -359 308 296
4454B96n54mN45j16n66K61M58k02m46K57M10k98l27K80K98l04k85L27L47m16k63
4475c02M56J24l49j27L82J23l34j88M35P0m36NM39Rm48M2M26l7n45J37M74k12
4497A44n13K95N04m36l67L68M31n06l83N69K26n67k50O81R1o04r5O07p4n74J16
4518c37O45j65o41K89N03l69m95M28M56m55l49M85K53m92j99N15K58n97n5N29
4538B07k0n74O6N71j14n25K00M08j17m30J60M94k63m18K84L76l93k78L80K53l34
4559f7k51L53K43m50j64M52J17m78m3M68K4n45R4M72j9n07J71N01k50n06L11M48
4581C74k85l94L04M38m77l57N50K30m58j92M91R7m14j45N89l7m82M6N06j51n07
4602b74K38M30k40m03L04L44k89l97L99K46l42k80M68J87m45k40M30J31l76j47
$$ plain form
4454 296 -258 -262 283 167 -399 -138 320 118 -328 -71 339 41 -286 -6 292 -12 -297 30 377 -39 -302
4475 -302 154 278 -71 -198 184 307 -27 -215 220 290 -146 -141 298 307 -141 -99 327 290 -255 -118 356 144
4497 144 -369 -74 430 -6 -373 -5 426 -80 -463 106 332 -235 -485 196 287 -317 -412 195 121 -453 -337
4518 -337 308 143 -498 -209 294 -75 -570 -142 314 -141 -490 -5 248 -244 -443 72 330 -267 -322 207
4538 207 187 -387 -321 250 136 -389 -189 219 102 -328 -168 326 63 -355 -71 305 -88 -366 14 267 -67
4559 -67 -318 35 278 -172 -336 116 233 -245 -288 180 204 -341 -247 225 206 -301 -130 371 121 -385 -74 374
4581 374 89 -305 -1 437 -40 -397 153 383 -75 -267 224 321 -93 -238 351 314 -168 -122 384 233 -274
4602 -274 -36 394 154 -249 55 399 110 -287 112 358 16 -264 204 391 -54 -294 136 267 -109 -256
4622b56M45J00m91m8M59o8l78N5M22r7m28R2M10r1m39K76M25l36l87M03J93l14
4644e3k46M30K49m34k38M76J67n94k2N53N7n45J2N36j50m83J52N54k15n12K52
4665e4M10l36l75M49L12m06l07M52K48n27j47M73J08m80p2N09p0m83J62M38j27
4686A77m82K03L95k76l03K40M02l30k98K85K59l95j62L98J70l52j48L68Q4l43
4706a08q2M48Rm40M5L85j02m10J62L90j28l88J36L93k13l52K01M08l40l30M12
4727I6J56k73k98L43K68m82m3M03j1m67J0M70r3m13J40M39k11m04K51L96k83l15
4749c21K70L05k88k58K38L17l76k17M75J10m25j48M82N2m12PM63m1m96J37L42
4770B16r8l92K51L08j99l68K42L01k68k95L49K25l12k46L58J63m03j24M53O1m67
$$ plain form
4622 -256 189 289 -202 -250 209 141 -237 -182 240 143 -285 -193 217 126 -313 -37 388 52 -335 68 261 -53
4644 -53 -299 131 380 -54 -292 184 351 -243 -265 288 345 -200 -188 348 198 -285 -133 421 206 -306 -54
4665 -54 356 20 -355 94 406 0 -307 145 393 -134 -281 192 300 -180 -252 257 187 -296 -134 304 177
4686 177 -305 -102 293 17 -286 -46 356 26 -272 13 272 -123 -285 113 283 -69 -217 151 235 -108
4706 -108 -190 258 267 -173 -128 257 155 -255 -93 297 169 -219 -83 310 97 -255 -54 354 14 -316 96
4727 96 252 -21 -319 24 292 -190 -233 170 159 -308 -298 172 79 -334 -194 245 34 -370 -119 277 -6 -321
4749 -321 -51 254 -34 -292 -54 263 -113 -330 145 255 -170 -318 164 216 -196 -189 274 233 -263 -126 216
4770 216 118 -274 -23 285 86 -282 -40 261 -7 -302 47 272 -40 -286 72 235 -168 -292 161 222 -245
4791b45o0M81m1l95J6M83j73l93J78L90j93m12L08L08k73k96L57K89l85j83L62
4812A23J93l63k10L93J26l87q2M94m8m65R6L96n8m31J60M15k48l72K36L90k64
4833I4l06K49K87k89k84L44J72l36j98M59O5m18r9M77n2l90R2L59r0m48R1M80
4855B59j88m15K38L27k55k80K88K74l03k50L28K27l95j78M37J78m39j18M36K6
4875A97l93o5M35Rl95N2M32j49l71J49L73k10l47K65K53k95k51L96J73l56k10
4896c08L63J51l70j83M86O3m32p7L84O5m20N0L75n6l99J30L63q2l42J52L11k45
4918b1l15L14L08l07k59L50J81l55j54L80J49l87r7M48j6l68j8M23n3l63N5M50
4940C45j79l23J63L21j72l85K72K08k62j90K43K23l26k22M18R0m11m4L17O1l75
$$ plain form
4791 -245 -305 176 135 -260 -244 239 66 -327 -149 241 48 -364 -56 252 -21 -317 40 329 -56 -239 123
4812 123 316 -47 -257 136 262 -125 -207 287 239 -226 -130 266 208 -223 -63 352 104 -268 -32 358 94
4833 94 -212 37 324 35 -249 95 267 -69 -267 192 257 -161 -260 217 165 -225 -133 226 136 -312 -221 259
4855 259 71 -344 -106 221 -34 -314 -26 248 -55 -305 23 250 -145 -323 114 292 -147 -265 171 197
4875 197 -196 -261 174 183 -212 -160 272 123 -248 -99 274 64 -283 -18 235 -60 -311 85 258 -98 -308
4896 -308 55 206 -164 -347 139 202 -230 -307 77 142 -278 -228 147 91 -308 -178 185 103 -239 -87 224 -21
4918 -21 -336 -22 286 -21 -280 70 251 -104 -258 122 271 -116 -213 235 219 -149 -167 256 203 -160 -105 345
4940 345 166 -157 6 327 155 -230 42 250 -12 -202 41 264 -62 -284 134 224 -187 -231 86 147 -228
4961b28N3L30r9l11P3L46j63k88J72L25k52l05K85L01l18k06K50K56l58j78M17
4982A02P3l10q3L38P1m17J1M14j7l85N3M12j05l72K25L20k96k72K76K83l08k66
5004b53L17K15l28j87L90J49l86j29M09kl53RL36Kl87R6L18p1l81J64L28j39l20
5027b03K09J97k08k39K72J81j75k75L27J08l04l7L39L0l18m3L10L9l61N3L36p5
5049A63l60J30L22j58k29J12K91j88k78K33K11k93k03L48J92l53j61L19J31l64
5069a35j17L94K6l49K4L53o4l78R8L92j85l35K58L30k68k74K92K61l54j67L24
5090A26J70l94n5L43L1l09j6L37L2m85J89L33q5l26J18K30j01l26K58K23j84k90
5112a81K92K15k78k28L37J19k88j21K14J08l12l5K87N7l41k2L29m1l63O0L93r5
$$ plain form
4961 -228 -175 155 56 -255 -182 164 1 -287 -115 210 -42 -347 -62 239 -79 -285 -35 221 -137 -315 102
4982 102 175 -135 -218 120 191 -226 -215 199 182 -203 -150 262 157 -215 10 330 34 -238 38 321 13 -253
5004 -253 64 279 -49 -236 154 303 -83 -212 197 195 -158 -149 187 189 -198 -102 216 145 -236 -72 256 117 -203
5027 -203 6 203 -5 -244 28 209 34 -241 86 194 -110 -147 192 222 -96 -139 171 210 -151 -98 238 163
5049 163 -197 -67 255 97 -132 -20 271 83 -195 38 249 -44 -247 101 293 -60 -221 98 229 -135
5069 -135 -252 142 168 -181 -157 196 132 -246 -148 244 59 -276 -18 312 44 -230 62 323 -31 -198 126
5090 126 296 -98 -153 190 221 -88 -104 233 265 -220 -31 302 217 -109 9 239 138 -188 70 293 109 -181
5112 -181 111 326 48 -180 157 276 -12 -133 81 189 -123 -158 129 186 -155 -177 152 111 -252 -192 201 106
5134A06l37J09K70j12l46J94K75k21k84L10J92l06j46K77J82l38j46L61J17l86
5154b29m4L46P9m23R2L12l7l56J82L41k45k75K72K28k24k26J82K73l06j38L07
5175A11R5l20o2K76J09l76jL61l1l12l1L77o9l43J32K99j41k96R7L69j74k36J87
5198B1K29k42k10K45J48k54p3K68R8l68l7L19O1l71j8M01ml58L2L30j40k38J34
5221b7K67j51k92J90K19k67j12J98J71l71r9L66P8l24p1L17M3l48O0K68o3k82
5243b30J25K54q1l52K46J67j58k61K69J60j89k68K96K03l09j17L16P2k87m1K64
5264G9Q9k90j4K98l5k63J01K41p7k74R1K71j65k25J93J95j27k46K24J83k20j82
5286a53K66J38l50r7L11J06l53m0L42J7l90N9L21n9l81J68L28j77k71J04L52k63
$$ plain form
5134 106 -231 -122 148 36 -310 -116 159 -62 -346 -36 156 -150 -296 -19 163 -175 -321 40 157 -229
5154 -229 -273 73 152 -271 -179 133 96 -260 -78 263 18 -257 15 243 19 -207 -25 248 -58 -196 111
5175 111 206 -114 -176 100 209 -167 -168 193 162 -150 -181 196 127 -216 -84 215 74 -222 -125 244 70 -166 21
5198 21 250 8 -202 43 191 -63 -136 132 230 -138 -175 144 205 -166 -184 217 213 -145 -113 217 77 -161 -27
5221 -27 240 89 -203 -13 206 -61 -173 25 196 -175 -274 92 170 -154 -225 92 135 -213 -153 115 52 -230
5243 -230 -105 149 68 -284 -38 129 -29 -290 -21 139 -50 -318 -22 181 -128 -245 71 143 -144 -185 79
5264 79 168 -122 -136 162 127 -136 -35 206 129 -145 -54 217 52 -173 20 215 88 -158 66 249 29 -153
5286 -153 113 251 -99 -196 115 221 -132 -172 170 187 -203 -144 177 118 -263 -95 233 56 -215 -111 241 -22
5308b2j82K03J83k39j84L35P2k81n1K42J06l35k1L85q6k88P1K32o0k62P1L42j55
5331G6k56J54K36j80k17K06J77k28j26K48J08k95o0K90M0k70o7L17Ll25L6K68
5353A35nl15J22K59o7l59R8L07j57k38K16J95k73j22K15J90l25r1L13R1l20o0
5375a91L66Ml37M7K72j2l48J18K74j06l01J39K67j28l08K37K57k20j66K13J67
5396B44k25j98K74R7l07n2K69P9l08jK47L8l29K3K77ol27R3K87j24j90J37K40
5419B38k01k83K74K04k52k04K60K04k82j42L01R9l04r5L31O8l52J0L46j23k33
5440a36J06K47j81j82Q1K89j58k48K11J94j74k14K38R8k44j02K91qk07q1L37o2
5462I5k31rK66n6k13JK48o8k38J07K29q7k11P6J80j27j85K23J86k52j07K17Q5
$$ plain form
5308 -22 -204 -1 182 -57 -241 94 166 -115 -166 76 182 -153 -174 211 125 -163 -92 140 80 -182 -111 231 76
5331 76 -180 -26 210 30 -187 19 196 -32 -158 90 198 -97 -157 133 173 -97 -164 153 156 -169 -133 135
5353 135 130 -185 -63 196 129 -230 -132 175 18 -220 -4 191 -82 -204 11 201 -124 -215 98 189 -131 -191
5375 -191 175 179 -158 -111 161 149 -199 -81 193 87 -214 -75 192 64 -244 -7 250 30 -136 77 244
5396 244 19 -179 95 192 -115 -167 102 181 -127 -128 119 157 -172 -149 128 122 -205 -112 175 51 -139 -2 238
5419 238 37 -246 28 232 -20 -224 36 240 -42 -184 117 216 -88 -183 148 216 -136 -126 220 97 -136
5440 -136 -30 217 36 -146 -65 224 66 -182 29 223 49 -165 73 171 -73 -175 116 108 -99 -180 157 95
5462 95 -136 -145 121 65 -148 -147 101 33 -205 -98 131 44 -167 -91 89 -38 -223 0 186 -66 -173 44 129
5485A29k30k3K12Qk18k2K61j9k72Q5L04q9k84J53K19j94k09J72K46j78k20K32
5507F3J02k09j06K58M9k44n0K93L9k91r1L22J5k91K5K68q3k41R8K27j58j63J11
5530e7K25j49k55K44K15k43j64J96J83l12n5L06O6l71p8L81Nk99P5K45l4k60J11
5553b5K14j32k28J56J91j19k11J57K24k26j64J92J86k60j34K23J64k92o3K77j7
5574A13l01O9K45l8k04J1K33o9k71J29K56k16j84J84J71k10j43K33J05j94j03
5595a84K19J40k38q1K29j0j81J5J99K4j86j2L06j53k17R7K26p2l26J68K57j80
5617D0j81J14J48j85q0K04L1j99l5K67ok54K9J70j7k22P1K64r9k31J21K24j72
5640Bj70J32K11k51j31K23Q7j05j80K50M0k31l5K50N2k45j9K12kk26mL32r4j90
$$ plain form
5485 129 -101 -124 88 96 -122 -144 117 98 -174 -89 215 126 -158 -5 214 20 -189 -17 229 51 -169 63
5507 63 165 -44 -150 108 157 -87 -137 156 195 -96 -187 135 150 -141 -116 152 69 -172 -74 153 -5 -168 -57
5530 -57 168 19 -236 8 223 -20 -184 12 195 -117 -172 134 200 -171 -249 132 137 -162 -87 158 124 -136 -25
5553 -25 189 57 -171 -15 176 57 -154 3 227 1 -163 29 215 -45 -179 44 208 -84 -147 130 113
5574 113 -188 -119 126 88 -116 -105 128 59 -212 -83 173 -43 -227 -43 128 -82 -225 8 113 -81 -184
5595 -184 35 175 -63 -144 85 75 -106 -91 108 132 -54 -66 240 87 -130 -33 193 121 -205 -37 220 40
5617 40 -141 -27 121 -64 -144 60 91 -108 -143 124 118 -136 -107 63 46 -176 -105 159 60 -171 -50 174 2
5640 2 -168 -36 175 -76 -207 16 103 -2 -182 68 108 -123 -158 92 144 -101 -120 92 90 -136 -140 192 98 -92
5664i2j0L37j67k17P9K57j61j58J54J55j85j09J51O1j41j41L66L3k19r3J31Q4
5686A15k34oL08j17k38Q4K14r9k05R8K19j20k21J38J67j73j17J80J13j91p6K43
5708H2K6j44j01K40N9k63k6K48n0j84J0K18k6k21J01K10j31j71J34J52j44j55
5730a36J41J22j26j38J96J53k36q1K27K3k74n2L02o2k01L1K33j03j50N0K41j10
5752E0k51J61K19j92j58J07J92j65j10J48J18k37PJ96J1k26K7K41o3k00K4L23
5774B22j30k27Q2K39p5k17J03K00j59j07J40J25j58j73K37Q3k44oJ88N2k16n0
5796i1K73j6l27Q9J56L4k78P9K64j15k48J58J85j98p6Q6J68j60j97K45P8j79j06
5819a76K24J24k39r2K46k2j99L2K46o8k12N9J89k9k52J35K09j49k15J86J89j08
$$ plain form
5664 -92 -102 235 68 -149 -70 187 26 -132 22 177 -8 -117 34 95 -46 -187 179 212 -7 -100 31 115
5686 115 -119 -125 183 66 -172 -88 126 27 -178 -80 139 19 -202 -64 103 -70 -187 -7 106 -85 -161 82
5708 82 108 -36 -137 103 162 -101 -127 121 71 -113 -103 115 89 -132 -31 179 48 -123 11 163 19 -136
5730 -136 5 127 1 -137 59 212 -24 -105 122 145 -129 -181 121 59 -142 -111 122 19 -131 -81 160 50
5752 50 -201 -40 179 -13 -171 -64 128 -37 -147 1 119 -118 -111 85 96 -130 -103 138 75 -125 -101 222
5774 222 92 -135 -53 186 111 -106 -3 197 38 -69 71 196 38 -135 102 185 -59 -65 123 175 -41 -91
5796 -91 182 166 -161 -72 84 118 -160 -81 183 68 -180 -22 163 -35 -111 -25 143 -17 -214 31 109 -70 -176
5819 -176 48 172 -67 -159 87 65 -134 -102 144 76 -136 -77 112 83 -169 -34 175 26 -189 -3 186 78
5841G8k38K28Q7j76q8K00P8k10r4K23%j38p3K63M7k72pJ59L0k60N6K02p7j83J11
5866e4J30j16j58J87Q7q1j60J89Q8j74p5K63Kk11m7K28k3j73j5J80o1j29Q0K04
5890A61j32j76J59K59k49j73J60J42j79j03J83R6j46j18K31L0j87mJ43l2j86Q6
5912c5J74j17j16j8J87l5j90J31J77j71j45J69Q4j02j33J90M5j82o9J93Q6k03
5934h0M6J46o6j72R8J38Jk66J20J68o4k03J13J78j02j77Q3K14k02o8J26J10j70
5957b9r7K02P1k43J0J93O3k48n2K36j6j64L6J51j04j46J31J30j27j57Q8J82j27
5980a7j38J74J05j51j36K13R5k34q9K29kj46k4J65L3k62R6J59l2j81J10J48q9
6003B6j29N3K23j23k05J80R0j30j31K23J4j52l6K23n2j28%J52Mk31R7J58k6k55
$$ plain form
5841 78 -160 68 155 -21 -109 91 169 -41 -135 88 88 -50 -123 140 187 -85 -92 67 97 -163 -107 95 18 -165 -54
5866 -54 76 -40 -198 -11 76 -5 -165 24 112 -62 -137 126 128 -83 -130 98 75 -98 -113 67 6 -123 -43 161
5890 161 29 -147 12 271 22 -151 9 151 -28 -131 52 148 2 -116 115 145 -42 -46 97 65 -121 -35
5912 -35 139 22 -94 -112 75 40 -150 -19 158 -13 -158 11 95 -7 -140 50 95 -87 -156 37 123 -80
5934 -80 -34 112 46 -126 -28 110 111 -155 -35 133 69 -134 -21 157 55 -122 -39 175 -27 -95 31 141 -29
5957 -29 -126 76 147 -96 -86 107 170 -78 -130 106 90 -74 -38 113 9 -137 -6 124 -3 -160 -72 110 -17
5980 -17 -155 19 124 -27 -163 50 145 -89 -178 51 49 -97 -121 44 77 -185 -89 70 38 -143 -33 115 26
6003 26 -103 -50 173 50 -155 25 115 -15 -146 77 91 -61 -97 126 74 -54 -54 98 102 -129 -32 126 100 -155
6027a55J00K11p4j80O4J44r3j38J78N2j54m2R8R5j87o8K19N2k67M8K31r7j91P5
6051g9J61J0j56k2K15p2j41K9K08j56j19J00J91j77q9J69R0j53j13J35J14j90
6073d5l2J68l4j17kJ69l7j51N2J49p5k09J55J47j56j53J90J18j17j62J40J29j08
6096A9j01J02J55k41n2J50R3k17NJ54kj64K7J80n2k06J54K06j02k61J80R9j30
6119dj25K36mn3j52J48Q6j67o0K19m7j03nJ71Ok22K1J95j02j39O0R4m4j47J70
6144C2J47j57j82J65J62k50k2J25Q9j28j37K46%j88J3J85Lk25J5J71j6j79Q2J49
6168A00o6j33Q1J17o9j74J16P2q1pN2P9j90kJ77J3k00L5R9Q4k29N2J45m0j27k1
6194a17J74p2j21J30J04p1j70J16J68j94j16K03Q9k02o2J54J18j88m5J82Pj43
$$ plain form
6027 -155 -55 156 82 -98 -34 110 17 -121 57 109 -45 -87 11 106 -81 -149 70 122 -145 -97 134 37 -154 -79
6051 -79 82 92 -64 -86 129 57 -84 -55 153 -3 -122 -22 169 -8 -97 72 162 9 -104 31 145 -45
6073 -45 -77 91 57 -60 -62 107 70 -81 -29 120 45 -164 -9 138 -18 -171 19 137 20 -142 -2 127 19
6096 19 -82 20 175 -66 -118 32 125 -92 -87 67 65 -99 -72 108 56 -150 4 210 108 -153 27 126 -4
6119 -4 -129 107 103 50 -102 46 132 -35 -95 124 77 -26 -31 140 146 -76 -55 140 38 -101 -41 53 9 -138 32
6144 32 179 22 -160 5 167 -83 -105 20 109 -19 -156 90 90 -98 -85 100 103 -122 -107 64 48 -131 -49 100
6168 100 34 -99 -18 99 30 -144 -28 44 -37 -44 8 87 -103 -105 72 85 -115 -80 19 103 -126 -74 71 31 -96 -117
6194 -117 57 -15 -136 -6 98 27 -143 -27 141 -53 -169 34 123 -79 -141 13 131 -57 -102 80 87 -56
6216e6j6J58k8j49K9J99r9j50L4K02j14q4R1P5q2j79K33R9j87o3J26R7j42j42
6240a48K39J6j75j0J77o4q0n1J74K7k05L5J32m0j45M2J50p2j39J22J04j36n1J35
6264C7K8j14o4J56R2k40lJ83rj31m3J38M4j91J43J25p5j18M9J06q4j16Q6J09q5
6289B3j06J54J1j16k3Q2Q2j45r8K68l9j65OJ91q6j79M5J96K7k36J23R3j28j26
6313a46J16J55j46j36J98P4j98p3J85J00k44J1K68q7j98M8K04m7j69K9K19j29
6335C4r5J01P1r7j15J78O4r5r2J32N9r2j26J41L4r7r9K04n3q8J9Q3K2j27k5J61
6361A02p9l8J4J47j00j57J23P7q4j37J14J08j57p2K08O0j67p8J58P8j50n3J89
6384A06k6j68K2J06M3j48rK14m2j69P3J20j33n3M6R6p6j15J54N2j26n8J38O1j94
$$ plain form
6216 -56 -72 86 58 -91 -62 137 38 -112 -78 124 10 -74 17 92 10 -169 64 163 -24 -87 39 136 -6 -148
6240 -148 91 107 -68 -78 99 35 -45 -96 78 105 -100 -65 67 27 -118 -76 74 2 -137 -15 89 -47 -98 37
6264 37 65 -49 -113 43 135 -105 -108 75 66 -65 -108 30 74 -117 26 151 76 -42 7 113 29 -87 -1 108 23
6289 23 -83 71 82 -34 -57 25 107 -38 -136 132 93 -72 -66 125 39 -140 -95 101 128 -108 15 108 -20 -146
6313 -146 -30 125 -21 -157 41 115 -83 -156 29 129 -115 -104 164 77 -121 -73 131 84 -85 -56 163 34
6335 34 -61 40 111 14 -101 77 141 46 -46 86 145 53 -73 68 102 5 -94 110 57 -31 -12 71 93 -34 -59 102
6361 102 23 -15 -1 146 46 -111 12 89 5 -132 -18 90 -67 -139 69 129 -38 -116 42 120 -30 -83 106
6384 106 80 -88 -66 40 83 -65 -74 140 98 -71 2 122 -11 -64 -18 78 2 -113 41 93 -33 -91 47 108 -86
6409h6pJ20O4j94O4J29k7j41mJ53q1j33J16Q6l7j99K09%n6j61J52P5j21l0J42
6434C3L3j79j4J36j8j02R6R3l9j46PJ49Rj89N7J98q0j48N4J37j10p4J35J30k45
6459g7k7J38j2j48N5P5N4j53M8J83o8j97Q3J32k8j39J9J65j48r4J20J01r6q6J25
6484B5P9j90k1J47R6j95q9J88K3j25J7J11J9j58K3J10Rj52N7J02j8j45N5K00j57
6509A1j05J02J28j50m2J12J16j52p1J39R2k31pJ75J6j85j8J96l3j85j0J88p5p8
6533f7K5J26l6j31N9J03q5p5M6Q1j48MJ13R0j81MJ53M4j98K3J24pj44NJ34k4j20
6560h2j8K01r3m8R8M0r2r3J31J7q2P0MM1j36J7J10K0j53l2J60Mj79Q1R3l3j60
6587a14R7J35q6j32J10J02j59m9J37po0j23J51Q4j27p9J62M0j80PJ59pj11nJ21
$$ plain form
6409 -86 -93 27 91 -103 -39 90 63 -78 -82 71 -10 -143 -27 59 22 -177 32 32 -24 -185 -33 42 -79 -109 33
6434 33 66 -113 -127 9 -9 -111 -15 78 39 -107 -100 49 58 -131 -74 124 44 -104 -50 87 -23 -97 38 168 -77
6459 -77 -104 34 22 -126 -71 4 58 -95 -47 136 68 -129 -46 86 58 -81 -62 103 -45 -139 -19 82 -14 -100 25
6484 25 104 -86 -107 40 136 -59 -148 40 63 -62 -45 66 85 -73 -50 60 69 -83 -26 76 58 -87 -32 168 11
6509 11 -94 8 136 -14 -56 56 172 20 -51 88 180 -51 -58 117 133 -52 -70 126 93 -92 -102 86 11 -67
6533 -67 -42 84 48 -83 -24 79 -6 -81 -35 46 -102 -98 15 105 -76 -72 81 125 -73 -50 74 67 -77 -72 62 38 -82
6560 -82 -100 101 8 -40 58 98 6 -87 44 61 -21 49 53 94 -42 -25 85 105 -48 -80 80 84 -95 -14 79 46 -114
6587 -114 -17 118 32 -100 10 112 -47 -96 41 34 -26 -149 2 86 -41 -120 42 82 -98 -91 68 61 -50 -55 66
6612F6%k15J20J27j01p1M0J21n5j34J54K3j03o6J43L2j21l1J50J3j34J4J48%k19
6637i9M2J65l4j56K7J61n2j49J20R7j57k4N5Q5j24m8O9J25j48o2J48Op2l9O9M5
6663E0j72J5J36k7p6KJ60o5p2M7J24q5j48R5J02%j67P5N7j04mM1L9j11OJ51op0
6691gn4J81p0j28P0J08l3j34L0N9lj56J30J23j83m0J42kr3k0J20J8j12l2J10N6
6717H0j73nK08o1j00%J63j01r2N2J11l9j33P7R3j10p1J55J7l0o8P4P4j80l1J41
6743E1P9j34k7J13Kp4k4Q0m1j20J29M1L2j37k0J75j31q1N7J10q7%j5J71j47m2
6769d0Q1Kj05K9J76j33o7k1J72k3j02K5J58j14r3N0M3L4j42Q3Q4o2j05Q4R0p2
6795C2m0R2k6n5n7Q5K2n8J0J5J5r0K9Q4l0r3O3J00n4n9rJ70k02J9R7l0pj50J60
$$ plain form
6612 66 66 -149 -29 98 -3 -74 -34 87 32 -102 52 75 -28 -94 49 81 -40 -71 79 92 -42 -28 120 120 -99
6637 -99 -57 108 74 -82 -55 106 54 -95 25 122 -35 -59 -4 81 -43 -91 -22 103 -45 -107 41 47 -25 -64 5 50
6663 50 -122 -107 29 2 -74 -72 88 23 -49 -2 122 37 -111 -16 86 86 -81 -6 51 -53 -57 -16 23 -88 -82 69 63 -7
6691 -7 -61 120 50 -78 -8 100 67 -67 -37 22 19 -137 -7 116 -67 -107 35 33 -60 -80 40 58 -54 -86 24 80
6717 80 -93 -98 110 49 -51 -51 112 11 -81 -29 82 43 -90 -13 80 -30 -101 54 71 41 -27 47 121 -59 -90 51
6743 51 130 -4 -31 82 84 10 -14 66 25 -95 34 75 107 -30 -50 125 -6 -87 -30 80 -7 -7 -22 149 2 -40
6769 -40 41 43 -62 -33 143 10 -57 -78 94 71 -31 -6 152 38 -55 -5 38 72 -70 13 97 35 -70 14 104 32
6795 32 -8 84 58 3 -54 31 53 -5 5 20 35 -55 -26 58 28 -65 -2 98 44 -15 -24 146 -56 -37 60 30 23 -127 33
6824C3N5j62lR5O0j27k9J10K3r9pJ25q9o3O3P4n4j12R3J05m3j95J60P6n3j26R0
6851@Q8j56M5O4Kr5M8L4O0j19m1J41j04j2K4J04n7r5N8P7q2n8J0J66j51p4J42
6878A9M4j18o3Q8O5j44N5N6M3j39k7J56mj25K4J58m0k13Q5J14nj45O2J29j11o0
6904i6J04J24j80o5J60m9k7q0J44Lr3l6Q7M5j56J27N5oj26K3J29n9j15k2J47n4
6930a6p0L7J52j36J8K8P3q6j09J92l8j02k6J67L2j82P9Q6l4p9j2Q5m6n0R5J4k7
6957D5n3RQ3p3j08J26N9j44l5R7Q9j35k2Q7K8p3NL7O5j32l4J89j03m5N8K6j5q2
6985e1N5J26j44o3O9R9j31J1P6M2o8l8Q0L0j35K3O5O4j52M8L9k0k7rN4k5r8Q1
7013AP4o5l7Q9N9j40M4J7N7j27k0N7N2r0K0L6J02k18L3J32K4j57M8R3o8j12P3
$$ plain form
6824 33 88 -74 -77 18 78 -49 -78 32 55 -44 -51 74 -15 -78 -15 59 5 -107 -14 91 48 -147 13 89 36 -90 0
6851 0 88 -68 -23 41 43 -52 -4 30 90 -29 -70 71 -33 -45 -21 83 26 -69 -11 66 -16 -74 -64 102 -49 -123 19
6878 19 63 -55 -118 -30 35 -109 -54 2 45 -94 -121 35 31 -94 -70 88 48 -165 -80 34 29 -116 -54 75 -36 -96
6904 -96 8 132 -48 -113 47 -2 -29 -109 35 38 -55 -91 -4 41 -115 12 67 61 -65 -42 87 28 -87 -109 38 -16
6930 -16 -86 -49 103 -33 -15 13 86 0 -109 83 45 -57 -83 84 116 -66 13 99 65 -14 -26 59 13 -37 58 72 45
6957 45 -8 1 84 11 -97 29 88 -56 -91 6 95 -40 -62 25 53 -20 -15 22 87 -45 -79 110 7 -38 20 46 31 -51
6985 -51 4 130 -14 -77 -8 91 -40 -29 47 89 21 -17 63 93 -42 -19 46 110 -42 6 45 25 -2 -11 43 18 -80 1
7013 1 75 10 -27 62 121 -19 25 42 99 -28 -48 9 61 -29 -9 27 129 -89 -56 76 100 -57 -9 84 16 -96 -23
7040b3P8l4p3M1R0q4l3R8J9j44pR0N4j24J1J20k9j14KJ22rj26O0P0om6%Q4j13
7069b6m0J23k3l1q6R7M2p7l0Q9l3l8J0J01K0j52LJ06o0q2QJ66m8j17Q5L7pr7P
7098e3L4j6n7J08j4k6KM6K0o8k9N6J9q0l1J32J0j08K6O9j4q5L4J09q7p0J02J4
7126D3m9j3M5J3q9K8N0j4l0QO1j9n0l6J31l9o3j2R8m0q7K0J09o5o8P4M9o3o9J04
7156B7M9m9q6Q3n2r9K2J17K7j02l9J82j8j36O9M4N3j51K9J18n4n5Q5K8q1q2Q6
7183A5R5j13n5P6L3q3K1L3Q2q4J0J1K6j39Q5L9Oo9QK6M9j61M4N3M5j05N1Q6q0
7212Eo6J01N6j03m9P1%jm9L6mn0QR2Pj05M8N6On8nQ0o9r1J03J2J4r3R3P0j14o0
7244e9J31j4p5LQ0Oq4k2Q5M3j30nJ47j12j2N6l6K2j5j2N3j04K4P8J1r7qJ02m5
$$ plain form
7040 -23 55 21 -52 -11 79 -5 -38 60 79 -65 -72 18 72 -52 -41 79 50 -64 -62 60 51 -75 -15 55 49 3 3 87 -26
7069 -26 -66 57 34 3 -83 14 56 -21 -51 38 5 -33 -23 78 98 -54 -51 55 -5 -87 -79 87 39 -78 7 44 37 -60 -53
7098 -53 -19 -35 -92 16 2 -24 -22 24 44 -24 -53 3 22 -58 -89 43 53 -55 -29 40 26 -59 -25 84 -3 -73 29 43
7126 43 -6 -19 26 39 -50 -22 28 14 -16 -8 53 34 -16 -52 79 40 -23 -35 63 23 -64 -44 65 0 -68 6 55 -8 -77 27
7156 27 76 27 -59 24 -28 -127 -105 12 39 -63 -102 80 62 -74 -5 39 92 -59 -30 88 34 -21 64 92 11 -71 15
7183 15 110 -3 -58 18 51 -32 -11 22 104 20 30 41 67 -72 13 52 58 -11 -3 23 72 -89 -45 8 53 -52 -1 85 5
7212 5 -61 40 96 -7 -56 15 15 14 -35 1 -3 -53 -45 47 54 -51 -3 53 59 1 -4 76 7 -84 19 31 45 -48 45 115 1 -59
7244 -59 72 58 -17 -14 66 72 -12 -34 51 94 -36 -41 106 -6 -18 38 2 24 9 -3 50 -54 -30 48 59 -38 -46 56 11
7273A1k9q1J53oq2m0J49p4p6Q4K8Rj58O2P2n2p3J18M3q5l4OR0m5n5J10L5r8o4
7302h2J38l1r0LJ18N1j22j5J18m8n1%P2n6l8m6J38j17L6OM4l1n1N0L3k0r1R2j6
7331fo4O7M4k8q2M1J3J3l6l6J38n7o7K0Q7k7p6M2J19n2r2R2K4j26J1L3J22j23
7359fl4J09k4k8k6J55n3q3O2K9n3q4J8J05n7r4O0N8m9j0K6Pp1J5R2mp3m6P8O5
7389H4j03r5J43m7n3K2J12k1o9K5P6j9q9N3M9o4n6N5O8r0L1J8j8o0M5N2o0L7p7
7418e1J39o0q0nO6K5j07J32L6l8j57J53K5q5k2O9l4L5r7O6nJ0k8LQ1r9l1J17m6
7447A2j07M8P8j5o5j1O4L9q0P8l9M7j17Q7K1q1nO5O7j19j8L3K5J5m0L6J11j79
7475e0J9J10o0l1j9Q6Oq4kR4q5nK8R4n3q6M2N6j8l9O7l2n0kK6p%n4J08K4j29O4
$$ plain form
7273 11 -18 -99 54 48 -34 -74 75 1 -75 9 37 46 -112 -50 22 -30 -103 15 58 -27 -61 -55 35 -10 -65 45 80 -18 -82
7302 -82 56 25 -65 -62 56 107 -15 -30 88 40 -11 -11 61 5 -33 -79 59 -58 -22 -16 28 -3 -54 -4 29 9 -82 10 -6
7331 -6 -70 -3 41 13 -69 -28 -15 -2 -38 -74 64 7 -60 -40 47 20 -56 -14 105 53 -39 53 77 -49 -38 -5 117 -6
7359 -6 -40 69 45 17 -9 146 93 10 72 101 48 -36 -18 87 30 -64 -4 54 5 -5 21 28 -43 -28 64 60 -13 -59 19 84
7389 84 -19 -114 29 -18 -71 -49 63 42 -27 -2 74 55 -34 19 68 4 -52 3 71 -19 12 30 12 -48 -3 49 -11 26 -51
7418 -51 88 28 -52 -57 9 34 -73 59 95 57 -100 53 78 -7 -29 40 6 41 -56 10 5 15 -13 -10 71 -28 -59 58 12
7447 12 -95 -47 31 16 -49 -60 4 43 -37 41 2 49 -68 19 40 -41 -46 19 86 -33 -51 -18 7 22 -18 18 129 -50
7475 -50 -31 79 19 -12 -31 55 61 -23 -25 69 -16 -21 7 101 48 -38 4 60 42 3 70 38 -12 -14 12 5 5 -49 59 83 -46 18
7507A8K1l6o9M3M6N3j09Q3o6J9q3Q3K0m4o5J16lp9N4J9Rn7M5MP1j24J1LJNL5R0
7539A14j00q5Q4Q9q7q6L1Q1m8n5K2R4r8k5J38Kj15q7J34OJ2j7K4n9l9k4R6K5p9
7568e2O1N9r4j9N9k7K4n6N6M1r7J1lN0q3L7Q1l6Kl4O0M7j07k3P9J2r9O5K4o6m6
7599g4O1P3k6o3R8o6l8J9j1Q6r9NM8K6m0n0R8k8n7RJ31j19LL6M5r1olP7n1l7Q8
7631D4J6r6j6R0K8o9l7O6k1j3m9Q3K3p0J7N5n5j9K3JMj6J2O7m0j02O5M5r8l6R4
7662dM7l0l7M0k3j6j9N5j2m0L0N2K7o5%jOk1K7l4QprQ6j22J6J7M0m8J0K2M8q9
7695d6K2M2M8p4J1j2O6j29N6P7m8r3Q0P0m6o8R0J6m1l7L8J7m5l0O4j0n0l3J33
7724F8pq8j3J7L2o3L7L5l6mK6NL5q8J7J08l3n6J2K9N3q6O3k8n5M0M6j8p3K4K8
$$ plain form
7507 18 39 3 -66 -23 23 76 -33 50 -16 3 -80 3 23 -21 -86 30 27 -52 2 21 30 -27 18 22 93 -31 -20 -17 -16 -11 24 114
7539 114 14 -71 13 102 15 -71 -40 41 -7 -62 -40 54 -44 -69 69 71 -44 -131 3 9 21 4 28 -31 -70 -94 2 27 -52
7568 -52 9 68 -26 -45 14 -13 11 -45 11 52 -45 -34 -37 13 -70 -33 48 12 14 -20 40 87 -20 -43 36 48 -51 14 38 -28 -74
7599 -74 -13 60 34 -29 69 3 -35 -16 -27 59 -40 -35 13 39 -1 -51 47 19 -38 -29 102 -17 -14 22 67 -24 -30 -33 44 -7 -44 44
7631 44 60 -36 -52 38 66 -3 -40 26 5 -8 -57 26 49 -21 -4 51 -4 -23 0 1 5 -11 1 68 28 -74 -9 36 -62 -98 -4
7662 -4 43 13 -24 16 -7 -23 -42 13 1 -39 -9 43 70 5 5 4 10 -11 16 -18 -10 -17 -26 60 -62 -46 -29 11 -37 -27 -5 43 -46
7695 -46 -24 18 66 -8 3 -9 57 -72 -16 61 13 -80 0 70 24 -44 46 62 21 -16 22 39 -6 -36 28 18 -32 -65 68
7724 68 61 -27 -40 -23 9 -54 -17 18 -18 -22 4 9 44 -44 -27 81 48 -8 4 33 86 0 63 35 -20 20 66 48 -25 -1 27
7755B7L9p6j8P7j8o1PJ20l3q7KO1n2m0O8K5o3m2Q0J2l7k5Q5m1n3J8P1k3n7k3N7
7786@nl4L9N8r6MN6k0Rn0K7j7qkJ7N6Jp9P4J9n6Ml5J06r6J6LL4r5L6P0j3l5O5
7820E3k0p2J9K7M0m5J3jK7r7j0R7J5l6q5J16M4j51j5J34K2n2r3J16K3m9n1N5j7
7849Gj5RM8k9o5P4l9L9k7R7l6p1J9J7K0n9k5O7l5j7Q1m2M0n3J2K0q2M9k0K1M2
7880D7j02Q2j4l1m1N6Q2j57MR4j4J7q0J9Q6q1m1J02j9m7K1M1Qp6K6Q4n6j7Nj2
7910a4Pm5M0Q3j14J8L6j9J5k9Q1p2L5m2N9p3NJ04l3k0q8P4O8o8l3J3J03j02K3
7939A2K2po4L2J5Lm3lM0M7k0o4mR7r8J8LQL1o9P9Pr0J9P2n1PK1Q5j08j4N8l7J2
7973A6j5L8j0m9K1j1rN7k6Q3j32J8lJ06n5q6Q2J3p0l2P7k8m5qO1K2n7J1J4J5r
$$ plain form
7755 27 66 -10 -28 49 31 -30 -23 97 64 -23 -21 40 -12 -52 16 41 -22 -64 16 28 -9 -34 51 10 -43 -25 46 23 -34 -57 0
7786 0 -5 -39 0 58 -38 -34 22 2 11 -39 -12 -29 -37 -39 -22 34 35 -44 30 49 -7 -3 -38 68 -28 -12 -9 25 -70 -34 36 23 -12 53
7820 53 33 -39 -20 7 47 2 15 14 41 -56 -66 31 46 10 -75 41 85 -66 -81 53 75 23 -70 46 69 20 -31 24 7
7849 7 -8 1 49 20 -45 29 -10 29 2 99 63 -8 11 28 48 -11 -36 31 -4 -21 60 18 58 5 17 37 -45 4 -16 5 47
7880 47 -55 27 13 -18 -59 -3 79 -78 -74 20 6 23 -57 -38 48 -33 -74 28 9 -38 -17 24 32 -44 -18 66 10 -7 -2 -14
7910 -14 -7 -52 -12 71 -43 -25 11 -8 7 -22 59 -13 22 -20 39 -34 -29 75 42 22 -66 8 76 8 -25 -12 91 -11 12
7939 12 34 27 -37 -5 10 13 -30 -33 7 54 34 -30 -34 63 -35 -17 -14 -6 25 -44 35 42 -48 -29 43 -8 -1 20 105 -3 -17 41 4 16
7973 16 1 39 29 -20 1 -10 -19 38 12 95 -37 -19 -22 84 29 -57 25 38 -32 -64 13 -15 -60 -68 -7 15 -42 -31 -17 -2 -11
8004a1n5R4j9p0O2O0n9J6k0L6l3qO3o8J3J8l7K3j4n4N9M7Oj15Q6k2Q3q3%N3l2
8035A9o0P0K3m1nJ9rn6M1qJ2J2j1L0n7n6Q1mk2j8N2J3J8o8M6L2j17P0L7o4L3o1
8067d9R1k6m2oO3m3j%K1Lk8L6%j7j9M2j3m0k1J21l8n0J3KR1q4M5q6R2j01L9O6
8099F1k0p1R4l9k4mJ3J5ml7K6N7j20K2N8K8j14L3N3m3K5p6P8K2q0jjP8m5J2J1
8130GK2o4O8l2n9PL8O8q7K8L0Kj3l4MJ4j9J1P8m0p6L8J04p8p5N9J9Rn5J8R3r1
8162fl5J10l0m6j9O3m1l4J8L3P0r5J2rK4l9m4J56j17K8K3Ol2n9L5O0m1K1j8
$$ plain form
8004 -11 -66 28 9 -61 1 61 2 18 -2 34 1 -7 56 -12 1 19 -18 5 -9 -63 -4 43 49 -66 20 -2 81 -2 -2 51 19
8035 19 -41 29 52 11 6 25 16 -40 1 -7 5 17 6 36 -21 -77 4 0 -22 -40 12 25 43 -25 21 53 -64 6 43 -21 12 -49
8067 -49 42 16 -26 -32 31 -12 -13 -13 8 11 -17 19 19 2 -17 25 12 -28 -49 72 34 -16 -3 -1 90 6 51 -35 57 -44 -5 61
8099 61 41 -30 64 25 1 -3 10 25 21 -16 10 67 -53 -31 27 55 -59 -26 27 -16 9 -67 11 33 -47 -48 -49 29 -16 -4 7
8130 7 29 -35 33 1 -58 -51 -13 55 -32 -4 26 28 15 -19 -15 -1 -20 -9 69 29 -47 -9 95 17 -58 1 20 29 -26 -8 85 -6
8162 -6 -41 69 39 -7 -26 37 -4 -38 -20 13 83 -12 0 -9 15 -24 -68 88 -29 -1 22 28 -4 -63 -28 32 -9 12 -6
8191f
$$ Imaginary data points
##PAGE= N=2
##DATA TABLE= (X++(I..I)), XYDATA
0@%%%%%%%%%%%%%%%%%%%mJ1j5J6j6J6j6J6j6K1k7L0l2L7m3M4n0N7n9O7p5Q2r3
42d9J01j11J26j41J56j74J95k20K52k91L41m05M91o18Q17j160J858l779J7409
61A4798N7040o4405m9699O7434L3455p3224k1442P4695J2900o7580L756O5326
73E3054j3897n9988K2498N2021k9714m3213L5022L2446m1877k5987M5424K1925
85D7714m3163j6368L8127N969m1155o996L5075N233k8644j889K3741k263k5343
98i962l770J7696K128j6050l832J2739K111j4661m397J3549K807j6599m637J4280
112h598j768k0600K933K4219l584k4349P216K2895j6944k8910J8428K8783k0613
125b0892k4101K7516K2194l2754k1017L3751J5755l4996q464L7499L397l7010
$$ plain form
0 0 0 0 0 0 0 0 0 0 0 0 0 0 0 0 0 0 0 0 0 -4 7 -8 8 -8 8 -8 8 -8 13 -14 16 -16 21 -22 22 -28 29 -30 37 -38 44 -49
42 -49 52 -59 67 -74 82 -92 103 -117 135 -156 185 -220 271 -347 470 -690 1168 -2611 14798
61 14798 71838 7433 -42266 25168 58623 -14601 -36043 38652 51552 -16028 -12272 53054
73 53054 39157 -20831 1667 53688 23974 -19239 15783 48229 6352 -19635 25789 47714
85 47714 4551 -11817 26310 32279 -8876 -15872 19203 24436 -4208 -6097 17644 15381 -9962
98 -9962 -13732 3964 6092 -9958 -13790 -1051 1060 -13601 -17998 -4449 -1642 -18241 -22878 -8598
112 -8598 -10366 -30966 -28033 -3814 -7398 -31747 -24531 -1636 -18580 -47490 -29062 -279 -20892
125 -20892 -44993 -17477 4717 -28037 -49054 -15303 452 -34544 -43008 -5509 -2112 -39122
137c9122L678L7524p843l3169J5366L0856k1495k8417K6065K6482k5916j7740
149c3731L2662J5867l4208j3234L3404R467l1199j979L4682J983l1505J373L0006
162A3588l620k6985P989K6988q987k4655J1900K4470j1813k0256J6493K0140j9212
175F040k0460J9930J8764k0871j4173K6701J4610k8877j3953K8876R321l1472
187e564n188L4695K956l5375Q05L4588o267l4712J1136L3142j6694l1841K0355
200B036K7754k4858k3159K9582J8825l3373j5328L3305P974l5311k066L6740k092
213B0029l5324O476L1944j2589l0374J5942K7342j8246k3102K0393J8577k1985
225i17j4605K2614J0833k2388p584K0890L721j9828m84J9226p33j7215J916J4622
$$ plain form
137 -39122 -35444 2080 -5763 -38932 -23566 7290 -14205 -42622 -16557 9925 -15991 -33731
149 -33731 -1069 14798 -19410 -32644 760 10227 -20972 -22951 11731 13714 -17791 -16418 13588
162 13588 9968 -17017 -9028 17960 8973 -15682 -3782 20688 8875 -11381 5112 25252 6040
175 6040 -14420 5510 24274 3403 -10770 15931 30541 1664 -12289 16587 25908 -5564
187 -5564 -10752 23943 26899 -8476 -7671 26917 20650 -14062 -2926 30216 13522 -18319 2036
200 2036 29790 4932 -18227 11355 30180 -3193 -18521 14784 22758 -12553 -14619 22121 20029
213 20029 -15295 -8819 23125 10536 -19838 -3896 23446 5200 -17902 2491 21068 -917
225 -917 -15522 7092 17925 -4463 -12047 8843 12564 -7264 -7748 11478 10745 -6470 -4554 10068
239A0068l895j4066M222J3475l765j1981L806J1324m476j2050L730J2149l845
252D696j2827M220J3390n437j4561O443J5052q438j5845J0026J5398j3044j5086
265a6013J5763J4101j8479j2458K0901R523k3880o794K5847L253k7076J091K8018
278A3797n501k8127R797K7293j4143k5446J8489K3330k1999k0071K5317J6631
290A9367k7789j2384K9851Q445l0545l796L1158m08l0516M658K9755q263k7794
303a8261J2023K5983j4898k3242J7623K0700j9519j7628K1249J4763k2390j1616
315a5213K3401R050k3406o122K3561L442k3641j221K3587q22k2565L356K2382
328A5789n313k1875O876K1081q700j9987J0824J9372j2391j8180J4155J6796j5623
$$ plain form
239 10068 6173 -7893 -3671 9804 6039 -5942 -2136 9188 4712 -7338 -3608 8541 4696
252 4696 -8131 -3911 9479 4042 -10519 -4076 10976 2538 -13307 -3281 12117 -927 -16013
265 -16013 -250 13851 -4628 -17086 3815 13338 -10542 -17336 8511 11764 -15312 -14221 13797
278 13797 8296 -19831 -10034 17259 3116 -22330 -3841 19489 -2510 -22581 2736 19367
290 19367 -8422 -20806 9045 17490 -13055 -16851 14307 13899 -16617 -11959 17796 9533 -18261
303 -18261 -6238 19745 4847 -18395 -772 19928 409 -17219 4030 18793 -3597 -15213
315 -15213 8188 17238 -6168 -12290 11271 14713 -8928 -10149 13438 12616 -9949 -6593 15789
328 15789 10476 -11399 -4523 16558 7858 -12129 -1305 18067 5676 -12504 1651 18447 2824
341B824j5465J7288J3596j8836j1893K0103J0014k0852p491K1680M780k3047k970
354a0269K2824P7k2512K770K2455n421k2490P173K0602j0059j9892J2130J8312
367A5700j4177j6972J5459J4713j7341j3043J8062J0548j9637r008J9767O630
379A0701k0010m105K0436J798k0935m30J9909k104j9488M703J9471o137j8377
392a4568P862J7136j0064j6152J1846J5130j3060j3236J4984J1938j5982r728
404a3894J7509P891j8484o090J9086M178j9094j113K0208m74j9982K454J9072
417A1267m981j8483P351J8255q721j6430J0811J5023j2662j3749J4066J1917j5226
430a562j0053J6514Q233j7116n989J8048L991j8558k419J8393l5j8448K403J8730
$$ plain form
341 2824 -12641 4647 18243 -593 -12486 7617 17631 -3221 -10712 10968 15748 -7299 -10269
354 -10269 12555 12632 -9880 -7110 15345 9924 -12566 -5393 15209 5150 -14742 -2612 15700
367 15700 1523 -15449 10 14723 -2618 -15661 2401 12949 -6688 -15696 4071 10701
379 10701 -9309 -13414 7022 8820 -12115 -12545 7364 5260 -14228 -9525 9946 3809 -14568
392 -14568 -6706 10430 366 -15786 -3940 11190 -1870 -15106 -122 11816 -4166 -13894
404 -13894 3615 11506 -6978 -13068 6018 10196 -8898 -10011 10197 9723 -10259 -7805 11267
417 11267 6286 -12197 -4846 13409 4688 -11742 -931 14092 1430 -12319 1747 13664 -1562
430 -1562 -11615 4899 13132 -3984 -9973 8075 12066 -6492 -8911 9482 9447 -9001 -6598 12132
444A2132l629j7988N678J7055q103j6808R635J5876j1106j4273J3090J3277j4525
457C11j1978J5535R919j7101q305J7976O230j8535l808J9206J464j9531M17J8785
471A0585l393j9015N658J8315p689j7085J0024J5351j2397j4499J3538J2051j5196
484c752j0138J6339Q100j7023n931J7287L367j7872j593J7249p35j6802K856J6443
498G795m334j5277N955J3941p653j3113Q688J1882r379j0127J0821R032j1260
511c029p613J1740O192j2412m934J2912L873j2745j946J3339R02j3510J19J3291
525F179j635j3287L199J3456m230j2844N756J2274p333j1878Q553J0741r992r604
539a0645J1318Q451j2225o895J3212N103j4160l760J4235J802j4300M60J4596
$$ plain form
444 12132 8503 -9485 -3807 13248 5145 -11663 -2028 13848 2742 -11531 1559 14836 311
457 311 -11667 3868 13787 -3314 -11619 6357 12587 -5948 -9756 9450 10914 -8617 -8200 10585
471 10585 7192 -11823 -6165 12150 4461 -12624 -2600 12751 354 -14145 -607 11444 -3752
484 -3752 -13890 2449 10549 -6474 -12405 4882 8249 -9623 -11216 6033 5298 -11504 -8648 7795
498 7795 3461 -11816 -5861 8080 427 -12686 -3998 7884 -1495 -11622 -801 8231 -3029
511 -3029 -10642 1098 7290 -5122 -10056 2856 6729 -6016 -7962 5377 6279 -7231 -7112 6179
525 6179 4544 -8743 -5544 7912 3682 -9162 -3406 8868 1535 -10343 -1790 8951 -1041 -10645
539 -10645 673 9124 -3101 -9996 3216 8319 -5841 -9601 4634 6436 -7864 -7404 7192
552G192j902j4323L488J3471n389j2786O869J2072q028j0750R300R786j0110q532
566i642J1074P184j1754o101J2117N125j2199l469J2927K567j3130j648J2948
579E999K55j2991J132J3547j916j3507L238J3268m795j3308O262J3186p798j2787
593a0215R548J2321j1244j1380J3101J0182j4905r053J6507P050j7945m651J9477
606H793K432k0161J71K0348l324k0417O311K0073q940j8629J1899J6880j4359
619A077j4775J6535J2241j8117r252J9314O198j9767k894K0030m3j9404K799J8143
633A2085n556j6821P770J5195r359j3122J0588J0735j1633r001J1824O816j1747
646b226n119J1326L382j0845k423R889J239r131p95Q216K62p682l00P194K39o825
$$ plain form
552 7192 5290 -9033 -5545 7926 2537 -10249 -3380 8692 664 -10086 -786 9000 -1110 -9642
566 -9642 1432 8616 -3138 -9239 2878 8003 -4196 -7665 5262 7829 -5301 -6949 5999
579 5999 6254 -6737 -5605 7942 6026 -7481 -4243 9025 4230 -9078 -2816 10370 2572 -10215
593 -10215 -667 11654 410 -10970 2131 12313 -2592 -11645 4862 11912 -6033 -10684 8793
606 8793 11225 -8936 -8765 11583 8259 -12158 -5847 14226 5286 -13343 -1444 15436 1077
619 1077 -13698 2837 15078 -3039 -12291 7023 13221 -6546 -9440 10590 10547 -8857 -6058 12085
633 12085 6529 -10292 -2522 12673 3314 -9808 780 11515 -118 -9119 2705 9521 -2226
646 -2226 -7345 3981 7363 -3482 -5905 3984 5223 -3908 -4703 3513 3775 -3907 -4207 2987 3226 -3599
662c599l54O751K57p205n57P795M61q123J81Q982q52r988J885J0779k923j1087
678g597M739J1617o412j1506Q532J1278j0257j0214J2363Q912j4016p079J5795
691F155N150j6715k605J7493L4j7934K788J7713n490j6893Q016J5815j0403j4381
705a1257J2319J2342j4198j0219J5325P899j6301n598J6525L015j6824q61J6339
718H506j369j5956L235J4781n078j3893O570J2570p859j1504Q735J0065r678q803
732i678J0279P610j0855o544J1111N419j1480m271J1785L115j1912k100J2036
745D515J026j2096L02J2059j619j1937L038J1685m411j1222N835J0555p193r717
759i180Q596Q722r822p405J0702O052j1384m532J2025K853j2205j173J1999k43
$$ plain form
662 -3599 -3953 2798 3055 -4150 -4707 3088 3549 -4574 -4393 4589 3737 -6251 -4366 6413 3490 -7597
678 -7597 -2858 8759 2347 -9159 -627 10651 394 -9820 2543 11455 -2561 -9640 6155
691 6155 11305 -5410 -8015 9478 9512 -8422 -5634 12079 6589 -10304 -2288 13527 3124 -11257
705 -11257 1062 13404 -794 -11013 4312 12211 -4090 -9688 6837 9852 -6972 -7833 8506
718 8506 7137 -8819 -5584 9197 4119 -9774 -3204 9366 1507 -9997 -1262 8803 -875 -9678
732 -9678 601 8211 -2644 -9188 1923 7342 -4138 -8409 3376 6491 -5421 -7521 4515
745 4515 5541 -6555 -6253 5806 4187 -7750 -4712 6973 2562 -8660 -2825 7730 537 -9180
759 -9180 -584 8138 -1684 -9089 1613 7665 -3719 -8251 3774 6627 -5578 -6751 5248 5005
773E005j1583K012J0859l154j0045M469R003n288p690O113O715o457n508O806
787A257M582o818l366O737K712o449j945O302J597n945j330N773J195n576j015
802b289N535J063n763j041O094R40o540r50P036L33p781J76Q376j208r008K129
818b898R220l667r629N146R394p066r121Q608Q098j0560p027J2048N280j3515
832e689l508J4440J245j5220J213J5393l815j5085O276J4368q644j2989J0860
845a155J1247j2714r163J4368O935j5271m240J5777J713j5754Q94J5457l185j4415
859i506N428J3151p233j1512Q823R903r932p922J0737O079j1176m190J1110K604
873F364j0964j046J0517k03r919J153R055j877q312K561P523k953o832K930O341
$$ plain form
773 5005 -6578 -4566 6293 3139 -6906 -2437 6566 1278 -6412 -299 6416 -41 -5549 1257
787 1257 5839 -979 -4345 2392 5104 -1345 -3290 3012 4609 -1336 -2666 3107 4302 -1274 -2289
802 -2289 3246 4309 -1454 -2495 3599 4539 -2001 -2951 4085 4418 -3363 -3187 5189 3981 -5027 -2898
818 -2898 6322 2655 -6974 -1828 7566 500 -8621 -13 8085 -2475 -9502 2546 7826 -5689
832 -5689 -9197 5243 6488 -8732 -7519 7874 4059 -11026 -4750 9618 974 -12015 -1155
845 -1155 10092 -2622 -11785 2583 9518 -5753 -9993 5784 7497 -8257 -7363 8094 4909 -9506
859 -9506 -4078 9073 1840 -9672 -849 9054 -878 -8800 1937 8016 -3160 -7350 3760 6364
873 6364 -4600 -5646 4871 4668 -5251 -4098 4957 3080 -5232 -2671 4852 1899 -4933 -2003 4338
888D338l123n669L292N442l401n421L633N207l760m995M236N070m708m976N298
903D63M891n945m338O756M071p487l583Q141K835q673j764R415P91r882K62J0012
919E965j447r987K856R794m136r553N217Q747o325p972P524P037q526o094Q981
934B081M727r642l446J0112K183j0193j255J0003p7r983J314R840k196r687L094
949c125R000m029q597N159Q173n786p666O357O953p207o117Q260N472q750m636
964f539R289L578r871k446J0656J478j0883l04J0805j130j0928K673J0911l783
978C506j0567N152R643o597q972Q060Q065r034o858R692N373j0811l865J1293
992D080K470j1369j066J1234p37j1289K152J0855l371r990M536R000n897q199
$$ plain form
888 4338 1215 -4454 -1162 4280 879 -4542 -909 4298 538 -4457 -221 4849 141 -4835 463
903 463 5354 -591 -4929 1827 5898 -1589 -5172 2969 5804 -2869 -4633 4782 5573 -4309 -4047 5965
919 5965 4518 -5469 -2613 7181 3045 -6508 -1291 7456 1131 -6841 683 7720 -806 -6900 2081
934 2081 6808 -2834 -6280 3832 6015 -4178 -5433 4570 4493 -5490 -4176 5664 3468 -6219 -3125
949 -3125 5875 1846 -6751 -1592 6581 795 -6871 -514 6439 -768 -6885 1375 6847 -1903 -6539
964 -6539 2750 6328 -3543 -5989 4667 6145 -4738 -5042 5763 4633 -6295 -3622 7289 3506
978 3506 -7061 -1909 7734 1137 -7835 225 8290 -744 -7602 2090 7463 -3348 -7213 4080
992 4080 6550 -4819 -5885 5349 4612 -6677 -4525 6330 2959 -7031 -2495 6505 608 -7591
1006g591O726P277p069o029P505M685p873l762Q022L080p702j892P437R34p356
1021c608l30P181Q0o655O90O271j215o349J561O213j537n843J953N680k564n843
1037d315K906N898l137n564L695N270m598n282N098N108n581m376O182L672p143
1052b167l187P532K627p924j326Q223J62q656P60Q729j839q333L254Q031m557
1067A329p611N429O966o168n923P393M929q176m036Q656K874q635j417Q942K36
1082D788r085P59Q673j703q159L049P706l944p336M596O387n274n451O084M706
1097E796o674m135O723L072o953k176P321J311p479q00P170j84p050J103O991
1112D036j803o933K318O435l043o121L895N838m446n377M831M721n392l951N921
$$ plain form
1006 -7591 -865 6412 -657 -6686 819 5504 -2369 -6131 1891 4971 -2731 -4623 2814 3748 -3608
1021 -3608 -3938 3243 3323 -3332 -2642 3629 2414 -3935 -2374 3839 2302 -3541 -1588 4092 1528 -4315
1037 -4315 -1409 4489 1352 -4212 -517 4753 155 -5127 -29 5079 -502 -4878 1304 4976 -2167
1052 -2167 -5354 2178 4805 -3119 -4445 3778 3940 -4716 -3956 4773 2934 -5399 -2145 5886 1329
1067 1329 -6282 -853 6113 -55 -5978 1415 6344 -1832 -5868 2788 5662 -2973 -4390 4552 4788
1082 4788 -4297 -3538 5135 3432 -4727 -1678 6028 2084 -5252 -656 5731 457 -4994 1090 5796
1097 5796 -878 -5013 1710 4782 -2171 -4347 2974 4285 -3194 -3994 3176 2992 -4058 -2955 4036
1112 4036 2233 -4700 -2382 4053 1010 -5111 -1216 4622 176 -5201 -370 4351 -1041 -4992 929
1127I29L650o392k908O540K169o746j123P050N54p172K63P018j140o789K131O797
1143D831k824o380L429N873m216n466M987N031n455m463N886L645o478k854O804
1158B350K189p099j441P127M53p199K20P278j000p227J861O773k660o561L414
1173a522O217m051n714M754N022n367m375N818L945o250l096O573K402o879j595
1188d118P136Q65p179N0P093p92o802J459O749k235o299K918N954l531n592M116
1204b08N018m519m701N153L890n336l423N619K766n905k156O092J426o231r14
1219c429O214K38o297K86O310j000o277J692O048k210o043K844N787l405n522
1234d764M091N225m794m786N339M299n831l608O373L019o814k355P306J583p554
$$ plain form
1127 929 4579 -1813 -4721 1819 3988 -2758 -3881 3169 3723 -3449 -3186 3832 2692 -4097 -1966 4831
1143 4831 2007 -4373 -944 4929 713 -4753 234 5265 -190 -4653 1233 4878 -1600 -4454 2350
1158 2350 4539 -2560 -4001 3126 3579 -3620 -3400 3878 2878 -4349 -2488 4285 1625 -4936 -1522
1173 -1522 4695 644 -5070 -316 4706 -661 -5036 782 4727 -1523 -4619 1954 4356 -2523 -4118
1188 -4118 3018 3883 -3296 -3246 3847 3055 -3747 -2288 4461 2226 -4073 -1155 4799 1268 -4324 -208
1204 -208 4810 291 -4410 743 4633 -703 -4126 1493 4259 -1646 -3802 2290 3716 -2515 -3429
1219 -3429 2785 3023 -3274 -2988 3322 2322 -3955 -2263 3785 1575 -4468 -1624 4163 758 -4764
1234 -4764 -673 4552 -242 -5028 311 4610 -1221 -4829 1544 4563 -2251 -4606 2700 4283 -3271
1249c271m95P730m37p785J376P781k261p495L280P154m294o713N138O077n805
1264b0n343O494M523p244l604P615K634p822j674P998N68q105L69P905j370p552
1280d628K259P203l116o739L782O071m354n388M951M796n419m108N668L468n901
1295a455k663O147J977o229j300O157Q04o159K2O148n61o012J068N783j641n467
1311c381K215N254k763n011L197M620l642m271L968L895m444l456M571K883m915
1326a280k487N213J806n365j281N298O63n416j62N432m94n477J096N161j651n005
1342c949K223M794k683m489L122M194l516l886M044L568m259l039M662K559m964
1357a619k005N357J638n407r81N627M10n713L27N813p67n786J487N674k154n592
$$ plain form
1249 -3271 -3766 3964 3527 -4258 -2882 4899 2638 -4857 -1577 5577 1283 -5430 -292 5785 -20
1264 -20 -5363 1131 5654 -1590 -5194 2421 5055 -2767 -4441 3557 4125 -3980 -3611 4294 2924 -4628
1280 -4628 -2369 4834 1718 -5021 -1239 4832 478 -4910 41 4837 -582 -4690 978 4446 -1455
1295 -1455 -4118 2029 4006 -2223 -3523 2634 3438 -2721 -2699 3449 2888 -3124 -2056 3727 2086 -3381
1311 -3381 -1166 4088 1325 -3686 -489 4131 489 -3782 186 4081 -363 -3819 752 3635 -1280
1326 -1280 -3767 1446 3252 -2113 -3394 1904 2567 -2849 -3011 2421 1927 -3550 -2454 2707 1056 -3949
1342 -3949 -1726 3068 385 -4104 -982 3212 -304 -4190 -146 3422 -837 -3876 786 3345 -1619
1357 -1619 -3624 1733 3371 -2036 -3017 2610 3020 -2693 -2366 3447 2680 -3106 -1619 4055 1901 -3691
1373c691K922N400l575n055M206M645m937m125N610L470o219k787O603J900p042
1388b675j015P299k8p514R55P347k048p154L100O733m183o225M937N451n654m576
1404e250O179L685o748k718P061J698p040o45O912l61o828J394O491k257n815
1419d242K963N296l758m512M085L964m479l155M734K396m795j870M700J287m514
1434a900o85M302K53m178k0L833k48l467N62L305p68l230Q05K998q14k894J122
1451a024K912j338l042J479L100j627k984K135L131k564l199K946L132l165k892
1466c000L927K674m466k377M884K035n017j355N459O92n731k9N863o89n728J628
1482a230N662k491n560L314N029m136m495M911L979n651l404N953K445o387j718
$$ plain form
1373 -3691 -769 4631 1056 -3999 207 4852 -85 -4210 1400 4870 -1349 -4136 2467 4367 -2675
1388 -2675 -3690 3609 3581 -3933 -2978 4369 2321 -4833 -1733 5000 817 -5408 -471 4980 -674 -5250
1404 -5250 929 4614 -2134 -4852 2209 3907 -3133 -3778 3134 2773 -4055 -2661 3830 1573 -4242
1419 -4242 -1279 4017 259 -4253 -168 3796 -683 -3838 896 3292 -1503 -3373 1327 2614 -1900
1434 -1900 -2585 1717 1970 -2208 -2228 1605 1357 -2110 -1548 1757 989 -2241 -1436 1562 748 -2146 -1024
1451 -1024 1888 550 -2492 -1013 2087 460 -2524 -389 2742 178 -3021 -75 3057 -108 -3000
1466 -3000 927 3601 -865 -3242 1642 3677 -1340 -2695 2764 3456 -2275 -2304 3559 2870 -2858 -1230
1482 -1230 4432 1941 -3619 -305 4724 588 -3907 1004 4983 -668 -4072 1881 4326 -2061 -3779
1497c779O675Q95o876k21O565p37o469J662O118k264n901K834N188l666m593M311
1513b58M154m753l622N004K837n508k072O014J521o007r38N991J44o041P04O091
1529C261j041n878J690N463k324n127L096M875l387m340L812L655m404l000M869
1544A220K573n059j806N154R56n383l43N598j19n487P37N231j549n129J913N046
1560C553k214m534K550L926k957l740L245L352l247k735L319K086l554j758L619
1575I11J538l469j093L503N85l689k88L734M05l766lL737l91l886N23M133n96
1592A888m092R33M084j308m271J610M340j931m155K350L978k999l893L513L500
1607C547l804l039M347K508n103j973N439J257n683l65N918n24o146J228O103
$$ plain form
1497 -3779 2896 3791 -3085 -3306 3259 2522 -3947 -2285 3833 1569 -4332 -1498 3690 24 -4569 -258
1513 -258 3896 -857 -4479 525 3362 -2146 -4218 1796 3317 -2690 -3628 2363 2507 -3534 -2830 3261
1529 3261 2220 -3658 -1968 3495 1171 -3956 -860 4015 628 -3712 100 3755 -649 -3649 1220
1544 1220 3793 -1266 -3072 2082 3038 -2345 -2688 2910 2791 -2696 -1959 3272 1723 -3406 -1493 3553
1560 3553 1339 -3195 -645 3281 324 -3416 -171 3181 -66 -2801 518 2604 -950 -2708 911
1575 911 2449 -1020 -2113 1390 1975 -1714 -2002 1732 2137 -1629 -1632 2105 1714 -2172 -1649 2484 1888
1592 1888 -2204 -1271 2813 1505 -2766 -1156 3184 1253 -2902 -552 3426 427 -3466 47 3547
1607 3547 -257 -3296 1051 3559 -1544 -3517 1922 3179 -2504 -2869 3049 2525 -3621 -2393 3710
1622C710k025n892K986N648l855n161M434M551m959l701N586K849n887k008O052
1637B328J156o078j00O092p92n993J777N489k422n019L133M697l777m137M219
1652E73L447m586k770M740K157m820j616M768Q97m734l63M537j45m430N82M039
1668B276j027l875J404L581j795l296J829L114k186k905K456K531k518k326K678
1683e9K094k804j992L039J728l097j400L394J164l416r44L603O47l606k01L767
1699A917r8l780N14L747q83l624J465L599j776l515K161L244k583k969L156K681
1715C256l366k453L589J895l886j404M181J047m309o82M168om203N23M322j038
1731A634m205J417L884k100l666K642L469k975l150L336K639l821k148M156J925
$$ plain form
1622 3710 1685 -4207 -1221 4427 572 -4589 -155 4396 -563 -4264 1322 4171 -1716 -3724 2328
1637 2328 3484 -2594 -2694 3398 2606 -3387 -1610 3879 1457 -3562 -429 4268 491 -3646 573
1652 573 4020 -566 -3336 1404 3561 -1259 -2875 1893 2790 -1944 -2307 2230 2085 -2345 -1763 2276
1668 2276 1249 -2626 -1222 2359 564 -2732 -903 2211 25 -2880 -424 2107 -411 -2737 -59
1683 -59 2035 -769 -2761 278 2006 -1091 -2491 903 2067 -1349 -2293 1310 1957 -1649 -1850 1917
1699 1917 1819 -1961 -1447 2300 1417 -2207 -742 2857 1081 -2434 -273 2971 388 -2581 575 3256
1715 3256 -110 -2563 1026 2921 -965 -2369 1812 2859 -1450 -2132 2036 2030 -2173 -1650 2672 1634
1731 1634 -2571 -1154 2730 630 -3036 -394 3075 100 -3050 286 2925 -896 -3044 1112 3037
1746C037m273j437M417O62m621p0M822l09m641Q59M419j548m326K125M297k465
1762I48l814K892L260l467k947L915K609m045j993M206J222m611p40M639M05m573
1778b094L02M394j121m440J398M455j880l914K190L506k889l394L161L027l151
1793d50k520L509J841l822j694L944J348l750p03L859J52m101M2M043k82l680
1809b264Q88L676j284l792J609L543j649l212K222K986k705k970K877K669k916
1824c22k092L268J890l696j787L679J439l703q40M039K97m259j37M067k81l878
1840b316R13M006j463m120J655L678j953l273K653L097l081l095L177K550l434
1855a006j817L920J503m189j278M099P74m082N2M294m03m398O76L981j105l769
$$ plain form
1746 3037 -1236 -2673 1744 2406 -2215 -2285 2537 2228 -2413 -1554 2865 1317 -3009 -884 3413 948
1762 948 -2866 26 3286 -181 -3128 787 3396 -649 -2642 1564 2786 -1825 -2565 2074 2479 -2094
1778 -2094 -1792 2602 1481 -2959 -1561 2894 1014 -2900 -710 2796 -93 -3487 -326 2701 -450
1793 -450 -2970 539 2380 -1442 -3136 808 2156 -1594 -2297 1562 1714 -2387 -2345 1698 1416 -2264
1809 -2264 -1376 2300 1016 -2776 -1167 2376 727 -2485 -263 2723 18 -2952 -75 2594 -322
1824 -322 -2414 854 2744 -952 -2739 940 2379 -1324 -2164 1875 2172 -2087 -2224 1843 1562 -2316
1840 -2316 -1403 2603 1140 -2980 -1325 2353 400 -2873 -220 2877 -204 -3299 -122 2428 -1006
1855 -1006 -2823 1097 2600 -1589 -2867 1232 2006 -2076 -2024 2270 1867 -2531 -1855 2126 1021 -2748
1871b748J916L753k191l695K348L120k726k674L281K537l489k300L429J664l616
1886a391j124M045P62m123m73L858j34l951Q27M022j041l884J108L605j815l261
1902b970K256L389k544l057K688K533l036k189L506K140l615j680L618J061l719
1917a619o53M163M00l966O0L917p38l792J156L939j411l564J801L208k306l100
1933b505K819K954k959k489L193J945l663j550L771J368l818q60L784K51m022
1948a781J08M017m05l832Q97L605j622l483J852L298k064k965K476K465k886k276
1964b596K976K089l084j476L164J037l499o82L507M16l234j5L330n24l255P11
1980a135L303r84k863J329K787j703k680J941K474j971k079K256J762k475j692
$$ plain form
1871 -2748 -832 2921 730 -2965 -617 2503 -223 -2897 384 2921 -568 -2868 561 2225 -1391
1886 -1391 -2515 1530 2292 -1831 -2304 1554 1420 -2531 -1704 2318 1277 -2607 -1499 2106 291 -2970
1902 -2970 -714 2675 131 -2926 -238 2295 -741 -2930 576 2716 -899 -2579 1039 2100 -1619
1917 -1619 -2272 1891 2291 -1675 -1615 2302 1564 -2228 -1072 2867 1456 -2108 -307 2901 595 -2505
1933 -2505 314 3268 309 -2180 1013 2958 -705 -2255 1516 2884 -934 -1794 1990 2241 -1781
1948 -1781 -1673 2344 1939 -1893 -996 2609 987 -2496 -644 2654 590 -2375 101 2566 -320 -2596
1964 -2596 380 2469 -615 -2091 1073 2110 -1389 -2071 1436 1852 -1382 -1397 1933 1409 -1846 -1135
1980 -1135 2168 1184 -1679 -350 2437 734 -1946 -5 2469 498 -1581 675 2437 -38 -1730
1995a730K596J430k570r91K681O53k915n20K895K80k873J45K802m95l024P40K837
2012A941r65k702J260K635j740k606J885K398k197k080K475J848k868j631K961
2027F14J338l211q20L311N54l611j60L544k12l476O79L521j206l437J569L199
2043B196j935l001K493K694k838k404L021K011l315j643L633J153l745p72L817
2058A365K43l880L69L722p20l694J208L480j612l267K042L012k393k642K676K282
2074B191k979j868L218J542l251j059L378O61l370j55L394j36l241N84L162r51
2090A120k977J343K914j536k605J837K346k011k088K260J908k384j604K519J269
2105B311k574j008K639P07k658n57K693K37k776J5K657k98k637L61K602o40k626
$$ plain form
1995 -1730 866 2296 -274 -1265 1416 2069 -846 -1366 1529 1809 -1064 -919 1883 1388 -1636 -896 1941
2012 1941 976 -1726 -466 2169 429 -2177 -292 2106 -91 -2171 304 2152 -716 -2347 614
2027 614 1952 -1259 -2079 1232 1786 -1825 -1985 1559 1347 -2129 -1450 2071 865 -2572 -1003 2196
2043 2196 261 -2740 -247 2447 -391 -2795 226 2237 -1078 -2721 912 2065 -1680 -2452 1365
2058 1365 1608 -2272 -1903 1819 1099 -2595 -1387 2093 481 -2786 -744 2268 -125 -2767 -91 2191
2074 2191 -788 -2656 562 2104 -1147 -2206 1172 1833 -1537 -1692 1702 1566 -1675 -1091 2071 1120
2090 1120 -1857 -514 2400 864 -1741 96 2442 431 -1657 603 2511 127 -1477 1042 2311
2105 2311 -263 -1271 1368 2075 -583 -1140 1553 1790 -986 -971 1686 1388 -1249 -888 1714 1074 -1552
2122a552Q55K498j142k511J307K343j561k343J754K089k069j924K278J734k544
2137g88j585K730J335k866j130L126P58l225m86L426J23l412L21L399o85l389
2153b348J120L334j525l126J946K967k301k733K761K429l047k037L267J670l524
2168a147j182L726O73l849k19L931k98l906P93L789j283l654J675L375k111l075
2184b762K496K780k924k314L084J882l191j536L337J041l507m72L447R5l361L18
2200a587L249o42l255J125K983j338k809J697K523j927k190K145J953k345j666
2215b084K402J439k610j092K620Q04k608n77K684K35k615l7K564l05k467N06K393
2232A252o83k333R23K127j007k141J286J917j341j834J515J749j694j486J872
$$ plain form
2122 -1552 -697 1801 659 -1852 -545 1798 237 -2106 -352 1737 -332 -2256 22 1756 -788
2137 -788 -2373 357 1692 -1174 -2304 822 1580 -1645 -2131 1295 1418 -1994 -1673 1726 1041 -2348
2153 -2348 -1228 2106 581 -2545 -599 2368 67 -2666 95 2524 -523 -2560 707 2377 -1147
2168 -1147 -2329 1397 2070 -1779 -1998 1933 1635 -2271 -1478 2311 1028 -2626 -951 2424 313 -2762
2184 -2762 -266 2514 -410 -2724 360 2242 -949 -2485 852 1893 -1614 -2086 1361 1456 -1905 -1587
2200 -1587 1662 1020 -2235 -1110 1873 535 -2274 -577 1946 19 -2171 -26 1927 -418 -2084
2215 -2084 318 1757 -853 -1945 675 1479 -1129 -1706 978 1213 -1402 -1439 1125 820 -1647 -1141 1252
2232 1252 569 -1764 -841 1286 279 -1862 -576 1341 0 -1834 -319 1430 -264 -1750 122
2247A22J375j971j143K126J005k186p83K328O94k367l92K521K33k551J02K680
2263A793l22k619O51K664r75k489J249K512j527k343J863K167k231j863K389J689
2279B608k776j298K913Q79l102n54L175Q1l240L13L194q16l266J205L039j689
2295F66k829J992K547k449k303K728J832k948j525L131J018l243o63L334J82l383
2311a913L30L169p25l082J248K856j595k574J876K310k117j991K328J687k506
$$ plain form
2247 122 1497 -474 -1617 509 1514 -672 -1455 873 1567 -800 -1192 1329 1562 -989 -887 1793
2263 1793 1471 -1148 -497 2167 1192 -1297 -48 2464 937 -1406 457 2624 393 -1470 919 2608
2279 2608 -168 -1466 1447 2326 -776 -1330 1845 1926 -1314 -1001 2193 1377 -1889 -684 2355 666
2295 666 -2163 -171 2376 -73 -2376 352 2184 -764 -2289 842 1860 -1383 -2046 1288 1470 -1913
2311 -1913 -1583 1586 861 -2221 -973 1883 288 -2286 -410 1900 -217 -2208 120 1807 -699
$$ [...]
8191A3
##END NTUPLES=NMR FID
##END=
