##TITLE=1H_IBTB 2705
 CDCl3, 8 sc, 
 28.5.2019
##JCAMPDX= 6.0         $$ Bruker NMR JCAMP-DX V2.0
##DATA TYPE= NMR FID
##DATA CLASS= NTUPLES
##ORIGIN= UXNMR, Bruker Analytische Messtechnik GmbH
##OWNER= root
$$ XWIN-NMR		Version 3.5
$$ Tue May 28 14:33:23 2019 Russian Standard Time (UT+4h)  she@DPX200
##.OBSERVE FREQUENCY= 200.1315
##.OBSERVE NUCLEUS= ^1H
##.DELAY= (6, 6)
##.ACQUISITION MODE= SIMULTANEOUS
##.ACQUISITION SCHEME= undefined
##.AVERAGES= 8
##.DIGITISER RES= 18
##SPECTROMETER/DATA SYSTEM= spect
##.PULSE SEQUENCE= zg30
##.SOLVENT NAME= CDCl3
##.SHIFT REFERENCE= (INTERNAL, CDCl3, 0, 15.7039)
##AUDIT TRAIL= $$ (NUMBER, WHEN, WHO, WHERE, WHAT)
$$ ##TITLE= Audit trail, XWIN-NMR		Version 3.5
$$ ##JCAMPDX= 5.01
$$ ##ORIGIN= Bruker BioSpin GmbH
$$ ##OWNER= she
$$ F:/spectra/data/she/nmr/H-F/1/audita.txt
$$ ##AUDIT TRAIL=  $$ (NUMBER, WHEN, WHO, WHERE, WHAT)
(   1,<2019-05-28 14:32:16.90 +0400>,<she>,<DPX200>,
      <created by zg, POWCHK disabled, PULCHK disabled
       configuration hash MD5:
       00 E9 B6 7A A2 85 ED C7 34 08 36 98 17 FE 4E 26
       data hash MD5: 16K
       BE 6C 79 A2 83 10 3E E0 BF 9B 4D EE DE CD DA 41>)
$$ ##END=
$$ 
$$ hash MD5
$$ 76 FF 5A 06 00 F0 F9 44 57 51 6D 84 66 D1 EB F4
##$RELAX= 
##$RELAX= 
##$RELAX= 
##$RELAX= 
##$RELAX= 
##$RELAX= 
$$ Bruker specific parameters
$$ --------------------------
##$DU= <F:/spectra>
##$EXPNO= 1
##$NAME= <H-F>
##$PROCNO= 1
##$TYPE= <nmr>
##$USER= <she>
##$AMP= (0..31)
100 100 100 100 100 100 100 100 100 100 100 100 100 100 100 100 100 100 
100 100 100 100 100 100 100 100 100 100 100 100 100 100 
##$AQSEQ= 0
##$AQ_mod= 1
##$AUNM= <au_zg>
##$AUTOPOS= <>
##$BF1= 200.13
##$BF2= 200.13
##$BF3= 200.13
##$BF4= 200.13
##$BF5= 200.13
##$BF6= 200.13
##$BF7= 200.13
##$BF8= 200.13
##$BYTORDA= 1
##$CFDGTYP= 0
##$CFRGTYP= 5
##$CHEMSTR= <none>
##$CNST= (0..31)
1 1 145 1 1 1 1 1 1 1 1 1 1 1 1 1 1 1 1 1 1 1 1 1 1 1 1 1 1 1 1 1 
##$CPDPRG= <>
##$CPDPRG1= <>
##$CPDPRG2= <>
##$CPDPRG3= <>
##$CPDPRG4= <mlev>
##$CPDPRG5= <mlev>
##$CPDPRG6= <mlev>
##$CPDPRG7= <mlev>
##$CPDPRG8= <mlev>
##$CPDPRGB= <>
##$CPDPRGT= <>
##$D= (0..31)
0 1.2 0 0 0 0 0 0 0 0 0 0.03 0 0 0 0 0 0 0 0 0 0 0 0 0 0 0 0 0 0 0 0 
##$DATE= 1559039536
##$DBL= (0..7)
120 120 120 120 120 120 120 120 
##$DBP= (0..7)
150 150 150 150 150 150 150 150 
##$DBP07= 0
##$DBPNAM0= <>
##$DBPNAM1= <>
##$DBPNAM2= <>
##$DBPNAM3= <>
##$DBPNAM4= <>
##$DBPNAM5= <>
##$DBPNAM6= <>
##$DBPNAM7= <>
##$DBPOAL= (0..7)
0.5 0.5 0.5 0.5 0.5 0.5 0.5 0.5 
##$DBPOFFS= (0..7)
0 0 0 0 0 0 0 0 
##$DE= 6
##$DECBNUC= <off>
##$DECIM= 24
##$DECNUC= <off>
##$DECSTAT= 4
##$DIGMOD= 1
##$DIGTYP= 9
##$DL= (0..7)
0 120 120 120 120 120 120 120 
##$DP= (0..7)
150 150 150 150 150 150 150 150 
##$DP07= 0
##$DPNAME0= <>
##$DPNAME1= <>
##$DPNAME2= <>
##$DPNAME3= <>
##$DPNAME4= <>
##$DPNAME5= <>
##$DPNAME6= <>
##$DPNAME7= <>
##$DPOAL= (0..7)
0.5 0.5 0.5 0.5 0.5 0.5 0.5 0.5 
##$DPOFFS= (0..7)
0 0 0 0 0 0 0 0 
##$DQDMODE= 0
##$DR= 18
##$DS= 0
##$DSLIST= <SSSSSSSSSSSSSSS>
##$DSPFIRM= 0
$$ [...]
##$SUBNAM2= <"">
##$SUBNAM3= <"">
##$SUBNAM4= <"">
##$SUBNAM5= <"">
##$SUBNAM6= <"">
##$SUBNAM7= <"">
##$SUBNAM8= <"">
##$SUBNAM9= <"">
##$SW= 24.9337058887773
##$SWIBOX= (0..15)
0 0 2 0 0 0 0 0 0 0 0 0 0 0 0 0 
##$SW_h= 4990.01996007984
##$TD= 16384
##$TD0= 1
##$TE= 0
##$TE2= 300
##$TE3= 300
##$TEG= 300
##$TL= (0..7)
0 120 120 120 120 120 120 120 
##$TP= (0..7)
150 150 150 150 150 150 150 150 
##$TP07= 0
##$TPNAME0= <>
##$TPNAME1= <>
##$TPNAME2= <>
##$TPNAME3= <>
##$TPNAME4= <>
##$TPNAME5= <>
##$TPNAME6= <>
##$TPNAME7= <>
##$TPOAL= (0..7)
0.5 0.5 0.5 0.5 0.5 0.5 0.5 0.5 
##$TPOFFS= (0..7)
0 0 0 0 0 0 0 0 
##$TUNHIN= 0
##$TUNHOUT= 0
##$TUNXOUT= 0
##$USERA1= <user>
##$USERA2= <user>
##$USERA3= <user>
##$USERA4= <user>
##$USERA5= <user>
##$V9= 5
##$VALIST= <valist>
##$VCLIST= <CCCCCCCCCCCCCCC>
##$VD= 0
##$VDLIST= <DDDDDDDDDDDDDDD>
##$VPLIST= <PPPPPPPPPPPPPPP>
##$VTLIST= <TTTTTTTTTTTTTTT>
##$WBST= 1024
##$WBSW= 4
##$XGAIN= (0..3)
0 0 0 0 
##$XL= 0
##$YL= 0
##$YMAX_a= 57648
##$YMIN_a= -79776
##$ZGOPTNS= <>
##$ZL1= 120
##$ZL2= 120
##$ZL3= 120
##$ZL4= 120
##$ABSF1= 10
##$ABSF2= 0
##$ABSG= 5
##$ABSL= 3
##$ALPHA= 0
##$AQORDER= 0
##$ASSFAC= 0
##$ASSFACI= 0
##$ASSFACX= 0
##$ASSWID= 0
##$AUNMP= <proc_1d>
##$AZFE= 0.1
##$AZFW= 0.1
##$BCFW= 1
##$BC_mod= 2
##$BYTORDP= 1
##$COROFFS= 0
##$CY= 11.3945322036743
##$DATMOD= 1
##$DC= 2
##$DFILT= <>
##$DTYPP= 0
##$F1P= 18.9103706918063
##$F2P= -1.10871071338519
##$FCOR= 0.5
##$FTSIZE= 0
##$FT_mod= 4
##$GAMMA= 1
##$GB= 0.15
##$INTBC= 1
##$INTSCL= 1
##$ISEN= 128
##$LB= 0.24
##$LEV0= 0
##$LPBIN= 0
##$MAXI= 10000
##$MC2= 0
##$MEAN= 0
##$ME_mod= 0
##$MI= 1.114404
##$NCOEF= 0
##$NC_proc= 0
##$NLEV= 6
##$NOISF1= 3.799351
##$NOISF2= 2.8
##$NSP= 1
##$NTH_PI= 0
##$NZP= 0
##$OFFSET= 15.70392
##$PC= 1
##$PHC0= -9016.73
##$PHC1= 17.60025
##$PH_mod= 1
##$PKNL= yes
##$PPARMOD= 0
##$PSCAL= 0
##$PSIGN= 0
##$REVERSE= no
##$SF= 200.130013532006
##$SI= 16384
##$SIGF1= 3
##$SIGF2= 2
##$SINO= 400
##$SIOLD= 16384
##$SREGLST= <1H.CDCl3>
##$SSB= 0
##$STSI= 0
##$STSR= 0
##$SW_p= 3612.71676300578
##$SYMM= 0
##$S_DEV= 0
##$TDeff= 0
##$TDoff= 0
##$TI= <>
##$TILT= no
##$TM1= 0
##$TM2= 0
##$TOPLEV= 0
##$USERP1= <user>
##$USERP2= <user>
##$USERP3= <user>
##$USERP4= <user>
##$USERP5= <user>
##$WDW= 1
##$XDIM= 8192
##$YMAX_p= 0
##$YMIN_p= 0
$$ End of Bruker specific parameters
$$ ---------------------------------
##NTUPLES= NMR FID
##VAR_NAME=  TIME,          FID/REAL,        FID/IMAG
##SYMBOL=    X,             R,               I
##VAR_TYPE=  INDEPENDENT,   DEPENDENT,       DEPENDENT
##VAR_FORM=  AFFN,          ASDF,            ASDF
##VAR_DIM=   8192,          8192,            8192
##UNITS=     SECONDS,       ARBITRARY UNITS, ARBITRARY UNITS
##FACTOR=    0.0002004,     1,               1
##FIRST=     0,             0,               0
##LAST=      1.6414764,     0,               0
##MIN=       0,             -79776,          0
##MAX=       1.6414764,     57648,           0
$$ Real data points
##PAGE= N=1
##DATA TABLE= (X++(R..R)), XYDATA
$$ plain form
0 0 0 0 0 0 0 0 0 0 0 0 -8 8 -8 8 -8 16 -16 16 -24 24 -32 40 -40 48 -56 64 -74 88 -96 112 -123 138 -155
33 -155 176 -194 216 -241 267 -297 330 -364 403 -446 494 -547 608 -676 752 -840 944 -1065
51 -1065 1210 -1388 1613 -1907 2308 -2893 3830 -5583 9972 -44549 -58708 14474 -38148 -77982
65 -77982 -35610 13215 -38753 -79776 -37217 5845 -36530 -66024 -24592 6193 -35765 -58060
77 -58060 -16556 8556 -28388 -43484 -4736 12234 -25566 -41123 -7266 9258 -19868 -31066
89 -31066 -898 15619 -7621 -22164 -3984 9267 -6237 -19485 -8195 5262 -1701 -14204
101 -14204 -11009 284 -1038 -12015 -12245 -878 143 -13715 -19289 -8930 -7281 -22004 -24639 -6524
115 -6524 -1555 -20534 -26049 -6892 -4828 -30485 -36124 -9905 -3842 -30927 -36550 -7897 -2344 -32380
$$ packed form
0@%%%%%%%%%%qJ6j6J6j6K4l2L2m0M8n6P2q0Q8j04J20j38J62j84K08k35K61k93
33a55L31l70M10m57N08n64O27o94P67q49R40j041J155j284J428j592J784k009
51a065K275k598L001l520M215n201O723r413J5555n4521j4159P3182n2622l9834
65g7982M2372M8825n1968m1023M2559M3062m2375k9494M1432L0785m1958k2295
77e8060M1504K5112l6944j5096L8748J6970l7800j5557L3857J6524k9126j1198
89c1066L0168J6517k3240j4543J8180J3251j5504j3248J1290J3457o963j2503
101a4204L195J1293j322j0977k30J1367J021j3858n574J0359J649j4723k635J8115
115f524M969j8979n515J9157K064k5657n639K6219O063k7085n623K8653N553l0036
$$ plain form
129 -32380 -37842 -6856 -285 -29619 -34258 -5140 -2574 -32408 -34043 -3512 -716 -26946 -23913
142 -23913 5706 3375 -25673 -23012 5395 2303 -24616 -18972 10852 8342 -18920 -15523 11809
155 11809 10255 -14990 -12820 13122 12734 -12219 -13651 9012 10713 -10438 -11084 11853 15380 -6205
169 -6205 -11028 8225 11014 -10830 -15665 6475 13102 -8723 -15794 6173 12941 -11397 -20386 4158
183 4158 13931 -11460 -22937 1855 12296 -14681 -26612 1238 14489 -12176 -24429 2808
195 2808 13833 -15198 -27245 1161 12308 -15299 -24002 5439 14262 -14757 -22239 7109 13915
208 13915 -14738 -19771 9564 14279 -14429 -18412 9904 14053 -11902 -13722 12836 15468 -9357
221 -9357 -11874 10671 12342 -8770 -9421 11231 12836 -5159 -6072 10454 11096 -4169 -4969 8983
$$ packed form
129c2380n462L0986O571k9334m639K9118K566k9834j635L0531K796k6230L033
142b3913K9619k331k9048K661K8407l092k6919N644K9824k510k7262L397K7332
155A1809j554k5245K170K5942l88k4953j432K2663J701k1151o46K2937L527k1585
169f205m823J9253K789k1844m835K2140O627k1825p071K1967O768k4338q989K4544
183D158R773k5391j1477K4792J0441k6977j1931K7850J3251k6665j2253K7237
195B808J1025k9031j2047K8406J1147k7607q703K9441Q823k9019p482K9348O806
208A3915k8653n033K9335M715k8708l983K8316M149k5955j820K6558K632k4825
221i357k517K2545J671k1112o51K0652J605j7995r13J6526O42j5265q00J3952
$$ plain form
235 8983 10216 -2431 -4182 6964 8896 -1491 -3960 5662 9562 1025 -3855 3562 8834 1353
249 1353 -5901 736 9326 3522 -6100 -400 10665 4921 -7698 -2397 11260 5871 -8960 -3276
263 -3276 12551 6649 -10226 -3724 14125 7157 -11109 -3220 15697 7085 -12617 -3253 16756
276 16756 6501 -13612 -2346 18307 6327 -14286 -1756 18861 5455 -15130 -1260 19222
288 19222 4862 -15315 -673 19173 4197 -15522 -577 18676 3517 -15365 -420 18116
300 18116 3354 -14923 -541 17360 3104 -14460 -722 16327 3204 -13679 -936 15672
312 15672 3494 -12756 -964 15369 4223 -11909 -1436 14562 4616 -11394 -1921 14572
324 14572 6117 -10037 -1895 14580 7106 -9817 -3019 14020 7945 -9190 -3303 14344 9236
$$ packed form
235H983J233j2647j751J1146J932j0387k469R622L900q537m880P417N272p481
249A353p254O637Q590n804r622N700J1065n744j2619N301J3657n389j4831N684
263c276J5827n902j6875O502J7849o968j8266P889J8917q612j9702R364K0009
276A6756j0255k0113J1266K0653j1980k0613J2530K0617j3406k0585J3870K0482
288A9222j4360k0177J4642J9846j4976j9719J4945J9253j5159j8882J4945J8536
300A8116j4762j8277J4382J7901j4256j7564J3738J7049j3123j6883J2743J6608
312A5672j2178j6250J1792J6333j1146j6132J0473J5998r946j6010R473J6493
324A4572q455j6154Q142J6475p474j6923O798J7039o075j7135N887J7647n108
$$ plain form
337 9236 -8554 -3962 14046 10064 -8093 -4409 13754 10331 -8307 -5543 12954 10481 -7664
350 -7664 -5254 13275 11174 -7489 -6066 11783 10136 -8053 -6682 11589 10632 -7242 -6610 11110
364 11110 10571 -7271 -7120 10239 10477 -6953 -7829 9218 10350 -6422 -7739 9034 11326 -4824
378 -4824 -7390 8111 10614 -5144 -8237 7299 11002 -3807 -7426 7488 11676 -3041 -7627 6819
392 6819 11698 -2769 -7893 6320 11555 -2645 -8127 6160 12232 -1574 -7436 6581 12436 -2035
406 -2035 -8800 5122 11709 -2173 -8626 5680 12789 -1297 -8594 5003 12325 -1615 -9187 4236
420 4236 11796 -1618 -9388 3809 11587 -1178 -8823 4012 11911 -864 -9262 2849 10858 -1620
434 -1620 -9875 2444 11257 -505 -9245 2590 11466 -467 -9941 1401 10761 -562 -10454 689
$$ packed form
337I236j7790M592J8008l982j8157L684J8163l423j8638K764J8497k473j8145
350g664K410J8529k101j8663J423J7849j647j8189J371J8271r57j7874O32J7720
364A1110n39j7842J51J7359K38j7430q76J7047J132j6772j317J6773K292j6150
378d824k566J5501K503j5758l093J5536L703j4809l619J4914M188j4717m586J4446
392F819M879j4467n124J4213N235j4200n482J4287O072j3806n862J4017N855j4471
406b035o765J3922O587j3882o453J4306P109j4086p297J3597P322j3940p572J3423
420D236P560j3414p770J3197P778j2765p645J2835P899j2775q398J2111Q009j2478
434a620q255J2319Q813j1762q740J1835Q876j1933r474J1342R360j1323r892J1143
$$ plain form
448 689 10803 -121 -10381 703 11419 654 -10425 -114 10765 35 -11536 -1299
460 -1299 10465 549 -10941 -777 11121 1188 -10928 -1417 10292 518 -11563 -1882 10216
473 10216 692 -11059 -1481 10621 1270 -10424 -1161 10566 1198 -10573 -1683 9931 1424
486 1424 -9792 -1037 10633 2680 -8440 -572 10406 2766 -8287 -1111 9758 3042 -7453
499 -7453 -719 10058 4025 -6209 -412 9991 4394 -6083 -1289 8759 4025 -6075 -1504 8840
513 8840 4640 -5426 -1515 8462 4387 -6005 -2573 7495 3777 -6857 -3531 7098 3913 -6760
527 -6760 -3759 7026 3876 -7336 -4807 5937 3001 -8203 -5481 5664 3063 -7980 -5230 5738
541 5738 3040 -7962 -5410 5376 2714 -8167 -5673 4955 2628 -7557 -4816 5709 3682 -6439
$$ packed form
448F89J0114j0924j0260J1084J0716j0765j1079J0311J0879j0730j1571J0237
460a299J1764r916j1490J0164J1898r933j2116R511J1709r774j2081R681J2098
473A0216r524j1751R578J2102r351j1694R263J1727r368j1771Q890J1614q507
486A424j1216Q755J1670p953j1120P868J0978p640j1053P176J0869o716j0495
499g453O734J0777o033j0234N797J0403n597j0477M794J0048m734j0100M571J0344
513H840m200j0066L911R977m075j0392L432J0068l718j0634L326J0629l185j0673
527f760L001J0785l150j1212K529J0744k936j1204K722J1145k601j1043K750J0968
541E738k698j1002K552J0786k662j0881K494J0628k327j0185K741J0525k027j0121
$$ plain form
555 -6439 -4410 5472 3497 -6377 -4586 5407 4184 -5184 -3931 5752 5139 -4233 -3950 5624 5748 -3744
571 -3744 -4425 4966 6098 -3406 -4868 4876 7154 -2430 -5082 4530 7418 -2919 -6635 3670 7606
586 7606 -3120 -7387 3681 8265 -3483 -8478 3536 8579 -4167 -9769 3086 8589 -5179
599 -5179 -10999 3172 8980 -5618 -11272 3842 9426 -6278 -11968 3673 9018 -7083 -12051 4382
613 4382 9415 -6850 -11267 5102 9114 -6936 -10582 5519 8878 -6825 -9485 5969 8384 -6308
627 -6308 -8060 6549 8309 -5465 -6754 6483 7524 -5065 -5964 5923 7156 -3917 -4780 5566
641 5566 6776 -2899 -4197 4583 5945 -2121 -3805 3359 5283 -1227 -3698 2086 4954 -293 -3637
656 -3637 923 4590 333 -4218 -703 4088 795 -4705 -1611 4465 1639 -5193 -2786 4430 1762
$$ packed form
555f439K029R882j975r874J791R993j223r368J253R683o13r372K83R574J24r492
571c744o81R391J132r504j462R744K278r584k652R612K888j0337l716J0305L936
586G606j0726m267J1068M584j1748m995J2014N043j2746n602J2855N503j3768
599e179n820J4171N808j4598n654J5114N584j5704n690J5641N345j6101m968J6433
613D382N033j6265m417J6369M012j6050l646J6101L359j5703k660J5454K415j4692
627f308j752J4609J760j3774j289J3237J041j2589q99J1887J233j1073q63J0346
641E566J210r675j298Q780J362q066j684P164J924o510k471N784K868n247l344
656c637M560L667m257m551L515M791l293n500L094O076k826o832K407P216k668
$$ plain form
671 1762 -6199 -3573 5103 2300 -7121 -4363 5572 2638 -7859 -4532 6400 2925 -8424 -4887
685 -4887 6692 2911 -8847 -4709 7370 3002 -9152 -4395 7653 2837 -9291 -4095 7970
698 7970 2627 -9363 -3877 7966 2533 -9165 -3700 7848 2459 -8875 -3678 7482 2455 -8536
712 -8536 -3722 7039 2381 -8135 -3728 6831 2727 -7771 -3944 6359 2785 -7450 -4173 6184
726 6184 3233 -7069 -4546 5852 3567 -6802 -4679 5852 4064 -6570 -5046 5717 4504 -6326
740 -6326 -5237 5840 4851 -6236 -5349 5860 4977 -6130 -5225 5949 5008 -6145 -5038 6031 4877
755 4877 -6094 -4750 6134 4457 -6281 -4482 6065 4294 -6122 -4175 5695 3648 -5960 -3967
769 -3967 5344 3248 -5557 -3607 4563 2645 -4988 -3158 3949 2179 -4340 -2868 3091 1801 -3745
$$ packed form
671A762p961K626Q676k803r421K758R935k934j0497L327J0932l475j1349L537
685d887J1579l781j1758M138J2079m368j2154M757J2048m816j2128N196J2065
698G970n343j1990N486J1843n433j1698N465J1548n389j1334N197J1160n027j0991
712h536M814J0761m658j0516M407J0559m104j0498L827J0303l574j0235L277J0357
726F184k951j0302K523J0398k285j0369K123J0531j788j0634J524J0763j213j0830
740f326J089J1077r89j1087Q87J1209q83j1107R05J1174r41j1153J107J1069j154
755D877j0971J344J0884j677j0738J799J0547j771j0416J947R870k047r608J993
769c967R311k096q805J950Q170j918p633J830P107j770o519J472N959j290n546
$$ plain form
784 -3745 -2664 2458 1685 -2931 -2581 1715 1822 -2020 -2644 1037 2195 -1154 -2915 400 2760 -201
800 -201 -3088 -94 3505 470 -3694 -595 4338 1099 -4384 -908 5219 1502 -5151 -1020 6112
815 6112 1604 -5942 -1184 6726 1394 -6722 -974 7441 1056 -7599 -729 7864 334 -8267 -287
830 -287 8137 -539 -8986 89 8226 -1203 -9222 574 8128 -1992 -9444 860 7871 -2623 -9311
845 -9311 1309 7483 -3193 -8990 1711 7084 -3315 -8207 1970 6630 -3467 -7692 2033 6030
859 6030 -3268 -6631 2392 5603 -2887 -5772 2494 5257 -2491 -4984 2468 5102 -1884 -4321 2315
874 2315 4981 -1161 -3908 1947 5027 -190 -3444 1409 4742 347 -3469 719 4821 1146 -3155
889 -3155 221 4701 1471 -3515 -379 4701 1768 -3635 -758 4765 1842 -4159 -1306 4862 1982
$$ packed form
784c745J081N122p73m616L50M296J07l842o24L681J158l349j761L315K360k961
800b01k887K994L599l035m164L099M933l239n483L476O127l717o653M131P132
815F112m508p546M758P910n332q116N748Q415o385q655O870Q593p530q601P980
830b87Q424q676q447R075Q137r429q019R796P554j0120p452J0304P011j0494o688
845i311J0620O174j0676n797J0701N373j0399m892J0177M660j0097m225R725L997
859F030r298l363R023L211q490k885Q266K763p748k493P452K634o986k437O636
874B315K666o142k747N855L080n217l254M853L333m395l816M188M102l675m301
889c155L376M480l230m986L136N080k933n403K877N523k923o001K853O168k880
$$ plain form
904 1982 -4389 -1555 4978 1883 -4991 -2111 4827 2031 -4946 -2067 5037 1970 -5254 -2556 4643
919 4643 2068 -5114 -2477 4679 2253 -4943 -2781 4317 2237 -4687 -2611 4293 2588 -4263 -2865
934 -2865 3907 2558 -4125 -2961 3964 3320 -3552 -3242 3497 3321 -3622 -3654 3541 4009 -3180 -3928 3215
951 3215 4029 -3438 -4498 3211 4606 -3252 -4647 3243 4622 -3785 -5263 3338 5027 -3699 -5321
966 -5321 3583 5058 -4287 -5922 3513 5177 -4219 -5639 4023 5168 -4743 -6039 3781 4945 -4737
981 -4737 -5525 4385 5026 -4992 -5569 4111 4587 -4918 -5028 4475 4622 -4803 -4918 4109 4021 -4785 -4434
998 -4434 4235 4120 -4142 -4077 3704 3555 -4033 -3903 3546 3825 -3008 -3568 2853 3238 -2878 -3605 2362
1015 2362 3536 -1898 -3170 1845 3258 -1666 -3506 1183 3533 -783 -3304 889 3664 -648 -3925
$$ packed form
904A982o371K834O533l095o874K880O938k796o977K879P104l067p224K698P199
919D643k575p182K637P156k426p196K162P098k080o924K076O904j705o851J398
934b865O772j349o683J164O925o44o872L10O739j76o943l2P195M68p189p48P143
951C215Q14p467j060P709J395p858j395P890J379q407j478Q601J689q726j622
966e321Q904J475r345j635R435J664r396j420R662J145r911j296R820J164r682
981d737p88R910O41j0018n77R680M76r505j10R503J47r425j15R027q8q806L51
998d434Q669j15q262O5P781j49p588J30P449K79o833n60O421L85o116p27N967
1015B362J174n434j272N015J413m924j840M689K350m316k521M193K775m312l277
$$ plain form
1030 -3925 115 3875 129 -3692 92 4269 344 -4287 -684 4300 754 -4187 -372 4822 901
1045 901 -4698 -953 4727 930 -4628 -639 5164 1085 -4944 -1020 4987 849 -4910 -672 5343
1060 5343 1070 -5061 -930 4766 537 -5195 -651 5082 759 -4974 -852 4640 234 -5311 -898
1075 -898 4711 540 -4953 -992 4251 126 -5208 -1085 4288 524 -4707 -1062 3896 87 -5088
1090 -5088 -1447 3755 502 -4484 -1177 3848 460 -4724 -1642 3576 646 -4273 -1380 3726 786
1105 786 -4444 -1692 3538 1008 -4085 -1416 3866 1200 -4182 -1752 3616 1318 -4033 -1600 3985
1120 3985 1742 -3884 -1881 3619 1702 -3796 -1734 3869 2022 -3572 -1938 3545 1881 -3665 -1931
1135 -1931 3736 2205 -3427 -1992 3463 1985 -3529 -2132 3469 2254 -3205 -2081 3403 2201 -3303
$$ packed form
1030c925M040L760l746l821L784M177l925m631L603M984l546m941L815N194l921
1045I01n599L745N680l797n558L989N803m079o029L924O007m138n759M238O015
1060E343m273o131M131N696m229n732M544N733m323n733M122N492m406n545M413
1075h98N609m171n493L961N243m125n334M123N373l764n231L645M958l809n175
1090e088L641N202l253m986L307N025l388n184L082N218k930m919K893N106k940
1105G86n230K752N230k530n093K669N282k666n382K430N368k298n351K433N585
1120C985k243n626K003N500j917n498K062N603j847n594J634N483j664n546J734
1135a931N667j531n632J435N455j478n514J397N601j215n459J124N484j202n504
$$ plain form
1150 -3303 -2356 3272 2457 -3067 -2309 3291 2512 -3201 -2513 3126 2682 -2926 -2467 3163 2824 -2963 -2629
1167 -2629 2997 2846 -2813 -2622 2956 2927 -2640 -2646 2750 2866 -2617 -2626 2730 2920 -2556 -2811 2668 2874
1185 2874 -2506 -2907 2539 2979 -2449 -2974 2267 2850 -2362 -3151 2122 2874 -2314 -3079 1875 2813 -2262
1202 -2262 -3280 1645 2820 -2027 -3351 1431 2787 -1854 -3442 1181 2815 -1794 -3561 1021 2945
1217 2945 -1616 -3665 871 3038 -1523 -3728 804 3203 -1320 -3938 737 3460 -1231 -4155 562
1232 562 3613 -1000 -4202 480 3814 -967 -4402 382 3887 -825 -4411 426 4005 -835 -4556
1247 -4556 318 3997 -853 -4633 304 4242 -757 -4628 249 4115 -836 -4669 211 4230 -644
1262 -644 -4714 130 4048 -663 -4622 116 4234 -465 -4534 15 4078 -419 -4541 -64 4145
$$ packed form
1150c303R47N628q15n524P58N600p79n713O88N639m44n608M59N630l39n787L34
1167b629N626j51n659J91N578k9n567oN396J16n483rN356J90n476k55N479K06
1185B874n380m01N446M40n428n25N241N83n212p89N273P52n188p65M954R38n075
1202b262j018M925J175m847j324M782J356m641j588M623J634m609j767M582J924
1217B945m561k049M536K167m561k205M532K399m523k618M675K723m691k924M717
1232E62L051m613l202M682L334m781l435M784L505m712l586M837L579m840l721
1247d556M874L679m850l780M937L938m999l871M877L866m951l833M880M019m874
1262f44m070M844L918m711l959M738M118m699m069M549M063m497m122M477M209
$$ plain form
1277 4145 -186 -4229 -161 4052 -34 -4213 -243 4108 247 -3975 -224 3983 368 -3991 -407
1292 -407 3978 607 -3699 -402 3995 708 -3738 -721 3739 897 -3525 -675 3766 1008 -3508
1307 -3508 -971 3477 941 -3484 -910 3476 1048 -3448 -1186 3184 1020 -3379 -1307 3064 1108
1322 1108 -3299 -1586 2543 929 -3168 -1662 2427 1095 -2937 -1792 2094 981 -2824 -1941 1807
1337 1807 1114 -2677 -2038 1650 1208 -2539 -2267 1549 1457 -2261 -2314 1388 1626 -2262 -2695 1277 1886 -2013
1355 -2013 -2704 1454 2227 -2010 -3009 1294 2475 -1904 -3150 1535 2926 -1934 -3411 1611 3158 -1844
1371 -1844 -3445 1778 3422 -2099 -3735 1872 3433 -2146 -3590 2207 3668 -2305 -3665 2336 3558
1386 3558 -2487 -3584 2586 3562 -2639 -3629 2697 3559 -2751 -3371 2792 3481 -2789 -3295 2804 3195 -2722
$$ packed form
1277D145m331m043M068M213m086m179L970M351l861m222L751M207l615m359L584
1292d07M385l371m306L297M397l287m446L017M460k842m422K850M441k758m516
1307c508K537M448k536m425K574M386k428m496K262M370k164m399K072M371j956
1322A108m407J713M129j614m097J506M089j332m032J145L886j113l805Q83L748
1337A807o93l791O39L688m42l747K72L816r2l718n3L702K38l888m33L972O09l899
1355b013o91M158P73m237r99M303J181m379j246M685J391m860j477N022J547n002
1371a844j601N223J644n521j636N607J561n579j444N797J461n973j360O001J222
1386C558o045j097O170R76o201r90O326Q62o310o20O163O89o270n06O099L91n917
$$ plain form
1403 -2722 -3070 2789 3013 -2630 -2781 2681 2794 -2455 -2549 2495 2486 -2318 -2257 2308 2311 -2015 -1941 2226 2205
1422 2205 -1736 -1869 1811 2067 -1480 -1708 1643 2127 -1115 -1735 1255 2070 -755 -1644 1047 2129 -464
1439 -464 -1683 633 2066 -167 -1674 632 2208 77 -1811 252 2185 80 -2041 241 2601
1454 2601 312 -2199 49 2633 241 -2386 -19 2869 457 -2655 -208 2848 314 -2777 -196
1469 -196 3041 567 -2683 -373 2963 387 -2982 -447 2985 507 -2906 -335 3024 478 -3063
1484 -3063 -510 3008 535 -3028 -505 3133 542 -3262 -773 3122 823 -3167 -744 3348 1077
1499 1077 -3167 -1092 3102 1046 -3020 -907 3317 1346 -2996 -1027 3256 1201 -3004 -870 3541
1514 3541 1370 -3019 -895 3622 1282 -3225 -782 3963 1692 -3081 -809 3868 1569 -3201 -835
$$ packed form
1403b722l48N859K24n643j51N462J13n249r4N044rm804O1M565Lm326P4M167k1
1422B205l941j33L680K56l547k28L351M84l242o20K990Q15k825q89K691J082k593
1439d64j219K316J433k233j507K306J576k131j888K063J933k105k121K282K360
1454B601k289k511K248K584k392k627K367K888k412l112K447L056k534l091K581
1469a96L237k474l250K310L336k576l369K535L432k478l413K571L359k546l541
1484c063K553L518k473l563K523L638k591l804K489L895k299l990K423M092k271
1499A077m244K075M194k056m066K113M224j971m342J969M283k055m205K134M411
1514C541k171m389K124M517k340m507K443M745k271m773K272M677k299m770K366
$$ plain form
1529 -835 3952 1827 -2845 -593 3869 1500 -2952 -526 3818 1517 -2620 -141 3684 1151 -2742
1544 -2742 -191 3526 1113 -2492 41 3606 991 -2606 -280 3199 933 -2283 -111 3175 1208
1559 1208 -2036 -493 2486 1192 -1681 -451 2236 1324 -1322 -763 1659 1202 -1041 -617 1622 1475
1575 1475 -850 -1033 1281 1441 -1000 -1193 1372 1989 -675 -1579 1098 2136 -771 -2100 1016 2631
1591 2631 -470 -2368 819 2787 -554 -2670 766 3037 -376 -2683 705 3038 -651 -3017 767
1606 767 3199 -649 -2910 1075 3210 -901 -3330 1010 3265 -978 -3237 1252 3441 -1162 -3355
1621 -3355 1151 3352 -1137 -3218 1233 3377 -1147 -3268 1153 3163 -1169 -2967 1306 3070 -1123
1636 -1123 -2934 1209 2893 -1225 -2702 1292 2827 -1095 -2586 1237 2652 -1079 -2603 1276 2745
$$ packed form
1529h35M787k125m672K252M462k369m452K426M344k301m137K479L825k533l893
1544b742K551L717k413l605K533L565k615l597K326L479k266l216K172L286j967
1559A208l244J543K979j294k873J230K687r12k646N59K422m57k243M24K239j47
1575A475k325j83K314J60k441j93K565O17k664r04K677J038k907j329L116J615
1591B631l101j898L187J968l341k116L436K271l413k307L388K333l689k366L784
1606G67K432l848k261L985K135m111k429M340K255m243k259M489K189m603k193
1621c355M506K201m489k081M451K144m524k121M421K010m332j798M273J764m193
1636a123j811M143J684m118j477L994J535l922j491L823J415l731j524L879J469
$$ plain form
1651 2745 -827 -2388 1022 2609 -762 -2385 891 2548 -624 -2185 715 2437 -412 -2183 655
1666 655 2389 -328 -2080 552 2393 -210 -2114 454 2372 -164 -2110 236 2419 106 -2129
1681 -2129 177 2333 227 -2075 11 2350 283 -1947 -179 2174 474 -2052 -289 2182 611
1696 611 -1965 -308 2195 705 -1932 -527 2115 763 -1838 -600 2082 828 -1858 -843 1894
1711 1894 902 -1913 -910 2021 1075 -1868 -1105 1823 1081 -1912 -1305 1794 1298 -1814 -1279 1655 1141
1728 1141 -1973 -1395 1746 1284 -1992 -1395 1804 1059 -2191 -1608 1744 1297 -2088 -1501 1808 1199 -2375
1745 -2375 -1771 1812 1170 -2262 -1531 1994 1253 -2353 -1772 1843 1273 -2252 -1445 2040 1262 -2314 -1610
1762 -1610 1906 1200 -2253 -1369 2119 1336 -2112 -1347 2023 1225 -2095 -1234 2226 1535 -1890 -1194 2032
$$ packed form
1651B745l572j561L410J587l371j623L276J657l172j561K900J722k849j771K838
1666F55J734k717j752K632J841k603j904K568J918k536j946K346K183k313k235
1681b129K306K156k106k302K086K339k067k230J768K353j700k526J763K471j571
1696F11k576J657K503j490k637J405K642j352k601J238K682j254k686J015K737
1711A894r92k815J003K931r46k943P63K928p42k993O07L099m96l112N35K934n14
1728A141l114N78L141m62l276N97L199p45l250N83L352m47l385N87L309o09l574
1745b375O04L583o42l432P31L525p41l606N81L615n70l525Q07L485p78l576P04
1762a610L516p06l453Q84L488p83l448P65L370p98l320Q61L460o91l425O96L226
$$ plain form
1779 2032 1262 -1927 -1166 2211 1674 -1613 -1058 1928 1371 -1669 -1215 2002 1736 -1282 -1109 1861 1659
1796 1659 -1496 -1406 1654 1777 -1014 -1249 1651 1747 -1247 -1614 1343 1838 -985 -1326 1453 1898 -1085
1813 -1085 -1806 958 1718 -835 -1534 1235 1925 -924 -2041 758 1752 -875 -1834 980 2097 -790
1829 -790 -2147 479 1856 -817 -2010 808 2160 -529 -2170 451 1892 -683 -2095 605 2397
1844 2397 -281 -2081 477 2045 -643 -2265 461 2330 -162 -1963 485 2143 -524 -2270 328
1859 328 2316 -129 -1989 381 2164 -408 -2383 134 2161 -117 -2049 250 2144 -380 -2456
1874 -2456 -213 1991 -203 -2194 53 2104 -249 -2428 -435 1799 -215 -2288 -215 1977 -148
1889 -148 -2512 -620 1716 -192 -2394 -377 2023 78 -2462 -730 1671 -30 -2380 -502 2077
$$ packed form
1779B032p70l189P61L377n37l287N55K986n57l040M54L217k66l018J73K970k02
1796A659l155R0L060J23k791k35K900R6k994l67K957M95k823l41K779M45k983
1813a085p21K764P60k553o99K769O90k849j117K799R94k627r59K814J117k887
1829g90j357K626J377k673j193K818J352k689j641K621J441k575j412K700J792
1844B397k678j800K558J568k688j622K726J869k492j801K448J658k667j746K598
1859C28J988k445j860K370J783k572j975K517K027k278j932K299J894k524k076
1874b456K243K204k194j991K247K051k353k179J993K234k014k073K073K192k125
1889a48k364J892K336j908k202K017K400j945k540J732K401j701k350J878K579
$$ plain form
1904 2077 337 -2235 -692 1833 314 -2317 -642 2143 692 -2001 -675 2011 582 -2112 -669
1919 -669 2246 1049 -1703 -577 2144 857 -2061 -750 2103 1166 -1673 -574 2185 1115 -1951
1934 -1951 -896 2045 1173 -1731 -727 2140 1141 -1896 -1108 1772 1062 -1748 -944 1944 1128 -1877
1950 -1877 -1274 1531 930 -1813 -1198 1687 1125 -1833 -1415 1332 840 -1829 -1360 1421 1041 -1674 -1449
1967 -1449 1111 843 -1816 -1388 1249 1014 -1498 -1369 1095 819 -1668 -1488 1075 1097 -1346 -1368 941
1984 941 1023 -1411 -1484 876 1189 -1084 -1374 866 1126 -1117 -1496 762 1264 -927 -1352 776 1175 -1000
2002 -1000 -1621 577 1214 -847 -1510 596 1297 -937 -1716 330 1265 -934 -1736 436 1348 -883 -1881
2019 -1881 263 1322 -892 -1908 435 1526 -817 -2021 298 1473 -851 -1956 386 1656 -723
$$ packed form
1904B077j740k572J543K525j519k631J675K785j451k693J326K686j429k694J443
1919f69K915j197k752J126K721j287k918J311K853r37k839J099K759j070l066
1934a951J055K941q72k904J004K867r99l037P88K880p10k810Q04K888q16l005
1950a877O03K805o01k743O15K885n62k958M18K747m92k669M69K781l80k715K25
1967a449K560k68k659M28K637k35k512J29K464k76k487J80K563K2k443k2K309
1984I41Q2k434p3K360L13k273k90K240K60k243l79K258N02k191m25K128L99k175
2002a000o21K198O37k061o63K106P01k234p79K046R35k199q02K172R12k231r98
2019a881K144J059k214j016K343J091k343j204K319J175k324j105K342J270k379
$$ plain form
2034 -723 -1984 275 1575 -762 -2040 473 1891 -594 -1952 469 1810 -622 -2004 547 1913
2049 1913 -533 -1976 569 1969 -523 -1979 527 2047 -450 -1862 567 2066 -479 -1909 490
2064 490 1993 -422 -1851 593 2017 -372 -1877 456 1882 -393 -1801 434 1858 -319 -1823
2079 -1823 271 1738 -366 -1724 348 1699 -326 -1638 222 1558 -355 -1669 197 1492 -301
2094 -301 -1649 99 1440 -207 -1532 43 1401 -196 -1545 -111 1333 -75 -1460 -151 1290
2109 1290 -6 -1489 -313 1214 185 -1500 -348 1175 188 -1428 -559 1198 273 -1392 -625 1181
2125 1181 401 -1474 -717 1200 421 -1575 -813 1156 523 -1640 -996 1214 658 -1626 -1029 1145 733
2142 733 -1623 -1095 1228 820 -1605 -1240 1278 933 -1630 -1262 1400 984 -1580 -1303 1405 1140 -1532
$$ packed form
2034g23j261K259J300k337j278K513J418k485j358K421J341k432j382K551J366
2049A913k446j443K545J400k492j456K506J520k497j412K429J499k545j430K399
2064D90J503k415j429K444J424k389j505K333J426k275j408K235J424k177j504
2079a823K094J467k104j358K072J351k025j312J860J336j913j314J866J295j793
2094c01j348J748J341j647j325J575J358j597j349J434J444j408j385J309J441
2109A290j296j483J176J527j029j685J152J523r87j616Q69J757r25j665P67J806
2125A181p80j875P57J917p79j996P62J969o33k163O44K210n56k284N97K174m12
2142G33k356N28K323m08k425L65K518l45k563L68K662m16k564K77K708k65k672
$$ plain form
2159 -1532 -1297 1473 1236 -1537 -1274 1612 1304 -1459 -1240 1650 1344 -1551 -1270 1714 1406 -1446 -1168
2176 -1168 1709 1446 -1577 -1252 1725 1518 -1437 -1243 1680 1440 -1418 -1233 1562 1460 -1363 -1204 1543
2193 1543 1349 -1402 -1186 1537 1322 -1283 -1157 1431 1241 -1251 -1107 1315 1181 -1177 -1009 1235 1167
2210 1167 -1103 -994 1182 1175 -1061 -1002 1108 1167 -872 -971 977 1149 -849 -1037 872 1130 -625 -991
2228 -991 789 1163 -526 -961 670 1151 -386 -1006 493 1153 -372 -1065 398 1177 -209 -1166 207
2245 207 1184 -184 -1244 69 1260 -94 -1350 -20 1289 -52 -1526 -173 1309 -1 -1550
2260 -1550 -264 1424 -23 -1625 -263 1586 71 -1694 -306 1632 75 -1745 -222 1691 112
2275 112 -1763 -186 1724 230 -1758 -135 1821 171 -1716 -95 1872 224 -1750 63 1882
$$ packed form
2159a532K35K770k37k773K63K886l08k763K19K890l06k895K81K984l08k852K78
2176a168K877k63l023L25K977k07k955J94K923k40k858J85K795j02k823J59K747
2193A543j94k751K16K723k15k605J26K588j90k492J44K422j34k358J68K244o8
2210A167k270J09K176pk236N9K110N9k039r9J948J72j998j88J909K58j755l66
2228i91J780L74j689m35J631M81j537o20J499O60j525o93J463P79j386r57J373
2245B07R77j368j060J313J191j354j256J330J309j341j474J353J482j310j549
2260a550J286J688j447j602J362J849j515j765J388J938j557j820J523J913j579
2275A12j875J577J910j494j988J623J956j650j887J621J967j648j974J813J819
$$ plain form
2290 1882 191 -1669 102 2003 206 -1605 135 1968 210 -1588 155 1919 136 -1476 214
2305 214 1873 117 -1443 247 1847 141 -1375 141 1726 136 -1407 161 1666 210 -1279
2320 -1279 174 1620 147 -1279 104 1473 147 -1171 134 1520 286 -1152 18 1407 338
2335 338 -1141 -28 1444 482 -1024 -98 1395 563 -967 -131 1398 617 -893 -196 1269 641 -853
2352 -853 -235 1335 667 -835 -270 1273 763 -772 -425 1144 823 -820 -515 1107 809 -886 -556
2369 -556 1100 796 -796 -629 940 795 -813 -666 871 915 -879 -932 812 858 -864 -969 667 914
2387 914 -756 -1000 753 950 -817 -1046 687 1025 -725 -1014 815 1050 -759 -1059 916 1121 -801
2404 -801 -978 989 1258 -674 -988 1006 1337 -720 -951 1140 1368 -703 -1009 1156 1381 -675 -895
$$ packed form
2290A882j691j860J771J901j797j811J740J833j758j798J743J764j783j612J690
2305B14J659j756j560J690J600j706j516J516J585j590j543J568J505j456j489
2320a279J453J446j473j426J383J369j326j318J305J386j234j438J170J389j069
2335C38j479J113J472r62j506R26J493q32j530Q36J529p81j510O97J465o28j494
2352h53O18J570o68j502N65J543n10j535L47J569l21j643L05J622k98j695L30
2369e56J656l04j592J67J569j45j608J47J537M4j794n3J744M6j722j05J636K47
2387I14j670k44J753J97j767k29J733L38j750k89J829K35j809l00J975K05j922
2404h01j77J967K69j932l14J994L31k057k31K091K28k071l06K165K25k056k20
$$ plain form
2421 -895 1117 1438 -686 -956 1225 1427 -680 -897 1140 1469 -621 -926 1168 1407 -718 -903 1175
2438 1175 1335 -610 -868 1067 1278 -705 -873 1089 1357 -583 -855 963 1332 -590 -915 899 1343
2455 1343 -501 -818 876 1299 -364 -894 794 1273 -175 -814 717 1350 -147 -834 580 1222 -61
2472 -61 -762 527 1377 35 -904 390 1322 147 -897 310 1333 132 -974 209 1245 161
2488 161 -1025 144 1377 269 -1028 60 1300 163 -1120 -78 1308 303 -1102 -82 1229
2503 1229 194 -1190 -117 1211 253 -1205 -177 1253 162 -1201 -197 1183 105 -1137 -205
2518 -205 1261 239 -1217 -214 1226 262 -1191 -290 1199 278 -1193 -259 1281 292 -1081 -240 1249
2535 1249 420 -1117 -204 1203 368 -1078 -264 1247 424 -1058 -304 1228 479 -1066 -282 1233 496
$$ packed form
2421h95K012L21k124k70K181K02k107k17K037L29k090l05K094K39k125j85K078
2438A175J60j945k58J935K11j983j68J962K68j940k72J818L69j922l25J814M44
2455A343j844l17J694M23j663n30J688M79j448o39J531O33j497o87J414O42j283
2472f1p01J289Q50j342r39J294R32j175j044J207J023j201j106J183J036j084
2488A61j186J169J233j108j297J088J240j137j283J042J386j005j405J020J311
2503A229j035j384J073J328r58j458J028J430j091j363J004J380j078j242R32
2518b05J466j022j456J003J440r64j453R01J489r21j471R34J540r89j373Q41J489
2535A249q29j537R13J407q35j446Q14J511q23j482P54J532p49j545P84J515p37
$$ plain form
2552 496 -1012 -359 1171 507 -1052 -345 1221 611 -974 -366 1138 574 -1024 -408 1148 653 -960
2569 -960 -415 1171 616 -863 -488 1111 683 -898 -477 1132 722 -835 -467 1102 761 -745 -461
2586 -461 1051 859 -749 -451 1003 768 -660 -513 994 823 -690 -490 951 800 -606 -611 848 847
2604 847 -623 -669 803 819 -608 -754 686 868 -634 -820 674 832 -657 -863 642 734 -713 -865
2622 -865 500 713 -724 -913 502 732 -686 -1024 368 732 -606 -947 378 727 -670 -987 383
2639 383 666 -609 -990 358 732 -519 -948 321 750 -538 -964 319 811 -465 -975 349 815
2656 815 -388 -891 360 873 -325 -945 234 833 -327 -833 318 939 -300 -958 246 816 -294
2673 -294 -883 235 871 -247 -969 100 851 -350 -1019 156 947 -238 -1018 144 826 -284 -1085
$$ packed form
2552D96j508O53J530o64j559P07J566o10j585O08J504n64j598O16J556m95j613
2569i60N45J586n55j479L75J599m28j581M21J609m10j557L68J569l41j506K84
2586d61J512j92j608K98J454k35j428J47J507j71j513K00J441j51j406nJ459j
2604H47j470m6J472J6j427j46J440J82j502j86J494J58j489k06J505R2j447j52
2622h65J365K13j437j89J415K30j418l38J392L64j338l41J325L49j397l17J370
2639C83K83j275l81J348L74j251m29J269M29j288m26J283M92j276n10J324M66
2656H15j203n03J251N13j198o20J179N99j160n06J151O21j239o58J204N70j110
2673b94n89J118O36j118p22J069P51j201o69J175P91j185p80J162O82j110q01
$$ plain form
2690 -1085 24 942 -135 -1007 19 958 -251 -1115 48 966 -67 -971 100 1029 -117 -1063 55
2707 55 1036 -15 -871 113 1052 -19 -1008 31 1011 53 -883 110 1122 67 -997 -35 1015 118
2725 118 -912 80 1102 187 -964 -57 1022 85 -962 -18 1072 195 -976 -186 949 37 -1042
2742 -1042 -165 966 213 -1029 -302 848 16 -1051 -279 869 133 -1053 -366 742 24 -1113 -362
2759 -362 751 149 -1002 -370 721 47 -1098 -515 704 197 -909 -427 674 131 -976 -532 624
2776 624 228 -797 -338 657 224 -903 -558 521 246 -734 -449 664 358 -791 -620 475 337 -648
2794 -648 -551 585 493 -592 -662 441 464 -686 -622 517 646 -553 -733 414 496 -635 -795 560 748
2813 748 -467 -795 388 653 -717 -943 512 828 -521 -794 460 718 -583 -971 544 913 -517
$$ packed form
2690a085J109R18j077q72J026R39j209q64J163R18j033r04J071R29j146r46J118
2707E5R81j051q56R84R39j071r89J039R80r58r36R93J012j055j064R62J050q97
2725A18j030R92J022r15j151R07J079r37j047R44J090q77j171P90J135r12j079
2742a042Q77J131p53j242P27J150q32j067P72J148p36j186O87J108p18j137P51
2759c62J113o02j151O32J091o74j145N83J219n07j106M82J101n43j107M44J156
2776F24l96j025M59R95m33j127L45J079k75r80K85J113l06j149J71J095j38r85
2794f48R7J136r2j085p0J103K3j150O4J139J29j199j80J147Q2j131j60J355J88
2813G48j215l28J183K65j370k26J455L16j349k73J254K58j301l88J515L69j430
$$ plain form
2830 -517 -861 576 875 -679 -901 595 993 -495 -730 666 907 -673 -950 573 760 -519 -727
2847 -727 703 860 -552 -868 542 824 -479 -730 658 867 -454 -716 432 698 -434 -636 571
2864 571 797 -426 -692 361 589 -412 -650 299 697 -314 -676 211 455 -368 -735 226 704 -213 -703
2883 -703 94 528 -326 -807 7 601 -31 -703 -3 533 -250 -850 -56 571 5 -732 -92 577 -125 -837
2903 -837 -167 672 -90 -708 -87 702 -73 -889 -178 562 -33 -818 -87 722 75 -833 -228 597 65 -740
2923 -740 -85 729 81 -744 -244 607 19 -713 -94 663 157 -688 -215 696 95 -736 -141 695 269 -620
2943 -620 -254 633 180 -681 -222 740 344 -602 -208 690 256 -674 -239 748 386 -596 -282 735 355 -672
2963 -672 -248 765 385 -689 -233 853 375 -736 -308 882 326 -695 -232 866 345 -700 -254
$$ packed form
2830e17l44J437K99j554k22J496L98j488k35J396K41j580k77J523J87j279k08
2847g27J430J57j412l16J410K82j303k51J388K09j321k62J148K66j132k02J207
2864E71K26j223k66J053K28j001k38R49L98j011l62Q87K44q23l67R61M78r17m90
2883g03P97M34q54m81Q14N94o32o72P00N36p83o00P94O27n66p37O40O69p02p12
2903h37O70Q39p62o18O21P89p75q16P11P40n95p85P31Q09o47r08O05Q25n32q05
2923g40O55Q14o48q25N00Q51n88p32O19P57n06q45M73R11o01q31N95Q36m26q89
2943f20L66Q87m53q61M59R62l96r46L94Q98m34r30M35R87l62r82L14J017l80j027
2963f72M24J013l80j074M56J086m78j111M28J190n56j021M63J098n21j045M46
$$ plain form
2980 -254 779 276 -741 -176 933 345 -774 -178 760 200 -740 -108 857 286 -718 -197 738 161
2998 161 -726 -187 805 253 -608 -177 678 199 -585 -307 533 289 -511 -295 416 184 -531 -276 402 244
3018 244 -446 -366 281 285 -449 -496 274 338 -441 -492 172 361 -440 -566 222 368 -295 -670 152 473 -403 -719
3040 -719 78 553 -329 -720 154 566 -328 -758 154 605 -358 -764 164 593 -320 -742 194 664 -347 -735
3060 -735 262 765 -299 -746 314 713 -328 -692 266 737 -317 -665 399 750 -271 -662 352 635
3078 635 -333 -576 304 622 -288 -599 304 635 -266 -622 313 649 -235 -561 194 580 -217 -616 220 580
3098 580 -206 -589 151 605 -110 -598 154 662 -159 -575 147 582 -136 -677 107 652 -86 -676 111 686
3118 686 -38 -664 63 610 -36 -625 76 702 -60 -700 22 684 -17 -690 15 616 7 -591 -10 592
$$ packed form
2980b54J033n03j017N65J109n88j119N96R38n60r40O32R65n71j004N21R35n77
2998A61q87N39R92n52q61M31Q55m79p84K78Q40k44q00K16P11k32p15K55O78j58
3018B44o90Q0O47Mp34m7P70O4p79n1O64J89q01j26P88J46o63l75Q22L21q76l16
3040g19P97M75q82l91Q74M12q94m30R12M51r63m06R28M29r13m22R36M70j011l88
3060g35R97N03j064m47J060L99j041l64R58M71j054l48J064L51j021l91J014K83
3078F35r68k43Q80L18r10l11R03L31r01l56R35L36q84l26P55L86p97l99Q36L60
3098E80p86l83P40M54p15m88P52N08q21m16P22M35p18n41P84N45p38n90P87N75
3118F86p24o26P27N47o46n89P01O26p62o40P22O62p01o73P05O01o09n98N81O02
$$ plain form
3138 592 34 -614 -67 576 9 -644 -37 567 12 -621 -101 481 1 -596 -183 465 27 -556 -326 386
3158 386 86 -574 -290 337 96 -591 -347 336 120 -610 -341 312 189 -583 -413 275 206 -531 -409 324
3178 324 217 -575 -408 355 345 -449 -435 339 298 -526 -413 412 320 -434 -336 461 377 -481 -325 579 421 -443
3200 -443 -355 544 388 -417 -319 600 439 -427 -324 625 396 -433 -277 642 417 -403 -258 583 440 -450 -164
3221 -164 577 401 -412 -232 538 336 -441 -311 474 385 -402 -192 386 394 -390 -254 402 325 -287 -275 425 333
3243 333 -270 -331 326 381 -279 -287 353 420 -215 -377 243 427 -252 -339 262 412 -198 -398 272 449 -171 -360
3265 -360 252 553 -136 -382 229 568 -191 -425 111 557 -150 -467 240 405 -137 -532 264 439 -211 -535
3285 -535 159 501 -248 -490 118 428 -219 -510 107 415 -167 -501 71 422 -171 -466 84 432 -149 -519
$$ packed form
3138E92n58o48N47O43n67o53O07O04n55o33N20N82m80n97M13O48m38n83K30P12
3158C86l00o60K84O27k41o87K44O83k16p30K69O53j23p72J70O88o9p37J22P33
3178C24j07p92J67P63j0p94J4P74m1q24J13Q25r2p54R8P97q4q58J56R04j58q64
3200d43Q8Q99j56q05R8R19j61q66J03R49k29q29J56R19k25q20J45Q41j43q90K86
3221a64P41j76q13J80P70k02p77J30P85q9p87K10N78Qp84J36O56p7o12J2P00r2
3243C33o03o1O57N5o60qO40O7o35j62O20J84o79q7O01J50o10k00O70J77o20j89
3265c60O12L01o89k46O11L39p59k34N36M46p07l17P07J65n42l95P96J75o50l24
3285e35O94L42p49k42O08L10o47k91O17L08n82l34N72L51n93k95N50L48n81l70
$$ plain form
3305 -519 124 429 -134 -547 150 441 -129 -458 63 472 -120 -485 15 510 -42 -451 79 491 -62 -451
3325 -451 91 480 60 -406 108 605 10 -448 57 527 119 -416 32 584 95 -409 29 529 175 -349
3345 -349 60 588 146 -390 141 546 221 -310 95 557 136 -353 -26 596 160 -330 -6 582 194 -334
3365 -334 -23 540 201 -372 -31 534 168 -424 10 515 205 -331 -37 521 175 -374 -120 494 173 -415
3385 -415 -72 501 202 -397 -124 507 240 -442 -232 543 258 -319 -133 487 169 -397 -166 494 273 -346
3405 -346 -138 429 221 -375 -172 463 255 -392 -256 376 222 -461 -241 377 197 -326 -185 331 296 -401
3425 -401 -362 269 297 -265 -308 294 260 -340 -354 266 285 -331 -269 310 267 -222 -336 228 331 -244 -258 207 385
3448 385 -222 -297 221 355 -216 -296 203 391 -146 -321 272 418 -163 -326 224 475 -186 -327 270 454 -105
$$ packed form
3305e19O43L05n63m13O97K91n70l29N21M09n92l65N00M95n52m09N30M12n53l89
3325d51N42L89m20m66N14M97n95m58N05M70m08n35M48N52m89n04M38N00l54n24
3345c49M09N28m42n36N31M05l25n31M05M62m21m89L27O22m36m90L24N88l88n28
3365c34L11N63l39n73L41N65l66n92M34N05l10n36K94N58l46n49K54O14l21n88
3385d15L43N73k99n99K73O31k67o82K10P75k85n77J86O20l18n66K31O60k21o19
3405c46K08N67k08n96K03O35k08o47J36O32j54o83K20O18j80n23J41N16l5o97
3425d01L9O31K8n62m3O02l4o00j4O20J9o16O2N79m3m89j14N64J03n75j4M65J78
3448C85o07p5N18J34n71q0M99J88n37j75N93J46n81j63N50K51o61j41N97J84n59
$$ plain form
3469 -105 -301 238 416 -42 -259 255 489 -106 -289 179 439 -73 -245 269 425 -102 -271 283 405 -35
3489 -35 -309 258 394 -75 -311 208 468 -68 -305 164 471 -94 -340 164 435 -100 -367 193 443 -55
3509 -55 -303 75 349 -31 -355 123 399 -80 -399 125 383 -55 -427 112 420 -71 -433 26 423 -87
3529 -87 -451 60 347 -47 -419 3 342 -90 -456 36 347 -67 -421 37 288 -102 -431 53 325 -60
3549 -60 -390 -35 206 -22 -380 -85 264 -83 -375 -75 286 -22 -301 -88 207 -75 -312 -131 203 4
3569 4 -324 -114 309 58 -384 -88 180 90 -286 -101 214 129 -220 -137 227 122 -290 -162 273 177 -303 -177
3591 -177 303 148 -391 -187 329 218 -264 -189 302 194 -271 -235 359 258 -325 -230 403 261 -291 -190 310
3612 310 262 -328 -110 386 253 -330 -200 385 224 -349 -150 421 235 -355 -150 361 119 -353 -137 387
$$ packed form
3469a05j96N39J78m58k17N14K34n95j83M68K60n12j72N14J56n27j69N54J22m40
3489c5k74N67J36m69k36N19K60n36k37M69L07n65k46N04K71n35k67N60K50m98
3509e5k48L78K74l80l24M78K76m79l19N24K58m38l72N39L08m91l62M59L97n10
3529h7l64N11K87l94l72M22L39m32l66M92L11m14l54M58K51l90l29M84K72l85
3549f0l30L55K41k28l58K95L49l47k92L00L61l08k79K13K95k82k37J81L34j99
3569Dl28K10M23k51m42K96K68r0l76J85L15q5l49Q3L64j05m12J28M35r6m80J26
3591a77M80j55n39K04N16j11m82P5M91j08m65L6N94j01n83R5O33j42n52J01N00
3612C10m8n90K18M96j33n83J30N85j61n73J99N71j86n90K05N11k42m72K16N24
$$ plain form
3632 387 109 -339 -194 335 181 -325 -168 217 143 -319 -140 238 83 -284 -207 241 138 -263 -179 183 187 -299
3654 -299 -130 216 147 -319 -238 169 223 -310 -223 211 197 -270 -324 160 271 -189 -322 162 240 -261 -342 148 136
3677 136 -224 -370 63 178 -203 -382 117 267 -259 -339 130 279 -224 -340 176 210 -238 -303 99 207 -168
3698 -168 -311 108 231 -202 -293 116 174 -181 -316 0 257 -107 -393 125 215 -100 -279 14 234 -106 -210
3719 -210 81 232 -9 -252 63 331 -46 -235 15 294 -17 -287 54 322 65 -312 14 333 69 -287
3739 -287 84 316 29 -310 65 397 18 -351 20 397 37 -329 -5 399 -36 -359 15 414 -51 -363
3759 -363 64 395 -59 -319 58 324 -69 -304 37 376 -70 -436 63 307 -122 -355 4 290 15 -297
3779 -297 52 265 -2 -290 93 223 -81 -283 25 240 -58 -260 12 178 -19 -227 -100 161 -21 -271
$$ packed form
3632C87k78m48J45N29j54n06J57L85p4m62J79L78j55l67P7M48j03m01Q4L62Mm86
3654b99J69L46o9m66Q1M07N4n33Q7M34j4m67n4M84J11m60j33M84P8n01q1M90j2
3677A36l60j46M33J15l81j79M99J50n26q0M69J49n03j16N16L4m48o5M02J08l75
3698a68j43M19J23m33r1M09N8l55j35L16K57l64k86N18R0l15j79K93K20l40j04
3719b10K91J51k41k43L15K68l77j89K50K79l11k70L41K68k57l77L26L19k64l56
3739b87L71K32k87l39L75L32l79l69L71L77l60l66L24M04m35l23L74L99m65l12
3759c63M27L31m54k60L77K66l93k35L41L39m46l66M99K44m29k33L59K86k75l12
3779b97L49K13k67k88L83J30l04k02L08K15k98k02K72J66j97k08J27K61j82k50
$$ plain form
3799 -271 -69 156 33 -182 -157 178 107 -214 -133 205 89 -248 -124 130 100 -286 -189 169 125 -148 -169 198
3821 198 108 -254 -188 207 180 -294 -229 217 184 -248 -251 264 96 -265 -195 209 196 -252 -139 250 203 -175 -164 198
3845 198 248 -180 -205 223 207 -248 -106 272 180 -211 -160 225 136 -223 -83 274 244 -187 -157 216 179 -178 -80
3868 -80 168 204 -142 -110 269 112 -122 -116 158 151 -145 -226 152 225 -175 -161 243 223 -83 -156 177 230 -108 -143 200
3893 200 270 -101 -161 197 293 -134 -186 177 229 -133 -200 162 199 -182 -296 227 219 -142 -215 80 170 -140 -265 85
3917 85 181 -134 -158 85 183 -142 -261 119 166 -138 -245 76 174 -115 -208 54 187 -143 -181 68 127 -65 -235
3940 -235 68 133 -58 -188 11 195 -34 -253 -17 154 -14 -243 13 145 12 -207 -14 155 -72 -241
3960 -241 6 218 -3 -261 -11 278 -22 -173 -32 274 11 -228 -13 237 48 -184 35 200 57 -199
$$ packed form
3799b71K02K25j23k15K5L35p1l21Q1L38j16l37J24K54l0l86R7L58m4k73k1L67
3821A98r0l62O6L95k7m74O5M46l3m32lN15j68l61P0M04j3m48J13L89m7l78J1L62
3845A98N0m28k5M28j6m55J42L78r2l91N1L85q9l59J40L57l0m31L0L73l7l57R8
3868h0K48L6l46L2L79j57k34OK74pk96q1L78P3m00J4M04k0l06p3L33N3l38l5L43
3893B00P0l71o0L58R6m27n2L63N2l62o7L62L7l81j14N23ql61p3K95R0l10j25L50
3917H5R6l15k4K43R8l25j19L80M7l04j07L21R8k89r3K62J33l30l8K49N9j92j70
3940b35L03O5j91j30J99J84k29k19K36J71j68k29K56J32j33k19J93J69k27j69
3960b41K47K12k21k58K50K89l00j51J41L06k63k39K15K50j89k32K19J65j43k56
$$ plain form
3980 -199 30 178 97 -230 -54 213 44 -212 -23 271 5 -252 0 257 88 -220 22 307 74 -181
4000 -181 -21 266 89 -233 -43 229 23 -198 -25 229 75 -210 3 229 101 -233 28 252 54 -174
4020 -174 -66 233 44 -185 -57 213 65 -190 -107 201 132 -191 -43 104 61 -176 -75 174 33 -263 -96
4041 -96 173 92 -200 -139 97 41 -223 -115 87 121 -225 -204 118 63 -180 -180 122 78 -209 -212 109 48 -180 -103 84
4066 84 91 -188 -226 118 84 -158 -125 115 159 -166 -198 93 44 -188 -164 116 85 -206 -199 173 141 -134 -168 136 183
4091 183 -168 -103 52 154 -137 -104 93 193 -126 -155 57 78 -126 -181 69 119 -91 -149 80 130 -147 -141 85
4114 85 121 -83 -150 103 123 -70 -154 63 172 -98 -193 71 235 -107 -241 68 191 -31 -191 36 136 -81
4136 -81 -157 67 196 1 -137 104 166 -81 -160 45 238 -19 -152 116 184 -55 -153 7 173 -43 -163 5
$$ packed form
3980a99K29J48q1l27J76K67j69k56J89K94k66k57K52K57j69l08K42K85k33k55
4000a81J60K87j77l22J90K72k06k21J73K54j54k85K13K26j28l34K61K24j98k28
4020a74J08K99j89k29J28K70j48k55Q3L08o9l23J48J47m3k37J01K49j41k96J67
4041i6K69q1k92O1K36n6k64J08K02L4l46K1L22n5k43%L02m4k87lL21o1k28P7J87
4066H4Pk79l8L44l4k42L3K40M4l25l2K91m9k32K4K80l1k91PL72l2k75l4L04M7
4091A83l51O5J55J02k91L3J97J00l19k9K12K1k04n5K50N0k10n8K29N0k77OK26
4114H5L6k04o7K53K0j93q4K17J09k70r5K64J64l42j34L09J23k22j60K27J00k17
4136h1p6K24J29j95j38K41O2k47p9K05J93k57j33K68O8k39r8J60J66k16j20J68
$$ plain form
4158 5 151 -26 -216 14 194 -34 -187 7 202 -70 -194 54 158 -87 -159 -13 155 -52 -262 -13 120
4179 120 -39 -221 26 118 -83 -265 -54 152 -24 -237 -16 123 3 -213 -36 110 -39 -225 -34 139
4199 139 -33 -227 -88 154 -39 -172 -70 132 -22 -175 -10 104 -21 -140 -60 147 78 -149 -94 181 52
4220 52 -202 -140 127 87 -170 -35 170 11 -122 -106 91 51 -189 -74 174 83 -159 -73 198 33 -109 -95 179
4243 179 177 -127 -29 136 73 -170 2 130 112 -124 -36 125 58 -222 -111 186 115 -75 -61 187 109 -139 -58 175
4267 175 156 -124 -110 141 69 -94 -18 149 157 -56 -130 189 153 -95 -11 131 107 -59 -41 142 152 -116 -70 138
4291 138 103 -64 -152 101 160 -101 -84 103 67 -85 -103 88 103 -93 -53 137 145 -86 -155 80 100 -121 -143 66
4315 66 70 -128 -181 85 75 -145 -119 119 125 -152 -137 142 82 -126 -113 127 121 -120 -98 61 138 -57 -132 67 102 -124
$$ packed form
4158EJ46j77j90K30J80k28j53J94J95k72j24K48J04k45p2J46J68k07k10K49J33
4179A20j59j82K47R2k01j82K11K06j76k13K21J39j20k16J77J46j49j86J91J73
4199A39j72j94J39K42j93j33J02K02j54j53J65J14j25j19Q0K07o9k27N5K75j29
4220E2k54O2K67m0k57J35K05j59j33J6J97m0k40J15K48r1k42Q6K71j65j42J4K74
4243A79kl04R8J65o3k43J72J28j8k36Q8J61o7k80J11K97p1j90J4K48p8k48Q1K33
4267A75j9k80J4K51p2j63P6J67Qk13p4L19l6k48Q4J42k4j66J8J83J0k68M6K08
4291A38l5j67q8K53N9k61J7J87l6j52j8J91J5j96M0J90Qk31o9K35K0k21k2K09
4315F6Mj98n3K66j0k20K6K38Ok77J5K79o0k08J3K40ok41K2J59P7j95p5J99L5k26
$$ plain form
4341 -124 -94 11 121 -36 -100 36 144 -78 -94 21 92 -86 -116 13 135 21 -14 54 101 -1 -116 37 132
4364 132 -13 -118 82 139 56 -85 68 199 -30 -110 0 143 0 -170 15 129 3 -129 27 181 64
4385 64 -110 -25 165 25 -56 108 188 -18 -147 27 173 3 -76 -34 139 66 -89 52 216 16 -149 55
4407 55 151 5 -47 25 153 20 -83 -58 132 94 -108 3 112 33 -130 -44 149 23 -65 10 93 8 -104 9
4431 9 156 22 -140 -14 163 -7 -97 -28 186 40 -157 32 126 34 -105 -45 144 22 -103 -90 131 -12 -51
4454 -51 -127 161 63 -174 -38 122 11 -122 -50 101 30 -195 -69 62 20 -105 -44 118 38 -91 -58 97 80
4477 80 -143 -11 152 53 -117 -24 159 94 -113 -11 34 99 -96 -86 117 81 -49 -95 112 100 -53 36 119 110 -50
4502 -50 -8 121 158 -4 -7 149 105 -63 -104 86 156 -82 -42 132 118 1 -94 108 218 -86 -27 117 96 -53
$$ packed form
4341a24L0J05J10j57o4J36J08k22j6J15P1j78l0J29J22j14l5O8M7j02j15J53R5
4364A32j45j05K00N7q3j41J53J31k29q0J10J43j43j70J85J14j26j32J56J54j17
4385F4j74Q5J90j40q1J64Q0k06j29J74J46j70p9M2J73p3j55J41J64k00j65K04
4407E5R6j46n2P2J28j33j03K5J90l8k02J11J09p9j63Q6J93j26q8P5Q3q5j12J13
4431IJ47j34j62J26J77j70r0O9K14j46j97J89R4r2j39O0J89j22j25J3K21j43l9
4454e1p6K88r8k37J36J60j11j33P2J51p1k25J26J31m2j25O1J62q0j29L3J55j7
4477H0k23J32J63r9j70R3J83o5k07J02M5O5j95J0K03l6j30m6K07j2j53Q9Q3rj60
4502e0M2J29L7j62lJ56m4j68m1J90P0k38M0J74j4j17r5K02J10l04N9J44k1j49
$$ plain form
4526 -53 -93 75 165 -54 -73 116 133 -30 -89 85 197 -39 -41 38 117 -18 -43 66 59 -33 -31 100 168 -71 -47 133
4552 133 37 -87 -104 91 40 -83 -101 82 95 -81 -106 33 73 -51 -56 33 141 -70 -138 10 84 -23 -72 -39 99
4577 99 -127 -147 19 103 -27 -120 -22 79 -79 -95 38 122 -49 -89 57 42 -31 -115 15 108 26 -172 20 129
4601 129 -37 -179 -2 127 -21 -116 -1 54 -1 -147 7 73 -73 -79 38 153 1 -132 -39 67 -31 -100 -86
4624 -86 200 56 -19 60 128 10 -112 86 179 36 -131 -5 144 32 -100 3 109 74 -136 14 121 50
4646 50 -87 -19 115 -12 -86 28 110 39 -96 -17 78 77 -115 12 81 16 -148 -9 68 52 -59 -55 94 -16 -76
4671 -76 -27 71 14 -116 -112 119 35 -166 12 98 -34 -87 -59 114 15 -127 -46 84 4 -143 -86 107 31 -136 11
4696 11 60 14 -71 -49 100 72 -116 -73 33 -54 -97 -90 55 15 -84 -67 45 35 -88 -125 106 16 -181 -69 57 65
$$ packed form
4526e3m0J68R0k19j9J89J7j63n9J74J12k36kP9P9j35k5J09pr2KJ31O8k39K4J80
4552A33r6j24j7J95n1j23j8J83J3j76k5J39M0j24nQ9J08k11o8J48P4j07m9L3J38
4577I9k26k0J66Q4j30r3R8J01j58j6J33Q4j71m0J46j5p3q4J30R3q2j98J92J09
4601A29j66j42J77J29j48r5J15N5n5j46J54O6j46oJ17J15j52j33R3J06r8o9J4
4624h6K86j44p5P9O8j18j22J98R3j43j67J26J49j12j32J03J06l5k10J50J07p1
4646E0j37O8J34j27p4J14Q2p1j35P9R5jj92J27O9o5j64J39P7j6j11MJ49j10o0
4671g6M9R8n7j30MK31q4k01J78Q6j32n3K8J73r9j42Q1J30q0j47N7J93p6j67J47
4696A1M9m6q5K2J49k8j88M3J06q7m3PJ45m0r9J7J12j0j23l7K31r0j97J12J26Q
$$ plain form
4722 65 -89 -107 22 59 -51 -4 70 24 -151 -85 44 58 -90 -39 -10 28 -50 -82 18 77 -134 -69 93 87 -68 -107
4748 -107 32 30 -56 -26 76 105 -104 -3 62 90 -54 -63 88 80 -54 -53 83 84 -51 -96 96 143 -42 -73 88 -10
4774 -10 2 -23 87 108 24 -104 29 49 -61 -2 -3 53 -31 -91 88 85 -35 -74 5 90 -33 -72 27 132 19 -49 24
4801 24 80 -81 -109 -6 42 24 -94 21 21 -65 -102 19 78 -70 -120 78 40 -31 -121 -48 46 -23 -57 15 102 -28 -96
4828 -96 -4 -1 -9 -77 -51 37 -53 -63 -4 10 -28 -52 -34 31 -18 -59 51 58 -6 -79 -49 35 -11 -117 -44 79 -10 -66 41 128
4858 128 63 -81 -6 64 32 -49 -4 83 -31 -11 -54 52 18 -97 50 51 66 -48 -34 133 15 -100 10 60 12
4883 12 -59 -48 195 78 -101 7 108 59 -41 -37 147 89 -84 -17 78 33 -26 -12 114 52 -87 14 102 21 -40
4908 -40 9 80 -4 -89 8 79 8 -81 -18 63 30 -53 -36 84 63 -27 -10 82 34 -10 -47 60 27 -50 2 100 66 -49 -17
$$ packed form
4722F5j54j8J29L7j10M7P4m6j75O6J29J4j48N1K9L8p8l2J00N9k11O5J62oj55l9
4748a07J39kq6L0J02K9k09J01O5K8j44rJ51qj34JJ36Jj35m5J92M7j85l1J61r8
4774a0J2k5J10K1q4j28J33K0j10N9jN6q4o0J79lj20l9P9Q5j23l9R9J05j13o8P3
4801B4N6j61k8J03M8j8j18J15%q6l7J21N9j48n0J98l8p1r0P3R4o9l4P2Q7j30o8
4828i6R2Lqo8K6Q8r0j0N9J4l8k4J8O5m9m1J10Po4p3L0Q4m6j06P3J23q9n6J07Q7
4858A28o5j44P5P0l2q1M5Q7j14K0m3J06l4j15J47JJ5j14J4J67j18j15J10N0m8
4883A2p1J1K43j17j79J08J01m9j00MJ84n8j73O7R5m5n9J4J26o2j39J01Q8q1o1
4908d0M9P1q4q5R7P1p1q9O3Q1l3q3J7J20k1r0J7R2m8m4l7J07l3p7N2R8l4j15L2
$$ plain form
4937 -17 109 36 -34 -68 94 23 -33 -53 45 31 -10 -67 -23 59 -92 -54 71 -8 -65 -11 -32 31 -24 -31 59 -42 -91 -60
4965 -60 26 7 -46 -67 56 -25 -69 -71 72 -24 14 -73 120 -10 -79 -87 72 5 -47 -46 9 58 -61 -51 52 8 -60 -85
4993 -85 22 56 -8 -40 38 3 -11 -31 7 72 -19 -55 38 82 -95 44 100 51 16 47 39 46 90 -48 77 50 -52 27
5021 27 100 103 1 -35 46 125 -9 -8 40 79 20 -16 94 79 -8 -51 43 37 25 -31 97 76 -19 3 18 96 25 9 62 40
5051 40 -16 -18 21 41 -61 -80 -6 135 11 -76 -2 91 12 -56 -15 50 38 -23 -53 54 29 -94 44 78 -38 -86 -24
5078 -24 35 -46 -58 -54 7 48 -119 -23 53 29 -45 -32 131 -4 -26 -13 42 -29 -95 62 -13 83 -34 10 11 -46 -55 105 65
5107 65 -38 -42 -24 64 26 -104 -26 9 -5 -83 -31 84 21 -66 -4 77 93 -17 -15 104 28 -62 35 47 37 -4 4 61 -9
5136 -9 -60 -49 61 -11 -44 15 57 61 8 -6 127 50 -85 68 35 -1 15 28 86 56 -5 3 85 78 -30 -77 66 99 -24
$$ packed form
4937a7J26p3p0l4J62p1n6k0R8j4m1n7M4Q2j51L8J25p9n7N4k1O3n5pR0j01m9L1
4965f0Q6j9n3k1J23q1m4kJ43r6L8q7J93j30o9qJ59o7n2JN5M9j19J0J03m4o8k5
4993h5J07L4o4l2P8l5j4k0L8O5r1l6R3M4j77J39N6m9l5L1qPM4j38J25k7j02P9
5021B7P3Lj02l6Q1P9j34JM8L9n9l6J10j5q7m3R4oj2n6J28k1r5K2J5P8p1j6N3k2
5051D0n6kL9K0j02j9P4J41j24q7P4R3p9o8M1O5j2o1l0J07k5j23J38L4j16m8O2
5078b4N9q1j2MO1M1j67R6P6k4p4J3J63j35k2J3N5p1o6J57p5R6j17M4Jn7rJ60m0
5107F5j03mJ8Q8l8j30P8L5j4p8N2J15o3q7O2Q1J6j10KJ19p6r0R7J2j0m1QN7p0
5136in1J1J10p2l3N9M2Mn3j4J33p7j35J53l3l6J6J3N8l0o1QQ2pj08m7J43L3j23
$$ plain form
5165 -24 -71 133 50 -13 -42 85 12 -49 39 84 26 -61 -48 108 72 -35 20 89 37 -73 -4 82 97 -32 -44 1 88
5192 88 -70 52 125 24 -26 -57 32 83 -47 -12 51 117 -64 -28 2 27 -43 -44 26 16 -47 -49 77 0 -42 -75 38 57
5220 57 -33 -94 80 108 -43 -79 122 25 -85 -27 -2 20 -73 -59 40 33 -42 -20 -16 58 -2 -48 19 52 -18 -105 27 38 12
5249 12 -32 39 43 -4 -16 74 95 26 -35 -51 20 17 13 59 68 -16 -13 7 4 -17 -18 32 44 2 -27 27 62 -8 -87 39 11 14 -35 -12
5283 -12 42 24 -23 -11 61 -16 -56 74 61 -6 -40 75 -1 35 38 -15 96 36 -66 -16 69 -24 -56 -38 69 -34 -54 -9
5311 -9 59 -4 -103 0 74 -28 -52 17 84 28 -30 6 41 14 -62 12 25 -13 -73 -29 3 20 -60 -6 55 -5 -66 -18 25 -1
5341 -1 -27 28 41 -72 -31 20 67 -61 -25 3 64 35 -77 -44 11 26 -132 -94 29 10 -44 -84 2 -15 -80 -57 -8 59
5369 59 -110 -4 33 5 -26 -43 84 48 -122 -6 51 12 -70 -17 68 58 -29 -35 36 26 -53 -58 -2 80 6 -29 79 28
$$ packed form
5165b4m7K04q3o3k9J27p3o1Q8M5n8q7J3J56l6j07N5O9n2j10O9Q6J5j29j2M5Q7
5192H8j58J22P3j01n0l1Q9N1j30L5O3O6j81L6L0K5p0jP0j0o3kJ26p7m2l3J13J9
5220E7r0o1J74K8j51l6K01r7j10N8K5K2r3J4R9pp5K2MP4o0m6O7L3p0q7J32J1k6
5249A2m4P1Mm7j2R0K1o9o1j6P1lmM6Rq4LK0lk1jN0J2m2k9N4L5p0p9J26k8Lm9K3
5283a2N4j8m7J2P2p7m0J30j3o7l4J15p6L6Ln3J11o0j02N0Q5r3l2J8J07j03k0M5
5311iO8o3r9J03P4j02k4O9O7n6n8L6L5k7p6P4J3l8o0M4L2J7q0N4O1o0o1M8M3k6
5341ak6N5J3j13M1N1M7j28L6K8O1k9j12L3N5J5j58L8J23j9n4m0Q6j7o5K3M9O7
5369E9j69J06L7k8l1j7J27l6j70J16N7l9q2N3Q5j0q7oP1j0p9nN6Q2p4l5J08n1
$$ plain form
5397 28 -69 -47 102 11 -40 28 12 40 -43 46 78 15 -14 -29 39 42 -49 -48 46 -18 -48 -24 23 -19 -57 -73 69 18 12 -32 99
5428 99 26 -34 -79 -57 59 6 -15 68 9 -23 -46 80 53 16 -21 -1 6 -27 -6 14 125 -59 -73 67 30 -63 -13 -36
5456 -36 21 -61 18 19 28 -90 -26 -39 17 20 -17 19 -44 -25 -79 58 58 -100 6 22 19 -58 -112 -32 -26 -12 26 6 31 -42 -29
5487 -29 -18 33 5 -54 65 19 6 -29 -32 69 30 -67 -1 74 50 -55 5 69 -45 -25 23 49 101 -12 25 115 -22 -22
5515 -22 -1 -5 -23 -58 23 -5 -3 5 73 84 -13 -11 51 84 37 -94 -20 99 -6 11 53 10 22 -47 19 45 -80 -65 14 91
5545 91 17 -42 -1 47 -19 23 77 10 2 -17 -3 23 -1 48 -44 84 18 -88 6 32 -22 -41 -21 85 -59 -60 -25 37 7
5574 7 -2 -22 -2 58 44 -9 83 -30 -14 -89 39 -83 -4 -25 40 24 -108 -3 14 -63 -32 -19 34 -12 -64 16 24 25 -80
5603 -80 -36 23 -58 -36 -8 -15 48 -77 17 17 10 -62 -52 0 32 -52 -12 77 74 -63 -6 6 18 -59 2 48 13 -52 -17 35 18
$$ packed form
5397B8r7K2J49r1n1O8j6K8q3Q9L2o3k9j5O8Lr1JR4o4l0K4M7m2l8j6J42n1om4J31
5428I9p3o0m5K2J16n3k1Q3n9l2k3J26k7l7l7K0Pl3K1K0J11j84j4J40l7r3N0k3
5456c6N7q2P9JRj18O4j3N6Ll7L6o3J9n4J37%j58J06J6lp7n4Q0OJ4L8k0K5p3J3
5487b9J1N1k8n9J19m6j3l5lJ01l9r7O6P5k4j05O0O4j14K0M8K6N2j13L7R0j37%
5515b2K1mj8l5Q1k8KQO8J1r7KO2L3m7j31P4J19j05J7M2m3J2o9O6K6j25J5P9P7
5545I1p4n9M1M8o6M2N4o7qj9J4K6k4M9r2J28o6j06R4K6n4j9K0J06j44jL5O2l0
5574Grk0K0O0j4n3R2j13J6p5J28j22P9k1O5j6j32J05J7p7L1J3N3m6n2Q0QJj05
5603h0M4N9q1K2K8pO3j25R4%pp2J0N2L2q4M0Q9lj37N7J2J2p7O1M6l5o5L5N2j7
$$ plain form
5634 18 -70 25 42 -59 10 16 65 20 -46 -31 43 43 -31 -81 19 45 -35 -8 66 18 -36 -41 27 62 -21 12 73 82 1 -27 58
5665 58 -12 -37 4 56 87 -73 20 58 78 3 16 70 -48 50 -47 49 68 -13 -30 48 55 48 -7 9 10 5 -10 17 39 22 34
5696 34 58 60 1 4 11 87 9 -42 -15 26 -27 -50 -33 -13 -27 -12 62 40 -26 -10 1 -2 -33 -19 57 104 -36 -83 15 84 -59
5727 -59 -46 47 15 -33 -64 60 18 -19 -42 16 51 -38 -91 54 40 -28 -48 10 71 -16 18 26 70 -51 2 -8 48 -4 -66
5756 -66 70 13 -37 -44 0 27 -10 33 14 88 -26 -34 13 56 5 -34 67 72 -1 -28 14 38 -3 26 37 81 -64 -15 -7 0 -19
5787 -19 -53 -12 -18 74 -7 8 32 48 11 33 110 25 -42 71 121 15 47 54 5 40 -35 59 77 -24 -19 6 103 47 -85 46
5817 46 107 17 -4 59 112 25 -33 34 97 2 40 18 92 -19 -41 -3 48 58 38 3 66 -18 -16 15 51 30 -49 11 -1 36
5847 36 -84 4 75 39 -58 91 -16 -15 -39 10 25 54 -30 -74 61 -26 -58 4 -22 -30 -32 -34 34 0 -22 -46 12 1 -21 16
$$ packed form
5634A8q8R5J7j01O9OM9m5o6J5P4%p4n0J00K6q0K7P4m8n4nO8L5q3L3O1Rq1k8Q5
5665E8p0k5M1N2L1j60R3L8K0p5J3N4j18R8r7R6J9q1j7P8Ppn5J6Jnj5K7K2j7J2
5696C4K4Kn9LPP6p8n1K7M1n3k3J7K0j4J5P4k2o6J6J1ll1J4P6M7j40m7R8O9j43
5727e9J3R3l2m8l1J24m2l7k3N8L5q9n3J45j4o8k0N8O1q7L4QM4j21N3j0N6n2o2
5756f6J36n7n0pM4K7l7M3j9P4j14qM7M3n1l9J01Np3k7M2K4m1K9J1M4j45M9QPj9
5787a9l4M1oR2q1J5K4J6l7K2P7q5o7J13N0j06L2Pm9L5p5R4J8j01NK5R7n6j32J31
5817D6O1r0k1O3N3q7n8O7O3r5L8k2P4j11k2L8N1J0k0l5O3q4KL1L6k1p9O0j2L7
5847C6j20Q8P1l6r7J49j07Jk4M9J5K9q4m4J35q7l2O2k6qkkO8l4k2k4N8j1k2L7
$$ plain form
5877 16 39 -73 -79 -41 3 -8 -52 19 32 -16 -31 -27 13 7 8 -16 47 25 9 28 87 59 -74 34 33 -57 -18 -24 -2 48 -64
5908 -64 -1 70 -8 -45 -28 39 50 7 -59 41 33 -54 10 40 119 -42 12 62 -53 2 2 40 -8 -101 -51 33 41 -9 -9 7 -42
5939 -42 -18 -43 -11 111 -43 -16 -3 44 -54 -57 65 84 17 -36 47 76 -47 10 15 87 -26 -43 34 37 -33 8 -7 58 -71
5968 -71 -90 88 -33 -32 -29 -59 27 -9 -77 -48 49 56 1 -9 28 -9 -1 43 -7 -30 -53 6 33 26 -23 22 41 14 -35 32 50 28
6000 28 -21 -8 48 -1 -37 19 -28 -41 -11 -17 -22 24 -33 16 57 -43 -51 -17 47 -10 -34 -34 -37 7 -18 34 26 -5 -55 28 69 -39
6032 -39 -88 38 50 62 -22 38 5 15 -17 4 15 19 -72 12 74 67 27 42 66 -3 -25 -14 -18 2 35 20 24 -13 -57 15 67 -13
6064 -13 -36 31 29 7 -34 -23 91 -8 -6 15 56 11 -12 -25 51 18 -47 -13 88 47 -32 10 89 -19 -3 -111 36 -10 -64
6093 -64 -6 58 53 -58 -18 42 37 -28 -23 -42 6 -52 -39 -15 68 -52 -4 58 -10 -33 -2 81 -6 -12 -56 23 -14 -52 -79 41 11
$$ packed form
5877A6K3j12oL8M4j1m4P1J3m8j5MM0oJk4O3k2j6J9N9k8j33J08jr0L9oK2N0j12
5908f4O3P1p8l7J7O7J1m3o6J00qq7O4L0P9j61N4N0j15N5%L8m8r3N0Q4Qn0%J6m9
5939d2K4k5L2J22j54K7J3M7r8lJ22J9o7n3Q3K9j23N7NP2j13j7P7Lp0M1j5O5j29
5968g1j9J78j21JLl0Q6l6o8K9R7Pn5j0L7l7QM4n0k3k3N9K7pm9M5J9k7m9O7J8k2
6000B8m9J3N6m9l6N6m7j3L0onM6n7M9M1j00qL4O4n7k4%lM4k5N2ql1n0Q3M1j08
6032c9m9J26J2J2q4O0l3J0l2K1J1Mr1Q4O2pm0J5K4o9k2J1mK0L3j5Ml7m4P2N2q0
6064a3k3O7kk2m1J1J14r9KK1M1m5k3j3P6l3o5L4J01m1p9M2P9j08J6j08J47m6n4
6093f4N8O4nj11M0O0no5Nj9M8n8J3K4Q3j20M8O2o8k3L1Q3q7om4P9l7l8k7J20l0
$$ plain form
6124 11 -74 -4 28 32 -1 -19 36 13 4 -56 95 -34 -8 -12 -8 65 -49 5 17 -1 -17 -20 25 -11 -24 -81 65 6 -15 39 -2
6155 -2 -3 -31 13 24 71 -16 7 6 36 -28 -20 46 -8 -44 3 41 19 -59 2 63 27 -19 46 44 -3 -13 -19 82 46 -47 -22 26 66
6188 66 -20 -18 56 79 -12 -25 40 40 -23 -46 -16 58 -9 -64 61 72 -78 -52 10 -2 -36 6 14 1 -52 -59 -9 -4 7 -58 1 68
6220 68 1 -40 -51 44 -71 -49 21 -1 86 -78 24 50 51 -47 21 53 12 -88 29 37 -70 -67 -36 60 17 -82 3 7 42
6249 42 -69 28 43 5 -34 11 114 20 -47 -7 -23 -43 -23 9 69 29 -89 -28 23 -48 17 -31 -3 -14 -49 12 33 30 -18
6278 -18 -14 -14 26 0 -32 32 -59 -95 -39 21 43 -33 11 30 -2 -28 1 60 -19 -31 1 78 21 -50 12 48 -3 -77 37 84 8
6309 8 -63 0 84 32 -25 47 41 -19 -32 46 86 74 -57 4 17 -10 -43 -17 53 3 -63 62 59 6 -54 -11 40 56 -17 -13 -19 -9
6341 -9 -44 -62 65 5 -64 -23 52 -47 -47 -53 -24 86 -95 -71 -33 35 -36 -62 69 11 -66 34 32 -25 -62 -34 56 -3 -41 -33
$$ packed form
6124A1q5P0L2Ml3j8N5k3ro0J51j29K6mMP3j14N4J2j8j6lM5l6j3n7J46n9k1N4m1
6155bjk8M4J1M7q7K3jL0o4QO6n4l6M7L8k2p8O1O1l6m6O5km7j0oJ01l6r3K5M8M0
6188F6q6KP4K3r1j3O5%o3k3L0P4o7n5J25J1j50K6O2j2l4M2Qj3n3pN0NJ1o5N9O7
6220F8o7m1j1R5j15K2P0k2Q7j64J02K6Jr8O8L2m1j00J17Qj07LL1R6m3r9Q5ML5
6249D2j11R7J5l8l9M5J03r4o7M0j6k0K0L2O0m0j18O1N1p1O5m8K8j1l5O1K1lm8
6278a8M%M0k6l2O4r1l6N6O0K2p6M4J9l2k6K9N9p9j2L2P7n7p1O2L6n1p4J14M7p6
6309Hp1O3Q4n2n7P2oo0j3P8M0j2j31O1J3k7l3K6P0n0o6J25ln3o0M3N1J6p3MoJ0
6341il5j8J27o0o9M1P5r9%oK9J10j81K4L8O8p1k6J31n8p7J00kn7l7K8R0n9l8Q
$$ plain form
6371 -33 37 -17 -55 42 32 -8 37 11 21 -5 -81 -36 -6 2 -50 -47 57 -12 -9 -65 31 -26 -14 -14 23 4 -38 -33 6 70 -90 -5
6403 -5 -9 37 -15 -58 36 -10 -53 9 18 17 -49 -23 3 31 34 -18 25 56 -22 -51 32 40 -7 -35 -10 66 -45 -66 -15 22 -4 -52 8
6436 8 68 -21 -22 2 41 -42 -51 50 13 -27 6 -9 30 49 -86 -32 89 -1 -65 8 70 -28 -47 58 16 5 -45 19 126
6465 126 67 -48 -42 6 -56 -78 -55 -11 18 -61 -18 16 56 -6 7 -19 -5 -69 -105 -8 1 -50 -9 14 -55 -6 23 -2 10 -41
6495 -41 55 62 -9 8 -24 89 -5 -45 -11 25 4 -80 -84 14 91 -33 -40 27 -51 -29 17 -28 42 -59 -1 -18 36 -10 -28 32
6525 32 -8 18 -41 50 14 -6 -79 25 -40 -74 -14 64 51 -63 13 37 7 5 39 56 3 -1 -6 28 13 9 -2 11 19 -42 -20 22
6557 22 17 -11 36 33 66 -56 10 52 62 -28 18 31 36 -31 -82 14 76 -23 -15 9 -4 -89 -4 25 5 -20 18 40 44 -37 -22 25
6589 25 2 46 -18 67 28 -27 16 79 -15 -36 -13 2 7 5 -30 -63 58 -14 -23 31 62 -42 -43 64 25 4 -35 -27 54 -62 -82
$$ packed form
6371c3P0n4l8R7j0m0M5k6J0k6p6M5L0Qn2LJ04o9Ln6R6n7J2%L7j9m2NL9O4j60Q5
6403emM6n2m3R4m6m3O2Rjo6K6K6K8Ln2M3L1p8k9Q3Qm7k8K5P6j11k1N1L7k6m8O0
6436HO0q9jK4L9q3rJ01l7m0L3j5L9J9j35N4J21r0o4P3O2r8j9J05m2j1n0O4J07
6465A26n9j15OM8o2k2K3M4K9p9M3L4M0o2J3k6J4o4l6R7Rn1M1K3o9M9K9k5J2n1
6495d1R6Pp1J7l2J13r4m0L4L6k1q4mR8P7j24pO7p8K2M6m5P0j01N8j7N4m6j8O0
6525C2m0K6n9R1l6k0p3J04o5l4O0P8j3j14P6K4l0kL4J7n3mnL4j5mj1J3Qo1K2M2
6557B2nk8M7lL3j22O6M2J0r0M6J3No7n1R6O2r9QK4j3q5Q5K9k0k5L8K2Mq1J5M7
6589B5k3M4o4Q5l9n5M3O3r4k1K3J5Nkl5l3J21p2rN4L1j04jJ07l9k1l9QQ1j16k0
$$ plain form
6620 -82 34 -3 -18 -66 -4 13 -11 26 -27 -10 -48 -61 18 30 25 -41 2 -7 -10 -57 43 42 -6 -101 3 5 27 -40 43 47 -4 -62
6652 -62 -5 90 9 -44 41 -10 22 -32 39 8 -11 -8 76 83 25 10 0 77 25 -56 69 72 -12 -52 16 33 -2 -30 11 66 27
6683 27 -26 51 50 -6 -3 -23 68 9 -44 -31 112 -33 9 55 86 34 -40 -37 -11 -54 -64 70 39 12 -6 5 35 12 -59 -20
6713 -20 80 5 -33 -49 22 26 -95 3 27 36 -35 -53 69 48 6 -2 133 -34 -8 -18 31 -29 -52 -63 30 46 -69 -35 49
6742 49 65 -20 -8 79 -38 -93 25 61 -10 -54 38 11 17 -70 -16 15 -3 -50 11 44 -13 -45 1 3 -58 -20 -1 74 -23 -18 -34
6773 -34 24 27 -47 -83 6 95 -20 -38 31 14 -14 -39 21 38 -3 -26 51 49 -35 22 88 -9 2 10 40 99 -8 -36 55 -4 11
6804 11 24 18 25 6 2 64 51 -18 -38 80 61 -14 20 -31 75 15 22 107 -1 -76 -49 11 31 -37 -64 51 7 -113 -6
6833 -6 -26 30 -58 -12 12 -4 -24 -11 80 19 -72 -6 18 20 -39 -51 -31 60 -21 -42 2 17 -24 -55 27 13 -7 8 13 6 -49 6
$$ packed form
6620h2J16l7j5m8O2J7k4L7n3J7l8j3P9J2no6M3rlm7J00jm8r5J04KK2o7Q3Mn1n8
6652f2N7R5q1n3Q5n1L2n4P1l1j9LQ4Pn8j5j0P7n2q1J25Lq4m0O8J7l5k8M1N5l9
6683B7n3P7jn6Lk0R1n9n3J3J43j45M2M6L1n2p4LK6m3j0J34l1k7j8J1L0k3p1L9
6713b0J00p5l8j6P1Mj21R8K4Rp1j8J22k1m2qJ35j67K6j0M9o0k3j1R3J6j15L4Q4
6742D9J6q5J2Q7j17n5J18L6p1m4R2k7Oq7N4L1j8m7O1L3n7l2M6Ko1L8J9P5r7Nj6
6773c4N8Lp4l6Q9Q9j15j8O9j7k8k5O0J7m1k3P7kq4N7O6r7J1QL0N9j07k8R1n9J5
6804A1J3oPj9mO2j3o9k0J18j9p5L4n1J06o0PQ5j08p5K7O0K0o8k7J15m4j20J07
6833fk0N6q8M6K4j6k0J3R1o1r1O6K4Kn9j2K0R1q1k1M4J5m1l1Q2j4k0J5Npn5N5
$$ plain form
6865 6 26 56 -34 8 -66 75 -3 -28 -7 67 -7 -52 78 -18 -59 -58 20 13 27 -71 -23 12 28 -9 -65 19 -39 -126 -3 23
6895 23 9 -36 70 59 -40 -14 -10 -11 -38 -39 -18 73 38 -10 0 26 -39 44 -53 27 34 -53 -31 -27 9 -51 28 48 -2 33 21 14 -34
6928 -34 -7 -10 34 36 -3 54 -30 30 -33 -42 59 16 8 20 83 49 6 -57 45 -18 -61 20 21 27 -11 -17 25 -18 -30 14 43 -50 -61
6961 -61 68 61 -17 -39 -50 98 -2 -78 -3 -6 -12 -90 -28 97 -58 -32 -32 57 40 -77 -8 5 16 -15 8 34 47 -9 47
6990 47 33 27 -59 75 47 21 -62 -24 33 12 -10 32 -21 86 -46 -13 65 55 2 -14 41 -23 -96 -141 33 7 -5 -47 54
7019 54 -29 -52 -88 50 -24 -12 -40 24 15 -53 -9 30 6 -15 -45 61 55 -39 -63 33 35 -50 24 2 7 6 -39 -9 33 -45 -52 0
7051 0 -8 -9 19 43 -9 15 -21 -20 24 -5 3 -4 26 27 -44 87 0 -24 -58 22 69 25 10 -40 69 17 3 27 123 42 -67 19
7083 19 24 47 12 47 96 77 -19 44 38 36 -107 -7 59 12 48 36 80 -27 -3 22 -26 25 50 20 35 1 -22 46 17 -117
$$ packed form
6865FK0L0r0M2p4J41p8k5K1P4p4m5J30r6m1JP8pJ4r8M8L5J6l7n6Q4n8q7J23K6
6895B3j4m5J06j1r9K6Mjk7jK1R1l5m8J0K6o5Q3r7Q0Pq7K2ML6o0P9K0n0L5j2pm8
6928c4K7lM4Kl9N7q4O0o3rJ01m3qJ2O3l4m3o3J02o3m3Q1JOl8oM2m3j2M4K9r3j1
6961f1J29pp8k2j1J48j00p6P5lop8O2J25j55K6%Q9j7j17O9J3J1l1K3K6J3n6N6
6990D7j4oq6J34k8k6q3L8N7k1k2M2n3J07j32L3P8j0n3j6N5o4p3m5J74k6j2m2J01
7019E4q3k3l6J38p4J2k8O4ro8M4L9k4k1l0J06or4k4R6Kq5P4k2Njm5L0M2p8pN2
7051@qjK8K4n2K4l6JM4k9QpL0Jp1J31q7k4l4Q0M7m4j5n0J09n2j4K4R6q1j09Q6
7083A9NK3l5L5M9j9r6O3okj43J00O6m7L6j2M4j07K4K5m8N1K5l0J5l4k3O8k9j34
$$ plain form
7113 -117 -31 43 44 -26 -59 -6 69 -26 -51 34 0 -25 -31 -5 13 7 -12 11 -42 -20 -49 46 20 -8 -62 36 -14 51 -60 -37 32
7144 32 6 -58 -15 19 30 -42 5 14 -44 -28 -34 24 57 -77 42 63 51 -10 1 9 68 -82 -29 20 74 -37 3 37 -13 -19
7174 -19 7 77 30 -20 -30 14 34 -10 34 53 12 -46 39 47 21 32 40 65 -7 -15 -1 73 31 -29 -55 39 91 -77 41 1 -16
7205 -16 11 8 64 79 -8 -38 36 49 -28 -30 109 49 3 29 67 28 -36 -54 78 16 43 2 58 29 7 4 14 50 45 18 9 37
7237 37 34 -60 65 3 -25 43 65 -45 -46 -78 -3 -33 -42 -6 -5 55 -44 -12 43 70 -61 -41 17 -29 28 -27 -5 -13 -22 -8 1 41
7269 41 -25 -67 48 43 -26 -49 6 40 -19 -9 35 74 14 64 57 88 -59 41 1 67 10 -65 25 89 20 8 75 13 42 -37
7299 -37 68 62 -41 -4 16 76 16 -14 37 60 -2 -29 -41 -3 -14 -56 31 17 2 11 8 19 -37 -60 14 112 -31 -38 -21 45 -40
7330 -40 -13 5 64 30 -39 -17 59 43 -45 -57 109 -21 -13 36 91 24 -3 40 29 54 57 -8 16 -6 -72 10 16 34 -14 32 65
$$ packed form
7113a17Q6P4Jp0l3N3P5r5k5Q5l4k5oK6J8oj9K3n3K2k9R5k6k8n4R8n0O5j11K3O9
7144C2k6o4M3L4J1p2M7Rn8J6oN8L3j34J19K1j2o1J1QN9j50N3M9N4j11M0L4n0o
7174a9K6P0m7n0j0M4K0m4M4J9m1n8Q5Qk6J1QK5p2qJ4P4m2o0k6R4N2j68J18m0j7
7205a6K7lN6J5q7l0P4J3p7kJ39o0m6K6L8l9o4j8J32o2K7m1N6k9k2lJ0L6nk7rK8
7237C7lr4J25o2k8O8K2j10jl2P5l0rL6JO0r9L2N5K7j31K0N8m6N7n5K2qrJ4RM0
7269D1o6m2J15no9k3N5L4n9J0M4L9o0N0pL1j47J00m0O6n7p5R0O4o9j2O7o2K9p9
7299c7J05oj03L7K0O0o0l0N1K3o2k7j2L8j1m2Q7j4j5RlJ1n6k3P4R8j43pJ7O6q5
7330d0K7J8N9l4o9K2P6j6q8j2J66j30QM9N5o7k7M3j1K5Lo5K4k2o6Q2OJ8m8M6L3
$$ plain form
7361 65 86 -54 21 70 4 -44 16 60 -68 22 -12 30 -27 -87 -45 18 45 -12 12 -8 -19 -38 -3 -11 -10 -9 -11 29 -19 -95 28
7392 28 77 -68 -12 27 31 -16 -1 6 -24 3 -76 -10 27 -40 0 14 22 31 -40 23 87 5 -10 67 -14 42 -51 -2 73 61 -55
7423 -55 -35 32 130 -16 -21 -7 52 5 -44 91 52 -75 2 -4 -29 -12 -46 -2 40 48 29 -20 48 -1 -33 47 74 -45 5 51
7453 51 31 48 4 50 -20 -5 -12 40 31 -25 -33 25 -25 -8 -23 70 29 -32 -79 59 37 -16 -36 76 26 6 23 11 68 -24 -65
7484 -65 -2 18 -100 -41 -8 55 -11 -40 58 -40 -106 37 26 -6 -61 -47 -10 -2 -59 32 -33 -13 -58 -29 24 -1 -82 -38 -54 -39
7514 -39 -44 -57 35 34 -3 -39 31 51 -5 -61 47 40 26 -21 -1 9 -33 -10 26 6 -20 -84 52 16 -5 -12 15 40 -5 24 -24
7545 -24 25 11 -30 -84 22 -9 -18 4 36 67 14 59 39 -34 23 14 23 42 -43 15 66 21 0 -59 -10 -95 -17 9 -23 -72 -45
7576 -45 -5 71 -44 15 6 -2 45 26 34 86 11 -36 68 31 74 30 34 19 -36 -24 -27 17 -3 -60 -23 -6 -1 -14 -4 5 -1 10 32
$$ packed form
7361F5K1j40P5M9o6m8O0M4j28R0l4M2n7o0M2O3K7n7K4k0j1j9L5qJJkM0m8p6J23
7392B8M9j45N6L9Mm7J5Pl0K7p9O6L7o7M0J4QRp1O3O4q2j5P7q1N6r3M9P5j2j16
7423e5K0O7R8j46nJ4N9m7m9J35l9j27P7ok5J7l4M4M2Qj9m9O8m9l2Q0K7j19N0M6
7453E1k0J7m4M6p0J5pN2rn6qN8n0J7j5R3m1o1m7J38k2n3k0J12n0k0J7j2N7r2m1
7484f5O3K0j18N9L3O3o6k9R8r8o6J43j1l2n5J4L7Qn7R1o5K0m5K9N3k5q1M4j6J5
7514c9nj3R2jl7l6P0K0n6n6J08pj4m7K0J0m2K3L6k0k6o4J36l6k1pK7K5m5K9m8
7545b4M9j4m1n4J06l1rK2L2L1n3M5k0p3N7rRJ9q5N8N1m5k1n9M9q5P8K6l2m9K7
7576d5M0P6j15N9rqM7j9QN2p5m7J04l7M3m4Mj5n5J2lM4k0n7L7J7Nj3J0RoJ1K2
$$ plain form
7609 32 22 -2 -40 56 19 -77 -15 -17 44 38 -23 35 38 70 -18 14 31 3 -70 10 -18 -7 -25 -1 -29 -56 -40 20 49 -4 7 -46
7641 -46 29 11 -3 9 33 48 -7 -17 42 -30 -59 -93 70 -36 1 -17 11 43 0 7 -11 41 -4 -69 22 34 24 -15 50 32
7671 32 -68 -11 70 8 -45 -34 -8 32 -34 -13 58 17 -12 -33 105 32 -23 -41 40 16 -82 -4 81 -22 16 24 -33 10 26
7700 26 -3 89 -43 -44 61 -14 58 2 -39 13 68 10 20 12 100 59 -41 64 39 -6 1 23 35 14 4 109 88 -33 -43
7729 -43 -7 61 -46 14 -8 3 22 -50 88 44 16 10 74 -3 -7 -30 24 60 -62 25 -18 38 -27 -43 64 -7 -57 -22 -74
7758 -74 26 42 -10 -66 -5 21 -9 -70 -1 107 -93 -42 40 -30 -92 -26 72 29 -14 38 62 -8 -24 -14 5 9 -11 -6 60 19
7788 19 -35 -23 -3 -28 -3 60 31 -5 37 60 47 -45 -69 30 5 42 16 -40 48 -9 -14 -11 67 33 31 -32 43 -47 12 7 37 4
7820 4 38 -11 75 26 45 -34 53 32 -10 -4 -14 14 23 4 36 45 -9 33 20 94 -73 54 58 76 37 -30 61 18 -30 -7 52 -24
$$ packed form
7609C2j0k4l8R6l7r6O2kO1oo1N8LL2q8L2J7k8p3Q0k8J1j8K4k8k7J6O0K9n3J1n3
7641d6P5j8j4J2K4J5n5j0N9p2k9l4J63j06L7j8K8L2m3Pj8N2m5o5R1J2j0l9O5j8
7671C2j00N7Q1o2n3J1K6M0o6K1P1m1k9k1J38p3n5j8Q1k4r8P8Q5j03L8Qn7M3J6
7700B6k9R2j32jJ05p5P2n6m1N2N5n8J0qQ8m1j00J05k5m5PK2J2k1j0J05k1j21j0
7729d3L6O8j07O0k2J1J9p2J38m4k8oO4p7mk3N4L6j22Q7m3N6o5j6J07p1n0L5n2
7758g4J00J6n2n6O1K6l0o1O9J08k00N1Q2p0o2O6R8m3m3N2K4p0j6J0J9Mk0NO6m1
7788A9n4J2K0k5K5O3k9l6M2K3j3r2k4R9k5L7k6n6Q8n7nLP8l4ko3P5r0N9nL0l3
7820DL4m9Q6m9J9p9Q7k1m2Oj0K8Rj9L2Rn4M2j3P4j67J27MJ8l9o7R1m3m8K3N9p6
$$ plain form
7852 -24 -11 -4 57 -6 26 -22 34 52 -61 62 -10 14 -48 -8 35 -4 -19 -33 101 43 -41 14 10 -11 -22 -65 51 53 -29 -45
7882 -45 36 45 45 -21 51 -1 -17 49 -14 113 -21 -83 73 49 -49 4 44 9 -46 -65 10 36 -16 -36 8 22 -60 -11 6 78
7912 78 4 1 8 1 -19 -53 -24 -54 -90 -16 -12 45 -40 -16 -25 29 -8 -8 31 36 17 5 -4 8 -6 6 -1 15 -86 0 43 90 -9 -26
7946 -26 32 105 -84 16 77 61 24 -8 34 23 8 -66 46 -40 -11 -25 3 45 1 23 17 42 7 -19 -53 -36 -21 -39 -6
7975 -6 35 30 -61 32 31 -3 1 71 -44 2 2 -48 53 -6 -4 19 50 14 -10 60 -3 60 -5 -27 -10 -3 -48 -52 26 9 -37 27 3
8008 3 -52 14 -38 7 -5 -38 16 42 4 -21 -8 67 24 -36 -36 26 -8 3 -32 59 6 -63 42 49 29 -81 -51 101 28 -83
8038 -83 -45 57 -6 -41 -3 -26 10 -37 4 -5 32 -24 -8 51 -14 -9 -80 49 59 5 34 42 2 29 -27 -8 -17 -54 17 21 -27 -65
8070 -65 32 68 45 43 -88 20 -20 1 -6 27 28 31 26 44 54 -23 45 116 61 5 51 30 59 7 -12 100 87 -45 -10 23 -26
$$ packed form
7852b4J3PO1o3L2m8N6J8j13J23p2K4o2M0M3l9j5j4J34n8q4N5mk1j1m3J16Kq2j6
7882d5Q1R%o6P2n2j6O6o3J27j34o2J56k4r8N3M0l5n5j9P5K6n2k0M4J4q2M9J7P2
7912G8p4lPpk0l4K9l0l6P4MN7q5K4rN4l7%L9Nj9j2rJ2j4J2pJ6j01Q6M3M7r9j7
7946b6N8P3j89J00O1j6l7l2M2j1j5p4J12q6K9j4K8M2m4K2oK5l5k6l4J7J5j8L3
7975fM1nr1R3jl4MP0j15M6%n0J01n9KK3L1l6k4P0o3O3o5k2J7Pm5mP8j7m6O4k4
8008Cn5O6n2M5j2l3N4K6l8k5J3P5m3o0%O2l4J1l5R1n3o9J05Pk0j10L0J52p3j11
8038h3L8J02o3l5L8k3L6m7M1rL7n6J6N9o5Np1J29J0n4K9Qm0K7n6J9rl7P1Mm8l8
8070f5R7L6k3kj31J08m0K1pL3JLnJ8J0p7O8P1n5n6M6k1K9n2j9J12j3j32L5L3m9
$$ plain form
8101 -26 -28 -16 48 63 29 -4 52 -23 20 -30 11 16 44 28 33 -26 -23 -14 54 33 35 -65 -23 0 -28 25 -7 -39 37 -36 -7 5 -29
8134 -29 16 -33 85 19 14 41 50 -21 -38 16 -5 -24 -80 50 -6 -69 -26 36 28 26 -106 36 -40 -11 3 11 5 56 -57 27 76
8165 76 -45 -26 -44 -7 -9 -42 37 28 -53 24 -65 -27 -16 -21 -28 -21 -20 -21 -49 16 29 -26 -28 -12 -32 4
$$ packed form
8101b6kJ2O4J5l4l3N6p5M3n0M1NK8j6Nn9LRO8k1Kj00M2K3k8N3l2l2P6p3K9J2l4
8134b9M5m9J18o6nK7Rp1j7N4k1j9n6J30n6o3M3O2qkj32J42p6K9J4QoN1j13Q4M9
8165G6j21J9j8L7kl3P9rq1P7q9L8J1npPJjk8O5J3n5kJ6k0L6
8191D
$$ Imaginary data points
##PAGE= N=2
##DATA TABLE= (X++(I..I)), XYDATA
$$ plain form
0 0 0 0 0 0 0 0 0 0 0 0 0 0 0 0 0 0 0 0 0 0 0 0 0 0 3 -4 4 -6 6 -6 6 -6 6 -7 10 -11 12 -12 14 -16 18 -18 20 -24 25 -28
46 -28 31 -36 42 -46 54 -64 78 -94 121 -162 229 -358 652 -1588 9240 57648 10521 -43729 -689
65 -689 42047 -8256 -54260 -8105 34035 -8965 -45498 -4607 25059 -17194 -43611 -1832 22215
78 22215 -16956 -37094 245 15811 -22583 -38292 -1263 16302 -13401 -25507 5464 20165
90 20165 -6151 -21263 -50 14745 -851 -12635 2220 17133 9428 -2432 3660 16636 15407
103 15407 5306 6349 17750 18582 5895 2526 14860 19325 7703 6431 23307 26929 7561
116 7561 1139 18816 21555 -1537 -5772 19928 25580 -1610 -8487 18290 22800 -7608 -14119 15488
130 15488 20463 -11083 -17979 9859 12413 -17706 -20091 10002 12207 -16504 -16955 9950 6182 -24184
$$ packed form
0@%%%%%%%%%%%%%%%%%%%%%%%%LpQj0J2j2J2j2J2j3J7k1K3k4K6l0L4l6L8m4M9n3
46b8N9o7P8q8J00j18J42j72K15k83L91n87J010k240J0828M8408m7127n4250M3040
65f89M2736n0303m6004M6155M2140m3000l6533M0891K9666m2253k6417M1779K4047
78B2215l9171k0138L7339J5566l8394j5709L7029J7565k9703j2106L0971J4701
90B0165k6316j5112K1213J4795j5596j1784J4855J4913p705j1860O092J2976j229
103A5407j0101J043J1401Q32j2687l369J2334M465j1622j272J6876L622j9368
116G561o422J7677K739k3092m235K5700N652k7190o877K6777M510l0408o511K9607
130A5488M975l1546o896K7838K554l0119k385L0093K205k8711m51K6905l768l0366
$$ plain form
144 -24184 -22197 6426 3791 -23357 -18422 10312 6339 -22079 -18985 8551 6437 -19453 -17073
157 -17073 8774 7815 -17215 -17246 7420 10017 -10653 -10909 11848 14233 -7968 -12242 8283 12433
171 12433 -7285 -10234 12646 18920 -2702 -9463 12278 19181 -3941 -11778 12591 22018 -3265
184 -3265 -14209 10488 21338 -4621 -15712 11698 24128 -3499 -17019 9026 19875 -8897
196 -8897 -20821 7696 19272 -8789 -19022 9199 17523 -12234 -20927 7973 14827 -14329 -20460
209 -20460 8334 12967 -16231 -20532 8194 12439 -14608 -17415 8781 10760 -15123 -17803 6083
222 6083 8405 -13042 -13592 7579 8876 -10237 -11443 5858 6619 -9040 -9508 5339 6455 -6655
236 -6655 -7888 4097 6060 -4491 -6516 3648 6859 -2251 -6797 948 6063 -1382 -7598 -510
$$ packed form
144b4184J987K8623k635k7148M935K8734l973k8418L094K7536k114k5890K380
157a7073K5847r59k5030l1K4666K597k0670k56K2757K385k2201m274K0525M150
171A2433j9718k949K2880O274k1622o761K1741O903k3122p837K4369R427k5283
184c265j0944K4697J0850k5959j1091K7410J2430k7627j3520K6045J0849k8772
196h897j1924K8517J1576k8061j0233K8221Q324k9757q693K8900O854k9156o131
209b0460K8794M633k9198m301K8726M245k7047k807K6196J979k5883k680K3886
222F083K322k1447n50K1171J297j9113j206J7301P61j5659m68J4847J116j3110
236f655j233J1985J963j0551k025J0164L211r110m546P745N115p445o216P088
$$ plain form
250 -510 7534 1389 -7842 -2197 7886 2040 -9957 -4548 8482 3138 -11189 -5725 9613 3741
264 3741 -12699 -6564 10692 3969 -14170 -6837 11680 3445 -15920 -6945 12991 3267 -16641
277 -16641 -5890 14502 2837 -17689 -5578 15139 2162 -18300 -4542 16021 2036 -18266
289 -18266 -3805 16274 1476 -18294 -3266 16185 1230 -17833 -2706 16011 1136 -17347
301 -17347 -2720 15242 970 -16740 -2780 14574 1096 -15907 -3008 13708 1199 -15164
313 -15164 -3237 13022 1600 -14674 -3978 12143 2024 -14011 -4145 12205 3222 -13087
325 -13087 -4749 11606 3736 -12949 -5659 11474 5197 -11788 -5668 11793 6424 -11212 -6291
338 -6291 11737 7393 -10508 -6524 11702 8161 -10148 -6842 11855 9469 -8687 -6257 12022
$$ packed form
250e10Q044o145r231N645J0083n846j1997N409J3030n344j4327N464J5338n872
264C741j6440O135J7256o723j8139P333J8517q235j9365Q975J9936r724j9908
277a6641J0751K0392j1665k0526J2111K0717j2977k0462J3758K0563j3985k0302
289a8266J4461K0079j4798j9770J5028J9451j4955j9063J5127J8717j4875j8483
301a7347J4627J7962j4272j7710J3960J7354j3478j7003J2899J6716j2509j6363
313a5164J1927J6259j1422j6274J0696J6121j0119j6035R866J6350q983j6309
325a3087Q338J6355p870j6685P290J7133o277j6985O120J7461n369j7636M921
338f291J8028m344j7901L984J8226l541j8309L306J8697k386j8156K430J8279
$$ plain form
351 12022 9711 -8890 -7268 10977 9566 -8327 -6697 11584 10464 -7636 -6886 10728 10092 -7803
365 -7803 -7572 9990 9979 -7569 -8132 9058 9996 -6841 -8010 8674 10286 -6387 -9020 6685 8966
380 8966 -6664 -9515 6299 9767 -5262 -9040 5789 9522 -5506 -9878 4706 9379 -5116
393 -5116 -10127 4180 9497 -4647 -9931 4453 10348 -3805 -9781 4095 9800 -4555 -10859 3391
407 3391 10262 -3479 -9804 4439 11189 -3067 -10354 3502 10609 -3183 -10463 3178 10854 -2558
421 -2558 -10052 3314 11199 -1733 -9496 3290 11001 -1910 -10154 2300 10423 -1765 -9652 2946
435 2946 11615 -443 -9153 2596 11275 -636 -9859 1783 11272 -106 -9507 1826 11897
448 11897 954 -9164 1884 12246 1257 -9627 819 11720 1212 -9994 568 12443
$$ packed form
351A2022k311j8601J622J8245j411j7893J630J8281j120j8100P50J7614o36j7895
365g803K31J7562j1j7548n63J7190R38j6837j169J6684J612j6673k633J5705K281
380H966j5630k851J5814L468j5029l778J4829L733j5028m372J4584M673j4495
393e116n011J4307N317j4144n284J4384N895j4153n976J3876N705j4355o304J4250
407C391O871j3741o325J4243O750j4256p287J3856P107j3792p280J3641P676j3412
421b558p494J3366P885j2932p763J2786P711j2911q244J2454Q123j2188p887J2598
435B946Q669j2058q710J1749Q679j1911r223J1642R489j1378r401J1333J0071
448A1897j0943j0118J1048J0362j0989j0884J0446J0901j0508j1206J0562J1875
$$ plain form
460 12443 2382 -9162 816 12374 2080 -10032 -485 11473 1712 -10158 -391 11666 2094
473 2094 -9900 -401 11453 1880 -10179 -1037 10530 1081 -10716 -1668 10069 1468 -9952
486 -9952 -1279 10177 1705 -9743 -1938 8919 1173 -9889 -2378 8681 1845 -8713 -1861 8882
500 8882 2599 -7978 -2102 8242 2476 -7825 -2506 7815 3212 -6689 -1855 8515 4198 -5907
514 -5907 -1916 8123 4140 -6197 -2387 7961 4427 -5773 -2169 8522 5361 -5454 -2398 8142
528 8142 4981 -6197 -3491 7385 4551 -6414 -3674 7459 4796 -6392 -3886 6909 4041 -7210
542 -7210 -4864 5868 3149 -7862 -5304 5335 2950 -7557 -5052 5244 2700 -7872 -6014 3933
556 3933 1782 -7977 -6084 3922 2535 -7090 -5789 3863 2994 -6591 -6100 3467 3381 -5979 -6328 3355
$$ packed form
460A2443j0061j1544R978J1558j0294j2112R547J1958r761j1870R767J2057r572
473B094j1994R499J1854r573j2059R142J1567r449j1797R048J1737q601j1420
486i952Q673J1456q472j1448P805J0857p746j1062P511J1059o836j0558O852J0743
500H882o283j0577N876J0344n766j0301N319J0321m603r901M834J0370m317j0105
514e907L991J0039l983j0337L810J0348l534j0200L604J0691l161j0815L056J0540
528H142l161j1178K706J0876k834j0965K740J1133k663j1188K506J0795k868j1251
542g210K346J0732k719j1011K558J0639k385j0507K505J0296k544j0572J858R947
556C933k151r759J893J0006j387r625J301R652q69r585M91R567q6r360l49R683
$$ plain form
572 3355 4480 -4780 -5915 3933 5954 -3634 -6012 3648 6495 -3482 -6578 3895 7813 -2557 -6485
587 -6485 4497 8988 -2421 -7172 4653 9684 -2693 -8120 4636 10149 -3179 -8864 5008
600 5008 10788 -3514 -9388 5258 10702 -4858 -10780 4887 10237 -5630 -10912 5343 10223 -6274
614 -6274 -11189 4916 9063 -7323 -11196 4796 8177 -7814 -10850 4684 7194 -7812 -9944 4713
628 4713 6455 -7738 -9361 4150 5301 -7523 -8440 3886 5053 -6314 -7227 3494 4542 -5434
642 -5434 -6551 2685 4048 -4252 -5759 1947 3931 -2885 -5059 1216 3951 -1615 -4604 223 3757
657 3757 -617 -4779 -863 3891 498 -4566 -1437 4240 1265 -5242 -2787 4268 1615 -6070 -3355
672 -3355 4947 2219 -6967 -4209 5390 2451 -7805 -4715 5869 2491 -8820 -5401 6136 2494
$$ packed form
572C355J125r260j135R848K021r588k378R660K847r977l096J0473L918j0370l928
587f485J0982M491j1409m751J1825N031j2377n427J2756N513j3328n685J3872
600E008N780j4302n874J4646N444j5560n922J5667N350j5867n282J6255M880j6497
614f274m915J6105M147j6386l873J5992L381j5991l036J5534K510j5006k132J4657
628D713J742j4193j623J3511J151j2824r17J2326J167j1367r13J0721J048r976
642e434j117R236J363q300j507P706J984o816k174O275K735n566k989M827L534
657C757m374m162L916M754l393n064L129N677k975o507K455P055k653p685K715
672c355Q302k728r186K758R599k939j0256L090J0584l378j1311L419J1537l642
$$ plain form
686 2494 -9245 -5151 6694 2413 -9737 -5199 6915 2109 -10038 -4923 7164 1885 -10019
699 -10019 -4626 7389 2044 -9753 -4276 7292 1995 -9421 -4166 7099 2043 -8954 -4004
712 -4004 6986 2297 -8383 -3804 6739 2414 -8000 -4026 6398 2710 -7504 -4099 6176
725 6176 3113 -7179 -4395 5971 3454 -6910 -4687 5750 3831 -6732 -5041 5710 4290 -6474
739 -6474 -5307 5599 4532 -6415 -5493 5633 4835 -6257 -5486 5685 4756 -6311 -5302 5984
753 5984 4788 -6203 -4901 6034 4508 -6242 -4554 6198 4380 -6062 -4311 5915 3954 -5863
767 -5863 -3821 5637 3550 -5448 -3544 4989 2985 -4975 -3167 4283 2460 -4447 -2913 3310 1937
782 1937 -3926 -2761 2526 1563 -3397 -2934 1503 1394 -2747 -3176 520 1451 -2123 -3519 -240 1773
$$ packed form
686B494j1739M094J1845m281j2150M538J2114m806j2147N115J2087n279j1904
699a0019N393J2015n345j1797N477J1568n297j1416N255J1265n056j0997M950
712d004J0990m689j0680M579J0543m325j0414L974J0424l688j0214L405J0275
725F176l063j0292K784J0366k517j0364K223J0437j919j0563J691J0751j420j0764
739f474J167J0906j067j0947R22J1126p98j1092P71J1171r29j1067J009J1286
753E984j196j0991J302J0935j526j0750J688J0752j818j0442J751J0226j961r817
767e863K042R458k087q998J904Q533k004p960J808P450j823o907J534O223j373
782A937n863J165N287r63m960M63M437j09m141m29L696R31l574j396L279K013
$$ plain form
798 1773 -1312 -3967 -1036 2222 -702 -4555 -1508 3110 -18 -5193 -1882 3970 498 -5825 -1873
813 -1873 5017 863 -6468 -1784 6006 1002 -6957 -1343 7079 1040 -7408 -714 7963 703 -7819
828 -7819 20 8543 275 -8158 734 9089 -157 -8186 1395 9182 -870 -8372 1868 9055 -1377
843 -1377 -8254 2318 8636 -2068 -8044 2602 8275 -2416 -7637 2613 7420 -2893 -7290 2528
857 2528 6685 -2951 -6649 2521 5844 -2980 -6068 2364 5154 -2847 -5486 2133 4714 -2421 -5033
872 -5033 1841 4405 -1927 -4596 1421 4340 -1109 -4226 828 4217 -349 -3905 473 4397 509
887 509 -3614 -97 4360 1044 -3673 -365 4634 1680 -3641 -660 4785 1906 -3945 -1030 5041
902 5041 2161 -4051 -1290 5204 2091 -4584 -1660 5282 2364 -4586 -1803 5174 2099 -5057 -2222
$$ packed form
798A773l085k655K931L258k924l853L047M618l128n175L311N852l472o323L952
813a873O890m154p331M684P790n004p959N614Q422o039q448O694Q677p260q522
828g819P839Q523q268q433Q892Q355r246q029R581P787j0052p502J0240P187j0432
843a377o877J0572O318j0704n976J0646N673j0691n221J0250M807j0313m397R818
857B528M157r636l698R170L323q824l088Q432K790q001k639P619K581p135k612
872e033O874K564o332k669O017K919n449l117N054L389m566l556M378L924l888
887E09m123L517M457l316m717L308M999k954n321K981N445k879n851K915O071
902E041k880o212K761O494l113o675K924O942k918o950K783O977l075p156K835
$$ plain form
917 -2222 4883 2236 -4885 -2319 4783 2096 -5183 -2840 4252 2108 -4878 -2832 4090 2181 -4774
932 -4774 -3196 3540 2202 -4486 -3220 3648 2781 -4153 -3707 3121 2846 -3971 -3755 3377 3661 -3536
948 -3536 -4119 3011 3805 -3461 -4255 3350 4564 -3166 -4571 3250 4721 -3347 -4735 3787 5429 -3237
964 -3237 -4897 3892 5464 -3701 -5286 4270 5930 -3447 -4998 4521 5695 -4087 -5316 4639 5842
979 5842 -3899 -4806 4893 5569 -4407 -5029 4835 5385 -4167 -4412 5104 5215 -4331 -4468 4672 4812 -4109
996 -4109 -3924 4797 4664 -3877 -3970 4185 4077 -3518 -3377 4183 4266 -2986 -3378 3125 3647 -2673 -3184 2926
1014 2926 3883 -1818 -3149 2061 3384 -1570 -3248 1639 3745 -819 -3311 915 3443 -715 -3712
1029 -3712 424 3959 74 -3782 -53 3885 -60 -4444 -664 4219 633 -4322 -583 4386 409
$$ packed form
917b222P105k647p121K566P102k687p279K343P092k144o986K046O922j909o955
932d774J578O736j338o688J266O868q67o934M46O828k75o817K16P132K84p197
948c536n83P130P94p266p94P605J214p730j405P821J471q068j388Q522J642q666
964c237j660Q789J572r165j585R556J660r377j551R519J174r782j229R955J203
979E842r741r07R699O76r976o22R864N50r552k45R516J11r546j37R140J40q921
996d109J85Q721j33q541r3Q155j08p595J41P560Q3p252l92O503N22o320n11O110
1014B926R57n701j331N210J323m954j678M887K106m564k492M226K528m158k997
1029c712M136L535l885l856L729L938l945m384L780M883l586m955L739M969l977
$$ plain form
1044 409 -4997 -1165 4578 798 -4811 -949 4790 664 -5326 -1267 4752 801 -4995 -817 5053
1059 5053 694 -5388 -1180 4739 610 -5043 -679 5111 721 -5087 -963 4729 423 -4986 -552
1074 -552 5026 767 -4912 -815 4525 420 -4823 -658 4719 799 -4478 -783 4220 496 -4596
1089 -4596 -895 4379 922 -4188 -927 4029 645 -4392 -1184 4091 1068 -4025 -1142 3892 918
1104 918 -4238 -1465 3845 1284 -3821 -1223 3875 1236 -4209 -1592 3863 1537 -3790 -1422 4062
1119 4062 1734 -3856 -1724 3842 1895 -3582 -1540 4030 2002 -3557 -1932 3720 2015 -3421 -1572
1134 -1572 3936 2345 -3391 -1886 3577 2207 -3325 -1914 3677 2455 -3169 -2028 3392 2215 -3273
1149 -3273 -2226 3383 2465 -3125 -2349 3257 2345 -3269 -2552 3041 2485 -3127 -2647 2925 2425 -3232 -2960
$$ packed form
1044D09n406L832N743l780n609L862N739m126n990M059O019l951n796M178N870
1059E053m359o082M208N919m129n653M364N790m390n808M124N692m306n409M434
1074e52N578m259n679M097N340m105n243M165N377l920n277L695N003l724n092
1089d596L701N274l457n110L261M956l384n037L208N275l023n093K883N034k974
1104I18n156K773N310k561n105K598N098k639n445K617N455k326n327K368N484
1119D062k328n590K132N566j947n477K042N570k028n559J625N652j705n436J849
1134a572N508j591n736J505N463j370n532J411N591j222n624J141N420j177n488
1149c273J047N609r18n590P76N606r12n614P17N593n56n612M80N572n00n657K72
$$ plain form
1166 -2960 2765 2575 -3030 -2915 2575 2484 -3125 -3122 2436 2529 -2973 -3062 2449 2558 -2997 -3178 2252 2551
1184 2551 -2845 -3113 2284 2637 -2787 -3259 2067 2625 -2603 -3197 2017 2709 -2470 -3324 1784 2744 -2274
1201 -2274 -3304 1706 2792 -2115 -3303 1372 2802 -1885 -3452 1229 2934 -1770 -3472 1149 3000
1216 3000 -1544 -3498 1026 3180 -1406 -3617 931 3359 -1216 -3785 795 3598 -1069 -3865 776
1231 776 3794 -840 -3968 734 4009 -707 -4009 806 4243 -449 -4029 815 4350 -445 -4137
1246 -4137 765 4550 -315 -4044 873 4638 -240 -4210 752 4678 -194 -4067 760 4692 -191
1261 -191 -4192 583 4569 -139 -4133 627 4531 -115 -4237 335 4350 -294 -4254 278 4377
1276 4377 0 -4205 -7 4124 -16 -4294 -221 4041 157 -4109 -404 3903 242 -4082 -537
$$ packed form
1166b960N725j90n605J15N490r1n609LN558R3n502q9N511J09n555j81N430K99
1184B551n396k68N397L53n424m72N326N58n228n94N214O92n179q54N108R60n018
1201b274j030N010J086m907j188M675J430m687j567M681J705m704j702M621J851
1216C000m544j954M524K154m586k211M548K428m575k569M580K803m667k796M641
1231G76L018m634l128M702L275m716l302M815L437m692l580M844L535m795l692
1246d137M902L785m865l729M917L765m878l970M962L926m872l873M827L932m883
1261a91m001M775L986m708l994M760L904m646m122M572M015m644l960M532M099
1276D377m377m205M198M131m140m278M073M262l884m266L705M307l661m324L545
$$ plain form
1291 -537 3830 482 -3923 -746 3705 409 -3967 -845 3653 656 -3719 -879 3651 883 -3712
1306 -3712 -1000 3482 927 -3468 -980 3520 1046 -3481 -1090 3305 1121 -3187 -1018 3295 1235
1321 1235 -3134 -1281 2917 1252 -2833 -1249 2857 1421 -2626 -1467 2442 1388 -2472 -1482 2341
1336 2341 1511 -2369 -1706 2013 1550 -2234 -1852 1951 1763 -1977 -2032 1712 1845 -2061 -2286 1665 2237
1353 2237 -1708 -2346 1659 2369 -1810 -2758 1594 2729 -1627 -2846 1701 3071 -1590 -3137 1819 3368
1369 3368 -1552 -3122 2046 3562 -1748 -3317 2186 3768 -1729 -3208 2499 3947 -1928 -3401 2589
1384 2589 3928 -2094 -3286 2885 4001 -2257 -3218 2991 3925 -2327 -3063 3107 3754 -2494 -3102 3133
1400 3133 3570 -2467 -2907 3014 3311 -2430 -2629 2871 3006 -2420 -2616 2610 2538 -2245 -2297 2447 2328 -2132
$$ packed form
1291e37M367l348m405L177M451l296m376L122M498k997m375K840M530k768m595
1306c712K712M482k555m395K488M500k474m527K391M395k184m308K169M313k060
1321A235m369J853M198j665m085J584M106j436m047J159L909j054l860R90L823
1336B341q30l880O63L719m63l784L82L803j88l740n5L744J33l906k25L951N72
1353B237l945o38M005P10m179r48M352J135m356j219M547J370m661j547M956J549
1369C368m920j570N168J516n310j569N503J582n497j479N707J448n875j473N990
1384B589J339o022j192O171J116o258r61O209R34o252p36O170O47o248o08O235
1400C133M37o037m40N921K97n741j99N500J35n426j96N226p2m783n2M744j19m460
$$ plain form
1418 -2132 -2130 2053 2109 -2054 -2070 1715 1853 -1807 -1984 1487 1821 -1492 -2009 1016 1731 -1219 -2064 716
1436 716 1633 -985 -2169 423 1719 -620 -2011 215 1743 -521 -2306 -126 1811 -422 -2316
1451 -2316 -100 2081 -189 -2542 -272 2277 -72 -2670 -297 2583 -7 -2893 -470 2588 168
1466 168 -2890 -338 2941 332 -2948 -502 2774 358 -2981 -463 2912 460 -2914 -404 2925
1481 2925 345 -3067 -468 3063 469 -3040 -441 3158 594 -3184 -661 3174 847 -3120 -694
1496 -694 3255 852 -3337 -1094 3039 1042 -3016 -991 3222 1140 -3168 -1178 3001 1026 -3140
1511 -3140 -981 3277 1100 -3352 -1234 3301 1066 -3429 -1043 3614 1281 -3544 -1301 3383 1177
1526 1177 -3549 -1180 3683 1404 -3419 -1208 3344 1026 -3370 -1059 3399 988 -3213 -794 3108
$$ packed form
1418b132KM183N6m163j6L785J38l660j77L471L34l313n17L025P15k950q45K780
1436G16R17k618j184K592J296k339j391K226J528k264j785K180J937k233j894
1451b316K216K181k270k353K270K549k349k598K373K880k590k886K423L058k420
1466A68l058K552L279k609l280K446L276k416l339K518L375k452l374K510L329
1481B925k580l412K599L531k594l509K599L599k564l778K523L835k327l967K426
1496f94L949k403m189K243M133j997m058K025M213k082m308J990M179j975m166
1511c140K159M258k177m452K118M535k235m495K386M657k333m825K243M684k206
1526A177m726K369M863k279m823K211M552k318m396K311M458k411m201K419L902
$$ plain form
1541 3108 592 -3289 -649 3178 611 -3041 -555 3010 387 -3208 -731 2857 511 -2798 -596
1556 -596 2617 554 -2828 -1115 2115 606 -2232 -1040 1755 621 -2109 -1308 1203 750 -1622 -1145
1572 -1145 1027 749 -1570 -1603 631 814 -1395 -1608 799 1236 -1424 -2220 505 1452 -1341 -2447 587
1589 587 2027 -1059 -2822 313 2163 -1038 -3042 344 2604 -822 -3186 289 2553 -1015 -3278
1604 -3278 442 2886 -947 -3295 627 2863 -1165 -3494 771 3192 -1091 -3367 968 3236 -1226
1619 -1226 -3526 1051 3329 -1152 -3348 1175 3216 -1236 -3354 1119 3173 -1142 -3119 1250 3128
1634 3128 -1245 -2984 1181 2867 -1190 -2744 1309 2835 -1101 -2689 1238 2680 -1103 -2602 1212
1649 1212 2735 -945 -2533 1031 2545 -878 -2441 893 2596 -581 -2353 762 2374 -643 -2253
$$ packed form
1541C108k516l881K640L827k567l652K486L565k623l595K477L588k346l309K202
1556e96L213k063l382J713L230j509k838J192K795j134k730Q01K511m53k372M77
1572a145K172k78k319l3K234J83k209k13K407M37k660p96K725R47k793j106L034
1589E87J440l086j763L135J850l201k004L386K260l426k364L475K264l568k263
1604c278L720K444l833k348L922K236m028k329M265K421m283k276M335K268m462
1619a226k300M577K278m481k196M523K041m452k118M473K054m315j977M369J878
1634C128m373j739M165J686m057j554M053J526l936j588L927J442l783j499L814
1649A212J523l680j588L564J514l423j563L334J703l177j772L115J612l017j610
$$ plain form
1664 -2253 604 2297 -480 -2180 454 2190 -415 -2289 305 2209 -295 -2245 113 2185 -164
1679 -164 -2302 -24 2157 -41 -2313 -216 2065 72 -2246 -332 1947 178 -2322 -583 1968
1694 1968 260 -2142 -615 1887 356 -2182 -746 1788 543 -2081 -836 1907 575 -2124 -1004
1709 -1004 1769 715 -2083 -985 1841 966 -1972 -1188 1746 1031 -1989 -1164 1833 1220 -1852 -1333
1725 -1333 1722 1145 -1873 -1276 1879 1436 -1782 -1353 1857 1363 -1965 -1288 2041 1582 -1854 -1256 2058
1742 2058 1371 -2032 -1429 2112 1647 -1910 -1324 2170 1416 -2135 -1426 2213 1568 -1927 -1255 2236 1454
1759 1454 -2177 -1441 2219 1495 -1980 -1162 2177 1479 -2166 -1456 2060 1327 -1996 -1068 2300 1435 -1998
1776 -1998 -1340 1943 1281 -1930 -1093 2239 1503 -1759 -1378 1748 1359 -1717 -1199 2011 1648 -1587 -1314
$$ packed form
1664b253K857J693k777j700K634J736k605j874K594J904k504j950K358K072k349
1679a64k138K278K181k198k272K097K281j993k318J914K279j769k500J739K551
1694A968j708k402J527K502j531k538J436K534j245k624J245K743j332k699J120
1709a004K773j054k798J098K826q75k938P84K934p15l020Q25K997o13l072N19
1725a333L055n77l018N97L155m43l218M29L210m94l328O77L329m59l436N98L314
1742B058o87l403O03L541m65l557N86L494p54l551P09L639o45l495O72L491p82
1759A454l631P36L660p24l475Q18L339o98l645P10L516p33l323R28L368q65l433
1776a998O58L283o62l211Q37L332p36l262L81L126l89l076N18L210l63l235K73
$$ plain form
1793 -1314 1626 1359 -1589 -1420 1696 1817 -1194 -1367 1453 1561 -1408 -1606 1409 1818 -1007 -1491 1207
1810 1207 1616 -1242 -1910 1027 1853 -922 -1661 1003 1638 -1203 -2168 595 1733 -932 -1983 704
1826 704 1823 -1148 -2421 279 1607 -970 -2292 465 1818 -1048 -2606 14 1568 -1023 -2373
1841 -2373 300 1851 -919 -2641 -121 1505 -1035 -2556 165 1905 -615 -2498 -30 1596 -865
1856 -865 -2531 145 2018 -437 -2408 39 1779 -689 -2455 133 2174 -206 -2171 152 1945
1871 1945 -456 -2365 16 2215 54 -1990 91 2082 -141 -2342 -174 2160 220 -1925 94
1886 94 2112 -21 -2349 -311 2022 166 -2060 -53 2177 71 -2369 -655 1915 137 -2179
1901 -2179 -358 2172 327 -2428 -818 1788 191 -2280 -659 1972 442 -2341 -1001 1662 276
$$ packed form
1793a314K940k67k948J69L116J21l011j73K820J08k969j98L015M09k825m84K698
1810A207M09k858o68K937Q26k775p39K664O35k841r65K763J138k665j051K687
1826G04J119k971j273K700J328k577j322K757J353k866j558K620J554k591j350
1841b373K673J551k770j722K520J626k540j521K721J740k520j883K468J626k461
1856h65j666K676J873k455j971K447J740k468j766K588K041k380j965K323J793
1871A945k401j909K381K199k161k044K081J991k223k201K168K334j940k145K019
1886I4K018k133k328K038K333j856k226K007K230k106k440J714K570j778k316
1901b179J821K530j845k755J610K606j597k471J621K631j530k783J340K663j386
$$ plain form
1916 276 -2314 -887 1994 606 -2255 -1060 1660 432 -2281 -966 1988 860 -1988 -1025 1758
1931 1758 608 -2219 -1121 1909 983 -1875 -900 1855 802 -2101 -1179 1897 1058 -1759 -942 1828
1947 1828 964 -2032 -1311 1622 1067 -1763 -1095 1742 974 -1871 -1373 1366 896 -1722 -1312 1401 952
1964 952 -1796 -1533 1101 780 -1764 -1380 1233 896 -1761 -1553 967 714 -1740 -1471 1045 956 -1585
1981 -1585 -1555 754 779 -1512 -1516 836 1123 -1207 -1516 743 1029 -1298 -1462 754 1276 -878 -1331 738
1999 738 1214 -991 -1479 825 1499 -628 -1225 850 1547 -653 -1429 811 1626 -459 -1345 860 1688
2016 1688 -498 -1460 781 1801 -443 -1443 870 1917 -477 -1621 699 1908 -435 -1654 831
2031 831 1998 -467 -1726 581 1914 -475 -1746 631 1963 -446 -1833 577 1967 -503 -1862
$$ packed form
1916B76k590J427K881j388k861J195K720j228k713J315K954j128k848R63K783
1931A758j150k827J098L030r26k858R75K755j053k903R22L076q39k817Q17K770
1947A828q64k996P21K933n55k830O68K837p68k845M98K739m70k618M10K713m49
1964I52k748K63K634l21k544L84K613l37k657K08K520k53k454K69K516q9k541
1981a585L0K309K5k291mK352K87k330l09K259K86k327j64K216N22k154m53K069
1999G38M76k205m88K304O74k127n97K075O97k200p76K240Q15k085q86K205Q28
2016A688k186r62K241J020k244j000K313J047k394j144K320J209k343j219K485
2031H31J167k465j259K307J333k389j271K377J332k409j387K410J390k470j359
$$ plain form
2046 -1862 649 2059 -424 -1880 565 2022 -445 -1886 596 2112 -399 -1777 598 2024 -421
2061 -421 -1800 580 2078 -364 -1809 580 2020 -326 -1850 536 1972 -277 -1682 470 1956
2076 1956 -238 -1718 396 1809 -228 -1670 395 1706 -333 -1686 200 1634 -241 -1659 283
2091 283 1613 -278 -1648 127 1484 -177 -1611 95 1455 -161 -1558 -90 1463 -70 -1482
2106 -1482 -31 1374 85 -1422 -99 1291 168 -1319 -195 1404 339 -1305 -214 1418 447
2121 447 -1241 -266 1443 600 -1175 -353 1463 706 -1286 -459 1464 805 -1213 -529 1563 955 -1208
2138 -1208 -660 1542 1038 -1221 -716 1623 1137 -1284 -871 1640 1242 -1320 -890 1612 1356 -1315 -1030
2155 -1030 1695 1388 -1330 -1045 1647 1373 -1415 -1113 1722 1378 -1345 -1072 1737 1464 -1450 -1168 1791
$$ packed form
2046a862K511J410k483j456K445J457k467j441K482J516k511j378K375J426k445
2061d21j379K380J498k442j445K389J440k346j524K386J436k249j405K152J486
2076A956k194j480K114J413k037j442K065J311k039j353J886J434j875j418J942
2091B83J330j891j370J775J357j661j434J706J360j616j397J468J553j533j412
2106a482J451J405j289j507J323J390j123j487J124J599j065j644J091J632r71
2121D47j688R75J709q43j775Q22J816p57j992Q27J923o59k018O84K092o08k163
2138a208N48K202n04k259N05K339m86k421M13K511l98k562M30K502k56k671K85
2155a030K725l07k718K85K692k74k788L02K835l44k723K73K809k73k914K82K959
$$ plain form
2172 1791 1541 -1373 -1130 1862 1502 -1398 -1092 1863 1562 -1331 -1070 1691 1505 -1316 -1163 1657 1490
2189 1490 -1300 -1100 1681 1495 -1284 -1136 1613 1415 -1238 -1078 1450 1322 -1213 -1086 1423 1197 -1267
2206 -1267 -1127 1180 1086 -1248 -1153 1124 997 -1172 -1168 1018 979 -1137 -1097 844 918 -1073 -1203 856 977
2225 977 -871 -1129 577 974 -780 -1137 523 952 -585 -1157 356 1000 -490 -1155 330 1124 -281
2242 -281 -1131 188 1178 -125 -1143 212 1325 -38 -1230 87 1367 68 -1246 35 1496 126
2258 126 -1366 -5 1523 165 -1502 -55 1630 158 -1529 -117 1664 241 -1731 -174 1712
2273 1712 265 -1756 -194 1753 243 -1678 -139 1773 183 -1714 -56 1879 151 -1660 -17
2288 -17 1891 166 -1689 65 1888 140 -1708 84 1909 195 -1611 122 1893 165 -1584
$$ packed form
2172A791k50k914K43K992l60k900L06K955l01k893K61K761j86k821J53K820j67
2189A490k790K00K781j86k779J48K749j98k653J60K528j28k535J27K509k26k464
2206a267J40K307r4k334R5K277j27k169MK186l9k116M0J941P4j991j30K059J21
2225I77j848k58J706L97j754l57J660M29j537n72J513O44j490o65J485P94j405
2242b81q50J319R90j303j018J355J113j363j192J317J280j299j314J281J461j370
2258A26j492J361J528j358j667J447J685j472j687J412J781j423j972J557J886
2273A712j447k021J562J947j510j921J539J912j590j897J658J935j728j811J643
2288a7J908j725j855J754J823j748j848J792J825j714j806J733J771j728j749
$$ plain form
2303 -1584 126 1801 154 -1433 175 1743 142 -1457 142 1700 150 -1445 77 1624 103
2318 103 -1381 73 1497 152 -1345 -18 1460 6 -1333 -97 1330 75 -1332 -187 1248
2333 1248 56 -1408 -238 1147 138 -1374 -369 1086 166 -1314 -492 1088 238 -1250 -546 989
2349 989 306 -1217 -510 997 392 -1229 -578 990 474 -1074 -614 941 537 -1022 -628 940 593
2366 593 -906 -674 973 739 -909 -611 993 754 -884 -739 911 866 -822 -718 882 898 -829 -860
2384 -860 797 957 -785 -946 738 969 -740 -981 765 1017 -764 -1052 792 1078 -834 -1056 809
2401 809 1091 -784 -1044 899 1154 -835 -1197 813 1186 -860 -1118 987 1265 -863 -1170 1007 1283
2418 1283 -817 -1092 1054 1305 -764 -1095 1067 1379 -785 -1003 1127 1415 -793 -994 1077 1361 -789
$$ packed form
2303a584J710J675j647j587J608J568j601j599J599J558j550j595J522J547j521
2318A03j484J454J424j345j497J327J478j454j339J236J427j255j407J145J435
2333A248j192j464J170J385j009j512J005J455r20j480Q22J580q50j488P04J535
2349I89o83j523P07J507o05j621O51J568n16j548M60J555m04j559L94J568l47
2366E93j499K32J647k34j648K98J604k39j638J45J650m5j688J04J600J6j727l1
2384h60J657J60j742j61J684K31j709k41J746K52j781k88J844K86j912k22J865
2401H09K82j875k60J943K55j989l62K010L73k046k58K105K78k128l07K177K76
2418A283k100k75K146K51k069l31K162L12k164k18K130K88k208k01K071K84k150
$$ plain form
2435 -789 -962 1125 1245 -784 -1010 1089 1199 -819 -1012 1010 1223 -750 -967 852 1127 -821 -1123
2452 -1123 791 1064 -676 -1071 662 1019 -686 -1149 497 940 -588 -1186 404 998 -523 -1219 236
2469 236 952 -457 -1192 166 939 -379 -1300 -10 957 -320 -1183 -17 996 -247 -1216 -40 979
2486 979 -105 -1238 -129 1133 -29 -1267 -180 1069 -55 -1225 -221 1176 109 -1229 -257
2501 -257 1129 56 -1323 -190 1214 148 -1239 -250 1174 76 -1321 -178 1181 124 -1230
2516 -1230 -278 1153 116 -1296 -336 1208 164 -1208 -247 1216 215 -1279 -322 1233 260 -1166
2532 -1166 -269 1250 304 -1155 -321 1184 340 -1154 -272 1195 403 -1138 -352 1193 467 -1072 -289
2549 -289 1250 483 -1051 -325 1188 446 -1028 -377 1150 502 -992 -373 1124 566 -1064 -489 1144
$$ packed form
2435g89j73K087J20k029k26K099J10k018j93K022K13j973k17J819K75j948l02
2452a123J914K73j740l95J733L57j705m63J646M43j528n98J590N94j521o96J455
2469B36P16j409p35J358P73j318r21J290R67j277q63J166J013j243r69J176J019
2486I79j084j133J109J262j162j238J087J249j124j170J004J397j067j338R72
2501b57J386j073j379J133J404j066j387R89J424j098j397J143J359j057j354
2516a230R52J431j037j412R60J544j044j372R61J463j001j494R57J555r73j426
2532a166Q97J519r46j459Q34J505q44j494Q82J467p92j541P86J545p26j539P83
2549b89J539p67j534P26J513p42j474O51J527o48j494O19J497n58j630N75J633
$$ plain form
2566 1144 590 -1074 -507 918 559 -1102 -588 1010 511 -1056 -677 921 532 -1096 -716 865 593
2583 593 -1024 -759 827 505 -1014 -771 786 558 -1005 -808 747 538 -984 -765 736 654 -919
2600 -919 -865 714 662 -806 -857 637 673 -831 -853 646 755 -721 -852 615 678 -757 -917 555 743
2619 743 -665 -979 468 777 -651 -884 425 688 -649 -983 447 729 -569 -1035 351 711 -701
2636 -701 -987 350 704 -606 -1022 324 631 -597 -1086 236 702 -643 -982 239 719 -539 -940
2653 -940 295 782 -411 -898 298 873 -421 -915 267 868 -297 -875 368 882 -233 -871 250
2670 250 959 -196 -710 334 1031 -166 -782 314 1021 -119 -791 370 1088 -108 -892 244 975
2687 975 -150 -938 267 1083 -108 -1026 101 888 -185 -1014 65 1012 -54 -1067 -12 830 -275
$$ packed form
2566A144n54j664N67J425l59j661N14J598m99j567L79J598l89j628L80J581k72
2583E93j617K65J586l22j519K43J557k28j563J97J555k09j522K19J501q2j573
2600i19N4J579n2j468n1J494L6j504k2J499J09j476j31J467O3j435j60J472J88
2619G43j408l14J447L09j428k33J309K63j337l34J430K82j298m66J386L60j412
2636g01k86J337L54j310m16J346L07j228m89J322M66j345l39J221M80j258m01
2653i40J235M87j193m87J196N75j294m94J182O01j165n78J243N14j115o38J121
2670B50P09j155n14J044O97j197o16J096P07j140o72J161P18j196p84J136P31
2687I75j125p88J205Q16j191r18J127P87j073q29J079R47j066j013J055Q42j105
$$ plain form
2704 -275 -1138 -54 964 -111 -1103 -89 801 -284 -1278 -163 938 -103 -1158 -143 834 -231
2720 -231 -1327 -225 927 -99 -1085 -129 926 -104 -1238 -272 906 53 -1033 -111 961 29 -1134
2737 -1134 -308 846 59 -1058 -177 993 118 -1118 -356 813 73 -1009 -224 959 137 -992 -429
2754 -429 723 15 -1070 -329 829 212 -986 -453 675 67 -1074 -422 784 212 -962 -524 573
2771 573 96 -988 -522 629 333 -809 -384 573 125 -915 -497 600 266 -706 -404 602 344 -724
2789 -724 -521 572 451 -537 -400 655 489 -607 -569 541 525 -468 -463 659 692 -500 -676 479 627
2808 627 -446 -503 688 857 -485 -762 487 749 -540 -729 719 870 -562 -875 469 700 -643
2825 -643 -871 608 943 -608 -857 497 738 -678 -950 582 929 -600 -824 535 773 -703 -1004
$$ packed form
2704b75q63J084J018j075r92J014Q90j085r94J115J101j041j055J015R77j065
2720b31j096J102J152j026r86R56J055j030j134R66J178q53j086R22J072r32j163
2737a134Q26J154p87j117Q81J170q75j236P62J169p40j082P85J183q22j129N63
2754d29J152p08j085P41J158o17j198N33J128o08j141O52J206n72j174M38J097
2771E73m77j084M66J151k96j142M25R57m48j040M18J097l34r72L02J006k58j068
2789g24K03J093j21r88J37J055j66j096L8J110j6r93NJ122L3j192j76J155J48
2808F27j073n7J191J69j342k77J249K62j289j89J448J51j432l13J344K31j343
2825f43k28J479L35j551k49J354K41j416k72J532L47j529k24J359K38j476l01
$$ plain form
2842 -1004 573 835 -626 -899 603 771 -725 -1036 476 701 -600 -812 513 670 -628 -912 368
2859 368 687 -561 -723 509 671 -486 -775 303 508 -408 -695 451 620 -446 -777 159 480 -365
2877 -365 -717 252 620 -238 -730 34 534 -310 -660 137 663 -152 -743 -70 605 -173 -713 -62 703 29
$$ packed form
2842a004J577K62j461k73J502J68j496l11J512K25j301k12J325J57j298k84J280
2859C68L19j248j62J232J62j157k89J078K05r16k87J146J69j066l31R36L21q45
2877c65l52R69L68q58m92P64N00q44l50P97N26q15n91O73O75p78n40O51P65o74
$$ [...]
8191B9
##END NTUPLES=NMR FID
##END=
