##TITLE=1H_IBPM1709
 CDCl3, 8 sc, 
 18.9.2019
##JCAMPDX= 6.0         $$ Bruker NMR JCAMP-DX V2.0
##DATA TYPE= NMR FID
##DATA CLASS= NTUPLES
##ORIGIN= UXNMR, Bruker Analytische Messtechnik GmbH
##OWNER= root
$$ XWIN-NMR		Version 3.5
$$ Wed Sep 18 13:49:14 2019 Russian Standard Time (UT+4h)  she@DPX200
##.OBSERVE FREQUENCY= 200.1315
##.OBSERVE NUCLEUS= ^1H
##.DELAY= (6, 6)
##.ACQUISITION MODE= SIMULTANEOUS
##.ACQUISITION SCHEME= undefined
##.AVERAGES= 8
##.DIGITISER RES= 18
##SPECTROMETER/DATA SYSTEM= spect
##.PULSE SEQUENCE= zg30
##.SOLVENT NAME= CDCl3
##.SHIFT REFERENCE= (INTERNAL, CDCl3, 0, 15.7039)
##AUDIT TRAIL= $$ (NUMBER, WHEN, WHO, WHERE, WHAT)
$$ ##TITLE= Audit trail, XWIN-NMR		Version 3.5
$$ ##JCAMPDX= 5.01
$$ ##ORIGIN= Bruker BioSpin GmbH
$$ ##OWNER= she
$$ F:/spectra/data/she/nmr/H-F/1/audita.txt
$$ ##AUDIT TRAIL=  $$ (NUMBER, WHEN, WHO, WHERE, WHAT)
(   1,<2019-09-18 13:48:16.29 +0400>,<she>,<DPX200>,
      <created by zg, POWCHK disabled, PULCHK disabled
       configuration hash MD5:
       00 E9 B6 7A A2 85 ED C7 34 08 36 98 17 FE 4E 26
       data hash MD5: 16K
       35 A5 37 1D AE C6 70 78 43 1E E9 C6 0B 2C 11 20>)
$$ ##END=
$$ 
$$ hash MD5
$$ E0 4A EC 3C 20 25 BD 84 DE B0 F9 98 3D DB 53 74
##$RELAX= 
##$RELAX= 
##$RELAX= 
##$RELAX= 
##$RELAX= 
##$RELAX= 
$$ Bruker specific parameters
$$ --------------------------
##$DU= <F:/spectra>
##$EXPNO= 1
##$NAME= <H-F>
##$PROCNO= 1
##$TYPE= <nmr>
##$USER= <she>
##$AMP= (0..31)
100 100 100 100 100 100 100 100 100 100 100 100 100 100 100 100 100 100 
100 100 100 100 100 100 100 100 100 100 100 100 100 100 
##$AQSEQ= 0
##$AQ_mod= 1
##$AUNM= <au_zg>
##$AUTOPOS= <>
##$BF1= 200.13
##$BF2= 200.13
##$BF3= 200.13
##$BF4= 200.13
##$BF5= 200.13
##$BF6= 200.13
##$BF7= 200.13
##$BF8= 200.13
##$BYTORDA= 1
##$CFDGTYP= 0
##$CFRGTYP= 5
##$CHEMSTR= <none>
##$CNST= (0..31)
1 1 145 1 1 1 1 1 1 1 1 1 1 1 1 1 1 1 1 1 1 1 1 1 1 1 1 1 1 1 1 1 
##$CPDPRG= <>
##$CPDPRG1= <>
##$CPDPRG2= <>
##$CPDPRG3= <>
##$CPDPRG4= <mlev>
##$CPDPRG5= <mlev>
##$CPDPRG6= <mlev>
##$CPDPRG7= <mlev>
##$CPDPRG8= <mlev>
##$CPDPRGB= <>
##$CPDPRGT= <>
##$D= (0..31)
0 1.2 0 0 0 0 0 0 0 0 0 0.03 0 0 0 0 0 0 0 0 0 0 0 0 0 0 0 0 0 0 0 0 
##$DATE= 1568800095
##$DBL= (0..7)
120 120 120 120 120 120 120 120 
##$DBP= (0..7)
150 150 150 150 150 150 150 150 
##$DBP07= 0
##$DBPNAM0= <>
##$DBPNAM1= <>
##$DBPNAM2= <>
##$DBPNAM3= <>
##$DBPNAM4= <>
##$DBPNAM5= <>
##$DBPNAM6= <>
##$DBPNAM7= <>
##$DBPOAL= (0..7)
0.5 0.5 0.5 0.5 0.5 0.5 0.5 0.5 
##$DBPOFFS= (0..7)
0 0 0 0 0 0 0 0 
##$DE= 6
##$DECBNUC= <off>
##$DECIM= 24
##$DECNUC= <off>
##$DECSTAT= 4
##$DIGMOD= 1
##$DIGTYP= 9
##$DL= (0..7)
0 120 120 120 120 120 120 120 
##$DP= (0..7)
150 150 150 150 150 150 150 150 
##$DP07= 0
##$DPNAME0= <>
##$DPNAME1= <>
##$DPNAME2= <>
##$DPNAME3= <>
##$DPNAME4= <>
##$DPNAME5= <>
##$DPNAME6= <>
##$DPNAME7= <>
##$DPOAL= (0..7)
0.5 0.5 0.5 0.5 0.5 0.5 0.5 0.5 
##$DPOFFS= (0..7)
0 0 0 0 0 0 0 0 
##$DQDMODE= 0
##$DR= 18
##$DS= 0
##$DSLIST= <SSSSSSSSSSSSSSS>
##$DSPFIRM= 0
$$ [...]
##$SUBNAM2= <"">
##$SUBNAM3= <"">
##$SUBNAM4= <"">
##$SUBNAM5= <"">
##$SUBNAM6= <"">
##$SUBNAM7= <"">
##$SUBNAM8= <"">
##$SUBNAM9= <"">
##$SW= 24.0689530833862
##$SWIBOX= (0..15)
0 0 2 0 0 0 0 0 0 0 0 0 0 0 0 0 
##$SW_h= 4816.95568400771
##$TD= 16384
##$TD0= 1
##$TE= 0
##$TE2= 300
##$TE3= 300
##$TEG= 300
##$TL= (0..7)
0 120 120 120 120 120 120 120 
##$TP= (0..7)
150 150 150 150 150 150 150 150 
##$TP07= 0
##$TPNAME0= <>
##$TPNAME1= <>
##$TPNAME2= <>
##$TPNAME3= <>
##$TPNAME4= <>
##$TPNAME5= <>
##$TPNAME6= <>
##$TPNAME7= <>
##$TPOAL= (0..7)
0.5 0.5 0.5 0.5 0.5 0.5 0.5 0.5 
##$TPOFFS= (0..7)
0 0 0 0 0 0 0 0 
##$TUNHIN= 0
##$TUNHOUT= 0
##$TUNXOUT= 0
##$USERA1= <user>
##$USERA2= <user>
##$USERA3= <user>
##$USERA4= <user>
##$USERA5= <user>
##$V9= 5
##$VALIST= <valist>
##$VCLIST= <CCCCCCCCCCCCCCC>
##$VD= 0
##$VDLIST= <DDDDDDDDDDDDDDD>
##$VPLIST= <PPPPPPPPPPPPPPP>
##$VTLIST= <TTTTTTTTTTTTTTT>
##$WBST= 1024
##$WBSW= 4
##$XGAIN= (0..3)
0 0 0 0 
##$XL= 0
##$YL= 0
##$YMAX_a= 568830
##$YMIN_a= -308998
##$ZGOPTNS= <>
##$ZL1= 120
##$ZL2= 120
##$ZL3= 120
##$ZL4= 120
##$ABSF1= 10
##$ABSF2= 0
##$ABSG= 5
##$ABSL= 3
##$ALPHA= 0
##$AQORDER= 0
##$ASSFAC= 0
##$ASSFACI= 0
##$ASSFACX= 0
##$ASSWID= 0
##$AUNMP= <proc_1d>
##$AZFE= 0.1
##$AZFW= 0.1
##$BCFW= 1
##$BC_mod= 2
##$BYTORDP= 1
##$COROFFS= 0
##$CY= 11.3945322036743
##$DATMOD= 1
##$DC= 2
##$DFILT= <>
##$DTYPP= 0
##$F1P= 20.1720416913024
##$F2P= 0.152960286110954
##$FCOR= 0.5
##$FTSIZE= 0
##$FT_mod= 4
##$GAMMA= 1
##$GB= 0.15
##$INTBC= 1
##$INTSCL= 1
##$ISEN= 128
##$LB= 0.24
##$LEV0= 0
##$LPBIN= 0
##$MAXI= 10000
##$MC2= 0
##$MEAN= 0
##$ME_mod= 0
##$MI= 1.114404
##$NCOEF= 0
##$NC_proc= 0
##$NLEV= 6
##$NOISF1= 3.799351
##$NOISF2= 2.8
##$NSP= 1
##$NTH_PI= 0
##$NZP= 0
##$OFFSET= 15.70392
##$PC= 1
##$PHC0= -9738.279
##$PHC1= 24.20096
##$PH_mod= 1
##$PKNL= yes
##$PPARMOD= 0
##$PSCAL= 0
##$PSIGN= 0
##$REVERSE= no
##$SF= 200.130013532006
##$SI= 16384
##$SIGF1= 3
##$SIGF2= 2
##$SINO= 400
##$SIOLD= 16384
##$SREGLST= <1H.CDCl3>
##$SSB= 0
##$STSI= 0
##$STSR= 0
##$SW_p= 3612.71676300578
##$SYMM= 0
##$S_DEV= 0
##$TDeff= 0
##$TDoff= 0
##$TI= <>
##$TILT= no
##$TM1= 0
##$TM2= 0
##$TOPLEV= 0
##$USERP1= <user>
##$USERP2= <user>
##$USERP3= <user>
##$USERP4= <user>
##$USERP5= <user>
##$WDW= 1
##$XDIM= 8192
##$YMAX_p= 0
##$YMIN_p= 0
$$ End of Bruker specific parameters
$$ ---------------------------------
##NTUPLES= NMR FID
##VAR_NAME=  TIME,          FID/REAL,        FID/IMAG
##SYMBOL=    X,             R,               I
##VAR_TYPE=  INDEPENDENT,   DEPENDENT,       DEPENDENT
##VAR_FORM=  AFFN,          ASDF,            ASDF
##VAR_DIM=   8192,          8192,            8192
##UNITS=     SECONDS,       ARBITRARY UNITS, ARBITRARY UNITS
##FACTOR=    0.0002076,     1,               1
##FIRST=     0,             0,               0
##LAST=      1.7004516,     0,               0
##MIN=       0,             -308998,         0
##MAX=       1.7004516,     568830,          0
$$ Real data points
##PAGE= N=1
##DATA TABLE= (X++(R..R)), XYDATA
$$ [...]
$$ plain form
1827 -1006 1728 1354 -1290 -1701 74 671 -354 -446 192 18 -537 -297 -216 -558 271 1596 358 -2336
1845 -2336 -1735 1615 2116 -793 -1964 170 1109 -564 -1039 796 1778 228 -1413 -1331 209 1935 1471
1862 1471 -1186 -2259 302 2311 258 -1866 60 2268 272 -2282 -584 2220 1522 -1041 -1191
1877 -1191 366 1201 651 -377 -967 -59 1357 871 -992 -810 1248 1314 -817 -1008 1377 1816 -530
1894 -530 -1766 -247 1178 890 142 25 -420 -787 165 1202 703 -312 -17 377 -815 -1343 837 2671
1912 2671 592 -2506 -1765 1177 1595 -97 -404 354 -96 -853 -260 321 341 815 371 -1737 -2123 1155
1930 1155 2819 -607 -3157 -36 2629 -134 -2661 -381 2066 243 -1830 -574 1012 433 -671
1945 -671 -1092 -866 679 1836 5 -2733 -1515 1837 1431 -1158 -755 1136 -301 -2404 -637 2045
$$ packed form
1827a006K734l74k644m11J775N97j025r2O38j74n55K40Q1l42Q29J325j238k694
1845b336O01L350N01k909j171K134R39j673m75J835R82j550j641Q2J540J726m64
1862A471k657j073K561K009k053k124J926K208j996k554J698K804o98k563j50
1877a191J557Q35n50j028n90R08J416m86j863J82K058O6k131j91K385M39k346
1894e30j236J519J425k88p48j17m45l67R52J037m99j015K95L94j192n28K180J834
1912B671k079l098P41K942M18j692l07P58m50p57N93N81K0M74m44k108l86L278
1930A155J664l426k550L121K665k763k527K280K447j823k073J256J586n79j104
1945f71m21K26J545J157j831k738J218L352m06k589M03J891j437k103J767K682
$$ plain form
1961 2045 1309 -695 -1083 -977 -1012 761 2412 663 -2038 -1348 597 99 -565 968 1499 -721 -1985
1978 -1985 -618 856 998 994 257 -1627 -1670 1081 2269 -116 -1700 377 1431 -822 -1736 972 2588
1995 2588 27 -2446 -808 2023 1861 -521 -1482 -451 1027 1111 141 -754 -117 780 149 -1141 -19
2012 -19 2413 1598 -2145 -2674 1350 3275 199 -2081 -154 1354 -368 -1047 897 1594 -254 -973 -230
2029 -230 -15 362 1424 620 -1532 -1174 1432 1318 -1135 -747 1116 44 -1458 490 1760 -673 -1837
2046 -1837 707 1319 -1263 -692 2391 678 -3620 -1921 3170 2476 -2012 -1920 843 68 -1616 358
2062 358 2140 275 -1657 -1017 -811 -782 1539 2859 -734 -4152 -1257 2800 998 -2264 -221 2622
2078 2622 -280 -4001 -1346 3408 2354 -2012 -2211 712 872 -1033 -700 921 648 -392 -252 -489
$$ packed form
1961B045p36k004l88J06l5J773J651j749k701O90J945m98o64J533N31k220j264
1978a985J367J474J42mp37j884m3K751J188k385j584K077J054k253r14K708J616
1995B588k561k473J638K831j62k382r61J031J478Q4r70q95O37Q97o31j290J122
2012a9K432q15l743n29M024J925l076k280J927J508j722o79J944O97j848p19P43
2029b30K15L77J062q04k152L58K606j14k453L88J863j072j502J948J270k433j164
2046a837K544O12k582N71L083j713m298J699N091o94m488R2K763p75j684J974
2062C58J782j865j932O40K06K9K321J320l593l418K895M057j802l262K043K843
2078B622k902l721K655M754j054m366j99K923J60j905L33J621k73j040J40k37
$$ plain form
2094 -489 -1150 116 1860 342 -1860 -185 1929 -607 -2874 406 3302 388 -2399 -158 1123
2109 1123 -1461 -1123 2870 2196 -2435 -2059 1701 356 -2301 1341 4378 -364 -4692 -803 3124 632
2125 632 -882 1854 931 -2994 -1613 2603 1306 -1416 1331 2646 -2604 -4225 2441 5220 -1081
2140 -1081 -3935 1479 3203 -2079 -3138 2245 3674 -620 -2203 149 632 -334 528 1083 -344 -418
2156 -418 1047 26 -2134 -401 2977 1709 -2152 -1953 1293 1207 -1406 -850 2013 1574 -1666 -2296 418
2173 418 1418 -96 -336 819 -135 -1942 -657 1723 879 -1205 -235 1177 -831 -2248 450 2330
2189 2330 -42 -1771 -62 487 -1142 -423 1478 -15 -1795 464 1806 -1783 -2861 1997 3436
2204 3436 -2072 -3706 1654 2983 -2286 -3121 2160 2957 -1577 -2419 589 756 -617 541 729 -1458
$$ packed form
2094d89o61J266J744j518k202J675K114k536k267L280K896k914k787K241J281
2109A123k584L38L993o74m631L76L760j345k657L642L037m742m328L889L927k492
2125F32j514K736r23l925J381M216j297k722K747J315n250j621O666K779o301
2140a081k854N414J724n282j059N383J429m294j583K352M83r66Q62N55j427p4
2156d18J465j021k160J733L378j268l861J99L246q6k613N56K863m39l240o30K714
2173D18J000j514k40J155r54j807J285K380q44k084R70J412k008j417K698J880
2189B330k372j729J709N49j629P19J901j493j780K259J342l589j078M858J439
2204C436n508j634N360J329n269q35N281P97m534q42L008J67j373J158J88k187
$$ plain form
2220 -1458 -914 1771 217 -2798 2 3789 361 -4253 -978 3776 961 -3130 -546 2809 260
2235 260 -2448 -216 1831 134 -960 426 532 -580 -101 755 -110 -697 710 1226 -382 -1082 64
2252 64 770 256 251 594 -142 -877 -77 913 710 -78 -51 438 -53 -964 -124 1876 1642 -1298 -2192 568
2272 568 2156 6 -1458 645 1764 -540 -2059 147 2130 1057 -843 -1280 -544 686 1377 -6
2288 -6 -1538 -33 1912 -114 -2337 102 3024 258 -3286 -1016 2721 1225 -1980 -1177 990 558
2304 558 -455 4 163 -575 -278 312 -289 -199 997 302 -1787 -1271 1366 1483 -766 -1092 175 -156
2322 -156 -923 513 1507 -305 -1762 -591 761 85 -406 388 509 -890 -1529 -105 1399 1086 -593
2339 -593 -1776 -792 960 951 -503 -643 516 362 -1284 -1202 1112 2098 -111 -2314 -1366 1339 2032 -102
$$ packed form
2220a458N44K685j554l015K800L787l428m614L275M754k815m091K584L355k549
2235B60k708K232K047j697j094J386J06j112M79Q56q65n87J407N16j608p00J146
2252F4P06n14nL43p36p35Q00R90k03p88K7M89m91r11Q40K000k34k940q94K760
2272E68J588k150j464K103J119k304j519K206J983j073j900m37P36J230O91j383
2288fj532J505J945k026k223K439K922k766l544K270L737j496l205Q03K167m32
2304E58j013M59J59p38K97N90o01R0J196o95k089N16K637J17k249l26J267l31
2322a56p67J436R94j812j457J171J352o76m91P94J21j399o39J424J504l13j679
2339e93j183R84J752rj454j40J159j54j646Q2K314R86k209k203R48K705O93k134
$$ plain form
2357 -102 -1525 -317 1172 40 -1275 54 2038 703 -2220 -1632 1499 2380 -70 -1605 -502 915
2373 915 657 -153 -87 506 343 -556 -714 571 1411 445 -1041 -795 670 1152 398 -137 -58 -227 -341 481
2393 481 977 429 -658 -764 187 716 469 110 123 61 -580 -617 658 1741 522 -1732 -1516 1000 1805
2412 1805 11 -1165 89 787 -530 -1384 335 2260 875 -2069 -2164 820 2445 462 -1765 -915
2428 -915 855 296 -1237 -196 1605 913 -1619 -2067 166 2020 950 -1213 -1701 -121 990 259
2444 259 -650 -102 584 -407 -1536 -456 1605 1136 -1205 -1787 -44 1088 319 -560 -368 -33 -579 -569
2462 -569 399 878 -75 -1242 -692 637 501 -363 -288 477 -185 -1296 -284 1598 1092 -1226 -1634 309
2480 309 1388 189 -816 -50 752 -68 -1047 -312 1412 1454 -684 -1987 -368 1948 1380 -879 -1206
$$ packed form
2357a02j423J208J489j132j315J329J984j335k923N88L131Q81k450j535J103J417
2373I15k58q10O6N93j63q99j58J285Q40r66j486K46J465M82p54n35P9j69j14Q22
2393D81M96n48j087j06R51N29k47l59J3o2o41l7J275J083j219k254K16K516Q05
2412A805j794j176J254O98j317q54J719J925j385k944r5K984J625j983k227Q50
2428i15J770n59j533J041J801o92k532m48K233J854j070k163m88J580J111p31
2444B59r09N48O86r91j129J080K061m69k341n82J743J132p69q79J92L35n46J0
2462e69R68M79r53j167N50J329j36q64P5P65o62j111J012J882n06k318m08J943
2480C09J079j199j005P66Q02q20r79P35J724M2k138j303J619K316n68k259l27
$$ plain form
2497 -1206 567 988 -427 -804 782 1634 -127 -1886 -795 1722 2035 -259 -1854 -364 1425 784
2513 784 -717 -251 1134 494 -1391 -928 1460 1731 -467 -1526 -91 1108 372 -299 239 491 -332
2530 -332 -654 369 893 113 -579 -85 360 -33 -200 254 383 -4 -434 -194 440 631 -22 -845 -557 752
2550 752 906 -585 -1156 270 1156 -502 -1494 319 1916 24 -2364 -1154 1689 1518 -887 -1552 107
2567 107 870 -349 -1074 115 1334 425 -1665 -1856 613 2026 416 -1757 -1083 862 733 -971 -796
2584 -796 1090 1045 -1188 -1789 218 1574 293 -1184 -373 654 126 -832 -240 667 339 -429 -374 79
2602 79 -78 -98 116 192 59 -1 -205 -418 47 646 121 -523 384 928 -645 -1582 584 2244 113 -2020
2622 -2020 -143 1800 -93 -1820 362 2610 523 -2114 -1066 1204 1280 105 -173 -123 -28 175 -55
$$ packed form
2497a206J773M21j415l77J586Q52j761j759J091K517L13k294j595J490J789o41
2513G84j501M66J385o40j885M63K388K71k198j059J435J199p36o71N38K52q23
2530c32l22J023N24p80o92M94M45l93j67M54J29l87m30K40O34J91o53q23K88J309
2550G52J54j491n71J426Q86j658r92J813J597j892k388J210K843j71k405o65J659
2567A07P63j219p25J189J219r09k090j91K469J413j610k173O74J945j29j704J75
2584g96J886m5k233o01K007J356j281j477Q11J027n28r58N92R07l28p68N5M53
2602G9j57k0K14P6j33o0k04k13M65N99n25o44R07N44j573r37K166J660k131k133
2622b020J877J943j893j727K182K248k087k637J048K270P6j175k78N0R5K03k30
$$ plain form
2639 -55 -594 495 1940 407 -2462 -1431 2138 2069 -1206 -1467 1355 1480 -1521 -1675 1335 2345 -247
2656 -247 -1745 -283 902 313 -355 52 689 273 -499 -556 -56 544 771 -22 -627 -346 152 -94 -375
2675 -375 310 918 -158 -1237 -282 918 55 -992 281 1308 -656 -2122 -37 1872 85 -1747
2691 -1747 -51 1496 -316 -1910 -206 1411 438 -841 -568 -325 -208 485 416 -902 -505 1190 393
2708 393 -2239 -1166 2491 1716 -2281 -2156 1708 1788 -1791 -1818 1602 1792 -1224 -1797 441 1197 28
2725 28 -581 -45 69 75 92 -336 -485 558 984 -434 -1188 284 1328 -165 -1221 60 1233 -29
2743 -29 -1053 250 1127 -348 -1167 522 1532 -200 -1378 133 1257 -71 -1049 548 1440 -199
2759 -199 -1453 -64 1325 619 -283 -159 -46 -68 340 234 -411 199 1452 192 -1961 -711 2309 1522
$$ packed form
2639e5n39J089J445j533k869J031L569o9l275k61K822J25l001j54L010J010k592
2656b47j498J462J185n89o68M07O37m16p72n7N00O00K27p93o05K81M98k46k81
2675c75O85O08j076j079R55J200q63j047J273J027j964j466K085J909j787j832
2691a747J696J547j812j594J704J617r73j279K73K43J17O93o9j318L97J695p97
2708C93k632J073L657p75l997J25L864Q0l579k7L420J90l016n73K238P56j169
2725B8o09N36J14OJ7m28j49J043M26j418p54J472J044j493j056J281J173j262
2743b9j024J303Q77j475q19J689J010j732j178J511J124j328r78J597Q92j639
2759a99j254J389J389p06r02J24J13k2M08j06o45O10J253j260k153J250L020p87
$$ plain form
2777 1522 -1806 -1469 1783 1375 -1809 -1540 1851 2106 -909 -1770 261 1133 129 -581 -90 480 539 -138
2795 -138 -1109 -729 1103 1309 -629 -1285 322 872 -857 -1109 898 1732 -484 -1847 -401 880 115
2812 115 -313 512 524 -958 -1471 -16 1212 536 -397 -442 -220 -588 -662 359 1108 409 -856 -1138 -522
2831 -522 397 832 242 -654 -345 368 -241 -1220 -45 1911 848 -2046 -1684 1418 1525 -1208 -1450 1316
2849 1316 1618 -1165 -2012 393 1622 208 -853 -365 463 338 -343 -786 -17 1297 980 -1093 -1577
2866 -1577 558 1466 -77 -900 686 1163 -765 -1591 289 1661 706 -637 -565 -33 111 73 480 733
2884 733 354 -554 -868 29 973 708 -143 -144 147 -260 -489 472 1205 402 -841 -640 454 787 -41 -507
2904 -507 153 835 201 -1045 -546 1229 1108 -954 -1285 817 1544 -632 -1616 276 1680 177 -1228
$$ packed form
2777A522l328L37L252m08l184K69L391K55l015q61K031Q72j004p10M91N70N9o77
2795a38r71L80J832K06j938o56J607N50j729k52K007Q34k216j363J446J281p65
2812A15m28Q25J2j482n13J455J228o76r33m5K22l68p4J021P49o99j265k82O16
2831e22R19M35n90q96L09P13o09r79J175J956j063k894L62L102J07k733k42K766
2849A316L02k783q47K405J229j414j061M88Q28j25o81m43P69J314l17k073m84
2866a577K135R08j543q23J586M77j928q26J880J372r55j343P2N32J44l8M07K53
2884G33l79r08l14Q97R44k65q51jK91m07k29R61P33q03j243K01J094L33q28m66
2904e07O60O82o34j246M99J775j21k062l31K102P27k176r84J892J404j503j405
$$ plain form
2921 -1228 -475 778 430 -429 -593 125 897 321 -1183 -1244 880 1598 -440 -1760 -6 1290 -260
2938 -260 -1475 195 1604 -47 -1704 -587 964 694 -402 -518 -2 -13 -304 -226 204 327 -85 -734
2956 -734 -517 474 453 -261 -455 162 85 -531 -254 648 402 -706 -684 263 733 109 -667 -514 408 551 -330
2977 -330 -698 289 1066 -298 -1374 -82 1580 594 -1430 -989 1064 1135 -715 -1068 550 1131 -142
2994 -142 -1143 -325 1226 1034 -777 -1308 380 1575 186 -1235 -152 1336 417 -1198 -425 1243
3010 1243 923 -710 -817 458 890 169 -360 -117 337 265 -21 -62 293 433 -120 -436 97 847 245 -586
3030 -586 -211 478 215 -370 50 590 87 -760 -260 849 688 -620 -802 295 819 -107 -862 -10 936
3049 936 138 -1068 -512 1095 882 -785 -1165 261 1148 -53 -1141 -301 935 398 -987 -937 597
$$ packed form
2921a228P53J253l48q59j64P18P72n76j504o1K124P18k038j320J754J296j550
2938b60j215J670J409j651j657J117J551k70j096j16N16j1k91P8M30J23m12o49
2956g34K17R91k1p14j94O17p7o16K77R02k46j108K2R47M70o24p76J53R22J43q81
2977c30l68R87P77j364j076J292J662r86k024M41K053P1j850l53J618N81j273
2994a42j001Q18J551j92j811n31J688J195j389j421J083J488r19j615P73J668
3010A243l20j633j07J275M32p21n29K43M54p2k86m1L55J40n53l16N33P50o02q31
3030e86L75O89k63n85M20N40n03q47N00J109j61j308j82J097N24r26p55Q52R46
3049I36p98j206N56J607k13j667l80J426Q87j201j088Q40J236n37j385N0J534
$$ plain form
3066 597 1114 -299 -1343 -320 1051 591 -997 -879 561 841 -649 -1090 229 1052 -43 -1130 -455
3083 -455 732 529 -568 -652 202 414 -245 -572 8 441 -94 -624 -241 484 194 -476 -364 333 289 -395
3103 -395 -221 423 247 -640 -432 569 627 -280 -767 101 763 164 -534 -183 609 409 -510 -592 492 989
3123 989 -66 -1057 -268 1106 750 -645 -810 619 1080 -230 -1007 57 1314 514 -1125 -705 932
3140 932 1057 -475 -977 412 1190 -36 -1054 -121 1168 640 -699 -740 511 848 -110 -640 78 631
3158 631 188 -579 -235 596 458 -459 -451 443 548 -328 -540 193 569 -186 -492 147 375 -208 -509 228 606
3179 606 -93 -774 -295 531 429 -357 -591 63 485 -95 -744 -191 687 214 -865 -846 580 1048 -381
3198 -381 -1325 -107 1144 289 -1170 -662 817 671 -837 -1081 451 1062 -246 -1167 -369 759 438
$$ packed form
3066E97N17j413j044J023J371m60j588J18J440K80j490m41J319Q23j095j087O75
3083d55J187k03j097q4Q54K12o59l27N80M33n35n30L83P25k90o70J12O97m4o84
3103c95J74O44j76q87K08J001N8r07m87Q68O62n99o98L51P92k00r19q2J084M97
3123I89j055r91P89J374l56j395j65J429M61j310p77J064J257q00j639M20J637
3140I32J25j532n02J389P78j226j018R33J289n28j339m1J251L37r58n30P18N53
3158F31m43p67L44Q31j38r17QQ94J05q76k12P33L76p55l06O39K28n83l01P37L78
3179F06o99o81M79Q26j02p86k34O54M22n80o49N53Q78m73j079J9J426M68j429
3198c81r44J218J251q55j459N08J479j46j508k44J532O11j308r21P98J128l21
$$ plain form
3215 438 -731 -839 313 821 -203 -1084 -244 976 473 -893 -768 601 697 -555 -705 495 637 -440
3233 -440 -726 337 764 -134 -576 150 445 -149 -214 350 403 -100 -255 159 362 129 -54 -88 38 392 197
3254 197 -311 -310 506 746 -194 -704 396 961 -310 -988 321 1383 43 -1302 -331 1292 727 -661
3272 -661 -577 555 695 -298 -646 240 807 457 -555 -763 220 992 258 -875 -327 946 500 -1087 -664
3291 -664 1104 1008 -736 -1007 437 857 -376 -706 450 660 -346 -657 158 412 -101 -216 72 -47
3309 -47 -234 -57 72 -157 9 233 -100 -396 -100 284 -320 -497 426 713 -679 -1208 191 1055 -299
3328 -299 -1077 258 934 -556 -1515 136 1321 150 -1155 -521 473 211 -248 -135 182 195 -30 -471
3346 -471 -673 171 1060 286 -1252 -657 1030 656 -1140 -762 1273 1064 -1024 -1302 752 1135 -430 -779
$$ packed form
3215D38j169j08J152N08j024q81Q40J220n03j366J25J369R6j252j50J200J42j077
3233d40k86J063M27q98m42P26K95n94o5N64N3n03j55M14K03k33j83l4J26L54j95
3254A97n08JQ16K40r40n10J100N65j271o78J309J062j340j345R71J623n65j388
3272f61Q4J132J40r93l48Q86N67l50j012k08R83P72p34j133N48J273m46j587M23
3291f64J768r6j744k71J444M20j233l30J156K10j006l11Q15K54n13j15K88j19
3309d7j87J77J29k29J66K24l33k96K96L84o04j77R23K87j392n29J399Q64j354
3328b99p78J335O76j490r59J651J185j171j305O34R94k62m59J13L17J3k25m41
3346d71k02Q44Q89p74j538N95J687l74j796L78K035k09k088k78K054L83j565l49
$$ plain form
3364 -779 474 747 -387 -688 158 616 173 -67 -19 -229 -93 268 92 -146 271 527 -248 -743 150 922
3384 922 55 -448 276 698 -534 -850 690 1253 -168 -988 206 821 -258 -692 623 1087 -110 -942
3402 -942 -78 631 256 -147 -52 39 77 254 -122 -541 238 1173 391 -1238 -566 1196 653 -1173 -586 1456
3422 1456 878 -1457 -1257 988 1241 -523 -843 382 423 -588 -606 283 441 121 -147 -432 -596 -25 599
3441 599 74 -562 -44 429 -471 -912 274 1053 -74 -882 -67 463 -377 -656 460 720 -456 -975 29
3460 29 588 -230 -551 320 541 -332 -768 -207 337 198 -31 -149 -196 -59 63 -271 -410 403 876 -178
3480 -178 -1328 -340 1158 574 -945 -318 1085 379 -1310 -680 1214 1061 -633 -926 223 563 -40
3497 -40 -182 294 325 76 -167 -364 -202 569 730 -300 -692 283 777 -287 -691 441 982 -223 -887
$$ packed form
3364g79J253K73j134l01Q46M58m43k40M8k10J36L61j76k38M17K56p75m95Q93P72
3384I22q67n03P24M22j232l16J540N63j421q20J194O15j079m34J315M64j197q32
3402i42Q64P09l75m03R5R1L8J77l76m19P79R35p82j629O72J762n43j826N87K042
3422A456n78k335K00K245K53j764l20J225M1j011j8Q89J58l20k68k85j64N71O24
3441E99n25o36N18M73r00m41J186P79j127q08Q15N30q40k79J116K60j176n19J004
3460B9N59q18l21Q71K21q73m36N61N44j39k29j18m7J37J22l34j39Q13M73j054
3480a78j150R88J498n84j519O27J403p06j689O30J894j53j694k93J149L40o03
3497d0j42M76L1k49k43j97J62P71J61j030l92R75M94j064m04J132N41j205o64
$$ plain form
3516 -887 137 711 -52 -511 480 749 -276 -635 163 575 -24 -130 269 315 -311 -404 91 465 294 51
3536 51 -281 -278 115 362 -20 -195 271 465 -377 -890 175 1080 236 -1000 -485 776 423 -767 -469 742
3556 742 591 -685 -868 223 759 -33 -632 -270 326 316 -318 -657 -140 579 295 -643 -544 402 410 -600
3576 -600 -717 460 755 -375 -958 -86 554 45 -391 30 262 -237 -500 -61 303 220 -115 -289 -155 7
3596 7 32 0 18 175 -79 -373 -164 312 372 -262 -361 118 327 -193 -382 198 503 -107 -620 -128 679 352
3618 352 -621 -492 469 706 -306 -651 88 672 106 -502 -11 625 303 -421 -515 264 765 257 -579 -357
3638 -357 530 566 -189 -367 355 639 -189 -631 113 841 350 -489 -252 292 347 -93 -50 242 293 -72 -296
3659 -296 18 384 314 -234 -183 119 153 -119 36 274 55 -339 -172 238 224 -220 -236 100 244 -30 -335 -10
$$ packed form
3516h87J024N74p63m59R91K69j025l59P98M12n99j06L99M6o26r3M95L74j71k43
3536E1l32LL93K47l82j75M66J94q42n13J065R05q44j236N15J261l53j190K98J211
3556G42j51j276j83J091N36p92n99L62N96j0o34l39N17P19k84r38R9R46Qj010
3576f00j17J177K95j130n83Q72O40n09m36M21K32m99k63M39L64q3l35j74J34J62
3596GK5l2J8J57k54k94K09M76O0o34r9M79K09n20j89N80L05o10n13M92Q07l27
3618C52r73J29R61K37j012l45P39N84n66o08M91O36l22p24r4P79N01n08q36K22
3638c57Q87L6p55j78P22K84q28m42P44P28m91q39K37N44N5m40M3K92N1l65k24
3659b96L14L66p0n48N1L02L4k72J55K38k19l94J67M10j4m44j6L36J44k74l05L25
$$ plain form
3681 -10 258 6 -386 -323 274 470 -366 -726 -26 640 182 -654 -384 411 272 -454 -390 322 483 -333 -805
3702 -805 -162 593 389 -419 -579 62 443 -120 -548 42 515 -21 -736 -343 566 437 -340 -518 47 326
3722 326 -114 -233 -13 229 -38 -366 -249 204 270 -119 -294 -10 119 -87 -109 33 273 -131 -246 41 301
3743 301 16 -264 -6 276 125 -260 -145 276 386 -113 -424 196 606 98 -467 -101 608 460 -369 -388
3763 -388 394 595 -119 -416 173 561 148 -366 -261 417 642 -87 -602 -112 588 367 -396 -288 487 520
3783 520 -369 -575 314 696 -22 -494 -127 448 183 -244 -50 251 312 -195 -330 -29 362 144 -192 -197 64
3804 64 34 -209 -100 278 113 -286 -259 163 160 -266 -179 126 71 -327 -353 182 362 -167 -471 -96 291 108 -306
3827 -306 -276 92 156 -209 -399 -88 289 124 -374 -390 150 433 -155 -552 -109 525 173 -713 -411 442 442 -459
$$ packed form
3681a0K68k52l92O3N97J96q36l60P00O66m58q36K70P95j39p26O4P12J61q16m72
3702h05O43P55k04q08j60O41L81n63m28N90M73n36p15L93R09j29p77j78N65K79
3722C26m40j19K20K42k67l28J17M53O6l89j75K84J29k06k2J42K40m04j15K87K60
3743C01k85k80K58K82j51l85J15M21J10m99l11O20M10n08n65L66P09j48q29j9
3763c88P82K01p14k97N89L88m13n14J05O78K25p29n15M90P00k21p63J08P75L3
3783E20q89k06Q89L82p18m72L67N75k65m27J94L01O1n07j35L01L91k18l36nK61
3804F4l0k43J09L78j65l99K7M22lm26Q7L05n5l98k6N35J80n29l04L75L87j83m14
3827c06L0L68O4l65j90L11L77j65m98j6N40K83n88l97M43O34l52q86L02Q53%r01
$$ plain form
3849 -459 -635 314 563 -217 -617 39 510 93 -438 -188 200 209 -105 -247 -67 300 107 -256 -277 228 343
3870 343 -108 -262 76 233 -156 -205 305 281 -199 -304 178 303 -70 -118 214 193 -181 -182 222 321 -5 -183
3892 -183 -44 209 282 106 -144 -78 227 227 -126 -214 356 523 -209 -630 169 828 129 -667 -154 571 177 -513
3914 -513 -201 577 431 -395 -488 103 343 192 -75 -245 -63 231 86 -331 -115 405 249 -575 -477 428 530
3935 530 -304 -538 150 340 -329 -435 213 297 -243 -291 253 147 -365 -307 186 157 -236 -136 120 -151 -286
3956 -286 -31 230 -34 -171 -70 -276 -299 204 504 -193 -558 6 345 -187 -486 305 694 -270 -926 -99
3976 -99 634 161 -464 -175 292 -31 -364 -86 250 196 88 -111 -419 -133 513 365 -433 -368 556 356 -638
3997 -638 -406 725 647 -557 -543 475 587 -350 -415 428 432 -248 -134 315 21 -199 124 411 52 -271 197
$$ packed form
3849d59j76R49K49p80m00O56M71m17n31K50L88Rl14j42J80L67j93l63k1N05J15
3870C43m51j54L38J57l89m9N10k4m80j05M82J25l73m8L32k1l74jM04R9l26j78
3892a83J39K53P3j76k50O6L05%l53q8N70J67p32m21P99O59o99p96N13P25l94o90
3914e13L12P78j46q26r3N91K40j51k67j70J82K94j45m17K16N20j56q24R8R05J02
3935E30q34k34O88J90o69j06O48Q4n40m8N44j06n12N8M93k9l93J00K56k71j35
3956b86K55K61k64j37J01k06k3N03L00o97l65N64L39n32k99P91L89r64o56Q27
3976i9P33m73o25K89M67l23l33K78L36n4j08j99l08K86O46j48p98O5R24k00r94
3997f38K32J131p8j204J4J018J12r37o5Q43Mo80J14M49k94k20L23K87l59l23M68
$$ plain form
4018 197 164 -277 -21 534 172 -357 -161 357 52 -205 357 453 -258 -536 296 533 -228 -462 330 551 -334
4039 -334 -528 279 568 -188 -403 230 346 -6 -168 2 117 72 143 -129 -339 -114 419 184 -529 -158 648
4060 648 209 -766 -463 644 526 -545 -462 347 255 -568 -351 381 334 -252 -281 -55 -143 -126 299 151 -337
4081 -337 -210 57 -94 -378 20 418 -139 -547 -78 279 -226 -366 257 364 -410 -498 176 376 -348 -275 464
4102 464 193 -583 -551 297 431 -135 -170 -6 -68 -238 -25 187 93 184 68 -358 -452 162 648 194 -429 -159
4124 -159 418 50 -546 11 745 319 -542 -465 327 481 -180 -122 262 262 -147 -185 46 229 349 121 -128 -287
4146 -287 -10 344 67 -62 217 393 -180 -452 71 515 61 -166 179 219 -199 -303 320 439 -70 -123 95
4167 95 9 -339 -33 469 300 -245 -260 -108 -3 114 131 86 -153 -48 -10 -180 -141 291 319 -200 -577 -3 396
$$ packed form
4018A97l3m41K56N55l62n29J96N18l05k57N62R6p11k78Q32K37p61k34P92K21q85
4039c34j94Q07K89p56k15O33J16l52j62J70J15m5P1k72k10K25N33k35p13L71Q06
4060F48m39r75L03J107j18j071Q3Q09r2q23K17P32m7n86k9K26q8J7M25j48m88
4081c37J27K67j51k84L98L98n57m08M69L57n05j40O23J07p74q8O74K00p24P3P39
4102D64k71p76L2Q48J34n66l5J64o2j70K13K12r4R1j16m26r4O14M86m54o23K70
4124a59N77l68n96N57P34m26q61P7P92J54o61N8L84%m09l8K31J83J20k28k49j59
4146b87K77L54k77j29K79J76n73k72N23M44m54k27L45M0m18j04O23J19n09n3K18
4167I5q6l48L06N02j69n45j5J52J05J17J7m5k39J05L8j70L9M32K8n19l77N74L99
$$ plain form
4190 396 -52 -414 -47 338 72 -431 -283 222 266 -147 -315 -24 166 -120 -352 -120 168 190 -149 -344 -161
4211 -161 113 167 -161 -138 43 131 -216 -406 39 358 129 -366 -186 42 -10 -159 107 214 -84 -329 -160
4232 -160 80 55 37 144 88 -159 -204 115 179 11 -99 -123 28 96 74 -29 -13 82 112 -133 -135 85 174 -75 -184
4257 -184 85 317 146 -271 -229 228 346 35 -198 44 234 3 -268 12 461 305 -276 -304 88 354 177
4278 177 -99 -50 164 78 -79 -113 171 367 45 -258 -200 303 285 -161 -171 153 120 -148 -55 176 129 -122 -54
4301 -54 67 23 -60 75 60 -114 -135 43 224 -109 -161 -77 -69 43 121 18 -161 -131 113 81 -160 -31 125 -42
4325 -42 -399 -214 238 280 -258 -327 -112 149 102 -249 -119 75 -28 -312 -209 179 244 -12 -405 -246 106 178
4347 178 -29 -184 -61 153 -39 -311 -25 213 162 -251 -296 106 260 -11 -238 -65 109 -62 -123 98 140
$$ packed form
4190C96m48l62L67L85k66n03J48N05M4m13j68K91J90k86k32K32K88K2l39j95J83
4211a61K74N4l28K3J81Q8l47j90M45L19k29m95J80K28n2j49K66J07k98k45J69
4232a60K40k5j8J07n6k47m5L19O4j68j10k4J51O8k2j03J6R5L0k45kK20Q9k49j09
4257a84K69K32j71m17M2M57J18l11k33K42J90k31k71K80M49j56n81k8L92K66j77
4278A77k76M9K14q6j57l4K84J96l22l03N8N03j8m46j0L24l3k68R3K31m7k51O8
4301e4J21m4q3J35j5j74k1J78J81l33n2Q4QJ12P8j03j79L0K44l2k41J29J56j67
4325d2l57J85M52M2n38o9K15K61m7l51J30J94j03k84J03L88O5k56l93J59L52P2
4347A78k07j55J23K14j92k72K86K38n1m13m5M02J54k71k27J73J74j71o1K21M2
$$ plain form
4368 140 -12 -79 65 4 27 142 -2 -106 -76 136 139 -3 -57 -46 -9 79 188 193 -26 -95 65 123 -4 82 247
4393 247 102 -152 -172 259 356 87 -179 -24 173 146 23 25 172 93 -80 -126 -22 317 226 -176 -191 84 315
4416 315 109 -199 -26 197 119 -209 -107 255 247 -188 -264 45 205 54 -76 -12 0 -44 -32 1 -44 22 -5 -119
4440 -119 -151 -42 87 38 -169 -198 3 43 -20 -6 -29 -104 -30 63 56 -89 -72 31 0 -155 -76 51 68 -139 -272
4465 -272 4 235 16 -235 -197 56 73 -56 -73 -7 80 -21 -181 -159 106 237 -127 -269 -19 243 39 -169
4487 -169 -167 177 101 -160 -208 157 185 -28 -140 -144 99 121 97 -65 -40 29 104 -98 -81 173 184 -66 -181 54 223
4512 223 63 -64 6 38 33 58 127 87 -37 8 179 91 -60 113 195 17 -120 28 138 117 -10 -66 44 112
4536 112 117 -32 -58 -80 105 73 -53 -77 110 193 -25 -256 25 277 55 -216 -95 180 135 -153 -240 92 168
$$ packed form
4368A40j52o7J44o1K3J15j44j04L0K12Lj42n4J1L7Q8J09Nk19o9J60N8j27Q6J65
4393B47j45k54k0M31R7k69k66J55J97k7j23KJ47p9j73m6J04L39r1m02j5K75K31
4416C15k06l08J73K23p8l28J02L62qm35p6L09J60j51j30O4J2m4J2L3m5O6k7j14
4440a19l2J09J29m9k07k9K01M0o3J4k3p5P4R3pj45J7J03l1j55P9J27J7k07j33
4465b72K76K31k19k51L8K53J7j29j7O6Q7j01j60K2K65J31l64j42K50K62k04k08
4487a69KL44p6k61m8L65K8k13j12mK43K2k4j62K5O9P5k02J7K54J1k50j15K35J69
4512B23j60j27P0L2nK5O9m0j24M5J71q8j51J73Q2j78j37J48J10k1j27n6J10O8
4536A12Nj49k6k2J85l2j26k4J87Q3k18k31K81K52k22k71J21K75m5k88q7L32P6
$$ plain form
4559 168 -66 -226 -58 77 41 -66 -179 -89 165 30 -183 -134 63 17 -102 -158 12 99 -96 -223 -80 73
4581 73 -49 -20 -38 -61 -148 7 89 -54 -206 14 15 -141 -173 33 105 -106 -231 -70 29 -3 -26 -6 18 -107 -59
4606 -59 -16 -84 -79 135 109 -116 -308 35 234 39 -160 -64 175 -7 -154 -17 155 106 -40 -123 9 104 132 65
4630 65 -31 39 146 118 -140 -116 192 243 -51 -102 94 158 -34 -103 150 228 79 -135 -89 65 86 125 130 -42 -68
4655 -68 0 179 53 -11 193 103 -95 -143 85 247 100 -83 -65 36 -90 -44 56 113 -22 42 25 -146 -183 153
4679 153 281 6 -284 -40 143 49 -125 -6 176 0 -248 -160 79 57 -20 -19 -193 -108 67 44 -160 -111 202
4702 202 152 -231 -309 34 245 -78 -202 60 165 -158 -367 -43 131 -9 -71 -122 -100 -213 -21 142 15 -104
4724 -104 -101 58 -197 -200 103 239 -22 -234 -66 96 -37 -93 73 69 -113 -179 18 83 -36 133 199 -62 -293
$$ packed form
4559A68k34j60J68J35l6j07j13R0K54j35k13M9J97m6j19n6J70Q7j95j27J43J53
4581G3j22K9j8k3q7J55Q2j43j52K20Jj56l2K06P2k11j25J61R9l2k3K0K4j25M8
4606e9M3o8NK14k6k25j92L43J99j95j99R6K39j82j47J37J72m9j46q3J32R5K8o7
4630F5r6P0J07k8k58K4L08N1k94n1J96O4j92o9K53P8j49k14M6J54K1L9Nj72k6
4655f8O8J79j26o4K04r0j98m8K28J62j47j83J8J01j26M6J00N7j35O4j7j71l7L36
4679A53J28k75k90K44J83r4j74J19J82j76k48Q8K39k2p7Jj74Q5J75k3k04M9L13
4702B02n0l83p8L43K11l23j24K62J05l23k09L24J74j40o2n1K2j13J92J63j27j19
4724a04LJ59k55lL03J36k61k12J68J62j33n6J66mj82o6J97O5j19J69O6k61k31
$$ plain form
4747 -293 -6 284 31 -114 8 157 8 -218 50 217 6 -39 61 53 -79 11 127 -47 -62 208 236 -123
4769 -123 -324 139 350 63 -225 88 215 -117 -254 133 388 46 -170 -31 -4 -30 159 241 -39 -190 56
4790 56 158 -130 -137 234 314 -133 -294 31 249 33 -76 106 103 -126 -145 107 49 -72 61 158 -109 -190 107
4813 107 151 -122 -170 170 197 -186 -272 -30 146 6 -135 58 -8 -245 -31 116 8 -103 132 51 -260 -309
4835 -309 124 331 -145 -346 -90 75 -175 -244 171 248 -179 -303 -97 90 -22 -26 25 -99 -236 5 123 -113
4857 -113 -189 136 91 -196 -249 154 180 -157 -89 138 148 -149 -68 56 18 -53 32 121 -120 -209 68 188 -83 -66
4881 -66 186 56 -275 -150 229 206 -105 -35 56 -16 -88 69 216 47 -113 49 78 -28 -91 269 200 -169 -250
4904 -250 144 189 3 -9 113 80 -112 -94 83 111 87 1 33 -105 11 195 101 -86 -78 188 155 -126 -133 215 222
$$ packed form
4747b93K87K90k53j45J22J49j49k26K68J67k11m5J00qj32R0J16j74j5K70K8l59
4769a23k01M63K11k87k88L13J27l32j37L87K55l42k16J39K7k6J89Q2k80j51K46
4790E6J02k88pL71Q0m47j61L25K18k16j09J82lk29j9K52n8j21J33R7k67q1K97
4813A07M4k73m8L40K7l83q6K42J76j40j41J93o6k37K14J47j08j11K35q1l11m9
4835c09M33K07m76k01K56J65k50o9M15P7m27j24K06J87j12mN1j24j37K41J18k36
4857a13p6L25m5k87n3M03K6l37O8K27J0k97Q1J24l8p1Q5Q9k41q9K77J20k71J7
4881f6K52j30l31J25L79k3l11P0R1p2p2J57J47j69j60J62K9j06o3L60o9l69q1
4904b50L94M5j86j2J22l3j92J8J77K8k4q6L2j38J16J84r4j87QK66l3k81pL48P
$$ plain form
4929 222 -182 -209 93 14 -134 -103 35 87 38 -47 -31 -172 -67 191 48 -187 -111 103 -15 -263 -78 236 89
4952 89 -250 -151 -28 45 -91 -65 15 -95 -177 -62 71 -46 -28 41 -74 -229 -41 108 25 -149 -103 -14 22 -60
4976 -60 -106 -56 0 17 -101 -68 -65 5 3 -1 -151 -39 89 57 -161 -48 157 102 -128 -126 50 135 -54 -99 -6 86 14
5003 14 11 -67 16 91 134 59 -74 81 176 7 -174 -10 196 103 -155 -108 195 136 5 -20 43 62 26 1 113 79
5029 79 34 140 36 6 85 149 92 -60 -7 80 34 -23 -14 49 90 9 -17 -33 45 102 54 -35 -27 76 115 -26 -129 -2
5057 -2 104 74 -155 -79 19 44 -51 -138 -20 97 -24 -130 -69 36 44 45 -118 -114 32 46 -79 -202 -28 77 -40
5082 -40 -205 -75 103 39 -192 -174 -14 12 -25 -74 -65 -31 8 -78 -104 -59 -70 29 -62 -131 -52 97 42 -106 35 39 -56
5109 -56 -33 3 88 -9 0 5 -43 -49 21 95 -37 -122 -62 79 27 -75 -101 90 40 43 -124 -6 132 1 -25 -93 94 102
$$ packed form
4929B22m04k7L02p9j48L1J38N2m9q5J6j41J05K58j43k35P6K14j18k48J85L14j47
4952H9l39R9J23P3j36K6Q0j10q2J15J33j17J8O9j15j55J88J49q3j74M6Q9L6q2
4976f0m6N0N6J7j18L3LP0kmj50J12J28l2k18J13K05n5k30KJ76Q5j89m5R3R2p2
5003A4lp8Q3P5M3p5j33J55R5j69j81J64K06r3k58M7L03n9j31k5O3J9l6k5J12l4
5029G9m5J06j04l0P9O4n7j52N3Q7m6n7RO3M1q1k6j6P8N7m8q9QJ03L9j41j03J27
5057bJ06l0k29P6R8K5r5q7J18J17j21j06O1J05QJj63MJ46J4j25j23J74J05j17
5082d0j65J30J78o4k31J8J60K6l7m9RL4L9q6k6M5j1R9r1o9P9J49n5j48J41Mr5
5109e6K3L6Q5r7RNm8oP0P4j32q5O0J41n2j02k6J91n0Lj67J18J38j31k6o8J87Q
$$ plain form
5137 102 40 -89 -45 97 124 -36 -1 108 165 29 -114 -35 170 125 -68 -133 117 197 5 -58 -32 107 99 4 -10
5162 -10 35 110 54 -33 41 96 122 -33 -105 -5 152 49 -48 17 99 45 -56 69 31 -50 15 25 -7 -83 53 134 -13
5189 -13 -110 -43 8 16 -41 -74 9 -49 -123 -110 -67 23 11 -67 -160 -68 107 102 -137 -204 30 105 12 -103 -34 109 -32 -139
5217 -139 -85 91 119 -138 -194 -9 45 55 -44 -125 -13 99 -4 -61 -17 43 -10 -180 -186 5 143 -12 -186 3
5241 3 52 7 -77 16 71 -3 -100 -38 41 -1 20 68 -24 -100 -9 71 10 -34 42 86 94 42 5 2 36 36 43 57 20 48 126 3
5273 3 -104 176 205 -57 -115 10 123 61 -82 46 155 45 -63 -26 146 182 28 -145 -73 -28 127 106 -37
5296 -37 -40 86 75 -143 -116 196 206 -71 -163 27 162 -49 -184 2 77 -31 -90 20 9 -1 -51 -6 29 18 2
5321 2 -57 -137 -95 47 119 -53 -129 -78 -8 15 -13 -6 -48 -156 -44 69 -2 -88 57 23 -149 -189 -68 163 -5 -178
$$ packed form
5137A02o2j29M4J42K7j60L5J09N7j36j43P9K05m5j93o5K50Q0j92o3K6J39qr5j4
5162a0M5P5n6q7P4N5K6j55p2J00J57j03r7O5Q2n4j01J25l8q1O5J0l2p6J36Q1j47
5189a3r7O7N1Qn7l3Q3n8p4J3M3R0j2p8r3R2J75nk39o7K34P5r3j15O9J43j41j07
5217a39N4J76K8k57n6J85N4J0r9q1J12J12j03n7M4O0n3j70oJ91J38j55j74J89
5241CM9m5q4R3N5p4r7O2P9m2K1M8r2p6R1Q0o1m4P6M4Qn2l7lL4%PJ4l7K8P8j23
5273Cj07K80K9k62n8J25J13o2j43J28J09j10j08L7J72L6j54j73P2M5J55k1j43
5296c7lJ26j1k18K7L12J0k77r2J90J35k11j35J86P5j08n9J10j1j0n0M5L5j1j6
5321Bn9q0M2J42P2j72p6N1P0K3k8Pm2j08J12J13p1q6J45l4j72m0J21K31j68j73
$$ plain form
5347 -178 -143 50 -9 -111 -11 38 55 -76 -113 -101 33 24 -7 -158 -29 42 48 -121 -173 155 203 -82 -162 42 141
5372 141 -46 -101 29 162 51 -114 -74 50 140 57 15 14 -17 -24 118 116 48 95 48 -84 -44 144 132 57 -24 -9 -17
5399 -17 -10 34 227 98 -64 -57 55 55 -43 67 157 6 -153 6 167 79 -41 -8 46 46 -51 -104 42 98 64 -49
5425 -49 -87 -96 42 54 -34 15 90 156 -113 -199 0 253 88 -128 -43 105 -111 -176 -24 206 68 -112 -97 -101 -9
5450 -9 29 109 28 -50 -28 -112 -125 -59 133 121 -187 -266 -46 57 -69 -95 4 -18 -102 -155 107 51 -85 -86 59 16 -197
5477 -197 -78 102 -15 -201 -71 153 28 -203 -111 88 58 -36 27 -38 -51 -69 94 -19 -74 22 87 -155 -210 132
5501 132 293 64 -243 -5 186 0 -105 88 230 -7 -156 -3 120 91 27 56 -23 -57 55 118 -71 -20
5523 -20 132 205 -117 -180 144 192 -84 -120 145 169 -126 -73 157 107 -43 15 185 77 -188 -69 130 111 -125
$$ packed form
5347a78L5J93n9j02J00M9J7j31l7J2J34rl1j51J29P1Oj69n2L28M8k85q0K04R9
5372A41j87n5J30J33j11j65M0J24R0q3m2jl1pJ42ko8M7m7j32M0J88j2p5q1J5q
5399a7PM4J93j29j62PJ12%r8J10R0j51j59J59J61q8j20L3N4%r7n3J46N6l4j13
5425d9l8rJ38J2q8M9P5O6k69q6J99K53j65k16Q5J48k16o5J52K30j38j80J5mR2
5450iL8Q0q1p8K2q4j3O6J92j2l08p9K20J03j26k6R9k2q4n3K62n6j36jJ45m3k13
5477a97J19J80j17j86J30K24j25k31R2J99l0r4O3o5j3j8J63j13n5R6O5k42n5L42
5501A32J61k29l07K38J91j86j05J93J42k37j49J53J23k9o4K9p9l4J12O3j89N1
5523b0J52P3l22o3L24M8k76l6K65K4k95N3K30n0j50N8J70j08k65J19J99j9k36
$$ plain form
5546 -125 26 131 -24 -130 60 181 41 -129 30 16 -90 110 179 -5 -162 -14 152 -100 -176 165 226
5567 226 -157 -263 71 169 -112 -171 70 186 -23 -142 -18 92 -76 -15 -20 -71 -95 27 -1 -128 -67 116 81
5590 81 -322 -167 122 136 -137 -119 69 5 -258 -134 113 26 -62 -93 50 -28 -136 32 179 18 -74 -18 65 -77
5614 -77 -19 94 68 -115 -134 116 -29 -35 97 20 -38 -120 70 197 -124 -109 94 225 -115 -152 164 150 -54 -116
5638 -116 102 142 -64 -40 3 77 81 16 139 -54 19 78 97 -62 43 187 33 -246 -65 305 170 -160 -57
5661 -57 181 132 -76 -8 157 71 -49 -51 30 35 53 7 85 50 -24 66 13 -11 29 58 -40 -118 27 96 -24 -79 29 85
5689 85 -73 -94 63 -3 -115 -142 107 58 -162 -99 12 125 -127 -101 22 -5 -118 -127 -39 29 -32 -17 -146 -70 66
5714 66 167 -89 -155 67 80 -114 -185 -93 185 37 -218 -109 116 86 -95 -119 31 123 -60 -86 -20 -1 -41 -51
$$ packed form
5546a25J51J05j55j06J90J21j40j70J59j4j06K00O9j84j57J48J66k52p6L41O1
5567B26l83j06L34R8k81n9K41J16k09j19J24J10j68O1nn1k4J22k8j27O1J83l5
5590H1m03J55K89J4k73J8J88o4k63J24K47q7q8l1J43p8j08J68J47j61r2N6Q3j42
5614g7N8J13k6j83j9K50j45oJ32p7n8q2J90J27l21J5K03J31l40l7L16j4k04o2
5638a16K18M0k06K4M3P4Mo5J23j93P3N9J9j59J05J44j54k79J81L70j35l30J03
5661e7K38m9k08O8J65q6j20kQ1NJ8m6P8l5p4R0n3k4M0K9r8p8J45O9j20n5J08N6
5689H5j58k1J57o6j12k7K49m9k20O3J11J13k52K6J23k7j13rQ8O8o1J5j29P6J36
5714F6J01k56o6K22J3j94p1R2K78j48k55J09K25l0j81k4J50R2j83k6O6J9m0j0
$$ plain form
5738 -51 -80 -12 79 -2 -45 -102 88 -21 -82 -74 -19 71 -11 13 92 110 -80 -62 53 10 -51 -28 19 -19 -49 -18 63 64 -41
5767 -41 -37 28 82 48 -53 1 62 63 -43 -89 50 25 41 -54 -46 113 115 51 -72 34 137 32 -131 -44 108 90 -65
5794 -65 -75 65 116 -29 -89 -7 87 76 -68 -54 24 119 2 -50 -41 37 42 -47 -35 75 60 -16 -72 101 45 -66 -74 -16
5822 -16 9 -29 -79 -16 -15 -70 -34 -58 21 -24 21 -40 -12 25 -44 -123 5 72 -93 -113 -79 60 -5 -85 -23 45 1 -89 -155
5851 -155 72 178 -47 -117 -65 66 30 -66 -77 25 59 -43 -118 -76 86 6 -117 -65 68 87 -29 -163 -11 147
5875 147 8 -53 -97 -4 109 -19 -81 89 34 -50 -112 28 49 23 1 34 43 91 41 -33 46 91 2 3 31 26 40 66 6
5904 6 66 20 -34 -4 41 65 -36 16 70 138 -29 -55 -1 118 -20 -40 -2 68 44 -50 -47 39 103 6 -68 -111 93 95 -109
5933 -109 -52 45 78 -96 -54 -25 78 -23 -123 -135 83 72 -20 -71 -20 111 -45 -132 -58 54 80 -99 -83 60 -6
$$ packed form
5738e1k9O8R1q1m3n7J90j09o1QN5R0q2K4P9J8j90J8J15m3o1K3M7l8l0L1Q1Jj05
5767d1MO5N4l4j01N4O1Jj06m6J39k5J6r5QJ59Ko4j23J06J03j05j63Q7J52j8j55
5794f5j0J40N1j45o0Q2R4j1j44J4P8R5j17n2RP8Nq9J2J10j5p6n6J73n6j11qN8
5822a6K5l8n0O3Jn5L6k4P9m5M5o1K8L7o9p9J28O7j65k0L4J39o5q0O2O8m4r0o6
5851a55K27J06k25p0N2J31l6r6j1J02L4j02p5M2J62q0j23N2J33J9j16j34J52J58
5875A47j39o1m4R3J13j28o2J70n5q4o2J40K1k6k2L3RM8n0p4P9M5q9JK8nJ4K6o0
5904FO0m6n4L0M5K4j01N2N4O8j67k6N4J19j38k0L8P0k4r4LQ6O4r7p4m3K04Kk04
5933a09N7R7L3j74M2K9J03j01j00j2K18j1r2n1N1J31j56q7P4J12K6j79J6J43o6
$$ plain form
5958 -6 -83 -72 -30 -25 -23 -142 27 -17 -53 -36 -3 -10 -46 -74 -39 -2 -17 11 -19 -3 -52 32 -86 -55 74 26 -80 -139 62
5987 62 99 -115 -49 67 38 -129 -175 61 77 36 -53 -74 29 -5 33 -51 17 19 -1 -65 -118 51 164 -3 -206 -10
6013 -10 193 4 -175 38 222 130 -99 -95 108 30 -45 16 167 49 -75 24 35 39 75 179 38 -58 27 87 17
6038 17 -58 59 113 -66 -94 84 90 -96 4 60 78 -99 -82 152 164 -64 -99 132 77 -122 -25 86 84 -71 -82
6063 -82 -41 9 18 41 22 -13 -6 58 -60 -141 94 154 -78 -240 -13 164 -18 -226 -7 216 -6 -234 -31 87
6087 87 26 -84 5 31 -107 -112 -47 -62 -82 67 15 -163 -124 24 113 -76 -94 111 35 -205 -109 139 21 -141 -128
6112 -128 123 8 -217 -22 213 71 -127 -65 83 -107 -132 29 71 61 -101 -33 -15 -4 60 79 -16 -135 103
6135 103 138 -81 -142 90 223 -96 -155 25 232 -40 -146 116 206 5 -175 43 140 -8 -34 14 10 -14 -56 56
$$ packed form
5958fp7J1M2NKj19J69m4l6J7L3pl6k8L5L7j5K8l0J6m9Q4j18L1J29m8j06n9K01
5987F2L7k14O6J16k9j67m6K36J6m1q9k1J03l4L8q4O8Kk0o4n3J69J13j67k03J96
6013a0K03j89j79K13J84r2k29MK03p8p5O1J51j18j24R9J1ML6J04j41r6Q5O0p0
6038A7p5J17N4j79k8J78Oj86J00N6J8j77J7K34J2k28l5K31n5j99R7J11kj55j1
6063h2M1N0RK3j9l5PO4j18q1K35O0k32j62K27J77j82k08K19K23k22k28K03J18
6087H7o1j10Q9K6j38nO5j5k0J49n2j78L9J48Q9j89j8K05p6k40R6K48j18j62J3
6112a28K51j15k25J95K35j42j98O2J48j90k5J61M2j0j62O8J8J1O4J9r5j19K38
6135A03L5k19o1K32J33l19n9J80K07k72j06K62R0k01j80K18R7j48k6M8mk4m2J12
$$ plain form
6159 56 -4 -43 158 54 -153 -71 193 207 -122 -77 155 80 -149 -68 196 133 -150 -39 115 24 -125 61 126 67
6183 67 -120 -61 79 -4 -5 42 24 -47 -108 61 0 -25 27 80 -113 -151 6 66 -63 -114 16 167 -110 -174 30 130
6209 130 -47 -121 21 55 -188 -121 -20 28 -27 -42 -50 -79 -62 24 7 -52 -52 114 -20 -180 -16 171 83 -239 -124
6234 -124 86 35 -187 26 124 73 -136 -160 1 22 -23 0 73 -51 -71 30 53 -13 -13 39 -45 -58 73 66 -7 -6 41
6261 41 61 -32 -65 45 59 -94 -136 106 122 -79 -109 91 112 32 -73 51 125 5 -77 62 43 33 -62 -51 45 125
6287 125 100 -36 -45 63 128 28 -107 44 174 4 -143 -50 139 101 -72 -11 48 78 -121 -74 100 83 17 -66
6311 -66 -52 45 19 -35 -27 -2 -34 29 3 -53 10 -16 -69 -56 37 31 -85 -124 12 -16 -19 -3 11 -11 -121 -142 20 60 -26 -117
6341 -117 -11 38 58 -105 -66 34 12 -107 -115 39 53 19 -111 -59 32 94 -10 -109 -12 110 -44 -142 -69 66 119
$$ packed form
6159E6o0l9K01j04k07Q2K64J4l29M5K32p5k29Q1K64o3k83J11J54r1j49J86O5n9
6183F7j87N9J40q3jM7j8p1o1J69o1k5N2N3j93l8J57O0j29n1J30J51k77o4K04J00
6209A30j77p4J42L4k43O7J01M8n5j5qk9J7Q6j7n9%J66j34j60J64J87q8l22J15
6234a24K10n1k22K13R8n1k09k4J61K1m5K3P3j24k0J01K3o6%N2q4j3J31pp3JM7
6261D1K0r3l3J10J4j53m2K42J6k01l0K00K1q0j05J24P4j20q2J39j9j0r5J1R6Q0
6287A25k5j36rJ08O5j00j35J51J30j70j47R3J89l8j73O1N9L0j99M7J74j7o6q3
6311f6J4R7k6n4QK5l2O3k6n6O3k6n3J3R3oj16l9J36k8lJ6J4k2j10k1J62M0q6r1
6341a17J06M9K0j63L9J00k2j19qJ54J4l4j30N2R1O2j04r9R7J22j54r8P3J35N3
$$ plain form
6366 119 -53 -109 66 34 -60 -86 4 56 -17 -26 27 73 38 -56 9 58 48 27 -75 -35 75 46 55 6 11 -16 24 -13 45
6395 45 49 18 -13 -16 69 6 -28 62 21 -26 -72 34 115 47 30 -32 74 112 2 -97 85 54 -4 -113 5 130 75 -31
6423 -31 -116 30 124 4 -139 -47 142 117 -110 -154 104 129 -41 -106 79 51 74 -84 -31 86 46 -116 -50 62
6447 62 3 -56 3 50 71 18 -34 -82 10 14 -22 -63 61 -9 -87 -78 -15 53 -40 -40 -93 45 -45 -85 -29 13 -7 -65 -30 26 -32
6478 -32 28 -69 -13 57 -25 -103 -76 0 94 -26 -143 -12 117 39 -115 -26 92 59 -55 -46 62 61 -40 -96 23 65
6504 65 -17 -145 -78 75 27 -46 -10 65 96 -5 -114 -2 117 29 -15 -21 60 91 -42 -32 43 109 43 -43 13 99 46
6531 46 -10 6 117 45 -30 38 79 28 -44 -34 45 57 31 -2 18 120 -18 15 16 27 69 -16 -22 -5 74 18 -110 -62 124
6560 124 53 -71 -23 77 20 -85 -88 0 124 -3 -47 -45 63 10 -60 -15 0 58 7 -77 -55 89 65 -81 -113 41
$$ packed form
6366A19j72n6J75l2r4k6R0N2p3rN3M6l5r4O5M9j0k1j02M0J10k9Rm9Nk7M0l7N8
6395D5Ml1l1lQ5o3l4R0m1m7m6J06Q1o8j7o2J06L8j10r9J82l1n8j09J18J25n5j06
6423c1q5J46R4j20j43R2J89k5k27m4K58K5j70o5J85k8K3j58N3J17m0j62O6J12
6447F2n9n9N9M7K1n3n2m8R2Ml6m1J24p0p8RO3O8r3%n3J38r0m0N6M2k0n8L5N6n8
6478c2O0r7N6P0q2p8K7P6R4j20j17J31J29p8j54Q9J18l3j14RJ08jj01n6J19M2
6504F5q2j28O7J53m8p3L6P5L1j01j09J12J19q8m4oQ1L1j33J0P5O6o6q6N6Q6n3
6531D6n6J6J11p2p5O8M1n1p2J0P9J2k6l3K0J02j38L3JJ1M2q5oJ7P9n6j28M8J86
6560A24p1j24M8J00n7j05lQ8J24j27m4KJ08n3p0M5J5N8n1q4K2J44k4j46l2J54
$$ plain form
6586 41 48 -47 -120 1 60 -35 -136 -52 23 -57 -66 -20 48 -33 -37 -61 -21 25 45 8 -66 -20 -8 -21 -44 9 86 -32 -66 -9
6616 -9 80 26 8 -4 117 27 -85 3 52 21 -96 -71 35 37 -44 -97 42 37 -39 -74 -56 107 34 -11 -17 65 -27 87 -92
6645 -92 -9 84 69 -57 -69 75 141 -3 -62 26 115 -39 -61 -24 118 46 -24 -3 80 7 -48 11 32 100 40 -25 -37 41
6673 41 62 18 -72 -2 43 -42 -126 -17 23 42 -71 -34 44 -35 -140 -16 116 36 -76 -86 -26 43 -74 -49 34 -35 -104
6700 -104 -88 -6 5 -14 -67 -79 37 46 34 -97 -30 52 68 -39 -146 51 112 -18 -152 22 127 -1 -189 -6
6724 -6 84 51 -101 -110 57 27 -17 -11 25 16 -70 -90 -97 -48 37 -4 -98 -17 56 14 -48 1 105 34 -82 -85 62 54 -38 3 50
6755 50 45 -135 -29 39 67 -24 -39 99 -15 21 -19 26 91 9 5 11 -41 55 37 -10 -29 89 110 -32 -46 25 142 -57
6783 -57 -89 41 123 16 -73 -24 152 8 -131 24 40 42 -10 -49 -37 36 43 26 -12 92 92 3 -69 -78 63 24 -40 -29
$$ packed form
6586D1Pr5p3J21N9r5j01Q4P5q0rM6O8q1mk4M0M6K0l7p4M6J2j3k3N3P7j18l4N7
6616iQ9n4j8j2J21r0j12Q8M9l1j17K5J06Kq1n3J39np6l5J8J63p3m5oQ2r2J14j79
6645i2Q3R3j5j26j2J44O6j44n9Q8Q9j54k2L7J42p2p0K1Q3p3n5N9K1O8o0o5j2P8
6673D1K1m4r0P0M5q5q4J09M0J9j13L7P8p9j05J24J32q0j12j0O0O9j17K5Q3o9o9
6700a04J6Q2J1j9n3j2J16Rj2j31O7Q2J6j07j07J97O1j30j34J74J05j28j88J83
6724fR0l3j52rJ67l0m4OL6rq6k0pM9Q5m1r4Q1P3m2o2M9J04p1j16lJ47qr2M1M7
6755E0nj80J06O8K8r1j5J38j14L6m0M5O5q2mOn2R6j8m7j9J18K1j42j4P1J17j99
6783e7l2J30Q2j07q9M9J76j44j39J55J6Kn2l9J2P3Pj7l8J04%q9p2rJ41l9o4J1
$$ plain form
6811 -29 106 49 -146 -53 41 37 -139 -47 72 -5 -53 -56 45 72 2 -72 124 49 -25 -53 20 -3 -41 7 -106 -127 19
6838 19 97 -24 -61 -4 39 -112 -91 56 166 -35 -163 -42 56 -14 -123 3 183 47 -133 -93 65 -9 -61 -65
6862 -65 -28 -63 3 -58 -6 54 137 44 -139 -73 111 78 -66 -51 135 70 -60 -107 80 53 -60 -24 46 31 -62 -12 32
6889 32 57 -17 -48 -4 10 -55 41 94 10 10 53 -1 -19 39 53 58 -23 23 118 18 -83 74 85 11 -139 17 159 15
6917 15 -102 5 192 59 -93 58 9 45 -16 2 -53 -21 3 -58 -16 -5 37 -4 -135 -21 152 21 -139 -46 130
6942 130 36 -78 -63 73 77 -29 -42 77 -16 0 -97 -6 -11 -36 -11 -16 -79 -1 -1 -17 -99 -44 -42 -64 -88 8 33 -43 -89 -18
6972 -18 35 -90 -30 65 23 -82 -98 -20 93 -43 -181 -12 -13 -37 -94 -13 44 15 -49 -93 -41 15 9 -54 -27 -5 33 -75
7000 -75 -132 -42 101 32 -118 -68 103 10 -110 -56 92 91 -12 -101 53 54 -25 -9 16 56 40 -25 -21 37 -12 -16 -36 11 62
$$ packed form
6811b9J35n7j95R3R4mj76R2J19p7m8lJ01K7p0p4J96p5p4k8P3k3l8M8j13k1J46
6838A9P8j21l7N7M3j51K1J47J10k01j28J21R8p0j09J26J80j36j80M0J58p4n2m
6862f5L7l5O6o1N2O0Q3r3j83O6J84l3j44J5J86o5j30m7J87k7j13L6P0j5r3N0M4
6889C2K5p4l1M4J4o5R6N3q4%M3n4j8N8J4Nq1M6R5j00j01J57J1p4j50J56J42j44
6917A5j17J07J87j33j52J51m9L6o1J8n5L2K4o1M2J1M2m1j31J14J73j31j60R3J76
6942A30r4j14J5J36Mj06j3J19r3J6r7R1nk5K5no3P8%j6q2N5Kk2k4R6K5p6m6P1
6972a8N3j25O0R5m2j05j6P8J13j36j38J69jk4n7Q1N7k9o4m4N2N6oo3K7K2L8j08
7000g5n7R0J43o9j50N0J71r3j20N4J48jj03q9J54Jp9J6K5M0j6o5MN8m9mk0M7N1
$$ plain form
7029 62 57 3 -10 59 43 37 -28 -19 33 15 -41 6 65 -44 -80 24 80 2 -82 8 8 -29 -36 72 75 54 -9 -79 -3 65 35 -39
7061 -39 -38 20 55 -2 -73 56 60 -20 -104 -41 63 53 -116 -131 78 63 -19 -75 17 129 19 -37 -3 -5 8 -57 -86 67
7089 67 46 -78 -52 1 6 6 -34 -96 -6 35 -81 -77 6 40 -57 -110 -77 -8 -1 -75 -36 71 -6 -42 -40 33 62 -38 -38 10 61
7120 61 -3 2 -25 42 13 -15 23 42 78 31 -82 4 55 -26 -86 -10 35 51 -42 -39 1 60 3 -65 0 63 74 -103 -28 59
7150 59 60 -5 -1 19 85 10 -2 -69 112 12 -8 -74 -18 93 21 -56 52 160 26 -71 -45 22 31 -73 -45 58 59 -25
7178 -25 -19 68 -2 28 -62 63 71 -85 -37 46 42 -13 -21 -30 74 -8 -39 -2 -72 33 30 -59 -27 79 107 -91 -59 37 -17 -83
7208 -83 -120 -43 22 -14 -125 -18 23 18 -69 -69 49 66 13 -80 -38 44 -9 -49 -56 48 36 -35 -44 -13 47 -81 -102 -115 82
7237 82 41 -70 -37 86 13 -34 4 23 36 -15 -46 -53 4 45 17 -25 56 20 -2 12 -9 -16 5 -76 25 103 -13 -45 -15
$$ packed form
7029F2nn4j3O9j6oo5RN2j8n6M7N9j09l6J04N6p8q4R0%l7pJ08Lk1o3p0P6O8l0p4
7061c9JN8L5n7p1J29Mq0q4O3J04j0j69j5K09j5q2n6R2J12j10n6L4kJ3o5k9J53
7089F7k1j24K6N3N%m0o2R0M1j16MQ3L4r7n3L3O9Pp4L9J07p7l6KP3K9j00%M8N1
7120F1o4Nk7O7k9k8L8J9L6m7j13Q6N1q1o0P6M5J6r3LM0N9n7o8O5O3J1j77P5Q7
7150E9Jo5MK0O6p5j2o7J81j00k0o6N6J11p2p7J08J08j34r7K6O7Rj04K8J03Jq4
7178b5OQ7p0L0r0J25Qj56M8Q3mn5qrJ04q2l1L7p0J05lq9L2J06K8j98L2R6n4o6
7208h3l7P7O5l6j11J07M1nq7%J18J7n3r3M2Q2n3m0pJ04j2p1rL1O0j28k1j3J97
7237H2m1j11L3J23p3m7L8J9J3n1l1pN7M1k8m2Q1l6k2J4k1pK1q1J01P8j16l2L0
$$ plain form
7266 -15 69 74 -41 -46 -33 105 -3 -57 44 64 -9 -71 17 68 10 -66 -36 -38 74 94 -10 -39 51 87 2 -49 47 83 15
7295 15 -67 -25 63 45 -72 11 48 17 -59 63 114 52 15 -9 44 5 44 -15 13 -53 3 25 -62 -31 23 14 -116 -47 -16
7324 -16 24 -129 -17 87 46 -102 27 62 2 -34 -69 -8 33 -55 -43 19 -22 -24 -29 36 74 -3 -70 -24 -28 24 56 -20 -86
7353 -86 106 53 12 -62 45 105 -29 -132 -8 88 8 -97 -54 47 -20 -116 -30 98 14 -27 -1 -20 9 -15 -15 -49 -15
7380 -15 51 36 -56 -14 63 41 -92 -51 60 17 -91 -25 80 30 -74 21 83 12 -27 -23 70 44 16 32 11 64 -17 22
7408 22 5 -49 44 1 4 -37 9 38 -44 -66 100 136 -56 -124 8 147 -7 13 50 119 -3 -65 -37 31 -8 26 -66 -18
7436 -18 12 42 -24 -1 70 86 -73 -38 -38 56 0 -8 37 72 6 -87 -24 19 10 -41 -10 60 -2 -52 -64 57 21 -83 -41 0
7466 0 -35 -1 61 23 8 -70 -27 1 -25 40 62 45 -21 4 24 -158 -40 63 91 13 -75 27 -2 -78 -83 34 55 -27 -91
$$ packed form
7266a5Q4Nj15nJ3J38j08n4J01K0p3o2Q8N1n8p6L0kJ12K0j04k9R0L6q5n1R6L6o8
7295A5q2M2Q8j8j17Q3L7l1p6J22N1o2l7k4N3l9L9n9K8o6N6K2q7L1N4rj30O9L1
7324a6M0j53J12J04m1j48J29L5o0l6l5O1M1q8J2O2m1knO5L8p7o7M6mN2L2p6o6
7353h6J92n3m1p4J07O0j34j03J24R6q0j05M3J01o7r6Q6J28q4m1K6j9K9k4%l4L4
7380a5O6j5r2M2P7k2j33M1J11m3j08O6J05n0j04R5O2p1l9MR3k6k8J6k1N3q1L9
7408B2j7n4R3m3Lm1M6K9q2k2J66L6j92o8J32J39j54K0L7O9j22o2K8O8l9L4r2M8
7436a8L0L0o6K3P1J6j59L5%R4n6qM5L5o6r3O3M3rn1L1P0o2n0j2J21l6j04M2M1
7466@l5L4O2l8j5p8M3K8k6O5K2j7o6K5K0j82J18J03K8p8q8J02k9p6nJ17K1q2o4
$$ plain form
7495 -91 -14 28 42 2 -54 -24 11 -44 -27 -32 57 69 -77 -82 20 46 52 -27 36 132 22 -61 23 100 1 -100 -93 75 3 -38
7525 -38 31 91 35 -10 -15 -11 35 43 64 51 -15 0 -43 -7 22 34 -14 -19 20 60 -37 -55 42 21 55 -51 -58 13 65 -9 4 32
7557 32 40 -49 -112 -18 102 7 1 -40 -5 20 0 -37 37 38 50 -88 -13 58 -2 9 -20 3 26 73 -81 -49 10 48 -76 -53
7587 -53 69 32 10 -42 -11 53 -78 -65 -72 86 6 -31 31 -57 -17 -122 -44 5 21 -30 -25 -50 -44 -18 -61 4 -45 13 -53 -48
7617 -48 0 -20 61 -103 -38 19 9 -5 -30 43 73 -51 -19 38 0 -12 -84 10 2 52 -50 -18 32 54 17 -53 -13 74 70 -10
7647 -10 -7 107 124 -50 -38 62 68 4 -9 -8 47 -24 -17 62 96 12 12 -17 4 -9 -42 15 7 15 35 -11 17 -20 29 -7 -67 -44
7679 -44 41 49 -75 -25 73 -50 -59 -12 4 39 -61 -6 39 -15 -72 -38 -47 8 -48 9 -25 62 16 -11 19 -77 -2 -11 -137 -66
7709 -66 60 23 -31 -55 29 -26 -94 -67 52 92 -63 -86 -25 10 -45 -78 7 44 0 -42 -41 -4 -52 18 -48 -25 3 42 -62
$$ packed form
7495i1P7M2J4m0n6L0L5n5J7nQ9J2j46nJ02K6Op9O3R6j10q3Q4P7r9j01PJ68p2m1
7525c8O9O0n6m5nMM6QK1j3o6J5m3L6K9J2m8nL9M0r7j8R7k1L4j06pP1N2p4J3K8
7557C2Qq9o3R4J20r5om1L5K5k0l7P4JJ2j38P5P1o0J1k9K3K3M7j54L2N9L8j24K3
7587e3J22l7k2n2L1O4j31J3pJ58q0l7O2q8M0j05P8M9J6n1Nk5OK6m3O5m9N8o6N
7617d8M8k0Q1j64O5N7j0j4k5P3L0j24L2N7l8j2p2R4qN0j02L2N0K2l7p0M0Q7mq0
7647a0LJ14J7j74J2J00Oo4j3JN5p1PP9L4q4%k9K1j3l3N7qQK0m6K8l7M9l6o0K3
7679d4Q5Qj24N0R8j23rM7J6L5j00N5M5n4n7L4rN5n6N7l4Q7m6k7L0r6P5rj26P1
7709f6J26l7n4k4Q4n5o8K7J19M0j55k3O1L5n5l3Q5L7m4m2JL7m8P0o6K3K8L9j04
$$ plain form
7738 -62 -53 -50 -3 46 -27 23 -29 -1 -52 9 -20 -2 -74 8 29 -26 -25 33 101 88 -55 24 18 50 32 -3 -8 0 43 -10 26 -27 43
7771 43 -34 -44 10 85 59 -53 -80 40 44 -1 -60 56 91 -77 -31 93 77 6 -50 -6 7 5 -48 -22 16 10 -55 -58 -11 49
7801 49 -22 52 -46 6 32 2 -9 -50 44 -29 -54 7 -15 27 -26 58 56 17 -27 2 -10 11 16 -7 41 -32 34 1 35 23 -13
7832 -13 -10 -43 13 3 11 -26 -26 45 -1 -53 -51 48 61 -47 -83 -37 33 -64 -44 -24 7 -82 -68 -22 15 38 -48 -10 -98 18 25 -92
7864 -92 28 -27 39 21 -37 -15 29 -2 -9 20 43 10 -31 4 -50 13 -7 26 56 -62 -55 -39 6 72 -16 -4 9 21 73 34
7894 34 -8 -52 -42 -1 -11 11 -51 39 -26 19 33 38 54 36 38 11 -38 -28 81 74 79 -38 -26 36 -8 -26 24 75 96 20 -16
7925 -16 29 42 35 -11 -33 49 -10 20 -51 -26 61 40 -44 82 -16 10 -28 -33 15 -22 -9 -41 19 10 13 50 21 15 16 -36 -9 -2 -32
7958 -32 -9 44 -43 8 6 -44 16 63 0 -60 -40 -5 12 -48 3 41 2 -66 0 33 27 -2 13 -47 33 -36 -57 31 -1 34 -37
$$ packed form
7738f2RLM7M9p3N0n2K8n1O1k9J8p2Q2K1n5JN8O8j3j43P9oL2j8l5nQM3n3L6n3P0
7771D3p7j0N4P5k6j12k7J20Mm5n9J16L5j68M6J24j6p1n6M4J3kn3K6L8oo5lM7O0
7801D9p1P4r8N2K6l0j1m1R4p3k5O1k2M2n3Q4kl9m4K9j2K1Nk3M8p3O6l3L4j2l6
7832a3Ll3N6j0Ql7%P1m6n2KR9J3j08l6M6P0r7K0K0L1q9J4M6L7K3q6L8q8J16Pj17
7864i2J20n5O6j8n8K2M4l1pK9K3l3m1L5n4O3k0L3L0j18PJ6M5O6q8J2J3J2N2l9
7894C4m2m4J0M1j0K2o2R0o5M5J4NJ6j8Kk7m9J0J09pNj17J2O2m4j8N0N1K1p6l6
7925a6M5J3pm6k2Q2n9L0p1K5Q7k1q4J26r8K6l8nM8l7J3l2O0rLL7k9oJn2K7Pl0
7958c2K3N3q7N1kn0O0M7o3o0K0L5J7o0N1L8l9o8O6L3ok9J5o0Q0o9k1Q8l2L5p1
$$ plain form
7989 -37 -55 -38 -18 24 -34 -24 11 33 -36 -86 7 108 9 -54 11 40 -18 -23 56 15 -24 -83 -57 3 24 33 69 -18 35 50 21
8020 21 -14 -24 -35 11 -25 24 35 8 7 -97 58 38 -71 35 11 9 34 17 26 40 38 -29 -9 -2 -32 10 55 80 -1 -28 68
8051 68 -13 -33 15 -21 27 45 66 -4 -8 -5 -19 23 -30 -8 50 -29 -73 -59 -26 61 -15 -63 45 2 -27 -5 61 -15 20 -24 -13
8082 -13 -30 3 -1 -30 -73 78 24 -1 -1 7 13 -59 -71 -32 3 28 12 13 7 -16 -59 -53 26 -25 -28 65 -17 -40 -58 37 35 3 -54 31
8116 31 12 -41 -4 63 34 45 -5 -80 -114 -23 77 10 -38 4 38 -36 -63 44 21 -11 -53 -74 36 62 -56 14 7 -11 -56
8145 -56 -42 15 21 51 52 59 -9 -16 39 -22 -19 -29 34 16 -57 79 -4 21 3 20 56 -10 -35 50 14 -17 -29 -8 -29 -11 58 52 35
8178 35 -7 22 43 -35 12 -4 -32 19 -47 16 4 -47 -32
$$ packed form
7989c7j8J7K0M2n8J0L5K2o9n0R3J01r9o3O5K9n8nP9m1l9n9K6O0K1RL6q7N3J5k9
8020B1l5j0j1M6l6M9J1k7jj04J55k0j09J06k4kK5j7RJ4ko7K0Pl0M2M5K5q1k7R6
8051F8q1k0M8l6M8J8K1p0mLj4M2n3K2N8p9m4J4L3Q7p6m8J08m3k9K2O6p6L5m4J1
8082a3j7L3mk9m3J51n4k5%QOp2j2L9L5K5j6Jok3m3OP9n1lR3q2k3j8R5kl2n7Q5
8116C1j9n3L7O7k9J1n0p5l4R1J00o7m8M2L4p4k7J07k3l2m2k1J10K6j18P0pj8m5
8145e6J4N7OL0JPo8pN5o1Lj0O3j8p3J36q3K5j8J7L6o6k5Q5l6l1j2K1k1J8O9oj7
8178C5m2K9K1p8M7j6k8N1o6O3j2n1J5
8191c2
$$ Imaginary data points
##PAGE= N=2
##DATA TABLE= (X++(I..I)), XYDATA
$$ plain form
0 0 0 0 0 0 0 0 0 0 0 0 0 0 0 0 0 0 0 0 -4 4 -3 4 -5 7 -10 11 -13 17 -17 21 -25 29 -33 39 -44 51 -58 64 -70 80 -90
41 -90 101 -108 120 -133 145 -158 169 -183 194 -202 204 -200 174 -114 -12 295 -950 2738 -9354 75387
61 75387 568830 222310 -308998 -35474 199414 -160916 -247722 242500 321198 -145066 -249395
72 -249395 35758 9610 -126197 107314 265424 -34564 -219966 -7579 66098 -98626
82 -98626 -5258 218414 72702 -194128 -104018 77404 13303 -23979 106195 73476 -117140
93 -117140 -101129 47591 22146 -27892 94484 123639 -78275 -165858 -7678 80601 8073
104 8073 6528 67704 4597 -98637 -62109 38405 63083 33946 4266 -19879 -30113 -44925
116 -44925 -52822 37082 161560 84497 -133050 -135277 51207 53181 -66077 37702 166953
$$ packed form
0@%%%%%%%%%%%%%%%%%%mQpPrJ2j7K1k4L0l4L8m6N4o2P2q3R5j09J22j34J50j70
41i0J91k09K28k53K78l03L27l52L77l96M06m04L74k88J02L07j245L688j2092Q4741
61G5387M93443l46520n31308K73524K34888l60330q6806M90222P8698m66264j04329
72b49395K85153k6148j35807K33511J58110k99988j85402K12387P3677j64724
82i8626R3368K23672j45712k66830R0110J81422o4101l7282J30174l2719j90616
93a17140J6011J48720k5445n0038J22376K9155k01914q7583J58180Q8279p2528
104H073j545O1176o3107j03234L6528J00514K4678k9137k9680k4145j0234j4812
116d4925p897Q9904J24478p7063k17547k227J86484J974j19258J03779J29251
$$ plain form
127 166953 -43454 -255525 -37436 220590 70675 -115296 8850 66805 -123003 -118812
137 -118812 133390 139357 -78830 -60729 79565 -25128 -122471 71303 167923 -62207 -156307
148 -156307 51568 89621 -101891 -64527 136123 57666 -133298 -36563 109683 -12029 -99099
159 -99099 61267 107845 -75088 -97104 69684 47922 -94956 -19030 110530 -2538 -115456
170 -115456 16743 104751 -29175 -73831 66172 68811 -81349 -64351 69937 25655 -87626
181 -87626 -8488 101936 9051 -102684 -24461 74896 29766 -27865 1461 14895 -22216 -21162
193 -21162 18069 28209 16473 2205 -33548 -52700 -982 55803 27424 -34312 -33085 8678
205 8678 20691 6497 5685 17835 13722 -19130 -42885 -7025 49555 30254 -41835 -40448 28543
$$ packed form
127A66953k10407k12071K18089K58026j49915j85971J24146N7955j89808M191
137a18812K52202N967k18187J8101J40294j04693r7343J93774R6620k30130r4100
148a56307K07875L8053j91512L7364K00650p8457j90964R6735J46246j21712q7070
159i9099J60366M6578j82933k2016J66788k1762j42878P5926J29560j13068j12918
170a15456J32199Q8008j33926m4656J40003K639j50160J6998J34288m4282j13281
181h7626P9138J10424r2885j11735P8223R9357m5130n7631K9326J3434l7111J054
193b1162L9231J0140j1736j4268l5753j9152N1718N6785k8379o1736J227M1763
205H678J2013j4194q12J2150m113l2852k3755L5860N6580j9301p2089J387O8991
$$ plain form
218 28543 33746 -21166 -14842 33608 14594 -31260 -7644 27092 -1148 -19564 15023 14374 -30612
231 -30612 -19173 28809 10119 -27803 6904 36929 -12666 -35128 26107 41268 -26208 -35140
243 -35140 27731 20001 -41548 -16912 47738 14525 -49496 -13142 47826 15842 -35280 -11655
255 -11655 22312 5092 -10762 1070 -490 -7961 6609 7142 -18365 -8497 30085 11335 -42554
268 -42554 -20959 48023 34551 -39510 -39828 24295 31375 -18786 -26178 11531 16344 -13277 -17700
281 -17700 6882 18138 6041 -9142 -13649 -3010 14015 12550 -10748 -20062 1614 16996 -1702
294 -1702 -20231 -3469 18583 5982 -16847 -7289 15544 8632 -12531 -6135 13926 6164 -16147
307 -16147 -11188 10667 9673 -7257 -5978 6558 1996 -10570 -3792 13701 11960 -8417 -17354 -435
$$ packed form
218B8543N203n4912O324M8450j9014m5854K3616L4736k8240j8416L4587o49m4986
231c0612J1439M7982j8690l7922L4707L0025m9595k2462O1235J5161o7476q932
243c5140O2871p730o1549K4636O4650l3213o4021L6354O0968l1984n1122K3625
255a1655L3967j7220j5854J1832j560p471J4570N33k5507R868L8582j8750n3889
268d2554K1595O8982j3472p4061l18O4123P080n0161p392L7709M813k9621m423
281a7700K4582J1256j2097j5183m507J0639J7025j465k3298r314K1676J5382j8698
294a702j8529J6762K2052j2601k2829R558K2833o912k1163O396K0061p762k2311
307a6147M959K1855r94j6930J279J2536m562j2566O778J7493j741k0377q937J6919
$$ plain form
321 -435 18392 10421 -12509 -11878 11896 13325 -15717 -21345 14170 29407 -6746 -30990 996
334 996 31668 7815 -23823 -7307 22568 10586 -20838 -18109 12130 22885 3018 -15643 -10197
347 -10197 7650 13007 751 -8942 -1853 8347 1945 -11148 -5388 15756 18756 -6140 -23020
360 -23020 -4031 22224 12696 -16679 -16292 10156 12757 -11873 -13725 13324 17467 -11166 -18569
373 -18569 10204 22456 -2257 -15970 3152 12892 -6802 -16137 3865 13692 -7706 -20348 2944
386 2944 23628 5789 -18528 -5895 19205 8440 -20531 -14453 16606 14623 -19289 -23807 11532
399 11532 26480 -1566 -21664 -3554 14921 3543 -11603 -4364 8423 4927 -6188 -9226 -2030
412 -2030 8828 11023 -4276 -21073 -10949 16267 17552 -10604 -19123 7860 19999 -7261 -22525
$$ packed form
321d35J8827p971k2930O31K3774J429k9042n628L5515J5237l6153k4244L1986
334I96L0672k3853l1638J6516K9875j1982l1424K729L0239J0755j9867j8661N446
347a0197J7847N357j2256r693P089J0200o402j3093N760K1144L000k4896j6880
360b3020J8989K6255r528k9375L87K6448K601k4630j852K7049M143k8633p403
373a8569K8773J2252k4713j3713J9122R740j9694r335K0002R827k1398j2642K3292
386B944K0684j7839k4317J2633K5100j0765k8971O078L1059j983l3912m518L5339
399A1532J4948k8046k0098J8110J8475j1378j5146P239J2787l496j1115l038P196
412b030J0858K195j5299j6797J0124K7216J285k8156q519K6983J2139k7260j5264
$$ plain form
425 -22525 7069 28599 -2515 -35131 -10411 30373 18329 -21064 -18924 13055 13050 -13498 -11590
438 -11590 15879 15696 -13340 -19284 7326 19486 -86 -13783 -2018 6011 -6035 -9340 10746
451 10746 20310 -1656 -18807 -854 19710 6333 -14882 -7046 8343 -2121 -16428 -1669
463 -1669 19888 12393 -8050 -8496 4187 8185 5349 1338 -7138 -11444 382 9990 -1627 -10424
477 -10424 6665 18139 -5076 -23416 3194 32102 9073 -28557 -15803 22896 19381 -16110
489 -16110 -19091 10714 15115 -13020 -20558 7865 24324 2772 -19671 -7965 16770 16903 -3238
502 -3238 -12062 -2042 4640 -2861 -7364 2165 8761 -2452 -14530 -6444 9304 9388 -646 -1943
516 -1943 1450 -2196 -3786 6220 11293 -1552 -13889 -8652 653 -635 -2911 2016 3748 -1457
$$ packed form
425b2525K9594K1530l1114l2616K4720M0784j2044l9393K140L1979nk6548J908
438a1590K7469j83k9036n944K6610J2160j9572j3697J1765Q029j2046l305K0086
451A0746R564k1966j7151J7953K0564j3377k1215P836J5389j0464j4307J4759
463a669K1557p495k0443m46J2683L998k836m011q476m306J1826R608j1617q797
477a0424J7089J1474k3215j8340K6610K8908k3029l7630J2754L8699l515l5491
489a6110k981K9805M401k8135p538K8423J6459k1552k2443J1706K4735J33k0141
502c238q824J0020O682p501m503R529O596j1213j2078Q086J5748Q4j0034j297
516a943L393l646j590J0006N073j2845j2337N237R305j288k276M927J732n205
$$ plain form
530 -1457 -2658 2026 4421 5624 6512 -2527 -16146 -10268 10606 9941 -13740 -15941 10258 15951 -10539
545 -10539 -16770 13060 23176 -8654 -25404 3680 25793 2995 -22572 -9912 12317 7609
557 7609 -7827 -7039 1622 2652 -366 -1870 -1084 6373 12245 -1090 -19908 -8455 20810 16351
571 16351 -16624 -18834 10818 13069 -12743 -8876 20008 13678 -19438 -17002 13534 14609 -6193
584 -6193 -2840 9604 -3490 -15911 1861 16140 916 -10589 -1 3633 -4898 1292 13354
597 13354 4365 -7250 874 3579 -10580 -5928 17328 9440 -21450 -13919 20872 15891 -15766
610 -15766 -8719 20223 9658 -19631 -11211 13957 8955 -8143 -5762 712 -794 4559 8331 -6349
624 -6349 -12277 10473 19351 -10011 -22913 8956 24316 -8457 -25932 6212 24982 -6179 -28039
$$ packed form
530a457j201M684K395J203Q88r039j3619N878K0874o65k3681k201K6199N693k6490
545a0539o231K9830J0116l1830j6750K9084K2113k2798k5567J2660K2229m708
557G609j5436P88Q661J030l018j504P86P457N872j3335j8818J1453K9265m459
571A6351l2975k210K9652K251k5812L867K8884o330l3116K436L0536J075k0802
584f193L353J2444j3094j2421J7772J4279j5224j1505J0588L634q531O190J2062
597A3354q989j1615Q124K705j4159M652K3256p888l0890P531L4791m981l1657
610a5766P047K8942j0565k9289Q420K5168n002j7098K381O474j506N353L772j4680
624f349n928K2750Q878k9362j2902L1869J5360l2773j7475L2144J8770l1161k1860
$$ plain form
637 -28039 -876 25840 8743 -16754 -9476 9612 6118 -7530 -3075 9761 3948 -13013 -11418
650 -11418 5506 9211 -608 -1489 2134 -6519 -11751 4052 15567 1865 -9592 -317 2323 -9277
664 -9277 -3862 13960 6695 -13333 -7172 5606 -6142 -10218 15785 21220 -13010 -23524 8295
677 8295 16781 -9928 -9862 15930 7945 -20179 -13045 9983 6629 -217 7959 -899 -18599 -921
691 -921 22797 -1080 -24165 9525 31980 -13336 -40270 9103 38753 -7010 -31439 11557
703 11557 27790 -15360 -27465 12447 24448 -3000 -8771 3888 -4708 -11960 7263 15806 -2370
716 -2370 -7049 5495 -1608 -15248 947 21150 7770 -11644 -5606 2081 -4169 -1001 11565
729 11565 7648 -5542 -5344 -1299 -4597 -393 10689 7454 -3843 -3479 -2181 -8509 -1387 16663
$$ packed form
637b8039K7163K6716j7097k5497P278J9088l494j3648M455J2836n813j6961J595
650a1418J6924L705r819q81L623q653n232J5803J1515j3702j1457R275K640j1600
664i277N415J7822p265k0028O161J2778j1748m076K6003N435l4230j0514L1819
677H295Q486k6709O6K5792p985k8124P134K3028l354o846Q176q858j7700J7678
691i21K3718k3877k3085L3690K2455m5316k6934M9373K9650m5763k4429M2996
703A1557J6233m3150j2105L9912J2001k7448n771J2659q596p252J9223Q543j8176
716b370m679J2544p103j3640J6195K0203j3380j9414O038P687o250L168J2566
729A1565l917j3190J98M045l298M204J1082l235j1297L64J298o328P122J8050
$$ plain form
743 16663 10765 -12052 -10266 7389 2002 -11286 2223 18624 4410 -15632 -11017 2562 6775
756 6775 6604 1152 -7290 -1235 9512 -4246 -20262 3606 30684 4179 -31211 -9347 23129
769 23129 2153 -22638 4412 27001 -2681 -26362 -4420 12973 1568 623 9912 -4019 -18296
782 -18296 -548 13030 -4116 -8610 13351 10393 -19164 -16620 13810 13775 -8378 -4348 9933
795 9933 -1548 -14542 -2263 8234 1465 747 5866 -4130 -13696 -1779 9290 2709 998 6824
809 6824 -4070 -16855 -1454 16354 3261 -9677 4704 8756 -14690 -17772 12219 21391 -3478
822 -3478 -13731 1652 5659 -4968 -3848 6082 7769 3707 -3298 -13307 -9248 11730 16195 -4983
836 -4983 -11842 5583 6766 -11721 -7351 16671 15214 -7600 -11964 -838 1133 1124 7203 2656 -8276
$$ packed form
743A6663n898k2817J786J7655n387j3288J3509J6401j4214k0042M615J3579M213
756F775j71n452q442O055J0747j3758j6016K3868K7078k6505l5390K1864L2476
769B3129k0976k4791K7050K2589k9682k3681K1942J7393j1405r45R289j3931j4277
782a8296J7748J3578j7146m494K1961k958k9557K544L0430l5k2153M030J4281
795I933j1481j2994J2279J0497o769p18N119r996r566J1917J1069o581j711N826
809F824j0894j2785J5401J7808j3093j2938J4381M052k3446l082K9991R172k4869
822c478j0253J5383M007j0627J120R930J687m062p005j0009M059K0978M465k1178
836d983o859J7425J183j8487M370K4022j457k2814m364J1126J971rO079m547j0932
$$ plain form
851 -8276 -2337 7445 -2908 -10116 8795 19131 -3193 -17456 641 11186 -4209 -8228 8774
864 8774 10010 -8168 -10959 2489 5551 953 4221 5283 -4653 -9455 -1188 5804 5172 2848 -1669
879 -1669 -6758 -3712 3093 1314 -1995 4308 5915 -6848 -11769 3333 13152 2180 -7441 -2099
893 -2099 2708 -1260 -3770 -1417 1283 4065 2544 -7121 -9885 4829 13922 -887 -13042 139
907 139 11641 -1605 -12911 160 11814 895 -11287 -5349 4882 4903 -352 -3804 -2873 3137
921 3137 5980 -1655 -7723 37 6939 -1336 -8595 -97 6606 -1744 -7264 1566 7274 812 -3417
936 -3417 -55 -160 -2528 1287 4586 -1049 -5976 -1566 3090 1226 -21 1494 -444 -2992 349
951 349 3717 490 -1863 1981 2587 -3929 -4822 4257 7731 -2514 -9523 -452 9832 3658 -8032
$$ packed form
851h276N939R782j0353p208J8911J0336k2324j4263J8097J0545j5395m019J7002
864H774J236j8178k791J3448L062m598L268J062r936m802Q267O992o32k324m517
879a669n089L046O805j779l309O303J607j2763m921J5102R819j0972r621N342
893b099M807l968k510K353K700K782j521r665k764J4714R093j4809j2155J3181
907A39J1502j3246j1306J3071J1654j0919j2182N938J0231K1n255l452R31O010
921C137K843p635o068P760O902q275p259Q498O703q350n520Q830N708o462m229
936c417L362j05k368L815L299n635m927M410M656j864j247J515j938k548L341
951C49L368l227k353L844O06o516q93R079L474j0245p009R071J0284o174j1690
$$ plain form
966 -8032 -3947 9193 7193 -7654 -8792 6518 11117 -3293 -11060 443 9393 1391 -6947 -1448
980 -1448 6130 3359 -3234 -3421 1704 5526 3391 -3344 -5986 591 6613 1484 -6347 -3361 4346
995 4346 3323 -3051 -1928 4329 4405 -1888 -4558 95 4570 1722 -4685 -4741 1609 4003 -877 -3006
1011 -3006 1505 2905 -1776 -2148 3366 2670 -4420 -4017 3599 3319 -4683 -4509 3779 3969 -4541 -5265 3924
1028 3924 6439 -2726 -7618 274 7601 2016 -7082 -4809 4320 4553 -3883 -5924 1410 5129 -503
1043 -503 -5174 -1791 3569 3406 -940 -4061 -2075 2973 3633 -2700 -5934 1175 6557 -1032 -9089 -1909
1059 -1909 9030 4549 -7194 -5697 5061 5830 -2759 -4589 2064 3991 -2106 -5419 -310 4709
1073 4709 2475 -2833 -3146 1250 3041 541 -420 1165 303 -2308 -977 2806 1457 -2629 -1186 3000
$$ packed form
966h032M085J3140k000j4847j138J5310M599j4410p767J1503Q950q002q338N499
980a448P578k771o593j87N125L822k135o735k642O577O022n129p831K986P707
995D346j023o374J123O257P6o293k670M653M475k848o407n6O350K394m880k129
1011c006M511J400m681l72N514o96p090M03P616k80q002J74Q288J90q510p24R189
1028C924K515r165m892P892P327n585r098K273R129K33q436k041P334L719n632
1043e03m671L383N360j63m346l121J986N048O60o333l234P109N382p589q057P180
1059a909J0939m481j1743J497J0758P69q589j830O653J927o097l313N109N019
1073D709k234n308l13M396J791k500r61J585q62k611J331L783j349m086J443M186
$$ plain form
1089 3000 1376 -3263 -1131 4645 3249 -3120 -3201 2749 4099 -822 -3505 -110 3403 1672 -2316
1104 -2316 -2979 982 4317 2011 -3075 -2996 2750 4784 -868 -4908 10 5710 1812 -5826 -3836 5100
1120 5100 5970 -3025 -6595 1258 6875 783 -6206 -2167 5531 3658 -4150 -4592 2294 4741 -520
1135 -520 -4532 -1123 3115 1579 -2457 -2112 1633 2298 -1133 -2681 -45 2029 358 -1660 -1082 -123
1151 -123 -377 -74 1062 135 -2140 -1636 1490 1815 -1535 -2528 631 1913 -1375 -3182 315 3357 491
1168 491 -3648 -2572 1840 2903 -401 -2995 -1735 1651 2284 -1417 -3754 -48 4525 1290 -5563
1183 -5563 -3752 4925 5280 -4005 -6407 2533 6736 -1261 -6830 -520 6018 1970 -4640 -2975 2795
1198 2795 3504 -809 -3397 -784 3436 2895 -2374 -3916 1259 4626 135 -3999 -249 3907 652
$$ packed form
1089C000j624m639K132N776j396o369q1N950J350m921k683L395L513j731l988
1104b316o63L961L335k306n086P9N746K034n652m040M918N700l898p638J990Q936
1120E100Q70q995l570P853N617o092o989M039P698j873p808m42O886K447n261
1135e20m012L409M238j536m036L45L745O65l431j548K636K074j671k018N78R59
1151a23k54L03J136r27k275N04L126L25l350r93L159J282l288j807L497L042k866
1168D91m139J076M412J063l304k594J260L386O33l701k337L706M573l235o853
1183e563J811Q677L55r285k402Q940M203p997n569O310O538m048o610J665N770
1198B795P09m313k588K613M220n41n269j542N175L367m491m134L750M156l255
$$ plain form
1213 652 -3304 -412 3237 1364 -1414 -369 501 -688 279 2363 809 -2312 -860 2379 1336 -1410
1229 -1410 -176 2181 948 -1397 -1026 750 1186 898 81 -1356 -1009 1782 2620 -983 -3076 879
1245 879 4445 570 -4694 -1814 4702 3111 -4182 -4131 3496 5149 -2419 -5856 973 5760 909 -4425
1261 -4425 -1887 2797 1806 -1839 -2222 406 2345 1294 -2530 -4006 347 4768 1320 -4634 -2455
1276 -2455 3614 1839 -4043 -2138 3970 2262 -3827 -3257 1227 1258 -939 68 568 -1608 -1342 1578
1292 1578 925 -2278 -770 2724 728 -3375 -2126 1396 988 -790 -164 57 -1042 -273 1056 -844
1308 -844 -1746 2103 3674 -2107 -5726 -146 5065 1053 -4009 -965 3505 458 -4059 -1770 3492
1323 3492 4146 110 -3347 -2833 597 3136 1297 -1946 -835 2327 440 -4281 -2330 5237 6409
$$ packed form
1213F52l956K892L649j873k778J045Q70j189R67K084j554l121J452L239j043k746
1229a410J234K357j233k345L71J776M36k88q17j437L47K791Q38l603k093L955
1245H79L566l875n264K880O516j591p293N1P627J653p568l437O829M787m851n334
1261d425K538M684r91l645l83K628J939j051l824j476M353M421l448n954K179
1276b455O069j775n882J905O108j708o089N70M484L1k197J007N00k176K66K920
1292A578o53l203J508L494j996m103J249L522m08j778O26K21j099P69J329j900
1308h44r02L849J571n781l619N580N211m012n062L044M470l047m517K289N262
1323C492O54m036l457N14L430K539j839l243J111L162j887m721J951P567J172
$$ plain form
1338 6409 -1882 -6436 -671 4838 1385 -2857 463 4004 -104 -5074 -1917 3765 3412 -71 -609
1353 -609 -263 -1504 -726 2448 2487 -637 -761 1283 -369 -2978 -377 3870 2402 -1854 -1974 178 542
1370 542 337 1145 1002 16 231 60 -2020 -1935 1959 3480 -293 -3348 -1304 1456 1080 -203 -65 956
1388 956 1534 -208 -3353 -2803 2679 4632 -1334 -5582 -569 4204 -122 -4607 160 5654 1513 -5241
1404 -5241 -3689 2436 3496 -358 -2584 -1158 746 220 -1610 -1436 1181 2172 -467 -2528 -859 1584
1420 1584 1001 -812 -1414 -536 784 1055 -1030 -2971 -972 2449 1604 -1556 -1258 1143 267 -1988 -562
1437 -562 2254 1802 -638 -1915 -1947 -1020 1515 2728 418 -2131 -1268 334 152 -140 1200 2304 1080
1454 1080 -2088 -3831 -1077 4061 4083 -1719 -4029 504 2696 -1493 -2219 3455 4668 -1735 -4584 -494
$$ packed form
1338F409q291m554N765N509l453m242L320L541m108m970L157N682l53l483n38
1353f09L46j241P78L174L9l124j24K044j652k609K601M247j468m256j20K152L64
1370E42k05Q08j43r86K15j71k080Q5L894J521l773l055K044K760l76j283J38J021
1388I56N78j742l145N50N482J953n966m248N013M773m326m485M767N494m141o754
1404e241J552O125J060l854k226J426J904n26j830J74K617R91k639k061J669K443
1420A584n83j813o02Q78J320K71k085j941J999L421q45l160K98K401q76k255J426
1437e62K816m52k440j277l2R27K535J213k310k549Q63J602j82k92J340J104j224
1454A080l168j743K754N138K2n802k310M533K192m189p26N674J213o403k849M090
$$ plain form
1470 -494 2625 1534 859 259 -1932 -989 2264 648 -3063 487 5636 1192 -5635 -1745 5084 1677
1486 1677 -3730 53 4244 -128 -3893 -409 1864 -52 1067 3287 -803 -4870 -453 4275 921
1501 921 -2348 1211 2463 -2523 -4090 1044 3810 1211 -729 -1047 -2189 -1273 2341 2561 -1095 -1544
1517 -1544 1246 128 -3396 -1567 3508 3157 -1849 -3758 -789 1763 1102 -539 -706 394 521 -1074
1533 -1074 -1956 -436 1633 1354 -1099 -2525 -954 2004 1805 -2077 -3200 1630 4272 -1011 -5319 -442
1549 -442 4348 110 -4042 408 3908 -1281 -4716 85 3434 440 -805 918 -1378 -3760 852
1564 852 5072 53 -4406 -48 2976 -2015 -3378 2861 4283 -1962 -3690 774 1482 -791 965
1579 965 2355 -1586 -2971 1772 2763 -2404 -2268 3576 2954 -3538 -3263 3007 3481 -1445 -1829 1371 1302
$$ packed form
1470d94L119j091o75o00k191R43L253j616l711L550N149m444o827L890O829l407
1486A677n407L783M191m372l765L484K273j916J119K220m090m067M417M728l354
1501I21l269L559J252m986j567N134K766k599j940l18j142R16L614K20l656m49
1517a544K790j118l524J829N075l51n006j909K969K552o61j641j67J100J27j595
1533a074q82J520K069k79k453j426J571K958j99l882j123M830K642n283m308M877
1549d42M790m238m152M450L500n189l435M801L349k994j245J723k296k382M612
1564H52M220n019m459M358L024m991j363O239J422o245j728M464P08k273J756
1579I65J390l941j385M743R91n167J36N844o22o492K75O270M74m926l84L200o9
$$ plain form
1596 1302 -511 -175 357 -542 274 1825 212 -2035 -141 2730 571 -2609 -352 3525 1968 -2753
1612 -2753 -2991 1414 3479 799 -1719 -785 741 190 -766 308 1656 1093 -805 -1995 -1154 1423
1628 1423 3030 859 -2720 -2223 1463 1856 -1081 -1033 1626 952 -2217 -1676 1359 1309 -348 28 65 -1841
1646 -1841 -1112 2331 1434 -2631 -1599 2873 1214 -3809 -2148 3589 2574 -3069 -2991 1518 1814 -1176
1662 -1176 -1236 545 371 -423 -167 -478 -989 212 1331 -523 -2121 -227 1814 121 -2162 -834 1743
1679 1743 1432 -1169 -2097 -441 1339 1127 -599 -1446 -261 830 -75 -1150 107 1697 666 -1903
1695 -1903 -1969 929 2515 617 -1723 -1252 641 828 -175 -214 527 336 -301 -334 -223 162 1247 1482
1713 1482 -676 -2153 76 2505 759 -1826 -513 2103 789 -1920 -1092 1930 2282 -221 -1705
$$ packed form
1596A302j813L36N32q99Q16J551j613k247J894K871k159l180K257L877j557m721
1612b753k38M405K065k680k518R34J526n51r56J074J348n63j898j190Q41K577
1628A423J607k171l579M97L686L93k937M8K659o74l169N41L035n0j657L76L7j906
1646a841P29L443q97m065J032M472j659n023J661N737j015n643P8M509K96k990
1662a176o0J781j74p94K56l11n11J201J119j854j598J894K041j693k283J328K577
1679A743l11k601r28J656J780k12j726q47J185J091r05j075J257J590j031k569
1695a903o6K898J586j898k340M71J893J87j003l9P41j91o37l3J11L85J085K35
1713A482k158j477K229K429j746k585J313K616j314k709Q28L022L52k503j484
$$ plain form
1728 -1705 -704 1166 1730 230 -1259 -267 1487 485 -1640 -653 2206 1792 -1269 -1861 519 1822
1744 1822 627 -671 -611 171 610 228 -696 -663 927 1383 -462 -1654 -292 1576 906 -937 -1020 639
1762 639 1187 -413 -1632 -294 1767 849 -1528 -1815 498 1408 74 -814 -304 171 -2 -162 -401 -509
1780 -509 233 891 -643 -2044 -410 1865 890 -1835 -1422 1118 1255 -1139 -1829 111 1610 537 -1633
1797 -1633 -1873 321 1795 52 -2012 -732 1507 456 -1878 -864 1952 1456 -1480 -1908 104 1039
1813 1039 446 -225 -749 -1007 -13 1134 351 -946 -71 1322 11 -1867 -456 2043 1251 -1579 -1663
1830 -1663 689 1412 17 -393 347 239 -305 -70 270 105 496 1200 40 -1916 -892 2253 2238 -1060
1848 -1060 -1990 473 1625 -151 -802 912 1539 -262 -1609 -695 1089 1927 853 -1543 -1919 844
$$ packed form
1728a705J001J870N64j500j489R92J754j002k125R87K859m14l061n92K380J303
1744A822j195j298O0P82M39l82r24L3J590M56j845j192J362J868o70j843q3J659
1762F39N48j600j219J338K061r18k377k87K313R10j334q88N10M75j73j60k39j08
1780e09P42O58j534j401J634K275r75k725M13K540J37k394o90J940J499j073k170
1797a633k40K194J474j743k064J280K239j051k334J014K816m96k936m28K012R35
1813A039n93o71n24k58R94J147p83j297Q75J393j311j878J411K499p92k830q4
1830a663K352P23j395m10P40j08n44K35L40j65L91P04j160j956J024L145j5l298
1848a060r30K463J152j776o51J714O27j801j347R14J784Q38j074k396l76K763
$$ plain form
1864 844 2502 218 -1918 -49 2174 141 -2227 -305 2352 1130 -1644 -1368 742 1255 149 -786
1880 -786 -829 233 1277 496 -1149 -839 1076 1009 -1046 -1142 984 1313 -1062 -1930 98 1568 596 -593
1898 -593 -584 -552 -501 321 1011 268 -939 -547 42 -618 -980 809 1931 -443 -3017 -1511 1764 1758 -664
1917 -664 -1151 -43 -169 -870 -197 522 227 -3 -281 -1525 -1366 1471 2516 -916 -3030 53 2771
1934 2771 -101 -2794 -212 2335 180 -2011 -489 1352 454 -904 -782 -6 971 1439 -338 -2391
1950 -2391 -846 2424 1811 -1381 -1120 1015 158 -1745 18 2488 1127 -1374 -1323 -130 267 1247 2088
1967 2088 90 -2332 -1102 1386 986 -213 648 1044 -900 -1821 243 1830 1211 290 -383 -1373 -879
1984 -879 1566 2256 -441 -1899 262 1586 -459 -1363 1108 2261 -450 -2546 -326 2441 1538 -1203
$$ packed form
1864H44J658k284k136J869K223k033k368J922K657j222k774K76K110N13j106r35
1880g86m3J062J044p81j645L10J915o7k055r6K126L29k375q68K028J470r72j189
1898e93RL2N1Q22O90p43j207L92N89o60l62J789J122k374k574J506L275ok422
1917f64m87J108j26p01O73P19k95k30k78j244J59K837J045l432k114L083K718
1934B771k872k693K582K547k155k191J522J841q98j358J22P76R77M68j777k053
1950b391J545L270o13l192K61K135q57j903J763K470j361k501N1J193L97R80Q41
1967B088j998k422J230K488m00j199Q61L96j944r21K064J587o19r21o73r90M94
1984h79K445O90k697j458K161J324k045r04K471J153k711k096K220K767r03k741
$$ plain form
2000 -1203 -1711 35 1365 983 -382 -879 -164 730 135 -954 -32 1776 771 -2423 -2195 1825 3115
2017 3115 -511 -2850 -426 1526 -122 -1237 629 1137 -718 -1451 -146 447 295 660 -48 -1766
2033 -1766 -1103 1435 1128 -1378 -1147 948 298 -1345 103 1469 -814 -2088 467 1538 -966 -1056
2049 -1056 1629 415 -3244 -1357 3458 2213 -2728 -2587 1119 866 -1111 262 1958 -257 -2230
2064 -2230 -918 426 353 1330 1850 -1407 -3795 -345 3591 1371 -2409 -572 2359 -251 -3489 -383
2080 -383 4047 2065 -2760 -2455 1267 1662 -651 -580 1187 801 -606 -472 -47 -350 538 1690 247
2097 247 -1738 -237 1879 -64 -2171 788 3369 172 -2933 -305 1832 -397 -780 2468 1822 -2745
2113 -2745 -2260 2086 1400 -1646 816 3458 -1017 -4804 -139 4172 1095 -1785 593 678 -2633 -1256
$$ packed form
2000a203n08J746J330l82j365m97P15Q94n95j089R22J808j005l194K28M020J290
2017C115l626k339K424J952j648j115J866N08j855p33J305N93j52L65p08j718
2033a766O63K538l07k506K31K095o50j643J448J366k283j274K555J071k504r0
2049a056K685j214l659J887M815j245m941J41L706k53j977J373J696k215j973
2064b230J312J344p3R77N20l257k388L450L936k220l780J837K931k610l238L106
2080c83M430j982m825L05L722L95k313P1J767l86j407J34M25l03Q88J152j443
2097B47j985J501K116j943k107K959K581l197l105K628K137k229l83L248o46m567
2113b745M85M346o86l046K462K642m475l787M665M311l077k880K378Q5l311J377
$$ plain form
2129 -1256 3030 1767 -1855 -20 1786 -2215 -3430 2736 5008 -1717 -4701 1029 3372 -1833 -3081
2144 -3081 2292 3415 -1542 -3152 124 1270 -186 23 722 -545 -1005 462 -14 -1683 -181 2576
2160 2576 955 -2830 -2040 1487 1447 -1341 -1006 1542 968 -2115 -2196 1006 1923 -211 -930 234 -270
2177 -270 -1657 -382 1846 817 -1585 -689 1007 -541 -1789 711 2427 -279 -2268 -258 1101
2192 1101 -573 -424 1357 278 -1623 115 1703 -1150 -2243 1968 3218 -2078 -3679 1822 3396
2207 3396 -1850 -2868 2413 3152 -1878 -2782 1160 1654 -461 16 805 -987 -815 1719 769 -2032 95
2224 95 3457 208 -4058 -624 4231 1199 -3287 -602 3098 433 -2493 -94 2335 277 -1324
2239 -1324 238 826 -376 -145 800 145 -605 514 989 -567 -1108 302 1041 190 -134 188 -287 -731
$$ packed form
2129a256M286j263l622J835J806m001j215O166K272o725k984N730K343n205j248
2144c081N373J123m957j610L276J146j456K09O99j267m60J467m76j669J502K757
2160B576j621l785P90L527m0k788L35K548n74l083q1L202R17k134p19J164n04
2177b70j387J275K228j029k402Q96J696j548j248K500J716k706j989K010J359
2192A101j674J49J781j079j901J738J588k853j093M211J250n296j601N501J574
2207C396n246j018N281P39n030r04L942M94k115M77P89j792J72K534r50k801K127
2224I5L362l249m266L434M855l032m486K685L700k665k926K399K429k058j601
2239a324J562N88j202K31R45o55p50J119M75j556n41J410P39q51l24L22m75m44
$$ plain form
2257 -731 43 984 527 -511 -516 137 -99 -664 107 1495 800 -1783 -2031 802 2199 -249 -1822 157
2275 157 1401 -810 -2042 358 2140 351 -1607 -1408 -94 912 913 -445 -1596 -222 1544 -166
2291 -166 -2206 58 2610 -148 -3354 -791 2888 1057 -2524 -1432 1419 826 -762 -332 162 -477
2307 -477 -334 323 -26 -336 513 107 -1555 -864 1643 1475 -1093 -1432 348 401 -464 462 1237 -473 -1813
2326 -1813 -192 1308 512 -453 169 392 -739 -1049 626 1695 774 -1053 -1503 -66 1533 1161 -529
2343 -529 -720 458 535 -834 -529 1490 1795 -606 -2238 -517 2120 1959 -609 -1723 -110 1348 305
2360 305 -1046 167 1835 307 -1994 -1140 2034 2158 -683 -2035 -276 1324 747 -340 -317 418 211
2377 211 -472 -447 692 1227 -94 -1380 -688 970 1067 -173 -638 -295 -88 -90 373 676 -125 -997 -682 342
$$ packed form
2257g31P74R41m57j038nO53k36n65P71J388o95k583k48K833J397k448j573J979
2275A57J244k211j232K400J782j789j958J99J314J006Jj358j151J374J766j710
2291a66k040K264K552k758l206K563L679j831l581J092K851n93j588M30M94o39
2307d77J43O57l49l10Q49m06j662O91K507j68k568l39J780N3q65R26P75j710j340
2326a813J621J500p96r65O22K23j131l10J675J069r21j827m50J437J599l72j690
2343e29j91J178P7j369L05K019L05k401j632J721K637j61k568j114J613J458j043
2360C05j351J213J668j528k301Q54L174J24k841j352J759J600n77j087K3P35k07
2377B11o83K5J139N35j321j286O92J658R7j240m65L43K07kM63L03q01q72L15J024
$$ plain form
2397 342 689 199 -392 -389 -244 -405 -328 643 1172 -280 -1921 -1117 1295 1666 -515 -1640 -186 728 -407
2416 -407 -1089 434 1671 58 -2410 -1714 1411 2358 -254 -2290 -891 1163 468 -1044 -225 1359
2432 1359 361 -1865 -1674 874 2135 342 -1756 -1513 407 1372 302 -819 -258 498 -292 -1081 75
2449 75 1696 798 -1405 -1548 537 1553 292 -815 -332 220 -33 -66 593 839 -169 -1035 -255 996
2467 996 801 -359 -357 429 60 -685 127 1566 799 -1302 -1301 841 1721 166 -971 16 832 77 -778
2486 -778 3 1406 999 -1088 -1712 304 2160 1066 -1343 -1321 708 1184 -297 -785 706 1227 -463
2503 -463 -1782 -335 1917 1573 -1037 -2056 -103 1656 735 -933 -440 817 240 -1367 -680 1509
2519 1509 1373 -1029 -1852 74 1315 207 -790 -166 253 -449 -615 309 711 -218 -882 -202 353 -47
$$ packed form
2397C42L47m90n91LJ45j61P7R71N29j452j641Q04K412L71k181j125J454R14j135
2416d07o82J523J237j613k468O96L125R47k612k036J399K054o95j512Q19J584
2432A359r98k226J91K548J261j793k098K43J920R65j070j121N61P56p90p89J156
2449G5J621q98k203j43K085J016j261j107M83N52k53l3O59K46j008q66P80J251
2467I96j95j160KP86l69p45Q12J439p67k101JK142Q80j555j137R87Q16p55q55
2486g78P81J403m07k087o24K016J856j094k409K2K029M76j481m88J491N21j690
2503d63j319J447K252l44k610j019J953J759r21j668M93J257n77j607O87K189
2519A509j36k402q23J926J241j108r97O24M19p02j66R24M02r29o64O80N55m00
$$ plain form
2537 -47 -342 -13 133 -286 -553 -226 338 352 -325 -855 -391 727 627 -777 -1257 284 1054 -506 -1351
2556 -1351 355 1580 -281 -2323 -659 1979 1390 -1378 -1723 245 1154 -190 -924 370 1194 98
2572 98 -1649 -1181 1204 2006 -74 -2003 -818 1268 1019 -773 -590 1081 927 -1141 -1410 730 1870
2589 1870 133 -1306 -357 946 357 -570 63 856 338 -456 -247 303 231 95 295 288 -9 -66 -51 -160
2609 -160 267 730 235 -445 153 742 -438 -1145 795 2095 -105 -2097 -165 2002 147 -1746 351
2626 351 2297 58 -2489 -836 1875 1365 -403 -730 -200 -65 93 36 -313 381 1283 -188 -2374 -962
2644 -962 2365 1816 -1646 -1957 1111 1334 -1500 -1624 1517 2022 -921 -2201 -319 1246 320 -656 -211
2661 -211 305 -156 -783 -643 106 549 397 -379 -808 -399 236 45 -334 157 471 -395 -1152 -232 985 120
$$ packed form
2537d7k95L29J46m19k67L27N64J4o77n30M64J118j00j404m80J541P70j560q45
2556a351J706J225j861k042J664K638n89k768l45J968R09j344p34J294Q24j096
2572I8j747M68K385Q02k080j929J185K086k49j792J83J671j54k068k69K140J140
2589A870j737j439R49J303n89r27O33P93n18p94K09N50p2j36K00pk97n7J5j09
2609a60M27M63m95o80N98N89j180p07J940J300k200j992J932K167j855j893K097
2626C51J946k239k547J653K711n10j768l27N30J35J58n7l49O94R02j471k186J412
2644i62L327n49l462l11L068K23k834j24L141N05k943j280J882J565r26r76M45
2661b11N16m61o27J40P49M43j52p76m29M09O35j91l79M91L14q66p57R20J217q65
$$ plain form
2681 120 -997 24 913 -644 -1852 284 1991 1 -1843 -163 1572 -225 -1705 90 1706
2696 1706 283 -1229 -661 178 181 416 399 -612 -400 1006 445 -1734 -642 2543 1480 -2379 -1891 2065
2714 2065 2048 -1630 -1663 1804 1820 -1363 -1749 940 1660 -72 -757 22 365 151 128 -69 -176 495 806
2733 806 -422 -1013 425 1346 -75 -1172 225 1315 -16 -1065 192 1126 -232 -1040 493 1399
2749 1399 -307 -1405 186 1419 1 -1046 328 1226 -435 -1453 90 1419 381 -852 -481
2764 -481 74 5 264 123 -426 -43 838 -112 -1804 -540 2133 1138 -2122 -1610 1667 1293 -1940 -1629
2782 -1629 1742 1716 -1472 -2089 404 1402 -102 -892 -136 389 113 -489 -953 -330 1120 946 -929 -1485
2800 -1485 311 997 -645 -1033 890 1359 -905 -1917 -91 1356 332 -564 72 186 -913 -1076 510
$$ packed form
2681A20j117J021Q89j557j208K136J707j990j844J680J735j797j480J795J616
2696A706j423j512N68Q39LK35j7j011K12J406n61k179J092L185j063l859M88L956
2714B065j7l678l3L467J6l183l86K689P20j732o85P79L43k14k3j97j07O71L11
2733H06j228n91J438R21j421j097J397J090j331j049J257R34j358q08J533R06
2749A399j706j098J591J233j418j047J374Q98j661j018J543J329j038j233L71
2764d81N55o9K59j41n49L83Q81r50j692J264K673r95l260N12L277l74l233L11
2782a629L371k6l188o17K493R98j504p90P56N25k76o02m64O23J450j74j875n56
2800a485J796O86j642l88J923M69k264j012J826J447j024q96O36J14j099j63J586
$$ plain form
2817 510 1439 339 -875 -663 -85 -171 -124 624 943 -6 -1128 -879 147 893 840 5 -717 -379 465 88
2837 88 -683 299 1717 528 -2029 -1306 1776 1748 -1145 -1384 1325 1547 -1163 -1757 968 1976 103
2854 103 -1199 -290 651 331 -292 -369 357 1158 555 -1260 -1306 953 1784 -122 -1075 424 1056 -695 -1310
2873 -1310 667 1824 345 -1189 -779 210 428 209 343 428 -162 -802 -623 311 1047 452 -633 -503
2891 -503 -20 -187 -306 450 877 -110 -1151 -615 519 693 -198 -668 -5 525 -37 -1022 -383 1102 792
2910 792 -1252 -1278 725 1260 -885 -1666 400 1580 -135 -1526 -492 907 409 -636 -546 246 674
2927 674 -46 -1225 -831 1051 1414 -704 -1791 112 1477 -136 -1371 162 1474 -238 -1796 -279
2943 -279 1377 684 -676 -711 128 191 -121 -25 254 338 -190 -613 -167 658 533 -365 -444 261 319 -294 -36
$$ packed form
2817E10R29j100j214K12N78q6M7P48L19r49j122K49J026P46n3q35p22L38Q44l77
2837H8p71R82J418j189k557P23L082k8k893k39K709K22k710n94K725J008j873
2854A03j302R09R41l20o23p7P26Q01o03j815m6K259Q31j906r53J499O32j751o15
2873a310J977J157j479j534M10R89K18k19J34Q5n90o40J79R34P36n95j085J30
2891e03M83j67j19P56M27r87j041N36J134J74q91m70O63N30n62r85O39J485l10
2910G92k044k6K003N35k145p81K066J180j715j391J034J399m98j045R0P92M28
2927F74p20j179L94J882L63k118j087J903J365j613j235J533J312j712j558J517
2943b79J656o93j360l5Q39O3l12R6K79Q4n28m23M46Q25j25q98p9P05N8o13K58
$$ plain form
2964 -36 625 305 -618 -487 572 846 -69 -601 -208 612 558 -283 -587 412 930 -229 -1093 211 1631
2983 1631 433 -1522 -753 1361 1154 -827 -998 661 1152 -247 -1064 36 1296 766 -1016 -1158 594
3000 594 1475 9 -1326 -147 1360 299 -1241 -401 1274 688 -1039 -928 562 831 -145 -642 -134
3017 -134 409 199 -185 -188 53 233 -191 -448 56 565 17 -752 -314 446 246 -466 -245 303 -139 -761 -193
3038 -193 823 313 -796 -862 300 768 -275 -895 -30 771 -125 -1157 -455 1063 617 -1018 -1152 415
3056 415 1120 -244 -1190 -199 960 222 -1076 -720 748 992 -475 -1404 -168 1198 478 -1028 -776
3073 -776 761 815 -580 -979 416 1170 -109 -1125 -201 1048 503 -657 -591 474 644 -177 -446 212
3091 212 587 4 -477 -23 660 272 -467 -234 525 410 -283 -176 543 347 -426 -241 676 649 -384 -708
$$ packed form
2964c6O61l20r23J31J059K74r15n32L93Q20n4q41l04R99N18j159q64J304J420
2983A631j198j955P69K114k07j981j71J659M91j399q17J100J260n30j782j42J752
3000E94Q81j466j335J179J507j061j540Q40J675n86j727J11J490K69r76m97N08
3017a34N43k10l84lK41J80m24k57N04N09n48p69M38P60k00p12K21N48m42o22N68
3038a93J016n10j109o6J162M68j043o20Q65Q01q96j032P02J518m46j635j34J567
3056D15P05j364r46R91J159p38j298L56J468K44j467r29J236J366p20j506K52
3073g76J537N4j395l99J395P54j279j016R24J249n45j160O6J065J70q21k69O58
3091B12L75n83m81M54O83l88p39K33P59j15o93J07P19j96p73J85R17k7j033l24
$$ plain form
3111 -708 289 878 119 -558 -58 713 345 -471 -372 620 905 -244 -999 -21 1160 616 -815 -785 702
3130 702 1035 -355 -1040 217 1198 121 -1201 -622 1002 903 -717 -1068 392 1003 -248 -1126 -77
3147 -77 1092 347 -1024 -719 591 735 -319 -787 12 591 12 -701 -263 537 220 -570 -531 289 427
3166 427 -395 -598 206 424 -326 -619 14 347 -274 -557 126 490 -242 -807 -163 591 299 -578 -614 151
3186 151 469 -119 -615 -148 620 164 -905 -675 655 940 -560 -1207 102 1259 202 -1163 -494 1018
3204 1018 666 -889 -915 671 1100 -248 -1041 -65 988 528 -680 -584 589 825 -193 -918 92 1094
3222 1094 394 -935 -596 858 824 -387 -595 485 703 -391 -641 506 873 -124 -644 266 560 -27
3240 -27 -264 199 361 -142 -278 195 383 143 -82 -54 139 200 165 -257 -240 518 481 -408 -730 353 838 -209
$$ packed form
3111g08R97N89p59o77N00P71l68q16R9R92K85j149p55R78J181n44j431L0J487
3130G02L33j390o85J257R81j077j322N79J624r9j620l51J460O11j251q78J049
3147g7J169p45j371L05J310J44j054m68P99N79n79p13M38Q00l17p90L9Q20J38
3166D27q22k03Q04K18p50k93O33L33o21k83O83L64p32n65O44P54k92q77l6P65
3186A51L18n88m96M67P68m56j069K30J330K85j500o47J309J157j057j365O69J512
3204A018l52j555k6J586M29j348p93R76J053m60j208R6J173K36j018p25J010J002
3222A094p00j329L39J454l4j211k08J080K18j094k50J147L67r97n20R10K94n87
3240b7k37M63J62n03j36M73J88k40k25K8J93O1l5m22J7P58l7q89l22J083M85j047
$$ plain form
3262 -209 -926 368 1145 -116 -1345 -242 1307 633 -986 -726 615 575 -472 -635 248 719 47 -790
3280 -790 -672 340 948 8 -992 -343 820 274 -1135 -628 994 813 -991 -1186 491 878 -478
3297 -478 -842 277 538 -497 -780 92 466 -96 -329 10 -25 -177 -114 63 -66 -6 147 -64 -365 -62
3317 -62 291 -132 -415 309 564 -597 -1047 417 1160 -195 -1047 212 968 -434 -1239 464 1569 6
3335 6 -1295 -398 778 431 -266 -105 299 191 -108 -293 -305 408 960 148 -1096 -399 1166 725 -922
3354 -922 -645 1305 1022 -1200 -1244 1037 1381 -410 -962 479 876 -444 -689 401 766 64 -211 -91
3372 -91 -84 14 315 193 -158 93 338 -244 -586 311 931 120 -633 85 589 -411 -673 659 1078 -442
3392 -442 -1171 166 866 -227 -734 454 870 -407 -1089 4 749 224 -417 -158 -19 -36 44 -166 -446
$$ packed form
3262b09p17J294P77j261j229J103J549o74j619K60J341m0j047j63Q83M71o72q37
3280g90J18J012O08r40j000O49J163n46j409N07J622j81j804j95J677L87j356
3297d78l64J119K61j035k83Q72L74n62k33L39l5j52O3J77j29O0J53k11l01L03
3317f2L53m23k83P24K55j161m50J464P43j355q52J259P56j402q05J703J105j563
3335Fj301Q97J176l47o97J61M04j08k99j85j2P13N52q12j244O97J565m41j647
3354i22K77J950k83k222m4K281L44j791n52J441L97j320k45J090L65p02k75J20
3372i1PR8L01j22l51K51K45n82l42Q97O20q11p53P18N04j000k62J332M19j520
3392d42p29J337P00j093n07J188M16j277o82J093P45n25o41K59J39j7Q0k10k80
$$ plain form
3411 -446 116 847 -12 -1353 -584 1102 582 -1170 -684 1259 655 -1600 -1224 1150 1222 -806 -1067 348
3429 348 479 -607 -510 438 549 -198 -451 -404 -368 201 609 23 -675 -152 376 -282 -629 411 956 -150
3449 -150 -997 -101 660 -62 -443 462 661 -455 -885 174 764 -48 -452 324 524 -350 -691 106 618
3468 618 240 -133 -73 -147 27 130 -2 -76 460 688 -370 -1081 -26 1333 585 -933 -429 1042 350
3487 350 -1108 -430 1420 924 -914 -1019 453 842 -102 -267 295 372 -113 -227 -216 70 597 509 -421 -711
3507 -711 313 726 -212 -728 403 878 -404 -999 149 868 -80 -636 288 530 -359 -699 172 581 -46
3526 -46 -424 45 100 -429 -431 172 381 112 -245 -403 -215 169 281 -114 -348 48 177 -474 -744 223 1007
3547 1007 24 -1150 -448 765 346 -785 -514 684 507 -845 -830 374 715 -115 -752 -169 424 243
$$ packed form
3411d46N62P31q59j341P69J686n20j752M86J943o04k255L76K374P2k028k61J415
3429C48J31j086R7R48J11p47k53M7L6N69M08n86o98N23N28o58l47J040N45j106
3449a50q47Q96P61p22l81R05J99j116m30J059N90q12m04P76K00q74l41P97N12
3468F18l78l73O0p4J74J03j32p4N36K28j058p11J055J359p48j518N04J471o92
3487C50j458O78J850m96j838j05J472L89r44j65N62P7m85j14J1K86N27q8r30k90
3507g11J024M13r38n16J131M75j282n95J148P19r48n56R24K42q89l40Q71M09o27
3526d6l78M69N5n29kO03K09k69l57j58J88L84J12l95k34L96J29o51k70R67P84
3547A007r83j174P02J213m19j131K71J198j77j352J5J204L41q30o37N83N93j81
$$ plain form
3565 243 -360 -580 -8 598 222 -657 -482 489 487 -471 -507 545 739 -433 -923 183 829 97 -453 -34
3585 -34 322 -132 -287 122 468 191 -178 -241 -38 165 209 95 55 59 -46 -226 -16 523 367 -277 -403 211
3607 211 384 -70 -250 307 480 -90 -474 18 719 320 -575 -347 576 676 -242 -621 219 667 21 -532
3627 -532 -106 555 220 -551 -465 470 692 52 -717 -310 540 491 -333 -415 309 489 -351 -676 181 778 47
3648 47 -693 -411 325 281 -174 -178 115 112 -234 -365 6 359 63 -375 -205 54 44 -207 -110 131 -8 -364 -217
3671 -217 279 122 -365 -365 147 230 -214 -359 -76 155 41 -423 -248 365 284 -430 -603 73 637 17 -722
3692 -722 -268 494 314 -402 -327 391 377 -384 -657 33 739 278 -581 -489 212 587 -60 -494 127 573 -31
3713 -31 -649 -171 730 483 -390 -508 203 525 -25 -247 67 292 10 -274 -66 344 307 -51 -167 94 288
$$ packed form
3565B43o03k20N72O06l76q79J75R71kr58l6J052J94j172m90J106O46p32n50M19
3585c4L56m54j55M09L46k77l69o3K03K03M4j14m0Mj05j80K10N39j56o44j26O14
3607B11J73m54j80N57J73n70l84M92P01l99q95K28R23J00r18l79Q40M48o46n53
3627e32M26O61l35p71Q6R35K22o40p69M07Q50m9q24q2P24J80q40l25Q57N97p31
3648D7p40K82P36m4m55mK93ll46j31L71L53k96m38J70K59j0k51R7K41j39l56J47
3671b17M96j57m87%N12Q3m44j45K83K31j14m64J75O13q1p14j73O76N64o20p39
3692g22M54P62j80p16P5P18j4p61k73O90P06m61q59R2P01L75o47m34O21M46o04
3713c1o18M78R01k47q73j18P11L22n50k22L14K25k82k84K08M10l7l58j16K61J94
$$ plain form
3734 288 50 -64 100 253 -87 -175 123 428 30 -243 60 359 162 -109 -95 310 300 -228 -339 180 492
3755 492 93 -497 -149 603 346 -530 -432 382 469 -224 -479 150 496 -38 -538 -152 467 428 -244 -616 -77
3776 -77 590 195 -516 -364 366 336 -511 -578 299 578 -149 -685 -142 440 98 -357 -230 183 131 -345 -365 43
3798 43 292 16 -385 -246 87 49 -181 -122 132 -6 -450 -277 234 160 -239 -215 103 25 -275 -218 230 222 -257
3821 -257 -524 -63 315 128 -329 -208 233 255 -196 -297 69 389 142 -399 -208 342 379 -148 -455 74 586
3842 586 162 -547 -209 625 500 -450 -483 387 680 -172 -489 195 595 110 -278 -63 380 243 -100 -185 109
3863 109 396 181 -240 -169 302 383 -53 -262 149 301 -146 -122 289 308 -172 -244 217 341 -76 -202 196 161
3885 161 -239 -197 315 253 -145 -289 -2 165 194 -66 -199 -98 159 169 -177 -273 194 360 -326 -674 149 682
$$ packed form
3734B88k38j14J64J53l40q8K98L05l98k73L03K99j97k71J4M05j0n28j11N19L12
3755D92l99n90L48P52k57q76R8Q14Q7o93k55O29L46n34n00L86O19l9o72l72N39
3776g7O67l95p11J52P30l0q47o7Q77K79p27n36N43N82l42m55J27M13n2m76k0M08
3798D3K49k76m01J39L33l8k30N9K54j38m44J73N11p4l99K4L18p8l00N7M48qm79
3821b57k67M61L78j87m57J21M41K2m51j01L66L20k47n41J91N50L7n27l07N29N12
3842E86m24p09L38Q34j25r50l3Q70K93q52l17O84M00m85l88K15M43j37l43q5K94
3863A09K87k15m21P1M71Q1m36k09M11J52m47K4M11J9m80p2M61J24m17j26L98l5
3885A61m00M2N12o2l98j44K87J67K9k60j33J01K57J0l46r6M67J66o86l48Q23N33
$$ plain form
3907 682 -41 -790 -226 545 164 -647 -224 464 236 -594 -484 137 362 -9 -316 -262 -87 181 32 -254
3927 -254 -97 318 153 -606 -451 432 442 -362 -603 225 471 -343 -476 201 395 -241 -396 180 237 -335 -212
3948 -212 257 224 -199 -113 169 -26 -228 35 339 29 -200 -75 -65 -102 220 340 -144 -476 155 509 -124
3969 -124 -372 361 644 -264 -743 182 856 205 -501 -82 414 92 -251 72 344 241 42 -106 -221 86
3989 86 582 299 -439 -272 480 342 -536 -311 802 617 -577 -534 524 621 -396 -362 489 431 -258 -243 249
4010 249 132 -186 74 373 -77 -314 91 237 -172 -56 309 95 -445 -143 325 102 -303 99 302 -291
4030 -291 -486 296 566 -340 -587 219 400 -412 -580 275 572 -258 -537 82 342 -160 -280 -21 105 -37
4050 -37 -24 -53 -316 -93 324 41 -510 -253 522 108 -747 -374 693 440 -719 -548 447 325 -437 -382 429
$$ packed form
3907F82p23p49N64P71l81q11M23O88k28q30J10O21K25l71l07N4J75K68j49k86
3927b54J57M15j65p59J55Q83J0q04k41Q28K46q14j33O77J94o36j55N76N7n72J23
3948b12M69l3m23Q6K82j95k02K63L04l10k29J25J0l7L22J20m84l32O31L54o33
3969a24k48P33K83r08m79R25O74o51p06M19M96l22l43L23K72j03j99j48j15L07
3989H6M96k83p38J67P52j38q78K25J113j85j194M3J058R7j017L4Q51n8o89J5M92
4010B49j17l18K60K99m50k37M05J46m09J16L65k14n40L02M68k23m05M02K03n93
4030b91j95P82K70r06k47Q06J81q12j68Q55K97q30k79O19K60n02j20K59J26j42
4050c7J3k9k63K23M17k83n51K57P75m14q55L73J067k53j159J71R95j22p62N5Q11
$$ plain form
4071 429 286 -400 -351 76 48 -44 164 132 -338 -180 270 112 -250 93 402 -101 -501 52 418 -33 -250
4092 -250 247 344 -320 -429 276 452 -256 -240 421 280 -464 -327 523 574 -108 -261 148 124 -76 129 374
4113 374 157 67 41 -276 -178 364 685 108 -497 -186 435 129 -415 13 735 170 -723 -415 475 584 -153
4134 -153 -297 201 117 -261 -263 157 355 162 -53 -246 -177 27 308 79 -111 92 205 -238 -507 95 483
4155 483 4 -321 -5 157 -269 -320 256 394 -181 -375 -28 -33 -351 -7 356 91 -402 -406 -40 78 76 95 -71
4178 -71 -311 -154 -19 -144 -88 250 164 -337 -494 63 397 -50 -461 -64 333 27 -453 -250 309 287 -162
4199 -162 -299 93 234 -73 -240 -82 229 180 -142 -315 -66 187 159 -110 -115 94 148 -206 -267 231 470 60
4221 60 -316 -236 253 238 -81 129 201 -55 -278 -26 312 181 9 55 82 -158 -72 263 351 5 -140 -32 144
$$ packed form
4071D29j43o86M9M27k8r2K08l2m70J58M50j58l62L43L09n03m00N53L66m51k17
4092b50M97R7o64j09P05J76p08J6O61j41p44J37Q50N1o82j53M09k4k00K05K45
4113C74k17r0k6l17R8N42L21n77o05L11O21l06n44M28P22n65q93L08Q90J09p37
4134a53j44M98q4l78kM20J98j93k15j93O9K04K81k29j90K03J13m43k69O02L88
4155D83m79l25L16J62m26n1N76J38n75j94L47nl18L44L63k65m93mL66J18kJ9j66
4178g1k40J57J35j25N6L38q6n01j57N57L34m47m11L97L97l06m80K03N59k2m49
4199a62j37L92J41l07j67J58L11m9l22j73K49K53k8k69nK09N4l54o1M98K39m10
4221F0l76Q0M89j5l19K10P2k56k23K52L38j31j72M6K7k40Q6L35Q8l46j45J08J76
$$ plain form
4244 144 98 24 65 -18 112 128 -5 -91 154 237 -20 -147 103 254 32 -249 -161 311 353 -44 -237 -2 293
4267 293 -41 -205 -38 323 186 -358 -342 157 374 73 -236 -128 80 28 -51 -124 65 178 -108 -368 -236
4288 -236 240 217 -223 -228 43 68 -189 -142 153 -18 -192 -166 92 -23 -174 -50 51 -161 -213 29 67 -133 -187
4311 -187 -21 43 35 2 -80 -171 -52 146 27 -97 -10 123 -81 -272 -165 363 298 -278 -364 88 282 80 -146
4334 -146 -64 223 -1 -196 -83 289 265 -75 -330 -35 193 213 -64 -191 32 140 30 -95 62 375 159
4355 159 -206 -210 266 335 8 -235 90 232 -35 -81 107 146 2 -88 24 160 47 76 62 -46 -2 198 183
4378 183 -4 -70 -11 38 33 123 44 -60 -8 63 95 -14 9 164 -6 -222 -132 194 219 -79 -267 -101 169 54
4402 54 -103 -110 79 49 -162 -173 53 233 94 -257 -293 22 260 5 -336 -103 171 16 -306 -167 235 63
$$ packed form
4244A44m6p4M1q3J30J6j33q6K45Q3k57j27K50J51k22k81Q8M72M2l97j93K35K95
4267B93l34j64J67L61j37n44J6M99K17l01l09J08K08n2p9p3J89J13k86k60J32
4288b36M76k3m40nK71K5k57M7K95j71j74K6K58j15j51J24J01k12n2K42L8k00n4
4311a87J66O4ql3q2r1J19J98j19j24Q7J33k04j91J07N28o5n76q6M52J94k02k26
4334a46Q2K87k24j95J13L72k4l40k55K95K28K0k77j27K23J08j10j25J57L13k16
4355A59l65mM76O9l27k43L25J42k67m6J88L9j44r0J12J36j13K9j4j08M4K00j5
4378A83j87o6N9M9nR0p9j04N2P1L2j09K3J55j70k16R0L26K5k98j88J66K70j15
4402E4j57pJ89l0k11j1K26J80j39l51l6L15K38k55l41K33K74j55l22J39M02j72
$$ plain form
4424 63 -287 -293 64 239 -16 -235 -144 -39 -40 -45 -67 20 -49 -18 -103 -81 40 123 -16 -185 -121 100 15 -9 -54 -107 -50
4451 -50 19 62 8 -50 -96 11 29 -145 18 135 35 -139 -170 143 297 6 -163 -46 120 188 -77 -113 13
4474 13 128 30 -88 29 212 228 -67 -242 -14 368 127 -150 -43 237 170 -129 -146 206 328 -36 -130 24
4496 24 161 174 72 -57 7 96 147 -14 -33 93 159 -69 -153 54 198 72 -163 -51 99 27 24 88 -25 -63
4520 -63 -20 119 24 -31 20 50 -35 -148 -34 132 -37 -137 -108 54 60 20 -6 -163 -80 28 27 -78 -178 134 58
4545 58 -165 -276 -67 215 -68 -283 -207 192 -14 -271 -235 42 69 -114 -263 -57 141 40 -146 -166 -38 192
4567 192 114 -150 -155 7 92 -112 -172 59 93 -92 -218 47 135 27 -136 -18 -21 -15 45 74 8 -128 10 104 -31
4592 -31 -100 150 224 -57 -99 36 231 110 57 41 25 -46 10 127 0 -71 164 167 -61 -100 101 289 63 -202
$$ packed form
4424F3l50oL57J75k55k19R1J05jnk2Q7o9L1q5K2J21Q3j39j69O4K21q5k4m5n3N7
4451e0O9M3n4n8m6J07J8j74J63J17j00j74l1L13J54k91j69J17J66O8k65l6J26
4474A3J15r8j18J17J83J6k95j75K28L82k41k77J07K80o7k99j7L52J22l64r4J54
4496B4J37J3j02j29O4Q9N1j61j9J26O6k28q4K07J44j26k35J12J50p2lO4j13l8
4520f3M3J39r5n5N1L0q5j13J14J66j69j00K9J62Om0k6j57Q3J08jj05j00L12p6
4545E8k23j11K09K82k83k15P6L99k06k57L6K77K7j83j49K06J98j01j86k0J28K30
4567A92p8k64nJ62Q5k04o0K31L4j85j26K65Q8j08j63J18lOO0K9o6j36J38R4j35
4592c1o9K50P4k81m2J35J95j21n3j6j6p1N6J17j27p1K35Lk28l9K01J88k26k65
$$ plain form
4616 -202 18 197 3 -167 80 229 179 -105 -126 99 80 102 86 -55 3 155 35 -141 -32 211 198 -52
4638 -52 -232 121 176 -23 -160 78 179 -106 -218 -68 90 77 -12 17 -68 -125 -5 97 36 -134 4 53 -139
4661 -139 -210 15 240 72 -175 -135 -5 -80 -24 37 -49 -78 -88 -69 -105 -132 120 147 -100 -302 -96 166 42 -173
4685 -173 -36 101 -73 -239 -124 72 102 -77 -81 -119 -113 67 56 -78 -65 88 95 -188 -307 101 281 -60 -228
4708 -228 71 203 -92 -275 34 325 81 -95 -102 -57 -8 80 201 64 -138 -63 115 -60 -86 164 177 -76 -255
4731 -255 -51 247 86 37 135 128 -91 -119 88 172 8 108 166 -117 -176 59 369 78 -197 -19 234 49 -141
4754 -141 44 207 20 -120 51 119 -40 35 121 -2 -20 126 165 -192 -258 174 442 -34 -258 -25 168 -94
4776 -94 -244 191 311 -89 -261 -142 21 -24 94 107 -91 -203 -10 134 -56 -115 236 131 -238 -342 116
$$ packed form
4616b02K20J79j94j70K47J49n0k84k1K25j9K2j6j41N8J52j20j76J09K43j3k50
4638e2j80L53N5j99j37K38J01k85j12J50J58j3q9K9q5n7J20J02o1j70J38M9j92
4661a39p1K25K25j68k47M0J30p5N6O1q6k9j0J9l6k7K52K7k47k02K06K62j24k15
4685a73J37J37j74j66J15J96L0j79ml8OJ80j1j34J3J53Pk83j19M08J80l41j68
4708b28K99J32k95j83L09K91k44j76pM5M9Q8J21j37k02P5J78j75k6K50J3k53j79
4731b55K04K98j61m9R8pk19k8K07Q4j64J00N8k83n9K35L10k91k75J78K53j85j90
4754a41J85J63j87j40J71O8j59P5Q6j23j8J46L9l57o6M32K68m76k24K33J93k62
4776i4j50M35J20m00j72J19J63m5J18J3j98j12J93J44j90n9L51j05l69j04M58
$$ plain form
4797 116 250 -125 -174 42 51 -186 -188 83 72 -141 -31 -3 -126 -229 128 135 -160 -210 42 129 -228 -262 116 210
4821 210 -36 -158 11 -72 -182 8 159 105 -179 -58 7 -194 -124 240 362 -102 -421 15 279 8 -161
4842 -161 165 137 -116 -265 108 290 97 50 4 -39 -126 119 237 35 -74 113 151 -181 -134 162 273 -54
4864 -54 -147 128 156 -40 -50 195 135 22 112 88 -105 -130 181 228 -52 -43 154 99 -203 -116 299 290 -98 -105 60 28
4890 28 0 93 294 39 -158 -46 82 -19 -65 184 172 -310 -290 170 296 -108 -172 20 96 -106 -103 41 75 -26
4914 -26 -75 -51 -65 -41 69 36 -180 -225 106 47 -275 -151 114 170 -185 -289 69 112 -203 -130 101 50 -104 -95 -82
4939 -82 -111 -53 116 25 -152 -156 72 -11 -243 -21 174 40 -288 -181 136 104 -43 8 58 -40 -88 52 96 12 22
4964 22 70 20 -133 -10 172 75 -82 -36 71 107 -18 -24 29 100 80 11 -27 -37 64 92 57 -63 57 102 60 -74
$$ packed form
4797A16J34l75m9K16Rk37kK71j1k13J10K8j23j03L57Pk95n0K52Q7l57l4L78R4
4821B10k46j22J69q3j10J90J51n4k84J21O5k01P0L64J22m64l19M36K64k71j69
4842a61L26k8k53j49L73J82j93m7m6m3q7K45J18k02j09J87L8l32M7K96J11l27
4864e4r3K75K8j96j0K45o0j13R0k4j93k5L11M7k80RJ97n5l02Q7M15rl88pJ65l2
4890B8k8R3K01k55j97J12J28j01m6K49j2m82K0M60J26m04o4J92P6k02LJ44L4j01
4914b6m9K4j4K4J10l3k16m5L31n9l22J24K65N6l55j04L58M3l15P3K31n1j54RJ3
4939h2k9N8J69r1j77mK28q3k32K22J95j34l28J07L17l2j47N1N0r8m8J40M4q4J0
4964B2M8n0j53J23J82r7j57M6J07L6j25oN3P1k0o9l8j0J01K8l5j20J20M5m2j34
$$ plain form
4990 -74 9 182 186 -98 -132 157 178 -28 -60 102 74 7 -6 55 89 114 144 -8 -128 28 193 84 -88 61 149
5015 149 21 -181 -105 182 100 -112 -65 82 137 -15 30 11 21 -23 -10 -35 -59 44 75 -39 -100 -83 17 30 -151
$$ packed form
4990g4Q3J73Mk84l4K89K1k06l2J62k8o7j3O1L4K5L0j52j20J56J65j09j72J49Q8
5015A49j28k02P6K87q2k12M7J47N5j52M5j9J0m4J3k5k4J03L1j14o1J7J00J3j81
$$ [...]
8191A6
##END NTUPLES=NMR FID
##END=
