##TITLE=1H_IBPA2401A
 D2O
 8 sc, 
 25.1.2023
##JCAMPDX= 6.0         $$ Bruker NMR JCAMP-DX V2.0
##DATA TYPE= NMR FID
##DATA CLASS= NTUPLES
##ORIGIN= UXNMR, Bruker Analytische Messtechnik GmbH
##OWNER= root
$$ XWIN-NMR		Version 3.5
$$ Wed Jan 25 16:05:52 2023 Russian Standard Time (UT+4h)  she@DPX200
##.OBSERVE FREQUENCY= 200.13135
##.OBSERVE NUCLEUS= ^1H
##.DELAY= (6, 6)
##.ACQUISITION MODE= SIMULTANEOUS
##.ACQUISITION SCHEME= undefined
##.AVERAGES= 8
##.DIGITISER RES= 18
##SPECTROMETER/DATA SYSTEM= spect
##.PULSE SEQUENCE= zg30
##.SOLVENT NAME= CDCl3
##.SHIFT REFERENCE= (INTERNAL, CDCl3, 0, 15.7039)
##AUDIT TRAIL= $$ (NUMBER, WHEN, WHO, WHERE, WHAT)
$$ ##TITLE= Audit trail, XWIN-NMR		Version 3.5
$$ ##JCAMPDX= 5.01
$$ ##ORIGIN= Bruker BioSpin GmbH
$$ ##OWNER= she
$$ F:/spectra/data/she/nmr/H-F/1/audita.txt
$$ ##AUDIT TRAIL=  $$ (NUMBER, WHEN, WHO, WHERE, WHAT)
(   1,<2023-01-25 16:04:25.20 +0400>,<she>,<DPX200>,
      <created by zg, POWCHK disabled, PULCHK disabled
       configuration hash MD5:
       00 E9 B6 7A A2 85 ED C7 34 08 36 98 17 FE 4E 26
       data hash MD5: 16K
       36 E5 2F 0A FD 85 84 5E D5 4D C0 26 F6 75 C0 39>)
$$ ##END=
$$ 
$$ hash MD5
$$ A8 EB 71 14 9E 3D 3C 7E 3F 11 69 75 58 E7 F9 7B
##$RELAX= 
##$RELAX= 
##$RELAX= 
##$RELAX= 
##$RELAX= 
##$RELAX= 
$$ Bruker specific parameters
$$ --------------------------
##$DU= <F:/spectra>
##$EXPNO= 1
##$NAME= <H-F>
##$PROCNO= 1
##$TYPE= <nmr>
##$USER= <she>
##$AMP= (0..31)
100 100 100 100 100 100 100 100 100 100 100 100 100 100 100 100 100 100 
100 100 100 100 100 100 100 100 100 100 100 100 100 100 
##$AQSEQ= 0
##$AQ_mod= 1
##$AUNM= <au_zg>
##$AUTOPOS= <>
##$BF1= 200.13
##$BF2= 200.13
##$BF3= 200.13
##$BF4= 200.13
##$BF5= 200.13
##$BF6= 200.13
##$BF7= 200.13
##$BF8= 200.13
##$BYTORDA= 1
##$CFDGTYP= 0
##$CFRGTYP= 5
##$CHEMSTR= <none>
##$CNST= (0..31)
1 1 145 1 1 1 1 1 1 1 1 1 1 1 1 1 1 1 1 1 1 1 1 1 1 1 1 1 1 1 1 1 
##$CPDPRG= <>
##$CPDPRG1= <>
##$CPDPRG2= <>
##$CPDPRG3= <>
##$CPDPRG4= <mlev>
##$CPDPRG5= <mlev>
##$CPDPRG6= <mlev>
##$CPDPRG7= <mlev>
##$CPDPRG8= <mlev>
##$CPDPRGB= <>
##$CPDPRGT= <>
##$D= (0..31)
0 1.2 0 0 0 0 0 0 0 0.06 0 0.03 0 0 0 0 0.0002 0 0 0 0 0 0 0 0 0 0 0 0 
0 0 0 
##$DATE= 1674648264
##$DBL= (0..7)
120 120 120 120 120 120 120 120 
##$DBP= (0..7)
150 150 150 150 150 150 150 150 
##$DBP07= 0
##$DBPNAM0= <>
##$DBPNAM1= <>
##$DBPNAM2= <>
##$DBPNAM3= <>
##$DBPNAM4= <>
##$DBPNAM5= <>
##$DBPNAM6= <>
##$DBPNAM7= <>
##$DBPOAL= (0..7)
0.5 0.5 0.5 0.5 0.5 0.5 0.5 0.5 
##$DBPOFFS= (0..7)
0 0 0 0 0 0 0 0 
##$DE= 6
##$DECBNUC= <off>
##$DECIM= 32
##$DECNUC= <off>
##$DECSTAT= 4
##$DIGMOD= 1
##$DIGTYP= 9
##$DL= (0..7)
0 120 120 120 120 120 120 120 
##$DP= (0..7)
150 150 150 150 150 150 150 150 
##$DP07= 0
##$DPNAME0= <>
##$DPNAME1= <>
##$DPNAME2= <>
##$DPNAME3= <>
##$DPNAME4= <>
##$DPNAME5= <>
##$DPNAME6= <>
##$DPNAME7= <>
##$DPOAL= (0..7)
0.5 0.5 0.5 0.5 0.5 0.5 0.5 0.5 
##$DPOFFS= (0..7)
0 0 0 0 0 0 0 0 
##$DQDMODE= 0
##$DR= 18
##$DS= 0
##$DSLIST= <SSSSSSSSSSSSSSS>
$$ [...]
##$SUBNAM2= <"">
##$SUBNAM3= <"">
##$SUBNAM4= <"">
##$SUBNAM5= <"">
##$SUBNAM6= <"">
##$SUBNAM7= <"">
##$SUBNAM8= <"">
##$SUBNAM9= <"">
##$SW= 18.05172834244
##$SWIBOX= (0..15)
0 0 2 0 0 0 0 0 0 0 0 0 0 0 0 0 
##$SW_h= 3612.71676300578
##$TD= 16384
##$TD0= 1
##$TE= 0
##$TE2= 300
##$TE3= 300
##$TEG= 300
##$TL= (0..7)
0 120 120 120 120 120 120 120 
##$TP= (0..7)
150 150 150 150 150 150 150 150 
##$TP07= 0
##$TPNAME0= <>
##$TPNAME1= <>
##$TPNAME2= <>
##$TPNAME3= <>
##$TPNAME4= <>
##$TPNAME5= <>
##$TPNAME6= <>
##$TPNAME7= <>
##$TPOAL= (0..7)
0.5 0.5 0.5 0.5 0.5 0.5 0.5 0.5 
##$TPOFFS= (0..7)
0 0 0 0 0 0 0 0 
##$TUNHIN= 0
##$TUNHOUT= 0
##$TUNXOUT= 0
##$USERA1= <user>
##$USERA2= <user>
##$USERA3= <user>
##$USERA4= <user>
##$USERA5= <user>
##$V9= 5
##$VALIST= <valist>
##$VCLIST= <CCCCCCCCCCCCCCC>
##$VD= 0
##$VDLIST= <DDDDDDDDDDDDDDD>
##$VPLIST= <PPPPPPPPPPPPPPP>
##$VTLIST= <TTTTTTTTTTTTTTT>
##$WBST= 1024
##$WBSW= 4
##$XGAIN= (0..3)
0 0 0 0 
##$XL= 0
##$YL= 0
##$YMAX_a= 328897
##$YMIN_a= -307574
##$ZGOPTNS= <>
##$ZL1= 120
##$ZL2= 120
##$ZL3= 120
##$ZL4= 120
##$ABSF1= 10
##$ABSF2= 0
##$ABSG= 5
##$ABSL= 3
##$ALPHA= 0
##$AQORDER= 0
##$ASSFAC= 0
##$ASSFACI= 0
##$ASSFACX= 0
##$ASSWID= 0
##$AUNMP= <proc_1d>
##$AZFE= 0.1
##$AZFW= 0.1
##$BCFW= 1
##$BC_mod= 2
##$BYTORDP= 1
##$COROFFS= 0
##$CY= 11.3945322036743
##$DATMOD= 1
##$DC= 2
##$DFILT= <>
##$DTYPP= 0
##$F1P= 2.36226072786647
##$F2P= -0.459571619588291
##$FCOR= 0.5
##$FTSIZE= 0
##$FT_mod= 4
##$GAMMA= 1
##$GB= 0.15
##$INTBC= 1
##$INTSCL= 1
##$ISEN= 128
##$LB= 0.24
##$LEV0= 0
##$LPBIN= 0
##$MAXI= 10000
##$MC2= 0
##$MEAN= 0
##$ME_mod= 0
##$MI= 1.114404
##$NCOEF= 0
##$NC_proc= 0
##$NLEV= 6
##$NOISF1= 3.799351
##$NOISF2= 2.8
##$NSP= 1
##$NTH_PI= 0
##$NZP= 0
##$OFFSET= 15.70392
##$PC= 1
##$PHC0= -19270.29
##$PHC1= 6.200793
##$PH_mod= 1
##$PKNL= yes
##$PPARMOD= 0
##$PSCAL= 0
##$PSIGN= 0
##$REVERSE= no
##$SF= 200.130013532006
##$SI= 16384
##$SIGF1= 3
##$SIGF2= 2
##$SINO= 400
##$SIOLD= 16384
##$SREGLST= <1H.CDCl3>
##$SSB= 0
##$STSI= 0
##$STSR= 0
##$SW_p= 3612.71676300578
##$SYMM= 0
##$S_DEV= 0
##$TDeff= 0
##$TDoff= 0
##$TI= <>
##$TILT= no
##$TM1= 0
##$TM2= 0
##$TOPLEV= 0
##$USERP1= <user>
##$USERP2= <user>
##$USERP3= <user>
##$USERP4= <user>
##$USERP5= <user>
##$WDW= 1
##$XDIM= 8192
##$YMAX_p= 0
##$YMIN_p= 0
$$ End of Bruker specific parameters
$$ ---------------------------------
##NTUPLES= NMR FID
##VAR_NAME=  TIME,          FID/REAL,        FID/IMAG
##SYMBOL=    X,             R,               I
##VAR_TYPE=  INDEPENDENT,   DEPENDENT,       DEPENDENT
##VAR_FORM=  AFFN,          ASDF,            ASDF
##VAR_DIM=   8192,          8192,            8192
##UNITS=     SECONDS,       ARBITRARY UNITS, ARBITRARY UNITS
##FACTOR=    0.0002768,     1,               1
##FIRST=     0,             0,               0
##LAST=      2.2672688,     0,               0
##MIN=       0,             -307574,         0
##MAX=       2.2672688,     328897,          0
$$ Real data points
##PAGE= N=1
##DATA TABLE= (X++(R..R)), XYDATA
$$ [...]
1982A400j143l696M66L739N48j489J720J685l017l044J452J400j709M48L691O31
$$ 1400 257 -3439 -2973 766 1314 -175 1545 3230 213 -2831 -1379 21 -1688 -1240 2451 3082
1998C082l007o24J257j963k267K246L343p19j025J795j27m116j437K887R73j227
$$ 3082 75 -549 708 -1255 -3522 -1276 2067 1348 323 2118 1991 -2125 -3562 -675 298 -929
2014i29J960K821k097l676M91J205j766j39L691J659k409j064J346j377k782J105
$$ -929 1031 3852 1755 -1921 -1430 -225 -1991 -2130 1561 3220 811 -253 1093 -284 -3066 -1961
2030a961L131k05j197J964R66l107k145J804O02j712J240L536l26k886K3P97k432
$$ -1961 1170 965 -232 1732 2698 -409 -2554 -750 -148 -1860 -620 2916 2590 -296 -273 524 -1908
2047a908j481L056K698j248n85J655j235l793j87L018L86r25K069J815k717k844
$$ -1908 -3389 -333 2365 1117 532 2187 952 -2841 -3028 -10 376 -549 1520 3335 618 -2226
2063b226J161R61j802M42L558N34k665k04J473j870k527J940K649j002n98K233
$$ -2226 -1065 -104 -1906 -1464 2094 2628 -37 -241 1232 -638 -3165 -1225 1424 422 -176 2057
2079B057K53l338j408J880J30j304J834L070r88k777J28M48k178o14L373J991
$$ 2057 2310 -1028 -2436 -556 -426 -1730 104 3174 2186 -591 -463 -15 -2193 -2807 566 2557
2095B557j638m62J218j600l081Q17K813j71q39K036J014k857j890J612L51j608
$$ 2557 919 457 1675 75 -3006 -2189 624 453 -386 1650 2664 -193 -2083 -471 -120 -1728
2111a728Q67K919jk260K16J030k012k018K109K142r04j86K104m63l394q42J964
$$ -1728 -861 2058 2057 -203 13 1043 -969 -2987 -878 1264 360 174 2278 1815 -1579 -2421 -457
2128d57mq62K336K179j837k474N43L41j918J69L351J048k004k42J133j614k525
$$ -457 -461 -1323 1013 3192 1355 -1119 -576 -235 -2153 -1984 1367 2415 411 169 1302 -312 -2837
2145b837J360K471o73p35K008P51k795j438J583K58j722J099K912m32k079M70
$$ -2837 -1477 994 321 -414 1594 2345 -450 -1888 -305 -47 -1769 -670 2242 1810 -269 201
2161B01O66k319j339K417J829q77m7J608j087l155j48K123m1p08K188J632k299
$$ 201 867 -1452 -2791 -374 1455 578 531 2139 1052 -2103 -2251 -128 -169 -877 1311 2943 644
2178F44k203J061M16j840N45L112L11k144K25J127j864j930J598J917q72l30K077
$$ 644 -1559 -498 -82 -1922 -1377 1735 2046 -98 127 1254 -610 -2540 -942 975 103 -227 1850
2195A850J7k752q26J556l29j271J757K575j087j977P03K57k407m90K911J250j437
$$ 1850 1867 -885 -1711 -155 -484 -1755 2 2577 1490 -487 216 473 -1934 -2424 487 1737 300
2212C00J41J476j598k709P51K078o14n21K212R47k551j459J344k0j638R89K773
$$ 300 441 1917 319 -2390 -1639 439 -175 -696 1516 2463 -88 -1547 -203 -223 -1861 -872 1901
2229A901l36j908P01P97k188j542K069J632j210J67K029o94k890m0J640p05r03
$$ 1901 1565 -343 358 1155 -1033 -2575 -506 1126 -84 83 2112 1418 -1472 -1512 128 -577 -1480
2246a480K153J871j671j626R87j90k045J89K842O16j599L97J172j692k258J231
$$ -1480 673 2544 873 -753 234 44 -2001 -1812 1030 1646 47 444 1616 -76 -2334 -1103
2262a103J654q24j77K237K36k571p63J364m73j397J528K276q80j466J011J35k281
$$ -1103 551 -273 -450 1787 2023 -548 -1311 53 -420 -1817 -289 1987 1107 -359 652 787 -1494
2279a494p11K241J004j049M05J549j040k610L99J515p92n53K147J297j969j249
$$ -1494 -2205 36 1040 -9 396 1945 905 -1705 -1306 209 -583 -1136 1011 2308 339 -910
2295i10J121l56j822P95K472j28j321Q64O59k013j476J485J177r06K29K023k84
$$ -910 211 -145 -1967 -1172 1300 1172 -149 715 1374 -639 -2115 -630 547 -359 -130 1893 1609
2312A609k483l36J313o87j013J735J866j101j317Q75q2j998k59K260O54j138O20
$$ 1609 -874 -1210 103 -584 -1597 138 2004 903 -414 461 379 -1619 -1878 382 1036 -102 518
2329E18J188j504j902P60J152q26j61K146N97j955q44J045n64j520J237K151n13
$$ 518 1706 202 -1700 -940 212 -614 -775 1371 1968 13 -831 214 -350 -1870 -633 1518 1005
2346A005j217R17M54k143j126J892R41j139M97J867q84k264J52J225q27o41J907
$$ 1005 -212 705 1159 -984 -2110 -218 723 -416 81 1948 1064 -1200 -1048 177 -650 -1291 616
2363F16J323j374j079R25k51j789J61K193K72j250Q15J070j715j739J162J118
$$ 616 1939 565 -514 411 160 -1629 -1468 725 997 -253 562 1632 -83 -1822 -660 458
2379D58j078R5K076J67k148m67J163p88j189J447J834p83j023Q66J62j969n96
$$ 458 -620 -525 1551 1718 -430 -897 266 -522 -1711 -264 1570 787 -236 630 792 -1177 -1773
2396a773J858N95r97O58J414j036k025N04J008r63k34J998P50j686n47J051o69
$$ -1773 85 680 -317 341 1755 719 -1306 -802 206 -757 -991 1007 1757 71 -476 575 -94
2413i4j757R60J980l37r63R43N68j912j109J415P30j014M21J777l85k013J49J044
$$ -94 -1851 -891 1089 752 -211 732 1300 -612 -1721 -306 424 -590 -169 1608 1223 -790 -641 403
2431D03j087q55J752J410j146q02J135l30j982P0J908M8j014J106J154j577j683
$$ 403 -684 -1539 213 1623 477 -325 810 480 -1502 -1432 476 524 -490 616 1770 193 -1490
2448a490R51Q14j077J14J966L50j839l58J026p90j343J204J744o64q60J088R6
$$ -1490 -539 275 -802 -688 1278 1628 -211 -569 457 -333 -1676 -472 1272 608 -252 836 932
2465I32j858n77J580K73r94P83J455p93j681N12O62j118l80J741Q79j170m45J019
$$ 932 -926 -1503 77 350 -644 139 1594 801 -880 -368 294 -824 -1204 537 1416 246 -199 820
2483H20o51j820M94J821j61p64J063P08j821j128J022N74q91M42J722k41j630
$$ 820 169 -1651 -1157 664 503 -261 802 1510 -311 -1439 -417 157 -734 -292 1430 1189 -441
2500d41j8Q33r49q47J440J160r16m90J030j25j726j34J442Mr54R73J320r91j553
$$ -441 -459 374 -575 -1422 18 1178 262 -228 802 677 -1049 -1183 259 263 -691 282 1602 611 -942
2519i42N77N80j177j20J840O51j275k63P38q47j340Q08J510k05o21R64J21j579
$$ -942 -365 215 -962 -1082 758 1409 134 -129 609 -238 -1578 -770 740 535 -86 878 999 -580
2537e80p66J150M32p71M72J354n70j419M17O82j071n04J473P82j022l01J141m09
$$ -580 -1346 -196 236 -535 -63 1291 721 -698 -281 401 -670 -1174 299 1081 59 -242 899 490
2555D90j691J44J437j88p65J069J068j316j217O62L19r85L39J791J17j357j69
$$ 490 -1201 -1057 380 192 -573 496 1564 248 -969 -307 12 -973 -634 1157 1274 -83 -252
2572b52O91r35j052J273J350p93n00J076j00j734k21J468K0r94Q06J239q75j230
$$ -252 439 -496 -1548 -275 1075 282 -218 858 758 -976 -1197 271 291 -703 103 1342 467 -763
2590g63O72N79j222m69J641O25j099m7J050o93j601L83J406l38m63J183N54j608
$$ -763 -91 488 -734 -1203 438 1063 -36 -83 967 274 -1327 -944 462 124 -339 844 1398 -210
2608b10r52Q91K94r27O54J667m55j468K93P10j138n72J349R23r48l67R98j01j643
$$ -210 -1162 -271 23 -904 -250 1417 962 -506 -213 497 -641 -1213 136 1059 111 -256 742 641 -1002
2627a002J34J328l11r44J041J055j054r54Q18J02j238Q5J645L16j139K72O56j083
$$ -1002 -868 460 149 -795 246 1301 247 -707 111 213 -1025 -940 705 1021 -118 154 810 -273
2645b73j171R06J086m42k69J140P0j691m80J178n0p91Q74J234p62j181N91M34
$$ -273 -1444 -538 548 106 -163 977 1047 -644 -1124 54 4 -787 87 1321 559 -622 -31 403
2663D03j046l75J378M63r81J41R11n38j398M45R76n60m08J278N35j231o63Q50
$$ 403 -643 -1018 360 823 -158 -17 894 356 -1042 -597 379 -181 -589 689 1224 -7 -670 180
2681A80k16j081N59J584j51j078L51N18j194r01J289R72p96j32J077l37j478J5
$$ 180 -36 -1117 -558 1026 875 -203 148 666 -528 -1429 -140 832 36 -96 981 644 -834 -819
2699h19J039k39o39Q77R48r04q19O88J69j116p3J347K42r67M28P36p84j237O34
$$ -819 220 -19 -658 219 1167 263 -556 132 301 -815 -888 459 701 -266 162 898 114 -1123 -489
2718d89R30o15k53J262L41j436n53R30j57r15O88J337m01r94M15L60j095m09J167
$$ -489 441 -174 -427 835 1176 -260 -813 117 -40 -955 -267 1070 669 -325 90 450 -645 -1054 113
2737A13O04q08pR72m38j358L60Q74m97m91J157O56j072o22P75k1j112K38J329
$$ 113 717 -91 -98 874 436 -922 -562 312 -185 -676 481 1137 65 -557 218 197 -915 -677 652
2756F52O0r74M26O89j078r94Q65Q68n97j60J051M0j334j80Q16l07o53Q32J072
$$ 652 712 -262 164 853 -225 -1219 -354 514 -83 -243 808 848 -486 -666 150 -157 -810 22 1094
2775A094o26r19N74K93j177j72J253L09q72L51Q22p82j092M42Q56o38k24J191
$$ 1094 468 -451 123 416 -761 -933 320 629 -243 108 930 148 -944 -502 354 -284 -508 683
2793F83L18j113m25Q10k43r72M54J327k78q53N25M35j140n80J119N10q67K04J050
$$ 683 1001 -112 -537 273 30 -942 -488 839 561 -292 233 668 -472 -1052 67 577 -290 -86 964
2812I64l76j290K11P91n43n53J076P81q37o25O75l5j139J63J267L6q49M46P91
$$ 964 588 -702 -491 300 -243 -796 280 1061 224 -401 274 239 -900 -737 530 566 -283 163 954
2831I54r57j108P68O79o47p8J183L0j264o2Q15m86q03Q15J133o33p20P79J65j253
$$ 954 -3 -1111 -343 336 -311 -389 794 824 -440 -502 313 -173 -976 -161 972 339 -381 398 563 -690
2851f90k98J194K78p98L39Q99n18j169L42O98n94l35J114N10j007l35P33l29r97
$$ -690 -988 206 484 -314 25 924 406 -763 -421 277 -317 -652 462 972 -35 -370 363 34 -963
2870i63N06J091k88o01O59L36j126n72R90L35p21K12J003k40j117J10P51o39o04
$$ -963 -457 634 346 -255 404 740 -386 -958 32 367 -354 -142 861 621 -496 -386 365 -274 -878
2889h78R36R07q38m66P03j4j073l8J169n3p02N54O90p97q46N17M78o49l3J065
$$ -878 58 965 127 -339 364 350 -723 -761 408 355 -347 207 897 100 -746 -229 249 -400 -433 632
2909F32J53j023j18P19m77q40O85J002m87n46P06K52j215l51J008K57p13L17R19
$$ 632 785 -238 -356 363 -114 -954 -269 733 246 -300 406 658 -557 -908 100 357 -356 -39 880
2928H80l73j043J57O38n75l47Q95O12p94l61O84k32q82K38R31p7o00O04M55r76
$$ 880 507 -536 -379 259 -316 -663 232 844 50 -311 373 141 -741 -503 428 351 -249 355 810 -166
2948a66o40P79K44p15J89J114j89j064J94O69o44p41Q98R31o77m45P49O8j181
$$ -166 -806 -27 217 -498 -309 805 616 -448 -254 415 -229 -970 -72 859 182 -263 486 554 -627
2967f27k27J089K01o87L56P80o24r79M50N72p09j09R70L22r24j37P52m03r32N02
$$ -627 -854 235 436 -251 105 885 261 -718 -268 304 -405 -514 456 778 -146 -283 469 66 -866 -364
2987c64R52l80n85P74L65j068n13R29J75q49L38J073k43j080J95O02o67n36J018
$$ -364 588 208 -377 397 762 -306 -819 110 285 -564 -226 847 604 -476 -281 321 -346 -882 136
3006A36O50o34l27O55k35j067K41R58j94n21O63N05r24o00P33K06p72J32J028
$$ 136 786 152 -175 480 245 -822 -581 377 183 -338 325 830 -94 -694 39 245 -527 -395 633
3025F33n7r83K70P12p02p83P03Q51o13m28R78J66j244k58Q99k1o10N22R12o14
$$ 633 576 -407 -137 575 -127 -910 -207 644 31 -397 581 747 -497 -755 144 123 -487 35 947 333
3045C33q75M08L66p38j62J129L22r24m4O60m44q83N04R34n16n03P62L42r17m49
$$ 333 -542 -134 232 -506 -668 461 783 -141 -185 475 31 -852 -348 586 70 -433 329 671 -246 -695
3065f95Q35J43q42K35J058k30p99L44M42p54o03Q14O27o25l7P26k24j031p0Q64
$$ -695 140 283 -559 -324 734 504 -295 49 491 -263 -866 -52 575 -50 -87 639 415 -616 -686 178
3085A78r8n11P08N92p94p31N62K94p33R3J009j9q86J34P07n47o68N61O66n83k59
$$ 178 80 -431 277 869 75 -656 -94 200 -533 -440 569 550 -336 -202 505 -42 -710 -149 517 -66 -325
3106c25P71J95r74j31O52j25o60M31R26l71p55M33K85r01k82J056M41p25l1O99
$$ -325 446 641 -333 -464 188 63 -597 -166 760 389 -366 67 352 -549 -831 225 666 -59 -90 609
3126F09m73r30L14Q26k15m53P00L34q85l89O55J15o73J81Q86k07p51K88O17o65
$$ 609 136 -794 -480 346 131 -322 378 712 -173 -562 93 208 -465 -284 602 395 -356 -68 549 -116
3146a16o00P09M64o42r2Q67n7r65l3P12l23n78O71Q64n48p87N26J49q17p4J123
$$ -116 -716 -7 457 -185 -277 590 533 -432 -465 247 -76 -654 17 881 333 -454 72 221 -596 -670 453
3167D53J71p89Q3O15n06q70N74P17m01m11P69K17r20k56P97r6o63K71Q83l45o82
$$ 453 624 -165 -82 533 27 -843 -269 448 47 -364 405 622 -298 -554 243 147 -516 -245 638 293 -389
3188c89N16L78p71n55R17M35p30N2Q49k75j078K14P39l79m55P92O51q69n56N91
$$ -389 127 505 -266 -821 96 531 -199 -147 702 427 -651 -437 302 -77 -532 260 911 42 -514 77
3208G7R6p61J55J062j61p29K49N48o97n70O74N61o25k01Q04J23r97p3P68k68o67
$$ 77 173 -588 -433 629 468 -261 -12 536 -161 -731 -57 504 -121 -322 482 605 -392 -465 303 35 -632
3229f32N52Q46n45o29O22J79r12j75R59J79o18J89P09o48q25N11N87n16k60Q86
$$ -632 -80 766 221 -408 214 393 -519 -694 265 444 -174 15 724 76 -749 -238 349 -167 -427 459
3249D59K53r91k10P21j13p15L37Q75k54p41M99L86q23m05Q11L22p06J60Q25l13
$$ 459 712 -279 -489 232 119 -596 -259 616 362 -379 120 506 -317 -722 89 411 -295 -135 690 377
3269C77q88K18O39n02m24P62N64o86l80O14p8q62J31R71p4o84L66O17p61o61O19
$$ 377 -511 -293 346 -156 -580 182 746 60 -320 294 216 -646 -515 456 382 -302 64 681 -80 -741 -122
3290a22N51o97r2R06N4q95j16P12l49n78M88P74m35n09M99K07q31j88P49K59o02
$$ -122 429 -268 -360 546 600 -295 -411 301 -48 -626 -138 636 201 -308 191 398 -433 -621 128 387 -215
3311b15J59O73m13p67K55O13m49l17Q03L92q38k42O24p3q68K82R30k72n99M87
$$ -215 -56 617 204 -563 -308 305 -144 -461 342 734 -104 -346 278 205 -663 -381 549 277 -322 165
3331A65M20p23n58P15K88n58J7Q34j08q61P5N77m52m68P34N77o73l12O63p5r31
$$ 165 585 -138 -696 19 307 -251 -234 600 492 -369 -294 283 -169 -637 97 674 1 -311 352 277 -654
3352f54P6R66r4o16M18N86o40p43O34M61p30j65R10L02r46j20O85j79p83L03Q56
$$ -654 -578 388 294 -322 96 682 42 -701 -67 394 -336 -501 409 711 -235 -355 330 151 -632 -329 527
3373E27k75n82M29M24q28l78P50K20n76J52Q09l72p95K79N47n72l44Q73L75p57
$$ 527 252 -330 99 523 -305 -683 67 287 -289 -137 672 300 -495 -216 331 -241 -585 288 663 -94
3393i4k29P40j67q90K23Q82j23o90M38O01p09o37O52L48o76m0Q79Oq42J12N59
$$ -94 -323 417 250 -640 -417 465 342 -348 90 691 -18 -655 -3 345 -331 -371 508 514 -328 -216 343
3414C43m81m84N82O23n81k57O59%r02k7Q32p9o54M94O54o50p06N40M83p42k13
$$ 343 -138 -622 -40 583 2 -255 404 404 -498 -525 307 228 -426 68 722 72 -634 -94 389 -353 -566
3435e66J010K35r12j23P71k68q38L43R29l66m91M91L93p81m54P73J30p05L00Q07
$$ -566 444 679 -233 -356 415 147 -691 -348 581 215 -276 215 608 -173 -627 146 276 -429 -129 678
3455F78l22q00L82M04n81l19O95M37p55r5P61j20r82J87Q49k69n77N88N39p13
$$ 678 356 -444 -62 342 -239 -558 137 574 -181 -276 485 365 -617 -430 419 150 -427 161 700 -13
3475a3n47N52L06o80L5Q18M8p43P2M71l95o18N82O41m73l29N86Q2p98p6P16l3
$$ -13 -560 -8 298 -382 -347 471 519 -224 -152 319 -76 -694 -112 529 56 -273 313 395 -403 -479 237 204
3497B04o52M27O69n41n72M49M26o95l24Q60L11p41j9P42k92r12K80P54k59m98
$$ 204 -448 -21 648 107 -465 -16 410 -285 -609 251 562 -179 -198 544 252 -660 -380 374 115 -383
3517c83O80M05p94n10O33K40p06J59Q67j69p43K25M64n27l79O20M48n70k33O48
$$ -383 297 702 -92 -602 31 271 -435 -276 591 422 -321 -96 368 -159 -538 82 530 -40 -273 375
3537C75L5q63L5P23j48o15M64O11m96n57M88K65p31j25Q49K25p08M4O70n30p15
$$ 375 410 -453 -418 305 157 -458 6 617 121 -436 52 317 -414 -539 310 535 -173 -129 541 11 -704
3558g04M25P42m43k82O43J19q56k34P07R0n34K14P40l85o98L21O04o27m37P54
$$ -704 -279 463 20 -262 381 500 -356 -590 117 207 -327 -113 627 242 -456 -135 469 -158 -595 159
3578A59L87q00l8P64j57p84J75O84l84m77O37N27p04m52O27L4p31R6R23P2q13
$$ 159 546 -254 -292 472 315 -469 -294 390 6 -471 166 693 -11 -463 164 198 -533 -437 486 558 -255
3599b55J66N31n88n69O29O66n43l30P03k3r11M9Q06j96n72M44O50n79n44N41L22
$$ -255 -89 442 -146 -715 -86 580 37 -293 410 387 -524 -475 331 135 -437 7 657 78 -466 75 397
3620C97p37j22Q18M0o56P5P25l18p94L60N86n23k99Q19L73r17k84O34p2o54L75
$$ 397 -340 -462 356 396 -260 -185 540 222 -572 -212 374 -149 -448 371 744 -173 -457 177 105 -549 -174
3641a74P84k92p42M45L32o33l17P13L85o33j10O73j70p49J55O76l02n05N52N00
$$ -174 610 318 -424 21 353 -280 -597 116 501 -132 -242 431 261 -488 -333 343 41 -464 88 588
3661E88o69l68P06O9p61l9Q08ro08K99N64o49n45M80M97n11j50Q07M6q87j20O56
$$ 588 -81 -449 257 326 -435 -474 334 325 -283 16 580 -69 -614 -134 363 -148 -298 509 555 -332 -452 204
3683B04j31n44M46O31m16o36N38L18p01k37P76J95p23J11O67k87o99K74N64m64
$$ 204 73 -471 -25 606 190 -446 92 410 -291 -528 248 443 -280 -169 498 211 -488 -214 350 -114
3703a14l30O33L69n80l28N58k7p12K09P40j06o18L96M11o52m72O45L40n33q6P86
$$ -114 -444 189 558 -22 -350 208 181 -531 -322 418 312 -306 90 501 -151 -623 22 362 -171 -257 529
3724E29j11q39nP55l46n03N56N63n25m57M61K25o23j68P26J30o21J72N90l67n93
$$ 529 418 -421 -426 329 -17 -520 36 599 74 -383 78 303 -320 -488 238 368 -253 -81 509 142 -451
3745d51L11N07m95k39P17J50o97j31O09k35o37M22P53m29n43M69L65p04m26Q43
$$ -451 -140 367 -128 -367 350 500 -197 -328 281 46 -591 -169 584 155 -388 81 446 -258 -684 159
3765A59K52o62OP43j74q90K92O23l07n42O05M60n98l05N77lo76P9P62j77n27M18
$$ 159 411 -251 -245 498 324 -566 -274 349 42 -500 105 565 -33 -338 239 236 -440 -361 401 224 -303 115
3787A15M09n88m32N46L00o08r2Q10L6r17N2P58l62o16M91P00n54m68O06L06q25
$$ 115 524 -64 -496 50 350 -258 -350 460 496 -421 -369 389 27 -589 -98 602 48 -420 186 492 -333
3808c33k43Q09R0o49J98O60l58o73L59M56m47k47O62K32o74j67O37j66p51M05
$$ -333 -576 233 323 -326 -128 532 174 -499 -140 316 -131 -378 284 516 -158 -325 312 146 -605 -200
3828b00P73m53m69N42L71p96l29P11K49p20K3Q05j78p52J56O34m03n00N47N53
$$ -200 573 120 -349 193 564 -232 -561 150 399 -321 -298 507 329 -423 -267 367 -36 -536 11 564
3848E64n83k98N61L4o94m1P14p1m35L36L61m76m50N20K42n13r5Q07r3o79J39N14
$$ 564 -19 -317 244 278 -416 -457 257 186 -249 87 448 -28 -478 42 284 -229 -324 483 390 -289 -150 364
3870C64l67n96N44N78m86m24N98K38p84k02Q06J6o57J83P20l15o72L39M47m80
$$ 364 -3 -599 -55 523 37 -387 211 449 -335 -537 269 285 -372 -189 531 216 -456 -117 330 -150
3890a50k58N78L65o57r8N14j58o97K59P31l52l38M48K66o50l20N99K08o12j8Q37
$$ -150 -408 170 535 -122 -220 294 136 -561 -302 429 77 -261 187 453 -197 -517 82 290 -322 -340 497
3911D97j16p54J62O42n20m32N19M76m78l22N57J09o70p2O53r3m70K91M68l44n12
$$ 497 381 -373 -211 431 -89 -521 -2 474 -4 -326 231 340 -330 -402 251 158 -312 -21 447 103 -409
3932d09M05K60m74j44O56J57o83N7N13k96n77L90N91l84m23N31L69p52k68O74
$$ -409 -4 256 -218 -362 294 451 -232 -175 338 42 -535 -145 446 62 -361 170 539 -213 -481 193
3952A93J55p00J80O97k43o81K48M61m45l68O12L96o02j73O84j32p52J44O86k03
$$ 193 348 -352 -172 525 282 -399 -151 310 -135 -503 109 505 -97 -270 414 282 -470 -326 360 157
3972A57n27M40M73o20m47O49J82o91M3P21Mp13J58N95l88n96N13N42m72l57O46
$$ 157 -370 70 543 -77 -524 125 307 -384 -341 380 384 -329 -171 424 36 -560 -47 495 23 -334 312
3993C12J71q54j10P45j6o29L20O08l44o29M21L51o26j91P62J94p18L0N85j89o60
$$ 312 483 -371 -481 264 248 -381 -61 547 203 -426 -5 346 -280 -471 291 485 -233 -203 382 193 -467
4014d67K97N86m43l62N86K78o25l14P16n9o44J76P45k36n95L45M20o03l67O89
$$ -467 -170 416 -27 -389 197 475 -150 -464 252 193 -451 -275 470 234 -361 -16 404 -199 -566 123
4034A23L53n68j45O13n9p66Q5O90k04n31N13M47n34m37N29K30o14j02P99k2p10
$$ 123 476 -92 -237 376 317 -449 -364 326 122 -409 104 551 17 -420 109 339 -275 -377 422 400 -310
4055c10J92N58l67n63M45M68n52k38O79J82p31j23N98j61n42L31O65l41n70M01
$$ -310 -118 440 73 -490 -45 423 -129 -367 312 494 -237 -360 238 77 -465 -134 531 190 -380 21
4075B1L03n84k49P15L00o18q1N04j89o31K85N70l25m26N55K62n44k83N82P0n43
$$ 21 324 -260 -509 206 506 -112 -193 311 122 -509 -224 346 21 -405 150 412 -132 -415 167 237 -306
4096c06J6O29j03n97L36M60m88m48M56L65m91l5O25K0p83K7N52k55l47L69N66
$$ -306 -290 339 236 -361 -25 435 -53 -501 -45 320 -171 -206 419 439 -344 -317 235 -20 -367 2 568
4117E68m58m86M43J77n40j14P62k2n59L9N28k79n37M37M38m14l71N90K44o51j09
$$ 568 110 -376 67 244 -296 -410 352 330 -229 -190 338 59 -478 -41 397 -17 -388 202 446 -205 -314
4138c14N96o0o17J57O01j77m97L99L30n71m00N91K77m85p0O53j63o63R8N95k15
$$ -314 282 222 -395 -238 363 186 -311 88 418 -153 -553 38 315 -170 -240 413 250 -413 -315 280 65
4159F5m42N13M15o39l23N54J54p19M9P59rp25K27N78l48o33N02M49o13j85O04
$$ 65 -377 136 551 -88 -411 143 297 -422 -373 386 377 -348 -121 457 109 -524 -22 427 -186 -371 233
4180B33K22o00j79O01j74n36L36N73l67m52M93J83o40j92O97J47o02J35O35l55
$$ 233 455 -145 -324 277 103 -433 -97 476 109 -343 150 333 -307 -499 198 345 -257 -122 513 158
4200A58o82L58N52m28l57N91K94o77k34O34P2o28J27O53k58n38L90L35m66l67
$$ 158 -524 -166 386 -42 -399 192 486 -191 -425 209 281 -347 -220 433 175 -363 27 362 -104 -471
4220d71N42K22n08JN88n8o61J87M75l97m08N69M25n55l06N78N2o91M4P05oo47
$$ -471 71 293 -215 -214 374 316 -345 -158 317 -80 -488 81 506 -49 -355 223 275 -416 -372 333 327 -320
4242c20K40M88l43o14N15L94n04j64N48J59o55LN33j79m93K97M87k65m10M66J62
$$ -320 -80 408 65 -549 -34 360 -144 -308 240 399 -256 -253 280 101 -392 -95 392 127 -283 183 345
4263C45n90j40N99M0n35K06N76k79o36K82N17m78l67O04L12o52j28N95j7o29Q9
$$ 345 -245 -385 214 254 -281 -75 501 222 -414 -132 385 -93 -460 144 456 -196 -324 271 254 -375 -286
4284b86O75k04m63K05M98m43m28M58K28l81p2N13k9n75J50M64k77m64M06M32l93
$$ -286 389 185 -278 -73 425 -18 -446 12 240 -141 -213 300 271 -304 -154 310 33 -431 -25 407 14
4305A4l17N00J18n75n8N70On52J90N14l15n24L90L82m53k78N36K93n73j29N03
$$ 14 -303 197 315 -260 -318 252 258 -294 -104 410 95 -429 -39 343 -110 -388 148 441 -132 -261 242
4326B42q0n57J94N44k63l86L65K97m81k65N47J50n33J6N81j63n57K22N13m10l86
$$ 242 162 -395 -201 343 80 -306 59 356 -125 -390 157 307 -226 -210 371 208 -349 -127 386 -24 -410
4347d10N64L08n63k43N68M9o20O5O13j33n50K91N12m31m61M51K82m44k23O67Q0
$$ -410 154 462 -101 -344 224 273 -347 -282 331 198 -352 -61 451 20 -441 10 292 -152 -375 292 372
4368C72o53N3N01j91m68K74N43l47l35M68J47o00j57O86p1m91J56N54l40n36L41
$$ 372 -281 -228 273 82 -386 -112 431 84 -251 217 364 -236 -393 293 222 -269 -113 441 101 -435 -94
4389i4N19n46k90O03K12n27j88N89l4o11Q7O10j86n08M31L15m93k94N17J39m82
$$ -94 425 -121 -411 192 404 -123 -311 278 244 -367 -280 330 144 -364 67 382 -111 -405 112 251 -231
4410b31M2N39j20m99J68L86l62l62N13L52m94k18N55Oo44O8O39j89n49M17M79
$$ -231 -189 350 230 -269 -101 285 -77 -439 74 426 -68 -286 269 275 -369 -301 338 149 -400 17 496
4431D96m46n11M99L08n15j76O23J26o71O2N50k59m39K18M99l46k69M06K15n34
$$ 496 50 -461 38 346 -169 -345 278 404 -267 -205 345 86 -353 -135 364 18 -251 155 370 -164
4451a64j94N92j4m92R6O00k72n75L88M03n26k84O53K07n73p0M94m1o28K26M46
$$ -164 -358 234 220 -272 -176 424 152 -423 -35 368 -158 -442 211 418 -155 -225 269 228 -400 -174 272
4472B72k09l93M23K60m37k78M14J95m68k9N88r6n18J49M07k71l86L74L73m71j62
$$ 272 63 -330 93 353 -84 -362 52 247 -221 -250 338 242 -276 -127 280 9 -377 -3 370 -101 -263
4493b63N22K9n66k1N16p8n00L46M28l25m47L39K86m37j94M98J93n37O0M22j36
$$ -263 259 288 -278 -299 217 139 -361 -15 413 88 -359 -20 266 -171 -365 133 326 -211 -151 271 135
4514A35n62L15N08l89k97M03K20n05j62N28J5m53J9N37j82m40K30M53l89l69M72
$$ 135 -427 -112 396 7 -290 113 333 -172 -334 194 209 -244 -225 312 130 -310 -80 373 -16 -385 87
4535H7K15m23j57N51on57N8M95k14m03L25M59m23l32M14K17n95MN62P5n55O9M43
$$ 87 302 -121 -278 273 267 -290 -232 263 49 -354 -29 430 7 -325 89 306 -289 -285 277 352 -203 -134 309
4558C09k38n02L57M60l68l28M49J81n78l9N23k8n30K03N03l01m01L14L29m40k35
$$ 309 71 -431 -74 386 18 -310 139 320 -258 -297 226 198 -332 -129 374 73 -328 -14 315 -125 -360
4579c60M81J64m90k6N85j84n77K04M89k65k88L76L02m66k92M90O8n48J05O27j78
$$ -360 121 285 -205 -231 354 170 -407 -203 286 21 -267 109 411 -55 -347 143 211 -337 -232 395 217
4600B17n26K14M01l73k96L95L53m93j68M95N5n10M1N07j65n25L83L69l56k82M33
$$ 217 -309 -95 306 -67 -363 32 385 -108 -276 219 274 -236 -195 312 147 -378 5 374 18 -264 169
4621A69Q1n34o2N36L3l96LN06k88n21M02L51l76j79N00J09n76r0N43l3m30R3N08
$$ 169 250 -284 -346 190 223 -173 -170 336 48 -473 -71 280 -96 -275 225 334 -242 -332 211 178 -252 -159 349
4644C49k33m28L26L41m48k38M63R9l72o6N22k9n49R9M08k24l60L99K88l74k14
$$ 349 116 -312 14 355 -93 -331 132 231 -141 -207 315 286 -263 -164 244 20 -340 59 347 -27 -241
4665b41M01j0l76OM82q9m23J88L86l42m03M55K63l79j88M37J08n30J9N09j54m17
$$ -241 160 150 -226 -220 262 173 -250 -62 324 -18 -421 34 297 -82 -270 167 275 -255 -236 273 119 -298
4687b98K67L77l06l20L67J73l77j61M51L2m23J12M49k51l81K37K92k71l11M63
$$ -298 -31 346 40 -280 87 260 -117 -278 173 205 -218 -106 343 92 -289 -52 240 -31 -342 121
4707A21K61n16j50M66j5n55K67L97j42m53K43M16m38k39M46J56l56j46M97k2m93
$$ 121 382 -134 -284 182 167 -388 -121 276 134 -319 -76 340 -98 -337 109 265 -91 -237 260 238 -255
4728b55J20M17j91m21K61M11l22l30M70R6m31r8M55J1m20J38M01l06l51L13K70
$$ -255 -135 282 91 -330 -69 342 20 -310 160 256 -175 -273 182 193 -227 -89 312 6 -345 -32 238
4749B38l56j39M69J15m92q4M78r5n13K74M66k63m76M14K99m61j58M14J68n14O2
$$ 238 -118 -257 212 327 -165 -249 229 134 -379 -105 361 98 -378 36 335 -126 -284 130 298 -216 -154
4770a54M77j22m44J35L68k49l27L86K67m34j39L99K5m44Q1M47j83l56K88L28m20
$$ -154 323 201 -243 -108 260 11 -316 70 337 -97 -236 163 188 -256 -175 272 89 -267 21 349 -71
4791g1k84M13J84m30p3N16j1n40J07M23j38l54K49L45k99k91L48J88m68j1L71
$$ -71 -355 58 242 -188 -261 255 244 -296 -189 234 96 -258 -9 336 37 -254 94 282 -186 -197 174
4812A74o8l16J23L92k23m08L85K35l55j82M29K1m33oM97r4m82J57M66k92l14K97
$$ 174 106 -210 -87 305 82 -326 59 294 -61 -243 186 207 -226 -232 265 171 -311 -154 312 20 -294 3
4834CL38l93k89M82J19m91L0M78n4m58J53L15k57k61L16K65l16j96L65O9m89P6
$$ 3 341 -52 -341 141 260 -231 -201 277 223 -235 -82 233 -24 -285 31 296 -20 -216 149 218 -271 -195
4856a95M57j82l05K28K93l55k16L67K03m73n1M23L5m60Q7M64k37l93K54L58l02
$$ -195 262 80 -225 3 296 -59 -275 92 295 -178 -229 194 229 -231 -144 320 83 -310 -56 302 0
4877@k29L59J36m03p9L19N4l87J05M53k32l58K03L06l11j61L53R5l73j4M37r7
$$ 0 -229 130 266 -137 -216 103 157 -230 -125 328 96 -262 -59 247 -64 -225 128 223 -150 -164 273 176
4899A76m20J68L69k69l10L12K71l54k49L78K02m59l6M75m1m45J21L81l25k17K88
$$ 176 -244 -76 293 24 -286 26 297 -57 -306 72 274 -185 -221 254 213 -232 -111 270 -55 -272 16
4920A6K51k33k93L55J05m24JL90q2k91R1L88k79k95L21J91k84j89M25N5l53QL90
$$ 16 267 34 -259 96 201 -223 -222 168 86 -205 -114 274 -5 -300 21 212 -72 -261 164 219 -134 -126 264
4943B64j74l67J98L68k76k33L65J34m21j47M44L2m74J56L69j26l64J98L46l10
$$ 264 90 -277 -79 289 13 -220 145 279 -142 -289 155 187 -287 -131 238 112 -252 -54 292 -18
4963a8l42M49J78l23j50L89J5m61Q9M15j50l61K25K96l23j75L54J21m39l9N72
$$ -18 -360 89 267 -56 -206 183 198 -263 -174 241 91 -270 -45 251 -72 -247 107 228 -211 -250 322
4984C22j59l96J10M38k31m36L62K83l12k77M44J23m57l1L31N9m05J74L64k40k98
$$ 322 163 -233 -123 315 84 -352 10 293 -19 -296 148 271 -186 -217 114 173 -232 -58 306 66 -232
5005b32K55K85l75j52K88J65m05LL66n0l90J47L27k26k36L14K17l81j90L94L9
$$ -232 23 308 -67 -219 69 234 -171 -168 198 148 -242 -95 232 6 -230 84 301 -80 -270 124 163
5026A63l60P1M04j89l61K25K73k96k07L77J87m01m7L05M1l46%M04j48l38K10K91
$$ 163 -197 -126 278 89 -272 -47 226 -70 -277 100 287 -114 -161 144 185 -161 -161 243 95 -243 -33 258
5048B58k91k37K84J48l79O9L24rm09J40L08j65l20K34K72k62j33L18Q9l56o5L06
$$ 258 -33 -270 14 162 -217 -148 176 167 -242 -102 206 41 -279 -45 227 -35 -168 150 239 -117 -182 124
5070A24k1k98J34L65k62k83K48J90k17k63L92J17l62j9L52m9l84J21L26k65j91
$$ 124 103 -195 -61 304 42 -241 7 197 -20 -283 109 226 -136 -155 197 148 -236 -115 211 -54 -245
5091b45K73K51l52j55L18Q1l66K0M14j08l00J45K60k94k24K88K46k75j21K97O7
$$ -245 28 279 -73 -228 90 171 -195 -175 239 131 -169 -24 236 -58 -282 6 252 -23 -144 153 220
5112B20l95m4M82j05l20J15L44l10k73L15K56l56j20L63j4l33N8L49j17l11J80
$$ 220 -175 -219 263 158 -162 -47 297 -13 -286 29 285 -71 -191 172 158 -175 -117 232 115 -196 -16
5133a6K33k49k55L64J55l46j03L58k3l56J35L37j19l50K22J95k30k55L75J74l37
$$ -16 217 -32 -287 77 232 -114 -217 141 118 -238 -103 234 115 -235 -13 182 -48 -303 72 246 -91
5154i1j07L99k5l51O3L83k44k72K53K40l02k30M35J14l93j01M42q6l23J15L59
$$ -91 -198 201 176 -175 -112 271 27 -245 8 248 -54 -284 151 265 -128 -229 213 127 -196 -81 278
5175B78k57k82K80K34l12j20L53j3l26J1L08j25k74J97L19k30k68K67J99l67p9
$$ 278 21 -261 19 253 -59 -179 174 161 -165 -154 154 29 -245 -48 271 41 -227 40 239 -128 -207
5196b07L46P2l74L3L35j13l67K42L11l05j79L39O8k30j35K76R6m40J00L50j53
$$ -207 139 211 -163 -130 205 92 -275 -33 278 -27 -206 133 201 -29 -164 112 208 -232 -132 218 65
5217F5k65J96J93k84k54L92J15k85j3L38m5m22J37L75k25k59K71K32l39j09K97
$$ 65 -200 -4 189 -95 -349 43 158 -127 -140 198 153 -269 -132 243 18 -241 30 262 -77 -186 111
5238A11R3l61m2L47k0l23R8L07k11j69J99J59k63j74L24J49l85M8K91j01k92K09
$$ 111 204 -157 -199 148 128 -195 -97 210 -1 -170 29 188 -75 -249 75 224 -161 -113 178 77 -215 -6
5260fK15j58k35K22J95l43j25K99J12l81R1K83j01l66K23K70j87j90K08K45l59
$$ -6 209 51 -184 38 233 -110 -235 64 176 -205 -114 169 68 -298 -75 195 8 -182 26 271 -88
5281h8j34L40L1l21P2L10p4k62J03K75k39k03K63R4k46r6L60k5l42Q0K42o0k87
$$ -88 -222 118 149 -172 -100 210 136 -126 -23 252 13 -190 73 167 -79 -175 185 160 -182 -102 140 80 -207
5304b07J22K61k17j66K59J30l05p5L26rl45J03L04j28k82J79K18k13j79K89J50
$$ -207 -85 176 -41 -207 52 182 -123 -198 128 119 -226 -123 181 53 -229 -50 168 -45 -224 65 215
5325B15l16n8L33n1k98J28K91k06k30K44J45j89k17L22L0k82nL79p2m27J84K46
$$ 215 -101 -159 174 123 -175 -47 244 38 -192 52 197 8 -209 113 143 -139 -144 235 163 -264 -80 166
5347A66j16l01K40K13k10j71L43k7l50K2L52o6l39J66L00k43k27K97J02k33j16
$$ 166 50 -251 -11 202 -8 -179 164 137 -213 -191 161 95 -244 -78 222 -21 -248 49 151 -82 -198
5368a98L74kl19KL38j38k69K10K03k20k47L56J44m08K4L00j8k86N2L17j26k70
$$ -198 176 174 -145 -143 195 57 -212 -2 201 -19 -266 90 234 -174 -150 150 132 -154 -102 215 89 -181
5390a81K21J50k42k44L86J28l26o5L08K5l67J15K92j60k79K62J77k52j11L22q
$$ -181 40 190 -52 -296 90 218 -108 -173 135 160 -207 -92 200 40 -239 23 200 -52 -163 159 151
5411A51k72l8K94K7l88J54K56j82k50L01J93k69j21K48N0k79l0L53q6l08J21K94
$$ 151 -121 -159 135 162 -226 -72 184 2 -248 53 246 -23 -144 104 154 -125 -155 198 112 -196 -75 219
5433B19k07k24K43J56k76q6L38K1l51M3L06j02l35J93K78k25j65K78R0k62j26
$$ 219 12 -212 31 187 -89 -175 163 184 -167 -124 182 80 -255 -62 216 -9 -174 104 194 -68 -194
5454a94L08J20l78N0K21p2k62J27L21k53k18L24Q7k97o4L46q6k49J34K36j65k02
$$ -194 114 234 -144 -94 127 55 -207 -80 241 -12 -230 94 181 -116 -180 166 80 -169 -35 201 36 -166
5476a66J45J81j91k06K79J60l22m7L06J0k95O3K49j03k85J83J39j47j14K46O5
$$ -166 -21 160 -31 -237 42 202 -120 -167 139 149 -146 -83 166 63 -222 -39 100 -47 -161 85 150
5497A50k70j5L44j16k95J73J76j51j98J93K17k47j17K09J26k23j07K99n1k67Q6
$$ 150 -120 -135 209 93 -202 -29 147 -4 -202 -9 208 -39 -156 53 179 -44 -151 148 97 -170 -84
5518h4K57j07k15J54J82k75r4L07Ok64N6K11n6k66J40K63j67k50K91J13l19l8
$$ -84 173 66 -149 5 187 -88 -182 125 131 -133 -77 134 78 -188 -48 215 48 -202 89 202 -117 -155
5540a55K90N4l38QL09r0k35J72K40k18k61L09Q3k50oK20J7l43P6K89j41k21K26
$$ -155 135 189 -149 -141 168 78 -157 15 255 37 -224 85 168 -82 -88 132 149 -194 -118 171 30 -191 35
5563C5J75k72q9K02J45l19k0K91q5k27J15K20j36j70J81J30k48j22L01R6l46L5
$$ 35 210 -62 -151 51 196 -123 -143 148 63 -164 -49 171 35 -135 46 176 -72 -194 107 203 -143 -108
5585a08K47o9k71R7K71j22k19J96Q6k20l9K24j5j82J06J57q1k39J37K46j36k34
$$ -108 139 70 -201 -104 167 45 -174 22 108 -112 -151 73 58 -124 -18 139 58 -181 -44 202 66 -168
5607a68J66J44k11j16L33k7k52n4L28j01j87R4K40j88j82K39O0j98n0K53J8l00
$$ -168 -2 142 -69 -185 148 121 -131 -185 143 42 -145 -51 189 1 -181 58 118 -80 -130 123 141 -159
5629a59Q7J95j22j97K07J37k00q6J72J18k65o4L14n1k30K1K89j26j80K00J56k65
$$ -159 -72 123 1 -196 11 148 -52 -138 34 152 -113 -177 137 86 -144 -123 166 40 -140 60 216 -49
5651d9q9K41k0j60m8K41j7k92J65J30o0j71J35K02k76n4J95K9k09L3K32l0k54
$$ -49 -138 103 83 -77 -125 116 99 -193 -28 102 42 -129 6 208 -68 -122 73 102 -107 -74 158 128 -126
5674a26P6J92j16j60J44K06l29m0K27M4k55L2K27p5j66O1J64p2j58J87J15k96
$$ -126 -50 142 26 -134 10 216 -113 -153 74 118 -137 -105 122 47 -119 -58 106 34 -124 63 178 -118
5696a18l7K32M2j97k6K75j54j55J13J45q2k31K60R2j85j34K65kk04K7K24r0k28
$$ -118 -155 77 119 -78 -104 171 17 -138 -25 120 38 -193 67 159 -26 -160 105 103 -101 -74 150 60 -168
5719a68J53K30j92j40J56N9j69l7K41o4j72K9K12j54j07J35J62k03j47K76L9k67
$$ -168 -15 215 23 -117 39 98 -71 -108 133 69 -103 -74 138 -16 -123 12 174 -29 -176 100 139 -128
5741a28J5K49l6k82J58J73j71j71K14J17j51j16K58j3j71p3K18M4k71O1K38j65
$$ -128 -113 136 100 -182 -24 149 -22 -193 21 138 -13 -129 129 116 -55 -128 90 134 -137 -76 162 -3
5763cj92K19J58j54j63J80Q3k53K7J87k7k63J66J66j83j28K12R2k42J1K46n2k22
$$ -3 -195 24 182 28 -135 45 128 -125 -98 89 62 -201 -35 131 -52 -180 32 124 -118 -107 139 87 -135
5786a35M9K45r5j84J19J97k31j34J74J21j60j27K56L3k74Q6K09j42j05J33J25
$$ -135 -86 159 64 -120 -1 196 -35 -169 5 126 -34 -161 95 128 -146 -60 149 7 -98 35 160
5807A60k09o9K04N4k04q8L14j3l32J27K25j37k03K46R5k37l0J62Kj79J1J85J7
$$ 160 -49 -118 86 140 -64 -152 162 149 -183 -56 169 32 -171 75 170 -67 -97 65 67 -112 -101 84 101
5830A01k26R6J70j75l0O1J85k31j10K17K4j77Q7J10p2j55R3J94j66j84K55M9j69
$$ 101 -125 -29 141 -34 -64 -3 182 -49 -159 58 82 -95 -8 102 30 -125 -32 162 -4 -188 67 116 -53
5853e3m0J76k0k33R9K53j32j82R6K05j58j06R4J84k60m2J65N0j94M5K34r6j76
$$ -53 -93 83 63 -170 -71 182 50 -132 -36 169 11 -95 -1 183 -77 -119 46 96 -98 -53 181 85 -91
5876i1N3J71j55j14J93J27k62m1K61j6k52L5K40j26j75J61J09j31j51J89R5k34
$$ -91 -38 133 -22 -136 57 184 -78 -119 142 126 -126 -91 149 23 -152 9 118 -13 -164 25 120 -114
5898a14O5J42%k65R7K07j18j84J32J44j47j06K00O4k10L2J66o5j87O6K41j73j25
$$ -114 -49 93 93 -172 -75 132 14 -170 -38 106 -41 -147 53 117 -93 -61 105 40 -147 -81 160 -13 -138
5921a38J41J17j69q0J66J1j52qJ60N1k08L4K52j03k53J96R4j54r8J90P0k21j1
$$ -138 3 120 -49 -129 37 48 -104 -112 48 99 -109 -75 177 74 -179 17 111 -43 -141 49 119 -102 -113
5944a13K84q4j91N3J58p7j72J79J53k06q8J74n0j28pK42j30j27R7J47j38j26J97
$$ -113 171 87 -104 -51 107 30 -142 37 190 -16 -104 70 20 -108 -115 127 -3 -130 -33 114 -24 -150 47
5967D7Q5j94k8J45j6j30R8J59j68j32J21J72j81j52K44O6k09l2J78L6j71qJ97
$$ 47 132 -62 -90 55 39 -91 7 166 -2 -134 -13 159 -22 -174 70 136 -73 -105 73 109 -62 -70 127
5990A27j10j38O9J25j25n5J61N8k09J3K04q2j93J24K22j97j47J70R7k04o7K11
$$ 127 17 -121 -52 73 -52 -107 54 112 -97 -84 120 38 -155 -31 191 -6 -153 17 114 -90 -157 54
6012E4j0j12pJ90r6r1R0Q2j20j04J92O6j62q3J72M4j83N7J35q2j12O2J20j28l2
$$ 54 44 -68 -75 115 19 -72 18 100 -20 -124 68 134 -28 -111 61 105 -78 -21 114 32 -80 -18 102 -26 -58
6037e8J21Qj01l0J37j5j27O2J52j08j52P9J53j44n7J09Oq5j1J65J6j96L4J49j34
$$ -58 63 71 -30 -60 77 62 -65 -3 149 41 -111 -32 121 -23 -80 29 35 -50 -61 104 120 -76 -42 107 -27
6062b7q6J07J28j34p9J35L3q8m8J37l1j44P6J14j24j26J84Q1k09k9J97J8j27l9
$$ -27 -113 -6 122 -12 -91 44 77 -11 -59 78 47 -97 -21 93 -31 -157 27 108 -101 -130 67 85 -42 -81
6086h1J84pk14O6J88j25j31J16J34j28r9J84j2j24k0K12o2j58N1Q7j36o0J45J00
$$ -81 103 96 -118 -52 136 11 -120 -4 130 2 -97 87 75 -49 -69 143 81 -77 -26 61 -75 -135 10 110
6110A10j24j37K21Nj61J0K07r8j51Q6J79j94r9J75Q9j51l5J19J7j37m1K80o0k58
$$ 110 -14 -151 70 75 -86 -76 131 33 -118 -32 147 -47 -146 29 118 -33 -68 51 68 -69 -110 170 110 -148
6134a48R9J50j86j3J62Pj25m4K05l0j66K1K09j36j53R7J84j39j55K67j5k03O6
$$ -148 -49 101 -85 -98 64 71 -54 -98 107 77 -89 -68 141 5 -148 -51 133 -6 -161 106 91 -112 -46
6157d6J38n2j28L0J47q0j51J21J39j79o4J75O5k10k0J75L6k25P2J52j09o1R3O7
$$ -46 92 40 -88 -58 89 9 -142 -21 118 -61 -125 50 115 -95 -115 60 96 -129 -57 95 -14 -75 18 85
6181H5j11p2J86J9j57j3J96p4j57Q9J39j28j59J41J07j54OP1K6j17l7K22j45k5
$$ 85 -26 -98 88 107 -50 -63 133 59 -98 -9 130 2 -157 -16 91 -63 -57 14 40 -77 -114 108 -37 -62
6205f2P2R6j45r6J65J26k13K3J21o6j18J07N3n8o4P5O2m9p8J33M9k09MJ37nj59
$$ -62 10 106 -39 -135 30 156 -57 -34 87 21 -97 10 63 5 -59 16 78 29 -49 84 133 -76 -72 65 60 -99
6231i9N0J53l4j95J32P1j20j0R6R4j75o5K34r3j57J09J22p3j83J47M7n2j39J90
$$ -99 -49 104 70 -125 7 78 -42 -52 44 138 -37 -102 132 39 -118 -9 113 40 -143 4 51 -1 -140 50
6255E0Kj18nJ36j0j34M3J43r5r9J05N5j00k7P1P5j82P2J30n3j64L4J22Nj60J37
$$ 50 52 -66 -71 65 55 -79 -36 107 12 -87 18 73 -27 -54 17 92 -90 -18 112 59 -105 -71 51 56 -104 33
6281C3K3p6r7J77j3j36PJ77l2j50N4J25j16p8J22L8j00l8J48oj31rJ42l7j77O7
$$ 33 56 -20 -117 60 47 -89 -82 95 63 -87 -33 92 -24 -102 20 58 -42 -80 68 62 -69 -78 64 27 -150 -83
6307h3J76j13p1J10P0j66K3K04n3k11J12J31p5j27M9J09q6p3J38j4j07L7J32o2
$$ -83 93 -20 -91 19 89 -77 -54 150 97 -114 -2 129 54 -73 -24 85 -1 -74 64 50 -57 -20 112 50
6331E0j04k3J84o1j95J50J24j58j29K58k0j81K7J79k0j80O2J64j62o0R7J44j68
$$ 50 -54 -77 107 46 -149 1 125 -33 -162 96 76 -105 -78 101 81 -99 -37 127 -35 -95 2 146 -22
6354b2j00J54N7q6q3J71j5j45M0Q9k8j11J20M2j09q0J55O3j44jJ08n9q8O7J10
$$ -22 -122 32 89 3 -80 91 76 -69 -29 60 32 -79 41 83 -26 -106 49 112 -32 -33 75 16 -72 -5 105
6379A05j36m4J31O7k05PJ46n6p3j9J62n3j50J03J60j95k6J13O6j68nJ24l3j11
$$ 105 -31 -75 56 123 -82 -75 71 15 -58 -77 85 32 -118 -15 145 -50 -76 37 103 -65 -70 54 21 -90
6403i0O5J09j10n7O9R7j60rJ77Mj82L7J25j8j66Q1J09o4j36J09Q2q8q7J27M5j88
$$ -90 -25 84 -26 -83 -14 83 -77 -86 91 95 -87 -50 75 57 -109 -28 81 17 -119 -10 72 -16 -103 24 69 -119
6429a19R1J44n4j13NJ18r7r2J02P4l9o6J59oj17j8R4k4j85J21J35j15m8L4Q7j25
$$ -119 -28 116 62 -51 -46 72 -25 -117 -15 59 20 -46 113 107 -10 -28 66 42 -143 -22 113 -2 -50 -16 71 -54
6455e4JQ5j6j20O6J82j44p2P4N1k9q6M6J12j58L3O0L4j52OJ69n0j17J55Qr0j05
$$ -54 -53 32 16 -104 -38 144 0 -72 2 53 24 -62 -16 96 -62 -29 31 65 -87 -81 88 38 -79 76 84 -6 -111
6482a11J36N3j54L7J03Kj81J34R8n5j46N0J30j36p6J44L2j28j6J63m8r3L9J35
$$ -111 25 78 -76 -39 64 66 -115 19 117 62 -84 -34 96 -40 -116 28 60 -68 -84 79 31 -62 -23 112
6506A12n7j41Q0O6p9j08J94k0j65N9J32m8j34J52M5r9m6P7P1j59J1J69p8j09M1
$$ 112 55 -86 -6 60 -19 -127 67 47 -118 -59 73 25 -109 43 88 -11 -57 20 91 -68 -57 112 34 -75 -34
6531c4J28p0m7J8O3r9p1J55kl3j05J78k6j30L5R6q4o1N4J26j17L7M9j0p8m3J56
$$ -34 94 24 -23 -5 58 -41 -112 43 41 8 -97 81 55 -75 -40 56 -28 -89 -35 91 -26 11 60 50 -28 -71 85
6558H5l5j62O9J41j11j58J61R1r6p1J59J8j27rJ38q5j33J27P3p9l0K5R4j54L3
$$ 85 50 -112 -43 98 -13 -171 -10 81 -15 -86 73 91 -36 -45 93 8 -125 2 75 -4 -34 -9 85 -69 -36
6583c6J25j6j53J7R9mj46R0J29j28k3O3P5j33o8K24j14o4PR6Rj43J45O3j20n1
$$ -36 89 73 -80 -63 36 32 -114 -24 105 -23 -46 17 92 -41 -109 115 1 -63 -56 40 49 -94 51 114 -6 -57
6609e7P8N7j04k3O2R8j72lJ84j00j04J14J7j02L9N0Jo4k3Q4M2j36K7J04m9p6M7
$$ -57 21 78 -26 -49 13 111 -61 -64 120 20 -84 30 47 -55 -16 34 35 -29 -52 32 74 -62 -35 69 20 -56 -9
6636iR1j28o5J41Ll2j5J09j0j13l5J96j48n3Q5N9r3k6O6P0j29J8O4j9j22Q2J19
$$ -9 82 -46 -111 30 33 1 -14 95 85 -28 -63 133 -15 -68 17 76 -17 -43 23 93 -36 -18 46 27 -95 -13 106
6663A06j13p8J22M3j56O2O6M3j86N0J08Lj58N1J01o5o6J33l3n3k9P5M9j15mM5
$$ 106 -7 -85 37 80 -76 -14 52 95 -91 -41 67 70 -88 -37 64 -1 -67 66 33 -20 -49 26 75 -40 -44 1
6689AM4j49J07R4j25l3Q6R7j40m5J13k6j00M1R9m9m3M3M7o7n8J45K2j33j3J19
$$ 1 45 -104 3 97 -28 -61 25 122 -18 -63 50 24 -76 -35 64 15 -28 15 62 -5 -63 82 104 -29 -42 77
6715G7k8q5k0J18o8n8J21J9q4q2J02J00j60kJ13J0j17O7M7r6n6J08N7j40k0J59
$$ 77 49 -36 -56 62 -6 -64 57 76 -8 -90 12 112 -48 -50 63 73 -44 23 70 -26 -82 26 83 -57 -77 82
6741H2j6j20k5J74m2j19Q6M2p4p8J30K9q3r8J56jp6j1L6J6p0P1K7o5k5N7M7m8
$$ 82 66 -54 -79 95 53 -66 20 62 -12 -90 40 69 -14 -112 44 43 -33 -44 -8 8 -62 9 36 -29 -54 3 50 2
6769Bp0Q2M1j18P8N2n9o7M7Q2r0l3N9Q5j55RJ34j2j21P3N5o4n3K9K9k7q8J26L7
$$ 2 -68 14 55 -63 15 67 8 -59 -12 70 -20 -53 6 91 -64 -55 79 67 -54 19 74 10 -43 -14 15 -12 -100 26 63
6798F3j39J4Q4pj28J07Q7q3n9O6M9n8j8K1M6q0l0P8ko8M0J09n4j11J16O5j70M
$$ 63 -76 -62 22 15 -113 -6 81 -2 -61 5 54 -4 -22 -1 45 -35 -65 13 11 -57 -17 92 38 -73 43 108 -62 -58
6826e8J27J3j47%J54p8o7K7R3m2p4O9J9j06O4O3n1q2K1J31n5m5K7L6n9o3O1K4
$$ -58 69 82 -65 -65 89 11 -56 -29 64 22 -52 17 36 -70 -6 57 6 -76 -55 76 21 -24 3 39 -20 -83 -22 2
6854Bk1j8J31j10m7nR7k5j51J34P5m8p5J13M5j13l3L8Q2o5l4J07o0p7J1J48q0
$$ 2 -19 -37 94 -16 -63 -68 29 4 -147 -13 62 14 -61 52 97 -16 -49 -11 71 6 -28 79 19 -58 -47 101 21
6881B1l8KP5q9n0J06J5n9qR4p7p6J01R6j59l9J20Ro4p0J93j05n1L6P5k4j70J60
$$ 21 -17 -15 60 -29 -79 27 42 -17 -25 69 -8 -84 17 113 -46 -85 35 44 -20 -90 103 -2 -53 -17 58 34 -136 24
6909B4K3o0m2J02pl1mK0M2q5OJ24r2q7J03K7l5j11J13J5r5Q4L6pj29O1O7r7KM9
$$ 24 47 -13 -55 47 40 9 5 25 67 -18 -12 112 20 -67 36 63 28 -83 30 45 -50 34 70 63 -66 -5 62 -35 -33 16
6939A6N1j37K0R5%r1M1P4q5l2RJ23n4j39J80K5j84O7N6l5o5m0J80q7n2N4N3p3
$$ 16 67 -70 -50 45 45 -46 -5 69 -16 -48 -39 84 30 -109 71 96 -88 -21 35 0 -65 -105 75 -12 -64 -10 43 -30
6967c0r3J94J5p7p2J09Mr4L1N4oj09N6J09o6q4P7O6j50L7O2po3M7L0m4n2K7J54
$$ -30 -123 71 86 9 -63 46 50 -44 -13 41 35 -74 -18 91 25 -59 18 84 -66 -29 33 26 -37 10 40 -4 -56 -29 125
6996A25q1r4J29l4r2J8J30m6j12P6M9o0r5Q5O4n9l3P4rq0n7J71n1j11M1Q3l8j7
$$ 125 44 -50 79 45 -47 -29 101 55 -57 19 68 8 -87 -2 62 3 -30 44 35 -45 -102 69 18 -93 -52 31 -7 -24
7024b4L9L5m1m4R5K4j71M7O2k4l6P6L6m6j08J30k7j07K0Q1P0j32%Q5k1j01P4R5
$$ -24 15 50 9 -35 60 84 -87 -40 22 -2 -38 38 74 28 -80 50 23 -84 -64 17 87 -45 -45 40 19 -82 -8 87
7052H7j02n3J16l3m7l0J24m0p9L1J09q4n1P1N4p7j8J01l1j24Q2L7l6n5M6OL6j24
$$ 87 -15 -68 48 15 -32 -62 62 22 -57 -26 83 -1 -52 19 73 -4 -22 79 48 -76 6 43 7 -48 -2 4 40 -84
7080h4R8L8m7r3J14L5p3K3K9Jj09Q5M8m4m9M2L2n3q0J43Jj28N3M9k7j02O3O0n8
$$ -84 14 52 5 -88 26 61 -12 11 40 41 -68 17 65 21 -28 14 46 -7 -87 56 57 -71 -18 31 4 -98 -35 25 -33
7109c3k1O1M7l9l0J17n2j39L3J17k4n5L4Q7j10m4J20k0j14o1J21K4p5L8K6J9r1
$$ -33 -54 7 54 15 -15 102 50 -89 -56 61 37 -18 16 103 -7 -51 69 49 -65 -126 -5 19 -56 -18 8 27 -64
7136f4K8K8k6m6R0J24j95M9P5j5p1k2P0J7q4N5Mk4j1M2J5n6l1J19l6j11M3M5j4
$$ -64 -36 -8 -34 -80 10 134 -61 -12 63 48 -23 -45 25 42 -42 13 17 -7 -18 24 39 -17 -48 71 35 -76 -33 12 -2
7165bn3N6K4%l5J0J12j74L1Q8n6k0LM7Np6L2P5p9m3P3N9j33jJ01mp8M4K7o2j0
$$ -2 -55 1 25 25 -10 0 112 -62 -31 57 1 -19 -16 31 36 -40 -8 67 -12 -55 18 77 -56 -57 44 40 -38 6 33 -29 -39
7196c9K2R3p0q0J16J7l4m2j1M4q0J15J7p5J2oL2J7n4K3Pj08N8J8L8m1l6P1j7q9
$$ -39 -17 76 6 -74 42 59 25 -17 -28 16 -64 51 68 -7 5 -1 31 48 -6 17 24 -84 -26 -8 30 -11 -47 24 7 -82
7226h2J35L4j30q3J07Q8j55O5J9ol4J3J13j29O5JM5p3j9J21p2o0L8R3j01m0N3
$$ -82 53 87 -43 -126 -19 69 -86 -21 -2 -8 -42 -29 84 -45 20 21 66 -7 -26 95 23 -37 1 94 -7 -47 6
7253FR5q9m7L6qn6PR7k9j09Q9J35j42o1L5J29j25J6K1J8m6k8P9m1q5J20N4p6l6
$$ 6 101 12 -35 1 -7 -63 -56 41 12 -97 -8 127 -15 -76 -41 88 -37 -21 0 18 -28 -56 23 -18 -103 17 71 -5 -41
7282d1P7K7p3jL1L5j23M0N3ko9L6P0r3o9J51nl6m3N6N0j40K6J03p3l7j0J32r0
$$ -41 36 63 -10 -11 20 55 -68 -28 25 23 -46 -10 60 -33 -102 49 44 8 -35 21 71 -69 -43 60 -13 -50 -60 72 -18
7311a8n6J00L5j16RN7L5j11mJ00o2QQO1m6p8J11K7j32L6K0J0n5R4M3r6m1O6mm4
$$ -18 -74 26 61 -55 -46 11 46 -65 -69 31 -31 -23 -15 46 0 -78 33 60 -72 -36 -16 -6 -61 33 76 -20 -61 5 1 -43
7341d3J7J30r9n0N1mO4j41M9J10j44m1J15N5j12j5Q3jk1l2O2J7q0M7j5L3j5J1
$$ -43 -26 104 5 -45 6 2 66 -75 -26 84 -60 -101 14 69 -43 -58 25 24 3 -29 33 50 -30 17 2 35 20 31
7369C1j5n5MP7M0p4o8J07J7j56J17P0p1r0Q5rl6rQ5L2j13l7J08m6j15J45O5j18
$$ 31 16 -39 -35 42 82 8 -60 47 64 -92 25 95 24 -66 19 10 -26 -35 50 82 -31 -68 40 -6 -121 24 89 -29
7397b9%N6M2j05J8M6J6q4K9M3p2K4J8O7m9p6Q5N0n3rL3k2j51P1R2Jj10R9J3j00
$$ -29 -29 27 69 -36 -18 28 44 -40 -11 32 -40 -16 2 69 20 -56 29 79 26 17 50 28 -123 -52 40 41 -69 30 43 -57
7427e7nN7N0r7L1R6o3J9l0P7o4k8J0R2q6p0R4J8n9o0J17l2k5k8P1p7l0L4J37p4
$$ -57 -62 -5 45 -52 -21 75 12 31 1 78 14 -14 -4 88 2 -68 26 44 -15 -75 42 10 -15 -43 28 -49 -79 -45 92 18
7457A8j15J30M9j39K8J01n1j19J15l8K7j32J68O9j01k1M7J6q1RR5o6r4O8O4n7
$$ 18 -97 33 82 -57 -29 72 21 -98 17 -21 6 -126 42 111 10 -11 36 52 -29 -20 75 9 -85 -17 47 -10
7483a0k5Q0J7j22K1M9Oj0p4J70p7m7J1O0n4J7K2kn5J1M2l9l3N0M1j3p9L5K5o2
$$ -10 -35 45 62 -60 -39 10 16 6 -68 102 25 -22 -11 49 -5 12 34 32 -23 -12 30 -9 -42 8 49 36 -43 -8 17 -45
7513d5l1O8O1p6L2j5RK5k7J9l4m5O7P0j02k7J08j2j32L5O3k6PkQ2r0p6J06J7l4
$$ -45 -76 -8 53 -23 9 -6 3 28 1 20 -14 -59 8 78 -24 -51 57 45 -87 -52 11 -15 -8 -10 72 -18 -94 12 29 -5
7543eNL5oKo3R7m2o8J4R5r5jM7K3p8LJ09p0n8j9J41mq2M8K5j03QQ0L4j19M3N8
$$ -5 0 35 29 31 -32 65 23 -45 -31 64 -31 -32 15 38 -40 -37 72 2 -56 -75 66 62 -20 28 53 -50 -42 38 72 -47 -4 54
7575E4n9l9J2P7m9q1M5Q9j06K9J6P2j27%R9L4j26N1J12p6p4M8M3n8oN8j5q7M0
$$ 54 -5 -44 -32 45 -4 -85 -40 49 -57 -28 -12 60 -67 -67 32 66 -60 -9 103 27 -47 1 44 -14 -20 38 23 -64 -24
7604b4J16m6q2P5Ol9r0Q6P3r9k1J07j7n8n5J17l4p4N5Q7j60LJ00N9j28j3J23p1
$$ -24 92 46 -36 39 45 6 -84 2 75 -24 -45 62 45 -13 -68 49 15 -59 -4 83 -77 -74 26 85 -43 -56 67 -4
7632dj8J3R9p6n0JO5m9n1J05P4j47m7J34k9ll6N9k6m6JR5n1n7O6L5q2k0R1k4j8
$$ -4 -22 -9 90 14 -36 -35 30 -19 -70 35 109 -38 -85 49 20 17 -19 40 14 -32 -31 64 13 -44 22 57 -25 -45 46 22 4
7663Dn3N9j7p1L5J50j60j7J27j3q6lJ06p9l0KJ39j00n1J6J17p7j8O6nNo6Q1l2
$$ 4 -49 10 -7 -78 -43 107 -53 -70 57 44 -42 -45 61 -18 -48 -46 93 -7 -58 -42 75 -2 -20 46 41 46 -20 61 29
7692B9q7P7M2j40J7K2N6n8mR6k0m9K7QJ6j09OQ0q3J6R3qo3K2P0m1j13R7N9n4k8
$$ 29 -58 19 61 -79 -62 -40 16 -42 -46 50 30 -19 8 16 32 -77 -71 9 -74 -58 35 27 -36 -14 56 15 -98 -1 58 4 -24
7723b4jJ05k2q7j1R8n8m9J26j15J3PJ07j4j04K4krj4N2J6j03pQ0K8j07N9N6n4
$$ -24 -25 80 58 -29 -40 58 0 -49 77 -38 -25 -18 89 75 -29 -5 -7 -16 -30 22 38 -65 -72 8 36 -71 -12 44 -10
7752a0j1jM7o5pR0J5o0l9Q3Mr0M6O6k7m9J4Q0j46mJ69o0j10L5P1j8q3O2J00o7
$$ -10 -21 -22 25 -40 -47 43 58 -2 -41 42 46 -44 2 68 41 -8 6 86 -60 -64 105 45 -65 -30 41 23 -60 2 102 35
7782C5o7J0j7k3l1J07Ol8j9O7Jr6L6J17q3n8M1J05j21rO6k9qj2P6n8k2L8M8q8
$$ 35 -32 -22 -39 -62 -93 14 20 -18 -37 30 31 -65 -29 88 5 -53 -12 93 -28 -37 29 0 -8 -20 56 -2 -24 14 62 -26
7812b6nP8m8k2j7P5k0n5K9P1j0m6M4Pq9j4O4pk2l1N7K0o9nQ8j3j09J8J05n1o6
$$ -26 -31 47 -1 -23 -40 35 15 -40 -11 60 50 4 48 55 -34 -48 16 9 -13 -44 13 33 -36 -41 47 34 -75 -57 48 -3 -69
7843f9J16Mm2m6L9J6l8L0J05j15l9O3M9j18K9P0k9p1O8P6p5m9L2O0m1j04R0K4
$$ -69 47 51 9 -37 2 18 -20 10 115 0 -39 24 73 -45 -16 54 25 -46 22 98 23 -26 6 66 25 -79 11 35
7871C5q5J4O5K2q8O8J3j1J5r9J02k9q6J10M3n1j00Q9P2j66kJ23l1m4L0N6r8j6
$$ 35 -50 -36 29 51 -37 31 44 33 48 -51 51 22 -64 46 89 38 -62 27 99 -67 -69 54 23 -21 9 65 -33 -49
7899d9N7l4K6o7J23Mq8J5P6o8q0L8J31j02k0N9M8j45O0L1j1k2mR9n7r2M0P8j9
$$ -49 8 -26 0 -67 56 60 -28 -13 63 -5 -85 -47 84 -18 -38 21 69 -76 -16 15 4 -18 -22 77 20 -72 -32 46 27
7928B7k8k1rj9j0J00K0j06L6O0Nj43J24m7J2n0Q5K4j04j2J33m7q7L6N9r3n0R6
$$ 27 -1 -22 -31 -50 -60 40 60 -46 -10 50 55 -88 36 -11 1 -49 36 60 -44 -56 77 30 -57 -21 38 -55 -105 -9
7956iK9j0k0M1kn7l7J25mj44P0M3nn5P1Om2o8J40Nj08L2N4n8n4L0M4k3m6J08K8
$$ -9 20 10 -10 31 29 -28 -65 60 56 -88 -18 25 20 -35 36 42 0 -68 72 77 -31 1 55 -3 -57 -27 17 -6 -52 56 84
7987H4j43l6J26L2n5NK4jn9N0K9j05j8R0Qp1L5N4p3pL5M5q5j2M9m5K8nO1k4k1
$$ 84 -59 -95 31 63 8 13 37 36 -23 27 56 -49 -67 23 31 -40 -5 49 -24 -31 4 49 -36 -48 1 -44 -16 -21 40 16 -5
8018ej3J2K3n4QN1qNKL2m9j02J47Kq7m1J29J9j51J08M4j3r3R4k9qm9O3j7m7%P9
$$ -5 -18 -6 17 -37 -29 22 14 19 21 53 4 -98 49 51 -36 -77 52 71 -80 28 72 59 -34 60 31 23 -26 37 20 -27 -27 52
8050E2m2j11J08O6n9m1L6M6m5p1P7L0p7L3L6j4j12M8P6k8j3j5M9r0N7N3Qj15K8
$$ 52 10 -101 7 73 14 -27 9 55 10 -61 16 46 -31 2 38 24 -88 -40 36 8 -5 -20 29 -61 -4 49 57 -58 -30
8079c0J4K2o9R1M3p3k5Q8J7j18l1R2qj29J00J03r3p4R0N4p7J2J5m4j9kR5qq1L8
$$ -30 -16 6 -63 28 71 -2 -27 61 78 -40 -71 21 13 -116 -16 87 -6 -80 10 64 -13 -1 14 -30 -49 -51 44 36 -45 -7
8109gOl7KL2Q5j28J8R4l9p3j2Q0Ro5OJ16q3m0K6O8o0p8Q3N4o8k3L9k9M0l0O6p0
$$ -7 -1 -38 -36 -4 81 -47 -29 65 26 -47 -59 21 30 -35 -29 87 4 -36 -10 58 -2 -80 3 57 -11 -34 5 -24 16 -14 52 -18
8141a8K1M6Lq8j4L4K8q9Q6J0Rp1N7M8q6PrM0l0mO0j8j7l5Q2o4MK0K2m0n4J13j5
$$ -18 3 49 52 -36 -50 -16 12 -77 9 19 28 -43 14 62 -24 -17 -26 14 -16 -20 40 22 5 -30 52 -12 -8 12 34 -6 -60 53 38
8174C8n6l0P4K5j12M1O8p0oN7K1j08jR9J4q4K9
$$ 38 -18 -48 26 51 -61 -20 48 -22 -28 29 50 -58 -59 40 54 -30 -1
8191a
$$ Imaginary data points
##PAGE= N=2
##DATA TABLE= (X++(I..I)), XYDATA
0@%%%%%%%%%%%%%%%%%%%MmQj6J6j6J6j6J9k4K9l2L6m1M3n0N7o1O9p6Q4r4J02j12
$$ 0 0 0 0 0 0 0 0 0 0 0 0 0 0 0 0 0 0 0 0 4 0 8 -8 8 -8 8 -8 11 -13 16 -16 20 -21 22 -28 29 -32 37 -39 45 -49 53 -59
43e9J23j36J51j67J85k01K21k44K67k97L28l62M05m53N10n80O64p70R08j093J352
$$ -59 64 -72 79 -88 97 -104 117 -127 140 -157 171 -191 214 -239 271 -309 355 -415 493 -600 752
64G52j734K340l421N703j2269O4277K73249p2867j30693q243j75552k49116J1565
$$ 752 -982 1358 -2063 3640 -8629 55648 328897 256030 125337 117094 -58458 -307574 -296009
77b96009K02126J54198Q6711Q2012J4804j60938k38592r0477M4018N7917J42199
$$ -296009 -93883 60315 147026 229038 243842 82904 -155688 -246165 -202147 -144230 -2031
88b031K09682N8977j07426j14044j20316j49134m1689J41084J93692J02244L1188
$$ -2031 207651 266628 159202 45158 -75158 -224292 -265981 -124897 68795 171039 202227
99B02227L148j17106k33683j17820P9413R9428Q4096J58205J14752q2784j87400
$$ 202227 205375 88269 -145414 -263234 -183821 -84393 -297 157908 272660 189876 2476
110B476j33652o2380j3101P8637J81001J58192Q555r2785j02662j28825j18018
$$ 2476 -131176 -193556 -206657 -128020 52981 211173 219728 126943 24281 -104544 -222562
121b22562K0825J40276J23472Q5771O3483m6524j68920j38217k7035J4376N0235
$$ -222562 -201737 -61461 62011 147782 211265 164741 -4179 -142396 -169431 -155055 -104820
132a04820J46073J53571Q627j01822r0719q9836j11625k0121J37549J67757O7894
$$ -104820 41253 194824 203451 101629 10910 -78926 -190551 -210672 -73123 94634 162528
143A62528j330k4173j04055j73979q0302Q0213J09055P4586J02407O7386r1418
$$ 162528 161198 137025 32970 -141009 -221311 -141098 -32043 42543 144950 212336 120918
154A20918j63712q1566k4572j0154Q3139J64729R1689l1014o5218p6891j18754
$$ 120918 -42794 -124360 -148932 -159086 -75947 88782 180471 149457 84239 7348 -111406
165a11406q3105N1615J28080Q8292N0372L8986m2263j45628j19566m172M3670
$$ -111406 -194511 -142896 -14816 73476 123848 162834 120571 -25057 -144623 -148795 -105125
176a05125M7565J05605J24162K698j13201r4035n7073o7632m82J26896J36006
$$ -105125 -57560 48045 172207 174905 61704 -32331 -89404 -157036 -157518 -30622 105384
187A05384L8569j5821l8784j00899j24503l4898P1807R0872P2307P2669K3228
$$ 105384 143953 128132 89348 -11551 -136054 -170952 -99145 -8273 64034 136703 159931
198A59931q8551j27414n9534q579R876P9335J31254O0036m3581o3375o2230r3652
$$ 159931 71380 -56034 -115568 -124147 -114271 -34936 96318 156354 112773 49398 -12832 -106484
210a06484n9250O1637J18446O5557L0590K4722n3116j34339q4780J6315M2354
$$ -106484 -165734 -104097 14349 79906 110496 135218 82102 -52237 -137017 -120702 -78348
221g8348N1439R8266Q4277k5731j01134p7143m5453l9811K2063J15979J06010
$$ -78348 -26909 71357 155634 129903 28769 -48374 -93827 -133638 -111575 4404 110414
232A10414J1203k8903l3761q9389j06004l683Q4195O7630N1431O5022K677j00526
$$ 110414 121617 92714 58953 -30436 -136440 -140123 -55928 11702 63133 128155 130832 30306
244C0306j02258k9904q82J5146Q0424J09970L3002n2189n9658n5127p5849l4073
$$ 30306 -71952 -101856 -102738 -87592 -7168 102802 135804 83615 23957 -31170 -107019 -141092
256a41092P1471J05406M7872J5670P968n9697j17611n8343L2423M4615M6916Q7104
$$ -141092 -69621 35785 83657 99327 107295 47598 -70013 -128356 -95933 -51318 -4402 82702
268H2702N9774m8850r4572n2783l4426k9494M1643J09003P1964l938k6534l9962
$$ 82702 142476 93626 -946 -53729 -88155 -117649 -76006 32997 104961 101023 74489 34527
280C4527q4045p6961J4949P9369N8986M1255M6895j1726r8079q5516j2668Q124
$$ 34527 -49518 -126479 -111530 -32161 26825 68080 114975 103249 5170 -80346 -93014 -84890
292h4890J9380Q0308R3957P607o0057m9390m8297o5553j0230Q0438Q4985L0068
$$ -84890 -65510 14798 108755 116362 56305 6915 -41382 -106935 -117165 -36727 48258 78326
304G8326J1780m101o8243r7528l2582L6617M3212M7350P1180L5873n5101q5083
$$ 78326 90106 86005 17762 -79766 -112348 -75731 -32519 14831 86011 121884 66783 -18300
316a8300m1575k1994j6718M7438J00728N1700j9175k7267l8444p9029n5184L4178
$$ -18300 -59875 -81869 -98587 -51149 49579 101279 82104 54837 16393 -62636 -117820 -83642
328h3642P1551M5353L7749L2520l0228q9594o3346m507J3608L0014P3687O9829
$$ -83642 -12091 33262 71011 103531 73303 -16291 -79637 -84144 -70536 -40522 33165 102994
340A02994o618n8898m6304m1213m8370M887P9322P1725J6574K620j0829o8423
$$ 102994 96376 37478 -8826 -50039 -98409 -93522 -14200 57525 74099 76719 65890 -2533
352b533q2800j1867M3092L6826M3130O1723J5300o2070p1009l0134j5574k999
$$ -2533 -85333 -97200 -54108 -17282 25848 87571 102871 40801 -30208 -60342 -75916 -78915
364g8915N2102Q4573L5277k5106l1591l7366o4766l8116M0362O7493L6977K6966
$$ -78915 -26813 57760 93037 67931 36340 -1026 -65792 -103908 -63546 3947 40924 67890
376F7890K0270l6705q2103m7332O204J6637L1324O8834N2481k1822n6302l7042
$$ 67890 88160 51455 -30648 -77980 -71776 -55139 -23815 45019 97500 75678 19376 -17666
388a7666l6503l6879J9998P6591N5502O839m208j8380o3346o6634L86M7800L5662
$$ -17666 -54169 -91048 -71050 5541 61043 67882 63674 45294 -18052 -84686 -84300 -36500 -838
401h38L3895M7940M495o4522o2037j7006p251L292N4128P1862J7315k9205k8158
$$ -838 33057 80997 85492 20970 -41067 -58073 -65324 -62032 -7904 63958 81273 52068 23910
414B3910l7285n6716j9126M7612N6592K7355K3560J0634m6079p4419k9860J5076
$$ 23910 -13375 -70091 -89217 -41605 14987 42342 65902 76536 30457 -43962 -73822 -58746
426e8746J7010L1743O4061L8087l5090n6031k6828k6478k8945K7978P6454M1528
$$ -58746 -41736 -9993 54068 92155 57065 1034 -25794 -52272 -81217 -53239 23215 64743
438F4743p543q181j8842o0456n1951J4844M6717K9127K9979L6900q722o2126m8839
$$ 64743 57200 49019 30177 -30279 -82230 -67386 -20669 8458 38437 75337 66615 4489 -44350
451d4350r538l962R838N5732N9777K302l2006k3334l5440n1609n716N5493M9427
$$ -44350 -53888 -57850 -48012 7720 67497 69799 37793 14459 -20981 -72590 -78306 -22813 26614
464B6614J6422J7099M572n1077o8963j5367K5523J8860K8835N5168K4392m1526
$$ 26614 43036 60135 64707 13630 -55333 -70700 -45177 -26317 2518 57686 82078 40552
476D0552n1884k1658j8554j4625L2643O3983L0497r327j3783k5324n0588l3158
$$ 40552 -11332 -32990 -51544 -66169 -33526 30457 60954 51627 37844 12520 -38068 -71226
488g1226J9056L8582K7203L1128K5549k2672n6451l3348p479o260K0543O0949
$$ -71226 -52170 -13588 13615 44743 70292 47620 -8831 -42179 -49658 -55918 -35375 25574
500B5574M2626j2647k7377k0163m0239m2644J2758N7478L7595R500J3074n318
$$ 25574 68200 55553 28176 8013 -32226 -74870 -62112 -4634 32961 42461 55535 50217
512E0217n5188n5391J139K6941J4991L0651M7925N979m5091l8804j5765j8756
$$ 50217 -4971 -60362 -59223 -32282 -17291 13360 61285 67264 22173 -16631 -32396 -51152
524e1152m862M0745N3302J4559j1503q767k6998n1194k1502L0035L3878J8857
$$ -51152 -56014 -15269 38033 52592 41089 32322 5324 -45870 -67372 -37337 -3459 15398
536A5398L0200K2057l1544n8671k5232L791P21J9256N5877L8540k0658l7846j9351
$$ 15398 45598 67655 36111 -22560 -47792 -44001 -43280 -24024 31853 70393 49735 11889 -7462
549g462k6610l1079J4940N5670L5660K574p93j2044m3682m1874J989K7284K1212
$$ -7462 -34072 -65151 -50211 5459 41119 43693 42900 30856 -12826 -54700 -52711 -25427 -4215
562d215K6520L2160j697l9585l2993j3946j3886L165M1185M3102P255j0409j0848
$$ -4215 22305 54465 52768 13183 -19810 -33756 -47642 -44477 -3292 39810 47065 36656 25808
575B5808l1338m4855j0146L2854L2745J8777K3207R659l5548n1480j7614P833
$$ 25808 -5530 -50385 -60531 -27677 5068 23845 47052 56711 21163 -30317 -47931 -40098
587d0098P623K4907M6583K1647k3689l1821k0713k4541j4750K4530M4570K2503
$$ -40098 -32475 -7568 39015 60662 36973 5152 -15561 -40102 -54852 -30322 14248 36751
599C6751J799l76j8338m3749k7595J2836K1293J4025K9507K9805j3840m2145k2398
$$ 36751 38550 38174 19836 -23913 -51508 -38672 -17379 -3354 26153 55958 42118 -27 -22425
612b2425p171j4735M846M5549M1094l067j8162r424k7952m2278j860M2028L0608
$$ -22425 -29596 -44331 -39485 6064 47158 44091 25929 16505 -11447 -53725 -55585 -13557 17051
625A7051R131J6035M083l8103m5562p022J3683Q567K3192M0626J2198k9664k8666
$$ 17051 26182 42217 46300 8197 -37365 -44387 -30704 -22137 1055 41681 53879 24215 -4451
638d451j2902j9354j1208K8207M1420J2694l008P34j8879m2240k0150J7674K0554
$$ -4451 -17353 -36707 -47915 -19708 21712 34406 31398 32132 13253 -28987 -49137 -31463 -10909
651a0909J3645K7275K1949j9219l9739j9013n333q602J2688M3384L0532q464j8259
$$ -10909 2736 30011 51960 32741 -6998 -26011 -31344 -39946 -27258 16126 46658 38194 19935
664A9935j3179k7990k9841R622L8433K2502P219J2520m239l8918l4105J335J2094
$$ 19935 6756 -21234 -51075 -41453 -3020 19482 26701 39221 34982 -3936 -38041 -36706 -24612
677b4612Q249K5860L3798J78k9948k0766j0499j8400m798L0792L4939P030l210
$$ -24612 -16363 9497 43295 43473 13525 -7241 -17740 -36140 -40938 -10146 24793 31823 28613
690B8613r20k2471l9587j1887K2437J9848J2582K4189J4117k5065l7185j2546
$$ 28613 27693 5222 -34365 -46252 -23815 -3967 8615 32804 46921 21856 -15329 -27875
702b7875r89m548J6866M0726K0390j4940j7514j2268k5319k0604J6100L4199J6519
$$ -27875 -28864 -33412 -16546 24180 44570 29630 12116 -152 -25471 -46075 -29975 4224 20743
715B0743N369Q537r536l6494k5949O092J2348Q918K4782K7186o499k9197j6452
$$ 20743 26112 34649 25113 -11381 -37330 -31238 -18890 -9972 14810 41996 35497 6300 -10152
728a0152r072j6247J236L2963K9708J870n304m418k4370l3338l063K4701J7498
$$ -10152 -19224 -35471 -34235 -1272 28436 30306 25002 20584 -3786 -37124 -40187 -15486 2012
741B012J0819K0054O467k7523l1810p190J310n36J9385L5107J1803j7849j6148
$$ 2012 12831 32885 39352 11829 -19981 -27171 -25861 -26397 -7012 28095 39898 22049 5901
754E901j0620k1867j4450J9875L1167J0944L087O812j3434l5011j8097J0011J1453
$$ 5901 -4719 -26586 -41036 -21161 10006 20950 24037 30849 17415 -17596 -35693 -25682 -14229
767a4229R584K3824K0510j1413k7885j4191p066j1235O039L2285K4259l341q089
$$ -14229 -4645 19179 39689 28276 391 -13800 -20866 -32101 -26062 6223 30482 27141 19052
780A9052n753k2976k7064L697K4898J4103Q851J6798P78k9175k6293j637K803
$$ 19052 13299 -9677 -36741 -33044 -8146 5957 14808 31606 32384 3209 -23084 -24721 -21918
793b1918J178K0988L0333L744j9558j3064r492j9674q260K2760K7591O623P28
$$ -21918 -20740 248 30581 34325 14767 1703 -7789 -27463 -35723 -12963 14628 21251 21979
806B1979L582j5465l2097j1958J4018J1498Q550K1703J4972j6442k6259r437m897
$$ 21979 25561 10096 -22001 -33959 -19941 -8443 107 21810 36782 20340 -5919 -15356 -20253
819b0253q617J0984L1137J6128p584p010o578k2972k0533R788K3733J0348P099
$$ -20253 -28870 -17886 13251 29379 21795 14785 8207 -14765 -35298 -25510 -1777 8571 15670
832A5670J3894l784k9758k1176L651M282J428K0900K6643k322k1225j0191p737
$$ 15670 29564 25780 -3978 -25154 -21503 -17221 -15793 5107 31750 29428 8203 -1988 -9725
845i725j7772k824K5216K2561K209K21Q26j8316k7000m448J4545R261R147K0077
$$ -9725 -27497 -30321 -5105 17456 19665 19886 20712 2396 -24604 -29052 -14507 -5246 3901 23978
859B3978Q348j9966k2427m830m125o869J4768K9770R064j1536n420o047k2854
$$ 23978 32326 12360 -10067 -14897 -19022 -25891 -11123 18647 27711 16175 10755 4708 -18146
872a8146j5476J5259K2107O223N792J1178q248k8335j4840N974M332M140K0454
$$ -18146 -33622 -18363 3744 9967 15759 26937 18689 -9646 -24486 -18512 -14180 -10040 10414
885A0414J9507o940j8645q622q456j3869L449K4581J6550n74Q08j314k0943k2806
$$ 10414 29921 22981 4336 -4286 -12742 -26611 -23162 1419 17969 17395 18203 16889 -4054 -26860
899b6860K990J5097N635R492J9756J877k3708j7585o59l837m061J7626K5824L585
$$ -26860 -23870 -8773 -3138 6354 26110 27987 4279 -13306 -13965 -17802 -21863 -4237 21587 25172
913B5172j2892o021o551j9068r970J6557K0003M545L842P041j0851k4626r523
$$ 25172 12280 6259 -292 -19360 -29330 -12773 7230 11775 15617 22658 11807 -12819 -22342
926b2342O574L960O722J9447J2784j0093j5644p115r077j0336Q117K3284J1959
$$ -22342 -15768 -11808 -5086 14361 27145 17052 1408 -5707 -14784 -25120 -17003 6281 18240
939A8240k077j43m214k0515j7823O102J5270O374Q372J4558j686k2358j5492P11
$$ 18240 16163 16020 11806 -8709 -26532 -20430 -5160 1214 9586 24144 22458 100 -15392 -14681
953a4681o59k92J6539K0578r0j2196n709p883j5885l225J6721J4508L364N287
$$ -14681 -15340 -15632 907 21485 21395 9199 3490 -4393 -20278 -23503 -6782 7726 11090 16377
967A6377L460j4385k0794m180O814K479P830J9844Q915j4483j5169l385p721r726
$$ 16377 19837 5452 -15342 -19522 -12708 -10229 -2399 17445 26360 11877 -3292 -6677 -14398 -24124
981b4124J1435K4754P560o908p65l873k0125j4467J0550J6183M052O089J1695
$$ -24124 -12689 12065 19625 12717 11952 8079 -12046 -26513 -15963 220 4272 10361 22056
994B2056n106k1848j1140L594o6Q79J6206J6546l691j1811m052p060j4586p23
$$ 22056 16950 -4898 -16038 -12444 -12510 -11631 4575 21121 17430 5619 1567 -5493 -20079 -20802
1008b0802J8511J2545j08M561L435j6295k0450PR257K244P892J8448M974j6674
$$ -20802 -2291 10254 10146 14707 18142 1847 -18603 -18596 -9339 -7095 797 19245 24219 7545
1022G545j4480k300m902n406J2458K1265M741q102k983n027j6549q955J1700J3544
$$ 7545 -6935 -9235 -14137 -19543 -7085 14180 18921 10819 7836 2809 -13740 -22695 -10995 2549
1036B549L130N527P648p964j8268o435L227j309L245J6877J1866o751r385k608
$$ 2549 5679 11206 18854 10890 -7378 -13813 -10586 -11895 -8650 8227 20093 13342 3957 1349
1050A349r502j3238M922J8751Q307p13N219k44j8605j6575M540R628J927Q489
$$ 1349 -8153 -21391 -16469 2282 10589 9876 15095 14851 -3754 -20329 -15789 -6161 -4234 4255
1064D255J6422m55j9055j0678J185m880l376J5416J7802j552q334k11o090j5992
$$ 4255 20677 20222 1167 -9511 -8326 -13206 -16582 -1166 16636 15084 6750 6539 449 -15543
1078a5543l843J3762R525N78O506O877j0362j7274l174M121k040M314J7632R274
$$ -15543 -19386 -5624 3901 4479 10985 17862 7500 -9774 -12948 -8827 -10867 -6553 11079 20353
1092B0353r645r497k230q967j0360P783J8292O413j900K688l211j7481j1854O854
$$ 20353 10708 1211 -1019 -9986 -20346 -12563 5729 12142 10242 12930 9719 -7762 -19616 -12762
1106a2762R264K662Q245J1355m613j6338o983Q90l833K52J4352J2727l184o531
$$ -12762 -3498 -836 7409 18764 14151 -2187 -9170 -8280 -12113 -11861 2491 15218 12034 5503
1120E503n44o661j3821q70J3360P134N81P377M432j2928j5191m85L688r31O942
$$ 5503 4959 -1702 -15523 -16393 -3033 4101 4682 12059 16491 3563 -11628 -12113 -8425 -9356 -2414
1135b414J6176M664j1103q559j943q094p052J0555J6840L172l498J612m801j6122
$$ -2414 13762 18426 7323 -1236 -3179 -11273 -18325 -7770 9070 12242 8744 10356 5555 -10567
1149a0567p461R419Q161J016P053R209o270j5100m421K061l941J071J4659J0263
$$ -10567 -18028 -8609 -448 568 7621 16830 10560 -4540 -8961 -6900 -10841 -9770 4889 15152
1163A5152n236n735l32p819j2016K132J3068O217Q63N869J585j3821j3507J835
$$ 15152 9916 4181 3849 -3970 -15986 -13854 -786 5431 6294 12163 13748 -73 -13580 -11745
1177a1745N461j38P010J4445J171j2856o966o42p026m103J2190J4068q5l990J120
$$ -11745 -6284 -6422 588 15033 16204 3348 -3618 -4260 -11286 -15389 -3199 10869 10784 6794 7914
1192G914n560j3854l738R611O147O82P208P089q031j3610k392J783l462K998J4724
$$ 7914 2354 -11500 -15238 -5627 520 1202 8410 15499 7468 -6142 -8534 -6751 -10213 -7215 7509
1207G509P544p261n299n4q157j0710N282J3894L803n11N712r99j4951r916M922
$$ 7509 15053 7792 2493 2439 -5718 -16428 -11146 2748 6551 6040 11752 10753 -4198 -14114 -9192
1222i192M954k59P722J1832k262j2605m709P7o245j916J2569J1506k589l987J924
$$ -9192 -4238 -4497 3225 15057 12795 190 -4519 -4442 -10687 -12603 -34 11472 8883 4896 6820
1237F820n871j3297j315J0673M315J69Q038N139j0659j2262L14J844l143N087
$$ 6820 949 -12348 -13663 -2990 1325 1494 9532 14671 4012 -8250 -7936 -6092 -9235 -4148
1251d148J3885L906q113m121o50q459p406P824J2303J616p32M480k969j4234o387
$$ -4148 9737 13643 5530 1409 759 -7700 -15106 -7282 5021 6637 5905 10385 7416 -6818 -13205
1266a3205O814L532n99Q515R666n549j1388k057k79o157Q05J2962Q039m160k404
$$ -13205 -6391 -2859 -3458 5057 14723 9174 -2214 -4271 -4550 -10707 -9902 3060 11099 6939 4535
1281D535J144p479j1326J974J0165L068Q10P239J859j1504r428K096J451k296
$$ 4535 5679 -1800 -13126 -11152 -987 2081 2891 10130 11989 485 -8943 -6847 -5396 -7692
1295g692O513J2287N88q659k705r07q388m365R888R837o19k68L784m945j2632
$$ -7692 -1179 11108 11696 3037 332 -575 -8963 -13328 -3440 6397 5778 5510 9294 4349 -8283
1310h283l231O694K651M15Q182P018o741j0238j227j15m672K299J2072N906m741
$$ -8283 -11514 -4820 -2169 -1754 6428 13446 6705 -3533 -4760 -4875 -9547 -7248 4824 10730 5989
1325E989k318J53p667q727L989R290J937J298O015p80j1243o678K837Q89r97P268
$$ 5989 3671 3824 -3843 -12570 -8581 709 2646 3944 9959 9179 -2064 -8742 -5905 -5016 -6013 1255
1341A255R953j541q256k132r89p255k327J0256Q304j875n91L081n640j1495j245
$$ 1255 11208 9667 1411 -721 -1710 -8965 -11292 -1036 7268 5393 4802 7883 2243 -9252 -10497
1356a0497P309K122P03P719M627p840q787j66r3l559L851J0993L340n005k035
$$ -10497 -3188 -1066 -363 7356 11983 4143 -4644 -4810 -4903 -8462 -4611 6382 9722 4717 2682
1371B682m82p510o488N535Q547R45P34N186j909j1153n080M109J139r15P454Q700
$$ 2682 2200 -5310 -11798 -6263 2284 3229 3963 9149 7240 -3913 -8993 -4884 -3745 -4660 2794 11494
1387A1494l607q354j224o25o404n55J0214O615k605p54J909o043r587P56O970
$$ 11494 7887 -467 -1691 -2316 -8720 -9275 939 7554 4949 4195 6104 61 -9526 -8770 -1800
1402a800J725R05O834K580q448p226J208m20l188N266J0567P18n947n87p13q353
$$ -1800 -75 830 7664 10244 1796 -5430 -4222 -4642 -7830 -2564 8003 8721 2774 2187 1474 -6879
1418f879m318P711P322q43J007M793l773j0867k842N172Q71p24P472O855n142
$$ -6879 -11197 -3486 3836 2993 4000 8793 5020 -5847 -8689 -3517 -2646 -3370 4102 10957 5815
1433E815p899L6m39n789J080J0177M396l669O1J532p076p952L060O291J98J648
$$ 5815 -2084 -2048 -2487 -8276 -7196 2981 7377 3708 3769 5301 -1775 -9727 -6667 -376 -178 1470
1449A470O913L05r263n193K192r34k515O591R488j320o445m6q63p874k593Q809
$$ 1470 8383 8688 -575 -5768 -3576 -4510 -7025 -434 9054 7734 1289 1243 380 -7494 -10087 -1278
1465a278O299k033P11L769m751r709m90N267K17J33P056M211o002n787N65j400
$$ -1278 5021 2988 3699 7468 2717 -6992 -7482 -2215 -1998 -1865 5191 9402 3400 -2387 -1822 -3222
1481c222m441K914Q732K305k996N42K1p361n778M215N405j40K449O018j937r290
$$ -3222 -7663 -4749 3983 6288 3292 3834 3855 -3506 -9284 -5069 336 196 2645 8663 6726 -2564
1497b564l297K541j211r70P699O967l594n302M57k080o430M89Q193L778k117J154
$$ -2564 -5861 -3320 -4531 -5501 2198 9165 5571 269 726 -1354 -7784 -7295 898 4676 2559 3713
1513C713K254n374p598J221M707q62O96P189K391o781m225J484k430m084M582
$$ 3713 5967 593 -7005 -5784 -1077 -1939 -1243 5946 8337 1556 -2669 -1185 -3615 -7699 -3117
1528c117Q397N25l189R96r02p612m165N400N099k55K106M639l085q797k270L350
$$ -3117 5280 5805 2616 3612 2710 -4902 -9067 -3667 1432 1177 3283 7922 4837 -3960 -6230 -2880
1544b880l05l90O651N387m117n318O37j223n159R56P556K676k343J209J673n495
$$ -2880 -3185 -3575 3076 8463 4346 -972 -335 -1558 -6717 -5761 1795 4471 2128 3337 5010 -485
1560d85o094J909L597p35J659O361J035o493l619J000k298k653N332P581l75l615
$$ -485 -6579 -4670 -1073 -1808 -149 6212 7247 754 -2865 -1865 -4163 -6816 -1484 6097 5722 2107
1576B107M58j380p168k203O447M382j150K061L420m622p524P8L339r23M16O241
$$ 2107 2565 1185 -5983 -8186 -1739 2643 1493 3554 6974 2352 -5172 -5094 -1755 -2678 -2262 3979
1592C979L203m765l561J208j844m742K025P133J379k405J860J169o373n335L256
$$ 3979 7182 2417 -1144 64 -1780 -6522 -4497 2636 4015 1610 3470 4639 -1734 -7069 -3813
1607c813L510j291K278O473o47p535k621J698k338j486O482O271k408l692P71
$$ -3813 -303 -1594 684 7157 6510 -1025 -3646 -1948 -4286 -5772 710 6981 4573 881 1652
1622A652j735o200l67O821L012j926J747K929m875o683J555L554j891L12O503
$$ 1652 -83 -6283 -6650 171 3183 1257 3004 5933 1058 -5625 -4070 -516 -2407 -2095 4408
1637D408K122n317k490J600k744m224L440O629K58k018K051l12o665l555M013
$$ 4408 6530 1213 -1277 323 -2421 -6645 -3205 3424 3682 1664 3715 3403 -3262 -6817 -2804
1652b804K759q20L076M924k732p066r63J837k153k03O591M180l839k851J629k386
$$ -2804 -45 -865 2211 7135 4403 -2663 -3626 -1789 -3942 -4145 2446 6626 2787 -64 1565 -821
1668h21n491J420O496R83j838K677J563n508m691K313K177j853J714N809P02n093
$$ -821 -6312 -4892 1604 2587 749 3426 4989 -519 -5210 -2897 -720 -2573 -859 4950 5652 559
1684E59j858J073l042k902M703N855j067j817K003j515o660j427M740J943q09
$$ 559 -1299 -226 -3268 -6170 -1467 4388 3321 1504 3507 1992 -4668 -6095 -1355 588 -221
1699b21L230L264l944n781K76J759j860N48N846K530l840k002J244k528m285K078
$$ -221 3009 6273 2329 -3452 -3176 -1417 -3277 -2729 3117 5647 1807 -195 1049 -1479 -5764 -3686
1715c686N499N58j333K397O20n434l588K554J554j324K581N079r86m917r95O45
$$ -3686 1813 2371 1038 3435 4055 -1379 -4967 -2413 -859 -2183 398 5477 4491 -426 -1421 -776
1731g76k963j173N157M211j676j507J396k155n437r0M794J381j113K896K458m269
$$ -776 -3739 -4912 245 4456 2780 1273 2669 514 -4923 -5013 -219 1162 49 2945 5403 1134
1747A134m857J229J536k106J086N593J422l920j437J068k825l346K910M908j64
$$ 1134 -3723 -2494 -958 -3064 -1978 3615 5037 1117 -320 748 -2077 -5423 -2513 2395 2231
1762B231j113K270k37n485k574L015J446r90K706M112j931m906l64J101k679o72
$$ 2231 1118 3388 3151 -2334 -4908 -1893 -447 -1437 1269 5381 3450 -1456 -1820 -719 -3398 -4070
1778d070N277L445k587j420J528k253m784Q40M580O90j072K838J542m315m058
$$ -4070 1207 4652 2065 645 2173 -80 -4864 -4024 556 1246 174 3012 4554 239 -3819
1793c819J602J272j853J630N350L53m296q64J188l020k668L874M254j179q63K355
$$ -3819 -2217 -945 -2798 -1168 4182 4535 239 -625 563 -2457 -5125 -1251 3003 1824 961 3316
1809C316j142n479j278L698R95j255K917L439k993m444P22R49k864J90N451K047
$$ 3316 2174 -3305 -4583 -885 110 -1145 1772 5211 2218 -2226 -1504 -555 -3419 -3229 2222 4269
1825D269k903q30J393k820l994J846M332j94q24L017P47n054k917K419P50j816
$$ 4269 1366 536 1929 -891 -4885 -3039 1293 1099 275 3292 4039 -1015 -3932 -1513 -763 -2579
1841b579K570M516j106l960QP67l122j429M197L274j640m81J991j952m832R8L507
$$ -2579 -9 4507 3401 -559 -551 216 -2906 -4335 -138 3136 1496 1015 3006 1054 -3778 -3680 -173
1858a73J80q77L264K240l622l365J271K37k532J327M988P48l036k22J025l135
$$ -173 7 -870 2394 4634 1012 -2353 -1082 -845 -3377 -2050 2938 3686 650 428 1453 -1682
1874a682l031K818L621q74l38K827l63m831j730K558K02j205K878L518j917l447
$$ -1682 -4713 -1895 1726 852 514 3341 2978 -1853 -3583 -1025 -823 -2028 850 4368 2451 -996
1890i96N33K90l078k41M448K148k059RJ612k674m038J135L467n70n72L416J276
$$ -996 -463 -173 -3251 -3492 956 3104 1045 1054 2666 -8 -4046 -2911 556 -14 -586 2830 4106
1907D106m123k657J802P2k293J927M527j14l148J38P85k973k224L112K934r93
$$ 4106 -17 -2674 -872 -800 -3093 -1166 3361 3247 99 237 1022 -1951 -4175 -1063 1871 878
1923H78j41K357j070m384q04K404j3o59K915K582k350k859O06j17k533O39M237
$$ 878 737 3094 2024 -2360 -3164 -760 -773 -1432 1483 4065 1715 -1144 -538 -655 -3188 -2549 1688
1940A688J184k017N1J081k738l120J695K952n55l04K791M38l811j782J758k18
$$ 1688 2872 855 906 1987 -751 -3871 -2176 776 221 -83 2708 3146 -665 -2447 -689 -907
1956i07j591K209L527q66k496N99J04l095j100L485K006j323M99J986j956m061
$$ -907 -2498 -289 3238 2372 -124 475 579 -2516 -3616 -131 1875 552 1051 3037 1081 -2980
1972b980K14K503m30m82L313J889l259k593J349q3k501J226M260K85k506L43J101
$$ -2980 -2766 -263 -693 -1175 2138 4027 768 -1825 -476 -559 -3060 -1834 2426 2711 205 548 1649
1989A649k719k615K343K625j216j32K818j48l868r81J894o44j376K605L214j422
$$ 1649 -1070 -3685 -1342 1283 67 -65 2753 2605 -1263 -2244 -350 -994 -2370 235 3449 2027
2005B027k427P84o3l178n44L905J720j687N17J721k522l685J126K619p07k29L086
$$ 2027 -400 384 321 -2857 -3401 504 2224 537 1054 2775 253 -3432 -2306 313 -394 -623 2463
2022B463Q86l408j817J443j70j940J630L417m67k130P65P11k902j736K656J710
$$ 2463 3349 -59 -1876 -433 -603 -2543 -913 2504 2037 -93 672 1383 -1519 -3255 -599 1111
2038A111j406O39K621j035l651j97J637j098o74L199K396k139k036J003p61k754
$$ 1111 -295 344 2965 1930 -1721 -1918 -281 -1379 -2053 1146 3542 1403 -633 370 -391 -3145
2054c145P02L808P80j715P06J026k933k682K022K246j177J06K852p8l392q66J938
$$ -3145 -2443 1365 2145 430 1136 2162 -771 -3453 -1431 815 -362 -256 2596 2518 -874 -1740 198
2071A98r48j786K285K875j244j727J398N9l125r15K772J096j115J037K180j743
$$ 198 -750 -2536 -251 2624 1380 -347 1051 1110 -2015 -2930 -158 938 -177 860 3040 1297
2087A297l454K82J553r39r5L212J448k610j732J100q47k107J520L394j95j744
$$ 1297 -2157 -1875 -322 -1261 -1356 1856 3304 694 -1038 62 -785 -2892 -1372 2022 1827 83
2103H3R09N00k753j646K267J414j290M68K433m77k950k55J440j072j335K345K464
$$ 83 992 1492 -1261 -2907 -640 774 -516 -48 2385 1908 -1042 -1297 143 -929 -2264 81 2545
2120B545j343j325J187n14l057j74L013P57j074J328J363k504k736J059J372r28
$$ 2545 1202 -123 1064 550 -2507 -2681 332 1089 15 1343 2706 202 -2534 -1475 -103 -1031
2136a031M06K914M49k896j028J318r15j745J807K793o60j720J166N03k704j251
$$ -1031 -625 2289 2738 -158 -1186 132 -783 -2528 -721 2072 1412 -308 858 1361 -1343 -2594
2152b594K267J097j363P26K340r07k764N6J213j377o41K602J955j659j114R58
$$ -2594 -327 770 -593 133 2473 1566 -1198 -1142 71 -1306 -1947 655 2610 951 -163 795
2168G95r21k442M89K973L63j151J054J029k716k147J576J482j130M13K635j90
$$ 795 -126 -2568 -2079 894 1257 106 1160 2189 -527 -2674 -1098 384 -746 -333 2302 2112
2184B112k890l13J392j144j380K029K246j160j031J289k12k687m52K241N63j183
$$ 2112 -778 -1091 301 -843 -2223 -194 2052 892 -139 1150 938 -1749 -2201 40 603 -580
2200e80J233J957j640k582O14R78j417n3L056J082k337q11J169j165k133J381
$$ -580 653 2610 970 -1612 -998 -20 -1437 -1490 1566 2648 311 -500 669 -496 -2629 -1248
2216a248K719m53j081J322L84k651j430J939Q95j230P80K333p15k554J74J174
$$ -1248 1471 1018 -63 1259 1643 -1008 -2438 -499 396 -834 -54 2279 1564 -990 -816 358
2232C58j476j031K405J841j479p60J433o98k743K13K472l1j023J629J331k249
$$ 358 -1118 -2149 256 2097 618 -142 1291 593 -2150 -1937 535 504 -519 1110 2441 192
2248A92k009J083P31j348N28K734K22k259l59J107j291j651J669K216q33q36J452
$$ 192 -1817 -734 -3 -1351 -823 1911 2133 -126 -485 622 -669 -2320 -651 1565 732 -104 1348
2265A348p6k687p02K065L61j288J365J963j359k160P34O24j575l21K549J166j657
$$ 1348 1272 -1415 -2117 -52 309 -979 386 2349 990 -1170 -436 188 -1387 -1708 841 2007 350
2282C50m41J117j004k182P15K246k53r03J552P68k238j587J351N35j223Q23K311
$$ 350 -91 1026 22 -2160 -1445 801 548 -355 1197 1965 -273 -1860 -509 26 -1197 -374 1937
2299A937m13k003J80P61j461j078J909J590r65m27J263m96k409j74J977k6q87
$$ 1937 1524 -479 -299 462 -999 -2077 -168 1422 457 30 1293 797 -1612 -1786 191 165 -722
2316g22J412J540j652j827P50N21j412J84K425N83j772j40R43j207j630J134J761
$$ -722 690 2230 578 -1249 -499 22 -1390 -1206 1219 1802 30 -110 833 -374 -2004 -870 891
2333H91n50m35J363K33k244q50J355J66r49J048J985q50j832M59N80j576o52K226
$$ 891 341 -94 1269 1502 -742 -1592 -237 -71 -1020 28 2013 1163 -669 -210 370 -1206 -1858 368
2351C68J208j293k36J341r90k221M22J843k39p69J530R80j843j474J063L45j289
$$ 368 1576 283 47 1388 398 -1823 -1401 442 203 -566 964 1944 101 -1373 -310 35 -1254
2368a254M19K233J22j711J02Q95j433j402J511J663q61m17J502j87k259m70J583
$$ -1254 -835 1398 1520 -191 -89 806 -627 -2029 -518 1145 284 -133 1369 1182 -1077 -1547 36
2385C6r5r20J331J607j143j618N65M37j424j81K081P45j292p5J034j034j880P94
$$ 36 -59 -979 352 1959 816 -802 -237 200 -1224 -1405 676 1421 129 54 1088 54 -1826 -1032
2403a032J636n64m20J576M72k086q83J257k3j239R86K027n71j612N41O40j704
$$ -1032 604 40 -380 1196 1668 -418 -1301 -44 -67 -1306 -320 1707 1136 -476 65 705 -999
2420i99q23J844J149j063q3J348o36k073J11J500m08p46J553J161j531j255R27
$$ -999 -1822 22 1171 108 25 1373 737 -1336 -1225 275 -133 -879 674 1835 304 -951 -24
2437b4J30j567L43K184Q7j359N17Q01j552j459J313J305p74j78J555L7k113n78
$$ -24 106 -1461 -1118 1066 1153 -206 311 1112 -440 -1899 -586 719 -55 -233 1322 1359 -754 -1332
2455a332J363p0j088J142J748r52j476P34M29j650k93J892N99j219K45J200r94
$$ -1332 31 -39 -1127 15 1763 811 -665 69 498 -1152 -1445 447 1046 -173 72 1272 278
2472B78j674N60J209o81l94J597P10j592q75R33j87j270O65J988k30j167L96O00
$$ 278 -1396 -836 373 -308 -702 895 1605 13 -862 71 -116 -1386 -721 1267 1037 -130 266 866
2490H66j600j017J520J044p89P8J216m52j817n1J149l89o07J262J123j185j026
$$ 866 -734 -1751 -231 813 24 102 1318 866 -951 -1002 147 -242 -849 413 1536 351 -675
2507f75Q79P1j416P3J664K36j148N78J023j172j533P33J113q04j18J631L59j752
$$ -675 204 275 -1141 -1068 596 832 -316 262 1285 113 -1420 -687 426 -378 -496 1135 1494 -258
2525b58o37R14l48r93J083J612m78j081M54J35j342m61J438P55q45J66J055p43
$$ -258 -895 19 -329 -1322 -239 1373 895 -186 268 403 -939 -1400 38 793 -52 114 1169 426
2543D26j536L93J074o05n75J392Q20j311p01R65j61j427L21J646Q0r94O11O80
$$ 426 -1110 -717 357 -248 -823 569 1389 78 -623 342 181 -1246 -925 721 801 -193 418 1098
2561A098j346j256R64R21o49R4J495j57j762k85R30n10n94J347J221r91j033O78
$$ 1098 -248 -1504 -540 381 -268 -174 1321 1164 -598 -883 47 -463 -1057 290 1511 520 -513 165
2579A65J54j384q1J671K77j119L69J037q78j336O04J052r31m45J604N75j401m51
$$ 165 319 -1065 -1146 525 802 -317 52 1089 211 -1125 -521 531 -400 -845 759 1334 -67 -518
2597e18R17m28j360O95J647k82q73P66L18j617q73J438P35q25L13J338o74j658
$$ -518 399 -29 -1389 -694 953 671 -202 564 882 -735 -1608 -170 565 -260 53 1391 717 -941
2615i41J34J073o32n99J454Q59j284o27Q75L0j372J56J552m5j024O49R20j202
$$ -941 -807 266 -366 -965 489 1348 64 -563 312 342 -1030 -874 678 633 -391 258 1178 -24
2633b4j094Q69N79r26P6J645M3j498j43P37o43r51J092J406o25p28P79q5j509
$$ -24 -1118 -249 330 -596 -520 1125 1168 -330 -473 264 -379 -1330 -238 1168 543 -185 594 509 -1000
2652a000l41J606L04q87N28J012q94j391N57Q25o64l57J251N47j182l05Q83m15
$$ -1000 -1341 265 569 -318 210 1222 328 -1063 -506 319 -345 -702 549 1096 -86 -391 492 77
2670G7j219N72J199l19o44R51L69j392p08J008K44p54N12J344l49j425J00O63
$$ 77 -1142 -570 629 310 -334 617 986 -406 -1114 -106 138 -616 -104 1240 891 -534 -434 229
2688B29p43o28J389J064j056n80Q21k48j344J44J410j5p23N69P00r67j013Q24
$$ 229 -514 -1142 247 1311 255 -325 496 248 -1096 -952 458 443 -280 289 989 22 -991 -167
2706a67M31q37k6J340J95j103m9P10o23j096Q87J178n23n60R13J51j451n18J136
$$ -167 264 -573 -599 741 936 -167 -216 494 -129 -1225 -338 840 317 -243 670 821 -630 -1148 -12
2725a2K71p69N52J191o48j275K51O20o74l51J242O54j046l13P82l53j139L65J233
$$ -12 259 -510 42 1233 585 -690 -439 181 -493 -844 398 1052 6 -307 475 122 -1017 -652 581
2744E81l10o33Q18N39j185p76R52K68q86K49J337j90j136J06O75p48q28J097R98
$$ 581 271 -362 456 995 -190 -966 -14 254 -632 -383 954 764 -372 -266 409 -339 -1167 -70 928
2763I28p13m32Q69j26j338r5J068Q0n87O01Q16p29j085M80N19q54r0J296L18j088
$$ 928 215 -217 652 526 -812 -907 161 241 -346 255 1071 342 -743 -263 256 -598 -688 608 926 -162
2783a62o7Q04o22j062O75J031m82m08R04K15j259m96R21J88p84M73J235m60j087
$$ -162 -229 575 -47 -1109 -434 597 115 -293 611 826 -433 -929 -8 180 -604 -131 1104 644 -443
2802d43K72N62q70n27J239O38r08j93R45m20j205J44J147k44n60Q31P12j090q62
$$ -443 -171 391 -479 -1006 233 871 -37 -230 715 295 -910 -766 381 137 -423 408 1120 30 -832
2821h32P78L17j021K07J315O6j197K33O55p50r00Q90J020o97l65R93j8j342j35
$$ -832 -54 263 -758 -551 764 830 -367 -134 521 -229 -1129 -239 781 84 -281 712 694 -648 -783
2840g83R94j9q08P86R22p22r89N41L71r00j59J247K75q72nP92n75j012L62R54
$$ -783 211 192 -616 170 1092 370 -619 -78 293 -607 -766 481 756 -116 -121 671 96 -916 -554 400
2860D00l40l25Q20L68j156m98Q28l7p03M35J083m05q48L97M50r88m29J067N67
$$ 400 60 -265 555 923 -233 -731 97 60 -643 -208 875 470 -378 19 469 -519 -948 119 686
2879F86p35n9Q49l49j169J59R44k75n93Q42P50r33p67O66J49q93P7J247Q1q85
$$ 686 -49 -108 741 392 -777 -618 326 51 -542 300 1050 117 -650 16 165 -728 -651 596 677 -208
2899b08K14O19p33q73P43O66m23k97R56L3j167k43Q28j71o23P27R45o12q77N37
$$ -208 6 625 -108 -981 -238 428 5 -292 664 697 -470 -713 115 -56 -679 48 993 381 -496 41
2919D1L48r68l36J251L73q11mQ55m41j090K56Q40k84l85P90M36q53n67N94P8p26
$$ 41 389 -579 -915 336 709 -102 -106 749 308 -782 -526 314 30 -355 435 871 18 -549 45 123 -603
2940f03K13J012j17p80K95M41q03n73Q29O10o70o5R22j15j225J2R27l97o46Q42
$$ -603 -390 622 505 -275 20 461 -342 -915 -86 524 -146 -211 711 596 -629 -617 310 -87 -733 109
2960A09R32p95p09N19K72r20j18J125K92q50P5P00n24r70N01P81m53l42Q72K66
$$ 109 1041 246 -463 56 328 -592 -710 415 707 -143 -68 632 108 -862 -361 420 -33 -375 497 763
2980G63j015l20Q29j86p97N82R29m10p82N88L77j030m59J043M40p72O6R62l38
$$ 763 -252 -572 257 71 -726 -144 785 375 -407 181 558 -472 -931 112 552 -220 -154 808 470
2999D70j205J88Q10l66n04Q89P02r01o21O76j7q41K54J054j20p69M80M12p89o54
$$ 470 -735 -547 263 -103 -607 282 984 83 -538 138 121 -720 -466 588 468 -301 179 591 -198 -852
3019h52Q17N34p41J8R39k13r77L9Q19m57p11P86Q59o47o90P83J79j105k63J159
$$ -852 -35 499 -242 -224 715 502 -475 -436 383 -74 -785 1 860 213 -477 306 485 -620 -883 276
3039B76J62p04L99P17o73j031M80O89n36j37R47K42j076k36O93j91p59M78J022
$$ 276 438 -266 133 850 177 -854 -374 315 -221 -358 589 831 -245 -481 212 21 -738 -260 762
3058G62m48p47N89M57r52l82Q45L38q15J79R26l50q88J48O31n25m76Q25O63o62
$$ 762 314 -433 156 613 -339 -721 124 462 -353 -174 752 402 -486 -338 293 -232 -708 117 780 118
3078A18l78N32q6r74J73J032m1n77M26M73q72o63O63N16n50k8Q94p2r96k9P08
$$ 118 -260 272 186 -788 -615 417 376 -201 225 698 -174 -837 -174 342 -208 -236 658 586 -410 -439 269
3099B69k72o51O10P11m94n75O83K00q71k45P89J06o42L67Q20n20q91M19L98o41
$$ 269 -3 -654 -44 667 173 -402 281 481 -390 -635 154 260 -382 -15 805 285 -606 -187 211 -430
3119d30k07J034M25r16k00N27k38q29M02J055k86o24M83L06q17l85P00L75n90
$$ -430 -637 397 822 -94 -294 233 -5 -834 -432 623 337 -287 196 502 -315 -700 0 375 -215
3138b15l4R05k10r66K17P19m86n81P18O10o62l28P74m2j046kR64q0n85M95O78
$$ -215 -249 656 446 -520 -303 416 -70 -651 67 677 15 -313 461 419 -627 -629 335 255 -330 165 843
3159H43o86q91N36M40o43p7J077J09r31j37O27k66p43N69Q57m35o24O17K23q94
$$ 843 157 -734 -198 242 -401 -478 599 708 -223 -360 267 1 -742 -173 684 249 -375 242 465 -429
3179d29k28Q80P1o84K50Q80m45q37M50N34p50l97R35M97q57j69P56k40r52J96
$$ -429 -657 223 294 -390 -140 740 295 -542 -92 442 -308 -705 230 727 -130 -299 457 217 -735 -539
3199e39R74j92o29O54M97q71o34O74L65o92R1R22p6r59J47O37n44m97O99O76o72
$$ -539 435 243 -386 268 765 -106 -740 -66 299 -393 -302 620 544 -415 -268 369 -175 -672 27 703 31
3220C1l36O70L6q97r7Q96j22o46M78P70n87p59N41L57p84j19J037J96p67k9O10
$$ 31 -305 365 401 -496 -593 303 181 -465 13 783 196 -563 -22 335 -449 -568 469 665 -102 -131 479
3241D79m45q65N43P70l61n10P06K43r25l03P87J07p01L40Q67l97q15L83N06p24
$$ 479 34 -831 -288 482 121 -389 317 560 -365 -668 119 226 -475 -135 732 335 -480 -97 409 -315
3261c15l98R65L57o54j74P12k11r19K01P94k50m75O41N04q42m99O45J55p91J98
$$ -315 -713 252 609 -45 -219 493 282 -637 -436 358 108 -367 274 778 -64 -563 82 237 -554 -356
3281c56R33r4p60J51O08o21o80P36O35n81k84P60R7j037o8P90p1o42M74P16m87
$$ -356 577 483 -277 -126 482 -139 -819 -83 552 -29 -313 447 544 -493 -561 229 158 -484 -10 706 219
3302B19o72M32K92o69j41Q66J99o62nO28l72q19M26O48l48l74P09L43r54l57P79
$$ 219 -453 -21 271 -398 -539 327 526 -136 -141 487 115 -704 -278 370 22 -352 357 700 -254 -611 168
3323A68O8p54K76R16k69q02K87M96n75n52P71N01n49k71P46j16q54J4O91j40m81
$$ 168 236 -518 -242 674 405 -397 -110 386 -189 -741 30 531 -18 -289 457 341 -513 -499 192 52 -429
3344d29N60N64o63n31N63J74p71P1R91j00p02K32N78o03o86N81O74n14l40P69
$$ -429 131 695 32 -499 64 238 -533 -462 529 429 -273 -41 537 -66 -752 -171 503 -11 -351 418
3364D18J87r39l14Q42Rp37L71Q87l66p96L52M86p06l71Q42L72o98P3N77k64q49
$$ 418 605 -334 -648 194 203 -534 -163 724 358 -438 -86 400 -306 -677 165 537 -161 -88 489 225 -624
3385f24K71P76m33l69O89L59q87k82P39Rq05J40R87j52p71K79O08p03o65Q40N09
$$ -624 -353 423 -10 -379 310 669 -218 -500 239 248 -557 -417 570 418 -353 -74 534 -169 -834 6 515
3406E15n98k02P99l8r15J1P34l18n37O26N61n86m95O09R9q34R0Q85qp41L50O18
$$ 515 -83 -285 514 476 -439 -428 306 -12 -549 77 638 52 -443 166 265 -569 -479 406 398 -343 7 625
3428F25o34p74O00O80o11l49R36K53j015k14P90j43q02M93Q89m12p26M59M15p28
$$ 625 -9 -783 -183 497 -114 -463 473 726 -289 -503 287 144 -658 -165 724 312 -414 45 460 -268
3448b68m07Q16K88o47P1P06k73q19K16O70m74l59P01M57p70k83O28Pq88J96R00
$$ -268 -675 141 429 -218 -147 559 286 -533 -317 353 -121 -480 221 678 -92 -375 253 260 -628 -432 468
3469D68j46o21L60N16p15n64O49M21n23j25P61N3r12j4N98j96n89N67O63m83n14
$$ 468 322 -299 61 577 -138 -702 -53 368 -155 -280 481 534 -378 -392 206 10 -579 -12 651 168 -346
3490c46M59J80p17q8Q40M0o57K42O79m99p08M47M89n61k58P76K78p58j70O34j70
$$ -346 113 293 -424 -512 328 368 -289 -47 632 133 -575 -128 361 -200 -458 318 596 -162 -332 302 132
3511A32p36K42Q76k16o70M77M09p61m53P16L75n59RP42j80q60J05O17l43l83O19
$$ 132 -604 -362 514 298 -372 105 514 -247 -700 16 391 -168 -159 583 403 -457 -352 265 -78 -461 158
3532A58M95o47l78N48J01p94Q9Q11o4o54L15O15n45o07M83M34o53j61Q99J54q62
$$ 158 653 6 -372 176 277 -517 -428 383 319 -335 -20 595 50 -557 -74 360 -293 -454 445 599 -263
3553b63j07O00k50o02M67P41l56n39N06K05q22j72P85K02o64J76O39l28p78L36
$$ -263 -370 230 -20 -622 -155 586 230 -309 197 402 -420 -592 193 395 -269 -93 546 218 -560 -224
3573b24O27n13l37O75L67p50k06P22j26p34J58P83l32m69N92L80o95n54O51K69
$$ -224 403 -110 -447 228 595 -155 -361 361 235 -499 -341 442 110 -359 233 613 -82 -636 15 284
3593B84o38OR46q0q80K8O34l40n88O18P25o20m55N46J59q69K1R32p3p17K99O13
$$ 284 -354 -348 598 518 -362 -334 300 -40 -628 -10 715 95 -360 186 345 -524 -503 429 356 -361 -62 551
3615E51m61o49N94M20p14j48P41J67p40J5O50k88p59L33O94l14m66O88L29r52
$$ 551 90 -559 35 455 -259 -407 334 501 -239 -224 426 138 -621 -288 406 92 -374 314 643 -309
3635c09l93Q10J43p10L14Q32l55q42K99N06m78l36Q02L33o90k59O28j5p81K35
$$ -309 -702 108 251 -459 -145 687 332 -510 -211 295 -183 -519 283 616 -74 -333 295 280 -501 -266
3655b66P31k05p46N33N24o23m51N65K89p05QP44Po21J09N15n04n29N29N99m55
$$ -266 465 260 -486 47 571 -52 -503 62 351 -354 -346 398 405 -216 -107 408 -96 -625 -96 503 48
3676D8k76N87Q1r00j18P99j4n16L38N95n14o76M37M32n58j92P94J23o42r7O60
$$ 48 -228 359 440 -460 -578 221 207 -309 29 624 110 -566 -129 303 -255 -447 347 470 -172 -269 391
3697C91j89o86L31N76l30n26O20L79o56l73N61J25n94J06Q37k21o76J33M91m68
$$ 391 202 -484 -153 423 93 -433 187 566 -90 -463 98 223 -371 -265 572 351 -325 -192 299 -169
3717a69n05O93N63n66k90O52q3q20P0P85j85n46L97N53n81m84N11M04o17k00P23
$$ -169 -674 19 582 16 -274 378 295 -525 -455 330 145 -401 -4 549 -32 -516 -5 399 -218 -418 305
3738C05J63o95M1N61k96o27L83O09m26l28O48J09p38j41O02m2n10K53P15l83p14
$$ 305 468 -227 -186 375 79 -548 -165 444 18 -310 338 447 -291 -432 170 128 -382 -129 586 203 -511
3759e11L76M77n92l56P81L00o12j86P84j64q16K60O47k71n10N28M61o32m33N72
$$ -511 -135 342 -250 -606 175 475 -137 -323 461 297 -519 -259 388 117 -393 135 596 -36 -469 103
3779A03J52o13J13P12j37o47L10M46n33m64N62M49n72j71P23j9r17J07Q02k74
$$ 103 255 -358 -245 467 330 -317 -7 439 -94 -558 4 453 -119 -290 433 414 -503 -396 406 132
3799A32o31M89O96n63o77N77L80p30j90Q02J73o55qO17k81p04M04N44l93l38O25
$$ 132 -499 -10 686 123 -554 23 403 -327 -517 285 458 -197 -205 412 131 -573 -169 375 -18 -356 269
3820B69K44p04k14O33n9o19K94P79l52p15M54L96o60l30P54L65p09j19P40j46
$$ 269 513 -191 -405 228 169 -450 -156 623 271 -444 10 406 -254 -584 170 535 -174 -293 447 301
3840C01q52K03P33l69m72N14N21m94n49N45K18p07L9P15l4n63J87M75m99m63N28
$$ 301 -551 -348 385 16 -456 58 579 85 -464 81 299 -408 -369 346 312 -251 -64 411 -88 -551 -23
3861b3M36n57j40O87k4p73O1O56k31n44M51N99n04n56N30L45p08k56Q15J74p15
$$ -23 413 -144 -284 403 379 -394 -333 323 92 -452 -1 598 94 -462 68 413 -295 -551 264 438 -277
3882b77K2O93k22p24K81N61l54l76O50K47o41k14N10j9o07K73O42k05n77L94L65
$$ -277 -255 438 216 -508 -227 334 -20 -396 254 501 -140 -354 156 137 -470 -197 445 240 -337 57 422
3903D22n84l65O54L25o43l3O80r4p80Q5O94k66n69N17N41m92n21N10J88o22r8
$$ 422 -162 -527 127 452 -191 -224 456 362 -418 -333 361 95 -474 43 584 92 -429 81 269 -353 -451
3924d51P82Pn40J41M21k86n91M10M45m28j77N63J77p07n8N14q6o72M09O56m24
$$ -451 331 338 -202 -61 360 74 -517 -107 338 -90 -267 296 473 -234 -292 222 136 -536 -127 529 105
3945A05n00M65L69o95k75P63J93o72R5N63j54p31K25N94l33m48O37L49o29k80
$$ 105 -395 70 439 -256 -531 232 425 -247 -152 411 257 -474 -249 345 12 -436 201 550 -79 -359
3965c59N71P2o67K8P41n0o51L14M74n31m74N55L86o76k5P41o3p86J35N89k26n82
$$ -359 212 284 -383 -355 386 336 -315 -1 473 -58 -532 23 409 -267 -292 449 386 -400 -265 324 98 -484
3987d84M70O06n64l49M90K08p14j64P38Q1n52J09O16l95n96L60N58n09k47O14
$$ -484 -14 592 28 -321 169 377 -337 -501 237 318 -234 -125 491 96 -500 -140 418 -91 -338 276
4007B76J93o74j55O15o2o17K83O00l35m93M64L15n85l24O07J86o31R9P55j77p51
$$ 276 469 -205 -360 255 193 -424 -141 459 124 -369 95 410 -175 -499 108 294 -337 -238 517 340 -411
4028d11K61M59m21m08O71L95n69k73O02q5o52N0Q02j68n26L09L99m87m48N59K76
$$ -411 -150 309 -112 -520 151 546 -23 -296 306 221 -431 -381 421 253 -273 36 435 -52 -500 59 335
4049C35n33j18O97qo55M1O27k90n08L84M75m29l95N57K39o96j35O24Ro06K67O98
$$ 335 -198 -316 381 373 -282 -241 386 96 -412 -28 447 18 -377 180 419 -277 -412 212 221 -385 -118 580
4071E80l75o49L38L74m67j82O14K78o00k02O14j68o12K86O19l21n28M58L52n47
$$ 580 205 -444 -106 268 -199 -381 233 511 -89 -291 323 155 -457 -171 448 127 -401 57 409 -138
4091a38l08N83K02n78nN61po50J57M93l22m42M45M56n16j93N65N8p84lO90m1n61
$$ -138 -446 137 339 -239 -244 317 310 -340 -183 310 -12 -454 -9 447 -69 -262 303 361 -423 -426 264 223 -338
4114c38L90M52m55n52M26L71m53q2N78R2o71p7N75j84m87L69N19m48l72N10K02
$$ -338 52 504 49 -503 -77 294 -159 -241 337 429 -242 -319 256 72 -415 -46 473 25 -347 163 365
4135C65n17j81N50N2n58R3O75k38o04K53M91n42l61O88L07n81r7N50j00p50J57
$$ 365 -152 -333 217 269 -289 -196 479 241 -363 -110 381 -161 -522 166 473 -108 -205 345 245 -505 -348
4156c48P31k32n08M60L91o34l67N69L05o77pO88l2p22J07O66k77n25L64N27n16
$$ -348 383 151 -357 103 494 -140 -507 62 367 -310 -317 371 339 -383 -276 390 113 -412 -48 479 -37
4177c7l18N24K55o61j51O42p8n48L03N58l32n82L87K92n59j54O97K35p25N9N49
$$ -37 -355 169 424 -237 -388 254 176 -372 -69 489 157 -425 -38 254 -305 -459 238 473 -252 -193 356
4198C56k42o12L15O75l76m05M29L08o30k87O82K3n09M1O81k38n66K21N57m91m06
$$ 356 114 -498 -183 492 116 -289 140 448 -182 -469 213 236 -273 -232 449 211 -355 -134 423 -68 -474
4219d74N38L17m95q1N61j31n77P1O40l32l85M45M75n81m73N95J05n64M9O98q1
$$ -474 64 381 -114 -195 366 235 -342 -271 369 37 -348 97 572 -9 -482 113 218 -346 -297 401 320
4240C20o09J58M72l77n05M88N54m87l17N29J03n57j37N87l2n74K83N24l07m71
$$ 320 -289 -131 341 -36 -541 -53 501 14 -303 226 329 -228 -365 222 190 -384 -101 423 116 -355
4260c55L80K80n05j29N56J48n94M8N93k69o25L23N30l62l36N17K71o42k35N18
$$ -355 25 305 -200 -329 227 375 -219 -171 422 153 -472 -149 381 19 -317 200 471 -171 -406 112
4280A12J83n86O7O25j40n35J78M15m01m05N39L33m35k45N31Q8o43N6N27j62m23
$$ 112 295 -291 -224 401 261 -274 -96 319 -82 -487 52 385 -50 -295 236 324 -319 -263 264 102 -321
4301c21M01L20m23l55M52J69n27l3O02K4n64Q2N17k36o00L48N27l78l52N88J62
$$ -321 80 400 -23 -378 74 243 -284 -317 285 309 -255 -173 344 108 -492 -144 383 5 -347 241 403
4322D03n42k40N54Ln71K06N59j74n22K87L85n24k59N59J67m96J8N02j02o35K32
$$ 403 -139 -379 175 178 -393 -187 372 198 -324 -37 348 -176 -435 124 291 -205 -187 315 213 -422 -190
4343a90N59l36m05M90L21n40l19N44K24p00P0N95p2n51K05N15m12m75L47M71m26
$$ -190 369 33 -372 118 439 -101 -420 124 348 -352 -282 313 241 -310 -105 410 -2 -477 -130 341 -85
4364h5j88M75J70n99p5N25j56m17L08M80l73l76L80K39n80j28O73O8n67M3N63
$$ -85 -273 202 372 -227 -302 223 67 -350 -42 438 65 -311 69 308 -272 -400 273 341 -226 -183 380
4385C80k37o41M18M40l69l80N59K59n89j52N16N9o18J21O31j73n07K48M48n13
$$ 380 143 -498 -80 360 -9 -389 170 429 -160 -312 204 263 -355 -234 397 224 -283 -35 413 -100
4405a00l09M69K95n14nN39j48n44J53M83l52l15L95L75m89k97N02Q6n50O9O00
$$ -100 -409 60 355 -159 -164 375 227 -317 -164 319 -33 -348 47 422 -67 -364 138 224 -326 -257 343
4426C43p4o00K45M79l80m18L92L76m93k35N91J33n60n0N12j10n59K89M95l22l62
$$ 343 269 -331 -86 393 13 -405 -13 363 -130 -365 226 359 -201 -251 261 151 -408 -119 376 54 -308
4447c08L80J82m49j45N01J72n66M6N35k71m95K45N35l86l87N66L15n78k60N59
$$ -308 72 254 -195 -340 161 333 -233 -187 348 77 -418 -173 362 -24 -411 155 470 -108 -368 191
4467A91j0n13J56M96j04m75K82L56m38k97M28J83m38n9N05m3n02O8M55j99m68
$$ 191 181 -332 -176 320 216 -259 23 379 -59 -356 72 255 -183 -242 263 220 -282 -214 241 42 -426
4488d26M03L91m02k75N05L7n07oN64q2m52J52N18l57m79L80L66m26j94N19J63
$$ -426 -23 368 -34 -309 196 233 -274 -280 284 202 -250 -98 420 63 -416 -36 330 -96 -290 229 392
4509C92n60q4M67l7n89K30N69k69m17L22L44n37k30N03J71m39kN19j79n05K12
$$ 392 -168 -252 215 178 -411 -181 388 119 -298 24 368 -169 -399 104 275 -164 -166 353 174 -331 -119
4530a19M86l87l76M56L05m64k20N57L7n94j1O04j28m85L55L71m19l71L95K54m05
$$ -119 367 -20 -396 60 365 -99 -319 238 275 -319 -330 274 146 -339 16 387 -32 -403 -8 246 -159
4551a59j48N46Q4n28j6N08k06m04K81M57l64l62L84K28m86j15N51k0m89J32M91
$$ -159 -307 239 323 -205 -221 287 81 -323 -42 415 51 -311 73 301 -185 -300 251 231 -258 -126 365
4572C65k47m65K73L88l84k44M02K37m55p7M31q7m63J27N15k67k97L29L71n73k58
$$ 365 118 -347 -74 314 -70 -314 88 325 -130 -207 224 137 -326 -199 316 49 -248 81 452 -121 -379
4593c79M66K34m75j1N74j95n48K08M74l09l43L78K82m96j97N35M6n01M6M71j67
$$ -379 87 321 -154 -165 409 214 -334 -126 348 39 -304 74 356 -140 -337 198 244 -257 -211 260 93
4614I3m85L02M94l86m47M96J68m53q1M90R1m24J3M34l01m20L28M90l65l22M28
$$ 93 -392 -90 404 18 -429 67 235 -218 -299 191 282 -142 -129 305 4 -416 -88 402 37 -285 143
4635A43J72n45j78O17J05m94O4M62k07m78L23K85k50l25L50K26m54oM53J3n48
$$ 143 315 -230 -408 209 314 -180 -116 346 139 -339 -16 269 19 -306 44 270 -184 -190 263 276 -272
4656b72P4M41j83l62L09L82m15k95M32J22m89PM92M2n72J47L98k75l45L59L62
$$ -272 -198 243 60 -302 7 389 -26 -321 111 233 -256 -249 243 285 -287 -140 258 -17 -362 -3 359
4677C59l73k04L31O8l73o1N18q4m65J64M20k63l76L79K73l90k68M70J53m65L9
$$ 359 -14 -218 113 181 -192 -253 265 181 -284 -120 300 37 -339 40 313 -77 -345 125 278 -187 -148
4698a48M40k37l85J93L71k50k51M22K06n14j99N03O4m99J09N29k15m95K66L92
$$ -148 292 55 -330 -137 234 -16 -267 155 361 -153 -352 151 215 -284 -175 354 139 -356 -90 302
4718C02k97l46M17L15n03j38M15J2m56Q5M71j29m50K49L75k70l31M16P4m08j39
$$ 302 5 -341 76 391 -112 -250 165 177 -279 -194 277 148 -302 -53 322 52 -279 137 211 -197 -336
4739c36N63L8n04J31L98k70m10L44L62l56k44M41R2n15k6M45j5l78J76L87j93
$$ -336 227 265 -239 -108 290 20 -390 -46 316 -40 -284 157 249 -266 -292 153 138 -240 -64 323 130
4760A30m78L11L31l56k80M48J75n04OM33n6m29J06M49k58l05L24K89m54k03M57
$$ 130 -348 -37 294 -62 -342 106 281 -223 -217 216 160 -269 -163 286 28 -277 47 336 -118 -321 136
4781A36O7m40j1N43j47l89J93L89l95l11M34K18m61r7M76K2n21R3M91k28l93K93
$$ 136 203 -237 -248 295 148 -241 -48 341 -54 -365 69 287 -174 -271 205 227 -294 -201 290 62 -331 -38
4803c8L48k73l44L74J91m05j18M67O2l92L8L43k22l52L12L40m14j72M01J27m26
$$ -38 310 37 -307 67 258 -147 -265 202 264 -128 -90 253 31 -321 -9 331 -83 -255 146 273 -153
4824a53j25M82k6m71J78M21k25m13L21L35m19k29M62J52m08j28M57ln19J75M11
$$ -153 -278 204 178 -293 -115 306 81 -332 -11 324 -95 -324 138 290 -118 -246 211 208 -311 -136 275
4845B75k39l22L76J97l65j81M12j8l17N1L92j34l38J84L17l29k70L53K32l92j12
$$ 275 36 -286 90 287 -78 -259 153 135 -182 -131 261 127 -211 -27 290 -39 -309 44 276 -116 -228
4866b28M20O7m64k2N23k09m20K75L65l21k25K90K25m65o6M31K2l88R3L26j39l54
$$ -228 192 259 -205 -227 296 87 -333 -58 307 -14 -239 51 276 -189 -255 176 198 -190 -97 229 90 -264
$$ [...]
8191G0
##END NTUPLES=NMR FID
##END=
