##TITLE=1H_IBPA1609
 CDCl3, 8 sc, 
 17.9.2019
##JCAMPDX= 6.0         $$ Bruker NMR JCAMP-DX V2.0
##DATA TYPE= NMR FID
##DATA CLASS= NTUPLES
##ORIGIN= UXNMR, Bruker Analytische Messtechnik GmbH
##OWNER= root
$$ XWIN-NMR		Version 3.5
$$ Tue Sep 17 14:18:43 2019 Russian Standard Time (UT+4h)  she@DPX200
##.OBSERVE FREQUENCY= 200.1315
##.OBSERVE NUCLEUS= ^1H
##.DELAY= (6, 6)
##.ACQUISITION MODE= SIMULTANEOUS
##.ACQUISITION SCHEME= undefined
##.AVERAGES= 8
##.DIGITISER RES= 18
##SPECTROMETER/DATA SYSTEM= spect
##.PULSE SEQUENCE= zg30
##.SOLVENT NAME= CDCl3
##.SHIFT REFERENCE= (INTERNAL, CDCl3, 0, 15.7039)
##AUDIT TRAIL= $$ (NUMBER, WHEN, WHO, WHERE, WHAT)
$$ ##TITLE= Audit trail, XWIN-NMR		Version 3.5
$$ ##JCAMPDX= 5.01
$$ ##ORIGIN= Bruker BioSpin GmbH
$$ ##OWNER= she
$$ F:/spectra/data/she/nmr/H-F/1/audita.txt
$$ ##AUDIT TRAIL=  $$ (NUMBER, WHEN, WHO, WHERE, WHAT)
(   1,<2019-09-17 14:17:42.29 +0400>,<she>,<DPX200>,
      <created by zg, POWCHK disabled, PULCHK disabled
       configuration hash MD5:
       00 E9 B6 7A A2 85 ED C7 34 08 36 98 17 FE 4E 26
       data hash MD5: 16K
       70 D0 9E F7 7F 61 A2 25 DF 3F 97 99 ED 1F 07 6F>)
$$ ##END=
$$ 
$$ hash MD5
$$ 51 AA F5 74 33 82 86 1C CA B4 4F 43 3D 64 F0 51
##$RELAX= 
##$RELAX= 
##$RELAX= 
##$RELAX= 
##$RELAX= 
##$RELAX= 
$$ Bruker specific parameters
$$ --------------------------
##$DU= <F:/spectra>
##$EXPNO= 1
##$NAME= <H-F>
##$PROCNO= 1
##$TYPE= <nmr>
##$USER= <she>
##$AMP= (0..31)
100 100 100 100 100 100 100 100 100 100 100 100 100 100 100 100 100 100 
100 100 100 100 100 100 100 100 100 100 100 100 100 100 
##$AQSEQ= 0
##$AQ_mod= 1
##$AUNM= <au_zg>
##$AUTOPOS= <>
##$BF1= 200.13
##$BF2= 200.13
##$BF3= 200.13
##$BF4= 200.13
##$BF5= 200.13
##$BF6= 200.13
##$BF7= 200.13
##$BF8= 200.13
##$BYTORDA= 1
##$CFDGTYP= 0
##$CFRGTYP= 5
##$CHEMSTR= <none>
##$CNST= (0..31)
1 1 145 1 1 1 1 1 1 1 1 1 1 1 1 1 1 1 1 1 1 1 1 1 1 1 1 1 1 1 1 1 
##$CPDPRG= <>
##$CPDPRG1= <>
##$CPDPRG2= <>
##$CPDPRG3= <>
##$CPDPRG4= <mlev>
##$CPDPRG5= <mlev>
##$CPDPRG6= <mlev>
##$CPDPRG7= <mlev>
##$CPDPRG8= <mlev>
##$CPDPRGB= <>
##$CPDPRGT= <>
##$D= (0..31)
0 1.2 0 0 0 0 0 0 0 0 0 0.03 0 0 0 0 0 0 0 0 0 0 0 0 0 0 0 0 0 0 0 0 
##$DATE= 1568715461
##$DBL= (0..7)
120 120 120 120 120 120 120 120 
##$DBP= (0..7)
150 150 150 150 150 150 150 150 
##$DBP07= 0
##$DBPNAM0= <>
##$DBPNAM1= <>
##$DBPNAM2= <>
##$DBPNAM3= <>
##$DBPNAM4= <>
##$DBPNAM5= <>
##$DBPNAM6= <>
##$DBPNAM7= <>
##$DBPOAL= (0..7)
0.5 0.5 0.5 0.5 0.5 0.5 0.5 0.5 
##$DBPOFFS= (0..7)
0 0 0 0 0 0 0 0 
##$DE= 6
##$DECBNUC= <off>
##$DECIM= 24
##$DECNUC= <off>
##$DECSTAT= 4
##$DIGMOD= 1
##$DIGTYP= 9
##$DL= (0..7)
0 120 120 120 120 120 120 120 
##$DP= (0..7)
150 150 150 150 150 150 150 150 
##$DP07= 0
##$DPNAME0= <>
##$DPNAME1= <>
##$DPNAME2= <>
##$DPNAME3= <>
##$DPNAME4= <>
##$DPNAME5= <>
##$DPNAME6= <>
##$DPNAME7= <>
##$DPOAL= (0..7)
0.5 0.5 0.5 0.5 0.5 0.5 0.5 0.5 
##$DPOFFS= (0..7)
0 0 0 0 0 0 0 0 
##$DQDMODE= 0
##$DR= 18
##$DS= 0
##$DSLIST= <SSSSSSSSSSSSSSS>
##$DSPFIRM= 0
$$ [...]
##$SUBNAM2= <"">
##$SUBNAM3= <"">
##$SUBNAM4= <"">
##$SUBNAM5= <"">
##$SUBNAM6= <"">
##$SUBNAM7= <"">
##$SUBNAM8= <"">
##$SUBNAM9= <"">
##$SW= 24.0689530833862
##$SWIBOX= (0..15)
0 0 2 0 0 0 0 0 0 0 0 0 0 0 0 0 
##$SW_h= 4816.95568400771
##$TD= 16384
##$TD0= 1
##$TE= 0
##$TE2= 300
##$TE3= 300
##$TEG= 300
##$TL= (0..7)
0 120 120 120 120 120 120 120 
##$TP= (0..7)
150 150 150 150 150 150 150 150 
##$TP07= 0
##$TPNAME0= <>
##$TPNAME1= <>
##$TPNAME2= <>
##$TPNAME3= <>
##$TPNAME4= <>
##$TPNAME5= <>
##$TPNAME6= <>
##$TPNAME7= <>
##$TPOAL= (0..7)
0.5 0.5 0.5 0.5 0.5 0.5 0.5 0.5 
##$TPOFFS= (0..7)
0 0 0 0 0 0 0 0 
##$TUNHIN= 0
##$TUNHOUT= 0
##$TUNXOUT= 0
##$USERA1= <user>
##$USERA2= <user>
##$USERA3= <user>
##$USERA4= <user>
##$USERA5= <user>
##$V9= 5
##$VALIST= <valist>
##$VCLIST= <CCCCCCCCCCCCCCC>
##$VD= 0
##$VDLIST= <DDDDDDDDDDDDDDD>
##$VPLIST= <PPPPPPPPPPPPPPP>
##$VTLIST= <TTTTTTTTTTTTTTT>
##$WBST= 1024
##$WBSW= 4
##$XGAIN= (0..3)
0 0 0 0 
##$XL= 0
##$YL= 0
##$YMAX_a= 433202
##$YMIN_a= -787997
##$ZGOPTNS= <>
##$ZL1= 120
##$ZL2= 120
##$ZL3= 120
##$ZL4= 120
##$ABSF1= 10
##$ABSF2= 0
##$ABSG= 5
##$ABSL= 3
##$ALPHA= 0
##$AQORDER= 0
##$ASSFAC= 0
##$ASSFACI= 0
##$ASSFACX= 0
##$ASSWID= 0
##$AUNMP= <proc_1d>
##$AZFE= 0.1
##$AZFW= 0.1
##$BCFW= 1
##$BC_mod= 2
##$BYTORDP= 1
##$COROFFS= 0
##$CY= 11.3945322036743
##$DATMOD= 1
##$DC= 2
##$DFILT= <>
##$DTYPP= 0
##$F1P= 20.1720416913024
##$F2P= 0.152960286110954
##$FCOR= 0.5
##$FTSIZE= 0
##$FT_mod= 4
##$GAMMA= 1
##$GB= 0.15
##$INTBC= 1
##$INTSCL= 1
##$ISEN= 128
##$LB= 0.24
##$LEV0= 0
##$LPBIN= 0
##$MAXI= 10000
##$MC2= 0
##$MEAN= 0
##$ME_mod= 0
##$MI= 1.114404
##$NCOEF= 0
##$NC_proc= 0
##$NLEV= 6
##$NOISF1= 3.799351
##$NOISF2= 2.8
##$NSP= 1
##$NTH_PI= 0
##$NZP= 0
##$OFFSET= 15.70392
##$PC= 1
##$PHC0= -9577.958
##$PHC1= 19.40096
##$PH_mod= 1
##$PKNL= yes
##$PPARMOD= 0
##$PSCAL= 0
##$PSIGN= 0
##$REVERSE= no
##$SF= 200.130013532006
##$SI= 16384
##$SIGF1= 3
##$SIGF2= 2
##$SINO= 400
##$SIOLD= 16384
##$SREGLST= <1H.CDCl3>
##$SSB= 0
##$STSI= 0
##$STSR= 0
##$SW_p= 3612.71676300578
##$SYMM= 0
##$S_DEV= 0
##$TDeff= 0
##$TDoff= 0
##$TI= <>
##$TILT= no
##$TM1= 0
##$TM2= 0
##$TOPLEV= 0
##$USERP1= <user>
##$USERP2= <user>
##$USERP3= <user>
##$USERP4= <user>
##$USERP5= <user>
##$WDW= 1
##$XDIM= 8192
##$YMAX_p= 0
##$YMIN_p= 0
$$ End of Bruker specific parameters
$$ ---------------------------------
##NTUPLES= NMR FID
##VAR_NAME=  TIME,          FID/REAL,        FID/IMAG
##SYMBOL=    X,             R,               I
##VAR_TYPE=  INDEPENDENT,   DEPENDENT,       DEPENDENT
##VAR_FORM=  AFFN,          ASDF,            ASDF
##VAR_DIM=   8192,          8192,            8192
##UNITS=     SECONDS,       ARBITRARY UNITS, ARBITRARY UNITS
##FACTOR=    0.0002076,     1,               1
##FIRST=     0,             0,               0
##LAST=      1.7004516,     0,               0
##MIN=       0,             -787997,         0
##MAX=       1.7004516,     433202,          0
$$ Real data points
##PAGE= N=1
##DATA TABLE= (X++(R..R)), XYDATA
0@%%%qJ6j6J6k4M0n6P2q8J12j36J60j98K39k86L41m00M70n51O40p41Q54r79J122
27E99j278J448j640J851k082K337k616K925l265L633m037M484m974N513o105O758
43C551p484Q288r186J0196j1340J2646j4153J5917j8014K0552k3697K7724l3089
56a8089M0636n2123P1929j15329L67335k69638o94090O20147L23801l77734j43582
67b46737N62749K3397n89211j65699M90632J54284k17410p110J46477j82248j83910
78b14786J34842J48448q3473L8689J59521r1209k73495J249J86377M6685q814
89D4034R9915m3225k50194q6435K08709J56246j9215j2861l4694j86242j05528
100b29490J92169K18162o0393j52665K732K8790q6643k4542J54343J17927j01622
$$ y = [0, 0, 0, 0, -8, 8, -8, 8, -16, 24, -32, 40, -48, 64, -72, 88, -110, 129, -157, 184, -216, 254, -297, 343, -398, 456, -523, 599, -679, 769, -871, 980, -1102, 1235, -1381, 1544, -1721, 1912, -2125, 2359, -2615, 2898, -3207, 3551, -3933, 4355, -4831, 5365, -5975, 6671, -7482, 8435, -9579, 10973, -12724, 15000, -18089, 22547, -29576, 42353, -72976, 294359, 24721, -669369, -49222, 274579, -103155, -246737, 316012, 339409, -249802, -415501, 75131, 229415, 12005, 4895, 151372, -30876, -214786, -79944, 68504, -14969, 23720, 183241, 92032, -181463, -180214, 6163, 52848, 44034, 143949, 100724, -149470, -235905, -27196, 129050, 109835, 96974, 62280, -123962, -229490, -37321, 180841, 120448, -32217, -29485, -695, -87338, -111880, 42463, 160390, 58768]
111E8768j55088K4003J22738k3427j37816L5472K23243L4396k72031j46541K15651
122b0632J68532j53360q3374K16237N2818l30827j48807L31491K40743k14841
132E7980k03310J21306P5777j37678J1898K06355Q83k04599k7165J24118k3665
143A900o8893J00637O4996j37849n4449J57379K9166j84963j7731K04419K8272
154A22884j83186k6524J27375k7287j01304R9357J36680j03188j58868M7693J01257
165C4889k1038j382O5187o0606j37093N4129J64386k6293j31009M2036R4683r5633
177a7744j02184J31179J32555j29738j51575J05498J52199p2720j37099M0026
187d9603J09240j1556p0770p95L4201n021k3317L702L0785K9030j8057o8593l0399
$$ y = [58768, -96320, -72317, 50421, 26994, -110822, -75350, 147893, 182289, -89742, -236283, -20632, 147900, -5460, -88834, 127403, 180221, -150606, -299413, 32078, 272821, 57980, -145330, -24024, 51753, -85925, -74027, 132328, 133211, -71388, -98553, 25565, 1900, -66993, 33644, 98640, -39209, -93658, 63721, 92887, -92076, -109807, 94612, 122884, -60302, -86826, 40549, 13262, -88042, 11315, 147995, 44807, -114061, -66368, 34889, 13851, 12469, 77656, 17050, -120043, -65914, 98472, 72179, -58830, -16794, 77889, -17744, -119928, 11251, 143806, 14068, -137507, -32009, 120190, 47470, -89629, -49603, 59637, 48081, -22689, -23484, 10717, 5696, -17621, -13919, 16866, 45896, 27839, -40754, -71153]
200g1153P3120Q3513l2002r9848k2171O7065M0511k7568k3193K0864J0008l9983
212b0837k7612N0999O4657l3869r2196r93Q9266K4817p1320k8840N4051K2139
224C0262m0695q140L4389m797l2861R596K8945m226j1437k302k5390j0302O5153
237B8195M8165q0097q8420O3738R9179m6126q3438N2692P1350p4102q4420Q0844
249a2440J09151n4504j14295J2626Q6411J4415m5731j9326J4060J7924P823j7470
261a356k4859J9589L9360k1543n2889K4532O7872k3401q4864R477R4208J8474
273F4600p8797l9623M2845L4577j2986j2073P055l20j2919r568M873K5587K4350
286C7601k1682n3596k845O1799K7136n1342l5508M0403L4934l7109l6653L4615
$$ y = [-71153, 1967, 85480, 53478, -46370, -68541, -1476, 39035, 11467, -11726, 9138, 19146, -20837, -48449, 2550, 67207, 33338, -58858, -59851, 29415, 54232, -17088, -45928, 8123, 30262, -10433, -18573, 15816, 11019, -21842, -12246, 16699, 12473, 1036, -1266, -26656, -36958, 28195, 76360, -3737, -92157, -28419, 70760, 24634, -58804, -6112, 65238, -8864, -93284, -12440, 96711, 42207, -72088, -59462, 26949, 41364, -4367, -23693, -9633, 8291, 16114, -1356, -26215, -6626, 32734, 11191, -41698, -17166, 50706, 27305, -57559, -48082, 46126, 64600, -14197, -53820, -10975, 23602, 10616, -1457, 5598, 5278, -7641, -17209, -12336, 13251, 37601, 15919, -37677, -40522, 21277, 48413, -2929, -38437, 1966, 36900, -209, -36862, -2247]
298b247M2835k7815m9714J8351N6997m814o5005j6641O6583M4466n2054o4029
310e3087K6629O3630q499n3097O215M9865o728n8125p113N9521L1955l9838m7482
323c6154O685M2591J9763k6386l1767J2755L7518m623m4674n310N0286J6897n0344
336a2763k7093M6270L4635m1805m3611L2176N1838j2507n0913r997L6015K1216
348B3461j7880k0846J0109J9732j1416k8828Q256M2999P639m8803k6680M0718
360a539L7538k9088l9093K1391L8742j6080m0708Q215M0625K982l7251j3686L1677
373C725K4072k3184l5587R412M4420J0402m3451l0835L1494M1797j7810m3088
385b8633J0090M6012l651n1605q773N4401K7089m6913m3659L0019N0335j0879
$$ y = [-2247, 40588, 12773, -36941, -18590, 38407, 33593, -31412, -48053, 18530, 62996, 10942, -53087, -26458, 37172, 28673, -24424, -18209, 31656, 24928, -33197, -40310, 19211, 51166, 11328, -36154, -29469, 13122, 32885, 6499, -25268, -12513, 25005, 20382, -24292, -29602, 20684, 37581, -12763, -39856, 6414, 41049, -756, -44367, -12191, 39647, 27140, -23773, -33770, 2245, 23461, 5581, -15265, -5156, 14576, 3160, -25668, -17412, 25587, 33226, -15577, -42257, -1539, 35999, 6911, -32182, -10791, 27951, 11871, -28837, -20622, 20003, 22985, -14266, -27952, 3725, 27797, 4613, -30974, -21562, 22858, 33260, -10191, -41026, -9532, 32265, 14455, -28633, -18543, 27469, 23818, -27787, -36560, 17841, 44930, -1983, -45642, -15623, 34712, 23833]
397B3833m8043k600M3987J3142l9209k3477L1680L0772k1845l4150J3444L6721
409B4255m490l7214o588L4007J7095k5615k4468J3830K5256k900k0836j895J9728
422A0165O322k1187j5297J9148K5393j1461l3300L10L6181J1206l4582k0901L0708
435B705K9800k5438l8067J6469M4507m804m7042p143M7412J9639m5515l4742L7563
448d656M7695k3738n4620P492N5129P316m9776j8372M2704K5512l5736l3789K5294
461i545L8701j1253l8644k537L2939J4397k3245k2352J1004K5005N66k4924j0633
474b0521K1501J9745j6687k6098J1623L1686n585l7106l175M0024J3241l8137
486i489k3424L1785K9085k4332l1325J8537L2815j2655l5635M860L8095O434l5626
$$ y = [23833, -24210, -26810, 17177, 30319, -8890, -32367, -687, 30085, 8240, -25910, -12466, 24255, 19765, -17449, -24037, 9970, 27065, 1450, -23018, -9188, 16068, 13168, -7668, -9563, 10165, 16487, -4700, -19997, -849, 24544, 13083, -20217, -19907, 16274, 27480, -7102, -28003, 2705, 32505, 7067, -31000, -14531, 29976, 25172, -21870, -29013, 18399, 38038, -7477, -42219, -4656, 43039, 19301, -35319, -27827, 27302, 34618, -15158, -33530, 9174, 34686, -1050, -34839, -9545, 29156, 17903, -20741, -23278, 9661, 24058, 813, -21539, -10535, 14470, 15036, -9888, -20521, 980, 20725, 4038, -22060, -10437, 21249, 15664, -21442, -24617, 15407, 28648, -9489, -32913, -1128, 27957, 3625, -27700, -9163, 23652, 10997, -24638, -19778, 18317, 24751, -10875]
499a0875j9077K7351K8691j6223l3429M700L6282N935l7144j7443L4901K9092
511C2761k8768l8060K0040M4067q872m6366k834M4326J5081l7127k5569K4566
523f755K9960j0544k8095k84K4617R908k0097j9351J4351K9023l639l6252j0522
536b7680L6033K3169l0415l0550K5213L4938k0464l8872J5199M1999q120m2225
548b1775N25L9485M899l5554r546L0746J5310k3486j9080J3427J9212m179j5853
561e869j901J3417O768j2929j5138R446K5410N37l1151j4446K9343K5213k3068
574E632l1436J7014L5863j2264m1892M888M6418P554m5331j9321L7936K6003k9525
587A539l0147J9590L2492p556l0541n023K2689J4698j1604j8785J771K0015L713
$$ y = [-10875, -29952, -2601, 26090, 9867, -23562, -18862, 17420, 23355, -13789, -31232, 3669, 32761, 3993, -34067, -14027, 30040, 21168, -25198, -28032, 16294, 31375, -5752, -31321, -6755, 23205, 12661, -15434, -15718, 8899, 18807, -1290, -20641, -6290, 22733, 19094, -17158, -27680, 8353, 31522, 1107, -29443, -4230, 30708, 10244, -28628, -13429, 28570, 20450, -21775, -21250, 18235, 23134, -12420, -21966, 8780, 24090, 604, -18476, -5049, 14163, 9984, -5869, -7770, 5647, 12415, -514, -15652, -6206, 19204, 19741, -11410, -25856, 3487, 28700, 5632, -25804, -8790, 27073, 14809, -27083, -22195, 24223, 31777, -13554, -32875, 5061, 31064, 1539, -28608, -9018, 23474, 15918, -14623, -19646, 3043, 17741, 6137, -12648, -10877, 9138, 12851]
600A2851k4826j1243L0177K3983k8644l5103J9394L8147j0592l3896P222K8993
612A6463q699k8512O921K8847R94k2703p749J1406R240j483q761o123R229J4477
626A3547r197k4358N885L2096J88l5107m381L6732P208m1739j3442M4484K6975
639C8891l7537l8196K2049L9088q143l2617K398K9802L82l1941r851L1878K3314
652B9517k0801l0173N379K6340M764j7610r559J2093J3322n592j8975m469K0356
665D592J6250j5657k2332J1882K4774j2273l0990J0330M0081l82m2028j2092L2707
678D862J6769k0852j1901J6832Q925j8724j4522J4083K2961n28k3069j3562J5555
691c171K0824q898k4181N498K8772j506l3524n151L3698J1620l1472j4994K9247
$$ y = [12851, -11975, -23218, 6959, 30942, 2298, -32805, -13411, 24736, 14144, -19752, -12530, 16463, 7764, -20748, -13827, 15020, 16014, -6689, -14438, -3032, 6208, 4725, -4036, -10159, -930, 13547, 4350, -20008, -14123, 17973, 18161, -16946, -21327, 15405, 22613, -19126, -32568, 11916, 38891, 1354, -36842, -14793, 24295, 16152, -16465, -14067, 15735, 16117, -15824, -25675, 6203, 29517, 8716, -21457, -16078, 10262, 15026, -2584, -12143, -50, 13272, 7680, -11295, -15764, 4592, 20842, 5185, -17147, -5265, 19509, 7236, -23754, -13424, 26657, 26275, -15753, -27845, 4862, 21631, 779, -11122, 5710, 14635, -4089, -18611, -4528, 18433, 17905, -5164, -18726, -3171, 17653, 8755, -15426, -9928, 18844, 17338, -16186, -21337, 12361, 23981, -7491, -22485, 6762]
704F762J9459k6814k7377J8093L2476k334k8219j1021J5782J5103o127j4388K063
717f542J6455J057k1473r481K3524K1708j8238l1417O877L4161M791l1337j3916
730b3831K5360J9144j8558k1460J4165K2640j1480k5924O754L0017J149l0194
742a2218j0544K4894J6960j6762j8377R815J6200n195j3951K513J3091o26j3362
755g562l245J4674J0940j2100k0067K081K3502J1010j7805j7618Q528J6704n553
768C489j4758Q029K0484n685k9287o100L0249K0449k1686k7181J1671K8278n212
781A2740k8948j778L0176J1146k5953j8218J8235J9241j3839j8946J3172K5119
793B2147p445l1523p623K6359K0060j0102j8475j190Q419l92n274N265J2741N46
$$ y = [6762, 26221, -593, -27970, -9877, 22599, 20265, -7954, -18975, -3193, 11910, 5783, -8605, -6542, 9913, 10970, -10503, -19984, 3540, 25248, 7010, -24407, -17530, 16631, 21422, -9915, -23831, 1529, 20673, 2115, -19345, -5180, 17460, 5980, -19944, -13190, 16827, 17976, -12218, -22762, 2132, 19092, 2330, -16047, -6232, 9968, 4773, -9178, -6665, 6426, 5800, -7562, -10807, 3867, 14807, 2707, -17360, -15279, 8223, 19233, 1428, -16190, -7662, 9042, 3489, -11269, -3240, 17244, 11559, -17728, -23828, 6421, 26870, 5184, -21997, -10326, 17952, 12740, -16208, -17986, 12190, 23336, -2617, -20835, -2600, 16641, 2802, -16144, -2972, 22147, 14702, -16821, -24444, 1915, 21975, 11873, -6602, -7792, 627, 235, -5039, 226, 12967, 13513]
807A3513j7980j3881J1201K0197J15j7059l799J3952L025j6006p228J6835J3968
820A6853j0382j4710L796J0043n108j0432O842J8732K587k2808k0413J1618K9435
833A6053N214k3203j1429J5847O750k0498o993L0123J9129k9471l2754J6737L4062
846A9567m617k7520J058K2987R15k1291q176J5304J3292l928j1201l008O301L315
860B998p859n764J2011J6805q311k7193n833K4735J7346j2400j5919N670Q930
873E216r786r986J4087J9882q894k6852k571K3617R977j6840j0063J3878J0683
886A2348j3551j3997R701J5982l077j3512p15J1108K717j1654q645J1100J8487
899A6292k644k4598j0868K0902J9639j1697j8823P988J6275r954k0104R448K6785
$$ y = [13513, -4467, -18348, -7147, 13050, 13165, -3894, -7693, 6259, 9284, -6722, -13950, 2885, 16853, 6471, -8239, -4443, 5600, 492, -9940, -3098, 15634, 18221, -4587, -25000, -13382, 16053, 21267, -1936, -13365, 2482, 9232, -11266, -18259, 11864, 30993, 1522, -31232, -14495, 19567, 14950, -12570, -11512, 11475, 12390, -8901, -17077, -1773, 11519, 7591, -3610, -6618, -317, 2998, -4861, -10625, 1386, 18191, 9880, -17313, -23146, 1589, 18935, 6535, -9384, -3714, 5216, -4570, -14556, -469, 19413, 10519, -16333, -18904, 4713, 14690, -2150, -12213, 1665, 12348, -1203, -15200, -5499, 10483, 7406, -6106, -6821, 4287, 7004, -4650, -13295, -2195, 16292, 13648, -10950, -21818, -916, 18723, 7026, -11797, -3809, 12466, 2512, -17592, -8144, 18641]
912A8641k31k7951j1993J9899J8626q425j7908R46J5965L306j5457q684J4488
925A222J4752j0312j8064N332J9144k664k0083q64K2599O750k1390j4336J4479
938c435J7233o080j3234L026Q958n566j0324N693J4903O42j5250q904Q020J2364
952H046O95r752m491N978N390n665q186N755J2901k951j7178k006J8795O780j9184
967e073j1954J8779J8265j5232k4627O677K6137J858k1637o268J7695O820j7856
980f416j0114J7832J7672j2550k3545K046K2292O899j5074r592R384Q130p667
993g03q965O019J1432j474j2003l460R433O550o116p979L471R706m43j0948m029
1008i509R321Q025n218q442K524P337k977q995L250J3831J331j6969q506J4572
$$ y = [18641, 18410, -9541, -21534, -1635, 16991, 8566, -9342, -8396, 7569, 10875, -4582, -13266, 1222, 15974, 5662, -12402, -7070, 12074, 9410, -10673, -11537, 11062, 17812, -3578, -17914, -3435, 13798, 7718, -5516, -2490, 6468, 902, -9422, -3729, 11174, 11816, -3434, -12338, -4318, 8046, 8741, -1011, -5502, 476, 5866, 201, -7985, -2230, 10671, 7720, -9458, -11464, 7331, 14111, -5073, -17027, 1752, 20017, 4785, -19842, -13165, 12972, 14830, -6807, -13075, 4620, 11440, -6416, -16530, 1302, 18974, 6424, -17121, -15075, 7217, 14116, -958, -10550, -1166, 6964, -703, -9668, -3649, 7783, 6309, -5694, -9154, 279, 6829, 713, -7266, -3795, 5911, 5468, -5480, -9509, -188, 7837, 2619, -5823, -3299, 4038, 1061, -7934, -4684, 9147, 10478, -6491, -14997, -425]
1022d25J4119r292j5433N624J4990m323j6405K418J9093K945j9284r053J6082
1035A056J3963j1380j6407O743J7439q66j7784m922J4951R967j0357j1648O118
1048c127J1645l456j2069J50J2944N359j1138j0868N432J3153J412j1502n388
1061g453Q439O736p234q275P017J1256n142j4012J745J4484K331j3893m853J1972
1075C118P247j0577r576Q083J1407n148j1974K546J2242l76j3273k971J3419P792
1089A1959j1667j2141P076J4380k208j3496j926J1869M142j0682p065Q804J0967
1102A0012m736j3678j368J3419P353j1210j2030P402J4727l155j6173j413J6483
1115E633O175j5318j0147J2980J2245r193j4881O255J5560j462j5197l207J2973
$$ y = [-425, 13694, 4402, -11031, -5407, 9583, 5260, -11145, -8727, 10366, 13311, -5973, -15026, 1056, 15019, 3639, -12768, -6025, 11414, 10548, -7236, -12158, 2793, 12760, 2403, -9245, -3127, 8518, 5062, -7007, -6857, 6087, 11446, 308, -10560, -5128, 8025, 9437, -2065, -7453, 986, 7722, 488, -7787, -770, 10486, 5344, -8668, -6923, 7561, 9892, -4001, -8854, 3118, 10365, -212, -9788, -1705, 9702, 4554, -7420, -4874, 7368, 6992, -6281, -9252, 4167, 11959, 292, -11849, -4773, 9607, 7399, -6097, -8023, 3846, 7988, -2694, -9759, -955, 10012, 5276, -8402, -9770, 3649, 11002, -208, -12238, -4836, 9891, 6736, -9437, -10850, 5633, 11808, -3510, -13657, -677, 11568, 2375, -12506, -6251, 9309, 7847, -7350, -10557, 2416]
1128B416O871r788q345O284R093l675r824J519J0653J316j0345m347Q850O681
1142G359o584q382M479Q983j838r150m96Q526L568p342o290N586Q301k667j0222
1157f169p52J1499N348j1094r593R097J3245o315j5177K494J6499J213j6248n506
1171a1459J5328R636j2657j2554Q413J4426l859j4956m90J3802M573j1097p751
1184h645P776R325m175r936R75R430K523q730n397O390P872l565q709N94Q707
1199D435K009q511m205P820N854o202p912M715Q576k772r138J021R287R75r269
1214c317l617P830O425n736q019L012R201m98j0454k762J1123O425j0480j0409
1228a1276Q821J2664n627j4454K996J4588J38j4464l302J2234O261q504p870M840
$$ y = [2416, 9287, -501, -8846, -2562, 6531, 2856, -6968, -5449, 5204, 6520, -3825, -8172, 678, 7359, 775, -7607, -3128, 5855, 4017, -5133, -5629, 2897, 6465, -877, -7167, -1581, 6720, 4053, -6169, -6921, 4578, 9926, -1168, -10761, -1664, 11581, 5266, -9911, -7417, 9082, 10295, -5953, -11459, 3869, 13505, 848, -11706, -3293, 11133, 7274, -7682, -8172, 5630, 10203, -894, -8645, -869, 8456, 4281, -5655, -4680, 4750, 7273, -1457, -6854, -464, 7408, 3843, -4866, -4272, 4435, 6444, -2067, -6272, 1548, 7402, 1200, -6712, -1997, 6579, 3807, -5331, -4310, 4977, 5952, -3317, -6934, 896, 7321, 1585, -6434, -3422, 5779, 5281, -5173, -7935, 3188, 9613, -867, -11276, -2455, 10209, 4582, -9872, -6876, 7712, 7850, -6614, -9916, 2318, 8579, 75, -7795, -2955]
1242b955P774j249o925k563N451O110l426q650p5R776L938r419o683Q608Q739
1257H451p510j0638N740J2026l179j2356O12J1833J671j1244l126J0259N112q815
1271a164o819O568P996m534q007K974Q218j036q322j506P380M331n260n896K491
1286b586O852K48o982l439P314O785o127r971L563J2044n46j2572k016J2002N042
1301I611j1218p600Q572R914m796j0402N47R300K970p280n675N296Q457k580j0952
1316e836j227J1917M909j1113p854R749R494q129j0907O702J1362m677j1261K030
1330d841J0672l40r280q76P548K195o074l310L578L998q63m114j330K854M029
1345C846k376n557R79P491P40r515l584J0282O559r468r115P489J0881n421j2073
$$ y = [-2955, 4819, 3570, -3355, -5918, -467, 5643, 2217, -6433, -6508, 3268, 7206, -2213, -8896, -288, 8451, 941, -9697, -3957, 8069, 4890, -7466, -6854, 4979, 6650, -4594, -7720, 2539, 7651, -1164, -7983, -1415, 6581, 2047, -5960, -2986, 5232, 4196, -4126, -5632, 1748, 6079, 819, -5077, -2586, 4266, 4514, -2468, -5907, 1407, 8192, 2065, -7906, -4343, 7701, 7155, -5417, -7433, 4569, 9611, -1607, -9207, -635, 9279, 4483, -5919, -5372, 3928, 6898, -382, -6057, -761, 7696, 5116, -5836, -7063, 4854, 9763, -1350, -9204, 545, 10039, 1910, -8997, -2295, 9067, 4390, -6871, -4841, 5831, 5491, -3789, -4665, 2883, 5078, -996, -4306, -728, 3270, 2407, -1707, -3037, -183, 3846, 1470, -4087, -3108, 4383, 5123, -4392, -7976, 2306, 8865, -603, -9718, -2229, 8652, 3231, -8842]
1360h842L073J2895J46j3365l857J1748P722r005r563N557J0091k717j0487Q9
1374f515J0049L311q259o144M853P045j184o265p64N271K698n477n419M025Q714
1389E939r07r233k313P947L264o542l138P105L997p119o089M733P160j192n548
1404a936q16M024J433m310l114M563O677k158r423j277R681L101r064l452J0395
1419D324N342j1704r472R797J2098n059j0855J784Q638j176q220j69Q862L884
1433H074o837p472J774P605K472m984l477L866L292l568o083K126P774K622o974
1448B10n641L288O031j493n995K192P406j063j0341k673J0002O113o701o199M772
1463i2M547n750n090O356P702m242q586M12O413J523m442j293M050K351m043m880
$$ y = [-8842, -5769, 7126, 7272, -6093, -9950, 1798, 9520, 515, -9048, -3491, 6600, 3883, -6604, -6515, 3534, 6845, -1414, -7558, -2705, 4340, 3156, -3109, -3873, 1398, 4096, -1381, -6800, -2775, 5939, 5032, -4201, -6514, 1433, 4697, -1845, -4983, 2122, 6119, -1000, -7089, -2356, 4804, 3612, -1936, -2752, 1272, 2705, -1605, -4719, -156, 6521, 4363, -5060, -6337, 3344, 6445, -2619, -6071, 4324, 9666, -2038, -11510, -1713, 10385, 5326, -5529, -3745, 4893, 3717, -4503, -4672, 4190, 8074, 1237, -6235, -4461, 3144, 5616, 632, -2845, 1021, 4313, 745, -5338, -3212, 4562, 7184, 210, -5431, -2143, 3888, 2395, -3600, -1408, 5998, 4935, -5406, -8079, 1923, 8036, 1335, -4864, -92, 4455, -1295, -6385, -29, 7673, 3431, -5155, -4743, 1670, 3193, -1249, -2542, 1508, 3859, -184, -5064]
1479e064J192O696K449n919m911M700N454m314p246M146J0168j624j1915l024
1493i212J0700N721p349o167N482N826m317p290K412Q249K095p755n527M288P431
1508D587j089p372q20P237K757p705n094P203P042n133p432K980P336j913p245
1523d661J163P351Q48o757l110M672L960j794l582J050K660r84l011J21M048K242
1539D216l533m759J089O148J796n412m171M674N261m138o994M102R594k462j1898
1554f487k50J2738K673j2126n095J1261O965r581q863O643R904k888q580k80O412
1569B446J360m610k849L787N279j927p262k052P206N852m730p152K184N867j333
1584B066n465J394O312m49o355k198M772M005k891l595J155L691n73m265j240
$$ y = [-5064, -3872, 2824, 5273, -646, -5557, -857, 4597, 283, -6963, -2817, 7351, 5727, -6188, -9212, 1488, 7209, -140, -6307, -825, 5001, 684, -6606, -4194, 4055, 6150, -1605, -7132, -2844, 4587, 3498, -3874, -4694, 2543, 5300, -2405, -7499, -296, 6746, 1613, -5819, -2839, 4497, 2584, -4661, -3498, 3853, 4701, -2056, -5166, -494, 3466, 1672, -1910, -860, 1800, 816, -2195, -2074, 1974, 4216, 683, -4076, -2987, 3161, 4957, -455, -4626, 48, 5309, 1171, -5823, -1721, 7873, 5411, -6487, -6737, 6001, 8674, -3452, -8547, 2714, 9679, 98, -8765, -2122, 7782, 4894, -3686, -3966, 2446, 3806, -804, -3653, 134, 5413, 3486, -3776, -5828, 1378, 7230, 2500, -4652, -2468, 3399, 2066, -3399, -2005, 4307, 3858, -2497, -4695, 77, 4082, 1191, -2404, -1249, 2442, 1869, -2396, -3636]
1599c636M347L451l104m628J522M409j293m827J695O683N9q560l773P584O816
1614F745m432p539K273O731k343o953J427Q954R99r007m753O828O442l356o515
1629d499J166N892O47n543l218M388O006j791o559j223N948K280n270l087N858
1644I95N461o204p924L417R372L28p764k029N459J635m901j246N677K817n406
1659c13m757L110N619p87m961j52M226O42m062j676L803L072k278l794R94L623
1675B309m29m106q2M785K375m233n000J252O176K109m504m085K783M032k169n106
1691c893K680P411j149r359k612Q902O064o703p516M438P390k652p728R55Q026
1706D254J517p579l429N574M803m620n369L672O481j927p727l69P011K461m881
$$ y = [-3636, 711, 4162, 1058, -3570, -2048, 2361, 1068, -3759, -2064, 4619, 4678, -3882, -7655, -71, 6745, 2313, -5226, -2953, 3778, 1435, -5518, -4091, 4863, 5862, -3145, -7898, -1070, 5372, 2016, -4499, -3333, 2559, 3206, -2337, -5555, -1167, 4839, 3048, -3511, -4734, 1214, 3494, -1776, -4863, 995, 6456, 252, -7672, -4255, 5117, 5445, -2319, -4348, 1111, 2746, -2155, -3401, 2276, 5093, -313, -5070, -1960, 3659, 2872, -2089, -2241, 1985, 2627, -1435, -3111, 692, 3764, 1486, -2308, -1314, 2309, 1880, -2226, -2308, 2477, 4852, 619, -4381, -3129, 3047, 5156, 652, -3433, -650, 3382, 1213, -3893, -1213, 6198, 5049, -4310, -6922, 1980, 8044, 1341, -6175, -1737, 5653, 3001, -4727, -3772, 4254, 5771, -1808, -5237, 337, 5140, 520, -4849, -1177, 5304, 3377, -4350, -4719, 2292, 4753, -128]
1721a28k904L099J596l059j636L509L126k324m116m54L384K561j473l091j76L073
1737I87O07l381j471M225L001m195m838K809O486j946o874L02P799J871p915n057
1753g590O642P169l557p738R98P276pp070j258P870L876p577o544M538P995r91
1769D032p184j245N757K107m684k680L980L944k645m707N88M485J368m023k145
1784c052L379L416k566m718J020N079J017m157k104L016K253l168k211L640M096
1799D940l031o025O36O484J817n187l282M006L774l702m418L186O072k134o762
1814c626n38O841K493n648m109M243N492k596o408L29O232K073m853l902L701
1829b76L869j908m764Q92N661R23o028l635M669N458k117o315K78N809O99n515
$$ y = [-128, -3032, 67, 1663, -1396, -3032, 477, 3603, 1279, -2837, -3291, 93, 2654, 1181, -1910, -2086, 987, 1594, -1787, -3258, 967, 3968, -227, -5065, -2256, 4230, 2284, -4590, -4288, 3511, 5382, -2533, -7590, -948, 6221, 2664, -5074, -4076, 3200, 3193, -3877, -5135, 2735, 6611, -966, -7510, -2972, 5023, 4032, -3152, -4397, 1360, 3467, -1217, -3897, 83, 4027, 1382, -3325, -2737, 1748, 3116, -907, -3052, 327, 3743, 1177, -3541, -2521, 2558, 3575, -582, -2686, 330, 2583, -585, -2796, 844, 4940, 1909, -4116, -3480, 3004, 4821, -366, -3648, 358, 4132, 430, -3988, -802, 5270, 3136, -3626, -4164, 2677, 5170, -478, -4587, -344, 5148, 2552, -3856, -3527, 2705, 4778, -75, -3977, -276, 3593, 1685, -3079, -2187, 3474, 4397, -1631, -5266, -597, 4861, 2744, -3571, -3293, 2516, 3215, -2300]
1845b300j141N623K069n397l577M021M549k722m835K038M297n55m588k65L747
1860I64J570l124k058K031K096j068k923O92L886N06m213k844L449M458j445n105
1876c128L23M443Q21m537j856M896L292m072n305K278O029O0n939j706N543L409
1892D551m764m827L020O165j089o144j173N941K287n057l536M861N055l573o601
1907d884J707O502M40n697j224M864J280m191j965M074K532k990k891J237L076
1922A870k10k318l79J728J423j046k638k8L345J130l218k231K964L490l253m552
1938c923K552O184q53p296j211O826L025o185m064N328N559m685o477K778P095
1953D653o24o665j386N689K704m348m047K711M778m64m413k152L904L132k735
$$ y = [-2300, -3441, 2182, 4251, -1146, -4723, -702, 3847, 1125, -3710, -1672, 2625, 2070, -2518, -2783, 964, 2534, -590, -2648, -617, 1479, 411, -2512, -1820, 2066, 2572, -1641, -4485, -1036, 3422, 1977, -3128, -2805, 1638, 2459, -2078, -3934, 962, 4254, 182, -5123, -2845, 3184, 3244, -2695, -4401, 1142, 4551, -213, -5040, -2020, 4145, 3056, -3088, -4261, 1680, 3967, -1090, -4626, 235, 5290, 1717, -4884, -3177, 3325, 3765, -1932, -3156, 1708, 2988, -1203, -3168, 906, 3438, 448, -2443, -1206, 1870, 1660, -658, -1037, 691, 2114, 1068, -1570, -1598, 1747, 2877, -341, -2572, 392, 3882, 629, -3923, -1371, 4813, 3960, -3336, -4547, 2279, 5304, -881, -4945, 383, 5942, 1257, -5220, -2442, 4653, 4029, -2636, -4022, 1667, 4371, 23, -4024, -1313, 3465, 3001, -1412, -3564, 340, 3472, 737]
1968G37l732J503M623n28n329j041N243K756m715l349L070L844k179m017J159
1983a955M226k7m013j042L210J985k844k408J932L637j154m211m91M279J832l819
1999h63k906L470L865k845n276J804O475k87o668j459O105K942n805l775M689
2014e34N156l173n651J211N260L30l872j421K627K492j473l512m35M182K853l156
2030H84m622J597N574r40n306k80O099J454o443l030N699M060m304m002L366M104
2046C910k914m737J999N016m19l952o41K571P37k110q59K066J764r06k912r09
2062b296K757K571j651k926P73L437q50m652J32N673J894n868l322M297M356l481
2078H44m510K825N056j407n847q22N129L018l174l733J496L488l99m430q04N248
$$ y = [737, -2995, -1492, 3131, 2603, -2726, -3767, 1476, 4232, -483, -3832, -762, 3082, 903, -3114, -1955, 2271, 2244, -1769, -2811, 399, 2384, -460, -2868, -936, 2701, 1547, -2664, -3155, 1124, 2956, -863, -3769, -299, 3566, 721, -4555, -2751, 3724, 3437, -3231, -4690, 1415, 4357, -1448, -5223, -534, 4622, 1449, -4202, -2991, 2269, 2599, -1273, -2694, -67, 2425, 952, -2560, -2995, 1187, 4040, 884, -3738, -2141, 3433, 2493, -2813, -3093, 3006, 4460, -1983, -5013, 686, 4746, 442, -3560, -194, 3910, 996, -3741, -1742, 3274, 2855, -1097, -1738, 833, 1570, -540, -1399, 667, 2431, 1525, -1387, -2296, 461, 3032, 1381, -1545, -772, 2665, 1815, -2837, -2705, 2968, 4862, -1006, -4328, -31, 4325, 844, -3666, -841, 4215, 2808, -3039, -3861, 1268, 4286, 1112, -2621, -1125, 2363, 1964, -2466, -3270, 1978]
2094A978K685m567m964L006N509j480n135O35N252P1n854j080M901K435l536k606
2110b750K170K332j903k363J455K496M0k138j579J091K148k72j671m13K027N80
2126A250k663j870K935L674k128m851Q66N226K69n175j367N739K585n593m220
2141e323M493N550l391n723K030N827l99n911j104N152K720l656l796J820M027
2156B316N1l759j538L509K870k714l956J657M542l56m743j074M700K124l454l196
2172c021K572L173j170l419M83L260M76l068j818K828K878j945l511R46L960k33
2188B391m158p42M546J794m289l029L545L446k568m026K147M597j105n256o61
2203c368M929K697l663l766K172L669j108l924J82M290J482l948l412K305M690
$$ y = [1978, 4663, 96, -4868, -1862, 3647, 2167, -2968, -2333, 2919, 2990, -2864, -3944, 957, 3392, -144, -2750, -580, 1752, -151, -2514, -1059, 1437, 1477, -661, -2240, -1149, 999, 727, -944, -1357, 670, 1250, -1413, -3283, -348, 3326, 1198, -3653, -2787, 2439, 2708, -2467, -3834, 1905, 4490, -1103, -5323, -830, 4720, 1329, -4394, -2364, 3463, 3064, -2847, -3951, 1201, 3921, 265, -3531, -1711, 2316, 2367, -1392, -2930, 579, 3449, 735, -3221, -1564, 2978, 2622, -2121, -3195, 1505, 3629, 175, -3021, -449, 2724, 1554, -1865, -1382, 1878, 2354, -714, -2532, 296, 3174, 1229, -2282, -1336, 2624, 2391, -1767, -2509, 2037, 3831, -458, -3487, 58, 3504, 936, -3090, -943, 3654, 2549, -2707, -3368, 1561, 4258, 595, -3171, -999, 2670, 1562, -2362, -2180, 2110, 3592, -356, -3768, -1463, 3227]
2218C227o87m548j052M300J972l849l516L243M849j571n331k95M542J473m122
2233a365j906L857L022l367m578K016M986J35m551j371L694J258l228j599L533
2248E36K581k999l439J717L346l74k973j22K746Q06k917j741K268K527n63k822
2264a423p34K752J159k810j655K736L341k129m619K67M875J694l948k684L069
2279a09L225k799l854K004N169m90n496j403M589L055l626l555K542M010j379
2294A883m346Q9M329J343l588k140K258K829k061k504J218L153q3l671j220L028
2310E17K327j997k218R15K053q00k387Q99L042j42k931k010K970K728j759l380
2326b173J318L253l38l884o77L994K006l469l290K614L725j492m289L98M917P44
$$ y = [3227, 2540, -2008, -3060, 1240, 3212, -637, -4153, -910, 3939, 2368, -2963, -3258, 1284, 2757, -1365, -3271, 586, 3608, 241, -4337, -2321, 2665, 2800, -1751, -3122, 572, 1830, -1398, -2997, 536, 3117, 118, -3321, -1604, 1742, 1368, -1605, -1727, 1019, 1825, -1092, -2833, -565, 1962, 1399, -1423, -2157, 595, 1754, -1056, -2711, 25, 3366, 1237, -3382, -3115, 1760, 3454, -494, -3178, -109, 3116, 317, -3537, -1533, 3636, 3146, -2350, -3753, 836, 3891, 265, -3290, -748, 3262, 1883, -2463, -2374, 1955, 3298, -290, -2430, -172, 2657, 596, -1908, -690, 2463, 2380, -1291, -2511, 517, 2844, 847, -1371, -456, 1597, 797, -1590, -691, 2351, 2209, -722, -2732, 238, 2966, 1207, -2173, -855, 2398, 2060, -1824, -2501, 1493, 3499, 30, -3260, -646, 3079, 1587, -2702, -2304, 2613, 3357]
2342C357m925k462L787L928k090m355P45L865Q2l600o25L513J879l058l188R79
2358b168L943Q82l309k213K459K823k153l085J052M082j19m433j016L977J958
2373B680l467k475L243L018k488m125J482M458j32l847q81L455Q28l162j421L278
2389D44K690k594l787R15M257O41l686j623L025K367k883k656K028L424m76m015
2405a929r03L557J875k600k596J883L488p69m052j133M062K996l046l543J412
2420a298L784n36m140j57M743J412m803l031L667M135k009m179R34L680J30l540
2436a208r51L551J560k926k453K148K877j567l010J101K951k37k949j260L040
2451F67J872j904k011Q66K105q55k236K21K766J152k921k636J799L663l08l997
$$ y = [3357, -1568, -4030, -243, 3685, 1595, -2760, -2015, 1850, 1932, -1668, -2293, 1220, 3099, 41, -3147, -2168, 1775, 2657, -652, -2865, -406, 2417, 264, -2821, -1769, 2313, 2194, -2239, -3255, 722, 2680, -787, -3262, -19, 2999, 511, -3614, -2132, 2326, 2194, -1653, -2534, 921, 1749, -1413, -2834, 444, 3134, 540, -3247, -2332, 1925, 2566, -1120, -2743, 282, 2649, -234, -2890, -862, 2562, 2086, -1929, -2832, 725, 2600, 0, -2596, -713, 2775, 2006, -2046, -3179, 883, 3879, 833, -2710, -1298, 2486, 1950, -2190, -2347, 2396, 3808, -995, -4026, -359, 3776, 1767, -2412, -1478, 2202, 2332, -1208, -2159, 1392, 2952, 26, -2427, -279, 2598, 1031, -1979, -878, 2073, 1836, -1113, -2373, 667, 2539, 635, -1376, -510, 1595, 740, -1496, -1275, 1491, 2643, -278, -2914, -1115, 2548, 2240, -1757]
2467a757p07L694J663l795k377L235L536k442m106Q83M508K50m465j276L825K679
2483C348l110l780K055L872j22m032o94K840J536k399k338K341K959j521l741
2498b786N84L323R15k640j603J810J725j277j629P75K027l33k429m83K342J363
2514A684j990j868J485K771j185l094oL512J064l420j645L276K210l082k927K733
2530d82L852j596m633P3M474J407l517k278K563K490j346l227P00L419N89l204
2546g16j960K662K662j254l516N27L663P75l420k153K814K875j822k904P53K950
2562A936l2l031o69L069J499k811k666K146K949q91k816K6K992L10k798j227K703
2579F89J944k362k672J784L068j057l452J97L656P38l431j909K924K636k485k429
$$ y = [-1757, -2464, 1230, 2893, -902, -3279, -44, 3492, 1050, -3056, -2173, 2335, 2585, -1880, -3156, 669, 3348, 238, -3542, -1487, 2385, 2263, -1769, -2463, 377, 1913, -486, -2824, -483, 2476, 955, -2786, -2202, 1121, 2036, -604, -2207, -397, 1328, 51, -1578, -803, 1224, 891, -1538, -2021, 321, 1684, -306, -2174, -689, 2082, 897, -2197, -2203, 1309, 2373, -1047, -2692, 584, 2794, -288, -3215, -482, 3370, 1774, -2859, -2786, 1688, 3095, -422, -2700, -137, 2353, 1007, -2220, -1520, 1899, 2488, -716, -2676, -14, 2648, 1394, -2122, -1595, 2068, 2843, -577, -2730, 84, 2959, 1137, -1767, -1014, 1936, 1904, -1127, -1796, 1273, 2772, -39, -2705, -559, 2390, 1499, -1317, -1291, 1701, 2011, -787, -2014, 689, 2633, 271, -2401, -617, 2451, 1394, -2058, -1861, 1795, 2533, -898, -2807, 117, 2753, 268, -2161]
2595b161J289L088o40l346o07L095J806k314k566J109K750L23l016j248K643K517
2611B722k484l292J308L870J47m151j203L850K357l528l296K725M081j627m270
2626b791M64M111K40l741q82L272J635k574k178J596K485o75k593J14J996R14
2642A393j780j212J085J977o86k250R3K618L46k712r99K622K132k229l080J629
2658a053L204p67l280o3L141J328l012k057K166L306j519l318J3L726Q33l552
2674i04j658K647L032j694l736O36L498N94l365j516L154K493k722l087J649L543
2690B564l15l616m70K973Q65k305j363J785J652r42j826J77J604N02j474q37J215
2707A89J538r17k327L11K664N50k819j099K609J611k704k250K587L163k297l805
$$ y = [-2161, -872, 2216, 1576, -1770, -2377, 718, 2524, 210, -2356, -1247, 1503, 1826, -1190, -2438, 205, 2722, 238, -3054, -1746, 2124, 2271, -1880, -3083, 767, 3124, -404, -3700, -975, 3106, 1479, -2791, -2327, 1784, 2024, -1717, -2599, 673, 2308, -266, -2444, -848, 1637, 962, -1631, -1517, 479, 1393, -387, -1599, -514, 1463, 777, -1473, -1380, 1238, 1584, -1128, -2127, 495, 2627, 398, -2682, -1053, 2151, 1384, -1896, -1959, 1182, 2510, -502, -2559, -393, 2913, 1394, -1924, -1911, 1815, 2648, -904, -2562, 85, 3117, 1423, -2313, -1677, 1821, 2415, -950, -2466, 688, 3181, 459, -2628, -979, 2564, 2249, -1367, -1837, 1136, 2001, -304, -1667, 118, 1770, 828, -998, -821, 783, 1285, -189, -1026, 189, 1727, 810, -1517, -1206, 1458, 2008, -811, -1910, 699, 2310, -394, -2644, -57, 3106, 809, -2996]
2723b996J333M024m42l987n12M050J195l431k281K863K790k059k519O40K565K74
2739A507k315j216J275K260l72k624p35K586J722k066k444J303L254q74l851P7
2755b513M246P14m063j171L218J972k736k141J815K340r28k064n0J889O21j413
2771b64j276J312J645p41k341j55L096O53k913j556L066J951k824k411K577K859
2787B678j619l624J358L336M2l570q04L325J513k370k310J331K500j75k331q89
2803a609K169J642j340k534J76L225Q69l317j805K787K963k387l552J626L999
2818B912p44m135l23M166Q91l400j569K814J893k298j945J354K161p17j770n17
2834a227J636O47o74j503N73J704J6j797r29J826J840j965k361J721K775j395
$$ y = [-2996, -1663, 2361, 1919, -2068, -2580, 1470, 2665, -766, -3047, -184, 2606, 547, -1972, -1332, 1233, 1507, -808, -2024, -749, 1511, 1139, -1485, -2220, 366, 2088, 22, -2422, -1119, 2135, 1261, -2590, -2513, 1733, 2447, -1616, -2787, 431, 2403, -333, -2474, -659, 1681, 753, -1311, -1361, 528, 1149, -264, -1540, -228, 1417, 676, -1665, -1820, 1276, 1929, -984, -2540, 526, 2477, -347, -2758, -181, 2678, 1059, -2565, -1207, 2129, 2171, -1399, -2203, 1122, 2635, 265, -2045, -714, 1786, 1611, -720, -1609, 560, 2202, 862, -1672, -1496, 1729, 2598, -719, -2524, 263, 3226, 839, -2713, -1087, 2912, 2168, -1967, -2290, 1876, 2767, -633, -2202, 612, 2505, 207, -1738, -384, 1777, 1060, -710, -1227, 409, 1056, 382, -1121, -548, 1156, 1172, -625, -1554, 272, 2112, 147, -2214, -493, 2282, 887]
2850H87l489J129L560Ql816q39L521J486l194k005K750K547j859l012O40K889
2866A203N68k273j672J474K238p48k818m0L157J201l059k057K203L022j883k890
2882b374Q94L185j96l146m39K534J380j909j577Q13J765k61j828l11J893J032
2898A455j285j820R63J951k48k084l54K391P28k316j452K400J858j743k672J479
2914g49K995j040l295O91L414J04l342j063L364J308k581j870J943K266j147k218
2930a220j49K008J257j592j600O76K025J12k265r26K190J918k020k464J298K908
2946B156n85l104q6K976P23k482j546K011J946j170j974L46J801K11k053p44J881
2963C07J310j477j773R85K066l70k360J52K028P27k231r94J901J418j720j687
$$ y = [887, -2602, -1473, 2087, 2095, -1721, -2560, 961, 2447, -747, -2752, -2, 2545, 686, -2326, -1686, 1203, 1771, -502, -2174, -700, 1538, 790, -2028, -2068, 1089, 2290, -769, -2826, -623, 2399, 516, -2374, -1480, 1705, 1509, -1637, -2076, 458, 1838, -71, -1648, -835, 930, 669, -1159, -1470, 423, 1455, 170, -1650, -687, 1264, 1016, -1068, -1422, 969, 1697, -619, -2071, 329, 2187, 444, -2228, -749, 2246, 1206, -2089, -1398, 2016, 2120, -1222, -2285, 1079, 2387, -194, -2064, -121, 2145, 998, -1220, -1369, 639, 1896, 304, -1296, -620, 1405, 1517, -748, -1674, 516, 2434, 414, -2050, -752, 2156, 1571, -1533, -1619, 1357, 2080, -402, -1948, 63, 2009, 839, -1135, -789, 1012, 1223, -830, -1574, 307, 1617, 140, -1633, -648, 1418, 1048, -1312, -1160, 868, 1595, -636, -1630, 271, 1689, -31, -1718]
2979a718J484K085j156k334L2K565P10k196j486J600J779r86j943R9K535M70k313
2996g73j530J719K502j259k545oL104N28k754j515K467K460j831l027R48L002
3012A490K9l038l48K756J183k691j804J826K599j181k188J46J901O66j922o88
3028a264J561R81q67j787M65J811K02j738m65J660P80j340j513J117K009m66k315
3045a169k01K308O47k357r28K229J727j776k562R87L215k81k895q26K681J583
3061B382k439j869J733K576j007k918o3K903R72k477j744J983K186j155k497K52
3077a182K511P84k516j213J809J332j083j725O40J901R3j826j054J494J497r84
3093D78j660L61J803j83j694j11J535Q12j681j493J496J925j126j944N87K097
$$ y = [-1718, -234, 1851, 695, -1639, -1607, 958, 1668, -528, -2014, -414, 1365, 379, -1564, -1465, 1070, 1540, -773, -2303, -584, 1918, 659, -1886, -1892, 1212, 1740, -1014, -2529, -62, 2398, 567, -2460, -1512, 1490, 1519, -1519, -1867, 889, 2072, -619, -2423, -597, 2002, 821, -1367, -1221, 680, 1346, -576, -1264, 297, 1278, 411, -1376, -911, 900, 1102, -636, -1101, 559, 1339, -1, -1514, -397, 1612, 1146, -1169, -1370, 938, 1585, -772, -1700, 529, 2256, 480, -2082, -1095, 2120, 1839, -1056, -1882, 799, 2382, -57, -1926, -193, 2383, 1376, -1542, -1605, 1298, 2270, -207, -1951, 32, 2218, 1063, -1434, -1182, 1329, 2113, -403, -1616, 193, 1525, 442, -1283, -643, 1258, 1351, -475, -1529, -35, 1462, 478, -1182, -821, 982, 799, -895, -1006, 529, 1341, -340, -1833, -337, 1588, 462, -1482, -895, 1202]
3109A202l41k316r6K227P81j855j352J740J521j323j885N94K499j55k539m52J660
3126i0J691j594j668P11J897L20k274q93K203J387j554k028Q03K367J83k502q26
3143a867K303J150j534k087J224K088k74k377K4K255L90j897r65J762J371j282
3159B84j453M64J725R0j699m72J570O76j344p42Q21J448j062j249M32J647K7j769
3177f06m81J579J111j380j253P02J555l42j529k19J801R09j831j595J159K414
3193A994o36k637k21K388J208k175j815J891K280j309k693O23K857J19k708p19
3209a553K253J107j762j583J049K076k43k154j86J317P35j349n72R72R47o35j149
3226g30k10J250O18r47j063P89J205o51j382N56J410J01j922l15J507R02j649
$$ y = [1202, 861, -1455, -1551, 676, 1457, -398, -1750, -10, 1511, 188, -1697, -1103, 1396, 1241, -1298, -1750, -90, 1601, 7, -1661, -950, 947, 1267, -1007, -1900, 303, 1690, 136, -1892, -1089, 1278, 1461, -1041, -1867, 436, 1586, 52, -2035, -811, 1277, 1003, -1374, -1350, 905, 1295, -602, -1567, 195, 1566, 284, -1169, -705, 1020, 1110, -589, -1061, 509, 1185, -159, -901, -80, 1368, 306, -943, -511, 1136, 1163, -606, -1087, 492, 1603, 223, -1030, -328, 1227, 885, -644, -863, 938, 1847, 16, -1579, -420, 1994, 1358, -1279, -1500, 888, 2096, -79, -1894, -3, 2277, 968, -1725, -1102, 1755, 1874, -834, -1553, 700, 1807, 45, -1538, -489, 1587, 1344, -810, -996, 321, 1056, -293, -865, 107, 1054, 419, -730, -940, 310, 928, -19, -1082, -293, 912, 261, -1121, -565, 845, 946, -976, -1291, 216, 1118, -531]
3243e31j146J596J796j258k389M28K426M57k335q03J852J288j698j753J301K400
3259A631l27k446q21K052J602j730j894R94K582p93k383N9K269R00j933j489J435
3276b92J602j131j571N72J874L41j635j156J086J232j54j233j17J071N78j490
3292d23p98J304J527r22j866L37J923q3k094J27K481J45k325q32K111Q93j640
3309a35r77J509J286j434j688R86J752n1j119q08O07Q92k77r89j87J224J192j941
3327a58j831J531K257m61k463j97K514M66k618q77K296J516j449k058P83J741
3343I92m11j341J03J523L22j401j130Q85J250p0r14m31P51K77n79j031R04J449
3361A148n28j728Q6J587j32j394J02K002Q5k029p03J367R51q33r26P30R48q22
$$ y = [-531, -1677, -81, 1715, 457, -1932, -1504, 922, 1379, -956, -1759, 93, 1381, -317, -2070, -769, 1631, 1304, -1142, -1963, 89, 1691, -39, -1933, -939, 1643, 850, -1533, -1474, 795, 1695, -238, -1727, -292, 1310, 179, -1392, -820, 1054, 1395, -240, -1396, -310, 922, 768, -465, -582, 489, 1067, -423, -1221, 83, 1610, 688, -1178, -841, 1082, 999, -1095, -968, 1513, 1658, -667, -1499, 612, 1505, -135, -1112, 397, 1683, 249, -1439, -453, 1299, 1248, 129, -679, -72, 820, 543, -446, -633, 591, 1783, -158, -1989, -458, 1799, 1338, -1125, -1322, 1192, 1658, -960, -1837, 459, 1975, 526, -1532, -749, 992, 581, -760, -657, 866, 1188, -213, -1343, -458, 792, 722, -192, -623, 128, 405, -174, -1205, -301, 1148, 620, -1108, -1022, 565, 433, -961, -859, 1143, 1228, -801, -1504, -137, 814, -19, -945, -215, 733, -89]
3379h9r43J84J047N66o62r61j52J107Q15j180j110J277J630j362k187O89K849
3396A518k63k734o1K575O99k740j144K581J697j765j811Q61J515n97j256N99P91
3413D65J83p96m14QQ40M74m47r61M17J119m03j305K73J925k65j861l75K028L56
3432A261j673o11K137M66k013j124J599J438r80j226O52R68j83j239k77J162Q81
3449A238p24j340K0J485O43j418j084J385J727j394k390P32K642M1k196o94K029
3466G02P89j804r56J263J482r24j642k3J417O33p42q20M13Q44j95j096l97J160
3484A04J051r95j490J033J102l78j766L01K042j96j695m31J766O53j832n48J670
3501C91O86j605j319J610J230o33j253O0J263j97p27j50K79Q70k66n84q61Q42
$$ y = [-89, -1032, -848, 199, 765, 103, -858, -1010, 97, 912, -268, -1378, -101, 1529, 167, -2020, -1331, 1518, 1255, -1479, -1540, 1035, 1734, -1006, -2150, 431, 2128, 363, -1448, -587, 928, 331, -925, -326, 465, 648, -148, -562, -554, 286, 760, 313, -648, -231, 888, 485, -820, -547, 1378, 1113, -748, -1123, 905, 1261, -412, -1023, 1114, 1580, -433, -1557, 42, 1480, 500, -726, -74, 894, 711, -528, -805, 357, 1238, 514, -826, -806, 679, 1322, -96, -1180, 205, 1932, 538, -1852, -1120, 1522, 1563, -633, -1327, 702, 1491, -313, -1269, -6, 1476, 552, -1090, -1113, 304, 937, 195, -625, -212, 632, 437, -659, -1056, 104, 1155, 160, -1330, -297, 805, 427, -1339, -1038, 1004, 808, -887, -1318, 448, 1101, -731, -1279, 391, 1077, -528, -1847, -237, 993, 360, -893, -833, 430, 233, -494, -644, -365, 505, 239, -345, -1206, -364]
3519c64J189l30j739L82J920l7k086o56K470J237k134j743J515J924j170j757
3535a379P30K000l21j901j84J614M66q80o93K42Q01N8q36m08P33Q82n19r73K73
3554b95R46J58j168j20J247K72j460n32J281O13r57q72R80R13r81p65O31Q16j62
3573E45q15q3N10O67l28p23k64Q62M65q85q51Q71J350p03j824M93K008j8k098
3592h21o46J794J250j502j589J252J686p81j663J37J739j08j189l53J046M27r50
3609b71k10O5N54J85l19p27K52O48K02p96k71J172q0r40l11J018M89p16j168R56
3629b68J063o46j304O75J195m43r38j04J199k7q91m48J009O62o04r74P3R89O24
3648H42r51j115R25J200l98j363Q3J466L12j621n52J281J149j037j187M50J482
$$ y = [-364, 825, 495, -1244, -862, 1058, 1021, -1065, -1721, 749, 1986, -148, -1891, -376, 1548, 378, -1379, -649, 1351, 1030, -871, -1055, 559, 1025, 145, -548, -306, 495, 553, -283, -691, 42, 924, 405, -568, -295, 651, 809, -359, -479, 768, 1040, -420, -952, 329, 942, -15, -887, 93, 1006, 25, -740, -109, 707, 545, -270, -353, 157, 824, 496, -227, -491, 371, 836, -49, -900, -29, 1321, 618, -1206, -713, 1295, 1277, -821, -1467, 327, 1577, 75, -1514, -262, 1424, 643, -1020, -883, 856, 748, -441, -794, 252, 679, -271, -481, -416, 138, 323, 4, -723, -471, 177, 379, -417, -688, 484, 404, -536, -847, 171, 660, -56, -1224, -268, 795, 149, -1155, -480, 715, 272, -666, -770, 429, 402, -489, -937, 72, 734, 130, -844, -771, 218, 842, -109, -1224, -299, 901, 503, -860, -777, 689, 1001, -620, -1172, 109, 1258, 221, -966, -516, 966]
3665I66j96j164m33R37R09p11j064K66J429q9j170l43J009N77p88r53O45R72r3
3684G06j261M4J002L70j017l75J167K05r50m33O50R72n55j120L50R13p6q85k79
3703e72P86N44m77p13O3R45O8p95k60P50L87l48j327L96J393K41j314j001J271
3722C7J192r84j356O25J619m40j821O5J496Q25j494r46Q34J245n39j134P9J029
3740C32K94j096l57O85Q64o13q39L94Q56m35q28K12N29M57n42l94J67M14o7l52
3760c19K38L54o0q53J97O26L48m73o99L13P97j85q14l4Q41M68j057o11N59J203
3780H39o24j181L39J417J70j380m88R60J155r05j102L85R72Q2j050j99J001N14
3798I05r52p04N83Q99m1q28j18M62L37l27p43L35O91Qo59J97M17L6l46o06O69
$$ y = [966, 770, -394, -827, 110, 1019, 308, -756, -490, 939, 850, -320, -663, 346, 923, 135, -818, -173, 799, 706, -555, -511, 491, 861, -156, -531, 636, 841, -109, -542, 108, 1080, 525, -595, -245, 668, 592, -293, -572, 214, 758, 281, -432, -369, 576, 644, -151, -411, 339, 726, 378, -949, -553, 840, 1081, -233, -1234, 37, 1229, 245, -1111, -486, 1133, 693, -1128, -1063, 433, 1258, -236, -1182, -348, 897, 358, -776, -697, 332, 626, -470, -827, -142, 722, 109, -730, -336, 520, 85, -743, -531, -2, 455, -87, -481, -314, 100, 33, -319, -81, 273, 213, -640, -443, 183, 531, 58, -641, -328, 469, 284, -530, -564, 277, 745, -312, -923, -364, 839, 215, -966, -627, 790, 960, -420, -908, 52, 1207, 302, -800, -415, 557, 639, -411, -610, 391, 905, -47, -751, -168, 731, 690, -138, -256, 206, 543, 216, -527, -192, 499, 507, -152, 45, 462, 498, 152, -454, 215]
3819B15N55n54p13L00P08J00p66j95P26K09o16l85O05O81r40p55N54J132k38j001
3839c78k06J016K40q31n28Q20P16o26q73J36J132J58j058o67P96Q13k78j089J12
3858e95Q05K80m89o65M08O17j03o88k6Q53r1o65o58Q23R22m82r68P2Q83L0o64
3879d01l16O50M08o68o86P20P81m70o62L19P32j12j110K98O07M12q51k37N14K47
3899A75j33n17M50O46m36m80k43N82O58m34o16k56R67L57r27n08P70P12n95j246
3919a074M46J496P6j260n05J545K18j254l82P71O72j38r71J96N41r8k51o8J48
3938A08M73m12l78k08P90L60k31p30l2O07l2m59J52O74r1q01k66Q13M74r84k46
3959d19Q09K06n55m28J52P62k89k75L0J55R3m40m49M61Q93j39j225k34J024Q33
$$ y = [215, 770, 216, -497, -197, 511, 611, -155, -350, 376, 585, -31, -416, 189, 870, -70, -825, -271, 861, 623, -378, -584, 432, 672, -159, -687, 133, 849, 223, -650, -514, 618, 776, -282, -949, -153, 660, 382, -707, -595, 210, 490, 1, -664, -256, 361, 258, -430, -456, 397, 306, -359, -1017, -194, 728, 246, -722, -650, 233, 263, -401, -717, -67, 341, -327, -1013, -293, 488, 18, -644, -325, 407, 295, -815, -517, 90, 502, -349, -586, -72, 175, 42, -475, -25, 621, 185, -295, -538, 44, 702, 268, -348, -604, 363, 720, -207, -715, 55, 767, 172, -1074, -628, 868, 944, -316, -821, 724, 942, -312, -694, 77, 749, 611, -360, -164, 377, 279, 28, -40, 108, 581, 169, -209, -417, 373, 733, 502, -228, -260, 347, 315, -144, 8, 682, 591, -210, -476, 337, 811, -173, -419, 390, 596, 41, -387, -235, 527, 238, -37, -7, 148, 241, -199, -648, -187, 706, 567, -658, -892, 132, 965]
3979I65r54p88N26J012m98j325L84J507j42j335Q7P62J58m83m36M75L69k32j20
3998f8l02k03M36L67op01K44M98k47o68K08R49qj222o1J022L0r82J19R44kp42
4020c95o3P62o9q22q2J260r7q46l45O45M56l07j52j27J75m0P0k48M8O74M9m54
4042I2r22P88Q18n99q49L04J375m86j366K00J125K80q87j20P74m4q02k14P41L67
4062E75p7k70o23m6M76N88k10p67L50P36o03p83N63R67k50j191L67Q32m47q99
4082g12O06J200m95j126R9Q44l10n78N67M60k64p93L9L49K59J45K18o34k67J38
4102b55M97l10l90P39L95o01j069N18J169j98j404M15J375m50j404j07J376O35
4120I31j120n30O37O7l38o7O75J70j85l95k72j72N08M79l7q62qQ16k45o07J80
$$ y = [965, 11, -777, -251, 761, 263, -1062, -678, 829, 687, -648, -561, 201, 359, -124, -560, -85, 284, 52, -68, -370, -573, -137, 230, 224, -477, -233, 265, 18, -650, -442, 507, 499, -723, -784, 238, 268, -714, -595, 349, 347, -395, -458, 304, 235, -587, -669, 591, 494, -352, -697, -52, 404, 97, -55, -182, -7, -47, 23, -225, -177, 497, 546, 92, -830, -42, 776, 177, -672, -368, 1007, 521, -845, -645, 480, 760, -127, -247, 527, 483, -319, -533, 208, 575, 498, 228, -395, -441, 35, 623, 413, -354, -4, 732, 129, -654, -91, 876, 626, -565, -198, 634, 187, -712, -106, 1094, 599, -527, -428, 416, 106, -472, 95, 555, 291, -502, -463, -114, 145, 290, 508, -126, -393, -255, 242, -68, -458, 281, 676, 75, -994, -476, 693, 495, -909, -494, 881, 431, -973, -1080, 296, 931, -189, -719, -82, -15, -353, -420, 255, 425, 240, -155, -427, -599, -91, 388, 351, -511, -519, 297, 52, -555, -375]
4141c75R06R3j080k99N59L10o13J94P88n7r98n2M47K65j82M4M40l49l67N2K11
4162f3L70n6N0n35m35N41P41n62o07N45R72q00j148O80J127k5j271Q6J134r4j195
4183e45o9J169M11r49n30M95K71l74K43j2j26j10L58q2m38J20P25K8j108Q0R38
4204D95jq48k8R56J43j052k70Q89P1m49j60N64J93p92j33N82K44m73K0K81l4m58
4226b60K2L81J9j02k99K31q9J11K22j62m44L87N75m69o32j6Q29J18p69k93O88
4247D8K42p31j58P96K85o31l33L3N23N6j95n6r5J46L23m49l88M33L18q9o50K11
4269c61L72n2l06m7P68K0o86j7M24J13l87o2N15L8o65k34Q77m8n39J18K66L29
4291D36m76j55J32J49J24r2r3j96J11L43j17m22J78M66o8o97j29J004L38r61l75
$$ y = [-375, 531, 624, -456, -755, -196, 114, -499, -305, 483, 426, -572, -624, -177, 88, -94, -50, 390, 41, -326, -274, -63, 307, 251, 301, -234, -669, -128, 613, 51, -556, -11, 961, 161, -987, -307, 820, 795, -476, -390, 744, 650, -545, -614, 555, 966, 17, -513, -18, 253, -121, 122, 110, -16, -126, 232, 150, -288, -168, 557, 585, -523, -443, 495, 494, -354, -382, 574, 717, -335, -605, 284, 355, -94, -254, 310, 503, -289, -422, 160, 404, -69, -49, 232, 198, -260, -238, 143, 162, 60, -239, -8, -97, 14, 236, 74, -370, 17, 592, 123, -509, -525, 304, 422, -347, -640, 48, 290, -441, -599, 197, 482, -149, -482, -449, 74, 130, -65, -121, -216, -70, 253, -196, -584, -151, 167, 78, -572, -361, 11, -41, -347, -394, 374, 394, -292, -309, 115, 228, -159, -221, 294, 332, -333, -567, 310, 262, -277, -159, 107, 436, -40, -195, -63, 86, 210, 118, 25, -171, -60, 283, 166, -256, -78, 388, 320, -377, -506, 498, 836, -125, -500]
4312e00P26L32m38m86K86P73l70o85K00L80L2j17j59J6J92K08m80q6J81L91j0
4333C86m40j02L39J65m62J44L55n8m51n8K0M40k72o0J90J13j15l65L00j1o8o6
4355g6k8K23L3k93q6L51PN8m67J48lK61j9o63K04M90r0l77M6M51J61n01m00K41
4379c29M97lm41L3J08R9j91J3kL98q1k62k22O7N13k38l03o3L87K05k70k71K66
4402i0M05o18jK23M81n17l01L86K58k02j26J70M1p5k12K96R4l09p2J34K92j00
4424A57j39j25K09K14l03j8J68j09P9J61l56J0K34J16j92k19J83J96j56l17K66
4445E9R4J30m21j57L62K54r7l30j37L75K4l1k51L58j47j50m2Q2K70Q2m37j33M07
4468A64L6k50j33L69j70n2J26l5j00M4r6L21j73k08r8J03L52k99J20Rj54l7j35
$$ y = [-500, 226, 558, 120, -366, -80, 693, 323, -362, -162, 218, 250, 133, -26, -10, 182, 390, -90, -176, 5, 396, 386, -54, -156, 183, 348, -114, 30, 385, 327, -124, -182, -162, 278, 6, -54, 136, 249, 134, -231, 69, 58, -10, -76, -104, 119, 152, -141, -227, 124, 131, 189, -278, -130, -133, 128, 109, -554, -350, 140, 50, -327, -281, 170, 331, -170, -570, -329, 168, 165, -276, -243, -135, -36, -227, -214, -216, 182, 101, -161, -383, -316, 197, -41, -344, -407, -20, 185, -85, -356, -90, 315, -303, -304, -81, 400, -117, -418, -32, 226, 24, -102, 68, 109, 34, -178, 118, 212, -97, -169, -35, 257, 157, 18, -107, 102, 316, 13, -5, 163, 54, 133, 294, -62, -52, 182, 298, 106, -113, 70, 266, 110, -207, 59, 153, 283, -138, -295, 67, 321, 224, -106, -243, 132, 156, 125, -126, 232, 85, -65, -107, -25, 245, 327, -110, -243, 164, 200, -50, -183, 186, 16, -36, 90, 55, -45, -1, -97, 224, 51, -157, -255, -152, 200, -99, 21, 30, -124, -161, -296]
4491b96J88P4j49J59j37l08M11L28o3m69j58L72K95l33n65O00L41k13m76J50M83
4512B34j75o24L12M16N9m22j68K6M88J75k47k02j43K45Q5j51rP0Q6k46o6L15J44
4535B02j94k87K74K19l26N4J20J53l26J60k9J06k69mO3L09j41j9J2j86J87k2M2
4558I8n9Q2j47J19l8J25N60l90o95J13P05J49o43k25M63J71l38j17KM27k13K3
4580A72q3m5L1p2j14J30R3J67j61l26j39N34K65l53m72J48L24j16j44K39L15k77
4602A16m07M6K02J70K0j61L17m67j10L19L35q35K09J98K07l50J04p7K89L7j58
4623Dk7k11Q6N0K14k07o6K64j71k30M4L95K31n55k96L22K63r3j67k8J94j00m5
4646a29P2RL3N6J3J0j60O7R1j97j75M52K03l62j88J52K46J73m89qJ96r2k57N37
$$ y = [-296, -108, -34, -183, -24, -161, -469, -58, 270, 207, -262, -420, -48, 247, -86, -651, -51, 290, 77, -399, -249, 234, 59, -565, -253, 163, 222, -200, -368, -342, 146, 321, 74, -128, -271, -26, 59, -92, -101, -31, 55, -191, -257, 58, 202, 8, -279, -5, 214, -112, -58, 62, 215, -111, 49, 20, 126, -143, -147, -84, 225, 84, 65, 77, -109, 78, 56, 98, 39, 121, -26, 93, 55, 180, 740, 350, -345, -232, 473, 622, -21, -246, 217, 388, 50, -67, -65, 362, 149, 172, 89, 44, 75, 3, -111, 19, 112, 279, 118, -208, -347, 187, 452, 99, -373, -225, 99, -17, -161, 78, 393, 116, -291, -245, -43, 127, 147, -14, 303, -164, -274, 45, 380, -455, -246, -48, 159, -191, -87, -164, 125, 162, 4, -23, -234, -148, -98, 116, -91, -157, 107, -64, -294, -250, 145, 376, -179, -475, -153, 110, 17, -150, -178, 16, -84, -129, -57, -48, -15, 41, 54, 64, -96, -29, 62, -135, -310, 142, 345, -17, -205, -53, 193, 366, -123, -131, 65, -27, -284, 253]
4670B53J06l29l80M17J94k20j54K99K34o32k6O41N0m74j64K40K8j8J97j01j49
4691A2r2J93J49l89o6L79K14m89l85N17N97o42l58M97N15m45n22L46K53k10j41
4712f7K60K02p07K92K58N5k43j11J47o9l61J74M93o1n74m3N47k03l95K26K42J00
4734A62k25o4K53l07k47M84K39k20l60J90J71j25j64J68J79j90l24K58K73j38
4754A3J39j85k15n3K56J60k77k58M77J59l23o08N22N02l60m01L51L77l19m04L62
4775h5L17j09k55K10j00l25lP63j29o10K75L00r7m01J42O64l65n98M19K73J96
4796D82r24K62K19R5n12K87M08k87m32N75M53m87n76O10L46l26k18J84K46n32
4816a27n7L67K25m38K5j2K30l10q9O52l42n41M38M45o7o88J91M96k3m45L0K81
$$ y = [253, 359, 30, -350, 67, 261, 41, -113, 186, 420, -212, -238, 403, 453, -21, -185, 55, 83, 65, 262, 161, 12, -80, 113, 262, -127, -193, 186, 400, -89, -474, 43, 640, -2, -360, 137, 652, 207, -315, 31, 284, 74, -67, 193, 395, -312, -20, 238, 293, 50, -61, 86, 17, -344, -170, 323, 262, -312, -355, 192, -11, -406, -180, 62, 162, -63, -127, 126, -181, -428, 56, 295, 75, -285, -95, 76, -49, -213, -45, 134, -56, -380, -122, 151, 13, 152, -33, -248, -301, -45, 115, -162, -420, 57, 216, -107, -715, -193, 309, -51, -452, -101, 276, -43, -447, -85, 232, 123, -132, 78, -22, -347, -350, 413, 284, -326, -51, 249, 152, -249, -107, 557, 192, -406, 13, 286, 482, -442, -180, 39, 134, -378, -91, 317, 30, -402, 173, 626, 139, -437, 173, 519, 193, -25, 159, 405, -127, -184, 183, 408, -30, -5, -17, 213, -97, -186, 466, 124, -417, 21, 466, 399, -289, -98, 398, 375, -70, -40, 241]
4838B41Kn40J83L60j37k51P7J59j12J9J00R7n09r5O87j71n26K40L55n7l26J19
4860h5J93m28L6L36J38k88m44M13M01n05k38N56J95m02n03M45L47n1l58K77P9
4881A14l25k45M00J2J33j90P9P5m67K28L25l09k49K73N40m93m36M51N59j26o38
4902b89J38N05l77l35K76M29j18m90J51M69l24N8L07k33k23k2K14O3k18r4L52
4923B39k66L6o4j8J6L6J73J68l60k63M07n4J61k64K15J70m11j39J45K69l0j62
4945DQJ89l53K12p6k1o4L29p4j62l43L28M45k94m15J25N55n43l17K54P21l03l29
4968a24k87M16J15j20L0J65k57m9J54P0j20j03K60m3k06j58K34j0l29K19K43J0
4990A10k55o6M34k42oM3o4m5l43J27N18l96q8M6M36j2m75O1K00m6r0L0Q8l5RJ3
$$ y = [241, 243, -297, -114, 246, 109, -142, -65, 94, -18, 1, 101, 198, -311, -406, 281, 110, -416, -176, 179, 122, -204, -85, 108, -320, -284, 52, 190, -98, -542, -129, 272, -233, -471, 85, 280, -122, -625, -180, 167, 116, -242, 35, 114, -211, -456, -56, -44, 89, -101, -22, 53, -414, -186, 139, -170, -419, -146, 394, -99, -535, -84, 475, 349, -289, -151, 354, -23, -358, -82, 347, 229, -261, -110, 359, 35, 93, 400, 167, -56, -78, 136, 199, -19, -113, 239, -27, 9, -55, -73, -57, -21, 152, 320, -40, -303, 104, 50, 211, -53, 162, 332, -79, -218, -73, 196, 166, 4, 12, 201, -152, 60, -16, -37, -101, 228, 154, -8, -351, -23, 422, 128, -287, -162, 393, -150, -467, -213, 508, 205, -124, -411, 5, 120, 0, 30, 195, -62, -111, 43, 113, -7, -110, 150, 107, -99, -257, -23, -33, -362, -143, 100, 110, -145, -211, 223, -19, -25, 18, -46, -91, -434, -307, 211, -185, -273, -227, 209, 197, -278, -217, -17, -63, -153, -123, -35, -70, -61, -48]
5016d8M5k13J54R0J7k32o4L76j73P5k39L47j38l14J51K51J84l93j94J83J86J11
5038A62k61r2K27R7jk33J57R7l2r0j6N5Q5j39J19j00j04L5n4m2J21L6J53O0j41
5063I9q9j14M74j23l18K0J04L83l55k53K0L78j14l10K43J74j37m6j14J84l2P8
5085A52j5k68j6J41L3J30k58j02K64J03j85r4K98j8j29j54J23Qj59r9J24J39j33
5108a15km7K57m1j72O3J47l01j05J62J56k36K26j80j2%K06J03j52J63k39Q8j43
5131a74R4L34l85l5k65M89k5k59J31o7L36m8j86j14J23J03K9l37OL05m2j27Q3
5154c1M9N1k5k77N2J19R9r4pN7j1J75j37j4J69Lk2j57j36K42l2j28q0L27o1Q8
5180B19j88k20L69Nk87J11J08j27J70o9K90l78J58k35K44j3l75L09J65k21P6m9
$$ y = [-48, -3, -216, -62, 28, 45, -187, -251, 125, -48, 27, -212, 135, -3, -317, -166, 85, 269, -124, -318, -135, 51, 162, -99, -191, 36, 133, 132, -101, 56, 153, 121, 31, 15, 70, 155, 16, 135, 35, -69, -34, -88, -130, -9, 27, 180, 240, 99, 10, -104, 370, 247, -71, -51, 53, 436, 81, -172, -152, 226, 112, -198, 45, 219, 82, 36, -78, 106, 74, 152, 137, -131, -147, -6, 27, 157, -101, -203, 61, 164, -21, -115, 183, 165, 36, -118, 5, 13, -146, -245, -121, 18, -115, -117, -164, 93, 52, -120, -57, 90, -211, -316, -154, 2, -234, -8, -188, -200, -200, 6, 109, -43, 120, -119, -31, -174, -80, 254, -131, -166, -431, 58, 33, -226, -95, -162, 174, 126, -60, -174, -51, 52, 81, -256, -250, 55, 13, -114, -31, 18, 69, 44, -233, -181, -62, 37, -57, -64, -7, -18, 157, 20, 6, 175, 178, 156, -1, -137, 105, 73, -55, -135, 192, 131, 219, 31, -189, 180, 185, -102, 9, 117, -10, 160, 91, 381, 3, 161, -74, 170, 157, -218, 91, 256, 35, 111, 62]
5202F2J30j34j38m8O4K77j76J3Mm4M0K6j21Nj47K93P5l1j50J8J14k22o9L26M9
5227B16j34l56L89L3m1j73j0j87L36j69j17J17Q1J65q6l00J46P5m3q9J70R6r7
5250B2o3j66K11j13J09p6Jj31KJ39J89k20k4J5K77j18k90J83k3J40k08j9J41J40
5274A18j04Kq3J06n7J66k35m8J08K53p5k24m3jK98k67pK47J21l96k7J49K90l88
5298i7J88j0J02k63J08M6m5k79L07J18k19k12J74K17rk75K62J35l29j7N7J35k37
5321a43J11K94k81l69K61L10J31l65j78M69j06j59P6j4J45r5j66K03k2k20k7J90
5343D5L4N0j25R4n3j73M64j13l70p9J99J16l20l5K75J89k67j6J01J38k60l7K53
5366A10j41j43L68l07j74R5L64K07n91k30N20M5j91o2J34R7l27M8J87J13l73M6
$$ y = [62, 192, 58, -80, -128, -64, 213, 37, 50, 54, 10, 50, 76, -45, -40, -187, 106, 181, 150, 0, 18, 132, -90, -159, 167, 216, 82, -274, 115, 148, 107, -66, -76, -263, 73, -96, -213, -96, -15, 150, 64, -236, -90, -15, -58, -147, 23, 119, 22, -41, -207, 4, -109, 0, -76, -75, -206, -204, -65, 124, -96, -120, -105, 172, 54, -236, -53, -76, 64, -144, -163, -22, 118, 14, 16, -67, 39, -18, 148, -87, -135, -27, 226, 151, -73, -116, -117, 181, -86, -93, 154, 275, -121, -148, 1, 291, -97, 91, 81, 183, -80, 28, 74, 29, -250, 57, 175, -44, -256, -82, 135, 126, -149, 113, 248, -81, -98, -41, 94, -143, -32, 262, -19, -388, -127, 183, 314, -51, -229, 240, 134, -25, 51, 37, 182, 87, -79, 124, 102, -118, -145, 45, 79, 129, 4, 98, 45, -128, 336, 223, -147, -226, -27, 89, -231, -266, 9, 198, -69, -85, 16, 154, -106, -143, 110, -31, -174, 194, -113, -287, -192, 172, 379, -212, -442, 78, 123, -68, -130, 4, 101, -226, -178, 9, 122, -251, -205]
5388b05K31J03k88j75M88Jl67K03K08j78k57M5L95m5p6o7p5r3q7M59l2l62j24
5411b98L46j7k75K39L0M55n77k39M48k3j62qK23J99k60k34J30J34j90K87j84N9
5433H3k35M06j15k70l4N56O3m69k60L79K91l54k71M45M3k16o1K59j39j39j38L76
5455B00oj67jK44k00k49L36J57k79l46J67K85m5j36N5R9k03n5K43P1l06q5M30
5478B09j74m39J56J89K08l48O3L32k6m57o2M18K8l51K43k6J83l32K70J15k58l62
5500d21L26J32k51pL60J55k29l84K84M24l87k34J02R1j30n5J98K2p0j6K76l4o07
5523d55K95L51p0k34J53oo6k06J26J83k0P9r5oj75m0M64j70l59J40R0K57o56O3
5547c57L41L36l75l8K24N2k96L1K63l7Q7k52n1R6mJ38J51l67n5L05j45P1j49M0
$$ y = [-205, 26, 129, -159, -334, 154, 155, -212, -9, 199, 21, -236, -191, 204, 159, 83, 16, -59, -152, -239, 220, 188, -174, -298, 48, 31, -244, -5, 25, 480, -97, -336, 112, 89, -73, -81, 142, 341, 81, -153, -23, 111, -79, 208, 24, 83, -152, 254, 139, -131, -165, 391, 454, -15, -275, 104, 395, 41, -230, 215, 258, 42, -19, 240, 101, -38, -176, 200, 194, 27, 26, 270, 70, -179, 157, 314, 35, -311, -144, 141, 96, -40, 15, 114, -89, -144, 99, 170, -136, -221, 209, 35, -404, -248, -59, 149, -199, -136, 196, 170, -287, -349, 69, 97, -254, -11, -37, 146, -186, 84, 199, -59, -421, -95, 37, -214, -221, 139, 294, 65, -319, -35, 389, 2, -232, -130, -39, -169, -224, -26, -4, -74, -90, 186, 152, -455, -160, 191, 121, -113, 40, 34, -32, -238, -112, 71, 51, 130, 35, 29, -146, -186, 278, 108, -251, -111, -21, 236, -420, -357, -16, 320, -55, -93, 131, 183, -113, -82, 181, 144, 231, -21, -72, 24, 20, 158, 309, -58, -113, 192, 47, 118, -31, 9]
5571IJ83j39j20J64K59l16k9L6j05J54j0J9Q7j29J08O5j69p0k61M47Q5l32%L5
5595b9l1N1j15L22j04r6k05L33k11k64N79j87j11l59M42J66l12k48K09M43j94
5616G9k14J71j14J89l14J73J39j15j87Q9N3o2K72rm39PL61o7j7k87K73J65m39
5639b93O0J31L54l64L0k09K52l0J02r0J24k0K7p3n6m2JQ9R7K7m6k25K55j30M3
5664A4R8q8j47J98N7l48K68lJ01p1j77J35P7j25n4P8K97k82j49R3R2Q9N2n4j80
5689b9K21k57p7L0J78J87k40P6l07K40K42j57n6k09N15j40k40L2n0Q4j31Q2Qo4
5713f2k7m1K54k4k63K12Lm2o9K3M4j33O9p9M8K27j11j35J28R0j77K9j23J2Q1J43
5739G7J5j13J3J85l00n8m8M24k13Kj45J38p2J67k04J6J78o9Q0l02J67J4L37l74
$$ y = [9, 192, 53, -67, 97, 356, 40, 11, 47, -58, 96, 86, 105, 192, 63, 171, 236, 67, -3, -264, 183, 268, -64, -64, -29, -60, -9, -124, 198, 94, -2, -207, 126, -85, -349, 230, 43, -68, -427, 15, 181, -131, -379, -170, 273, 79, -135, 36, -78, 111, -203, -30, 109, -6, -193, -104, -51, -113, 159, 150, -289, -282, 79, 12, -5, -292, -19, 146, -293, -233, -102, 252, -112, -82, -291, -39, -69, 33, -57, 67, 47, 74, 1, -55, -97, -96, -7, 90, 117, 71, -154, 101, -29, 14, 112, 24, -123, 75, 132, -216, 52, 49, 150, 79, -98, 37, 114, -11, -65, 13, 310, 28, -121, -28, 64, 153, 205, 151, -29, 192, -65, -142, -112, 66, 253, 13, 89, -218, 22, 264, 107, 51, -158, 357, 217, -23, 9, -41, 43, -88, -6, 2, -62, -89, -130, 124, 100, -163, 49, 52, 10, -59, -36, 8, -125, -56, -135, -87, 140, 29, -106, 22, 112, -65, -36, -159, -147, -66, 77, 92, -21, -8, 177, -123, -181, -229, 195, -18, -16, -161, -23, -95, 72, -132, -116, 62, -7, 73, -229, -62, -48, 289, -85]
5763h5K6P6J41k28L1j2P9k10OK15j64K96j26o8K6K3N6M8j23j56N2M1O1K16j48
5788G3n6O8l4k42K76l5L6k1k03J60j88J59J03k00j7O1J95j30k57J10L37k20J38
5811A13k02K94L3k44j41J17K20K0k28j28J73J28K4k34J63K19j60k00K5L1J38j81
5833b0p2L6J43q8M4j52J74l1J0q4J79Oq3J0r9J4P1j27j3K0o1K13n6n2Q9q3j88
5860b00K3J37q3l8Q8Q2m5n3j19J32j0J59j62J04q2N1k1k40K05J29Nj52M3LN6j22
5886a10q1J06L0N4n6j72J67L71l09j86J17K38j07j20j64P0J09K5j66J29q9N8j37
5909b23J47N3J20o3q2J89j44r4K07j59N7N8j01J91o5p2P5L3j00J31j37J7p4J45
5933A09n1l3O9M9j08J26j56K71kj98op1J91k31M3O0m8J13l8O1j89J54O7k00j58
$$ y = [-85, -59, 17, 158, -70, -39, -51, 28, -182, -176, 39, -125, 171, 45, -23, 3, 26, 82, 130, 7, -149, -97, -56, 5, 221, 73, 17, 85, 51, -191, 85, 50, 86, 65, -138, 22, -166, -7, 96, -104, -121, -60, 135, 5, -252, -142, 195, -25, 113, -89, 205, 238, -6, -147, -30, 190, 210, -18, -146, 27, 155, 179, -55, 108, 327, 167, -33, -8, 23, 161, -20, -92, -56, 87, -1, 43, -109, 65, 34, 44, -40, 139, 145, 62, 72, -27, -13, 58, -69, -82, -62, -123, 90, 34, -18, 71, -12, -200, -177, -40, -123, -161, -73, 9, -36, -89, -208, -76, -86, 73, -89, 15, -67, -16, -37, -277, -72, 57, 62, -90, -47, -44, 12, -110, -191, -85, -55, -1, -57, -229, -62, 309, 0, -186, -69, 169, 62, -58, -222, -152, -43, -18, -184, -55, -144, -86, -223, -76, -23, 97, 34, -48, 141, -3, -97, 110, -49, 8, 66, -35, 156, 91, 19, 94, 127, 27, 158, 21, 38, -36, 109, 58, 25, 94, 143, 35, 161, 5, 276, 274, 76, 70, -1, 190, -41, 2, 62, 14, 127, 89, 150, -39, 115, 182, -18, -176]
5958a76K64nk0j92j8L15k5j69q0L6K41kl69J38K1p5J34N3j81J05j29L4rj30L29
5983I0O4l72K26j02J77j5k38J23j21J28r0K38l04J3M7J19m7J10j81P4K12l39N0
6006a38N6L2K38l29L8J98%n9q0r6J92Pj60q3K74j3j89n0M8J65q5r6J24R0pj56
6032g9M2J51r0P4j73J05Pp1O8J08k25rM6L21l43j45L35n7Mr1J67k6k41J08Q6J5
6058H7k03J28J79r7n4n7K70r5k19R0J37J9r0qlj27o7P5R4R1l06Q0J25j23J40J85
6084B51k54k72K32J97M3l89j55M71J85l38k08K77L38m73j63J48J62J46l61P1L04
6105B12l20J78Q0j37o3K3J80j66j31J47j69J14rJ01o3m7J11n6ok1k31M77j66k30
6129a92J66L5J68p0l81L34l20J47j01K70R3k24N4j70j1J52P5J13k37jK01k62l9
$$ y = [-176, 88, 83, 63, -129, -147, 168, 143, -26, -106, -70, 171, 169, -200, -62, -41, -116, 18, 71, -110, -5, -134, -100, -109, -239, 90, 154, -218, 8, -94, 83, 68, -170, -47, -168, -40, -130, 108, -196, -183, -136, -17, -64, 46, -135, -61, 151, -188, -138, -82, -50, 188, -141, -103, 95, 95, 36, -44, -140, 52, 59, -101, -184, 90, 77, -112, -162, -114, 51, -34, -130, -6, 84, 77, -79, -37, 114, 24, 98, -75, 30, 37, -34, 34, 142, -83, -92, -46, 275, -68, -213, 122, 65, 69, -22, 145, 119, -122, -14, 72, 87, -116, 12, 191, 94, 40, -17, 253, 158, -61, 29, 166, 185, 95, 87, 84, -43, -110, -35, 59, 150, -156, -76, 49, -74, 66, 251, -3, -275, -43, 154, 197, -192, -347, 124, 309, -29, -237, 40, 378, -95, -258, -110, 52, 198, -163, -92, 212, -108, 70, 150, 13, -50, -27, 153, -13, -144, 3, -166, -52, -61, 40, -23, -70, 41, -15, -21, -42, -273, 204, 38, -192, -26, 9, 177, 107, -274, 60, -260, -113, -214, 56, 149, -75, -21, -191, -202, -50, 25, 138, -99, -100, 101, -161, -200]
6152b00P1L53m1l83k30M22O5J1k51J14M9n2n4P0M3Q5j18J27j50K9l2K33q6qj46
6177g9J83k14n9K71Q8k1l47K44K3k55P0L55J8l31o8K16J23l60q8M29L1k35j23
6200a29J16J41Kj65L5J51j93J24j43P3mK54k12j56k48L36O8j56N8K56j2m41J15
6223a30K61j3k39r1L45M7l29L9P8J92j31L5r3j85L7L30k55J37j13N6P6l55q9M15
6247B5O1j77j24J69j37l7P1K87j9l42M4K17J78l25q5K92R3k17k35J96O7p1j8j97
6271b84J68J06M5L4m10K69K49p8k58j9M91k38q3k81M12o5k08J8Q7K64k54m6m8
6294a29J83J77k11j19o7L67J51j56k98L2N1O7L8j40L25j93l62K75J60L6l02P6
6316c9J48p4J02m2K97m60J33l1N5MO8k73K54J4k15O0J1N5PM4j49j67L7K24L9l23
$$ y = [-200, -129, 224, 183, -200, -430, -8, 57, 68, -183, -69, -20, -72, -126, -56, -13, 72, -46, 81, -69, -40, -72, 161, 75, 67, -79, 104, -110, -169, 102, 190, 169, -178, 66, 89, -166, -96, 259, 277, -54, -122, 94, 217, -143, -231, 198, 229, -6, -129, -13, 128, 130, -35, 0, 151, -42, 82, -61, 12, 8, 262, 50, -106, -354, -18, 50, -106, -48, 208, 196, -245, -130, 131, 118, -121, -212, 133, 180, -149, -110, -32, 160, 29, 64, -29, -214, -177, 153, -102, 35, -78, -22, 54, -301, -390, 25, 86, -91, -215, -46, -183, -220, -149, 138, 119, -223, -179, 38, 216, -109, -194, 98, 191, -26, -261, -65, 2, -69, -87, -284, -116, -10, 35, 69, -341, -72, 177, 99, -159, -178, 313, 75, -8, -289, 123, 58, -150, -132, -45, 219, -35, -81, -129, 54, 231, 20, -99, -166, 201, 352, 196, -102, -70, -19, 48, 86, -54, 271, 78, -284, -9, 151, 187, -115, -39, 109, 35, 137, 95, 392, -68, 65, 34, 89, 93, 161, -112, 142, 156, -59, 1, 12, 67, 74, 118, -31, -198, -161, 63, 102, -221]
6342b21K25L01k90k75K11K85j28j48j18J82LJ60k37J2RR3p7R4j00m3k6J7k15L10
6366B4P3k08r4N5K60k50P4J3j00J81k60O6O7L3j65l8N0K43j49K15j39J84j29j38
6390a32R3K5p7J17k02Q7J6N5k87K77J75j00o1j38J56L6j16m3P8K48k18j67J00
6413g8J84j9j29k37L90Jj22O3j69ML41l82J22L8J53%j73r4p0K30q8k6P3L01j87
6438A26k32j23L99mk39J06O9J04n6j95K70p3M3j74M2r5N9R0j51J46k21R5mj35
6462a53J81K5j82J58J81kk98l8K90q7L0j42J5J50k6k12qP0M7o1j14J49K33l9l52
6487a85m6J40P0m4m9P7M3J3j51QP3J18q8k31K33J83j32k68N4K89j16j07J3K7J04
6512B8M5l27R2K76Qj76o0N5JM2j49J29J66ol27K24P6n4k75K40p4J83j39k05J4
$$ y = [-221, 4, 305, 15, -260, -49, 236, 108, -40, -158, 24, 27, 187, -50, -38, -29, 64, -13, 81, -19, -62, -88, -71, -286, 24, 97, -111, -205, -150, 110, -140, -66, -53, -153, 28, -232, -166, -99, -66, -231, -269, -219, 24, -125, 90, -49, 135, 6, -132, -39, -14, -91, 26, -176, -89, -73, -18, -305, -28, 147, 47, -14, -152, 4, 40, -76, -119, -41, 207, -11, -178, -78, 106, 87, -42, -279, 111, 112, -10, 53, -116, -112, 229, -153, -31, 7, 160, 160, -13, -107, -177, 53, -35, -61, 12, 313, 126, -106, -229, 170, 166, -73, 33, 102, 206, 150, -45, 225, 152, 195, 21, 63, -32, 27, 117, -34, 112, -109, -14, -18, -153, 28, 53, -129, 29, 210, 208, -90, -128, 162, 75, 105, -37, -22, 128, 102, -110, -118, -48, -1, -62, -176, -27, 206, 167, -185, -231, -91, -21, -65, -114, -37, 6, 19, -132, -124, -51, 67, -21, -252, -19, 164, 32, -236, -182, 107, -9, -116, -103, -76, 28, 73, -254, -162, 114, 122, -54, -114, -59, -58, -16, -165, -36, 130, 124, -203, 21, 97, 43, -232, 8, -66, 117, -22, -227, -213]
6537b13K56K31l97k5K60J33l79Q3j7K12j12k24R1K63n6%j64N1L35k67l39K52J66
6560A40P5k33M0L4L8j45j61J77J51k2j67J16j10K58p9m8j44K06j07Mq6J69kr1
6584A3oK4J99k66n3K18l8o4k09Q7J89J48l50l8Q5M4J34l04j59J67L24l48J19q
6608i2J74j74j29P9K29M8k00l44M05J00j81Q0p6J73pO4l76N9L20n5k51lL75q9
6632A29k53RN4MJ17j91J31J91k07q2O7m9J61j72RM5J00k77M4Q2J75m7j60K57L3
6657A70j69p2M6o4J51l8m1j84K90l3k50O3J9J72j62k06M26M7p1k47J55J36J40
6680B78l42O8J24K3j16q0oL31k58ln4O3k9p5N4O6R2Q6j81k39J08K71m3k25R5K60
6706B68ql05q4K96k18J76n0L9j25O0k34Q2K61k64J98j41L32R6l09L9k35O2mo0
$$ y = [-213, 43, 274, -123, -148, 112, 245, -134, -51, -68, 144, 32, -192, -101, 162, 106, 106, -58, -7, 328, 61, -278, -26, 140, 215, -18, 22, 56, 94, -51, -212, -35, 116, 94, -73, 43, -67, 191, 112, 64, -80, 126, 19, 23, -63, 106, 104, 13, 7, 31, 230, -36, -89, 129, 91, 27, -182, -95, 94, 242, -108, -146, -61, -17, 117, -187, -346, -179, 145, -203, -84, -92, 82, -92, -221, -142, 87, 135, -65, -409, -4, 96, -85, -5, -81, 92, 85, 149, -227, -168, 152, 97, -154, -157, 218, 129, -124, -115, -61, -57, 60, -131, 0, 191, -16, -98, -31, -80, 81, -91, -82, -37, 63, -214, -170, -88, 87, 40, -120, 137, 170, 1, -71, -25, -89, 62, 24, -17, -201, 89, 56, -194, -131, -112, 60, -102, -308, 118, 165, 94, -153, 2, 138, 278, -64, 4, 128, 151, 35, -45, -51, 280, 22, 19, -35, 28, -1, -76, -22, 44, 136, 222, 41, -198, -90, 181, 138, -87, 8, 268, 260, -45, -129, 167, -51, 125, 75, 114, -11, 49, -185, -103, 158, -106, 92, -49, 283, 379, 70, 109, -126, -64, -68, -128]
6730a28j16K79J23q0k70J91K50k25l64M10J49N5n70J58J99m1j84k09K32K91o2
6751H8k28L1R9J40j51j73M5J43K26m11q5J85K15j82k48J12L40J2l73J57P0J20
6773A32m7j77J38N2k43P7O7j3K29k52J10Oj79K44j57K6p4N8k20R9K03n0N8l3O8
6798A22L1k96j06J17M43l07j56l3K89J48l24p3K62K01k55j95K37n6K04j70k25
6819a42L53k44K01j03j52J82J47k08l68M18K9nj37P8O9j52o2K08k0M1J05j76J1
6842G3Q3j03Jj14K26lk08m4J08J08nj72j17L56j75j39P3k7J4j68j82N22Qk12k40
6867c37K09M31k89j10o6K29O6j02k58K02K72l47J5o6K0R4q5j19K72m8J67m55K30
6890g5J49J59j55j41P9rNj10M6J10O7k93J43r8L13k52j25N4J67K03l57j62K64
$$ y = [-128, -244, 35, 158, 78, -192, -1, 249, 24, -340, 70, 219, 274, -296, -138, 61, 20, -164, -373, -141, 150, 88, -140, -109, -10, 130, -21, -194, -149, -6, 220, -191, -276, -91, 124, -58, -306, -194, 146, 158, -215, -58, 12, 132, 85, -92, 46, 98, -145, -68, -1, -14, 215, -37, 73, 79, -100, 144, -13, 13, -61, -3, -223, -124, 79, 29, 87, 54, 122, 153, -143, -249, -132, 311, 4, -152, -185, 104, 252, -72, -145, 117, 318, 63, -132, 105, 49, 253, 83, -142, 211, -33, 168, 65, -87, 95, 242, 34, -334, 84, 113, 108, -29, 49, 118, -34, -96, 112, 92, 133, 238, 62, 73, 156, 53, 54, -60, 166, 163, -45, -89, 19, 127, 122, -50, -167, 189, 14, -125, -52, -79, -65, -233, -415, 107, 115, -97, -337, -128, 303, 14, -96, -162, 67, 133, 31, -227, -25, 247, -100, -85, -151, -131, -37, -122, -241, 31, -17, 150, -305, -75, 74, 233, 78, -63, 16, 7, 12, -98, -52, 58, 125, -168, -25, -123, 190, -62, -187, -133, 34, 237, -120, -282, -18]
6913a8Q5m0Nj73J52k2n7o9J90K09l51QJ90K01j24m74J33K61l25K56k38L45O4j64
6937D4q9J47J5j10k39M6K73K4k12m6J01L51k42j58J25J13j32p7j23L11K23k79
6959F6k56M7J52K46m05j90N46j14j92O0J37M4N2j64q4J08J19q7J2j79O9j47k7
6982a87Q4K84L2j71l3Q1o7j00j49K84j03J4O4k72L85q2k22O5j7L49n3l37J1J70
7006C0J35n35L41L4K34r1k80J77L9P5k11k35J99K55l77q1L83K13l15m4k3K38o8
7029I3j17j88L63j50k2k05p2N20l25J06j02L34k33O8J14j99M8K97k84j0J9O8p8
7052D5j80K25j1m0j0K9N6r0j11NQ0K76l17k14L36K49l37j1k4K10jk36k4K9J59
7077I3l0m6o9J0jM1j51K41O4l5k15L8J20J17l48K5K83L7j07k91J87LK14j91j38
$$ y = [-18, 67, 27, 32, -141, 11, -11, -68, -137, 53, 262, -89, -81, 109, 310, 186, -288, -155, 106, -219, 37, -201, 144, 208, 44, -45, 102, 117, 7, -232, -186, 87, 111, -101, -147, -46, 305, 63, -95, 30, 143, 11, -66, -189, 122, 345, 66, -190, -143, 9, 255, -150, -340, 206, 92, -100, -40, 97, 141, 193, 29, -55, 53, 172, 85, 97, -82, -13, -160, -187, -103, 181, 213, 42, 9, 90, 23, -77, -226, 58, -45, -31, 33, -239, 146, 64, -158, -93, -110, 239, 186, -151, -140, 30, 165, -370, -29, 5, 239, 148, -132, 45, 84, 159, -52, -287, -88, 167, -210, -291, 92, 305, -10, -54, -77, 161, 93, -24, -212, 151, 1, -21, -226, -298, 222, -103, 3, -99, 235, 2, 70, 184, -15, 33, 330, 46, 36, 55, 123, 45, -135, 90, 79, 39, 29, 58, 114, 24, -87, -82, -2, 274, -43, -257, 79, 328, -9, -20, -44, 166, 165, -71, -95, -66, 93, 63, 17, -52, -42, -43, -2, -153, 88, 152, 117, -98, -60, 60, 177, -171, -146, 137, 174, 67, -224, -37, -34, 180, -11, -149]
7102a49J38r0q7J91m5j24N6j43J93J56M0k97O7J42K4j82P6o2K49k18j7j39K16
7125ej1N9l5k4K52l04k5P3o2R6l87O9M15o1k58MJ62J8o5jj08J90J89j78k83K75
7151eK21j79k44j8K56n1o7j79J35L76k64j40J13K21N6l89K05O0M1l5k86J74O3
7174F4r6j2j13K62%p3j54P8J49j58M9o7P6O4j80J45P5K20k83j51R0K17j7k21K02
7199A66j71L42l45q2L59k16j66n4L15n6j8j94j41L20Q6j00k46J70K01M8n04J32
7221a54K99p7o1j81J30J07m7L1m1N3P5j79N2j2P7j07j20Q4o2J60k25J1K28K05
7245B46m15MK40R3q6k27N1J56o3j37j26L48P2k34p8P0K65j20j93J29N3J63k94
7268h3k11K74J86k49R2j78L06N7l41J37N6J84k10R9k36J47K1j87l5R8J21j19n0
$$ y = [-149, -11, -101, -188, 3, -42, -166, -110, -253, -60, 96, 136, -161, -94, 48, 72, -110, -34, -96, 153, -65, -82, -221, -5, -16, 43, 8, -16, 236, -68, -93, -20, -82, 14, -373, -304, 111, 50, -208, -204, -42, -24, -89, -90, -198, -8, 181, 3, -280, -5, 216, 37, -207, -225, 31, -20, -87, -266, -131, 245, -19, -159, -46, 175, 231, -158, 47, 107, 148, 113, -173, 1, 64, -32, -44, -157, 105, 105, 32, -122, -44, 105, -53, -4, -71, 5, 69, -111, 34, 109, 329, 46, -105, -15, 202, 185, -36, 166, -5, 337, -8, -90, 269, 53, -113, -167, 148, 92, 74, -120, -261, 59, 145, 45, -201, -31, 170, 218, -286, -154, 145, 68, 7, -174, -44, 63, 16, 47, 6, 59, 134, -45, 7, -5, 72, -35, -155, -71, -133, 27, -198, -187, 41, 246, -169, -165, 75, 168, 82, -145, -94, 62, -1, -138, -264, 84, 156, -78, -156, -86, 179, 59, -134, -5, 48, 211, -83, -294, -20, 166, -83, 9, -169, 137, 194, -147, -10, 46, 230, 20, 119, -117, 30, 51, -136, -171, -73, 48, -71, -121]
7291a21m7K94j74L6J65j89K17q8m4ON8O1k58Q1J17L4j59j64K07Q7o9l9MJ93j35
7316G3q8N6J73j27k21l3J85J69j83k6QJ76j99%P0J3K95l08p4j43K14J60l85J75
7340b0N9J14j30j85M5J38J47l25j74M60k09N4k11K98M9L0j63j95K15%j44J19N7
7363B9J16ql73L13k14J23j42J4L5J18j67K3P6J53k07o1J46n2M9j08m7K59K02l71
7387i4m7J66j43O9j8p5K61nj05m8q7L44k56k18J42J92K3j28n9K03N2j18l02K64
7411A3J8N0k77l3L21QM1k14Q1J47j00k04N2k0K61k15J16J24j93J37l73J10J64
7434A4J53q0k97L15K0r8P2j17J05J38l77j18N21n5j48l08K34L26p1k57QL80k95
7457F5k21O2J61m2Q6j90M2K97j48k73j1r8K85J0j21O9K2K15k97K9K43N1k55o3
$$ y = [-121, -168, 126, -48, -12, 153, -36, 181, 93, 49, 55, 113, 174, -84, -3, 114, 148, -11, -175, 32, 119, 50, 11, 15, 208, 73, -15, 41, 214, 87, -134, -167, 18, 187, 4, -22, -14, 162, -37, -37, 33, 46, 341, 33, -41, -184, 30, 190, -195, -20, 39, 153, 23, -162, -117, 21, 168, -157, -331, 129, -80, -26, -237, 61, 110, 140, -23, -218, -3, -3, -147, -28, 29, 145, 137, -236, 77, -137, -14, -156, -142, -107, 11, -156, -133, -57, 96, -111, -172, -26, -78, -29, -137, -184, 75, 277, -94, -141, 25, -118, -49, -67, -142, 119, 114, 9, -39, -126, 218, -38, -256, -114, 78, 101, -27, -86, 117, 169, 51, -251, 13, 31, 81, -196, -229, 92, 100, 141, -73, 8, 155, 55, -149, -97, -117, 144, -71, 45, 169, -24, 113, -260, -150, 14, 167, 87, -210, 105, 125, 27, 99, -18, 87, 225, -152, -270, 251, 196, 48, -260, -26, 300, 229, -28, -20, 360, 65, -156, -94, 67, 25, 111, -79, -37, 260, 112, -161, -172, -270, 15, 25, -96, -27, -5, 210, -87, -58, 185, 236, -19, -82]
7481h2lK82j93p9J65J59j44j32j0P0J7m6J45n2n9Oj39Q6j27RJ8j36p2K39J62k50
7507a66P8R6J03k03j36K78k6k06jL74q6k68KJ67K7R9j75k33L42J42j50k26J67
7530alJ13k09J04k25M50k22j47J40K01Q0n10J38J70J04k41q7J30J83k16O4k7J97
7553A86rr7p6K1Q1n1Q8j34R7J32j90KJR4p1j44J05N0q1L6n6P8R5j48k4J38J95
7580C18m35J55K8J24j38p7o1n1J35M8pn6l2jK4J23L6M7l34K6J16K15j73j70l4
7605a74J68J49m05J02J68m2j3J2P2m9j38K36j03m0R0P1k29r1J91J80k28j15P3
7628a15J80k9j15q0L87jl95J51n0O7j43J28q1K56k17q5M57l00p2J7j13L70j28
7651H9j40n8J30JQp0QJ15O8j72j81J25J72j56j38L43J4J0j50j79J49O7l7o0K3
$$ y = [-82, -85, 197, 4, -75, 90, 249, 105, -27, -37, 33, 50, 4, 149, 97, 38, 44, -95, -9, -136, -127, -109, -245, -317, -78, 84, -166, -88, 8, 111, -92, -228, 50, 24, -182, -183, 191, 105, -163, -161, 6, 33, 132, -43, -276, 66, 208, 58, -168, -1, -4, 109, -100, 4, -221, 229, 7, -140, 0, 201, 281, -229, -91, 79, 183, -58, -145, -15, 168, -48, 16, -11, 186, 177, 80, 4, 25, 106, 55, 143, 9, 106, 238, 48, 50, 51, 145, 74, -70, 35, 85, 4, 40, -16, 62, 157, 9, -15, 123, 318, -117, 38, 66, 190, 52, -25, -86, -137, -2, 46, 39, -17, -49, -50, -26, 97, 133, 180, -154, -128, -12, 203, 30, -140, -174, -6, 143, -262, -160, 8, -34, -47, -35, 37, -12, -150, 86, -17, -57, 33, 104, -125, -216, -25, 155, -73, -188, -115, 65, 36, -79, -159, 228, 227, -168, -17, -67, 0, -143, -15, -96, 160, -57, -142, 315, 15, -57, -40, -153, 217, 89, -51, -109, 21, 22, 30, -40, -32, 83, 151, -21, -202, -77, 95, -61, -199, 144, 158, 168, 18, -161, -12, 55, 18, -42, -19]
7676a9M7K51l93J8J23K8r1n1J50p9ol8J89Jn2j11j0J37L1j44r0J71J1J17l76J67
7702a9Q9J37m48J27J83J58k63p0J70Q6o9l4j64k7J78plj33K82j3j87r0L37l7j57
7727B6n8K9L03j15k30j70L23j11k15J53MK20j20j99m9K31Q7j61Q5J44m1q6j73
7750a23j07L85j15mj47M0J57k5k28J11K27l66J95j39Q9J34j6j90m5K99o7k11J26
7773b0k4j69J07J04m7N8j67J82J32ro6j56O2L7J45j75j03K96j17k05q0J84K64
7796B33k10n1M5j72K14K8l36J50L61j78l05K47J13m1p4j18J61J76Rk11N3M1R0
7819B25l09P8J06J32j58j78r9L05K26m35O1K0J26J06k53J13J71j72J2l7j0L0p2
7842a2k29K71J82k11k66K61J65j73L4m6P5P4k32r1L26Q3l90m8J56K36j29P3l45
$$ y = [-19, 28, 279, -114, -96, 27, 55, -36, -87, 63, -16, -22, -60, 129, 130, 78, -33, -43, 94, 125, -19, -109, 62, 73, 190, -186, -19, 70, 207, -241, -114, 69, 227, -36, -106, 64, 150, 81, 47, -117, -144, 34, 27, 24, -109, 173, 160, -27, -117, 220, 183, 26, -32, -3, 300, 185, -45, -215, 108, -3, -218, -65, -61, 159, 39, -160, -209, 22, 109, -52, 33, 177, 136, 50, -123, -230, 155, 40, 36, -111, -71, 86, 61, -167, -56, 171, -195, 0, -139, -50, 84, 68, -122, -167, 132, 65, -146, -20, -44, -213, -106, -2, -49, 9, -158, 24, 156, 147, 81, -75, -13, 24, 169, -6, -109, 187, 70, -135, -215, -31, 233, 23, -28, 17, -155, 59, 87, -249, -99, 262, 84, -221, 26, 139, 98, 24, -94, 67, 243, 252, 41, 94, 135, 225, -84, -6, 100, 232, 74, -104, -203, 102, 328, -107, -46, -26, 100, 206, -47, 66, 237, 65, 77, 40, 30, 60, -12, -241, 30, 212, 1, -265, -4, 161, -12, 22, -24, 51, 125, -107, -198, 128, 211, -179, -227, -71, 165, 36, 109, -236]
7865b36K75J71k19k59J42K14r8p4M6J01j17k9k51K88J59j63O1j31J37Oq5j19J71
7888a0J9J06j64j45K69k43N5Q9q1J99j18j15K26l3m0k69L34j26M7M1j33J3J01
7911B2k01O0j5K22L1j41K2M3J20j78k3k0R3J84l44O0J05k0jJ3R6K0j06j43Q8J27
7937A14p4j9o3J61J37j25j02q6K80k03j46P2J16m8k33J43LO9J32k01JJ61k3J9
7961H5p2K7Q7j70J62l3k9j59J60j67J25K68m4l39J7K06o2j88k0K04J12k65J65
7984G0m0J0l1j90Q1K93j14k22P6P4k8N9Q8l4P6j18k48L3K08%j06p3J47nN4j49
8010h9%J75n2R2k77K83j47J56j84k8R8K0j78O3j58L80j25j06L9K48k66O8k28L70
8034A54Qj74p2J04p6j8Q1j83J08J12j05O8J87j25j34mj89J11N09m38k0L21l7r3
$$ y = [-236, 39, 210, -9, -268, -126, 88, -10, -84, -38, 63, -54, -83, -334, -46, 113, -50, 11, -120, 17, 23, -62, -181, -10, 9, 115, -49, -194, 75, -168, -113, -24, -105, 94, -24, -139, 87, 54, 14, -255, 79, -47, 0, 41, -92, -79, 22, -179, -119, -134, 88, 119, -22, 0, 43, 163, -15, -38, -58, 35, 219, -125, -65, 40, 20, 19, 32, 128, 148, 42, -101, -13, 114, 40, 21, -42, 119, 256, 131, 29, -57, 223, 20, -126, -54, 62, 14, -219, -76, -73, -4, 128, -73, -72, 89, 66, 85, 13, 40, 127, -43, 119, 86, 57, -102, 58, -109, 16, 284, 240, -99, -82, 124, 62, -126, -146, 58, 170, -95, 70, 30, 40, 9, -181, -100, 193, 79, -143, -67, 7, -21, 38, 126, 92, 168, 50, -198, -165, 43, 43, -63, -136, 11, 6, 60, -89, -89, 86, 34, 126, -151, 132, -15, 141, -43, -71, 27, 47, -131, -68, -226, 154, 29, -77, -38, 210, -56, 12, -216, 154, 162, -12, -84, 20, -56, -74, 7, -176, -68, 44, -61, 7, 194, 69, -65, -69, -258, -147, 362, -76, -96, 225, 188, 95]
8058I5j59P3J85j22j22m5K53k02n0mK90Oj22j98M3L00k65MP3P0jk63J61j15J78
8083F3M4k13P9J56j62L5j24J28K13l98J76K6J22j92j32K08L5j88P8j45K07J9L7
8106G2j75L0jJ15j36K59m3j93K53m18P5K64J1k94Q6K53K36m19j51P8K36k80R3
8129d9M4M7N3o2j67J32L3j20N9p2Q4rJ60l07K32N5j71m5k73K31M03k40j7J1P0
8154H2p8l21L95M7M1n29L88q1M0O1l16M68k08J98k39J64k11J42j60J90j81P7J16
8177H5k3K6M1J36l93Q9M6N3Rk02K74J35m54N
$$ y = [95, -64, 9, 194, 72, -50, -95, 158, -44, -94, -98, 192, 198, 76, -122, -79, 221, -44, -40, 33, 103, 102, -161, 0, -115, 63, 107, -106, -27, 129, -33, 2, -122, 6, 219, -179, -3, 23, 145, -47, -179, 29, 64, -124, -46, -191, 16, 35, 72, -103, -73, -74, 41, -95, 164, 121, -72, 181, -237, -162, 102, 113, -181, -95, 158, 394, -25, -176, -98, 138, -142, -49, -5, 42, 95, 33, -134, -2, 31, -89, -30, -102, -18, -27, 133, -174, 58, 113, -58, -103, -376, -145, 258, 18, 1, 12, 82, 4, -317, 78, 125, 166, -363, 25, -56, -16, 45, -271, 197, -11, 187, -52, 112, -99, 43, -117, 73, -108, -31, 85, 62, 88, 129, 265, -128, -39, 7, 60, 69, -133, 141, 276, -178, -173]
8191a73
$$ Imaginary data points
##PAGE= N=2
##DATA TABLE= (X++(I..I)), XYDATA
0@%%%Qj6QqJ6j6K2l0M0n3O1p2Q8j04J20j41J67j97K29k63L04l49L99m54N14n82
29c09O58p40Q31r30J037j158J288j431J590j763J954k163K392k649K936l253L609
46A899m014M476n006N626o363P253q352R751j1600J4161j7950K4130l5872O5646
60D3785k69105n62677P24380M96819m25291k38430M73957L9925n86136r7433N74968
71A74762J77216l44828j04600J57688j12439j58985J75813J92131r9353n5067
81B338J00699q9167k33353N7515K54017M6083r6213R559m5646j89581j1269K60205
93F5187J45158j13638j08221l5476r8667k0357K18043J81544j30557k05591J1161
104i1414Q4258l3885o913J33939O9822j40606j49525N5969J40010j5195j19469
$$ y = [0, 0, 0, 0, 8, -8, 0, -8, 8, -8, 14, -16, 24, -29, 32, -40, 48, -56, 64, -77, 90, -107, 122, -141, 163, -186, 213, -241, 273, -309, 349, -391, 440, -490, 547, -611, 677, -754, 836, -927, 1027, -1136, 1256, -1393, 1543, -1710, 1899, -2115, 2361, -2645, 2981, -3382, 3871, -4481, 5270, -6330, 7831, -10119, 14011, -21861, 43785, -225320, -787997, -63617, 433202, 7911, -230519, 243438, 283363, -302773, -400206, 174762, 351978, 7150, -97450, 60238, -52201, -211186, -35373, 156758, 57405, 2338, 103037, 13870, -219483, -161968, 92049, 138132, 41919, 51478, 5832, -183749, -195018, 65187, 210345, 96707, -11514, -46990, -145657, -166014, 52029, 233573, 103016, -102575, -91414, -7156, -41041, -47954, 85985, 155807, 15201, -134324, -78355, 61655, 46460, -73009]
115g3009L4718J76241j2641k59918r3293K54830J75245j73935j30973J68059N1298
126A16622k79048q9165L51430K07228k79048k38671J56969J43320j15997k0000
136d6360J73371j6236k19569k1056J67753J1442q7724O5515O4482j24176o2916
147i5474J46746M1225j70710k0708J97207K1104j99747l2174J56687O723j05967
158e5088O7043J13834j12365j55795P7860J40308k5508n0563L5203l7858j02295
169a05224O4311J58786l8512j53228K6524J08617o7621r3044J18729J17277j34451
180B164j44467J18696J53604r0045j47009N5499J24782k4684r1034K948N1073
191A1527o51k4888P625K7072R199k9296n0728k704P7066N9647n6904r8475L444
$$ y = [-73009, -38291, 137950, 125309, -134609, -227902, 26928, 202173, 28238, -102735, 65324, 116622, -162426, -251591, 99839, 307067, 28019, -210652, -53683, 89637, -26360, -46360, 127011, 110775, -108794, -129850, 37903, 49345, -38379, 27136, 91618, -32558, -95474, 51272, 92497, -78213, -98921, 98286, 119390, -80357, -112531, 44156, 50879, -55088, 11955, 125789, 13424, -142371, -64511, 75797, 50289, -274, 34929, -2929, -105224, -40913, 117873, 79361, -73867, -47343, 61274, -6347, -99391, 19338, 136615, 2164, -142303, -23607, 129997, 39952, -107057, -51558, 73224, 48540, -42494, -39546, 11527, 10876, -14012, -6387, 20685, 29884, 588, -50140, -52844, 24222, 83869, 26965, -71510, -68066]
204f8066Q7456L6840m4427l4546J9374J3660k9232j4684M8754M5245m6635q1897
216f8158J6328R3647J5140q1037k8882O2075K6804m6379j5102L7007J114l2797
228b0240Q356L2002q032k2473j6m761l65M7197K6861p7038p0038P4089R8260n2701
242C1101r3056M5910P5147o3064p4618Q1527R7257p1465j15891L3211J03283L625
254E2967o5796j9036K8326J9035j933j7125j6133J8427L2161k0779m6149K2806
266a3229O0102k4955p6523J9028R1982L677q9736l1777O1973M0721k5396k4274
278h407P004L542j0609j925J2044J8764P938k7179m1146J0719O0489J6209n7682
291a0239l2943M5158L5646l7688l5104L5864L9589l2200m6888K2940N3185j2447
$$ y = [-68066, 19390, 56230, 11803, -22743, -3369, 10291, -18941, -33625, 15129, 60374, 13739, -68158, -51830, 41817, 56957, -24080, -52962, 9113, 35917, -10462, -25564, 11443, 12557, -20240, -11884, 20118, 12086, -10387, -10403, -15164, -15529, 31668, 58529, -18509, -88547, -14458, 83802, 31101, -61955, -16045, 59102, -3962, -78580, 2947, 100204, 28739, -87152, -53941, 49342, 52967, -12829, -31865, -3539, 15496, 13563, -3562, -19695, -1268, 30893, 10114, -36035, -13229, 46873, 21918, -54605, -35577, 56405, 60082, -29654, -61431, 542, 41263, 15867, -8407, -1403, 2139, -8470, -10395, 1649, 20413, 28351, 1172, -39974, -29255, 31234, 47443, -10239, -43182, 1976, 37622, -66, -35170, 694, 40283, 8083, -38805, -15865, 37320, 24873]
303B4873o1173m465O7615L0812o1661n6357L9313O6041j5702n8996N717M9777
315B5794p052n3464K150O1145J9215n2722m2500K3466M7474P819l4608k6980J8987
328a1276L4986q115m1156k9M7965J0602n1190k2623M8546L0740m4242l8098L8387
341e503M8276k3432n3528R17M4504J7039k6294k2216J2750J9252j0126k2307J1698
354h970L6047j688m8034j7724M5672L3845l4362l8891K4827L9061j8770l9446
366b8433J2615M0934k915l9800q594L5052J8947k7705k9408J7581M0747K70m5235
379a5944k2159L8398L7927k4293m3381J3551M4169o937m8616j216N3608J7278
391D2385n2122l6022L8954M8307j9663m9855L934M6182Q179m1909j8709L5625
$$ y = [24873, -36300, -40765, 26850, 57662, -3999, -60356, -21043, 44998, 29296, -29700, -23983, 25794, 18742, -34722, -32572, 28573, 47788, -4934, -47434, -23968, 23506, 31325, -3283, -30263, -11276, 23710, 15595, -25561, -25590, 22375, 32977, -18213, -40836, 7710, 38450, -5792, -43890, -5503, 42773, 19341, -34187, -33270, 11234, 28273, 1979, -20237, -7487, 11765, 1639, -20668, -8970, 27077, 25389, -22645, -40369, 5303, 39148, 4786, -34105, -9278, 29783, 11013, -28433, -15818, 25116, 22201, -17599, -26193, 8859, 27806, 101, -29307, -11726, 29021, 29291, -15944, -38103, 295, 38222, 13929, -29452, -15901, 28268, 21331, -27285, -28501, 25107, 42385, -9737, -45759, -6805, 41502, 21839, -28016, -24082, 22100, 30279, -11630, -30339, 5286]
403E286K7392k6876l3231J7597L5647q818l7114q28L6289J2060l0347k1519J9426
416e036K5408p509k3193j91J9808L432k0294j0278K0744K0280j6019l0315O124
429a7039L5426N360l5449j6142L3160K5093k8355l4411K1243M1616j0926m6562
441b6986j169M7434J3485m6849k7218M2556M1826l1123n2370J5487N5205M09n3199
454b2512j3129M6307K2094l9407k9435L1236L6784j8692l9776M127L6463Q869
466B2929k8585j8657J7431K4358n270k5486n588K3289J5639j9285k3004J4281
478g948K8951q479l4828J972L8572P945m0001j8628L5243K7030k7814l0190K1657
491f518L2514j5829l4033R400L6814L71l7802j2915L2250K4542k1690l1449J0693
$$ y = [5286, 32678, 5802, -27429, -9832, 25815, 16997, -20117, -20945, 15344, 27404, -2943, -24462, -5036, 20372, 12863, -10330, -10521, 9287, 12719, -7575, -17853, 2891, 23171, 7152, -23163, -17039, 18387, 23747, -11702, -27844, 5316, 30409, 2054, -32357, -11114, 30502, 19576, -26986, -28155, 19279, 32764, -14085, -41303, 1253, 43079, 11956, -40414, -24927, 30278, 30687, -22512, -35641, 10666, 32760, -6647, -36082, -4846, 31938, 13246, -26530, -22403, 14060, 22929, -5656, -24313, -6882, 17476, 12206, -13280, -18868, 4421, 20060, 775, -22229, -7948, 21003, 12524, -22304, -20332, 18240, 26185, -13816, -32444, 2799, 29829, 2015, -28175, -6518, 25996, 10167, -23866, -14466, 22348, 22719, -15083, -27998, 4252, 28794, 7104, -24345, -13652]
504a3652L5296L33l7024j1837L6368K3401l2162l3696K4759M1679j4521m5897
516b6953L065M5820Q901m1685k1034L1623K8608j6650k9367N034K6495M854k2353
529c642j4786J7298K4012r861l3327l267L7251J7731l3573k7533K7714L3038k3065
542G990l7390J8243M0641j2082m2519M439M1188K142l7322p406L3028J2297k7803
555d554j7783J8743J9883q126j7630Q33J4255M189j3198j0874J1740K0053n334
568A2197k9438p419L1298K0796k6243k8890J9564L3712j5055l8580Q848M4651
580B5441J113m6740j3874M2216K3203l3597k8380K4679L1612j4191l2036J340
592a9214K7196J0454j6929j7634O209J9451J115k2006o916K7696J7136l0247l0310
$$ y = [-13652, 21644, 21977, -15047, -26884, 9484, 32885, 723, -32973, -8214, 33465, 18944, -26953, -23888, 21932, 30833, -10852, -31886, -263, 28345, 11695, -17672, -12638, 13857, 18711, -3642, -18428, -1130, 22882, 13021, -20306, -23573, 13678, 31409, -2164, -29697, -1983, 31055, 7990, -29400, -11157, 29484, 17402, -25117, -20678, 20510, 22652, -14670, -22076, 10952, 23249, -4554, -22337, -3594, 16289, 8163, -9467, -8634, 5621, 9810, -3388, -14262, -2522, 17531, 12197, -17241, -24660, 6638, 27434, 1191, -27699, -8135, 25577, 10522, -28058, -19210, 25441, 26554, -20186, -34060, 8156, 31359, -2238, -30618, -5939, 25673, 11482, -20554, -19214, 7982, 18436, 1507, -16127, -9918, 9533, 10648, -11358, -18274, 9422, 26558, -3689, -33999]
605c3999K4852L7957j4426l6359Q016L0910p809k8233Q300K9290l402k6636m717
618a6256J7664R237o151r124k133Q455J0226r772j9243Q360K8627k535l3984k747
632a9376L5703N419l8802r480M3676J9851m2530l3223L0361M0427j4057l6148
644a8179M337L0442j663l0748m057L2617J6868k7346k8061J3160K9177J108k2197
657d542p923J4367J1199r346j6124J050K0553J1059j8348k0256J3098K3516j1932
670F371k7429J2023L5913o671m2151o129L8542J5958k6376j5382J7475R474j8039
683f421j0803J7720J9075q295k3784p055J9796J8041j1891k2840P085K6143m339
696A2432l1413j625L4261Q994l2846j3356L0128J6853k8792k3476K3674L0736
$$ y = [-33999, -9147, 28810, 14384, -21975, -13959, 16951, 9142, -19091, -10791, 18499, 15097, -11539, -16256, 1408, 10645, 4494, -4630, -6763, 1692, 11918, 2146, -17097, -8737, 19890, 17355, -16629, -19376, 16327, 21746, -17056, -26536, 17140, 36991, -5539, -38762, -8401, 32026, 17969, -18179, -13842, 16600, 14937, -15811, -19868, 12749, 29617, 2271, -25790, -12630, 16547, 17655, -4542, -12465, 1902, 13101, 3755, -12369, -11319, 9234, 20293, 1945, -18311, -5213, 18303, 6371, -21058, -9035, 26878, 20207, -21944, -28073, 10469, 26427, 51, -15331, 2144, 11618, -6421, -17224, 496, 19571, 11276, -12508, -19563, 233, 18274, 6383, -16457, -9372, 16771, 12432, -18981, -20606, 13655, 22649, -10197, -23553, 6575, 23428, -5364, -28840, -5166, 25570]
708B5570j0572l1466n222K2292J4451j0256j5006L419J4769j119j8902m629K3639
721F968J5642k1704k7212J2834L3907q39l3375j0028K8477J7123k2016k0326J6109
734d440K1976j2367k4057R436K8276l626l0652n906K8381J4495k1043j8217J3056
747d688J7822p168j5363L826J3448j615j3174o57J4053O854j4028j5653P848K2972
761A4477M476k1568j5759J3095J7913o027j4619O396J6652p798k5436R14L1250
774A3966J3821k7156k5183J6462K8071p586k8309J922K9839O395k9145j5416K1888
787d31J9377j5054j8537J3277K1648j1674k9106O45L0834J4719j8778k1307L055
800a1332J3543J696n196L312Q506m014j6672p139J5543J8537n213j9580k962J4657
$$ y = [25570, 14998, -16468, -21690, 602, 15053, 4797, -10209, -6790, 7979, 6860, -12042, -16671, 6968, 22610, 906, -26306, -13472, 20435, 19596, -13779, -23807, 4670, 21793, -223, -20549, -4440, 17536, 5169, -18888, -9452, 18824, 15198, -15454, -21360, 7021, 21516, 473, -17744, -4688, 13134, 5966, -9397, -5571, 7877, 6262, -6912, -7569, 6484, 13338, -690, -16343, -8495, 14477, 18953, -2615, -18374, -5279, 12634, 6607, -8012, -1616, 15036, 7238, -18198, -17284, 13966, 27787, 631, -24552, -8090, 19981, 12395, -15914, -13992, 15847, 22242, -6903, -22319, -431, 18946, 3892, -14645, -1368, 20280, 8606, -20500, -19855, 10979, 25698, 6920, -14387, -11332, 2211, 3907, -1289, 2023, 10529, 6515, -10157, -17296, -1753, 16784, 11571, -8009, -10971, 3686]
814C686L805j4697m618J7559J0734j4428j5764O211J2606l583q934O744J4331
827A3652l822k2594j1153J8839K6758k671k7829j0448J8602R853j6613n348K5701
840A2927J1939l1853k6905K3691L5124r881l0942K044K4594j93k2096m043J9169
853C575J1257r673j3189o93Q395L912o174l565J0455J0589j1743k2978J967K7586
867I721J2791j8844j8149P892J2098o537p792J2795J4428j3020k4467L120K6386
880A0422P394j9804j0672J4982J0025j3681j2145J2072J5547o353j5327Q14J1835
893E109J666j0874m846J2220J3133p921k2604m109K3861J6338j6200k0131Q729
906e629J7425q551j7284J0654K3454n826k8908n962K4651J6523j4072j9114M347
$$ y = [3686, 7491, -7206, -11824, 5735, 16469, 2041, -13723, -7512, 5094, 1511, -7423, -679, 13652, 9830, -12764, -23917, -5078, 21680, 19009, -8820, -19268, -666, 9187, -7426, -12774, 12927, 24866, -6987, -33892, -10201, 24923, 15042, -15900, -13856, 10738, 10545, -11551, -15594, 3575, 14832, 5159, -8030, -8723, -328, 3584, -2590, -6155, 4300, 14889, 3146, -19832, -17865, 9721, 22512, 3668, -14481, -6589, 5509, -1028, -8820, 3975, 18403, 5383, -19084, -15964, 10422, 17816, -1988, -12660, 2322, 12347, -1334, -13479, -1407, 14140, 7787, -7540, -6726, 5109, 6775, -4099, -8945, 3275, 16408, 8487, -14117, -18226, 5635, 21973, 5773, -14358, -5629, 11796, 3245, -14039, -3385, 20069, 14243, -14665, -20627, 4024, 20547, 6475, -12639, -8292]
919h292J7080J202j5609n861J5228J1752j2921j7050P909J8454l560j9430J331
932i767K1381L232k2533j1063J8306J6692j0015j5826L985J0526m327q543O319
945a633J2592l335j5983n313J2270J1471l327j1363l206P431N299n652o520O053
959a216J0170m999j5201O03J8191M723j9081r143J9293J4751j7641k1660J1326
972i884K6082k160k4202m559J9183O584j7041p692J7953J3635j6292k1154P673
985a1874K3697L169j8700q993J1661R083q147q072P022R995m170j2151q15J1172
999B877N466p587p583N052Q575k122j0509j688J0499O264p026q665L411Q012k481
1014B495p499L499J0888j412j5993m609J6221J1839j1823j5086P091J4870m971
$$ y = [-8292, 8788, 9990, -5619, -11480, 3748, 15500, 2579, -14471, -6562, 11892, 8332, -11098, -9767, 11614, 14846, -7687, -18750, -444, 16248, 6233, -9593, -5608, 4918, 591, -7952, -1633, 10959, 7624, -8359, -13672, -1402, 10069, 6742, -4621, -7827, -396, 4903, -749, -7269, -1216, 8954, 3955, -11246, -10643, 7548, 12271, -6810, -15953, 3340, 18091, 450, -21210, -9884, 16198, 14038, -10164, -14723, 4460, 11044, -5997, -13689, 4264, 17899, 1607, -19547, -11874, 11823, 14992, -3708, -12701, -1040, 8043, -104, -8176, -1154, 8841, 4671, -7480, -8295, 2877, 8343, 756, -6827, -1775, 6800, 4678, -5831, -7519, 2980, 9244, 2218, -6447, -3036, 4976, 2495, -5004, -1505, 9383, 7971, -8022, -12631, 3590, 15429, 3606, -11480, -4389, 10481, 5510]
1027E510j5145L809J7765k07j9722n836J7975J1593j3521j5337Q901J6928l719
1040H994j7929k453J6774P946j2856j1029Q090J1517m381j1972J964J2538K359
1053I562j2676q169Q232J2913k044j2613l856R923O293q041p320P226R395o281
1067B544j2739L504J4915l5j4088l807J2765O025j1262q688R561J0694o946j1338
1081h895L623J2086j384j2573j491J3512N229j3097j0365J0074J3743m566j4275
1094h379j14J2766K776j0980n484R734R111o970j2641J946J4107M450j2627r642
1108a1947R082J3362m998j5579O37J6764M173j6240q108J3919J1761j1206j3836
1121a2216P879J5295l728j5732q66J4511N211j1428p700P774R015n269r126K621
$$ y = [5510, -9635, -5826, 11939, 11732, -7990, -13826, 4149, 15742, 2221, -13116, -4215, 12713, 8994, -8935, -11388, 5386, 13332, 476, -10553, -2463, 9054, 4673, -7299, -5335, 7203, 9562, -3114, -11283, -3051, 9862, 7818, -4795, -8651, 1272, 7565, -476, -7796, -570, 8825, 2544, -10195, -6691, 8224, 8189, -5899, -9706, 3059, 9084, -2178, -10866, -1305, 9389, 2443, -8895, -5272, 6814, 5430, -7143, -8634, 4878, 10107, -2990, -13355, -3281, 10462, 5896, -8379, -8493, 4273, 7049, -3931, -9415, 319, 9430, 2460, -10181, -8235, 5872, 10322, -2305, -11947, -2865, 10497, 5499, -10080, -9443, 7321, 11494, -4746, -12854, 1065, 12826, 1620, -12216, -4337, 10958, 7230, -8502, -9368, 5143, 10354, -1074, -8774, -1000, 8015, 2746, -6380, -3759]
1135c759J0047j5j0526k723R576N917p660p812N778Q504l268r272Q05R164J749
1150F505q113m631O804P165m247r514J156J1017K757j1634p194J0298J1607p733
1164D243j4519M491J5824o13j6876l128J5909P521j4116j1177J0708J3773o400
1177E640j4739J297J4424K919j2816o351R528Q884o032r696K538R734P95r582
1191c457l852P663O630n051q491K088Q791Q03q671l216Q205M975p270o966N828
1206a991Q089l569q869J831R171J00r434k491Q683N122o810p515M577Q801j675
1221D020r811j083J0774M501j1394q133R728J1736o976j3895M313J4698j394j4596
1235g512j818J3605M965j0667p534P093Q042l040p563m02O612M096m701p219J319
$$ y = [-3759, 6288, 6273, -4253, -6976, 2600, 8517, 857, -6955, -1177, 7327, 4059, -5213, -4408, 4756, 6505, -1608, -6239, 565, 7730, 3483, -6031, -4875, 6142, 8899, -2735, -9929, 369, 11976, 4243, -10276, -5785, 10039, 9426, -7450, -10578, 5331, 12852, -1264, -12441, -1733, 12040, 5640, -9099, -7802, 6622, 9541, -3275, -9626, -98, 8786, 2754, -6942, -4404, 5330, 6125, -3457, -7309, 354, 6984, 1933, -6558, -4470, 4321, 5124, -3547, -6763, 1442, 6417, -853, -7819, -1991, 6098, 2529, -6340, -4509, 4662, 4762, -4672, -7163, 1520, 6642, -168, -7683, -3106, 5695, 4020, -5791, -6874, 3900, 8401, -2993, -11126, -1398, 10338, 3362, -10533, -6220, 8478, 7084, -7512, -9330, 4275, 9240, -1427, -8961, -1868, 6174, 3134, -4429, -4831, 1781, 5877, 1176, -6043, -4724]
1250d724R640K295r698n670R165Q128q305r681O713J1501m545j2320J692J2196
1264F387N60j1395k102J0473M384r725o048P858P496n621p920L463P985j526q429
1279d160l91Q335K687o411n370L798O544r01p090j710P336M904o702q469M929
1294b671J0942k253j2293r59J2421L613j1731o301J0030Q936o887j0584K567J0152
1308D982J210q345m367O319P442m424r916R37J1554K886j1685o406J0436Q784
1322I407r174r840P263J1219n633j1708L260J1052j081j0104j95Q504J604p070
1336b496k839N068L809k381m244l00L426K829k702m601J763O591n16q371j981
1351f945J0075M785r970p826Q451J0017o298j1258M247J2450j564j3235k177J3087
$$ y = [-4724, 4916, 7211, -2487, -8157, 1008, 9136, 831, -8850, -2137, 9364, 4819, -7501, -5809, 6387, 6947, -4448, -6550, 3923, 8307, -1418, -7466, 392, 7888, 2267, -5653, -2190, 5795, 4269, -4160, -4551, 3784, 6471, 60, -5310, -1512, 5032, 4131, -2959, -4669, 2667, 7571, 869, -7600, -2671, 8271, 6018, -6275, -7234, 5187, 8800, -2931, -9232, 798, 9734, 2847, -7737, -5170, 4982, 6192, -2153, -6520, -201, 7241, 2817, -7099, -6162, 5392, 8278, -3407, -9813, 623, 9407, 233, -9607, -2344, 8875, 3242, -8466, -5206, 5846, 4765, -5339, -5534, 2970, 4574, -2496, -5335, -267, 3542, 1161, -3083, -3383, 43, 2872, 170, -4431, -2668, 3923, 3407, -4964, -6945, 3130, 7915, -2055, -9881, -1430, 8587, 2289, -8969, -4722, 7728, 6164, -7071, -9248, 3839]
1365C839N881j0457q785P041J0099l875j0165J471J0260J617r496m976O751O799
1379F004k837o722J40N784J841n417m101N153P021k470r398j050R114L004o888
1394h22l256O694L445p428n025O034P015k942o637J31M905O49l781j916M509M786
1410F361l669q436L24R901K430r154l380R513M098j1254p182J0969J1177p207
1424D491j2230K997R836j432p992R69Q323J655q164o230M454Q036N28o182l014
1439c955L825L448l630m699L199P037Qp999m241N203O127k267n650J722O353j915
1455B566r224m75J0633M826q597o818N620N112m854m368O454O019n700q389K083
1470e112Q003O34n333j242M048J586m258l433L183O061L80o616l810N036N509
$$ y = [3839, 9720, -737, -9522, -2481, 7618, 3743, -6422, -4951, 5309, 6926, -2570, -7546, -795, 6004, 3167, -3555, -3415, 2369, 4210, -1207, -5308, -155, 6866, 4396, -5002, -6052, 3062, 6066, -822, -4078, 2616, 6061, -1367, -6392, -358, 6657, 3715, -2922, -2791, 2114, 2763, -1018, -2934, 1575, 6361, 2692, -5744, -5420, 4481, 6911, -2243, -5623, 3890, 7988, -3266, -10448, 521, 11698, 4491, -7739, -4742, 5094, 3662, -4330, -3361, 4962, 6617, -1547, -7777, -3323, 4713, 5241, -941, -3955, -130, 3318, -312, -5011, -1812, 5225, 5233, -2766, -7007, -1804, 4323, 2056, -3594, -1872, 4481, 2566, -6658, -7133, 3500, 8326, -271, -7089, -1469, 3643, -1211, -5579, 875, 6894, 1194, -7195, -5112, 2891, 3525, -1808, -3050, 998, 2584, -1674, -5107, -1924, 4137, 4517, -2099, -5909, -873, 4636]
1485D636m251o229M305Q972l409j1425o74J1807M515q836o097O134N892m949o317
1500e926L891P894n92q290l833N979O994k501p534n3P414J777p625l768P817N721
1516G365n913p582L923P684k482p151J557P408k81p243j951N678L830l057l990
1531b205J277K827p72k562P97L221J102m169l531K534N573M20n586l297M904M541
1547E074m340n973M298Q107l472j0946J200J2446J627j2436l855J1604O041j0887
1561a512q122Q418R512m652r361J138P432O86n278k127M484L585l017o594J50
1576e258P910L903o096o714L329O301j547n517J529N709j169o376j007N826L246
1591D069l704l909J841L647r03m058k11M631K532m122m344K495M765j588m281
$$ y = [4636, 385, -5844, -1539, 7433, 4024, -7401, -8075, 3732, 8247, -589, -6686, -552, 5340, 391, -5926, -2035, 5859, 5267, -3023, -6856, -877, 6117, 3616, -3918, -3971, 3443, 5220, -2405, -6173, 1644, 7365, 1452, -6130, -2207, 5477, 2995, -4156, -2599, 4809, 4528, -2715, -4666, 1012, 4842, 1785, -2205, -928, 1899, 1127, -1435, -638, 2583, 3685, -484, -4015, -1481, 4092, 4512, -1074, -4371, 533, 5074, 734, -5239, -941, 7166, 3694, -7252, -6052, 6394, 8021, -4415, -8270, 3334, 9375, -1512, -9634, -1216, 8296, 3644, -5717, -4579, 2853, 3539, -1739, -3866, 618, 4203, 1186, -5408, -5258, 2652, 6555, 459, -6255, -2926, 3375, 1828, -3689, -2160, 3549, 2380, -3996, -5003, 823, 4069, 365, -3544, -1703, 1944, 1041, -3017, -3228, 1403, 3935, -187, -4531, -2036, 2729, 1141, -3140]
1606c140J692N471j248p832j787Q547N968o371p294K941O964k054o613K121P904
1621E269m67r150k700P897N786m798o453K141O053n31n395j975N338M665l086
1636B594o774K93O354J804n368k697N789M165o497o569M676R220j206q940j555
1651d711O392K103m868j337N193K020n702m144M522N446j839n280J56M401L52
1666B704m145j294M238K630l316l595J511L556n77l546J20M394R86m682l652K750
1682a918N969L19n113l561L415M064k348m461K718N984k187q635n69R509M338
1697G524p794o801N173P454l393p793J871Q411p8p917k700O776M224m909n344
1712e296L979N941k975p181P86P775J735o053k965L737K295k873j445L277K290
$$ y = [-3140, -1448, 4023, 2775, -5057, -6844, 1703, 7671, 1300, -5994, -3053, 3911, 1857, -4756, -2635, 5269, 4802, -4348, -7048, 849, 6635, 1837, -4616, -2475, 3578, 3047, -2348, -4323, 1015, 5680, 2594, -4180, -3887, 2467, 4271, -1097, -3794, 1995, 6160, -337, -6906, -2230, 6990, 5784, -3156, -4711, 1681, 3784, -1084, -2421, 2772, 4792, -910, -5054, -532, 4914, 3075, -2205, -2049, 2352, 2704, -1441, -2735, 1503, 4133, 817, -2778, -1267, 2289, 1712, -1834, -1714, 2680, 3666, -1016, -4668, -1918, 4051, 4370, -743, -4304, -889, 3175, 827, -3634, -916, 5068, 2881, -5754, -6323, 3186, 7524, -270, -7071, -1898, 5556, 2163, -5630, -3759, 4652, 4574, -3343, -6043, 733, 4957, 48, -5296, -1317, 4624, 1649, -5532, -4746, 3029, 4764, -1289, -4254, -517, 1778, -1095, -2540, 737, 3027]
1727C027l306l623J150M014J814k464l078L36L134M57l043q41L919K058m407l995
1743d848L530N996k385o586J193P253L21p583l441P544O178n137p598K125P629
1758D191m75o957n29P302K477p672n477O267P921k946p970k95O378K062n199k362
1774c284M365L414l491m347J367M900P17m572j872L622K539k711l880J772M985
1789C524R9m740j880L534K288k961k214L379K925l266n224J941O386R61o176k851
$$ y = [3027, -279, -3902, -2752, 1262, 3076, 612, -2466, -2130, 1004, 1461, -1582, -2423, 1496, 3554, -853, -4848, -1318, 4678, 2293, -4293, -3100, 4153, 4474, -3109, -6550, 994, 7172, 2035, -5563, -3438, 4191, 3716, -3241, -3770, 3532, 6009, -1663, -7140, -873, 7048, 4102, -3868, -4163, 2215, 4277, -922, -3284, 1081, 4495, 1004, -3343, -1976, 2924, 3641, -931, -2803, 819, 3358, 647, -3233, -1461, 3524, 3623, -1117, -2997, 537, 2825, -136, -2350, 1029, 3954, 688, -4536, -2595, 3791, 4752, -1424, -4275]
$$ [...]
8191b3
##END NTUPLES=NMR FID
##END=
