##TITLE=1H_1BM1003
 CDCl3, 8 sc, 
 12.3.2019
##JCAMPDX= 6.0         $$ Bruker NMR JCAMP-DX V2.0
##DATA TYPE= NMR FID
##DATA CLASS= NTUPLES
##ORIGIN= UXNMR, Bruker Analytische Messtechnik GmbH
##OWNER= root
$$ XWIN-NMR		Version 3.5
$$ Tue Mar 12 14:48:56 2019 Russian Standard Time (UT+4h)  she@DPX200
##.OBSERVE FREQUENCY= 200.1316
##.OBSERVE NUCLEUS= ^1H
##.DELAY= (6, 6)
##.ACQUISITION MODE= SIMULTANEOUS
##.ACQUISITION SCHEME= undefined
##.AVERAGES= 8
##.DIGITISER RES= 18
##SPECTROMETER/DATA SYSTEM= spect
##.PULSE SEQUENCE= zg30
##.SOLVENT NAME= CDCl3
##.SHIFT REFERENCE= (INTERNAL, CDCl3, 0, 15.7039)
##AUDIT TRAIL= $$ (NUMBER, WHEN, WHO, WHERE, WHAT)
$$ ##TITLE= Audit trail, XWIN-NMR		Version 3.5
$$ ##JCAMPDX= 5.01
$$ ##ORIGIN= Bruker BioSpin GmbH
$$ ##OWNER= she
$$ F:/spectra/data/she/nmr/H-F/1/audita.txt
$$ ##AUDIT TRAIL=  $$ (NUMBER, WHEN, WHO, WHERE, WHAT)
(   1,<2019-03-12 14:47:54.12 +0400>,<she>,<DPX200>,
      <created by zg, POWCHK disabled, PULCHK disabled
       configuration hash MD5:
       00 E9 B6 7A A2 85 ED C7 34 08 36 98 17 FE 4E 26
       data hash MD5: 16K
       EF 19 DA 4E 5F 42 54 6F 78 9C 08 36 8A A9 34 13>)
$$ ##END=
$$ 
$$ hash MD5
$$ 25 8D E3 22 B6 98 74 05 08 F5 D2 19 04 1C 74 2D
##$RELAX= 
##$RELAX= 
##$RELAX= 
##$RELAX= 
##$RELAX= 
##$RELAX= 
$$ Bruker specific parameters
$$ --------------------------
##$DU= <F:/spectra>
##$EXPNO= 1
##$NAME= <H-F>
##$PROCNO= 1
##$TYPE= <nmr>
##$USER= <she>
##$AMP= (0..31)
100 100 100 100 100 100 100 100 100 100 100 100 100 100 100 100 100 100 
100 100 100 100 100 100 100 100 100 100 100 100 100 100 
##$AQSEQ= 0
##$AQ_mod= 1
##$AUNM= <au_zg>
##$AUTOPOS= <>
##$BF1= 200.13
##$BF2= 200.13
##$BF3= 200.13
##$BF4= 200.13
##$BF5= 200.13
##$BF6= 200.13
##$BF7= 200.13
##$BF8= 200.13
##$BYTORDA= 1
##$CFDGTYP= 0
##$CFRGTYP= 5
##$CHEMSTR= <none>
##$CNST= (0..31)
1 1 145 1 1 1 1 1 1 1 1 1 1 1 1 1 1 1 1 1 1 1 1 1 1 1 1 1 1 1 1 1 
##$CPDPRG= <>
##$CPDPRG1= <>
##$CPDPRG2= <>
##$CPDPRG3= <>
##$CPDPRG4= <mlev>
##$CPDPRG5= <mlev>
##$CPDPRG6= <mlev>
##$CPDPRG7= <mlev>
##$CPDPRG8= <mlev>
##$CPDPRGB= <>
##$CPDPRGT= <>
##$D= (0..31)
0 1.2 0 0 0 0 0 0 0 0 0 0.03 0 0 0 0 0 0 0 0 0 0 0 0 0 0 0 0 0 0 0 0 
##$DATE= 1552387673
##$DBL= (0..7)
120 120 120 120 120 120 120 120 
##$DBP= (0..7)
150 150 150 150 150 150 150 150 
##$DBP07= 0
##$DBPNAM0= <>
##$DBPNAM1= <>
##$DBPNAM2= <>
##$DBPNAM3= <>
##$DBPNAM4= <>
##$DBPNAM5= <>
##$DBPNAM6= <>
##$DBPNAM7= <>
##$DBPOAL= (0..7)
0.5 0.5 0.5 0.5 0.5 0.5 0.5 0.5 
##$DBPOFFS= (0..7)
0 0 0 0 0 0 0 0 
##$DE= 6
##$DECBNUC= <off>
##$DECIM= 24
##$DECNUC= <off>
##$DECSTAT= 4
##$DIGMOD= 1
##$DIGTYP= 9
##$DL= (0..7)
0 120 120 120 120 120 120 120 
##$DP= (0..7)
150 150 150 150 150 150 150 150 
##$DP07= 0
##$DPNAME0= <>
##$DPNAME1= <>
##$DPNAME2= <>
##$DPNAME3= <>
##$DPNAME4= <>
##$DPNAME5= <>
##$DPNAME6= <>
##$DPNAME7= <>
##$DPOAL= (0..7)
0.5 0.5 0.5 0.5 0.5 0.5 0.5 0.5 
##$DPOFFS= (0..7)
0 0 0 0 0 0 0 0 
##$DQDMODE= 0
##$DR= 18
##$DS= 0
##$DSLIST= <SSSSSSSSSSSSSSS>
##$DSPFIRM= 0
$$ [...]
##$SUBNAM2= <"">
##$SUBNAM3= <"">
##$SUBNAM4= <"">
##$SUBNAM5= <"">
##$SUBNAM6= <"">
##$SUBNAM7= <"">
##$SUBNAM8= <"">
##$SUBNAM9= <"">
##$SW= 24.9336934301222
##$SWIBOX= (0..15)
0 0 2 0 0 0 0 0 0 0 0 0 0 0 0 0 
##$SW_h= 4990.01996007984
##$TD= 16384
##$TD0= 1
##$TE= 0
##$TE2= 300
##$TE3= 300
##$TEG= 300
##$TL= (0..7)
0 120 120 120 120 120 120 120 
##$TP= (0..7)
150 150 150 150 150 150 150 150 
##$TP07= 0
##$TPNAME0= <>
##$TPNAME1= <>
##$TPNAME2= <>
##$TPNAME3= <>
##$TPNAME4= <>
##$TPNAME5= <>
##$TPNAME6= <>
##$TPNAME7= <>
##$TPOAL= (0..7)
0.5 0.5 0.5 0.5 0.5 0.5 0.5 0.5 
##$TPOFFS= (0..7)
0 0 0 0 0 0 0 0 
##$TUNHIN= 0
##$TUNHOUT= 0
##$TUNXOUT= 0
##$USERA1= <user>
##$USERA2= <user>
##$USERA3= <user>
##$USERA4= <user>
##$USERA5= <user>
##$V9= 5
##$VALIST= <valist>
##$VCLIST= <CCCCCCCCCCCCCCC>
##$VD= 0
##$VDLIST= <DDDDDDDDDDDDDDD>
##$VPLIST= <PPPPPPPPPPPPPPP>
##$VTLIST= <TTTTTTTTTTTTTTT>
##$WBST= 1024
##$WBSW= 4
##$XGAIN= (0..3)
0 0 0 0 
##$XL= 0
##$YL= 0
##$YMAX_a= 26779
##$YMIN_a= -31753
##$ZGOPTNS= <>
##$ZL1= 120
##$ZL2= 120
##$ZL3= 120
##$ZL4= 120
##$ABSF1= 10
##$ABSF2= 0
##$ABSG= 5
##$ABSL= 3
##$ALPHA= 0
##$AQORDER= 0
##$ASSFAC= 0
##$ASSFACI= 0
##$ASSFACX= 0
##$ASSWID= 0
##$AUNMP= <proc_1d>
##$AZFE= 0.1
##$AZFW= 0.1
##$BCFW= 1
##$BC_mod= 2
##$BYTORDP= 1
##$COROFFS= 0
##$CY= 11.3945322036743
##$DATMOD= 1
##$DC= 2
##$DFILT= <>
##$DTYPP= 0
##$F1P= 18.9103706918063
##$F2P= -1.10871071338519
##$FCOR= 0.5
##$FTSIZE= 0
##$FT_mod= 4
##$GAMMA= 1
##$GB= 0.15
##$INTBC= 1
##$INTSCL= 1
##$ISEN= 128
##$LB= 0.24
##$LEV0= 0
##$LPBIN= 0
##$MAXI= 10000
##$MC2= 0
##$MEAN= 0
##$ME_mod= 0
##$MI= 1.114404
##$NCOEF= 0
##$NC_proc= 0
##$NLEV= 6
##$NOISF1= 3.799351
##$NOISF2= 2.8
##$NSP= 1
##$NTH_PI= 0
##$NZP= 0
##$OFFSET= 15.70392
##$PC= 1
##$PHC0= -8924.695
##$PHC1= 1.000254
##$PH_mod= 1
##$PKNL= yes
##$PPARMOD= 0
##$PSCAL= 0
##$PSIGN= 0
##$REVERSE= no
##$SF= 200.130013532006
##$SI= 16384
##$SIGF1= 3
##$SIGF2= 2
##$SINO= 400
##$SIOLD= 16384
##$SREGLST= <1H.CDCl3>
##$SSB= 0
##$STSI= 0
##$STSR= 0
##$SW_p= 3612.71676300578
##$SYMM= 0
##$S_DEV= 0
##$TDeff= 0
##$TDoff= 0
##$TI= <>
##$TILT= no
##$TM1= 0
##$TM2= 0
##$TOPLEV= 0
##$USERP1= <user>
##$USERP2= <user>
##$USERP3= <user>
##$USERP4= <user>
##$USERP5= <user>
##$WDW= 1
##$XDIM= 8192
##$YMAX_p= 0
##$YMIN_p= 0
$$ End of Bruker specific parameters
$$ ---------------------------------
##NTUPLES= NMR FID
##VAR_NAME=  TIME,          FID/REAL,        FID/IMAG
##SYMBOL=    X,             R,               I
##VAR_TYPE=  INDEPENDENT,   DEPENDENT,       DEPENDENT
##VAR_FORM=  AFFN,          ASDF,            ASDF
##VAR_DIM=   8192,          8192,            8192
##UNITS=     SECONDS,       ARBITRARY UNITS, ARBITRARY UNITS
##FACTOR=    0.0002004,     1,               1
##FIRST=     0,             0,               0
##LAST=      1.6414764,     0,               0
##MIN=       0,             -31753,          0
##MAX=       1.6414764,     26779,           0
$$ Real data points
##PAGE= N=1
##DATA TABLE= (X++(R..R)), XYDATA
$$ plain form
0 0 0 0 0 0 0 0 0 0 0 0 0 0 0 0 0 0 0 0 0 0 0 0 0 2 -8 8 -8 8 -8 8 -8 8 -10 15 -16 16 -16 18 -23 24 -26 29 -32 34
44 34 -39 43 -50 55 -60 68 -81 90 -106 126 -156 196 -260 371 -610 1308 -7235 -31753 -5308 15474
64 15474 979 -394 12799 -4033 -22871 -189 21969 3844 -11528 -1233 -1252 -9084 7438
77 7438 19760 -3882 -20874 -1564 10823 -1022 -473 10106 -1334 -14135 479 12746 -208
90 -208 -8061 1387 2983 -2420 2807 4727 -6667 -7951 5467 7352 -2371 -2536 1135 -3372 -2654 6570
106 6570 4456 -7664 -7923 2064 6194 5168 2231 -5916 -9953 -790 8149 6020 1852 -1915 -9029
121 -9029 -6849 8575 12537 -2345 -9405 -2025 388 666 9157 7517 -10320 -13537 3792 9472
135 9472 862 1499 2205 -10244 -10007 10310 12800 -6763 -8883 4577 1204 -5864 5675 9116 -9191
$$ packed form
0@%%%%%%%%%%%%%%%%%%%%%%%Kj0J6j6J6j6J6j6J6j8K5l1L2l2L4m1M7n0N5o1O6
44C4p3Q2r3J05j15J28j49J71j96K32k82L52m56O31r81J918q543k4518K6445K0782
64A5474j4495j373J3193j6832j8838K2682K2158j8125j5372J0295j9p832J6522
77G438J2322k3642j6992J9310J2387j1845N49J0579j1440j2801J4614J2267j2954
90b08p853R448J596n403N227J920j1394j284J3418J885r723j65L671m507P18R224
106F570k114j2120k59R987M130j026k937q147m037R163Q939k129m168l767p114
121i029K180J5424L962j4882p060P380K413K78Q491j640j7837l217J7329N680
135I472q610O37P06j2449K37K0317K490j9563k120J3460l373p068J1539L441j8307
$$ plain form
150 -9191 -12066 7450 9974 -4319 -2528 4815 -4281 -7079 7954 8327 -8616 -6786 8308 3895
164 3895 -6212 1678 5101 -8045 -6859 10681 8744 -8027 -6412 3902 -407 -3033 6446 4244
178 4244 -9629 -6355 7928 5624 -3665 -730 663 -6607 -2520 10489 6832 -7179 -6723 1539
192 1539 1151 802 5505 1790 -7172 -4129 4962 4254 -500 -564 -2050 -4413 915 6718 2044 -4483
208 -4483 -3105 -416 -209 2349 3504 -1563 -4328 -94 2229 117 272 499 -2701 -1875 3643 2924
224 2924 -2702 -1982 1442 -507 -769 3546 1614 -4534 -1649 4493 1160 -3250 582 1781 -3030 -762
240 -762 5476 1064 -5971 -1522 3806 -368 -1706 3284 580 -5940 -1153 5918 917 -4454 305
255 305 2212 -2784 -871 5059 889 -5384 -997 3722 -89 -1239 2742 362 -4288 78 4624
$$ packed form
150i191k875J9516K524j4293J791P343r096k798J5033L73j6943J830J5094m413
164C895j0107P890L423j3146J186J7540j937j6771J615J0314m309k626R479k202
178D244j3873L274J4283k304r289K935J393p270M087J3009l657j4011M56Q262
192A539l88l49M703l715q962L043R091p08m754o4j486k363N328N803m674o527
208d483J378K689K07K558J155n067k765M234K323k112J55K27l200Q26N518p19
224B924n626P20L424j949k62M315j932o148K885O142l333m410L832J199m811K268
240g62O238m412p035M449N328m174j338M990k704o520M787P071n001n371M759
255C05J907m996J913N930m170o273M387M719l811j150L981k380m650M366M546
$$ plain form
270 4624 -200 -3143 1558 1733 -3078 -672 4087 19 -4175 372 2992 -1511 -1876 2368 666 -3128
286 -3128 -104 2708 -965 -2225 1737 1428 -2381 -852 2339 130 -1797 903 1544 -1341 -961 1620
302 1620 737 -917 180 450 -815 166 1470 -283 -1361 433 664 -782 262 1259 -1159 -2051 1014
319 1014 1721 -1039 -1045 952 -294 -1503 1041 1850 -1409 -2046 1108 1529 -454 -53 506 -1318 -1103 1950
337 1950 1920 -977 -1153 372 -13 65 1655 608 -2253 -1412 1646 1562 -191 -472 -1059 -1847 313 2805
355 2805 889 -2127 -1466 46 -93 836 1987 -568 -3391 -874 2982 1978 -924 -1279 -913 -915 1097
372 1097 3128 1081 -2492 -2394 329 1866 1777 543 -1637 -2329 98 2580 1801 -816 -2323 -1857 287
389 287 2485 2085 -847 -2811 -1822 570 2205 1862 -641 -2843 -1617 1654 2631 560 -1558 -2035 -975
$$ packed form
270D624m824k943M701J75m811K406M759m068m194M547K620m503l65M244j702l794
286c128L024K812l673j260L962l09l809J529L191k209j927K700O41k885L80K581
302A620q83j654J097K70j265R81J304j753j078J794K31j446J044R97k418q92L065
319A014P07k760oJ997j246j209K544Q09l259o37L154M21j983M01N59j824K15L053
337A950l0k897j76J525l85P8J590j047k861Q41L058q4j753k81n87p88K160K492
355B805j916l016O61J512j39R29J151k555k823K517L856j004k902l55L66kK012
372A097K031k047l573R8K723J537q9j234k180o92K427K482p79k617j507M66K144
389B87K198m00k932j964R89K392J635l43k503k202J226L271R77k071k118m77J060
$$ plain form
406 -975 1348 3061 1466 -2080 -3057 -363 2354 2386 402 -1681 -2243 -455 2105 2396 -177 -2714 -2323
423 -2323 533 2797 2125 -813 -3024 -2257 635 2722 1945 -866 -2832 -1885 1091 2960 1613 -1599
439 -1599 -3090 -1144 2156 3256 1180 -1932 -3136 -1162 2233 3444 1016 -2300 -2873 -539 2195
454 2195 2887 589 -2788 -3296 118 3307 2478 -816 -2921 -2600 -139 2882 3122 -450 -3591 -2434
470 -2434 1052 2855 1868 -839 -3120 -2106 1760 3739 1379 -1971 -2878 -1367 1455 3606 2123 -2146
486 -2146 -3725 -735 2400 2521 642 -1792 -3103 -896 3033 3264 -571 -3191 -2366 -99 2286 3230
502 3230 361 -3751 -3260 1061 3188 1702 -477 -2341 -2689 544 4126 2400 -2310 -3406 -881 1316
518 1316 2740 2778 -834 -4445 -2164 2955 3527 338 -1583 -2184 -1866 1212 4013 1240 -3601 -3409 368
$$ packed form
406i75K323J713j595l546r77K694K717L2j984k083n62J788K560K91k573k537L91
423b323K856K264o72k938k211P67K892K087p77k811j966R47K976J869j347l212
439a599j491J946L300J100k076l112j204J974L395J211k428l316n73K334K734
454B195O92k298l377n08L414L189q29l294k105L21K461L021K40l572l141J157
470b434L486J803r87k707k281J014L866J979k360l350r07J511K822K151j483m269
486b146j579K990L135J21j879k434j311K207L929K31l835k620Q25K267K385R44
502C230k869m112M91M321K127j486k179j864l48L233L582j726m710j096K525K197
518A316J424L8l612l611K281N119N72l189j921o01L18L078K801k773m841J92L777
$$ plain form
535 368 2230 2027 1006 -1783 -3817 -1016 3293 2891 -731 -2390 -1619 -80 2031 2643 -201 -3083
551 -3083 -1821 1466 2653 1463 -625 -2483 -1960 1218 3081 1167 -1662 -2249 -817 1263 2446 979
567 979 -2099 -2922 -323 2403 2373 41 -2409 -2682 -219 2434 2400 63 -2246 -2614 -200 3045 2862
584 2862 -966 -3209 -1455 995 2094 2289 365 -3180 -3142 1424 3798 1186 -1298 -1495 -1733 -663
600 -663 2832 3139 -1739 -3997 -337 2219 841 307 479 -1976 -2895 1183 3744 300 -2619 -1015
616 -1015 416 67 1110 1592 -1203 -2525 640 2623 481 -1033 -387 -687 -682 1773 2387 -1139 -2894
633 -2894 -101 1894 757 63 -59 -1690 -1866 1432 3058 -15 -2666 -1499 188 665 1618 1553 -1441
650 -1441 -3346 -511 2802 1913 -555 -1092 -1065 -1122 818 3021 1197 -2610 -2433 871 1889 636 398
$$ packed form
535C68J862k03j021k789k034K801M309m02l622j659P71J539K111O12k844k882
551c083J262L287J187j190k088j858N23L178J863j914k829n87J432K080J183j467
567I79l078q23K599K726l0k332k450k73K463K653l4k337k309l68K414L245j83
584B862l828k243J754K450J099J95j924l545L8M566K374k612k484j97k38J070
600f63L495L07m878k258L660K556j378n34J72k455r19M078K561l444k919J604
616a015J431l49J043M82k795j322L165J983k142j514O46l00NK455O14l526j755
633b894K793J995j137o94j22j631j76L298J626l073k651J167J687M77R53o5k994
650a441j905K835L313q89k468n37K7n7J940K203j824l807J77L304J018j253k38
$$ plain form
667 398 74 -1828 -1811 1483 2768 -236 -2142 -458 574 -301 264 1275 -448 -1999 -35 1652 -31
684 -31 -1107 402 480 -1003 -127 1416 -205 -1645 615 1989 -444 -1650 357 885 -506 351 1611
701 1611 -527 -2297 14 1994 519 -543 104 -786 -1705 690 2645 122 -2346 -872 563 -245
717 -245 341 1869 -35 -2888 -1277 2001 1487 -523 -189 44 -1373 -784 1908 1860 -917 -1491 168
734 168 337 -227 874 1378 -708 -1808 94 1275 42 -314 755 -34 -1684 -548 1568 676 -1035
751 -1035 -179 559 -1044 -1151 1329 1611 -1005 -1385 523 240 -837 768 1781 -723 -2030 363 1408
768 1408 -304 -85 1355 -416 -2236 272 2397 62 -1491 531 629 -1635 -536 2226 692 -2056
784 -2056 -611 1145 -516 -971 1324 945 -1682 -998 1246 143 -1097 871 1400 -1336 -1642 1166
$$ packed form
667C98l24j902J7L294J285l004j906J684J032q75N65J011j723j551J964J687j683
684c1j076J509P8j483Q76J543j621j440K260J374k433j206K007N28j391Q57J260
701A611k138j770K311J980j475j062O47q90r19K395J955k523k468J474J435q08
717b45N86J528j904k853J611L278n14k010L34K33j417N89K692m8k777n74J659
734A68J69n64J101N04k086j100J902J181j233l56J069p89j650J136K116q92j711
751a035Q56P38j603j07K480K82k616l80J908k83j077J605J013k504j307K393J045
768A408j712K19J440j771j820K508K125k335j553K022R8k264J099K762j534k748
784b056J445J756j661m55K295l79k627O84K244j103j240J968N29k736l06K808
$$ plain form
800 1166 1280 -759 -52 1197 -652 -1773 711 2039 5 -937 87 -299 -965 814 1909 -258
816 -258 -1879 -432 659 14 263 1019 -385 -2025 -645 1571 1122 -564 -782 -290 -414 -39 1070
833 1070 932 -674 -1292 -73 897 478 -3 104 -277 -724 202 1199 233 -1050 -221 845 -42 -640 465
852 465 483 -925 -478 1159 293 -1537 -465 1235 228 -786 251 167 -1247 -218 1880 662 -1568
869 -1568 -669 682 -102 124 1598 178 -2296 -727 2011 976 -723 225 84 -1766 -359 2687
885 2687 1231 -2116 -1306 828 0 -301 1530 604 -2408 -1449 1771 1203 -910 -168 317 -1367 -751
902 -751 2018 1303 -1711 -1225 1015 431 -569 660 787 -1105 -924 1163 996 -652 -511 304 -37 51
920 51 734 11 -1051 -222 873 310 -376 -160 -344 -570 376 1000 -80 -1109 -609 226 597 711 111
$$ packed form
800A166J14k039P07J249j849j121K484J328k034r42J024l86o66J779J095k167
816b58j621J447J091o45K49P56j404j640J380K216m49j686k18M92j24L75J109
833A070j38j606o18J219R70m19m81J07l81m47R26R97r66j283Q29J066q87n98J105
852D65J8j408M47J637q66j830J072J700j007j014J037q4j414J029K098j218k230
869a568Q99J351p84K26J474j420k474J569K738j035j699R48j41j850J407L046
885B687j456l347Q10K134q28l01J831r26l012R59L220n68k113P42M85j684O16
902g51K769p15l014M86K240n84j000J229J27j892J81K087j67j648J41Q15l41Q8
920E1O83p23j062Q29J095n63o86K16j84k26R46O24j080j029N00Q35L71J14o00
$$ plain form
939 111 -1016 -957 360 1047 625 -9 -720 -1002 77 1361 885 -439 -788 -556 -145 947 1326 -269
957 -269 -1581 -534 667 436 362 417 -895 -1565 323 1658 108 -1064 -196 -75 -671 542 1550 -392
975 -392 -1859 -8 1372 101 -374 503 -206 -1125 448 1613 -118 -1233 115 568 -269 337 968
992 968 -685 -1489 532 1468 -225 -865 119 -151 -700 592 1155 -627 -1393 81 693 23 226 294 -959
1011 -959 -980 883 1246 -332 -732 35 -141 -188 870 867 -727 -1013 297 700 188 193 -41 -797 -412 804
1031 804 679 -383 -468 -138 -251 71 662 103 -823 -426 356 224 9 152 -246 -588 173 785 110 -482
1051 -482 -110 104 13 390 468 -352 -569 299 569 5 -38 102 -425 -381 671 706 -499 -743 75 198 -28
1072 -28 289 155 -754 -637 490 603 -157 -210 -94 -485 -190 836 627 -625 -706 182 372 143 339 129
$$ packed form
939A11j127N9J317O87m22o34p11k82J079J284m76j324l49K32M11J092L79j595
957b69j312J047J201k31p4N5j312o70J888J335j550j172Q68J21n96J213J008j942
975c92j467J851J380j271m75Q77p09r19J573J165j731j115J348M53q37O06O31
992I68j653q04K021R36j693o40R84k70n49J292N63j782p66J474O12o70K03O8j253
1011i59k1J863L63j578m00P67j76m7J058lj594k86J310M03n12Nk34p56L85J216
1031H04j25j062q5L30j13L22N91n59r26L97P82j32k15J43l98l42P61O12o75n92
1051d82L72K14r1L77P8q20k17Q68K70n64m3J40n27M4J052L5j205k44Q18J23k26
1072b8L17j34r09J17J127J13p60n3J16l91K95J026k09j252q1Q88J90k29J96k10
$$ plain form
1092 129 -565 -413 480 597 74 -139 -220 -354 99 691 273 -501 -408 43 41 90 296 -60 -599 -286 335 238
1114 238 -107 -58 -81 -294 -14 425 205 -291 -178 174 140 1 99 108 -45 -63 122 180 43 -61 -19 88 59
1137 59 -49 -72 -22 -27 -23 4 -86 -205 -126 100 84 -163 -151 -15 -35 -54 116 136 -132 -226 20 229 190 19 -115 -69
1163 -69 98 188 112 60 55 -107 -128 176 299 -28 -226 -60 47 -18 49 108 -162 -295 -27 141 -26 -108 -16 -83
1187 -83 -141 25 140 28 -79 -72 -19 72 135 23 -51 85 76 -82 42 237 32 -163 101 176 -183 -108 295 62
1211 62 -407 -35 330 -204 -411 284 308 -499 -382 438 175 -442 -3 362 -260 -363 370 309 -323 -48 354
1232 354 -180 -290 548 416 -510 -201 598 67 -467 324 523 -482 -479 553 274 -546 -16 448 -418 -561
1252 -561 502 393 -653 -301 573 -117 -671 302 595 -477 -518 524 259 -541 29 612 -149 -490 317
$$ packed form
1092A29o94J52Q93J17n23k13q1j34M53N92m18p74R3M51kM9K06l56n39L13O21r7
1114B38l45M9k3k13K80M39k20m96J13L52l4j39R8Rj53j8J85N8j37j04M2J07k9
1137E9j08k3N0nMK7r0j19P9K26j6k47J2J36k0j9J70K0k68r4K46K09l9j71j34M6
1163f9J67R0p6n2nj62k1L04J23l27j98J66J07o5O7N9k70j33K68J68j67q2R2o7
1187h3n8J66J15j12j07PN3R1O3j12p4J36rj58J24J95k05j95K64P5l59P5M03k33
1211F2m69L72L65n34k07O95K4q07J17Q20k63o17M39L65o22j03P33o1o32K75M02
1232C54n34j10Q38j32r26L09P99n31n34P91J99j005LJ032k79q20N30M64q66j43
1252e61J063j09j046L52Q74o90n54R73K93j072m1J042k65q00N70N83p61l41Q07
$$ plain form
1271 317 392 -319 -84 484 56 -393 89 308 -113 -47 240 -98 -341 85 188 -146 -35 143 -245 -385 177
1292 177 308 -125 -156 -12 -226 -109 382 230 -274 -74 115 -240 -8 674 220 -653 -189 521 36 -195
1312 -195 478 221 -766 -255 752 158 -510 195 224 -791 -279 966 182 -994 -56 671 -500 -579 873
1331 873 433 -1125 -303 1045 -48 -881 510 764 -802 -493 1069 279 -1068 196 1139 -400 -871
1348 -871 724 566 -895 -67 1164 -206 -1250 314 925 -514 -436 819 -90 -1325 117 1348 -76
1365 -76 -981 144 222 -697 108 1182 -2 -1139 -217 544 55 208 636 -331 -1080 46 980 296 -206
1384 -206 26 -309 -603 245 873 165 -545 -429 -224 50 495 289 -401 -401 -31 -111 32 517 133 -626 -268
1405 -268 398 14 -188 412 234 -500 -116 481 -163 -344 709 554 -786 -445 704 80 -502 699 763
$$ packed form
1271C17P5p11K35N68m28m49M82K19m21O6K87l38k43M26J03l34J11J78l88j40N62
1292A77J31m33l1J44k14J17M91j52n04K00J89l55K32O82m54q73M64P10m85k31
1312a95O73k57r87N11J007n94o68P05K9j015N12J245p84j176R38P27j171p9J452
1331H73m40j558Q22J348j093q33J391K54j566L09J562p90j347J264R43j539m71
1348h71J595j58j461Q28J231j370j044J564O11j439P8J255r09j235J442J231j424
1365g6r05J125P8r19Q05J074j184j137R22P61m89J53M28r67p49J126R34o84n02
1384b06K32l35k94Q48O28p08p10J16K05K74M45k06o90%L70q0J43M85l84p59L58
1405b68O66l84k02O00j78p34L84N97o44j81J053j55j340L41J149o24n82J201O4
$$ plain form
1424 763 -1162 -1079 999 888 -607 -73 536 -1014 -1154 1262 1489 -887 -1124 351 -185 -661 1198 1394
1442 1394 -1341 -1777 755 1082 -357 295 910 -1148 -1694 1116 1945 -414 -1010 297 -222 -840 935
1459 935 1547 -744 -1506 296 593 -387 333 858 -841 -1364 631 1137 -515 -562 559 -84 -862 307
1477 307 922 -368 -668 487 396 -492 -109 477 -68 -196 497 206 -664 -293 584 425 -73 -109 -287 -435
1497 -435 122 625 309 -266 -584 -611 69 919 525 -633 -764 -160 -19 342 907 92 -1245 -701 710
1516 710 656 52 253 -180 -1141 -215 1480 750 -891 -446 331 -318 -122 1195 473 -1350 -659 971 327
1535 327 -533 368 336 -1041 -431 1231 339 -1174 -137 841 -377 -639 782 366 -1143 -175 1264 43
1553 43 -1107 156 727 -436 -165 1022 -40 -1314 47 1281 118 -619 226 -36 -871 222 1353
$$ packed form
1424G63j925Q3K078j11j495N34O09j550j40K416K27k376k37J475n36m76J859J96
1442A394k735m36K532L27j439O52O15k058n46K810Q29k359n96J307n19o18J775
1459I35O12k291p62J802K97r80P20N25j699n23J995N06j652m7J121o43p78J169
1477C07O15j290l00J155r1q88L83N86n45j28O93k91q70L71Q77j59m98l6j78j48
1497d35N57N03l16n75l18k7O80Q50l94j158j31O04J41L61N65q15j337N44J411
1516G10n4o04K01m33r61R26J695p30j641M45P77o49J96J317p22j823O91J630o44
1535C27q60R01l2j377O10J662q92j513J037R78j218k62J421m16j509R68J439j221
1553D3j150J263N71j163K71J187j062j274J361J234j163p37Q45k62q35J093J131
$$ plain form
1570 1353 22 -1259 -334 450 -29 165 672 -324 -1254 -184 978 433 -243 -195 -422 -500 411 927 98
1589 98 -628 -340 -4 169 566 424 -404 -616 59 439 316 154 -173 -483 -70 441 175 -140 -9 -120
1609 -120 -370 129 536 -175 -656 58 412 -172 -226 248 -129 -467 299 589 -339 -522 295 239 -277 255 530
1630 530 -526 -696 599 786 -354 -367 322 -153 -469 536 734 -542 -750 308 295 -287 228 413 -652
1649 -652 -737 566 656 -417 -320 310 -221 -494 517 681 -480 -585 363 301 -248 190 450 -336 -468 404
1669 404 443 -249 -152 243 -90 -252 271 265 -334 -225 222 4 -218 92 133 -287 -180 238 11 -276 -14 115
1691 115 -114 -56 159 -65 -179 134 172 -136 -13 236 -27 -223 168 282 -119 -143 203 60 -174 82 193
1712 193 -117 -109 149 -57 -222 133 227 -247 -251 199 49 -269 54 269 -218 -340 196 251 -140 -28 188 -168
$$ packed form
1570A353j331j281R25P84m79J94N07r96r30J070J162n45o76M8k27p8R11N16q29
1589I8p26K88L36J73L97j42q28k12O75L80j23j62l27l10M13N11k66l15J31j11
1609a20k50M99M07p11m81P14L54n84n4M74l77l38P66K90r28j83Q17n6n16N32K75
1630E30j056j70J295J87j140j3O89m75l16J005J98j276k08J058j3n82N15J85j065
1649f52q5J303R0j073R7O30n31k73J011J64j161j05R48o2n49M38K60p86j32Q72
1669D04L9o92R7L95l33j62N23on99J09M47k18k22L10M1m20J07M18k27k87K62J29
1691A15k29N8K15k24j14L13L8l08J23K49k63j96L91J14m01k4L46j43k34K56J11
1712A93l10QK58k06j65L55R4m74mM50j50l18L23K15m87j22N36N5l91J12K16l56
$$ plain form
1734 -168 -229 336 370 -230 -233 200 48 -140 250 288 -323 -365 254 292 -98 -63 30 -287 -199 344 274 -308 -342 17
1758 17 13 17 225 11 -442 -246 287 265 -15 -33 -125 -282 114 549 184 -375 -228 139 154 172 245 -108 -454 -76
1782 -76 429 295 -75 -211 -268 -158 281 444 -77 -526 -288 100 233 219 -5 -405 -427 128 482 234 -172
1803 -172 -365 -279 128 548 345 -283 -501 -103 282 409 235 -184 -523 -211 406 525 69 -358 -464 -182
1823 -182 325 539 83 -561 -545 16 428 381 0 -476 -522 21 563 448 -88 -502 -415 69 608 550 -187 -648
1845 -648 -308 346 580 322 -181 -548 -374 273 705 319 -380 -655 -266 364 627 220 -498 -727 -189 497
1865 497 546 27 -515 -596 -147 469 658 65 -676 -640 96 662 507 -93 -534 -501 97 696 566 -208 -706
1886 -706 -390 300 656 413 -227 -712 -439 393 760 239 -456 -656 -296 351 728 298 -596 -820 -83 647
$$ packed form
1734a68o1N65L4o00lM33j52j88L90L8o11m2O19L8l90L5R3l17Q8N43p0n82l4L59
1758A7mMK08k14m53J96N33k2k80j8r2j57L96M35l65n59J47L67J5J8P3l53l46L78
1782g6N05j34l70j36n7J10M39J63n21m49K38L88J33j4k24m00k2N55L54k48m06
1803a72j93Q6M07M20k03o28k18L98L85J27j74m19l39L12O17J19m56m27j06K82
1823a82N07K14m56o44J6N61M12m7l81m76m6N43N42j15n36m14Q7M84N39n8p37m61
1845f48L40O54K34k58n03l67J74O47M32l86o99k75L89O30K63m07p18k29N38O86
1865D97M9n19n42q1M49O16J89n93p41L6P36N66j55o00m41L3N98N99j30p74m98
1886g06L16O90L56k43o40m85K73Q32L67n21o95k00L60O47L77m30q94k24P37P30
$$ plain form
1906 647 580 30 -465 -641 -182 629 816 12 -749 -606 138 695 641 -41 -731 -611 240 812 483 -241 -663
1927 -663 -512 148 758 575 -329 -925 -489 431 771 260 -485 -752 -328 373 691 310 -472 -803 -259 618
1947 618 783 126 -568 -665 -84 649 780 20 -724 -567 173 617 527 69 -585 -764 90 957 563 -462
1967 -462 -707 -299 113 544 626 -192 -1043 -531 598 740 83 -302 -530 -539 259 1029 396 -762 -726 75 380
1988 380 448 437 -259 -978 -280 921 713 -301 -511 -227 -172 252 779 166 -877 -636 369 551 129 -76
2008 -76 -386 -642 40 856 386 -620 -595 47 255 335 415 -156 -808 -307 722 724 -60 -517 -400 -70 457
2029 457 706 138 -657 -636 115 644 531 -38 -595 -610 -33 623 626 -99 -795 -651 166 664 381 -167 -502
2050 -502 -549 -98 682 691 -278 -781 -223 278 296 366 189 -552 -633 357 819 37 -418 -53 -29 -190 370 592
$$ packed form
1906F47o7n50m95j76M59Q11J87q04p61J43P44N57n4o82o90J20Q51N72l29p24m22
1927f63J51O60O10j83r04n96M36R20L40n11p45k67M24P01L18l81p82l31N44Q77
1947F18J65o57o94r7N81P33J31p60p44J57P40M44r0m58o54j79Q54Q67l94j025
1967d62k45M08M12M31Q2q18q51N12J129J42o57l85k28rP98P70o33j158L6Q01L05
1988C80O8j1o96p19O98J201k08j014k10K84N5M24N27o13j043K41J005J82m22k05
2008g6l10k56O82Q16m70j006K5O42K08Q0Q0n71o52N01J029Kp84m57J17L30N27
2029D57K49n68p95K1P51N29j13n69n57j5N77O56Lp25o96J44Q17M98k83n48l35
2050e02m7M51P80Rr69n03N58N01J8P0j77p41q1R90M62p82m55L65K4j61N60K22
$$ plain form
2072 592 -343 -755 171 586 -113 -216 192 -224 -480 416 694 -425 -783 251 503 -169 16 361 -414
2091 -414 -703 511 936 -221 -649 63 88 -179 491 699 -512 -949 226 747 34 -98 161 -417 -656
2110 -656 397 899 -99 -703 -173 42 -118 281 496 -311 -744 -43 463 120 -69 67 -166 -341 107 468
2130 468 123 -248 -99 60 48 81 123 9 -53 -17 36 51 17 -47 38 122 -49 -193 5 117 -78 -55 196 -78
2154 -78 -442 -40 455 51 -340 13 138 -294 -68 550 156 -539 -127 371 -51 -166 428 198 -618 -224
2174 -224 618 132 -448 173 366 -499 -414 598 339 -570 -164 462 -255 -551 418 546 -490 -444 403 81
2194 81 -479 250 646 -355 -645 325 431 -264 42 485 -253 -662 325 718 -136 -348 196 -6 -400 224
2214 224 647 -133 -639 -19 289 -30 33 190 -255 -465 102 389 -35 -218 -26 -109 -166 193 286 -151 -328
$$ packed form
2072E92r35m12R26M15o99j03M08m16k56Q96K78j119l58J034K52o72J85L45p75
2091d14k89J214M25j157m28P12K5k67O70K08j211m37J175N21p13j32K59n78k39
2110f56J053N02r98o04N30K15j60L99K15q07m33P01N06l43j89J36k33j75M48L61
2130D68l45l71J49J59j2L3M2j14o2L6N3J5l4o4Q5Q4j71j44J98J12j95K3K51k74
2154g8l64M02M95m04l91L53J25m32K26O18l94o95M12M98m22j15N94k30q16L94
2174b24Q42m86n80O21J93q65Q5J012k59r09M06O26p17k96R69J28j036M6Q47l22
2194H1n60P29L96j001k90R70J06o95L06M43p38m09R87L93q54k12N44k02l94O24
2214B24M23p80n06O20L08l19O3J57m45k10N67K87m24j83J92q3n7L59R3m37j77
$$ plain form
2235 -328 -1 221 138 -13 -111 -119 75 197 82 -32 -71 -159 -17 357 265 -290 -393 27 178 144 192 -92 -564
2258 -564 -262 495 407 -193 -234 -116 -327 15 746 369 -736 -593 307 366 77 287 29 -740 -368 781
2278 781 659 -339 -375 -22 -211 7 762 350 -790 -598 421 398 -80 103 -17 -668 -288 738 475 -547
2298 -547 -471 125 9 19 446 97 -701 -365 576 454 -171 -192 -92 -259 144 707 182 -657 -396 316 359
2319 359 177 139 -286 -615 -37 709 444 -306 -521 -305 56 495 490 -214 -714 -335 290 513 336 -149 -646
2340 -646 -442 360 696 234 -336 -532 -298 308 710 280 -482 -570 -66 322 491 289 -365 -742 -126 638
2360 638 495 -125 -395 -405 -192 412 653 -75 -762 -400 255 391 287 39 -515 -617 210 832 291 -427
2380 -427 -438 -174 118 590 545 -332 -814 -129 603 508 123 -207 -559 -399 475 823 67 -666 -500 -6 332
$$ packed form
2235c28L27K22q3j51r8qJ94J22j15j14l9q8J42L74r2n55j03M20J51l4M8k84m72
2258e64L02P57q8o00m1J18k11L42P31l77j105J43R00N9k89K10k58p69L72J149
2278G81j22r98l6L53j89K18P55m12j140J92J019k3m78J83j20o51L80J026k63j022
2298e47P6N96j16J0M27l49p98L36R41j22o25k1J00j67M03N63n25q39K61P12M3
2319C59j82l8m25l29N78P46k65p50k15K16L61M39np04n00L79O25K23j77m85m97
2340f46K04Q02L36m62n70j96K34O06M02m30p62q8N04L88J69k02o54l77O16P64
2360F38j43o20k70j0K13O04K41p28o87L62O55J36j04k48n54j02Q27O22n41p18
2380d27j1K64K92M72m5q77m82O85P32r5l85l30l52J60Q74L48p56p33J66M94L38
$$ plain form
2401 332 527 218 -587 -754 47 640 397 -116 -418 -500 -125 587 623 -168 -667 -328 220 463 393 -66 -587
2422 -587 -414 317 609 212 -262 -431 -251 227 590 268 -431 -565 -72 363 421 130 -371 -571 -84 514
2442 514 456 -95 -448 -381 -4 445 488 -57 -576 -369 213 532 372 -111 -528 -407 281 670 283 -311 -481
2463 -481 -220 220 555 356 -342 -676 -231 386 517 136 -369 -598 -244 427 553 35 -461 -458 -106 323 502
2484 502 135 -483 -553 28 516 416 -34 -386 -382 42 476 419 -91 -422 -301 99 412 371 -84 -497 -299 221
2506 221 413 151 -198 -359 -240 157 402 180 -292 -411 -96 234 325 98 -285 -375 -37 327 306 -9 -259
2527 -259 -271 -19 322 356 -28 -381 -252 141 313 188 -102 -302 -232 88 323 177 -178 -351 -209 148 314
2548 314 130 -253 -361 -97 213 252 51 -183 -261 -95 199 324 81 -232 -282 22 277 264 -8 -209 -181 34
$$ packed form
2401C32J95l09q05j67Q01N93k43n13l02q2L75P12L6p91m99L39N48K43p0m59n21
2422e87J73P31K92l97m74j69J80M78L63l22o99j34M93M35N8k91n01k00M87N98
2442E14n8n51l53O7L77M49M3n45n19K07N82L19j60m83m17J21O88L89l87n94j70
2463d81K61M40L35j99o98l34M45O17J31l81n05k29L54O71J26n18m96LL52M29J79
2484E02l67o18p0N81M88j00m50l52MM24M34n7n10l31J21M00L13m1m55m13J98N20
2506B21J92k62l49j61J19L97K45k22m72j19L15L30R1k27l83r0L38L64k1l15k50
2527b59j2K52L41L4l84l53J29L93J72j25k90k00P0L20K35j46l55j73J42L57J66
2548C14j84l83j08K64L10L9k01k34p8J66K94J25k43l13n0L04K55j3k72k01K8K15
$$ plain form
2570 34 227 212 8 -197 -202 33 233 179 -76 -242 -151 53 184 87 -118 -213 -102 61 130 82 -66 -195 -116 108
2594 108 186 40 -140 -115 3 86 112 57 -77 -148 -4 162 112 -37 -90 -59 -18 65 87 -31 -130 -72 51 52 0 -27
2620 -27 -76 -94 28 123 17 -119 -57 56 21 -7 56 36 -81 -50 119 109 -49 -35 41 28 1 74 39 -71 -39 69
2646 69 26 -80 10 53 -78 -89 36 32 -101 -62 65 -10 -137 -62 81 9 -65 -4 -5 -100 -16 147 66 -115 -74 60
2672 60 36 23 101 49 -131 -118 127 171 -17 -85 -47 -43 -7 117 126 -124 -206 4 130 34 -19 -3 -106 -135 72 220
2698 220 -4 -213 -82 103 69 31 81 -49 -173 21 242 82 -149 -74 29 4 67 171 -40 -291 -83 253
2720 253 139 -125 -118 -59 -124 37 266 82 -339 -271 107 179 57 33 -99 -291 -93 351 295 -136 -254 -61 54
2743 54 122 253 110 -297 -275 179 336 75 -80 -88 -152 -81 259 280 -134 -351 -64 188 99 13 -35 -164 -191 88
$$ packed form
2570C4J93j5k04k05nK35K00n4k55j66R1K04J31r7k05r5J11J63O9m8j48j29P9K24
2594A08P8j46j80K5J18Q3K6n5j34p1J44J66n0j49n3L1M1Q3K2j18r9N8J23Jn2k7
2620b7m9j8J22R5j06j36O2J13l5k8O3k0j17L1J69j0j58J4P6j3k7P3l5j10L2J08
2646F9m3j06R0M3j31j1J25mj33L9J27p5j27P5J43p2p4O1jr5Q4J63q1j81M1J34
2672F0k4j3P8n2j80J3K45M4j88o8L8ML6J24Rk50q2K10J26r6n3J6j03k9K07J48
2698B20k24k09J31J85l4l8N0j30j24J94K21j60k31P5J03k5O3J04k11k51K08L36
2720B53j14k64PN9o5J61K29j84m21O8L78P2j22k4j32j92J98M44n6m31j18J93J15
2743E4O8J31j43m07K2M54J57k61j55qo4P1L40K1m14k17K87K52q9q6m8j29k7K79
$$ plain form
2767 88 268 29 -265 -147 74 106 100 69 -148 -267 50 368 152 -214 -205 10 70 134 221 -13 -413 -231 315
2790 315 385 -27 -234 -205 -158 62 403 214 -362 -458 12 274 190 125 -74 -432 -292 389 527 -51 -368 -145
2812 -145 -3 67 343 306 -291 -487 82 427 144 -43 -63 -217 -201 271 402 -90 -388 -79 149 58 78 81 -234
2835 -234 -317 134 368 -14 -289 -111 25 19 148 173 -194 -370 28 375 181 -135 -193 -147 1 250 313 -48
2857 -48 -372 -223 166 312 170 -73 -283 -259 82 409 269 -222 -427 -143 192 245 142 -45 -325 -321 138 468
2879 468 185 -282 -280 -57 107 256 268 -120 -425 -85 332 207 -36 -47 -114 -225 105 439 71 -400 -182 198
2901 198 91 -25 106 -84 -359 -27 400 97 -319 -150 78 -17 46 274 -61 -449 -87 417 194 -149 -63
2922 -63 -52 -176 122 468 84 -432 -210 204 178 88 123 -120 -414 -55 425 255 -186 -221 -113 -68 154 320
$$ packed form
2767H8J80k39k94J18K21L2ol1k17j19L17L18k16l66RK15O0O4Q7k34m00J82N46
2790C15P0m12k07K9M7K20L41j89n76r6M70K62q4o5j99l58J40O81J38n78l17K23
2812a45J42P0K76l7n97j96N69L45k83j87k0j54J6M72J31m92k98L09K28r1K0Ll15
2835b34q3M51K34l82k75J78J36oJ29K5l67j76L98L47j94l16n8M6J48K49O3l61
2857d8l24J49L89J46j42k43k10K4L41L27j40m91k05K84L35N3j03j87k80MM59L30
2879D68k83m67KK23J64J49J2l88l05L40M17j25k43j1o7j11L30L34l68m71K18L80
2901A98j07j16J31j90k75L32M27l03m16J69K28r5O3K28l35l88L62N04k23l43Q6
2922f3J1j24K98L46l84n16K22M14k6r0L5k43k94L59M80j70m41l5J08M5K22J66
$$ plain form
2944 320 -6 -389 -215 129 200 83 18 -152 -254 -6 302 171 -126 -198 -79 70 158 109 -67 -168 -78 83
2966 83 144 73 -98 -180 -31 122 84 -27 -97 -132 -62 152 146 -115 -213 -24 92 45 70 51 -192 -202 174 273 -23
2991 -23 -160 -20 -21 -29 245 229 -203 -297 93 216 14 31 72 -171 -234 195 330 -88 -245 -15 -2 -81 143 182
3015 182 -215 -300 104 190 -78 -44 81 -114 -200 154 256 -116 -200 76 74 -63 57 133 -124 -149 151 159 -83 -62
3039 -62 62 -38 -76 113 106 -162 -147 104 86 -63 -22 21 -117 -51 150 87 -111 -86 27 -2 39 109 -4 -143 -22
3064 -22 112 61 3 31 -58 -94 72 154 -10 -90 13 11 -47 49 84 -84 -121 18 27 -65 13 41 -111 -104 98 57 -143
3091 -143 -59 99 -22 -103 55 86 -81 -62 127 48 -92 24 90 -47 -33 125 21 -143 9 157 -25 -109 80
3114 80 77 -118 -33 156 7 -145 -1 107 -57 -60 75 -22 -120 31 120 -62 -100 61 40 -72 17 117 -44 -107
$$ packed form
2944C20l26l83J74L44P1j17o5j70j02K48L08j31k97p2J19J49Q8m9j76j01R0J61
2966H3O1p1j71q2J49J53l8j11p0l5P0K14ok61r8J89J16m7K5j9k43j0L76R9k96
2991b3j37J40jqK74j6m32r4L90J23k02J7M1k43o3M29J35m18j57K30J3p9K24L9
3015A82l97q5M04Q6k68L4J25j95q6L54J02l72q4K76kj37J20P6k57k5L00Qk42K1
3039f2J24j00l8J89pk68J5K51j8j49M1M3j38O6K01o3j98K5J13k9M1P0j13j39J21
3064b2J34n1n8K8q9l6J66Q2j64q0J03kn8R6L5j68l7J39Rr2P8K8j52PK02m1k00
3091a43Q4J58j21q1J58L1j67J9J89p9j40J16O6j37J4J58j04j64J52J48j82q4J89
3114H0lj95Q5J89j49j52J44J08j64lJ35r7r8J51Q9j82l8J61k1j12Q9J00j61o3
$$ plain form
3138 -107 66 103 -56 -29 73 -18 -75 66 91 -80 -89 64 19 -53 11 23 -97 -55 71 31 -96 -35 21 -61 -34 95
3164 95 17 -119 -49 87 34 -23 35 8 -58 43 134 17 -66 31 28 -35 60 129 -31 -136 25 128 -2 -41 15 -34
3190 -34 -88 44 102 -33 -118 -20 -2 -36 63 53 -113 -118 70 101 -34 -41 11 -54 -60 107 105 -69 -96 36 38 10 64 31 -102
3219 -102 -69 92 88 -38 -41 -12 -44 -9 101 46 -106 -70 38 30 -1 40 -3 -94 -19 123 67 -54 -19 9 1 49 84 1
3247 1 -71 -7 64 32 6 21 -38 -58 51 110 7 -87 -45 10 19 13 -5 -75 -111 0 55 32 -29 -64 -79 -38 83 77 -50 -95
3277 -95 -34 12 63 69 8 -83 -67 64 92 51 -16 -59 -60 29 98 51 -49 -63 -13 20 66 55 -31 -110 -41 61 53 3 -22 -45
3307 -45 -68 25 88 18 -71 -43 8 22 41 34 -47 -67 14 67 14 -18 -5 -26 -23 25 56 -24 -102 -18 49 24 -20 -14 -34 -49 13 46
3339 46 7 -63 -45 -4 23 14 20 -17 -71 -1 87 56 -20 -44 11 -4 7 76 37 -58 -45 53 66 -4 -21 0 -36 -27 60 40 -50 -63
$$ packed form
3138a07J73L7j59K7J02r1n7J41K5j71rJ53m5p2O4J2j20M2J26m0j27O1N6q2K7J29
3164I5p8j36P0J36n3n7N8k7o6J01R1j17q3R7lo3R5O9j60j05J61J03j30l9N6m9
3190c4n4J32N8j35q5R8J8l4R9j0j66nJ88L1j35pN2o5oJ67kj74k7J32Kk8N4l3j33
3219a02L3J61mj26lK9l2L5J10n5j52L6J08ql1M1m3r1P5J42n6j21L5K8qM8L5q3
3247Ap2O4P1l2k6J5n9k0J09N9j03r4M2N5Roj8p0l6J11N5k3o1l5j5M1J21oj27m5
3277i5O1M6N1Oo1r1J6J31K8m1o7m3jQ9O9m7j00j4N0L3M6j1q6p9O9J02qn0k5k3
3307d5k3R3O3p0q9K8N1J4J9pq1k0Q1N3n3l2J3k1LM8L1q0p8Q4O7k5m4Ok0j5O2L3
3339D6l9p0J8M1K7rOl7n4P0Q8l1p6k4N5j5J1O9l9r5J3R8J3p0j7K1l6RQ7k0r0j3
$$ plain form
3371 -63 28 34 -24 13 5 -60 -72 51 58 -53 -63 12 -10 -40 38 50 -77 -94 46 86 -33 -43 19 -10 -46 48 87 -11 -76
3400 -76 -19 23 2 30 10 -70 -81 21 75 -9 -35 10 -24 -43 38 74 10 -57 -31 34 20 13 19 -9 -20 -1 36 41 27 -3 2 0
3432 0 -4 11 28 21 -30 1 13 -28 -39 34 38 -54 -61 13 22 -63 -6 63 -27 -118 8 65 -38 -56 40 5 -93 8 126 17 -96
3463 -96 12 63 -61 -23 119 24 -116 7 99 -22 -52 93 54 -132 -48 138 17 -94 34 69 -88 -96 101 63
3487 63 -82 -28 72 -43 -68 93 89 -78 -50 85 11 -76 61 108 -72 -110 62 68 -53 -13 71 -30 -112 20 78
3512 78 -21 -54 5 -32 -90 9 62 -31 -77 -4 9 -25 27 51 -2 -36 -16 34 26 27 21 -1 6 12 15 50 37 -12 -25 18 24 -14 7 55
3546 55 -20 -69 7 53 -26 -33 35 -10 -95 -5 80 -21 -58 27 8 -98 -26 115 16 -114 -12 69 -58 -38 115 49 -152
3573 -152 -57 115 15 -62 61 52 -142 -82 126 35 -120 -15 57 -93 -85 129 88 -152 -89 89 0 -79 61 101 -103
$$ packed form
3371f3R1On8L7qo5j2J23Pj11j0P5k2l0P8J2j27j7J40M0j19j0O2k9l6R4L9r8o5
3400g6N7M2k1K8k0q0j1J02N4q4k6M5l4j9Q1L6o4o7K6O5j4pOk8j1J9L7Nj4l0Nk
3432@mJ5J7pn1L1J2m1j1P3Mr2pP4Rq5N7O9r0r1J26N7j03j8R6l5r8J01J18j09j13
3463i6J08N1j24L8J42r5j40J23R2j21l0J45l9j86Q4J86j21j11J28L5j57qJ97l8
3487F3j45N4J00j15k5J61mj67K8J35p4q7J37M7j80l8J72Oj21M0Q4j01q2J32N8
3512G8r9l3N9l7n8R9N3r3m6P3J3l4N2K4n3l4K0N0qJok2POLL5j3m9j3M3Ol8K1M8
3546E5p5m9P6M6p9pO8m5q5R0Q5j01l7Q5j9j06P2J41r9j30J02Q1j27K0J53o6k01
3573a52R5J72j00p7J23rj94O0K08r1j55J05P2j50QK14m1k40O3J78q9p9J40M0k04
$$ plain form
3598 -103 -100 96 92 -55 15 90 -40 -81 87 98 -66 -59 88 8 -81 35 83 -34 -70 30 26 -82 -23 43 -11 -77 1
3625 1 21 -52 -42 39 9 -59 -33 -5 -16 10 15 -13 -46 -31 -1 23 39 -1 -38 -43 -1 37 49 35 -28 -84 0 63 22 -20 9 -34
3657 -34 -80 10 121 7 -93 -30 31 -24 -3 85 5 -133 -43 91 26 -51 36 19 -85 -28 142 42 -112 -6 69
3682 69 -35 -54 85 23 -123 -46 121 -14 -116 -1 42 -83 -48 85 4 -138 -25 88 -20 -82 17 29 -81
3705 -81 -14 111 11 -105 -5 69 -16 0 84 -11 -100 0 115 50 -62 -21 10 -22 24 79 7 -79 -49 23 36 34 16
3732 16 -52 -72 -4 61 29 -38 -50 -41 -12 48 55 -21 -73 -35 11 61 44 -30 -91 -24 36 24 -2 -4 -46 -56 40 78 -1 -82 -53 12
3764 12 6 35 33 -62 -103 6 82 20 -27 -12 -51 -31 69 104 -24 -112 -3 51 30 55 60 -66 -100 33 131 40 -47 -27 -22
3793 -22 -4 84 85 -45 -114 -28 46 22 22 0 -89 -90 33 89 -24 -89 -43 -7 -12 34 27 -49 -85 -2 60 30 -4 -20 -48 -21 81
$$ packed form
3598a03LJ96mj47P0P5j30m1J68J1j64PJ47q0q9J16M8j17l6J00mj08N9O6n4o6P8
3625AK0p3J0Q1l0o8K6K8j1K6Nk8l3J5L0K4J6m0l7nM2L8J2j4o3n6Q4O3m1m2K9m3
3657c4m6R0J11j14j00O3O1n5K1Q8q0j38R0J34o5p7Q7j7j04N7J70j00j54J06P5
3682F9j04j9J39o2j46P7J67j35j02J15M3j25L5J33q1j42J13J13j08o2R9J2j10
3705h1O7J25j00j16J00P4q5J6Q4r5q9J00J15o5j12M1L1l2M6N5p2q6L0P2J3kj8
3732A6o8k0O8O5l2o7j2RK9O0Pp6n2L8M6N0j7p4o1O7O0j2k6km2j0R6L8p9q1K9O5
3764A2oK9kr5m1J09P6o2m7J5l9K0J00L5j28q8J09N4k1K5Nj26l4J33R8r1q7K0N
3793b2J8Q8Jj30o9Q6P4k4%k2q9jJ23N6j13o5M6L6nM6pp6l6Q3O2l0l4j6k8K7J02
$$ plain form
3824 81 72 -38 -69 -16 28 42 33 0 -61 -65 48 86 28 -54 -67 -35 36 67 20 -70 -75 -7 45 68 20 -49 -86 -10 88 79 -2 -53
3856 -53 -61 -2 73 100 10 -82 -56 -1 72 70 0 -88 -79 21 75 33 -33 -62 -78 -16 65 68 -54 -123 -47 31 46 22 -32 -72 -44
3887 -44 33 71 18 -39 -46 -25 37 92 43 -45 -65 11 84 49 14 -31 -51 -4 54 62 -10 -63 -46 19 46 50 -16 -88 -55 35 57 15
3919 15 -26 -50 -39 11 73 36 -56 -61 -10 36 46 31 -21 -65 -23 53 62 5 -51 -62 -9 43 55 -2 -52 -67 -5 38 35 2 -59 -56
3951 -56 3 54 32 -24 -51 -34 29 51 47 -15 -36 -24 32 49 39 -14 -45 -19 48 65 27 -29 -27 -21 31 50 13 -29 -49 -24 10 26
3983 26 2 -45 -57 -24 34 12 -19 -56 -29 -8 28 36 -12 -49 -28 15 21 15 6 -15 -32 -2 41 18 -30 -36 -14 -3 23 18 -20 -43 -13
4016 -13 28 20 -15 -7 -11 -15 5 40 16 -36 -37 12 27 10 6 5 -13 -12 37 26 1 -7 -7 -7 8 39 14 -38 -20 10 17 -16 -3 -9 -24 -44 0
4053 0 9 -28 -30 -10 0 -27 3 8 -10 -26 -20 2 -7 1 13 6 -20 -2 17 23 2 0 8 -14 1 23 15 -18 -9 7 14 -3 10 17 -19 -17 15 32
$$ packed form
3824H1rj10l1N3M4J4rl3o1mJ13L8n8q2j3L2P1L1m7r0nO8N2K3m8o9l7P6R8rq1n1
3856e3qN9P5K7r0r2K6N5P3kp0q8RJ00N4m2o6k9j6O2Q1Lj22o9P6P8J5k4n4m0K8
3887d4P7L8n3n7pK1O2N5m9q8k0P6P3l5l5m5k0M7N8Qp2n3J7O5K7Mo6p2L3R0K2m2
3919A5m1k4J1N0O2l7r2nN1M6J0j5n2m4M2P6Rn7n6j1N3N2J2n7n0j5O2M3ll3o1L
3951e6N9N1k2n6k7J7O3K2mo2k1J2N6J7j0n3l1K6O7J7l8n6KON2J9l7m2k0K5L4J6
3983B6k4m7j2L3N8k2l1l7K7K1L6Qm8l7K1M3Oork1j7L0M3k3m8oK2J1K6nl8k3L0
4016a3M1ql5QmmK0L5k4n2jM9J5j7mjj8JM9j1k5q%%J5L1k5n2J8L0Pl3J3oj5k0M4
4053@Rl7kK0J0k7L0Nj8j6OK2rQJ2pk6J8J9Ok1kQk2J5K2ql3RJ6Pj7J3Pl6KL2J7
$$ plain form
4091 32 -6 -37 -2 5 -1 3 9 -21 -44 22 38 0 -17 -6 -16 -10 29 37 -33 -64 -1 55 24 -3 -17 -35 -44 4 62 7 -67 -55 -23 11
4125 11 28 24 -40 -76 -36 44 42 -17 -28 -33 -41 20 76 35 -67 -64 23 44 44 16 -24 -40 0 65 65 -9 -38 -5 13 16 22 -4 -50 -46 15
4160 15 63 -4 -54 -32 -23 1 23 29 -62 -95 2 76 33 -40 -46 -55 -44 37 89 -15 -113 -61 42 62 33 12 -57 -92 5 117 62
4191 62 -60 -65 -31 -14 48 93 -11 -140 -70 65 90 10 -16 -44 -74 1 115 62 -54 -87 1 53 49 59 -13 -93 -38 97
4219 97 93 -11 -49 -20 5 11 73 25 -76 -88 29 67 23 -39 -54 -65 5 76 55 -65 -118 -25 51 57 10 -44 -99 -60 63
4248 63 114 27 -98 -84 -1 56 83 32 -47 -109 -26 108 104 -22 -90 -75 -18 65 108 35 -108 -138 17 100 46 -4 -40 -93
4276 -93 -25 107 107 -39 -115 -27 42 46 58 23 -97 -92 53 134 4 -82 -38 -20 8 61 65 -73 -125 8 98 15 -23 -37 -68
4305 -68 -42 61 112 -35 -128 -46 48 39 37 17 -85 -107 52 135 40 -69 -59 -22 11 91 92 -48 -129 -29 97 88 30 -28
$$ packed form
4091C2l8l1L5PoMOl0k3O6J6l8j7J1j0OL9Qp0l1O3N6l1k7j4j8rM8N8n5p4J2L2L4
4125A1J7mo4l6M0Q0kn9j1nqO1N6m1j02LQ7K1%k8m0j6M0O5%p4k9L3J8LOk6m6MO1
4160A5M8o7n0K2RK4K2Or1l3R7P4m3p3orJ1Q1N2j04r8N2J03K0k9k1o9l5R7J12n5
4191F2j22nL4J7O2M5j04j29P0J35K5q0k6k8l0P5J14n3j16l3Q8N2mJ0p2q0N5J35
4219I7mj04l8K9K5OO2m8j01j2J17L8m4o2j5j1P0P1k1j20n3R3P6Om7n4n5L9J23
4248F3N1q7j25J4Q3N7K7n1p9o2Q3J34mj26o8J5N7Q3M3p3j43l0J55Q3n4n0l6n3
4276i3O8J32%j46p6Q8O9MJ2l5j20NJ45Q1j30q6M4J8K8N3Mj38n2J33R0q3l8j4l1
4305f8K6J03N1j47r3Q2R4rkk0j02k2J59Q3r5j09J0L7L3Q0Jj40q1J00J26rn8n8
$$ plain form
4333 -28 -75 -47 69 118 37 -85 -93 -17 52 74 23 -55 -107 -30 78 73 -20 -85 -60 -10 50 62 17 -76 -70 25 97 49 -35 -74
4363 -74 -31 22 54 51 -18 -102 -33 52 52 -6 -41 -56 -46 31 102 24 -93 -82 28 56 22 20 -34 -90 -19 92 94 -40 -65 -10
4393 -10 2 41 84 26 -75 -57 47 83 11 -6 -14 -60 -5 101 49 -66 -71 6 21 16 39 0 -100 -64 43 63 -20 -49 -42
4422 -42 -20 12 43 19 -63 -51 22 39 16 10 -22 -47 -11 71 38 -29 -49 -5 28 29 34 -9 -62 -26 30 51 16 -14 -45 -36 33 52
4454 52 8 -30 -29 -7 26 39 22 -27 -42 1 39 28 11 -10 -43 2 44 22 -18 -21 -20 -12 13 47 3 -58 -19 4 6 -11 -5 -18 -47
4487 -47 -15 32 7 -33 -14 5 -14 5 26 -1 -44 -2 45 -1 -3 17 15 -20 13 39 4 -36 5 43 1 4 32 17 -19 11 34 -3
4519 -3 -17 4 10 -23 17 24 -19 -28 12 21 -19 -9 15 -8 -24 -4 11 -19 -5 20 -3 -17 -10 18 -2 -9 15 -8 -28 -4 23 1 -23 -2
4553 -2 -11 -22 13 14 -10 -31 -2 10 -10 14 2 -10 -22 14 28 0 -5 2 -13 16 45 24 -21 -25 13 27 12 10 0 -31 -24 25 33 -8 -25
$$ packed form
4333b8m7K8J16M9q1j22qP6O9K2n1p8n2P7J08nr3o5K5N0O0J2m5r3OR5P2m8q4l9
4363g4M3N3L2lo9q4O9Q5%n8l5j5J0P7P1p8j17J1J10K8l4kn4n6P1J11Kj34k5N5
4393a0J2L9M3n8j01J8J04L6p2j7qm6N5J06n2j15nP7J5nK3l9j00L6J07K0q3k9P
4422d2K2L2L1k4q2J2P3J7k3ol2k5L6Q2l3o7k0M4L3JNm3n3L6N6K1l5l0l1RO9J9
4454E2m4l8JK2L3J3j7m9j5M3L8j1j7k1l3M5M2k2m0lJQK5L4m4o1L9K3Kj7Oj3k9
4487d7L2M7k5m0J9J9j9J9K1k7m3M2M7m6kK0kl5L3K6l5m0M1L8m2LK8j5l6L0K3l7
4519cj4K1Ol3M0Pm3rM0Rm0J0K4k3j6K0J5l0J4K5k3j4PK8k0pK4k3k0K4K7k2k4K1
4553brj1L5Jk4k1K9J2k0K4j2j2j2L6J4k8nPj5K9K9k1m5mL8J4j5kj0l1PM9Qm1j7
$$ plain form
4588 -25 -17 -9 12 35 7 -44 -35 19 16 12 10 -23 -49 -8 49 11 -31 -34 -21 -7 28 38 -14 -51 -20 31 26 -1 -16 -33 -41 31 56 18 -22
4623 -22 -20 -2 8 30 15 -44 -53 15 53 24 -8 -33 -36 9 47 36 -14 -43 -9 19 36 39 -6 -66 -32 57 59 18 -36 -44 -24 13 56
4656 56 18 -40 -58 -17 40 44 14 -50 -72 -15 46 43 -12 -48 -56 -8 30 48 2 -52 -59 0 63 43 -16 -51 -40 26 63 54 -3 -42 -30
4689 -30 20 76 52 -33 -60 -10 51 59 30 -22 -53 -15 48 61 6 -55 -46 -5 30 55 8 -63 -63 8 60 43 -11 -51 -58 -5 73 60
4721 60 -28 -72 -27 25 65 28 -25 -57 -40 32 63 25 -45 -59 -32 21 62 25 -58 -79 -13 47 46 9 -34 -58 -15 48 73 7 -59
4752 -59 -45 20 69 58 -1 -58 -38 10 65 32 -20 -35 -35 30 52 48 -28 -77 -40 51 50 7 -44 -53 -26 29 71 11 -70 -77 0 47 45
4785 45 0 -59 -60 -14 60 56 -12 -57 -61 -3 46 57 2 -74 -53 28 61 41 -16 -51 -43 3 58 51 -16 -61 -32 48 48 25 -20 -45 -25
4818 -25 32 70 20 -45 -31 4 41 47 29 -40 -61 3 69 47 -18 -35 -25 4 47 42 -7 -59 -38 25 46 8 -35 -51 -45 5 49 35
$$ packed form
4588b5QQK1K3k8n1RN4lmkl3k6M1N7l8m2lJ3J4L5J0n2l7L1N1nk7j5j7qP2K5l8m0
4623b2KJ8J0K2j5n9rO8L8k9l2k5lM5L8j1n0k9L4K8J7Lm5o0L4Q9Km1n4qK0L7M3
4656E6l8n8j8M1N7Ml0o4k2N7O1ln5l6qM8L8J8m6n4pN9O3k0n9l5J1O6L7rn7l9J2
4689c0N0N6k4q5k7N0O1Qk9n2l1L8O3J3n5o1RM1L5K5m7p1%P1N2j7n4m0pN3P8j3
4721F0q8m4M5N2M0l7n3l2J7P2L1l8p0j4K7N3M1l7q3k1O6O0jl7m3k4M3O3K5o6o6
4752e9J4O5M9j1n9n7K0M8N5l3n2j5%O5K2mp6m9L7R1jm3n1rK7N5M2o0q1pP7M7k
4785D5m5n9jM6P4mo8m5mN8M9J1n5p6K1Q1L3k0n7l5QM6N5po7m5K9Q0%k3m5k5K0
4818b5N7L8n0o5J4L5L7Oj8o9k1O4O6k2o5j7J0K9M3nm9n2K1O3K1l8m3j6ON0M4j4
$$ plain form
4850 35 -51 -58 -2 30 22 13 -14 -49 -29 44 78 -10 -38 -26 -5 26 45 28 -30 -50 23 52 26 -3 -13 -31 -18 45 36 -8 -52 -8
4882 -8 28 20 21 3 -27 -34 18 52 5 -43 -10 1 13 21 25 -28 -57 1 34 24 -23 -35 -18 -27 -2 27 -7 -50 -38 11 13 3 -19 -31
4916 -31 -37 -11 32 22 -27 -44 -13 3 9 21 1 -42 -19 29 40 22 -10 -7 -6 0 16 38 -4 -39 6 47 4 -2 7 -11 -12 13 27 -1
4950 -1 -33 6 21 -11 -12 14 6 -23 -6 30 -11 -32 4 27 -18 -18 25 4 -31 -3 30 11 -29 -1 8 -20 7 18 -7 -44 -8 36 -3
4983 -3 -9 10 7 -29 -5 31 16 -22 -7 14 -5 2 13 24 -13 -3 24 12 7 19 22 -1 -2 21 13 3 7 22 7 -17 -4 25 10 -7 -10
5018 -10 -8 -7 -13 17 12 -24 -25 -10 4 -16 -13 -11 -13 -32 -6 20 4 -8 -15 2 4 21 26 -18 -32 -3 20 -7 -5 7 1 -28 -10 33 9 -26 -27
5055 -27 6 12 -8 8 8 -16 -4 18 1 -29 14 3 12 7 15 -1 -29 -10 48 35 -18 -12 7 -6 7 22 6 -34 -28 7 19 -10 -22 -19
5089 -19 -25 3 24 12 -25 -33 -18 -1 4 8 -18 -42 -29 10 12 0 -14 -6 -9 15 24 11 -6 -32 7 32 25 3 -14 -14 15 11 38 12 -30 -6
$$ packed form
4850C5q6pN6L2qrk7l5K0P3L4q8k8J2K1L1J9j7n8k0P3K9k6k9j0j8J3O3rm4m4M4
4882hL6qJj8l0pN2L4m7m8L3J1J2QMn3k9N8L3j0m7j2J7rK5K9l4m3J2M9Kj0k2j2
4916c1oK6M3j0m9j7L1J6OJ2k0m3K3M8J1j8l2LJOJ6K2m2l5M5M1m3oRj8jK5J4k8
4950al2L9J5l2jK6qk9J7L6m1k1L6K3m5%M3k1l5K8L3j9m0K8Rk8K7J1k5l7L6M4l9
4983coJ9ll6K4L6j5l8J5K1j9PJ1J1l7J0K7j2nJ2Lk3jK3qj0MJ5j5k4J3K9j5j7l
5018a0KJoL0nl6jJ5J4k0LKkj9K6K6j6j2pJ7KJ7Nm4j4K9K3k7KJ2ok9J8M3k4l5j
5055b7L3Ok0J6%k4J2K2j7l0M3j1RnQj6k8J9N8j3n3OJ9j3J3J5j6m0OL5J2k9j2L
5089a9oK8K1j2l7qJ5J7NMk6k4J3L9Kj2j4QlK4Rj3j7k6L9K5pk2j7%K9mK7k6m2K4
$$ plain form
5125 -6 16 36 17 4 -25 -16 13 37 7 -28 -37 -7 15 19 15 -3 -32 -33 29 28 -8 -27 -27 -4 9 34 12 -31 -23 0 30 14 -2 -21 -40
5160 -40 -8 25 18 -8 -46 -9 3 28 24 13 -22 -31 23 32 12 -6 -28 -7 0 37 28 -18 -26 -6 31 37 7 -16 -22 -11 27 26 6 -15 -30
5195 -30 7 20 27 -1 -42 -34 0 24 15 -20 -33 -21 -4 20 8 -18 -41 -22 18 26 18 -25 -41 -8 17 36 17 -26 -26 -23 25 30 2 -16
5229 -16 -26 -8 35 29 -3 -19 -12 6 33 21 7 -27 -19 3 22 26 -18 -28 -5 5 13 14 -10 -24 -5 23 34 21 -3 -23 -13 29 27 9
5263 9 -26 -43 -2 18 26 20 -18 -29 -9 14 17 -13 -32 -34 -9 16 12 -6 -27 -12 -1 17 8 -1 -24 -17 10 26 12 -16 -25 2 26 29 17 -5
5299 -5 -15 -13 10 20 8 -6 -25 -8 22 14 -16 -29 -21 -3 15 15 3 -12 -20 5 15 18 6 -27 -25 -6 14 6 -10 -12 -4 -1 10 -5 -29 -20 0
5336 0 9 10 -4 -10 -23 -3 6 15 -8 -10 -27 -10 -1 14 -7 -15 -17 -6 24 -1 -4 0 -2 -1 22 14 -7 2 1 19 16 6 0 -16 0 10 11 -9 -22 -9
5376 -9 -1 0 10 2 -28 -22 -6 5 2 -9 -15 -14 -14 0 -2 -19 -20 -2 -10 9 1 -4 -7 -9 6 0 8 6 -1 -3 -3 5 -5 3 -11 -2 7 -2 -9 -6 6 -5 2 16 -3
$$ packed form
5125fK2K0j9j3k9RK9K4l0l5rL0K2Mmj8k9jO2jl6j9%K3J3K5k2m3QK3L0j6j6j9j9
5160d0L2L3pk6l8L7J2K5mj1l5rN4Rk0j8k2K1PL7rm6qK0L7Ol0k3oJ1L8jk0k1j5
5195c0L7J3Pk8m1QL4K4rl5j3J2J7K4j2k6k3J9M0Qqm3j6L3K5J9j9m3%LM8Nk8j8
5229a6j0J8M3ol2j6PJ8K7j2j4l4QK2J9Mm4j0K3J0QJk4j4J9K8J1j3k4k0J0M2kj8
5263Il5j7M1K0Qol8j1K0K3Ll0j9kK5K5mj8k1J5J1J8rrk3PK7J6j4k8rK7K4Lj2k2
5299ej0KK3J0j2j4j9J7L0ql0j3QJ8J8%j2j5qK5J0Lj2l3KJ9K0qj6kQLJ1j5k4RK0
5336@RJj4oj3K0RRk3kj7J7RJ5k1qkJ1L0k5lMkJK3qk1RjJ8lj0oj6J6J0Jk0j3J3
5376iQJJ0ql0OJ6J1lj1oJ%J4kj7jJ8qJ9qnlkJ5oQkpk%Qj0Qj4RRrpLJ2j1PJ4j9
$$ plain form
5421 -3 -6 5 20 2 -4 2 1 11 3 13 11 -15 2 7 9 -2 0 12 -5 -9 6 16 -11 -17 -3 -6 -8 -9 -15 -9 -19 -9 -1 -2 -27 -6 -5 -6 3 2 -15 -15
5463 -15 10 1 -5 -10 13 12 -1 5 10 -3 1 5 22 12 -1 9 11 3 6 15 0 -6 -8 10 9 4 3 -5 -8 5 8 7 -13 -3 -6 -11 9 24 -10 -14 -8 23 4
5506 4 -11 -5 -5 0 6 7 1 -17 -21 1 -1 -8 -13 -12 -13 -1 0 4 -22 -12 -2 0 -1 15 7 -1 -12 11 29 -10 -3 -5 -4 7 2 10 -7 -14 15 21 11 -1 2 -11
5550 -11 7 17 23 2 -13 0 10 6 -5 0 -2 -38 -7 10 3 -10 -6 -3 -2 -6 6 4 -36 -15 7 13 -5 -19 -19 -12 -10 14 7 -24 -14 5 4 -2 2
5589 2 7 -21 -18 12 21 -23 -3 12 14 0 13 12 -8 -5 14 16 -6 -2 9 4 9 24 11 -10 -8 35 15 3 -6 9 1 -12 10 21 -9 -21 -5
5626 -5 9 -14 6 -1 -27 -34 -4 11 3 -21 -24 -9 -9 -1 3 -11 -26 -8 3 1 11 9 7 -9 5 2 14 -2 -8 6 18 3 16 11 -1 -8 12 8
5664 8 6 -9 -4 5 -3 2 7 2 -3 14 17 3 -6 17 6 1 11 15 -15 -11 7 15 4 2 -1 0 -7 -1 28 -11 -21 -10 4 -9 0 7 -6 -26 -7 10 -7
5705 -7 -11 -3 4 -23 7 25 3 -15 -13 7 4 3 19 8 -3 -3 14 12 6 8 16 0 -9 15 18 -9 -3 12 0 4 8 7 -6 -7 5 7 -9 -14 11 1 -4
$$ packed form
5421clJ1J5j8oOjJ0qJ0kk6J7NKj1KJ2j7mJ5J0k7oJ4lkjoOj0J0Qjk5K1JjRjj7%
5463a5K5ronK3jj3ONj3MMJ7j0j3J0KqLRj5okJ8jnjqlJ3Ljk0J0lnK0J5l4mOL1j9
5506Dj5O%NOJoj8mK2kpnJjJ2JMk6J0J0KjJ6qqj1K3J8l9PkJJ1nQj7pK9Oj0j2Lj3
5550a1J8J0Ok1j5J3J0mj1Nkl6L1J7pj3MLJmJ2km0K1K2Oj8j4%PKK4pl1J0J9joM
5589BNk8LL0Rm4K0J5Kj4J3jk0LJ9Kk2MJ1nNJ5j3k1KM3k0j2rJ5qj3K2J1l0j2J6
5626eJ4k3K0pk6pL0J5qk4lJ5%QMj4j5J8J1kJ0kkj6J4lJ2j6oJ4J2j5J3nj2pK0m
5664Hkj5NRqNNnnJ7Lj4rK3j1nJ0Ml0MJ8Qj1klJpOK9l9j0J1J4j3RPj3k0J9J7j7
5705gmQPk7L0J8k2j8KK0ljJ6j1j1%J7koKQj6rK4Lk7OJ5j2MMjj3jJ2Kj6nK5j0n
$$ plain form
5746 -4 -9 -8 -4 -10 -3 5 -1 -15 -8 -10 0 5 16 -4 -11 -2 10 1 2 0 -3 -11 -12 14 8 -11 -12 2 -6 -6 0 14 -5 -12 10 15 -3 -3 5 7 4 16 9 -5 12 10
5792 10 20 -2 7 16 -2 -3 20 12 -8 -16 7 7 -17 1 19 4 -8 1 2 0 -21 3 4 -16 -4 4 -9 -22 -9 -9 -5 -5 -6 5 -16 -7 14 1
5830 1 -11 15 12 -2 3 6 11 -10 -2 15 13 -1 10 -5 3 13 12 17 0 5 2 10 1 19 10 -3 -6 16 7 -2 4 10 2 3 13 13 -9 -9 9 7 -1 -2 0 -4 -6
5875 -6 -8 13 -5 -13 -19 8 -17 -6 -1 2 -10 -3 0 -13 -3 8 13 -5 -15 12 3 -2 11 6 16 2 9 -4 -2 4 5 14 11 3 4 20 0 2 9 7 8 8 25
5918 25 -12 -5 -8 5 3 2 9 -6 -1 3 10 4 4 2 6 1 3 -2 8 -7 -8 2 0 -3 -13 -5 -12 -15 1 -1 -19 -6 -10 -4 -5 8 4 3 -4 0 4 -11 -7 -8 -10 -3 10
5965 10 27 16 2 8 6 5 23 18 8 2 1 2 10 14 7 3 -1 12 6 0 -7 -11 7 1 9 -17 -10 -8 -4 0 -10 -2 -10 -12 0 1 -4 5 -9 -14 -5 4 3 -3 -1 -3 9 5
6013 5 7 -12 -12 -7 -3 1 9 -4 -20 -2 6 12 -2 -4 -2 -9 13 8 16 -2 -12 -2 14 5 4 -12 -7 5 10 15 1 -12 -8 15 -4 10 1 -20 -15 2 17
6054 17 12 -6 -19 -8 4 13 -2 -10 -18 -24 -4 -5 -8 -8 -17 -18 -5 7 -4 -16 -23 -12 -6 12 13 -8 -14 -7 11 21 9 -8 -19 6 17 16 4 -2 -1
$$ packed form
5746dnJMoPQoj4PkJ0NJ1k0pRJ2rJklqjK6oj9jJ4q%OJ4j9pK2Nj8%QKlJ2pj4J7k
5792A0J0k2RRj8jK3qk0qK3%k4J8J8j5j2RJkk1K4Jk0J2Qj3j3J3%M%jJ1k1RK1j3
5830Aj2K6lj4NLNk1QJ7kj4J1j5QJ0jNj7NlQrJ8rj3lK2rrOOqJJ0%k2%J8kqjKmk
5875fkK1j8qoK7k5J1NLj2PLj3J0J1Nj8j0K7rnJ3nJ0j4Pj3KOJRlqJJ6k0KPkJ%J7
5918B5l7PlJ3kjPj5NMPo%kMnKnJ0j5jJ0klj0QplJ6kj8J3mOjJ3mjpMMj5MjkPJ3
5965A0J7j1j4OkjJ8nj0ojJQMpmmJ3oopmJ8oQk6PKMMj0QqkJ2JnRj4nRRjoKkJ2m
6013EKj9%NMMQj3j6J8QOj4kKpK2nQj8j0J0J6rjj6NJ2NNj4j3MK3j9J4rk1NJ7J5
6054A7nj8j3J1J2Rj5qqoK0jl%rjJ3J2j1j2pJ1OJ8Jk1oPJ8J0j2j7j1K5J1jj2oJ
$$ plain form
6093 -1 7 16 0 5 -17 -12 -6 17 0 0 -19 -14 7 -2 -7 -20 -14 -12 6 12 4 -17 -26 -5 -6 26 5 -17 -15 -8 4 16 5 -13 -19 -5 3 26 1 -22
6133 -22 -21 2 18 1 -7 -5 -16 -5 8 15 -6 -27 -15 2 15 16 2 -6 1 19 28 8 -6 -14 -12 4 25 9 -11 -21 -11 25 18 5 -6 -22
6169 -22 -7 9 11 1 -31 -26 -1 11 8 2 -23 -28 1 19 6 -8 -17 -11 -3 12 24 -4 -25 -13 6 12 3 1 -15 -21 0 25 12 -7 -25 -10
6205 -10 5 11 9 -9 -23 -14 14 21 5 0 -16 1 7 33 14 -12 -13 13 21 16 2 -4 -13 5 24 18 -2 -29 -6 5 10 11 -7 -22 -21 -5 10 5
6243 5 -15 -18 -12 -7 6 10 -14 -32 -7 20 5 -7 -18 -14 -16 17 16 1 -17 -22 3 21 13 5 -23 -22 13 19 21 -2 -14 0 5 5 10 -1 -22 -2 10
6282 10 13 -2 -1 -17 -22 1 18 12 -24 -8 4 14 0 -12 -17 -19 -16 15 15 -6 -18 -23 1 7 2 8 -20 -25 7 26 -3 -12 -18 -9 -11 4 16 -13 -34
6321 -34 -21 22 7 4 2 -1 -13 12 25 11 -5 0 7 2 13 12 -7 -20 -1 17 3 -9 -5 -9 -14 0 2 -4 -19 -13 14 3 -11 -6 -5 -9 -17 2 5
6360 5 -11 -17 -5 2 0 1 -8 -14 -13 14 15 1 -13 -6 1 -1 -6 8 -6 -4 -6 10 6 -6 3 -3 -7 4 7 6 8 -4 7 -8 -1 12 7 -1 6 11 14 -2 3 -1 -3 7
$$ packed form
6093aQRj6Nk2NOK3j7%j9NK1rnj3OKJ8Oqk1rK1jL2k1k2KPJ2J2j1j8oJ4QK3k5k3
6133b2JK3J6j7qKj1J1J3Pk1k1J2J7J3Jj4qPJ8Rk0j4qKJ6K1j6k0j0J0L6pj3j1j6
6169b2J5J6Kj0l2NK5J2lok5nK9J8j3j4rOQJ5J2k8k1J2J9Orkj6oK1K5j3j9j8J5
6205a0J5Okj8j4RK8Pj6nj6J7OK6j9k6jK6Qnj4orJ8J9ok0k7K3J1NJj8j5JJ6J5n
6243Ek0lONJ3Mk4j8K5K7j5j2j1MkL3jj5j8nK5J8qqk8JL5OKk3j2J4N%Nj1k1K0J2
6282A0Lj5Jj6nK3J7ol6J6J2J0j4j2nkLL1%k1j2nK4OnOk8nL2J9k9roRkJ5J2k9k1
6321c4J3M3j5lklj2K5J3j4j6NPnJ1jj9j3J9J8j4j2MmnJ4Koj5OK7j1j4NJmqJ9L
6360Ej6oJ2PkJroJK7Jj4j4PPknJ4j4KkJ6mj2RomJ1LjKj2J1j5PJ3nqPNLj6NmkJ0
$$ plain form
6406 7 5 13 0 9 8 -11 -17 -5 4 -17 -7 -8 -4 -17 -5 -9 -9 -13 -5 11 -21 -25 0 -5 -21 -3 2 -5 -9 0 10 4 -16 5 6 -6 -5 1 0 -11 -9 17 0
6449 0 4 4 -1 0 3 13 9 -6 4 2 -2 12 3 6 -25 -1 25 8 6 -10 -5 -4 1 19 23 -3 -26 -2 7 2 6 -1 -7 -20 -8 11 0 -21 -12 7 13 -5
6491 -5 0 -11 -21 -22 6 12 -14 -5 -11 -17 1 11 8 -17 -9 13 21 13 -4 -1 -4 6 13 21 3 -13 -3 16 5 13 5 -22 -11 19 27 -6 -12 -5 -2 -7 22
6532 22 9 -22 -30 -2 12 12 -4 -20 -23 -11 4 20 -19 -30 -30 -4 20 10 3 -25 -22 8 27 12 -21 -13 -20 0 22 24 7 -27 -20 6 9 -10
6568 -10 -14 -32 -15 10 18 -1 -27 -23 1 25 26 8 -13 -18 7 39 23 6 4 -9 6 32 15 -10 -24 -28 4 24 4 -13 -32 -20 6 17
6602 17 5 -19 -29 -12 3 20 5 -28 -40 -29 8 10 14 -38 -32 -3 19 17 1 -9 -34 -6 27 17 -17 -24 -12 -1 18 28 7 -27 -21
6635 -21 0 30 14 -11 -22 -22 6 34 22 -19 -23 -7 10 20 15 -11 -33 -18 31 27 -2 -26 -23 -2 24 23 9 -22 -20 -20 18 9 -7 -25 -28
6670 -28 -20 14 12 -22 -35 -25 -8 12 16 -18 -33 -22 8 24 7 -18 -25 -13 7 21 18 -18 -2 -9 29 22 26 -7 -33 4 18 20 -2 -30 -28
$$ packed form
6406GkQj3Rjj9oJ2Rk1J0jMj3J2m%mQJ6l2mK5nj6J8NpmRJ0ok0K1Jj2JOjj1KK6j7
6449@M%nJLJ0mj5J0kmJ4rLl1K4K6j7kj6NJNJ8Mk6k3K4RnMpoj3J2J9j1k1RJ9Oj8
6491eNj1j0jK8Ok6RooJ8J0lk5QK2Qqj7LlJ0PQj8j6J0J9j1Qqk7J1L0Ql3oPLnK9
6532B2j3l1qK8J4%j6j6lJ2J5J6l9j1%K6K4j0pk8LL0J9j5l3QpK0K2Kj7l4PK6Lj9
6568a0mj8J7K5Qj9k6MK4K4Jj8k1nK5L2j6j7kj3J5K6j7k5j4mL2K0k0j7j9J2K6J1
6602A7j2k4j0J7J5J7j5l3j2J1L7KMn2OK9K2kj6j0k5K8L3j0l4pJ2J1J9J0k1l4O
6635b1K1L0j6k5j1%K8K8j2m1mJ6J7J0nk6k2J5M9mk9k4LK1K6jj4l1K%L8rj6j8l
6670b8QL4kl4j3J0J7K0Ml4j5J1L0J6j7k5pJ2K0J4ll6J6pL8pMl3k6L7J4Kk2k8K
$$ plain form
6705 -28 0 8 21 -4 -24 -28 -4 19 16 -2 -32 -12 8 13 9 -7 -21 -13 4 25 3 1 -25 -1 6 17 14 -22 -23 -8 19 10 -7 -20 -30 -15
6741 -15 12 7 -3 -23 -20 -4 13 12 -9 -25 -26 -3 11 16 -4 -21 -17 4 21 19 2 -18 1 6 16 11 -8 -15 -13 10 16 5 -15 -25 -12 7
6777 7 20 -8 -10 -30 -11 3 15 -6 -16 -25 -12 3 1 1 -25 -13 0 6 9 -4 -18 -15 -6 22 -3 -9 -25 -9 2 10 7 -16 -7 -12 11 23 0
6814 0 -15 -14 2 11 3 0 -7 -19 -10 11 12 14 -9 7 6 21 19 6 0 -1 13 6 6 1 -12 -7 -3 1 6 -21 -18 -6 -16 -11 -11 5 -24 -14 -11 -7 11 -13 -2
6857 -2 -4 -5 -15 1 -11 -19 9 4 -18 -6 7 8 10 10 19 -7 6 4 -2 -4 1 7 7 0 -2 -5 -14 -4 9 0 -5 -4 -3 -7 6 5 0 1 -13 1 -4 1 -8 2 -2 8
6903 8 18 -2 1 7 5 2 -3 3 -5 -14 1 3 7 -10 -9 -10 -10 -9 -11 -15 -12 -12 -13 7 12 -7 -7 8 11 8 11 2 -15 13 10 -4 5 4 -3 -3 22 26 -4 -3 -11 10 4 9
6951 9 10 3 -10 -5 11 15 5 -11 -11 -2 1 3 -2 -25 -19 6 6 -3 -20 -19 -1 1 17 3 -13 -32 -11 10 0 -1 -6 -17 -13 10 16 -4 -27 3 10 -2
6991 -2 13 3 -17 -20 0 8 14 -13 -12 0 1 21 21 -17 -22 -7 23 24 1 -6 -11 -8 5 26 12 -13 -17 -7 20 17 7 -15 -17 -8 15 28 4 -23
$$ packed form
6705b8K8QJ3k5k0mK4K3lj8l0K0K0Nmj6j4QJ7K1k2kk6K4PJ1ll6jJ5K7rj7j3j0J5
6741a5K7nj0k0LJ6J7jk1j6jK3J4Nk0j7MK1J7kj7k0J9NJ0nj9pKK3Oj1k0j0J3J9
6777GJ3k8kk0J9J4J2k1j0rJ3J5k%k6J2J3OLj3j4LRK8k5oj6J6J1Qlk3RnK3J2k3
6814@j5JJ6Rqlpj2RK1JKk3J6jJ5kj3ojJ4p%nj3NMMNk7LJ2j0N%J6k9J0LMJ8k4J1
6857bkjj0J6j2qK8nk2J2J3JK%Rk6J3kokNO%pklrJ0J3rnJJmJ3jnJj4J4nNrJ0mJ0
6903HJ0k0LOklnOqrJ5KMj7Jj%JkmL%jK0Nj9%J5LlLrj7K8lj4Rjp%K5Ml0JqK1oN
6951IJpj3NJ6Mj0j6%RLKnk3OK5%rj7JJ8KJ6j4j6j9K1K1j0jnj1MK3Ok0k3L0Pj2
6991bJ5j0k0lK0QOk7JJ2JK0%l8nJ5L0Jk3pnLJ3K1j4k5mJ0K7lj0k2kRK3J3k4k7
$$ plain form
7029 -23 -18 -5 14 13 11 -30 -17 7 5 -8 -12 -21 -16 3 11 16 -25 -27 -13 17 9 19 2 -9 -14 17 31 9 -9 -1 0 9 24 15 -14 -26 2 22
7067 22 10 -2 -19 -19 11 17 27 0 -26 -20 2 13 16 -5 -19 -21 6 16 18 -16 -22 -15 -1 14 9 -2 -31 -16 20 20 -7 -20 -25 -12 1 14
7103 14 13 -19 -32 -9 17 10 -12 -8 -18 -7 8 23 -4 -25 -10 28 10 15 5 -23 -27 27 46 14 -1 -7 0 9 22 14 -14 -23 -9 13 15 -6
7139 -6 -13 -15 -15 13 20 3 -19 -23 6 7 18 12 -20 -21 -5 13 24 -15 -15 -18 -5 18 14 3 -15 -25 11 35 8 -17 -23 -10 5 17 4 -13 -28
7176 -28 -6 12 13 3 -5 -24 1 15 9 6 -17 2 3 10 20 -2 -6 -17 7 38 16 -9 -9 -13 4 23 17 -6 -33 -18 7 19 2 -1 -21 -12
7212 -12 -6 19 12 -21 -20 -16 -9 9 -5 -8 -16 -15 16 11 -1 -27 -7 4 10 4 7 -23 -17 -2 5 6 3 -16 -15 13 9 14 -11 -13 2 0 -10 1 1 -14 -9 -1
7254 -1 16 1 -5 -12 -7 3 2 -10 -20 -18 -9 17 7 -11 -3 -22 -7 1 6 -1 -22 -20 -9 -6 -19 -24 -21 -23 -8 -2 6 -19 -7 -3 1 3 -4 -14 -15 -11 1 14
7296 14 4 -6 -11 3 2 -1 5 -4 -8 14 1 -1 9 5 -8 -2 12 2 -13 -9 -14 -1 4 -12 -14 -7 8 -11 -1 -12 -1 -1 -10 1 2 1 -15 -6 -5 11
$$ packed form
7029b3NJ3J9jkm1J3K4kj3mrNJ9QNm1kJ4L0qJ0j7j1nL1J4k2j8QJRJ5rk9j2K8K0
7067B2j2j2j7%L0OJ0k7k6OK2J1Lk1j4kK7J0Kl4oPJ4J5nj1k9J5L6%k7j3nJ3J3J3
7103A4jl2j3K3K6pk2Mj0J1J5J5k7k1J5L8j8Nj0k8mN4J9l2j5oPRJ3qk8rJ4K2Kk1
7139fpk%K8Pj7k2mK9JJ1ol2jJ6J8J1l9%lJ3K3mj1j8j0L6K4k7k5oJ3J5J2j3j7j5
7176b8K2J8Jj0qj9K5J4olk3J9JPJ0k2mj1K4L1k2k5%mJ7J9ok3k7J5K5J2j7lk0R
7212a2OK5pl3JMPJ8j4lqJL1nj2k6K0J1OoLl0OJ5PJlj9JK8mNk5kJ5kj0J1%j5NQ
7254aJ7j5opNJ0jj2j0KRK6j0j8Qj9J5QNpk1KJ1Lj3nLkJ5OQk5J2MMKpj0jMJ2J3
7296A4j0j0nJ4jlOrmK2j3kJ0mj3OJ4j0j5MnJ3Nj6kPJ5j9J0j1J1%rJ1Jjj6RJJ6
$$ plain form
7336 11 -7 -8 -16 -6 -6 -7 -10 -11 -9 -4 -6 2 3 -4 -5 -5 -16 -7 -14 -4 -7 3 -12 3 -2 -8 -19 -8 -6 -12 -3 1 -1 10 2 0 -4 0 7 7 13 -2 6 4 6 -2 -5 -13 -14
7385 -14 -1 4 7 -2 -24 -2 -8 4 -2 1 -9 -26 -9 1 -1 -8 -9 -16 -1 -9 -9 -13 -8 3 6 7 7 -16 -8 2 7 8 2 -14 -8 5 10 -2 -2 -9 4 11 5 -2
7429 -2 5 -9 -9 -5 2 4 -7 -13 -8 4 12 -1 -10 -4 2 1 5 2 -10 -17 0 0 7 -2 -10 -10 -4 -6 -6 -13 -18 -4 -18 7 -15 -18 -29 -14 -5 -5 -9 -18 -23 -9 -6 -1 9
7476 9 2 -13 -22 2 6 5 -13 -22 -4 16 11 -15 -11 -10 10 5 19 9 -3 -12 -7 1 5 -7 -4 -15 -10 6 8 -2 -2 -19 -2 5 4 -4 -22 -10 3 0 1 -11
7518 -11 -19 -7 -2 -1 0 -12 -12 -15 -2 4 -12 -18 -20 -5 3 -11 -7 -14 -15 -5 -3 -8 -15 -8 -4 -9 2 1 -3 -11 2 -3 3 5 3 -8 -9 10 11 6 -15 -12 -2 3 7 -5
7564 -5 -12 -17 -11 12 -2 -13 -24 -18 3 -10 -2 -12 -29 -1 0 -4 -8 -13 -16 -16 -1 0 3 1 -13 5 9 -7 0 -13 -18 -11 4 4 -8 -5 -21 -9 1 1 -8 -16
7606 -16 2 -2 -2 0 -6 -6 -19 -10 9 3 -8 -17 -7 7 -2 -4 -10 -1 -12 3 7 -6 -10 -21 -5 3 0 5 -20 -23 -1 4 -4 -17 -6 -16 -10 -7 -3 -13 -19 -6
7648 -6 2 12 -1 -8 -15 -8 -2 -2 -1 -15 -5 -3 -6 -4 5 3 -3 -7 5 4 4 -15 5 4 -4 7 6 -11 -13 11 -4 -13 3 -11 -20 -7 -8 5 1 8 -8 -5 -8 -6 -8
$$ packed form
7336A1j8jqJ0%jljKNkQJpj%j1RpJ0lJ0j5J5noj1J1KoRMkJ1qkmMP%Oj5QkKqlqj
7385a4J3NLrk2K2oJ2oLj0j7J7J0kpjpJ5q%mNJ1LJ%k3QJ0NJoj6OJ3Nj2%pJ3Pop
7429bPj4%MPKj1oNJ2Qj3rOOjMlj2pJ7%Prq%Ok%pnJ4j4K5k2lj1J5R%mrnJ4LNJ0
7476Ipj5rK4Mjj8rJ8K0nk6MJK0nJ4j0j2rNQMj2Lj1NJ6Kj0%j7J7Pjqj8J2J3lJj2
7518a1qJ2NJJj2%lJ3Oj6okJ5Qj4MpjJ0KnpPMnJ1jmqJ3nOKkj1jJ9Jnk1LJ0NMj2
7564epnOK3j4j1j1OK1j3Qj0j7K8Jmmnl%J5JLkj4J8Mj6Pj3nPJ5%j2Lj6J2J0%rq
7606a6J8m%Ko%j3RJ9oj1rJ0J4rkoRj1J5Mj3mj1J6QlNk5lK2Nqj3J1j0OLMj0oJ3
7648fQJ0j3ppPO%Jj4J0KlKRkomJ2j%j9K0jqJ1jj7kK4j5rJ6j4rJ3jJ3mPj6LlKk
$$ plain form
7693 -8 -14 -15 -11 -6 1 -12 -5 5 0 -6 -6 -7 -12 3 -4 -1 -9 -6 -9 -9 -1 -2 2 -18 -8 -6 -6 -2 9 1 0 6 12 -1 -8 -4 2 9 -3 3 2 -7 -10 0 12 6 7 -5 -5 -15
7743 -15 3 0 -9 -6 -1 10 2 4 5 -3 -18 -15 0 -4 15 1 -3 -8 -2 9 -7 -1 4 1 -9 -13 -4 22 -4 -3 -6 -6 -6 10 -2 -7 -10 -5 -4 -3 8 -8 -3 -5 -2
7788 -2 0 2 5 4 14 -12 -9 5 0 -10 -13 2 4 5 -6 -7 3 0 16 7 -11 -9 -14 1 3 -2 -4 -16 -7 -9 4 -22 -5 -4 -3 -1 -11 -1 -8 7 -1 -2 17
7831 17 0 -3 6 -3 7 0 2 -15 0 5 16 -13 13 12 -2 6 9 2 0 -2 8 16 7 2 -3 -7 -2 8 -1 -3 8 4 9 -14 14 3 -10 -2 0 -4 -9 13 -5
7874 -5 -13 0 2 0 -1 -7 0 4 4 3 -10 -8 -2 -8 -2 -10 -13 -17 -5 -3 -10 -10 -16 3 -9 1 -2 -13 -14 -16 -5 2 2 7 2 -12 9 17 6 17 5 -6 3 4 -1 -3 -6
7921 -6 1 5 0 11 -1 -13 0 14 -2 -3 -6 -6 -3 -11 -5 -2 -16 -5 -4 -6 2 7 -6 -8 -8 -3 -4 -3 -5 -7 -5 -4 1 -6 -8 -4 -2 2 -3 -5 -18 -11 -1 -12 -1 -7 -1 4
7969 4 2 2 12 4 -1 4 -1 3 5 11 -1 9 -2 7 11 0 1 -3 20 12 -7 9 -1 7 15 6 -1 -9 -8 -3 8 -2 -13 -23 -10 -4 4 -7 -28 -12 -5 -5 0 -9
8013 -9 -15 -6 -6 6 2 -5 -5 0 8 6 5 0 -5 2 4 7 6 0 6 5 -5 4 -3 0 -9 -10 3 -5 8 -3 -4 -5 9 -5 -2 -3 -5 5 5 -6 -2 -8 -2 2 12 -9 -5 0 -10
$$ packed form
7693hojMNPj3PJ0no%jnJ5pLqLl%QjMk0J0K%MJ1qjOOj3pMOPj2OjrlJ0J2oJj2%j0
7743a5J8lrLNJ1qKJqj5LJ5mJ9j4mnOJ1j6ONlj0mRK6k6Jl%%J6j2nlNJJJ1j6NkL
7788bKKLjJ0k6LJ4nj0lJ5KJj1jJ0lJ6rj8KnJ5Knkj2RkJ3k6J7JJKj0J0pJ5qjJ9
7831A7j7lRrJ0pKj7J5NJ1k9K6jj4QLpkkJ0QrnnmNJ0rkJ1mNk3K8j1j3QKmnK2j8
7874eqJ3KkjoPM%jj3KOoOqlmJ2Kp%oJ9j2J0lj1jkJ1P%Nnj4K1Qj1J1j2j1RJnkl
7921fPMnJ1j2j2J3J4j6jl%LqOLj4J1JkQNj3k%NjJkkKJNpkMKMnkj3PJ0j1J1oON
7969Dk%J0qnNnMKOj2J0j1RMj1JmK3qj9J6j0QQrpqJNJ1j0j1j0J3OQj1k1J6P%Nr
8013ioR%J2mp%NQkjnnPKLjoOjj0RpLrjJ3qJ3j1jjJ4j4LjkJ0%j1MoOMJ0k1MNj0
$$ plain form
8062 -10 2 -5 7 -16 -17 -8 -11 9 -3 -11 -17 -17 -14 -13 -9 -10 -10 -16 -13 -2 1 9 -1 -1 -9 -4 1 -7 -4 10 0 1 13 -13 -2 -10 -10 2 1 -3 1 -13 -9 -9 2
8107 2 -18 -15 -11 -1 -4 -11 -7 -16 -2 6 -7 -2 -19 -8 -5 -10 -3 -13 -23 -7 5 -10 4 -12 -25 -7 -8 -14 -10 -9 -7 -19 -10 -2 -3 -8 -2 5 -4 -19 1 3 -3
8150 -3 2 -1 0 -16 -10 5 0 3 2 18 2 3 5 8 7 -1 0 -9 5 5 -2 -5 -8 -8 -12 0 -6 -4 -11 -8 -13 -1 5 -18 -14 -14 -11 -15 4 -4 -2
$$ packed form
8062a0J2pJ2k3jRlK0j2qo%LJMj%oLJ1LQj0%qNNqLJ4j0JJ2k6J1q%J2jmMj4M%J1
8107Bk0LMJ0lpMrJ4Qj3Nj7J1LnPj0j0J6J2j5J4j6j3J8joMJKj2RQjnOPrj5K0Ko
8150cNlJj6OJ5nLjJ6j6JKLjqJrJ4%pll%mJ2oKpLnJ2Ok3M%LmJ9qK
8191b
$$ Imaginary data points
##PAGE= N=2
##DATA TABLE= (X++(I..I)), XYDATA
$$ plain form
0 0 0 0 0 0 0 0 0 0 0 0 0 0 0 0 -4 8 -8 8 -8 8 -8 16 -16 16 -22 24 -24 32 -32 40 -41 48 -56 62 -68 76 -86
37 -86 94 -104 116 -129 142 -157 174 -193 215 -237 263 -295 331 -373 426 -484 564 -666 805 -1005
57 -1005 1321 -1898 3299 -13514 -4860 26779 3626 -5828 4698 -2632 -19535 2929 23481 2930
71 2930 -17871 -3207 4655 -2919 5497 15345 -6685 -21671 611 17021 1607 -4563 5527
84 5527 -1154 -13048 992 13951 -107 -10632 756 5489 -1900 -184 3295 -5359 -6531 6565
98 6565 8278 -3927 -5337 1295 -666 -1820 5225 3352 -7668 -6251 5674 8098 1973 -2537 -6664
113 -6664 -6812 3117 10524 4321 -3541 -5071 -6277 -2364 9837 10609 -5704 -12035 -387 5352 2271
128 2271 4851 2863 -11147 -11599 7416 12742 -747 -4362 -415 -6804 -6139 11269 12407 -8521
$$ packed form
0@%%%%%%%%%%%%%%mJ2j6J6j6J6j6K4l2L2l8M6m8N6o4P2q1Q9j04J18j30J44j62
37h6J80j98K20k45K71k99L31l67M08m52N00n58O26p04P99r10J048j230J471j810
57a005K326l219N197j6813Q654L1639k3153r454J0526p330j6903K2464K0552k0551
71B930k0801J4664P862p574Q416R848k2030j4986K2282J6410j5414o170J0090
84E527o681j1894J4040J2959j4058j0525J1388M733p389J716L479q654j172J3096
98F565J713j2205j410O632j961j154P045j873j1020J417J1925K424o125m510m127
113f664j48R929P407o203p862j530j206L913J2201P72j6313o331J1648N739l081
128B271K580j988j4010m52J9015N326j3489l615L947o389O65J7408J138k0928
$$ plain form
142 -8521 -11484 5338 5275 -4772 2610 7415 -7941 -10816 8985 11981 -5533 -6511 4159 -1177
156 -1177 -5876 6598 8031 -8491 -7829 8571 5473 -7478 -1541 5197 -5158 -5806 9942 7983
170 7983 -9986 -8371 5670 3194 -3075 3699 3458 -8539 -5369 9379 6540 -5830 -3615 1781
184 1781 -2899 -880 9467 4897 -9536 -7531 4282 4491 387 2588 218 -6984 -3183 6439 4587
199 4587 -2854 -2891 -1282 -2129 1820 6023 470 -6249 -3164 1930 1779 1843 2073 -2202 -4313 639 3513
216 3513 311 -931 177 -1501 -1054 3509 2646 -3269 -2645 2096 952 -876 2197 1152 -4259 -1761
232 -1761 4615 1484 -4038 -478 2447 -1833 -1223 4272 664 -6183 -1543 4984 784 -2679 1723
247 1723 913 -4805 -778 6281 1247 -5267 -390 3413 -1371 -1292 4155 832 -5450 -951 4825 731
$$ packed form
142h521k963J6822o3j0047P382M805j5356k875J9801K996j7514r78J0670n336
156a177m699J2474J433j6522O62J6400l098j2951N937O738j0355o48J5748j959
170G983j7969J615J4041k476o269O774k41j1997L170J4748k839j2370K215N396
184A781m680K019J0347m570j4433K005J1813K09m104K201k370p202L801R622j852
199D587p441l7J609q47L949M203n553o719L085N094j51O4K30m275k111M952K874
216C513l202j242J108j678M47M563q63n915O24M741j144j828L073j045n411K498
232a761O376l131n522L560K925m280O10N495l608o847M640O527m200l463M402
247A723q10n718M027P059n034o514M877L803m784P9N447l323o282M499N776m094
$$ plain form
263 731 -2342 1388 647 -3706 -98 4647 -111 -4080 691 2290 -2440 -1226 3602 210 -4362 91
279 91 3611 -932 -2449 1941 1220 -2851 -362 3047 -368 -2406 1449 1884 -2045 -1059 2528 623
295 623 -1996 477 1726 -1121 -1222 1588 885 -1317 -337 639 -573 -173 1143 -355 -1590 245 964
312 964 -680 -298 885 -875 -1775 1110 1972 -1019 -1433 969 414 -1134 794 1769 -1238 -1931 1427
329 1427 1987 -695 -788 442 -634 -673 1855 1638 -1522 -1691 618 604 -117 812 128 -2175 -1116 2015
347 2015 1522 -1049 -1272 -658 -733 861 2531 268 -2692 -1389 1106 909 635 1098 -813 -2791 -5
364 -5 3516 1647 -2000 -1829 -65 373 1368 2258 -108 -3144 -1968 1480 2386 867 -803 -2023 -1649
381 -1649 905 2610 811 -2008 -2437 -649 1495 2460 977 -1930 -2802 -571 1969 2405 826 -1551
$$ packed form
263G31l073L730p41m353L608M745m758l969M771J599m730J214M828l392m572M453
279I1L520m543j517M390p21m071K489L409l415k038L855M35l929R86L587j905
295F23k619K473J249k847j01K810p03k202R80R76j212M00J316j498j235J835P19
312I64j644L82J183j760r00K885Q62k991m14K402n55j548J928R75l007o93L358
329A427N60k682r3J230j076l9K528k17l160j69K309j4p21R29o84k303J059L131
347B015m93k571k23O14p5J594J670k263k960J303K495j97k74M63j911j978K786
364eL521j869l647J71J764M38R95Q90k366l036J176L448R06j519j670j220L74
381a649K554J705j799k819m29J788K144R65j483k907q72K231K540M36j579k377
$$ plain form
397 -1551 -2551 -451 2570 2442 -501 -2279 -1429 448 2088 2344 20 -2915 -2547 919 3009 1581
413 1581 -1095 -2416 -1641 597 2362 1481 -1400 -2917 -1221 1808 2869 846 -2129 -3011 -864 2107
429 2107 2906 805 -1977 -2665 -525 2283 2780 352 -2490 -2540 371 3053 2551 -528 -2968 -2473 474
446 474 3093 2629 -693 -3279 -2272 908 2813 1853 -1018 -3260 -2204 1597 3648 1297 -2356 -3151
462 -3151 -1063 1670 3214 1860 -1875 -3745 -1105 2625 3070 585 -2014 -2736 -574 2825 3314 -168
478 -168 -3192 -2435 360 2558 2856 296 -3312 -3352 627 3323 1811 -1040 -2561 -2172 513 3355 2219
495 2219 -2082 -3690 -1088 1790 2761 1904 -1155 -3904 -1993 2716 3733 566 -1970 -2284 -1138 1752
511 1752 3833 1024 -3537 -3264 765 2780 2208 751 -2209 -4094 -777 4036 3167 -1371 -2949 -1655
$$ packed form
397a551j000K100L021j28k943j778Q50J877J640K56k324k935L68L466K090j428
413A581k676j321P75K238J765q81k881j517J696L029J061k023k975q82K147K971
429B107P99k101k782o88K140K808M97k428k842n0K911K682n02l079k440M95K947
446D74K619m64l322k586J007L180J905r60k871k242J056L801K051k351l653p95
462c151K088K733J544j354l735j870K640L730M45k485k599p22K162L399M89l482
478a68l024P57K795K198K98k560l608m0L979K696j512k851j521L89K685K842j136
495B219m301j608K602K878R71q57l059k749J911M709J017l167k536l14J146K890
511A752K081k809m561K73M029K015n72j457k960j885L317M813q69m538j578J294
$$ plain form
527 -1655 -201 1951 3161 -127 -4225 -2602 2153 3256 1099 -718 -2304 -2693 553 3992 2245
542 2245 -2085 -2916 -564 1347 2199 1563 -1253 -3138 -832 2551 2554 40 -1914 -2327 -765 2069 2777
559 2777 -32 -2698 -2039 368 1928 1772 -251 -2604 -2182 1000 2977 1507 -1347 -2747 -1546 1319
575 1319 3017 1605 -1270 -2598 -1429 1269 3238 1739 -2159 -3349 -317 2416 2160 763 -1140
590 -1140 -3149 -1932 2520 3830 -57 -2888 -1798 -422 553 2533 1928 -2556 -3918 615 3354 840
606 840 -948 -412 -1383 -1711 1851 3633 -367 -3371 -796 1584 753 572 807 -1265 -2143 1035 2780
623 2780 -19 -1962 -598 130 -34 1387 1530 -1664 -2883 481 2532 528 -1011 -644 -1082 -906 1748
640 1748 2602 -846 -3166 -901 1556 1410 948 420 -1770 -2608 618 3429 1483 -1689 -1719 -410 111
$$ packed form
527a655J454K152J210l288m098J623M755J103k157j817j586l89L246L439j747
542B245m330q31K352J911Q52o36k816j885K306L383Lk514j954m13J562K834P08
559B777k809k666O59K407J560j56k023k353M22L182J977j470k854j400J201K865
575A319J698j412k875j328J169K698J969j499l898j190L032K733k56j397j903
590a140k009J217M452J310l887k831J090J376R75J980o05m484j362M533K739k514
606H40j788N36r71l28L562J782m000l004K575K380q31j81K35k072q78L178J745
623B780k799j943J364P28j64J421J43l194j219L364K051k004j539L67m38J76K654
640A748Q54l448k320K265K457j46m62n28k190q38L226K811j946l172l0J309N21
$$ plain form
657 111 1257 2309 132 -3077 -2012 1806 2408 23 -867 -591 -1387 -991 1799 2422 -940 -2708 -330
674 -330 1318 166 -59 782 -461 -1741 223 1942 102 -1339 234 818 -639 -216 1315 37
690 37 -1461 495 1887 -542 -1894 406 1349 -340 -225 975 -610 -2078 300 2267 293 -1396
706 -1396 -424 -287 -925 860 2268 -375 -2726 -666 1494 505 61 1085 -340 -2531 -583 2684
722 2684 1621 -1186 -921 146 -618 -260 1881 1436 -1492 -1851 464 982 -67 361 756 -959 -1770
739 -1770 340 1604 36 -833 212 -39 -1346 -261 1727 675 -1336 -553 711 -419 -745 1361
755 1361 1503 -1182 -1571 773 944 -480 415 1362 -799 -1984 583 1866 -191 -726 745 -296 -1876
772 -1876 373 2418 -99 -2069 43 937 -1125 -559 1969 560 -2300 -802 1570 73 -994 977
$$ packed form
657A11J146J052k177l209J065L818O02k385q90K76p96L96K790O23l362j768K378
674c30J648j152k25Q41j243j280J964J719j840j441J573N84j457M23J531j278
690C7j498J956J392k429j352K300R43j689J15J200j585j468K378J967j974j689
706a396R72J37o38J785J408k643k351K060K160r89m44J024j425k191J948L267
722B684j063k807K65J067p64L58K141m45k928l59K315N18j049M28L95j715q11
739a770K110J264j568q69J045k51j307J085J988j052k011P83J264j130l26K106
755A361J42k685l89K344J71j424Q95R47k161j185K567J283k057n35J471j041j580
772a876K249K045k517j970K112Q94k062N66K528j409k860J498K372j497j067J971
$$ plain form
788 977 957 -1604 -1018 1538 684 -1062 436 1248 -1162 -1525 1360 1607 -866 -685 902 -379 -1484
805 -1484 799 2015 -364 -1636 -124 232 -489 642 1460 -680 -2118 -225 1298 328 -123 439 -490
822 -490 -1637 -71 1960 1048 -1067 -1038 80 240 311 939 543 -931 -1177 326 1241 406 -422 -264 -228
841 -228 -450 274 998 -8 -1218 -329 898 69 -787 196 495 -757 -545 1003 338 -1405 -368 1432
859 1432 389 -1025 -31 476 -694 -65 1710 478 -1788 -703 1215 455 -136 887 -67 -2054 -430
876 -430 2311 995 -1394 -529 243 -1042 -127 2345 772 -2611 -1489 1423 739 -465 762 312 -2149
893 -2149 -1077 2232 1476 -1307 -762 533 -595 -421 1876 1123 -1915 -1321 1392 923 -693 164 655
910 655 -955 -876 1174 989 -948 -828 429 202 -156 339 -133 -1005 -171 965 254 -703 -324 -36 -193
$$ packed form
788I77k0k561N86K556q54j746J498Q12k410l63K885K47k473J81J587j281j105
805a484K283J216k379j272J512L56p21J131Q18k140j438J893J523r70m51N62r29
822d90j147J566K031r12k115K9J118J60P1O28l96j474k46J503R15q35q28J58L6
841b28k22P24P24j006j210Q89J227q29q56R83K99j252K12J548o65j743J037J800
859A432j043j414R94N07j170O29J775j232k266J085J918p60n91J023r54j987J624
876d30K741j316k389Q65P72j285R15K472j573l383J122K912o84j204J227m50k461
893b149J072L309p56k783N45J295j128J74K297p53l038N94K713m69j616Q57M91
910F55j610P9K050j85j937J20J257k27l58M95m72q72Q34J136p11r57L79K88j57
$$ plain form
929 -193 451 847 -284 -1141 -233 805 753 341 -259 -936 -508 845 1175 210 -569 -774 -523 500 1336
948 1336 461 -1006 -979 -120 382 865 743 -753 -1665 -229 1185 570 -168 -140 -783 -1084 643 1729 -75
967 -75 -1426 -243 497 -153 447 1184 -499 -1769 222 1754 180 -847 161 54 -816 403 1467
984 1467 -296 -1509 68 923 -166 -114 561 -633 -1314 613 1518 -413 -1286 75 325 -370 455 954
1002 954 -672 -1324 404 1168 78 -199 108 -626 -583 1062 1252 -589 -1052 150 330 -35 582 535 -911
1021 -911 -1024 503 909 -23 -311 -223 -601 -234 821 546 -679 -686 36 94 130 497 -9 -791 -285 639 404
1042 404 -120 -31 -128 -341 265 759 19 -639 -113 345 139 198 240 -394 -555 358 637 -126 -342 -16 -252
1063 -252 -252 562 529 -673 -823 235 501 -32 48 50 -608 -404 686 693 -299 -424 16 -95 34 760 445 -736
$$ packed form
929a93O44L96j131q57R08J038n2m12o00o77M28J353L30r65p79k05K51J023Q36
948A336q75j467K7Q59N02M83j22j496r12J436J414o15p38K8o43l01J727J086j804
967g5j351J183P40o50O00P37j683j270J991J532j574j027J008j07q70J219J064
984A467j763j213J577Q55j089N2O75j194o81J927R05j931q73J361K50o95Q25M99
1002I54j626o52J728P64j090k77L07p34M3J645J90j841m63J202J80l65O17m7j446
1021i11j13J527M06r32k88Q8l78L67J055k75j225pP22N8L6L67n06p82N06R24k35
1042D04n24Q9r7k13O06M94p40o58N26M58k06N9M2o34j61R13K79p63k16L26k36
1063b52%Q14l3j202j50J058K66n33Q0Ko58K04J090Pr92j25M40j11J29P26l15j181
$$ plain form
1085 -736 -676 428 631 44 4 -44 -522 -282 573 535 -251 -458 -239 -178 148 523 34 -688 -432 239 222 33
1107 33 113 -134 -503 -128 526 329 -171 -139 20 -79 93 430 166 -344 -173 269 204 -35 12 63 -79 -94 96
1130 96 115 -48 -150 -70 35 -6 -89 -105 -37 -3 -36 -25 -71 -145 -23 172 107 -147 -120 86 94 26 124 117 -110 -161 115
1157 115 290 129 -86 -145 -34 131 166 21 -80 -55 -110 -95 127 182 -142 -335 -68 99 -21 -22 42 -146 -228
1180 -228 62 248 28 -109 20 27 -23 115 215 38 -83 -14 68 112 133 6 -74 36 79 -83 -25 147 -11
1203 -11 -249 -27 140 -170 -200 178 43 -426 -111 329 -111 -409 212 338 -424 -358 479 297 -428 -75 417
1224 417 -101 -331 369 391 -332 -156 378 -45 -282 397 375 -542 -324 557 147 -536 112 465 -458 -547 506
1245 506 359 -588 -206 456 -236 -538 462 493 -594 -339 633 122 -600 250 680 -363 -548 526 435
$$ packed form
1085g36O0J104K03n87m0m8m78K40Q55l8p86k07K19O1L26L75m89p22K56O71j7j89
1107C3Q0k47l69L75O54j97n00L2J59r9J72L37k64n10J71M42o5k39M7N1j42j5J90
1130I6J9j63j02Q0J05m1q3j6O8L4l3J1m6p4J22J95o5k54K7K06Qo8R8pk27n1K76
1157A15J75j61k15n9J11J65L5j45j01K5n5J5K22N5l24j93K67J67j20jO4j88q2
1180b28K90J86k20j37J29Pn0J38J00j77j21O9Q2M4K1j27q0J10M3j62N8J72j58
1203a1k38K22J67l10l0L78j35m69L15M40m40k98O21J26p62O6Q37j82p25L53M92
1224D17n18k30P00K2p23J76N34m23k37O79k2r17K18Q81m10o83O48L53r23q9J053
1245E06j47r47L82O62o92l02J000L1j087K55R72n11p22Q50M30j043j85J074r1
$$ plain form
1264 435 -496 -84 605 -84 -548 256 461 -327 -259 382 32 -491 -7 321 -157 -223 127 -99 -360 47 271
1285 271 -129 -144 111 -134 -270 253 387 -124 -227 72 6 -4 358 232 -311 -145 206 -22 -4 504 120
1306 120 -700 -241 613 139 -360 203 145 -696 -274 767 182 -682 -52 290 -536 -255 896 228 -1046
1325 -1046 -165 844 -202 -605 720 520 -999 -369 1129 186 -938 313 837 -663 -624 983 415
1342 415 -1081 -45 1110 -342 -1067 532 709 -852 -361 1001 -141 -1286 255 1110 -413 -711
1358 -711 630 121 -1091 151 1417 -68 -1188 93 630 -340 42 1015 -50 -1202 -102 928
1374 928 247 -101 283 -341 -930 228 1119 162 -647 -253 -146 -349 314 768 -100 -822 -414 116 259 397
1394 397 109 -511 -425 160 181 75 358 55 -615 -225 552 188 -234 245 222 -473 -172 520 11 -371 471
$$ packed form
1264D35r31M12O89o89m64Q04K05p88O8O41l50n23M84L28m78o6L50k26k61M07K24
1285B71m00j5K55k45j36N23J34n11j03K99o6j0L62j26n43J66L51k28J8N08l84
1306A20q20M59Q54m74m99N63n8q41M22J041n85q64O30L42q26K81J151o68j274
1325a046Q81J009j046m03J325k00j519O30J498r43j124J251N24j500L9J607n68
1342D15j496J036J155j452p25J599J77j561M91J362j142j145J541Q55j523k98
1358g11J341n09j212J242J266j485j120J281N37r70L82R73j065j152J100J030
1374I28o81l48L84o24n89J158Q91r57q09L94J07k03O63M54q68p22M08N30J43J38
1394C97k88o20Q6N85K1j06K83l03o70L90P77l64m22M79k3o95L01O92n09l82Q42
$$ plain form
1415 471 430 -808 -555 742 305 -596 275 547 -1039 -980 1117 1063 -818 -588 467 -525 -813 1254 1417
1434 1417 -1129 -1415 592 541 -358 823 1046 -1365 -1669 1105 1598 -448 -394 555 -839 -1314 1245 1940
1452 1940 -774 -1619 213 351 -525 664 1210 -958 -1670 462 1079 -298 -119 565 -701 -1167 769
1469 769 1342 -546 -879 514 241 -703 272 965 -309 -797 456 570 -463 -221 527 59 -293 291
1487 291 170 -621 -241 677 378 -363 -356 -186 -195 242 569 42 -547 -534 -196 379 835 218 -863 -755 228
1508 228 467 359 497 -174 -1144 -410 1092 808 -268 -246 -202 -750 52 1434 531 -1246 -720 558 85
1527 85 -175 791 235 -1388 -657 1185 541 -751 -24 362 -751 -381 1201 432 -1216 -260 1029 -82
1545 -82 -707 623 532 -941 -233 1266 146 -1203 71 983 -243 -404 725 28 -1209 64 1381
$$ packed form
1415D71m1j238K53J297m37r01Q71K72j586N9K097n4j881K30J055r92k88K067J63
1434A417k546k86K007n1q99J181K23k411l04K774M93k046N4R49j394m75K559O95
1452A940k714q45J832J38q76J189N46k168p12K132O17j377J79O84j266m66J936
1469G69N73j888l33J393k73r44R75O93j274m88J253J14j033K42P48m68l52N84
1487B91j21p91L80R18k99p41PJ70rM37L27n27n89J3L38N75M56o17j081J08R83
1508B28K39j08J38o71r70P34J502k84j076K2M4n48Q02J382r03j777N26J278m73
1527H5k60R66n56j623P31J842o44j292P27L86j113L70J582p69j648R56J289j111
1545h2o25J330r1j473P08J499j120j349J274R12j226j61J129o97j237J273J317
$$ plain form
1562 1381 51 -1024 -29 234 -556 165 1138 -173 -1439 -241 875 224 -115 305 -350 -1035 111
1579 111 1222 371 -628 -386 -127 -122 516 816 -156 -828 -268 348 358 358 139 -533 -586 238 574 165 -168 -319
1601 -319 -370 17 465 124 -323 -145 -24 -194 133 459 -169 -622 121 560 -97 -301 220 59 -322 263
1621 263 570 -316 -558 352 431 -260 2 391 -412 -628 588 753 -503 -640 270 83 -409 365 580 -626
1641 -626 -831 400 541 -285 -56 291 -493 -595 647 747 -487 -511 352 58 -353 445 635 -493 -649
1660 -649 455 502 -257 -28 352 -274 -455 398 494 -335 -337 224 2 -263 188 245 -339 -278 245 97 -245 31
1682 31 151 -212 -151 266 95 -248 -21 214 -21 -63 174 12 -167 116 201 -123 -81 197 -17 -242 110 248
1704 248 -177 -240 146 73 -217 -21 153 -147 -187 100 3 -211 86 217 -223 -258 230 179 -213 29 303 -111
$$ packed form
1562A381j330j075R95K63p90P21R73j311j266J198J116o51l39M20o55o85J146
1579A11J111q51r99K42K59NO38L00r72o72N60O16J0%k19o72n3Q24L36m09l33j51
1601c19n1L87M48l41m47J78J21j70L27L26o28m53P43M39o57k04N21j61l81N85
1621B63L07q86k42R10P9o91K62L89q03k16J216J65j256j37R10j87m92P74K15j206
1641f26k05J231J41q26K29L47p84j02J242J00j234k4Q63k94m11P98J90j128j56
1660f49J104M7p59K29L80o26j81Q53R6q29kN61k22k65M51N7n84O1N23j48l42K76
1682C1J20l63O1M17j71l43K27K35k35m2K37j62j79K83Q5l24M2K78k14k25L52J38
1704B48m25o3L86p3k90J96J74l00m0K87r7k14K97J31m40l5M88n1l92K42K74m14
$$ plain form
1726 -111 -299 254 353 -126 -103 188 -44 -175 301 335 -280 -311 228 153 -158 98 188 -356 -371 271 338 -203 -227
1749 -227 11 -155 -126 321 229 -371 -345 147 200 31 122 -26 -333 -114 419 300 -120 -152 -69 -111 159 463 56
1772 56 -498 -231 259 218 38 29 -206 -408 5 469 189 -308 -326 -146 30 305 313 -217 -530 -119 356 330 84
1795 84 -126 -330 -199 332 549 103 -333 -335 -36 311 488 128 -454 -465 89 442 280 -53 -368 -454 -32 500
1817 500 383 -215 -537 -331 79 419 389 -170 -639 -350 303 539 208 -238 -470 -271 297 639 281 -348
1837 -348 -514 -151 358 616 259 -414 -651 -76 569 523 -13 -450 -511 -104 469 602 9 -633 -566 63 557
1858 557 488 -73 -638 -539 165 688 439 -252 -599 -345 227 644 468 -213 -716 -366 450 749 254 -417 -603
1879 -603 -240 370 670 245 -526 -752 -123 553 569 31 -537 -674 -132 602 641 -99 -727 -541 72 577 565
$$ packed form
1726a11j88N53R9m79K3K91k32j31M76L4o15l1N39p5l11K56R0n44j5O42O7n41k4
1749b27K38j66K9M47r2o00K6M92N3j69R1j48l07K19N33j19m20l2Q3m2K70L04m07
1772E6n54K67M90m1j80rk35k02M13M64k80m97j8J80J76K75Qn30l13M11M75k6k46
1795H4k10k04J31N31K17m46m36kK99L47J77l60n82j1N54L53j62l33l15q6M22N32
1817E00j17n98l22K06M10L40l0n59m69K89O53K36l31m46k32J99N68L42l58o29
1837c48j66L63N09K58l57o73k37N75O45m6n36m37o1M07N73J33n93o42O7O29M94
1858E57o9n61n65R9P04N23k49o91l47K54N72M17j76o81n03L50Q16K99m95o71j86
1879f03L63O10L00m25p71k26O29O76J6n38n68j37N42P34L9p40o28J86O13N05j2
$$ plain form
1900 565 -27 -726 -619 302 849 419 -300 -584 -351 208 778 571 -324 -847 -341 512 768 299 -417 -773
1920 -773 -335 532 789 137 -617 -691 -169 446 699 208 -639 -860 -110 745 704 -70 -718 -579 88 652 587
1941 587 -31 -656 -617 147 808 600 -244 -743 -440 286 743 493 -338 -855 -345 479 680 197 -332 -670
1961 -670 -476 386 932 248 -803 -734 50 493 488 279 -423 -910 -170 917 753 -238 -587 -365 -86 491
1981 491 881 95 -952 -612 451 655 260 28 -434 -766 8 1030 544 -653 -710 -47 163 276 492
2000 492 -123 -950 -474 645 644 -113 -386 -334 -296 259 826 180 -793 -538 367 511 217 95 -292 -640 -40
2021 -40 861 583 -405 -695 -198 257 508 428 -209 -788 -443 420 716 229 -421 -667 -349 320 694 355 -420
2042 -420 -800 -329 549 757 141 -470 -513 -207 274 717 432 -503 -790 16 605 349 64 -96 -533 -456 489
$$ packed form
1900E65n92o99J07R21N47m30p19k84K33N59N70k07q95n23N06Q53K56m69p16l56
1920g73M38Q67K57o52p54p4N22O15K53m91q47k21P50Q55m1p74o48J39O67N64o5
1941E87o18o25L9P64O61k08q44m99L03P26M57k50q31n17N10Q24K01m83n29l38
1961f70J94Q62N46o84j051O9P84M43nk09p02m87P40J087j64r91l49K22K79N77
1981D91L90p86j047L40J063K04l95k32m62l32P74J022m86j197n7O63K10J13K16
2000D92o15q27M76J119jp57k73N2L8N55N67o46r73K55R05J44k94j22l87l48O00
2021d0R01k78r88k90M97M55K51q0o37n79L45Q63K96m87o50k46L18O69L74l39p75
2042d20l80M71Q78K08o16o11m3L06M81M43k85r35k87Q06N89k56k85j60m37P7R45
$$ plain form
2063 489 795 -173 -695 -95 165 -69 210 394 -412 -745 235 670 -154 -432 117 -27 -328 339 612 -455
2083 -455 -757 372 705 -171 -235 255 -220 -499 536 889 -374 -837 134 407 -69 253 437 -570 -893
2102 -893 378 903 -75 -464 -11 -221 -424 447 818 -275 -868 -91 366 74 165 306 -335 -671 158 671
2122 671 138 -237 -40 -73 -218 182 447 26 -361 -122 147 103 36 44 -51 -129 -36 20 18 -31 -71 -21 69 -68 -178
2147 -178 10 163 -25 -75 125 -30 -307 54 504 84 -397 -8 249 -124 -37 489 132 -556 -156 488 86
2168 86 -238 250 172 -569 -217 642 187 -553 -20 350 -381 -417 554 371 -637 -315 473 -52 -511 336 557
2189 557 -487 -529 455 294 -417 121 578 -323 -659 363 590 -258 -191 359 -151 -581 325 728 -231 -582
2209 -582 130 161 -278 143 518 -227 -703 21 470 25 -122 79 -181 -356 194 481 -57 -312 0 71 -25
$$ packed form
2063D89L06r68n22O00K60k34K79J84q06l33R80M35q24k78N49j44l01O67K73j067
2083d55l02J129L33q76o4M90m75k79J035L53j263m63R71K73m76L22J84j007l23
2102h93J271N25r78l89M53k10k03Q71L71j093n93P77M57k92R1J41o41l36Q29N13
2122F71n33l75J97l3j45M00K65m21l87K39K69m4o7Qr5p8R3N6km9m0N0R0j37j10
2147a78J88J53j88n0K00j55k77L61M50m20m81L89K57l73Q7N26l57o88M00O44m02
2168H6l24M88p8p41L52Q59m55p40N33L70p31l6R71j83j008L22P88n25m59Q47K21
2189E57j044m2R84j61p11N38M57r01l36J022K27q48O7N50n10m30R06M03r59l51
2209e82P12L1m39M21L75p45m76P24M49m45j47K01k60j75N50K87n38k55L12P1r6
$$ plain form
2230 -25 185 256 -170 -315 93 297 98 -112 -134 -74 104 172 -13 -158 -116 -95 19 257 120 -379 -386 139 296
2253 296 46 -43 -163 -412 -88 581 383 -369 -375 -1 -4 138 601 182 -778 -509 566 572 -59 -37 -48 -538 -171
2276 -171 842 580 -563 -590 105 91 48 518 143 -865 -547 631 539 -249 -194 -36 -424 -136 757 414
2296 414 -686 -519 331 289 -2 224 25 -617 -223 682 456 -390 -353 23 -27 162 517 -12 -753 -333 500
2317 500 413 -61 -166 -305 -416 141 711 225 -591 -562 -22 322 458 240 -401 -666 -58 581 517 57 -351
2338 -351 -553 -118 601 659 -25 -574 -432 36 497 580 -6 -664 -500 221 516 317 -57 -503 -598 112 745
2359 745 344 -450 -541 -199 101 468 445 -291 -798 -192 558 466 37 -213 -463 -345 426 810 73 -673 -424
2380 -424 125 349 457 208 -533 -757 106 778 377 -263 -430 -394 -92 569 666 -228 -834 -336 339 497 315
$$ packed form
2230b5K10P1m26j45M08K04j99k10k2O0J78O8j85j45M2K1J14K38j37m99pN25J57
2253B96k50q9j20k49L24O69j98p52oL74lJ42M63m19r60K69J075Oo31K2j1m90L67
2276a71J013k62j143k7O95j4m3M70l75j008L18J178r2p88N5J58l88K88Q93l43
2296D14j100J67Q50m2k91K26j99o42L94R05k26q46L7L76n0J89L55n29p41M20Q33
2317E00q7m74j05j39j11N57N70m86q16K9N40L44J36k18o41k65O08O39o4m60m08
2338c51k02M35P19N8o84n49J42M68M61Q3n86o58J64P21K95j99l74m46r5P10O33
2359G45m01p94r1L42L00L67k3p36n07O06P50r2m29k50k50J18P71L84p37p46K49
2380d24N49K24J08k49p41k24Q63O72m01o40j67L6L02O61R7q94o06M98O75J58j82
$$ plain form
2401 315 -78 -643 -521 352 799 237 -404 -462 -207 203 634 418 -402 -692 -88 491 474 118 -316 -566 -185
2422 -185 499 568 -56 -525 -403 -28 367 462 -9 -588 -466 170 495 289 -148 -475 -405 162 617 306 -333
2443 -333 -498 -146 275 491 289 -271 -568 -159 456 541 111 -350 -499 -151 477 603 2 -567 -447 43
2463 43 403 441 47 -519 -578 47 590 419 -154 -512 -423 76 573 433 -209 -580 -281 204 454 337 -107
2484 -107 -551 -376 290 603 224 -305 -453 -214 230 511 221 -327 -482 -127 281 377 127 -309 -504 -139
2504 -139 362 391 -40 -364 -304 -31 296 372 17 -389 -327 110 384 258 -64 -310 -248 143 423 223 -149 -317
2526 -317 -145 160 336 211 -194 -415 -131 285 315 11 -265 -304 -93 200 296 34 -292 -328 -31 269 298 -3
2548 -3 -322 -280 83 335 207 -70 -233 -183 60 285 243 -49 -289 -187 148 320 148 -158 -285 -101 149 233
$$ packed form
2401C15l93n65J22Q73M47n62o41n8K55M10M31k16q20k90O04N79j7l56m34k50L81
2422a85O84O9o24m69J22L75L95R5m71n79J22O36L25k06m37l27P0N67M55l11o39
2443c33j65L52M21K16k02n60k97M09O15Q5m30m61j49L48O28J26o01n69J20M90
2463D3L60L8l94n66n9O25N43j71n73l58Q9M99M97j40o42l71K99M85K50j17m44
2484a07m44J75O66L13l79n29j48K39M44K81k90n48j55L55M08R6k50m36j95L65
2504a39N01K9m31l24O0K73L27P6l55m06O2M37K74j26l22k46O2L91K80k00l72j68
2526c17J72L05J76j25m05k21K84M16L0l04k76l9K11K93R6k62l26l6K97L00K9l01
2548cl19M2L63K52j28k77j63N0K43K25m2k92k40J02L35J72j72l06j27J84K50Q4
$$ plain form
2570 233 70 -135 -245 -126 121 234 71 -186 -250 -53 166 208 32 -180 -187 3 166 158 27 -98 -137 -12
2592 -12 194 201 -18 -170 -72 79 130 81 -10 -107 -122 32 154 51 -125 -132 -37 22 55 21 -75 -149 -33 86 62 -40
2618 -40 -56 -48 -30 54 136 12 -118 -30 113 85 5 33 38 -51 -13 124 107 -60 -59 34 34 -9 38 15 -83 -46 69 33 -92
2647 -92 -6 57 -38 -73 40 78 -52 -54 77 32 -100 -14 114 51 -64 -1 48 -28 18 135 52 -126 -80 84 71 -12
2673 -12 30 -17 -138 -98 121 139 -89 -168 -54 23 5 93 60 -152 -182 61 177 37 -77 -27 -42 -54 115 210 -20
2698 -20 -192 -29 183 104 -12 20 -43 -109 55 221 37 -192 -85 100 37 28 73 -89 -262 -30 275 113 -222
2721 -222 -168 5 -5 50 197 2 -334 -184 239 262 -17 -91 -89 -168 28 366 211 -244 -307 29 169 127 125 -41
2745 -41 -311 -207 250 330 -37 -234 -114 -57 17 243 172 -243 -350 28 293 110 -82 -75 -85 -70 158 265 -18
$$ packed form
2570B33j63k05j10J19K47J13j63k57o4J97K19M2j76k12pJ90J63qj31j25l9J25
2592a2K06Pk19j52R8J51N1m9r1r7j5J54J22j03j76pR5N9L3l4r6p4J16J19k4j02
2618d0j6QJ8Q4Q2j24j30Q8J43k8q0K8Nq9L8J37j7j67JR3%m3M7k3r8L7J15l6j25
2647i2Q6O3r5l5J13L8j30kJ31m5j32Q6J28o3j15O3M9p6M6J17q3j78M6J64j3q3
2673a2M2m7j21M0K19J8k28p9J14P7j8Q8l3k12l0K43J16j40j14N0j5j2J69R5k30
2698b0j72J63K12p9j16L2o3o6J64J66j84k29J07J85o3rM5j62j73K32L05j62l35
2721b22N4J73j0N5J47j95l36J50M23K3k79p4Kp9J96L38j55m55o3L36J40m2kj66
2745d1k70J04M57Q0l67j97J20N7P4K26p1m15j07L78K65j83j92Pj0J5K28J07k83
$$ plain form
2768 -18 -258 -74 202 170 51 -20 -126 -161 137 339 57 -320 -203 111 151 74 60 -117 -370 -119 380 331 -191
2791 -191 -376 -132 31 153 302 63 -455 -391 200 401 125 -89 -171 -308 -98 460 457 -226 -481 -54 199
2812 199 147 222 108 -351 -427 193 495 63 -241 -146 -98 -64 266 318 -185 -438 0 289 98 -20 3 -184 -200
2835 -200 214 370 -61 -348 -45 172 87 87 92 -191 -278 131 402 98 -284 -233 -15 121 226 154 -176 -385 -104
2858 -104 292 288 -6 -240 -288 -119 204 379 103 -350 -395 29 352 254 -17 -172 -260 -117 301 444 44 -395
2880 -395 -243 122 234 212 99 -209 -363 38 418 189 -177 -149 -74 -88 129 344 -20 -449 -139 305 150
2901 150 -122 -5 -59 -244 30 401 70 -393 -157 209 85 11 148 -79 -373 -6 464 157 -297 -154 37
2922 37 -34 124 339 -39 -495 -169 355 243 -38 -40 -164 -291 40 452 169 -334 -291 17 97 173 226 -101 -388
$$ packed form
2768a8k40J84K76l2j19p1j06l5K98K02k82l77J17L14M0p7j4j77k53K51M99m9n22
2791a91j85K44J63J22J49k39n18O4N91K01k76k14q2j37K10N58lo83k55M27K53
2812A99n2P5j14m59p6O20L02m32l04R5M8L4L30N2n03k53M38K89j91j18K3j87j6
2835b00M14J56m31k87L03K17q5%Nk83q7M09K71l04l82N1K18J36J05p2l30k09K81
2858a04L96mk94k34m8J69L23J75k76m53m5M24L23r8k71j55q8J43M18J43m00m39
2880c95J52L65J12k2j13l08j54M01L80k29l66K8P5j4K17K15l64m29L10M44j55
2901A50k72J17n4j85K74L71l31m63K36L66j24p4J37k27k94L67M70l07m54J43J91
2922C7p1J58K15l78m56L26N24j12k81kj24j27L31M12k83n03M3L08Q0P6N3l27k87
$$ plain form
2945 -388 -115 311 253 12 -89 -134 -127 121 321 129 -214 -183 27 153 151 36 -127 -161 11 143 115 -12 -140
2968 -140 -157 22 150 49 -98 -141 -68 14 149 96 -159 -219 44 171 44 3 -19 -145 -118 213 267 -88 -231
2991 -231 8 80 30 164 132 -221 -285 159 294 -25 -108 5 -126 -164 201 292 -152 -310 25 115 -18 86 132
3014 132 -195 -263 168 267 -67 -117 72 -34 -118 168 249 -140 -240 100 146 -65 -2 96 -100 -156 136 143 -142 -136
3038 -136 65 4 -84 59 65 -174 -140 135 104 -89 -57 25 -56 -13 159 88 -122 -71 83 63 39 76 1 -111 20
3063 20 151 71 -33 2 -26 -51 79 115 -31 -108 -11 49 -20 30 63 -86 -123 52 66 -43 -26 37 -68 -90 115 82
3089 82 -104 -60 131 28 -97 44 110 -68 -81 103 62 -101 -10 99 -38 -64 82 17 -146 1 141 -27 -150
3112 -150 39 89 -105 -58 116 8 -160 15 134 -12 -83 67 25 -91 42 158 -14 -88 101 99 -58 16 108
$$ packed form
2945c88K73M26n8k41j01m5PK48K00j92l43L1K10J26kj15j63l4J72J32k8j27j28
2968a40j7J79J28j01j47m3P3Q2J35n3k55o0K63J27j27m1k2j26K7L31N4l55j43
2991b31K39P2n0J34l2l53o4M44J35l19q3J13j31l8L65R1m44j58L35R0j33J04M6
3014A32l27o8M31R9l34n0J89j06q4K86Q1l89j00L40M6k11O3R8j96n6K92Pk85O
3038a36K01o1q8J43Ok39L4K75l1j93L2Q2q1M3J72p1k10N1J54k0k4L7p5j12J31
3063B0J31q0j04L5k8k5J30L6j46p7R7O0o9N0L3j49l7J75J4j09J7O3j05k2K05l3
3089H2j86M4J91j03j25J41O6j78j3J84m1j63R1J09j37k6J46o5j63J47J40j68j23
3112a50J89N0j94M7J74j08j68J75J19j46p1J50m2j16J33J16j72p4J89kj57P4R2
$$ plain form
3135 108 -19 -105 68 113 -60 -77 71 1 -77 38 80 -94 -108 56 37 -71 -23 22 -77 -54 89 48 -100 -37 58
3160 58 -16 -25 83 35 -114 -34 122 45 -51 9 22 -41 35 115 -3 -96 -2 49 -28 18 79 -42 -149 34 145 -10
3186 -10 -88 2 -1 -38 56 111 -29 -115 18 80 17 44 51 -76 -64 100 131 -31 -70 25 -6 -30 102 88 -91 -113 48
3213 48 71 -14 4 -14 -113 -75 90 81 -84 -88 -5 -30 -5 81 20 -114 -62 77 56 -20 26 0 -52 8 124 62 -69 -45
3241 -45 39 28 23 57 -8 -73 6 92 23 -35 -2 -12 -33 57 93 -21 -115 -39 60 27 12 0 -60 -55 48 102 22 -39 -59 -38
3271 -38 35 98 59 -80 -95 13 68 59 22 -44 -88 -49 66 97 -5 -70 -64 -40 57 77 2 -93 -70 13 36 43 19 -54 -84 13
3301 13 97 59 -13 -29 -20 -8 56 102 16 -75 -26 55 58 46 15 -29 -40 49 80 8 -50 -8 -7 -15 25 59 -41 -101 -7 69 24 -44
3333 -44 -41 -10 -16 21 59 -9 -62 -38 32 41 11 4 -25 -43 21 90 41 -51 -46 25 33 21 43 16 -65 -43 64 64 -34 -43 19 -11 -16 52
$$ packed form
3135A08j27q6J73M5j73j7J48p0p8J15M2j74j4J64j9j08M8M5r9K3J43m1j48O3R5
3160E8p4rJ08m8j49Q0J56p7r6O0J3o3P6Q0j18r3R4N1p7M6O1j21j07J83J11j55
3186a0p8R0ll7R4N5j40q6J33O2o3K7Pj27J2J64L1j62l9R5l1k4J32j4j79k2J61
3213D8K3q5J8j8r9L8J65rj65mQ3k5K5Q6o1j34N2J39k1p6M6k6n2O0J16o2j31K4
3241d5Q4j1nL4o5o5P9Q6o9n8L3j0k1R0L6j14r4P6R9l3j5j2o0NJ03N4q0o1k0K1
3271c8P3O3l9j39j5J08N5rl7o6m4L9J15L1j02o5OK4R7K0p5r5K3Q3K3Pk4p3l0R7
3301A3Q4l8p2j6RJ2O4M6q6r1M9Q1Lj2l1m4j1Q9L1p2n8M2JqM0L4j00o0R4P6m5o8
3333d4LL1oL7L8o8n3K4P0Rl0pk9j8O4O9m9r2NP1Qj2K2k7q1K2J07%r8rO2l0nO8
$$ plain form
3367 52 40 -54 -54 37 61 -18 -4 27 -13 -31 69 65 -34 -43 44 51 -4 37 52 -47 -64 68 94 -38 -58 22 0 -37 42 59 -58
3398 -58 -109 3 43 -12 -22 -18 -68 -60 49 80 -28 -57 -7 -1 -10 33 71 -3 -61 -15 60 27 12 -1 10 0 -1 39 37 10 -3 -4
3430 -4 26 21 12 29 3 -24 -14 26 5 -20 27 32 -27 -64 42 49 -52 0 56 -8 -78 31 113 -11 -51 44 31 -59 12 108 2
3461 2 -111 15 68 -37 -28 88 14 -144 -28 92 -18 -78 55 39 -130 -56 128 43 -117 -1 90 -51 -70 111
3485 111 90 -73 -22 99 15 -62 100 106 -68 -67 107 47 -71 44 93 -64 -117 57 84 -61 -49 61 -27 -101 29
3510 29 82 -32 -85 0 7 -55 19 70 -20 -85 3 53 -7 10 32 -9 -48 -4 52 24 3 -11 -19 -7 10 23 32 10 -29 -49 10
3541 10 27 -12 -2 28 -19 -62 17 75 -11 -43 39 20 -56 19 111 29 -62 28 61 -48 -5 126 28 -106 0 105 -7
3568 -7 -44 104 40 -141 -66 134 48 -102 4 40 -106 -81 117 55 -127 -54 72 -52 -78 111 97 -137 -95 111
$$ packed form
3367E2j2r4%R1K4p9J4L1m0j8J00mr9rQ7Pn5M1J5r9j7J32K6j32k0Q0k2l7P9J7j17
3398e8n1J12M0n5j0Mn0QJ09L1j08k9N0OrM3L8p4n8M6P5l3j5j3J1j0jM0kk7j3j
3430dL0nrJ7k6k7J0M0k1k5M7Nn9l7J06Pj01N2N6o4p0J09Q2j24m0R5j3r0P1R6j06
3461Bj13J26N3j05RJ16p4j58J16J20j10o0J33j6j69P4J84q5j60J16R1j41j9J81
3485A11k1j63N1J21q4p7J62Oj74JJ74o0j18J15M9j57n3J74K7j45J2J10q8p4J30
3510B9N3j14n3Q5Po2P4N1r0o5Q8N0o0J7K2m1l9M4N6k8k1j4qJ2J7J3Rk2l9k0N9
3541A0J7l9J0L0m7m3P9N8q6l2Q2j9p6P5R2q2r1R0L3j09M3J31r8j34J06J05j12
3568gl7J48o4j81P5K00q6j50J06L6j46K5J98o2j82P3J26j24k6J89j4k34M2K06
$$ plain form
3592 111 52 -85 35 107 -75 -101 120 104 -79 -25 70 -32 -83 57 96 -69 -74 72 34 -65 18 80 -41 -80 46
3617 46 38 -66 -28 59 8 -72 6 40 -23 -24 56 44 -49 -22 35 20 19 12 -14 -41 -15 27 31 10 -19 -55 -31 19 32 0 -32 -59
3649 -59 -77 17 67 12 -59 -31 -10 -58 26 97 -4 -115 -27 73 9 -19 51 13 -101 -2 140 61 -61 13 49 -38 -4
3676 -4 116 41 -122 -36 100 -13 -62 59 42 -115 -31 111 16 -108 -7 88 -50 -54 76 32 -120 -13 107 7
3700 7 -99 -10 37 -43 -8 90 -2 -127 -12 73 -3 -31 41 -5 -98 -1 119 15 -103 -43 31 0 18 55 -19 -98 -33 65
3728 65 62 14 -11 -52 -46 42 113 33 -57 -40 14 36 58 33 -23 -50 -3 54 59 18 -36 -65 16 72 20 -13 -23 -41 -30 37 63 -27
3760 -27 -97 -18 32 17 14 1 -72 -81 25 87 -3 -64 -40 -22 -1 80 88 -57 -105 5 96 11 1 5 -54 -89 63 125 10 -92
3790 -92 -33 11 19 66 54 -67 -104 17 81 19 -21 -19 -63 -50 61 99 -31 -95 -18 44 26 28 27 -56 -70 31 75 18 -44 -29
$$ packed form
3592A11n9j37J20P2j82k6K21j6j83N4R5j02n1J40L9j65nJ46l8r9Q3O2j21l9J26
3617D6qj04L8Q7n1q0P8L4o3jQ0j2r3K7N7j5jpk6k7K6M2Mk1k9l6K4N0J3l2l2k7
3649e9j8R4N0n5p1K8K1m8Q4P1j01j11Q8J00o4k8P0l8j14R9J42p9j22P4L6q7L4
3676dJ20p5j63Q6J36j13m9J21j7j57Q4J42r5j24J01R5j38mJ30m4j52J07J20j00
3700Gj06Q9M7q0L5R8r2j25J15Q5p6k8P2m6r3R7J20j04j18O0P4l1J8L7p4p9O5R8
3728F5lm8k5m1OQ8P1q0r0J7N4K2K2k5n6k7M7N7Nm1n4k9Q1N6n2l3j0j8J1O7K6r0
3760b7p0P9N0j5lj3p3rJ06O2r0o1K4J8K1Q1Qj45m8J10R1q5j0Mn9l5J52O2j15j02
3790i2N9M4QM7j2j21l7J21O4o2m0Km4J3J11L8j30o4P7O2j8Kjq3j4J01M4n7o2J5
$$ plain form
3820 -29 -23 9 65 35 -69 -86 10 49 27 -6 -37 -62 -27 55 69 -28 -78 -50 4 41 67 -9 -81 -65 36 75 54 -3 -50 -56
3850 -56 35 112 60 -19 -44 -23 38 81 74 -26 -91 -32 63 84 37 -35 -87 -43 61 97 -9 -64 -53 -32 22 61 21 -82 -103
3879 -103 2 77 48 -12 -49 -55 -16 62 70 -4 -58 -40 3 43 57 1 -79 -69 29 72 7 -54 -50 -48 13 57 29 -46 -78 -29 37
3910 37 57 25 -30 -87 -13 82 86 2 -37 -35 1 54 79 30 -49 -42 27 75 44 11 -41 -54 8 69 41 -30 -74 -42 9 43 22 -37
3942 -37 -68 -43 20 50 25 -28 -51 -41 35 64 15 -44 -57 1 47 68 10 -29 -38 0 50 50 13 -40 -44 -9 60 54 -15 -36 -29 3 46
3975 46 37 1 -49 -51 12 46 29 1 -39 -34 23 61 37 -15 -25 8 25 45 34 -12 -39 -8 42 20 -4 -19 -36 -34 6 23 -8 -47
4007 -47 -53 -5 -1 8 -5 -31 -50 0 31 19 -20 -26 -9 -13 15 37 6 -40 -13 38 47 14 9 20 1 5 39 25 4 -11 4 -2 6 31 15
4042 15 -21 -12 20 30 -6 1 9 -9 -21 12 28 -6 -24 -5 2 -13 0 11 -3 -20 0 24 4 -2 5 13 -20 -8 26 14 -3 -21 4 -26
$$ packed form
3820b9OL2N6l0j04j7R6L9k2l3l1k5L5Q2J4r7n0K8N4L7K6p6p2J6J01L9k1n7m7o
3850e6R1P7n2p9k5K1O1M3pj00o5N9R5K1m7p2n2M4J04L6j06n5J1K1N4L9m0j03k1
3879a03J05P5k9o0l7oL9P8Qp4n4J8M3M0J4n6q0J0R8M3o5o1MKO1M4k8p5l2M9O6
3910C7K0l2n5n7P4R5Mq4l9KL6N3K5m9p9PO9M8l1l3n2j3O2O1k8p1m4L2N1L4k1n9
3942c7l1K5O3L0k5n3k3J0P6K9m9n9j3N8M6K1n8l9rL8N0%l7n3mL5O9oo9k1PL2M3
3975D6rl6n0kO3L4j7k8m0NN7L8k4n2j0L3J7K0j1m6k7L1N0k2k4j5j7KM0J7l1l9
4007d7oM8MRj3k6j9N0L1j2l9oJ7mK8K2l1m6K7N1Rl3nJ1j9ML4j4k1j5J5oQK5j6
4042A5l6RL2J0l6PQj8j2L3J6l4j8J9Pj5J3J1j4j7K0K4k0oPQl3J2L4j2j7j8K5l0
$$ plain form
4076 -26 -14 -11 -3 -31 -32 6 10 -24 -16 14 -25 -16 22 29 -15 -30 22 31 14 -2 14 -4 -7 44 41 -8 -20 9 32 13 19 26 -37 -67 7 69
4112 69 5 -39 -41 -31 -20 23 50 -5 -69 -47 12 20 18 -2 -48 -56 4 59 29 -34 -43 -18 3 19 58 3 -66 -42 42 51 12 -20 -30
4145 -30 -36 -7 55 43 -37 -60 0 51 34 -5 -20 -39 -20 46 64 -17 -51 -11 35 35 41 7 -42 -46 44 92 30 -51 -34 5 5 63 59
4178 59 -19 -103 -31 66 67 8 -35 -73 -62 27 97 13 -97 -87 -15 23 39 42 -44 -138 -47 102 89 -36 -76 -49 -19 41 96 41
4208 41 -95 -78 41 84 35 4 -28 -77 -2 97 76 -53 -63 -4 26 36 52 10 -66 -44 60 83 -3 -57 -44 -17 46 72
4236 72 37 -80 -99 11 89 53 -15 -58 -62 -15 91 92 -22 -103 -77 49 84 61 -26 -92 -89 18 126 69 -75 -118 -40 33
4264 33 67 73 -15 -128 -86 79 125 12 -48 -59 -35 11 113 72 -68 -112 -3 95 62 19 -7 -58 -36 93 134 -21 -108
4291 -108 -23 30 36 45 27 -66 -103 43 110 6 -81 -56 -16 -12 60 78 -70 -136 -6 93 41 -19 -34 -81 -68 67 136 2
$$ packed form
4076b6J2LQk8jL8Ml4QL0l9RL8Pm4j5N2Rj7j6J6j8lN1lm9j2K9K3j9OPo3l0P4O2
4112F9o4m4kJ0J1M3K7n5o4K2N9Qkk0m6qO0N5l0o3rK5K1J6L9n5o9K4Q4Rl9l2j0
4145c0oK9O2j2q0k3O0N1j7l9j5j9J9O6J8q1l4M0M6%Ol4m9mR0M8o2q1J7L9%N8m
4178E9p8q4P2R7Jn9m3l8J1Q9P0q4j10J0P2L8J6Lq6r4R1J49j3j25m0K7L0O0N5n5
4208D1j36J7J19M3m9l1l2m9P5R9k1j29j0N9L0J0J6m2p6K2J04K3q6n4J3K7O3K6
4236G2l5j17j9J10P8l6o8m3mM7J06Jj14q1K6J26L5k3q7o6LJ07J08n7j44m3P8P3
4264C3L4Oq8j13M2J65M6j13o0j1K4M6J02m1j40m4J09R8l3m3k6n1K2J29M1j55q7
4291a08Q5N3ORj8r3l7J46O7j04q7K5M0MP2J8j48o6J30R9n2o0j5m7J3J35O9j34
$$ plain form
4319 2 -113 -64 23 41 63 46 -82 -127 6 130 68 -36 -75 -61 0 83 99 -14 -112 -70 24 84 71 0 -63 -71 36 119
4347 119 66 -37 -80 -24 52 76 45 -16 -76 -34 50 109 18 -63 -67 -5 45 44 14 -54 -91 -15 76 55 -55 -71 -49 -15 30 61
4377 61 -24 -110 -62 52 62 8 -34 -43 -62 19 116 60 -75 -83 2 54 38 47 -5 -95 -42 93 87 -14 -46 -41 -29 12 89 43 -94
4408 -94 -67 30 59 10 9 -13 -73 -33 80 65 -43 -65 -13 16 21 35 3 -62 -31 50 44 -4 -12 -27 -46 11 65 16 -64 -62 -3 20
4440 20 2 -7 -43 -56 -27 39 39 -16 -47 -41 9 44 45 -7 -50 -18 32 46 43 13 -25 -21 42 43 33 3 -11 -10 23 59 18 -27 -18 1 6
4475 6 18 18 -7 -56 -18 21 10 -23 -19 -13 -36 -3 43 6 -41 -17 26 -1 3 21 4 -38 11 32 -3 -40 -11 3 -30 -9 32 -2 -41
4508 -41 -13 25 0 -13 1 0 -14 8 30 -11 -27 18 23 -5 12 42 -10 -7 30 49 6 1 25 17 1 15 24 -8 -2 20 12 -19 6 25
4542 25 4 -11 11 -4 -18 -7 18 -4 -23 -6 -2 -17 7 9 -18 -36 2 19 -4 0 1 -19 -17 28 26 12 -12 -3 4 17 36 13 -34 -19
$$ packed form
4319Bj15M9Q7J8K2j7j28m5J33J24o2j04l9J4O1Q3J6j13r8M2R4O0j3p1o3qJ07Q3
4347A19n3j03m3N6P6K4l1o1o0M2Q4N9r1q1mO2N0jl0o8l7P6R1k1j10j6K2L4M5L1
4377F1q5q6M8J14J0n4m2rj9Q1R7n6j35qQ5N2j6Rn2r0N3J35oj01l2NJ2M1P7m6j37
4408i4K7R7K9m9jk2o0M0J13j5j08k2N2K9NJ4l2o5L1Q1om8qj5j9N7N4m9q0KN9K3
4440B0j8rl6j3K9O6%n5l1ON0L5Jn2m3L2N0J4ll0l8MO3Jj0l0j4JL3L6m1m5RJ9N
4475FJ2%k5m9L8L9j1l3MOk3L3M6l7m7K4M3k7MJ8j7m2M9K1l5l7K9J4l3K1M1l4l9
4508d1K8L8k5j3J4jj4K2K2m1j6M5Nk8J7L0n2LL7J9m3nK4qj6J4Rl2OK2ql1K5J9
4542B5k1j5K2j5j4J1K5k2j9J7Mj5K4Kk7j8L8J7k3MJk0KM5kj4k4RPJ3J9k3m7J5
$$ plain form
4576 -19 18 24 8 6 6 -17 -2 45 41 -15 -25 -3 24 31 34 -3 -36 -8 38 36 9 -3 -17 -25 4 55 14 -36 -28 1 16 27 18 -31 -56
4611 -56 -2 32 29 -19 -30 -25 -22 23 26 -31 -53 -24 9 28 26 9 -38 -49 18 51 17 -20 -21 5 10 43 27 -25 -39 5 47 46 13 -9
4645 -9 -42 -3 62 59 5 -46 -32 16 42 51 5 -53 -49 9 61 43 -18 -64 -44 31 82 17 -39 -44 -26 13 55 37 -23 -71 -22 31 51
4678 51 14 -47 -69 -25 45 52 13 -58 -49 -6 35 68 6 -57 -67 7 68 48 -7 -32 -37 16 75 48 -21 -41 -23 30 64 40 -13 -60
4710 -60 -16 55 67 30 -22 -35 -27 21 76 29 -38 -71 -4 70 53 4 -52 -59 -15 56 53 -7 -71 -49 -3 36 49 -16 -81 -71 9 70
4742 70 26 -26 -42 -32 11 54 43 -23 -52 -29 46 67 41 -35 -44 -4 50 60 13 -41 -38 -3 52 60 23 -51 -65 4 70 64 3 -45
4774 -45 -30 15 61 62 -5 -60 -37 39 80 39 -12 -60 -42 25 74 34 -44 -57 -18 34 49 17 -40 -76 -47 31 55 7 -62 -47 -24
4805 -24 15 52 21 -60 -65 1 61 41 -13 -45 -33 7 47 71 9 -47 -13 34 63 47 12 -36 -13 34 80 37 -46 -38 6 31 36 24
$$ packed form
4576a9L7Oj6k%k3J5M7mn6j0K2K7PLl7l3K8M6kk7j2j4qK9N1m1n0QK9J5J1rm9k5
4611e6N4L4lm8j1NLM5Ln7k2K9L3J9kj7m7j1O7L3l4l7jK6NL3j6n2j4M4M2jl3k2
4645il3L9O5ln4n1J4M8K6Rm6n8MN8N2j8o1m6K0P5N1o5n6nJ8L9M2j8o0m8M9N3K0
4678E1l7o1k2M4P0Pl9p1RM3M1L3o2o3j0P4O1k0n5k5nN3N9k7o9k0J8N3L4k4n3m7
4710f0M4P1J2l7n2j3QM8N5m7o7l3O7P4j7m9n6pM4P1lo0o4K2M6L9J3o5o5J0Q0O1
4742G0m4n2j6J0M3M3j1o6k9K3P5K1k6p6rM0N4J0m7n4LL5N5Ql7p4j4O9O6oo1m8
4774d5J5M5M6Jo7n5K3P6M1m1n1m8J8O7M9m0p8j3L9N2J5l2n7l6K9P8K4m8o9J5K3
4805b4L9L7l1q1nO6O0k0n4l2J2M0M0K4o2n6L4M7K9j6l5m8K3M7M6m3q3QM4K5Nj2
$$ plain form
4837 24 -26 -55 -23 45 47 -1 -44 -28 -17 33 57 15 -52 -49 32 42 25 -4 -25 -42 0 57 53 -23 -72 -15 14 29 35 -9 -54 -37
4869 -37 24 51 10 -27 -28 -6 9 36 32 -10 -45 10 46 27 7 -6 -12 -11 54 54 8 -41 -2 34 32 23 10 -15 -23 16 48 32 -30 -34 7
4904 7 3 6 23 -8 -54 -26 24 25 -15 -28 -21 -29 16 34 22 -37 -29 2 12 0 2 -9 -41 -21 32 33 -12 -28 -12 9 8 13 17 -9 -42 11
4940 11 41 20 -9 17 6 -17 7 22 6 -12 10 44 14 2 18 22 -6 8 45 7 -15 20 46 7 -15 13 8 -17 3 49 -1
4971 -1 -38 -4 15 -9 -12 -1 -23 -46 -9 34 0 -32 -2 11 -18 -7 21 4 -27 -22 12 18 -6 20 11 -4 2 19 16 -4 4 19 -3 -16
5005 -16 16 17 12 -5 21 19 -9 5 26 2 -11 -1 17 -1 5 27 25 -3 -19 13 36 17 -4 10 -4 -5 20 31 -2 -21 -18 2 4 7 7
5040 7 -25 -32 2 18 3 -28 -6 3 -3 -3 22 9 -19 -13 22 18 -17 9 2 -2 8 33 15 -19 5 36 23 22 20 11 -11 10 59 21 -20 -11 25
5077 25 22 14 20 5 -24 -16 28 37 14 -13 -6 -17 7 28 -1 -38 -28 8 21 12 -2 -9 -37 -7 16 31 -13 -32 -15 4 17 29 3 -36
$$ packed form
4837B4n0k9L2O8Km8m3J6J1N0K4m2o7LQ1J0j7k9k1j7M2N7mp6m9N7K9J5Om4m5J7
4869c7O1K7m1l7jK2J5K7mm2l5N5L6j9k0j3oJO5%m6m9L9L6krj3k5qL9L2j6o2mM1
4904GmLJ7l1m6K8N0Jm0j3PqM5J8j2n9QL1J0j2Kj1l2K0N3Jm5j6J6K1jNMk6l3N3
4940A1L0k1k9K6j1k3K4J5j6j8K2L4l0j2J6Mk8J4L7l8k2L5K6l9k2K8nk5K0M6n0
4971al7L4J9k4lJ1k2k3L7M3l4l2L0J3k9J1K8j7l1NL4Ok4K6rj5OJ7lk0QJ5k2j3
5005a6L2Jnj7K6kk8J4K1k4j3J0J8j8OK2kk8j6L2K3j9k1J4j4jK5J1l3j9LK0KL%
5040Gl2pL4J6j5l1K2Ro%K5j3k8OL5ml5K6pmJ0K5j8l4K4L1j3jkrk2K1M9l8m1RL6
5077B5lqOj5k9QM4Rk3k7Pj1K4K1k9l7J0L6J3rj4pk8L0K3J5m4j9J7J9J3J2k6l9
$$ plain form
5111 -36 -35 4 26 4 -14 -24 -3 7 26 12 -13 -30 -4 29 34 27 0 -5 4 28 40 24 -25 -13 17 33 18 7 0 -18 17 54 32
5144 32 -15 -17 -9 15 28 25 -4 -31 -22 21 28 8 -21 -36 -22 7 39 21 -26 -34 -3 24 21 0 -18 -44 -9 44 28 6 -27 -12 -4 27
5178 27 35 -2 -27 -14 20 34 23 -10 -12 -15 22 36 42 -11 -29 -3 18 30 17 -8 -21 -14 21 40 15 -24 -22 5 40 34 2 -14 -21 -11
5212 -11 9 42 -8 -29 -32 -10 16 19 1 -35 -27 8 29 22 -12 -21 -35 6 26 30 -20 -29 -7 11 23 9 -11 -31 -13 28 39 16 -3 -9
5246 -9 6 18 38 31 -4 -8 17 37 30 6 -18 -11 12 37 28 4 -24 0 16 21 12 -8 -20 -24 -6 19 14 -23 -36 -15 16 27 8 -25 -27 -6
5282 -6 6 18 5 -12 -15 -21 13 29 -5 -31 -9 -12 19 16 -16 -24 -16 6 17 13 -14 -23 -11 3 29 18 -7 -12 -6 7 31 17 -13 -6 -2 26 24
5319 24 24 2 -5 8 27 37 10 -11 -18 3 9 25 -9 -18 -29 2 19 8 -6 -21 -28 -5 9 3 -13 -18 -17 3 10 10 -12 -21 -16 10 19 0 -1 2
5357 2 5 15 21 11 -9 6 13 19 19 4 -2 -1 8 16 29 1 -10 1 2 24 19 9 -5 -15 19 21 12 -3 -3 2 13 17 11 5 4 12 0 3 6 -3 -14 -22 0
$$ packed form
5111c6JL9K2k2j8j0K1J0J9j4k5j7K6L3Npk7nRK4J2j6m9J2L0J6j5j1pj8L5L7k2
5144C2m7kQK4J3lk9k7RM3Pk0k9j5J4K9L2j8m7qL1K7lk1j8k6L5N3j6k2l3J5QL1
5178B7Ql7k5J3L4J4j1l3klL7J4On3j8K6K1J2j3k5j3PL5J9k5l9KK7L5ol2j6pJ0
5212a1K0L3n0k1lK2K6Lj8l6QL5K1pl4rj4M1K0Mn0rK2J8J2j4k0k0J8M1J1k3j9o
5246iJ5J2K0pl5mK5K0pk4k4PK3K5rk4k8K4J6Nrk0j2mJ8K5nl7j3K1L1J1j9l3kK1
5282fJ2J2j3j7loL4J6l4k6K2lL1ll2qQK2J1mk7rJ2J4K6j1k5nOJ3K4j4l0PMK8k
5319B4%k2pJ3J9J0k7k1pK1OJ6l4rj1L1J7j1j4j5pK3J4oj6nJK0P%k2rNK6Rj9jL
5357BLJ0Oj0k0J5PO%j5oJRQJ3k8j1J1JK2nj0j4j0L4Krj5%NJ1MoojQj2LLrj1qK2
$$ plain form
5400 0 1 7 -23 -15 -8 -4 -3 -11 -12 -8 -6 -5 2 -9 -5 -3 5 10 8 -1 -5 1 16 17 6 11 14 15 18 33 4 -5 4 23 9 12 12 8 7 11 18 30 10 -2 15 7 9 0 16
5449 16 0 11 16 13 2 -13 5 7 5 9 0 -6 -8 13 15 0 -12 7 14 5 13 11 -9 -15 -1 -4 0 -18 -19 -7 -6 0 -6 0 -8 3 17 9 6 23 3 -2 16
5492 16 20 16 3 15 19 23 18 11 10 -6 11 23 18 -2 4 9 1 -3 13 6 4 0 -4 4 -7 3 -17 1 1 -4 4 -8 -8 9 -3 3 2 13 -7 -13 8 18
5534 18 -17 -11 2 0 8 16 0 -9 -1 8 12 -4 1 7 9 5 15 21 2 -16 6 18 17 -8 16 3 1 10 28 15 -10 2 29 10 13 15 14 1 5 17
5574 17 11 -3 -16 -3 -13 -1 13 3 -23 -20 -11 3 -5 -8 4 -20 -11 8 7 -14 -29 -9 5 -19 -8 5 -20 -12 16 17 -5 -6 12 21 8 8
5610 8 18 -7 4 27 41 8 -13 22 11 -2 32 20 0 -11 11 28 27 9 5 -4 -14 19 22 -7 -26 -2 -9 11 5 20 -12 -26 -13 14
5644 14 9 -10 4 -8 -3 -14 9 8 -18 -6 8 -6 -11 -6 -4 -16 -9 4 12 -7 -4 7 7 -2 4 -1 -1 7 14 17 -11 -2 23 21 4 10 19 -3 0 20 35
5685 35 14 -2 12 17 5 13 11 10 -8 -3 4 -5 -10 7 -2 -15 -7 19 1 -13 -24 2 -17 -14 1 2 -17 -15 5 -3 -6 1 7 -13 -2 8 17 9 5 14 2
$$ packed form
5400@JOl0QPMJqjMKJPj1MKQNkrmOJ5Jj1NLJLJ5k9rRJ9j4L%mjMPJ2k0j2J7qKrJ6
5449A6j6J1Nlj1j5J8KkMrokK1Kj5j2J9PrQkk0oJ4lMj8jJ2JOoOqJ1J4qlJ7k0nJ8
5492A6Mmj3J2MMnpjj6J7J2nk0ONqmJ6pkmmQj1J0k0J8%nQj2%J7j2OjJ1k0oK1J0
5534A8l5OJ3kQQj6rQRMj6NOKmJ0Oj9j8K2J2jk5K4j3kRJ8j3k5J2K7j9LKjj3MJ2
5574A7oj4j3J3j0J2J4j0k6LRJ4qlJ2k4RJ9jk1j5K0J4k4J1J3k5QK8Jk2jJ8Rj3%
5610HJ0k5J1K3J4l3k1L5j1j3L4j2k0j1K2J7jj8mrj0L3Lk9j9K4pK0oJ5l2j4J3K7
5644A4nj9J4j2Nj1K3jk6J2J4j4nNKj2PJ3Qj9LJ1%rOn%QPLk8RK5kj7ORk2LK0J5
5685C5k1j6J4Nj2Qkjj8NPrnJ7rj3QK6j8j4j1K6j9LJ5Jj9KK0qlPOk0J1J0RqmRj2
$$ plain form
5726 2 0 16 19 3 11 9 18 8 -1 21 6 4 17 22 14 -1 11 18 1 18 17 12 -1 29 26 7 -12 16 18 2 -5 15 0 -12 6 6 -3 -9 6 -5
5766 -5 -13 -8 1 -1 -17 -10 -5 -18 -19 -17 -15 -17 -11 0 5 -3 -2 14 3 13 19 29 3 9 14 22 2 18 23 2 9 13 23 -3 3 18 12 -1 8 25 5 2 2 9
$$ packed form
5726BkJ6Lj6QkRj0rK2j5kJ3Nqj5J2Pj7J7jnj3L0lj9j9K8Kj6pK0j5j2J8%roJ5j1
5766eqNRkj6PNj3jKKkOJ1NqJJ6j1J0OJ0k6ONQk0J6Nk1PMJ0k6OJ5oj3RJ7k0l%P
$$ [...]
8191d
##END NTUPLES=NMR FID
##END=
