##TITLE=1H_IBIP2501-1
 CDCl3, 8 sc, 
 8.2.2019
##JCAMPDX= 6.0         $$ Bruker NMR JCAMP-DX V2.0
##DATA TYPE= NMR FID
##DATA CLASS= NTUPLES
##ORIGIN= UXNMR, Bruker Analytische Messtechnik GmbH
##OWNER= root
$$ XWIN-NMR		Version 3.5
$$ Fri Feb  8 17:06:00 2019 Russian Standard Time (UT+4h)  she@DPX200
##.OBSERVE FREQUENCY= 200.1313
##.OBSERVE NUCLEUS= ^1H
##.DELAY= (6, 6)
##.ACQUISITION MODE= SIMULTANEOUS
##.ACQUISITION SCHEME= undefined
##.AVERAGES= 8
##.DIGITISER RES= 18
##SPECTROMETER/DATA SYSTEM= spect
##.PULSE SEQUENCE= zg30
##.SOLVENT NAME= CDCl3
##.SHIFT REFERENCE= (INTERNAL, CDCl3, 0, 15.7039)
##AUDIT TRAIL= $$ (NUMBER, WHEN, WHO, WHERE, WHAT)
$$ ##TITLE= Audit trail, XWIN-NMR		Version 3.5
$$ ##JCAMPDX= 5.01
$$ ##ORIGIN= Bruker BioSpin GmbH
$$ ##OWNER= she
$$ F:/spectra/data/she/nmr/H-F/1/audita.txt
$$ ##AUDIT TRAIL=  $$ (NUMBER, WHEN, WHO, WHERE, WHAT)
(   1,<2019-02-08 17:04:51.32 +0400>,<she>,<DPX200>,
      <created by zg, POWCHK disabled, PULCHK disabled
       configuration hash MD5:
       00 E9 B6 7A A2 85 ED C7 34 08 36 98 17 FE 4E 26
       data hash MD5: 16K
       83 2F 39 05 B5 20 CB 91 5C 90 78 AA 6C 23 04 A8>)
$$ ##END=
$$ 
$$ hash MD5
$$ 37 3C D4 DD 7E 9D 80 8E C7 A4 6C 00 FE E7 27 F0
##$RELAX= 
##$RELAX= 
##$RELAX= 
##$RELAX= 
##$RELAX= 
##$RELAX= 
$$ Bruker specific parameters
$$ --------------------------
##$DU= <F:/spectra>
##$EXPNO= 1
##$NAME= <H-F>
##$PROCNO= 1
##$TYPE= <nmr>
##$USER= <she>
##$AMP= (0..31)
100 100 100 100 100 100 100 100 100 100 100 100 100 100 100 100 100 100 
100 100 100 100 100 100 100 100 100 100 100 100 100 100 
##$AQSEQ= 0
##$AQ_mod= 1
##$AUNM= <au_zg>
##$AUTOPOS= <>
##$BF1= 200.13
##$BF2= 200.13
##$BF3= 200.13
##$BF4= 200.13
##$BF5= 200.13
##$BF6= 200.13
##$BF7= 200.13
##$BF8= 200.13
##$BYTORDA= 1
##$CFDGTYP= 0
##$CFRGTYP= 5
##$CHEMSTR= <none>
##$CNST= (0..31)
1 1 145 1 1 1 1 1 1 1 1 1 1 1 1 1 1 1 1 1 1 1 1 1 1 1 1 1 1 1 1 1 
##$CPDPRG= <>
##$CPDPRG1= <>
##$CPDPRG2= <>
##$CPDPRG3= <>
##$CPDPRG4= <mlev>
##$CPDPRG5= <mlev>
##$CPDPRG6= <mlev>
##$CPDPRG7= <mlev>
##$CPDPRG8= <mlev>
##$CPDPRGB= <>
##$CPDPRGT= <>
##$D= (0..31)
0 1.2 0 0 0 0 0 0 0 0 0 0.03 0 0 0 0 0 0 0 0 0 0 0 0 0 0 0 0 0 0 0 0 
##$DATE= 1549631090
##$DBL= (0..7)
120 120 120 120 120 120 120 120 
##$DBP= (0..7)
150 150 150 150 150 150 150 150 
##$DBP07= 0
##$DBPNAM0= <>
##$DBPNAM1= <>
##$DBPNAM2= <>
##$DBPNAM3= <>
##$DBPNAM4= <>
##$DBPNAM5= <>
##$DBPNAM6= <>
##$DBPNAM7= <>
##$DBPOAL= (0..7)
0.5 0.5 0.5 0.5 0.5 0.5 0.5 0.5 
##$DBPOFFS= (0..7)
0 0 0 0 0 0 0 0 
##$DE= 6
##$DECBNUC= <off>
##$DECIM= 32
##$DECNUC= <off>
##$DECSTAT= 4
##$DIGMOD= 1
##$DIGTYP= 9
##$DL= (0..7)
0 120 120 120 120 120 120 120 
##$DP= (0..7)
150 150 150 150 150 150 150 150 
##$DP07= 0
##$DPNAME0= <>
##$DPNAME1= <>
##$DPNAME2= <>
##$DPNAME3= <>
##$DPNAME4= <>
##$DPNAME5= <>
##$DPNAME6= <>
##$DPNAME7= <>
##$DPOAL= (0..7)
0.5 0.5 0.5 0.5 0.5 0.5 0.5 0.5 
##$DPOFFS= (0..7)
0 0 0 0 0 0 0 0 
##$DQDMODE= 0
##$DR= 18
##$DS= 0
##$DSLIST= <SSSSSSSSSSSSSSS>
##$DSPFIRM= 0
$$ [...]
##$SUBNAM2= <"">
##$SUBNAM3= <"">
##$SUBNAM4= <"">
##$SUBNAM5= <"">
##$SUBNAM6= <"">
##$SUBNAM7= <"">
##$SUBNAM8= <"">
##$SUBNAM9= <"">
##$SW= 20.0189088683792
##$SWIBOX= (0..15)
0 0 2 0 0 0 0 0 0 0 0 0 0 0 0 0 
##$SW_h= 4006.41025641026
##$TD= 16384
##$TD0= 1
##$TE= 0
##$TE2= 300
##$TE3= 300
##$TEG= 300
##$TL= (0..7)
0 120 120 120 120 120 120 120 
##$TP= (0..7)
150 150 150 150 150 150 150 150 
##$TP07= 0
##$TPNAME0= <>
##$TPNAME1= <>
##$TPNAME2= <>
##$TPNAME3= <>
##$TPNAME4= <>
##$TPNAME5= <>
##$TPNAME6= <>
##$TPNAME7= <>
##$TPOAL= (0..7)
0.5 0.5 0.5 0.5 0.5 0.5 0.5 0.5 
##$TPOFFS= (0..7)
0 0 0 0 0 0 0 0 
##$TUNHIN= 0
##$TUNHOUT= 0
##$TUNXOUT= 0
##$USERA1= <user>
##$USERA2= <user>
##$USERA3= <user>
##$USERA4= <user>
##$USERA5= <user>
##$V9= 5
##$VALIST= <valist>
##$VCLIST= <CCCCCCCCCCCCCCC>
##$VD= 0
##$VDLIST= <DDDDDDDDDDDDDDD>
##$VPLIST= <PPPPPPPPPPPPPPP>
##$VTLIST= <TTTTTTTTTTTTTTT>
##$WBST= 1024
##$WBSW= 4
##$XGAIN= (0..3)
0 0 0 0 
##$XL= 0
##$YL= 0
##$YMAX_a= 32144
##$YMIN_a= -40549
##$ZGOPTNS= <>
##$ZL1= 120
##$ZL2= 120
##$ZL3= 120
##$ZL4= 120
##$ABSF1= 10
##$ABSF2= 0
##$ABSG= 5
##$ABSL= 3
##$ALPHA= 0
##$AQORDER= 0
##$ASSFAC= 0
##$ASSFACI= 0
##$ASSFACX= 0
##$ASSWID= 0
##$AUNMP= <proc_1d>
##$AZFE= 0.1
##$AZFW= 0.1
##$BCFW= 1
##$BC_mod= 2
##$BYTORDP= 1
##$COROFFS= 0
##$CY= 11.3945322036743
##$DATMOD= 1
##$DC= 2
##$DFILT= <>
##$DTYPP= 0
##$F1P= 18.9103706918063
##$F2P= -1.10871071338519
##$FCOR= 0.5
##$FTSIZE= 0
##$FT_mod= 4
##$GAMMA= 1
##$GB= 0.15
##$INTBC= 1
##$INTSCL= 1
##$ISEN= 128
##$LB= 0.24
##$LEV0= 0
##$LPBIN= 0
##$MAXI= 10000
##$MC2= 0
##$MEAN= 0
##$ME_mod= 0
##$MI= 1.114404
##$NCOEF= 0
##$NC_proc= 0
##$NLEV= 6
##$NOISF1= 3.799351
##$NOISF2= 2.8
##$NSP= 1
##$NTH_PI= 0
##$NZP= 0
##$OFFSET= 15.70392
##$PC= 1
##$PHC0= -8758.838
##$PHC1= 12.20019
##$PH_mod= 1
##$PKNL= yes
##$PPARMOD= 0
##$PSCAL= 0
##$PSIGN= 0
##$REVERSE= no
##$SF= 200.130013532006
##$SI= 16384
##$SIGF1= 3
##$SIGF2= 2
##$SINO= 400
##$SIOLD= 16384
##$SREGLST= <1H.CDCl3>
##$SSB= 0
##$STSI= 0
##$STSR= 0
##$SW_p= 3612.71676300578
##$SYMM= 0
##$S_DEV= 0
##$TDeff= 0
##$TDoff= 0
##$TI= <>
##$TILT= no
##$TM1= 0
##$TM2= 0
##$TOPLEV= 0
##$USERP1= <user>
##$USERP2= <user>
##$USERP3= <user>
##$USERP4= <user>
##$USERP5= <user>
##$WDW= 1
##$XDIM= 8192
##$YMAX_p= 0
##$YMIN_p= 0
$$ End of Bruker specific parameters
$$ ---------------------------------
##NTUPLES= NMR FID
##VAR_NAME=  TIME,          FID/REAL,        FID/IMAG
##SYMBOL=    X,             R,               I
##VAR_TYPE=  INDEPENDENT,   DEPENDENT,       DEPENDENT
##VAR_FORM=  AFFN,          ASDF,            ASDF
##VAR_DIM=   8192,          8192,            8192
##UNITS=     SECONDS,       ARBITRARY UNITS, ARBITRARY UNITS
##FACTOR=    0.0002496,     1,               1
##FIRST=     0,             0,               0
##LAST=      2.0444736,     0,               0
##MIN=       0,             -40549,          0
##MAX=       2.0444736,     32144,           0
$$ Real data points
##PAGE= N=1
##DATA TABLE= (X++(R..R)), XYDATA
$$ plain form
0 0 0 0 0 0 0 0 0 0 0 0 0 0 0 0 0 0 0 0 0 0 0 0 0 0 0 0 8 -8 8 -8 8 -8 8 -8 14 -16 16 -16 18 -24 24 -24 32 -32 37 -40
46 -40 44 -48 54 -58 64 -71 78 -86 96 -107 119 -133 150 -168 193 -224 265 -319 396 -515 717
67 717 -1133 2297 -12163 -40549 3586 20791 -19100 -21545 25691 23339 -19910 -14123 19936 3629
81 3629 -23987 160 25183 -1727 -21988 3136 15202 -10836 -15717 12887 18163 -6717 -11114
94 -11114 6133 4282 -12414 -8137 10014 9837 -3703 -3425 5532 -489 -13669 -7752 8699 6681
108 6681 -5287 2146 15244 2329 -15886 -3773 12486 -2507 -15621 5218 17487 -6619
120 -6619 -16484 9525 15348 -11081 -10518 16930 9977 -19137 -9723 15287 913 -18590 3563
133 3563 22128 -1791 -16581 6199 12538 -12711 -13824 12740 12527 -9290 -4894 11824 1326
$$ packed form
0@%%%%%%%%%%%%%%%%%%%%%%%%%%Qj6J6j6J6j6J6j6K2l0L2l2L4m2M8m8N6o4O9p7
46d0Q4r2J02j12J22j35J49j64J82k03K26k52K83l18L61m17M89n84P15r11J232
67G17j850L430j4460k8386M4135J7205l9891k445M7236k352m3249N787L4059j6307
81C629k7616K4147K5023k6910k0261K5124J2066k6038m881K8604N276k4880m397
94a1114J7247j851j6696M277J8151j77j3540K78Q957o021j3180N917J6451k018
108F681j1968P433J3098j2915j8215J2113J6259j4993j3114K0839J2269k4106
120f619r865K6009N823k6429N63K7448o953k9114R414K5010j4374j9503K2153
133C563J8565k3919j4790K2780O339k5249j113K6564k13k1817M396J6718j0498
$$ plain form
146 1326 -14457 -3137 9543 -387 -6722 4866 7948 -4271 -6521 3396 4064 -3358 -2517 3230
160 3230 1536 -3893 -3799 332 2626 1588 479 2165 3167 -1210 -5116 -1569 2098 -1549 -2590 4403
176 4403 5188 -3844 -4625 4297 2903 -6270 -2134 7953 2448 -7250 -1144 6068 -1829 -6649 3002
191 3002 6397 -3163 -4189 4645 2657 -6019 -1925 6342 1665 -4685 589 4336 -2223 -4938 1228
206 1228 2896 -1500 -721 3160 1162 -2433 -925 863 -740 -1204 541 795 17 1 -571 -895 720
223 720 1173 -817 -398 1972 110 -3059 -445 2641 -678 -2616 2237 3325 -2881 -3583 2849 2453
239 2453 -3878 -1856 4715 1743 -4520 -1110 3901 -423 -4065 1223 4067 -1172 -2773 2233 2268 -2779
255 -2779 -2067 2530 1347 -2316 -581 2172 107 -1860 204 1380 -489 -817 888 504 -1092 -483
$$ packed form
146A326j5783J1320J2680r930o335J1588L082j2219k250R917O68p422Q41N747
160C230j694n429R4M131K294j038j109J686J002m377l906L547L667l647j041O993
176D403P85r032p81Q922j394r173M136J0087n505r698O106P212p897m820R651
191C002L395r560j026Q834j988q676M094Q267m677o350N274L747o559k715O166
206A228J668m396P79L881j998l595J508J788j603m64J745K54p78j6n72l24J615
223G20M53j990M19K370j862l169K614L086l319j938M853J088o206p02O432l96
239B453o331K022O571k972o263L410N011m324l642N288K844n239j601N006L5n047
255b779P12M597j183l663J735K753k065j967K064J176j869l28J705l84j596O09
$$ plain form
271 -483 826 113 -772 145 969 217 -422 85 519 26 -382 134 519 -266 -1026 -195 789 -180 -1139 456
291 456 1927 -14 -1980 -53 1865 -346 -2173 357 2155 -451 -1996 591 1671 -893 -1327 1424
307 1424 1410 -1397 -1133 1444 635 -1976 -997 1487 523 -1611 -606 1269 553 -740 -49 852 197 -530
325 -530 -284 -44 -199 -50 192 66 -4 147 21 -129 195 422 -17 -247 199 266 -531 -794 93 575 -117
346 -117 -516 347 980 251 -449 126 745 86 -682 -253 266 -191 -551 138 626 -24 -380 323 593 -260
366 -260 -602 217 563 -301 -810 -117 429 -56 -501 -13 597 346 -135 72 450 101 -510 -389 17 -197
386 -197 -545 -86 459 86 -415 -19 450 158 -248 -50 178 15 -135 -229 -269 -1 332 70 -292 78 480
407 480 69 -253 149 274 -186 -138 87 -497 -735 309 720 -313 -364 907 677 -830 -491 866 307
$$ packed form
271d83J309p13q85R17Q24p52o39N07M34m93m08N16L85p85p60Q31R84r69r59J595
291D56J471j941j966J927J918k211j827K530J798k606j545K587J080k564m34K751
307A424j4k807K64K577q09k611R79K484r64k134J005J875p16j293O91R01o55p27
325e30K46K40j55J49K42j26p0J51j26j50L24K27m39k30M46O7p97k63Q87M82o92
346a17l99Q63O33p29p00N75O19o59p68M29N19m57l60O89M88o50l56P03K70q53
366b60l42Q19L46q64n09O93N46m85m45M88O10k51m81K07L78l49o11J21M06k14
386a97l48M59N45l73n01L96M69k92m06J98K28j63j50r4m0K68L33k62l62L70M02
407D80m11l22M02J25m60M8K25n84k38J044M11j033n1J271k30j507L39J357n59
$$ plain form
426 307 -700 246 808 -670 -945 818 675 -1147 -340 1656 379 -1620 -83 1537 -341 -1536 568
443 568 1150 -1108 -1106 1210 726 -1270 -108 1702 119 -1461 133 1081 -621 -1004 700 576 -949
460 -949 -368 875 -58 -998 273 1035 -293 -898 281 740 -281 -699 75 500 -42 -513 7 800 387
479 387 -604 -87 977 -88 -1488 49 1635 -403 -1888 832 2141 -1252 -2271 1607 2158 -1955
495 -1955 -1644 2664 1385 -2983 -896 3134 203 -3222 594 3323 -1082 -3031 1576 2547 -2005 -1865
511 -1865 2343 1114 -2657 -613 2414 -321 -2365 1052 2307 -1363 -1905 1639 1445 -1838 -1050 1874
527 1874 804 -1557 -332 1324 -79 -1312 96 1100 -121 -961 104 970 -61 -1272 -278 1402
543 1402 384 -1726 -491 2104 590 -2278 -279 2688 18 -2920 405 2965 -1022 -2967 1746
$$ packed form
426C07j007R46N62j478k75J763j43j822Q07J996j277j999J537J620j878j195K104
443E68N82k258KK316m84j996J162J810j583j580J594R48j702l83J704j24j525
460i49N81J243r33r40J271P62j328o05J179M59j021m18P74M25n42m71N20P93m13
479C87r91N17J064j065j400J537J586k038j485K720J309l393j019L878N51m113
495a955L11M308j279m368K087M030k931l425L816K729m405j949M607R71m552J40
511a865M208j229l771K044L027k735k044L417J255l670n42L544j94l283P88K924
527A874j070k361J225J656j403j233J408J004j221q40J065Q66j031j211R94J680
543A402j018k110J235K595j514k868J999K967k670k938L325K560l987j945M713
$$ plain form
558 1746 2929 -2315 -2660 2778 2098 -3322 -1598 3573 993 -3553 -223 3368 -655 -3193 1346 2928
574 2928 -1669 -2153 2285 1703 -2557 -1293 2486 766 -2291 -236 2051 -194 -1854 308 1389 -523
590 -523 -1050 725 956 -734 -1006 484 930 -389 -944 527 1330 -450 -1663 323 1735 -460 -1636
607 -1636 1118 1989 -1468 -2233 1408 1542 -2262 -1331 2950 1409 -2842 -726 2965 -122 -3326 510
623 510 3241 -876 -2659 1665 2350 -2226 -2049 2502 1651 -2470 -969 2576 403 -2692 -296 2285
639 2285 36 -1753 438 1498 -739 -1509 517 1118 -448 -636 940 1072 -721 -1327 303 1066 -546
656 -546 -1252 784 1686 -696 -1744 735 1553 -1124 -1411 1559 1274 -1973 -1183 2030 599 -2328 55
673 55 2920 -47 -2659 505 2309 -1258 -2334 1536 2062 -1561 -1283 1970 714 -2377 -556 2175
$$ packed form
558A746J183n244l45N438o80n420J724N171k580m546L330L591m023k538M539J582
574B928m597m84M438n82m260J264L779j720l057K055K287k245j660K162J081j912
590e23n27J775K31j690k72J490M46j319n55J471Q03j780j213J986J412k195j176
607a636K754Q71l457p65L641J34l804R31M281j541m251K116L691l087l204L836
623E10K731m117j783M324O85m576J77M551q51m121J501L545k173l095K396K581
639B285k249j789K191J060k237p70K026O01j566j88J576J32j793o06J630P63j612
656e46p06K036R02k382j048K479Q18k677k87K970k85l247P90L213j431k927K383
673E5K865k967k612L164J804l567j076L870N26l623K78L253j256l091J821K731
$$ plain form
689 2175 15 -2092 464 2089 -650 -1907 756 1631 -809 -1285 890 1000 -984 -913 953 874 -679
706 -679 -451 1010 500 -1312 -1049 839 683 -1030 -422 1678 897 -1560 -899 1344 329 -1724 -105
723 -105 2053 169 -1833 174 1704 -631 -1681 954 1660 -1004 -1340 1028 761 -1386 -544 1498
739 1498 412 -1290 -64 1021 -550 -1247 557 1266 -225 -587 580 419 -813 -637 371 294 -200
756 -200 145 467 -95 -534 -52 334 -82 -417 139 628 -63 -850 -212 733 160 -674 147 1038 26 -1003
776 -1003 -32 748 -362 -762 663 879 -660 -761 684 407 -1030 -442 1042 436 -797 -138 708 -120
794 -120 -750 95 522 -146 -240 332 178 -351 -87 311 103 -44 74 -46 -243 -76 -22 -275 0 508 235
815 235 -350 -117 294 -57 -382 70 367 10 -123 123 8 -235 -27 233 5 -138 88 133 -111 -121 50
$$ packed form
689B175k160k107K556J625k739j257K663Q75k440m76K175J10j984P1J866p9j553
706f79K28J461n10j812K63J888j56j713O08K100p81k457O61K243j015k053J619
723a05K158j884k002K007J530k335j050K635P06k664l36K368k67k147Q42K042
739A498j086j702J226J085j571o97J804P09j491l62J167j61j232J76J008p7m94
756b00L45L22n62m39M82L86m16l35N56M89o91p87O38R45n73q34Q21Q91j012j029
776a003R71P80j110m00J425K16j539j01J445k77j437N88J484o06j233O59Q46q28
794a20o30Q45M27o68r4N72j54n29K64L98k08j47J18j20j97J67N4k53K75N08k73
815B35n85K33M11l51l25M52K97l57j33K46j15k43K08K60k28j43K26M5k44j0J71
$$ plain form
836 50 18 -83 -37 -84 -184 -38 154 138 54 87 45 -84 -76 -35 -71 54 181 -14 -203 -17 113 -71 -35 237 82
861 82 -255 -41 236 -154 -388 207 506 -194 -503 188 413 -222 -242 437 380 -269 -232 158 -92 -384 119 422
883 422 -96 -385 115 271 -256 -335 281 409 -115 -274 64 102 -171 -115 205 194 -108 -78 163 51 -209 -31
905 -31 312 118 -324 -218 166 51 -278 -38 355 131 -245 -46 186 -92 -213 187 328 -129 -270 148 181
926 181 -245 -224 235 257 -123 -182 75 56 -112 -69 48 -61 -87 28 24 -101 -19 185 127 -88 -65 73 45 -101
950 -101 -36 123 50 -70 12 56 -89 -155 60 172 -36 -165 52 140 -123 -228 39 162 -64 -110 147 153 -107
973 -107 -81 185 86 -209 -119 184 82 -258 -159 180 128 -150 -146 101 83 -75 -98 2 60 55 28 -40 -41 28 46 -40 5
1000 5 92 89 36 43 4 -142 -128 75 64 -141 -71 229 129 -237 -176 164 126 -152 -30 215 57 -175 -53 114 -49
$$ packed form
836E0l2j01M6m7j00J46J92j6q4L3m2j29QM1l6J25J27j95j89J86J30j84L6K72j55
861H2l37K14K77l90k34N95K99p00l09O91K25o35k0O79n7o49L7L90k50k92N03L03
883D22n18k89N00J56n27p9O16J28n24j59L38L8k73N6L20j1l02L0K41j12k60J78
905c1L43j94m42J06L84j15l29K40L93k24l76J99K32k78j21M00J41m57j41M18L3
926A81m26K1M59K2l80n9K57j9j68M3J17j09k6J15mj25Q2K04n8k15K3J38k8j46
950a01O5J59p3j20Q2M4j45o6K15J12k08j29K17Q8k63j05K67J23k26m6K57Ok60
973a07K6K66r9k95R0L03j02l40R9L39n2k78MK47j8j58k3J00N8nk7o8jO9J8q6M5
1000EQ7ln3Pl9j46J4K03j1k05P0L00j00l66O1L40l8k78J22K45j58k32J22J67j63
$$ plain form
1025 -49 -117 121 210 -52 -150 32 82 -96 -140 32 102 -2 -94 -86 -74 -19 69 88 64 66 88 -16 -182 -150 66 178
1051 178 53 -10 83 40 -194 -209 68 128 -20 96 215 -81 -391 -112 182 -70 -156 312 409 -198 -343 123
1073 123 146 -270 -36 453 114 -390 -120 197 -174 -290 259 377 -118 -181 115 -65 -310 48 301 -34 -130
1094 -130 236 98 -375 -181 321 154 -120 139 255 -159 -243 73 -8 -258 80 378 -39 -316 71 226 -199
1115 -199 -213 193 198 -93 -17 117 -98 -196 51 95 -85 14 214 106 -136 -112 -32 -3 34 19 -58 48 102 -148 -245
1140 -245 96 213 -65 26 334 -12 -409 17 346 -197 -324 461 490 -478 -463 421 187 -578 17 779 16
1161 16 -661 132 405 -594 -518 713 531 -620 -206 739 -43 -921 81 870 -140 -623 410 525 -650
1180 -650 -590 575 403 -528 -95 697 19 -748 -68 539 -85 -416 313 555 -239 -528 116 348 -186 -296
$$ packed form
1025d9o8K38Q9k62r8J82N0j78m4J72P0j04r2QJ2N5Q8J9k4KK2j04j66L2K16J12
1051A78j25o3R3m3k34j5K77O0j48J16J19k96l10K79K94k52q6M68R7o07j45M66
1073A23K3m16K34M89l39n04K70L17l71j16N49J18m95o3K96j80k45L58K53l35r6
1094a30L66j38m73J94N02j67k74K59J16m14q4L16q1k50L38K98m17k77L87J55m25
1115a99j4M06Nk91P6J34k15r8K47M4j80R9K00j08k42K4Q0K9L7j5p7J06N4k50r7
1140b45L41J17k78R1L08l46l97M26L29n43j27P85K9r68J5Q84k34p65N95P62p63
1161A6o77P93K73r99P6J231j82j151M14R45p82q78J002P89j010m83J033J15j175
1180f50O0J165j72r31M33P92o78p67O80O07o24l31P29K42p94k89O44K32n34j10
$$ plain form
1200 -296 352 531 -154 -502 42 313 -243 -405 334 515 -299 -416 353 180 -644 -174 828 229 -744 9
1220 9 779 -328 -1022 323 979 -346 -636 665 507 -925 -522 823 196 -839 206 1038 -347 -1078
1238 -1078 391 846 -601 -645 858 630 -837 -473 755 177 -747 117 862 -135 -762 149 470 -413
1256 -413 -458 512 542 -315 -342 251 109 -434 -214 332 229 -176 -93 245 94 -315 -151 322 154 -340 -145
1277 -145 385 81 -468 -38 527 6 -505 89 476 -287 -515 369 456 -433 -288 621 252 -665 -133 659
1297 659 -40 -674 203 655 -284 -530 432 433 -544 -365 533 182 -592 -90 552 -24 -495 143 448 -192 -330
1318 -330 256 219 -343 -203 313 139 -244 -21 296 66 -239 -91 134 35 -146 -49 128 74 -99 -53 121 56
1340 56 -123 -17 169 -13 -231 28 290 -41 -272 145 315 -188 -302 184 222 -279 -162 321 112 -334 -40
$$ packed form
1200b96O48J79o85l48N44K71n56j62P39J81q14j17P69j73q24M70J002n99r73P53
1220IP70j107o94J345O56j325k90J301j58j432M03J345o27j035J045Q32j385p31
1238a078J469M55j447m4J503k28j467L64J228n78r24Q64P45r97o27R11L21q83
1256d13m5R70L0q57k7N93j42n43K20N46j03m05Q3L38j51m09J64M73j68m94J95
1277a45N30l04n49M30N65n21n11N94L87p63k28Q84Q7q89J45R09l69r17N32P92
1297F59o99o34Q77M52r39k46R62Jr77J79Q98l51p74N02O42n76m71O38L05o40j38
1318c30N86l7n62J40N16j74l83K23L17k30l05J48K25r9j81R7J77n4j73M6J74o5
1340E6j79J06J86j82k18K59K62l31k31M17J70n03j14M86L8n01J17M83k09m46K94
$$ plain form
1361 -40 304 -86 -357 112 321 -159 -255 224 224 -222 -118 260 76 -227 1 206 -59 -223 83 181 -83 -139
1383 -139 115 144 -68 -102 37 53 -47 -59 21 59 -3 -20 47 74 -31 -62 49 70 -106 -111 105 126 -121 -112 160 87
1409 87 -204 -116 147 31 -196 -1 217 -2 -152 91 172 -130 -173 116 132 -130 -70 183 103 -123 -27 126 -32
1432 -32 -157 10 125 -41 -112 85 141 -46 -97 64 103 -64 -114 25 68 -51 -54 84 67 -81 -36 85 9 -127
1456 -127 -35 131 -2 -152 -12 146 8 -155 -2 139 -11 -123 30 110 -52 -79 101 102 -90 -68 114 56
1478 56 -120 -49 124 72 -80 -18 103 28 -85 -20 75 -5 -89 23 91 -19 -68 56 101 -41 -91 36 74 -71 -103
1503 -103 48 72 -44 -61 49 32 -80 -16 86 -2 -86 27 115 -14 -106 36 114 -33 -103 49 92 -45 -51 78
1527 78 77 -60 -41 78 27 -96 -29 96 29 -82 -4 83 -3 -92 0 82 -12 -80 29 75 -48 -79 42 71 -66 -74 61
$$ packed form
1361d0L44l90k71M69K09m80r6M79%m46J04L78j84l03K28K05k65j64L06R8k64n6
1383a39K54K9k12l4J39J6j00j2Q0L8o2j7O7K7j05l1J11K1j76nK16K1k47RK72p3
1409H7k91Q8K63j16k27J95K18k19j50K43Q1l02m3K89J6k62O0K53q0k26R6J53j58
1432c2j25J67J15j66p1J97N6j87n1J61L9j67n0J39M3j19lJ38j7j48M5J21p6j36
1456a27R2J66j33j50J40J58j38j63J53J41j50j12J53Q0j62k7J80Jj92K2J82n8
1478E6j76P1J73n2j52O2J21p5j13O5R5q0q4J12O8j10m9J24M5j42n0J27L8j45l2
1503a03J51K4j16j7J10j7j12O4J02q8q4J13Q8j29r2J42P8j47p0J52M3j37oJ29
1527G8jj37J9J19n1j23O7J25o7j11P8Q7q6q9R2Q2r4o8J09M6j23l1J21K9j37qJ35
$$ plain form
1554 61 68 -75 -80 70 54 -83 -44 68 14 -76 -2 94 -7 -70 32 88 -44 -89 67 90 -41 -68 69 61 -63 -43
1580 -43 71 29 -66 -5 70 -12 -76 20 73 -45 -71 46 76 -35 -30 46 18 -54 -7 49 -6 -51 14 32 -32 -49 25 46 -20
1609 -20 -24 27 26 -28 -7 26 7 7 21 14 -3 -6 32 20 -13 5 39 19 -2 -25 -21 6 2 0 4 4 16 -6 -19 -16 14 26 11 0 6 13 -2
1646 -2 -17 -11 13 -3 -7 21 30 -19 -28 16 18 -17 -3 52 6 -41 -1 59 4 -34 46 67 -28 -35 49 32 -53 -7 96 36 -77 -7 62
1679 62 -26 -67 38 73 -36 -33 61 2 -80 -19 81 2 -51 23 45 -29 -69 15 33 -31 -13 25 13 -40 -30 23 4 -22 14
1708 14 43 7 -14 -19 4 21 0 -3 36 26 -1 -14 26 18 -23 26 77 4 -55 10 47 -42 -58 50 63 -39 -43 37 16 -73 6
1739 6 58 3 -28 45 48 -56 -40 57 43 -39 10 67 14 -50 8 46 -15 1 44 23 -40 -5 19 -4 -9 30 46 -6 -3 16 -12 -6
1771 -6 24 19 7 17 32 -1 -35 6 2 -21 -7 37 4 -31 -14 10 -26 -42 18 26 -12 -10 13 -16 -21 8 22 2 8 32 -3 -26 -4 18
$$ packed form
1554F1Pj43nJ50j6j37L9J12n4r0P4R6j01o3J02N6j32m5J56K3j31k7J37qj24K0
1580d3J14m2r5O1P5q2o4R6N3j18k6J17L0j11NP6k8p2M7N6n5m5O5J8o4j7P4K1o6
1609b0mN1jn4K1L3j9%J4pj7lL8j2l3J8L4k0k1k3MK7mkM%J2k2j3LL0J2j5j1OPj5
1646bj5OK4j6mK8Rm9rM4Kl5J4N5m6m7M0O0n5l8Q0K1r5pQ4j7q5M6J03o0j13P0O9
1679F2q8m1J05L5j09LR4n9q2O1J00p9n3P4K2p4m0Q4J8o4J8L8j2n3J0N3j9k6L6
1708A4K9l6k1nK3J7k1lL9j0k7j3M0qm1M9N1p3n9O5L7q9j6J08J3j02mQ0k1q9P9
1739FN2n5l1P3Lj04J6R7j4q2M9N7n3o4N8L8o1J6M3k1o3L5K4k3nL9J6n2LJ9k8O
1771fL0nj2J0J5l3l4M1mk3J4M4l3l5J7K4l6j6O0Ql8KK3k9nK9J4k0OK4l5k3K2K2
$$ plain form
1805 18 9 5 29 -8 -11 25 11 -21 -1 52 12 -8 20 36 -23 -16 57 22 -25 4 50 -18 -57 16 49 -56 -42 57 29 -52 -22 41
1837 41 -7 -59 30 52 -32 -47 45 37 -49 -17 52 26 -40 -5 54 -1 -31 23 25 -20 1 39 12 -22 -7 31 18 -10 4 30 9
1868 9 -14 -12 4 19 -2 -7 1 23 -18 -24 7 25 -25 -16 31 13 -46 -11 39 -14 -38 20 53 -31 -39 41 28 -43 -11 63 11 -47 11 49
1902 49 0 -37 36 38 -27 -18 48 16 -31 3 54 12 -36 18 18 -5 -32 12 29 -8 -5 7 -1 -14 -14 4 5 2 -1 7 14 -10 -1 -10 14 -7 -28
1939 -28 16 5 -17 -5 35 19 -17 -5 27 3 -37 24 40 -9 -9 22 51 -12 -16 30 24 -24 -8 35 4 -24 22 22 -7 -9 10 4 -26
1972 -26 -20 22 10 -25 -2 13 -3 -9 -12 4 2 -12 -13 9 8 7 3 11 0 -1 -7 9 9 -3 14 19 19 -6 4 27 -7 -10 9 22 -12 -5 23 25 -6
2011 -6 -13 26 -2 -14 3 17 9 -17 0 20 -29 -12 2 -1 -30 -19 4 0 -11 -4 13 14 -2 -14 3 4 -12 -2 27 16 10 4 7 0 -13 10
2047 10 27 -5 -13 19 25 -6 -12 6 21 -18 -26 7 5 -10 -2 27 12 -20 2 18 -5 -32 14 20 -8 -23 10 19 -16 -11 14 3 -22 -14 19
$$ packed form
1805A8rmK4l7lL6j4l2K0N3m0k0K8J6n9PP3l5m7K9M6o8l9P3L3j05J4R9k8q1L0O3
1837D1m8n2Q9K2q4j5R2qq6L2O9k6o6L5N9n5l0N4Km5K1L8k7l4J5L8j3k8J4K6k1
1868Ik3KJ6J5k1nQK2m1oL1J8n0RM7j8n9L5N0n3k4N8L3q4qQ0j3p1L2P4n2n8N8L8
1902D9m9l7P3Ko5RO6l2m7L4N1m2m8N4%k3k7M4J7l7LJ2qj3%J8JllQPk4RrK4k1k1
1939b8M4j1k2J2M0j6l6J2L2k4m0O1J6m9%L1K9o3mM6om8J6M3l1k8M6%k9kJ9ol0
1972b6OM2j2l5K3J5j6olJ6kj4jK2jjmQj1joJ6%j2J7N%k5J0K3l4lJ9J3l4PK8Kl1
2011fpL9k8j2J7J4qk6J7K0m9J7J4lk9J1K3mj1PJ7Jj6j2J7Jj6J0K9j1ooLpj3K3
2047A0J7l2qL2Ol1oJ8J5l9qL3kj5QK9j5l2K2J6k3k7M6Ok8j5L3Rl5NK5j1k5QL3
$$ plain form
2082 19 3 -4 -5 23 14 -19 13 24 -3 -17 8 23 6 -24 19 31 5 -9 23 24 -16 -2 15 26 -12 3 18 7 -21 -9 20 3
2114 3 -25 -5 16 -7 -14 3 10 -4 -14 11 3 -11 -10 21 8 -18 -7 4 9 -5 -4 11 20 -4 13 37 13 3 14 31 -2 -9 22 34 7
2149 7 -2 28 26 -6 -6 24 25 -12 1 26 3 -25 -13 20 -7 -33 9 28 -12 -35 1 27 -8 -10 16 18 -20 -8 22 9 -32 0 36 7
2183 7 -31 3 28 -1 -21 23 30 -5 -5 11 4 -19 -4 27 4 -12 2 24 12 -18 -7 27 -1 -18 3 1 -6 -22 6 -11 -14 -2 11 -4
2217 -4 -23 -16 0 6 -18 -8 28 9 -25 -19 28 1 -12 11 32 -3 -5 18 24 -16 -2 36 23 -15 5 21 -9 -10 22 36 -3 -8 31 13
2251 13 -20 -6 15 13 -26 -1 9 -14 -19 13 2 -13 -15 9 -4 -21 -9 10 -10 -9 20 16 -5 -8 6 1 -2 10 21 2 4 5 -6 -16 7
2286 7 22 10 8 6 -10 -8 10 13 -8 11 15 1 -17 9 5 -8 1 33 0 -26 19 24 -18 -26 16 17 -20 -16 35 -1 -35 5 19 -21 -18 41 33
2323 33 -38 -16 37 1 -31 26 59 3 -21 36 32 -23 -7 56 20 -20 13 42 -15 -38 27 29 -8 1 36 -1 -30 -15 10 -5 -22 15
$$ packed form
2082A9j6pjK8rl3L2J1k7j4K5J5j7l0M3J2k6j4L2Jm0J4J7J1l8J5J5j1k8J2K9j7
2114Ck8K0K1k3pJ7Pj4j0K5qj4JL1j3k6J1J1Nj4JJ5Rk4J7K4k4j0J1J7l3pL1J2k7
2149GrL0kl2%L0Jl7J3K5k3k8J2L3k7k6M2J9m0k3L6K6l5kK6Kl8J2L0j3m1L2L6k9
2183Gl8L4K5k9k0M4Pl5%J6pk3J5L1k3j6J4K2j2l0J1L4k8j7K1kpj6K8j7lJ2J3j5
2217dj9PJ6Ok4J0L6j9l4OM7k7j3K3K1l5kK3Om0J4L8j3l8K0J6l0jL2J4l9nL9j8
2251A3l3J4K1kl9K5J0k3nL2j1j5kK4j3j7J2J9k0JK9mk1lJ4nlJ2J1j9KJj1j0K3
2286GJ5j2kkj6KJ8Lk1J9Mj4j8K6mj3RL2l3k6M5Nm2qM2Jl7MN1l6l4M0J4m0LN9q
2323C3p1K2N3l6l2N7L3n6k4N7mn5J6O3l6m0L3K9n7k3O5Kl7RL5l7k9J5K5j5j7L7
$$ plain form
2355 15 26 -10 -22 -6 -18 -10 3 9 3 3 -2 -3 1 -4 3 3 16 16 -13 -6 9 1 -18 25 47 17 -18 21 11 -20 -7 40 13 -12 6 25 -26
2392 -26 -27 27 46 -7 5 53 7 -40 -13 22 -16 -27 27 32 -37 -30 26 9 -46 -8 43 -3 -18 21 19 -21 -12 28 12 -11 12 24 0
2425 0 -20 22 15 -3 2 19 8 1 9 10 0 7 21 0 -4 14 15 -4 -2 19 8 -12 9 -3 -16 -24 7 -1 -28 -15 17 -4 -19 -3 1 -16 -11
2462 -11 23 -1 -21 10 20 -4 -21 19 12 -19 4 29 8 -11 17 21 -2 -10 29 15 -12 4 19 -4 -13 10 4 -18 -12 15 7 -9 10 14
2496 14 -3 -18 -1 4 -25 -19 17 -2 -24 -4 16 -5 -12 -4 7 -16 -8 8 5 -9 0 13 3 5 10 16 9 9 10 15 7 -4 12 2 3 0 -10 -6 15
2535 15 2 2 5 6 -3 -3 6 -7 -3 7 6 -10 -11 -2 5 -4 -16 7 10 -15 -7 10 -2 -4 5 16 -9 -1 15 5 -17 -7 20 21 -1 7 28 10 -11 9
2575 9 17 1 -7 21 2 -5 -1 7 9 1 -17 10 6 -9 -2 -11 4 -1 -8 -5 0 -18 -8 -3 -2 -21 -14 26 8 -9 5 7 6 -3 3 4 -7 4 11 13 6 5 18 14
2619 14 5 9 29 9 1 7 23 7 2 11 22 4 -18 5 22 0 -8 18 15 -13 -14 10 0 -18 -6 12 -4 -18 7 15 0 6 2 8 6 -4 7
$$ packed form
2355A5J1l6j2J6j2QJ3Oo%njMnP%J3%k9PJ5qj9M3K2l0l5L9j0l1J3M7k7k5J8J9n1
2392b6jN4J9n3J2M8m6m7K7L5l8j1N4No9PN6j7n5L8N1m6j5L9km0RM0j6k3K3J2k4
2425@k0M2pj8NJ7j1pQJj0PJ4k1mJ8Jj9KK1j1k0K1j2j3qL1qk7J3L2k1j5J6Mj7N
2462a1L4k4k0L1J0k4j7M0pl1K3K5k1j9K8Mk3qL9j4k7J6J5k3rK3ok2OK7qj6J9M
2496A4j7j5J7Nk9OL6j9k2K0K0k1pQJ1k3QJ6lj4RJ3j0KNOp%JNqj1J6j0Jlj0MK1
2535A5j3%LJr%Rj3MJ0jj6jRPrj2K3Lk5QJ7j2kRJ1k5QJ6j0k2J0K7Jk2QK1j8k1K0
2575IQj6qK8j9pMQKqj8K7mj5PrJ5npLNj8J0NJj9PM0j8j7J4KjrOJj1J1PKpjJ3m
2619A4rMK0k0qOJ6j6nRJ1j8k2K3J7k2qK6lk8jK4j0j8J2J8j6j4K5Qj5OmOkj0J1
$$ plain form
2656 7 14 -8 -5 15 9 0 -10 13 19 5 8 9 17 1 16 12 -3 1 12 5 -9 -13 1 2 3 2 5 12 4 4 -2 5 -14 -9 -4 -4 -10 -7 0 0 -8 -6 9 5 -1 16 14
2703 14 6 13 9 12 16 7 9 14 17 11 12 13 0 3 13 20 1 0 8 8 2 3 4 4 5 -4 -1 -5 2 -3 2 3 -14 -9 -3 -5 -9 -5 -5 -9 -13 -1 -11 2 -3 1 11 -6 -4 15
2753 15 16 -2 -3 3 16 -4 1 11 23 10 15 22 14 1 12 3 2 1 5 6 -8 -10 16 11 -10 -6 7 -4 -1 6 1 -1 -16 4 1 -10 -11 6 2 -10 4
2794 4 31 15 4 1 5 -7 -6 0 0 -4 -5 -2 8 13 1 22 14 6 0 6 1 15 0 7 2 -4 -7 5 13 -4 -4 3 -8 -17 7 -14 -17 -18 -7 13 -16 2 -3
2837 -3 4 -4 -7 -4 -2 -7 -1 20 2 -3 1 18 -2 7 16 14 6 7 14 12 -2 3 15 4 4 4 9 1 6 7 6 -11 3 7 8 3 4 4 2 -6 -9 6 -15 -11 -10 -2 -10 0 1
2886 1 -15 9 2 -1 -2 3 -3 11 10 4 6 8 2 11 8 -4 13 13 0 7 5 1 15 9 -4 6 19 7 7 0 0 3 -1 6 3 -7 6 0 -5 -11 3 -1 5 9 -2 -12
2932 -12 -14 -14 -4 7 4 4 2 0 -5 7 8 10 7 16 9 15 1 14 10 6 7 15 1 4 13 10 7 -3 -3 -4 3 -9 -11 -10 7 -5 -10 -10 -6 -5 -15 -15 -5 -5 -4 -6 -8 -5
2980 -5 -1 -11 -3 0 -11 4 3 4 0 11 -4 8 -5 1 -6 -6 -1 12 14 7 11 10 9 1 5 5 -1 10 0 10 -3 -1 1 1 -10 -8 -3 -9 0 -13 7 -1 -3 -1 6 -4
$$ packed form
2656GPk2LK0orj0K3Oj4LJQj6J5mj5MJ1pj4mJ4JJjLPq%oPj9NN%oLP%qKJ5moJ7k
2703A4qPmLMrKNLoJJj3LJ0Pj9jQ%oJJ%JrLmPnNJj7NOkmM%mmJ2j0J3nMJ0j7KJ9
2753A5Jj8jOJ3k0NJ0J2j3NPqj3J1rjjMJj4kK6nk1MJ3j1LPnkj5K0lj1jJ7mj2J4
2794DK7j6j1lMj2JO%mjLJ0Nj2K1qqoOnJ4j5PnolJ2Qj7%Pj1rK4k1ljJ1K0k9J8n
2837cPqlLKnOK1j8nMJ7k0RRkqJPkj4NJ2j1%%NqNJjj7J4MJnJ%kqlJ5k1MJQqJ0J
2886Aj6K4pljNoJ4joKKoRlj2J7%j3PkmJ4oj3J0J3j2%p%LmPlj0J3onoJ4mOMj1j0
2932a2k%J0J1l%kknJ2JKlRpOj4J3mmJQj4LRllj0%jPj2kJJ7j2n%MJj0%J0%JkkL
2980eMj0QLj1J5jJmJ1j5J2j3Op%NJ3KpMjjqM%oJ1j0J0j3KK%j1KNoRj3K0qkKPj0
$$ plain form
3026 -4 -3 -8 -6 -3 -5 -6 -5 -1 -7 0 8 8 0 20 1 1 12 -1 -2 1 0 2 22 7 6 7 -4 10 6 5 -3 2 2 -13 5 -10 -2 -7 -6 0 -2 -9 -6 -5 -10 -11 -11 2 -9
3075 -9 -15 -14 -12 -3 -9 -4 0 15 -4 13 0 2 13 7 -3 -3 -2 -8 3 -3 0 8 8 -3 5 10 6 1 -5 5 -2 -1 3 1 13 -4 2 -5 -5 -11 -3 -9 -14 -11 -10 -4 2 -11 -14
3124 -14 -8 -5 -7 -1 -4 0 1 9 2 6 7 -1 10 6 5 -1 3 -3 5 6 14 2 9 -4 -6 2 -6 8 -3 -1 -5 -4 -2 -2 -16 -4 -3 3 -4 1 -7 -6 1 -15 -23 -9 -7 -10 -7 -10 -6
3175 -6 4 -8 0 10 -16 3 11 7 8 7 9 5 -2 1 15 10 14 21 15 19 13 5 3 -5 8 -3 6 3 -1 12 -7 -4 -9 -1 -7 -7 -6 -14 -9 -4 11 -6 4 6 -11 -3 -3
3222 -3 -4 -5 5 -4 1 0 8 -1 1 0 0 6 -2 3 18 -2 15 5 8 8 9 12 7 4 14 9 11 1 0 -4 -13 -8 -1 -18 -5 0 -8 -10 -6 -14 -7 -7 -7 -7 -6 -4 -5 -5 0 0 -2 1
3274 1 -1 10 11 11 5 -3 7 6 8 9 3 0 3 8 4 14 5 8 9 8 6 4 -6 3 -6 -2 -5 -7 1 -13 -6 -5 3 -7 -12 -3 -12 -5 -19 -10 -3 9 -5 6 -14 1 8 4 0
3323 0 2 8 8 10 18 4 9 8 -3 8 -1 17 9 12 12 -5 2 -4 -5 4 -10 0 4 1 -9 -15 1 -1 4 -9 -3 -8 -12 -2 14 3 -9 2 4 -4 1 -2 -2 -4 7
3368 7 7 0 11 8 4 5 3 3 23 14 12 5 10 4 3 16 3 5 -10 5 10 -4 -8 -6 1 -8 -5 -10 -20 -8 1 -3 -6 -13 0 6 -5 -13 -8 -5 -3 -5 8 -7 -13 8 4
$$ packed form
3026dJnKLkjJMoPQ%qK0j9%J1j3jLjKK0j5jJj1J4mjqN%j5J8j5QnJOkpLJnj%J3j1
3075ioJKRoNMJ5j9J7j3KJ1oj0%JoJ1oLQ%j1QNmnoJ0pJMkJ2j7Op%oQonLJOOj3l
3124a4OLkOlMJQpMJqJ1mjoMoQJQj2Pj3kQqJ4j1KmJK%j4J2JOpNqJPj6qJ4KlLlM
3175fJ0j2QJ0k6J9QmJjKmpLJ4nMPoMoqkqJ3j1RlmJ3j9LnQo%JqNNJ5j7J0Kj7Q%
3222cjjJ0rNjQrKj%OqNJ5k0J7j0L%JLnlJ0nKj0jmrNPj7J3NqkMqP%%%JKj%N%kL
3274AkJ1J%oqJ0jKJolLNmJ0rLJjkkj0RrMlkQj4PJQj0nRrPj4RPJ2j4J1k0J5Pmm
3323@KO%KQj4Njj1J1rJ8qL%j7PojRj4J0Mlj0oJ6kNj3OnmJ0J6j1j2J1KqNl%kJ1
3368G%pJ1lmJk%K0rkpNojJ3j3Kj5J5Nj4mKPrLnj0J2RmlpJ3Oj1qNLKkJ3j5oK1m
$$ plain form
3415 4 -4 -3 4 11 0 7 11 16 4 4 11 15 8 17 11 9 16 4 13 17 10 0 3 8 -4 9 11 -1 -14 -6 6 2 -3 -8 -3 -8 -1 -6 8 4 0 5 -11 0 -1 7 3 -3 8
3464 8 -1 15 21 8 25 11 11 4 20 -3 -5 9 12 8 14 15 4 5 9 15 9 -8 4 9 0 -11 -3 2 -5 -4 0 -5 -13 -14 7 -8 0 -2 4 2 -6 13 7 -5 7
3509 7 4 4 4 12 12 5 8 19 18 18 22 8 -7 5 8 3 2 4 11 5 6 2 4 4 9 13 14 6 1 -13 -9 -8 3 -15 -17 -6 -14 -15 -1 -12 7 3 -7 1 -7 -2 -11 -5 -14
3558 -14 5 -2 0 -3 9 11 -3 1 14 12 7 18 3 3 -6 14 -1 -7 0 0 -9 -5 -1 -1 -3 -4 0 -7 -15 -17 -4 -4 3 7 -4 -7 -22 -5 2 -6 7 -16 -13 -16 3
3603 3 1 2 0 12 3 -6 0 9 3 13 12 2 2 12 2 3 11 17 6 -5 11 3 5 -2 10 2 -14 -4 -16 -9 5 1 0 -8 -8 1 -6 -10 -14 3 -6 -2 -1 4 -4 -11 -10
3650 -10 1 -8 11 3 5 -2 6 9 10 12 9 3 2 16 2 2 6 7 -7 0 13 9 -2 4 -5 13 -2 -5 0 12 -2 -14 -13 -18 -17 -7 -12 -19 -14 -9 -13 -12 5 -2 5 6
3696 6 -2 0 4 -9 2 4 2 -13 -9 -4 -3 11 10 6 8 -3 -6 11 9 5 1 -1 5 0 -2 2 -4 -6 -9 -7 -9 -20 -15 0 -10 -14 -7 -15 -27 -8 -9 0 -14 -14 -2 -14 2
3743 2 4 -8 -4 -5 8 15 0 -4 -1 8 18 12 0 4 10 -3 -9 11 -5 -6 -10 0 5 -4 12 -7 -5 -7 6 -1 -3 1 -1 -13 -9 -17 -7 -7 -13 -3 -3 -14 -4 -3
$$ packed form
3415DqJPPj1PMNj2%PMpRokPj2RMpj0LNj2J3Kj2j3QJ2mnnNnPnJ4mmNj6J1jQmoJ1
3464HrJ6Oj3J7j4%pJ6k3kJ4LmOJj1JMOoj7J2Nrj1QNpJMnqjK1j5QkOkqJ9oj2J2
3509Gl%%Q%pLJ1j%Mj4j5J2LnjKPoJmK%NMJqnj4MJJ1j8kJ1qjJ4j1J9mj0QqNrOr
3558a4J9pKlJ2Kj4MJ3knJ1j5%rK0j5oP%rMM%kjMpqkJ3%PMj1lj5J7PqJ3k3LlJ9
3603CkJkJ2rrORoJ0jj0%J0j0JQOj1j1J6qKpJ2qj6J0j2PJ4mjq%RpmmJ7rMJNqpJ
3650a0J1rJ9qKpQLJKlojJ4j4%MJj4PJ3mj1OrJ8j5lNJ2j4j2JnJJ0npNNmJJ7pPJ
3696FqKMj3J1Kkj5MNJJ4jmKj1lJ7kmmkOnkMoklKkj1NJ5j0mPqj2J9jRj4%J2j2J6
3743BKj2MjJ3Pj5mLRJ0oj2MOj3oK0j6jmJ0NrJ6j9KkJ3pkMkj2MqJ0%oJ0%j1J0J
$$ plain form
3787 -3 4 -6 -9 -1 -3 -9 -5 2 11 4 2 6 -7 4 16 7 21 9 16 5 5 -1 10 5 -3 -2 1 -2 1 2 -1 0 -14 -4 -3 -10 -6 -13 -6 -8 -17 3 -9 -11 -8 -9 -3 -13
3835 -13 -11 -10 -2 -2 11 3 -1 4 0 10 -6 5 2 7 4 6 9 10 8 5 9 -3 -2 -4 3 -6 0 -7 -4 5 -4 -3 -2 -12 -8 -18 -7 -11 -12 -3 -14 -5 -6 -17 -12 -4 0 -7 -1 -5
3885 -5 2 3 -4 -12 -5 3 -6 9 -7 5 -2 10 13 10 3 5 5 8 -1 8 2 6 13 10 -5 -2 1 -12 9 1 0 4 -8 0 -10 -3 -12 -6 -10 -6 -5 1 -3 -14 -1 -4 -13 2 -9
3934 -9 6 4 10 7 5 -1 9 11 13 3 13 9 4 -4 8 -1 -6 1 -3 -1 2 1 10 -8 -9 4 -3 3 -3 2 -7 -2 -2 -15 19 11 -6 -13 -14 -3 -1 -7 -9 -16 0 -5 -4 3 -3
3983 -3 -1 0 4 9 4 12 14 12 16 22 12 11 2 12 13 14 15 7 1 11 -1 -4 3 17 4 -8 -2 -6 4 4 2 6 10 2 1 -6 -2 -5 -2 0 -2 -9 -1 1 9 3 -1 7 2 -2 1 -1 8
4036 8 -6 7 15 8 14 6 9 12 12 11 8 9 10 11 14 3 9 -9 -3 -5 -2 -5 -12 -6 -5 -10 -7 -5 -12 -7 -8 -7 -9 -13 -7 -5 -8 2 -7 -3 -3 -1 4 1 8 -4 -2 4 -1 5 -8 7 11
4089 11 11 23 19 9 12 8 6 4 3 5 6 7 5 -2 -7 1 -2 1 6 -10 -1 -11 -9 -1 -5 -7 -3 -15 -10 -8 -10 -3 -12 6 2 1 1 3 -5 9 14 -1 10 7 12 7 11 11 7 10 14
4140 14 5 11 4 7 9 3 11 6 -8 7 -1 -1 19 3 -1 7 1 2 -4 -9 4 -10 -4 -6 -7 -1 -1 4 4 7 -5 0 10 12 11 11 6 12 3 -6 2 7 5 14 7 8 8 7 7 11 15 1
$$ packed form
3787cPj0lQkoMPRpkMj3J1J2rJ4j2Pj1%oJ1nqJLlLJlJj4J0JpMpPkrK0j2kLjOj0
3835a3KJQ%J3qmNmJ0j6J1lNlKLJklMj2JkPrOpLRrJJj0Mj0J1mjRj1Rjj1NQMpOm
3885ePJpqPQrJ5j6J2pJ2LlpK%LrRoMPlj5LLj3K1qjMj2Qj0PrOmMJOmj1J3lrJ5j1
3934iJ5kOlkoJ0KKj0J0mnqJ2rnPmKLjRj8jJ3pOoNrN%j3L4qj7pjJ1KokpJ6nJPo
3983cKJMNnQKkMOj0jrJ0JJJqoJ0j2lPJ4j3j2OmJ0%kMMqjpMlLKkpQKQomQnmLkR
4036Hj4J3QpOqLL%jlJJJLj1Oj8OkLlpOJnLKpNjJkmOKlJ0rM%KNlPj2KOnOj3J5M
4089A1%J2mj0LmkkjKJJkpnQlLNj6Rj0KQmkMj2NKkPrJ8mj%KqJ4Nj5J1lNnM%mLM
4140A4rOpLKoQnj4J5q%K0j6mQoJonJ3j4OkjO%N%Lj2NJ0Kj%nOrrQNkRpJ%j%MMj4
$$ plain form
4192 1 8 3 7 5 5 -1 2 6 8 10 8 4 0 -9 -3 -3 -7 -1 5 -6 -5 1 -5 -5 -9 6 2 -4 -9 -1 4 -4 -15 10 6 3 11 10 6 12 5 6 8 0 15 13 14 20 9 -5 -6 -7 0 -14
4246 -14 -12 -3 -2 0 -2 -18 -11 -1 -12 -7 6 -2 -7 -7 -7 -7 -1 -3 -7 -2 -8 14 5 1 7 15 6 13 9 2 11 3 4 -6 21 8 11 17 8 2 3 11 8 0 8 -5 -6 5 12 7
4296 7 -13 -15 -6 -9 -9 3 -3 -5 -5 -3 -1 -8 -5 -1 -2 5 8 9 6 4 8 7 16 10 13 3 -1 6 0 5 15 10 7 7 6 1 5 10 7 5 10 9 -14 2 0 -5 6 0 0 -7 2 2 -4 -4
4350 -4 -3 -9 -5 -2 -8 0 -7 2 -3 -13 15 3 8 2 10 16 6 1 -1 3 4 5 1 7 9 4 3 17 5 10 2 10 4 5 -4 7 2 5 5 -16 3 -1 5 -11 -1 -1 -5 6 6
4399 6 -8 1 0 -12 2 7 -7 -2 -1 -1 -7 -5 -4 3 5 9 18 12 6 4 15 5 24 7 -4 9 4 5 8 5 11 2 8 -4 -9 -11 3 0 -3 -1 -2 -10 -3 -4 0 0 7 -4
4447 -4 1 -7 -13 3 -5 -14 -5 -11 -2 5 4 14 0 7 11 7 9 17 9 24 19 15 11 21 22 12 13 11 11 6 3 17 12 15 -5 5 2 17 3 -5 -8 -1 -3 -2 -1 -7 4 2 0
4496 0 -3 -2 3 5 12 4 -2 5 0 6 -2 1 0 -1 11 1 2 13 9 20 2 10 7 2 3 12 2 12 -1 11 5 7 1 4 14 -5 -5 2 -4 -11 0 3 -19 -1 -9 -16 -2
4543 -2 -8 -1 -1 -13 -11 2 -13 -5 -3 9 8 1 6 7 6 6 5 15 4 7 5 -4 5 10 2 1 1 2 5 10 0 14 2 5 6 1 -12 -2 -6 -5 -7 -4 -1 -12 -9 -7 -4 -5 -7
$$ packed form
4192APnMk%oLMKKkmmrO%mOOj1JOo%mJ5monQNqj1K5mlQjmOpJKqJ5kJOj1j4jjPj4
4246a4KRJKkj6PJ0j1NJ3qn%%%OkmNoK2rmOQrPmpRqJj0K7j3LOroJQlqQj3jJ1Pn
4296Gk0kRl%J2ok%KKpLMjPLJlkMjRoLj0mPoNJ0nl%jnMNlkNjk3J6knJ1o%pR%o%
4350dJoMLoQpRnj0K8j2NoQOj0nkMJJmOKnjJ4j2NqQoJrJ1nL%k1J9mOj6J0%mJ1%
4399Fj4Rjj2J4Nj4NJ%oKJPKMRookJ1j0J9j7j1J3nJLlOrOj2nkJ4llKjqPjM%Pj1
4447dNqoJ6qrRoRPjJ0j4PMmKQqJ5nmmJ0Jj0Jk%nlJ4nLk0J0lJ5j4qlPkJJoJ1kk
4496@lJNKPqoPnOqLjjJ2j0JJ1mJ1j8QlnJRj0J0j3J2oKoLJ0j9%PopJ1Lk2J8qpJ4
4543boP%j2KJ3j5QKJ2jpNJj%jJ0j1LkrRNqj%JLNj0J4j2LJnj3J0mJkLLj1LKLjk
$$ plain form
4592 -7 -13 -7 -15 -5 -15 -3 8 -4 7 -7 9 9 8 8 14 11 5 14 7 13 4 2 3 1 4 9 -4 8 5 0 -9 5 0 7 10 -2 7 -13 -1 -16 -11 10 -14 -9
4636 -9 4 -11 -4 -5 5 -7 -8 -8 4 1 -2 0 -1 0 0 11 2 11 5 20 10 9 12 15 0 9 -2 17 13 3 7 0 -4 10 6 9 -3 7 6 6 1 -7 -10 -3 9
4681 9 -17 -2 -6 -5 -1 -14 -7 -10 1 -4 4 2 3 -1 -4 3 -9 4 2 18 8 11 -3 10 10 6 17 12 14 4 6 9 0 12 6 7 -7 -1 5 2 -4 -3 -9 -7 -7 -3 0
4728 0 -5 -6 -8 -3 -3 3 6 -10 6 -4 -1 1 11 -2 2 3 -10 9 0 8 2 15 3 2 4 4 -8 16 12 11 -1 4 3 -2 5 7 1 7 2 6 -1 3 1 1 -1 -9 -22 -2
4776 -2 -12 -13 -8 -10 -13 -13 -8 -6 -5 -2 10 -1 8 -13 2 -4 17 8 4 -1 3 11 7 15 14 18 9 5 12 4 -2 9 0 1 4 3 -1 1 15 1 0 3 6 7 0 0 5 2 -1 -3 -3 -2
4828 -2 -3 0 -12 -15 -9 1 -9 8 -6 -12 3 0 -11 -6 8 6 4 8 14 11 20 5 11 7 6 12 2 3 -9 3 10 1 -10 -2 0 5 0 -2 1 -4 -7 -6 -4 -7 4 -4 -5
4875 -5 -5 -5 -3 -3 9 -3 2 -2 -10 -5 5 3 -3 2 4 4 6 13 8 12 14 14 3 6 9 9 10 -1 0 4 9 11 0 -3 1 4 8 -16 1 -8 -11 -3 -10 -9 -9 -18 -14 -16 -14 -11 -10 -1 2
4928 2 -9 2 2 -15 3 -2 -11 -1 9 0 -2 5 10 1 11 4 5 -1 1 10 6 1 6 17 -2 -2 5 4 10 -11 4 -5 -10 0 -3 -4 -20 -10 -18 -7 1 -6 4 2 -6
$$ packed form
4592goOqJ0j0J2J1j2J1j4J6%j%OloRpOrkJkLNj3J2lnrJ4nPLj2Rk0J2j5NK1k4N
4636iJ3j5PjJ0j2j%J2llKjJ%J1rRoJ5j0jLLj5Rj1J9mj0MpmJ4mLj2J0j%nqlPJ2
4681Ik6J5mJMj3PlJ1nQkJmlPj2J3kJ6j0Lj4J3%mJ1nKj0KLrJ2oJj4OOloJoK%ML
4728@njkN%OLj6J6j0LKJ0j3MJj3J9rQoJ3j2jK%j2K4mjj2NjnPKoOnMpMk%kqj3K0
4776bj0jNkl%NKJLJ2j1Rk1J5oK1rmnMQmQjMrmPqoJ1rJLjmKJ4j4jLLJp%Nllk%J
4828bjLj2lOJ0j0J7j4oJ5lj1NJ4kkMOlRj5OmjOj0Jj2J2Prj1QKNnkLnlJKlJ1qj
4875e%%K%J2j2NmqNJ0koNK%KPnMK%j1LL%Jj1JMNKj1lMLMk4J7rlQpJ%rMkKLJRL
4928Bj1J1%j7J8nrJ0J0rkPNrJ0pJoKRmnNJ1j9%PjOk1J5rnJ0ljj6J0qJ1QpJ0kq
$$ plain form
4973 -6 -2 1 -10 -1 4 -11 -2 3 -8 7 6 4 9 8 7 17 15 7 8 14 2 -1 8 12 0 11 3 2 6 2 3 -3 -1 -5 -1 -1 -9 -7 -3 -3 -7 -12 -9 -11 -10 -9 -9 -7 -4 -1 -10 5
5025 5 -7 5 -8 -1 4 1 -3 -10 5 -2 8 5 3 4 9 1 7 5 4 10 6 -3 4 -4 -7 -6 -4 0 6 4 -6 3 -8 1 -13 -17 4 1 -12 -4 -10 -7 -7 -6 -5 -2 -2 -9 -2 -6 -4
5076 -4 -5 -9 5 -3 -7 3 2 3 1 13 14 1 6 5 6 4 -2 0 -9 6 1 -4 -1 4 -4 -10 -18 -3 -16 -11 -18 -7 -14 -15 -14 -9 -9 -4 0 2 2 6 -3 5 -2 -9 1 8 -10 10
5126 10 -3 4 -6 2 9 11 21 14 15 15 19 12 2 14 -1 5 -1 3 8 -1 10 -1 -4 10 -14 -9 -2 -1 -13 -7 -5 -8 -9 -10 -9 -7 -7 1 -1 8 4 -10 10 -4 15
5171 15 -1 11 9 -1 9 7 4 6 2 4 12 0 6 1 2 9 -6 4 2 -1 -3 0 -5 9 4 -18 -7 -2 3 1 3 1 -7 -7 -6 -13 -14 -13 0 -2 -18 -9 -1 -2 1 -5 -8 -2
5219 -2 -14 0 -7 -3 -1 -4 2 6 14 11 7 4 -1 6 7 6 8 1 2 0 13 -8 0 -5 9 12 -3 -6 -4 -13 -7 9 -10 -1 -6 2 -2 -9 -10 -9 5 4 1 -1 2 -8 -4 -5 6 1
5269 1 15 11 12 17 3 12 12 19 5 18 11 11 19 1 9 5 5 -2 6 0 -7 13 -5 -3 -8 10 -10 -2 0 -9 -7 -2 -6 -8 -12 0 -4 -6 -3 -8 -3 -4 2 -1 -6 4 -13 6
5317 6 11 16 5 6 11 12 18 10 8 7 13 10 8 2 13 1 15 -2 4 10 -7 2 -9 5 -2 8 5 -8 -8 0 1 -6 -4 -1 -11 -4 -4 2 7 -4 -1 14 5 11 0 0 -10
$$ packed form
4973fMLj1RNj5RNj1J5jkNjjJ0kqJOj2lRMj2J1qjMmJoKmM%qKM%mnLkJJ%KLLrJ5
5025Ej2J2j3PNlmpJ5pJ0lkJNqOkjOmrPqlJKMOkj0Rj1Rj4mK1lj3QoL%JJL%pPmK
5076djmJ4qmJ0jJkJ2Jj3NjJkoKrJ5nnLNqoqJ5j3NpJ1pjJN%NMK%MrQppJ0Pj8K0
5126A0j3Pj0QPKJ0pJ%Mpj0J2j5OoMNrJ1j1lJ4k4NPJj2OKljjJK%QkRmj4K0j4J9
5171A5j6J2kj0J0klKmKQj2OnJPj5J0klkLnJ4nk2J1NNkKkq%JpjJJ3kj6RQjLolO
5219bj2J4pMKlOMQlmlnPJjKpJkJ3k1QnJ4Lj5lKrOJ6j9RnQmpjJJ4jlkLj0MjJ1n
5269AJ4mJNj4R%Pj4J3p%Qj8Qm%pQopK0j8KnJ8k0QKrKNmkmJ2mkLnNjOlnJ0j7J9
5317FNNj1JNJOqkjOlkoJ1j2J4j7OOj7Rj1J4pJ0lj3%QJpKLj0P%ONj1LJ5rOj1%j0
$$ plain form
5364 -10 8 -2 -1 4 9 2 5 10 -2 6 11 5 14 5 12 8 2 8 10 7 -3 6 -1 1 -5 -5 -11 0 -16 -5 -5 7 -10 -9 -7 -6 -2 1 2 1 5 19 -2 1 9 6 13 2
5412 2 -7 -1 7 6 4 7 13 7 13 2 8 8 8 13 12 8 5 12 8 6 8 -2 1 8 2 -5 1 -2 -4 3 1 -6 2 -2 -5 -9 -19 -6 3 2 4 2 -4 9 -3 8 6 10 5 3 0 -2 15
5465 15 10 11 10 9 13 11 12 12 -3 6 10 8 -1 15 -2 2 -8 -3 1 9 3 12 7 -7 10 -4 -8 -6 -3 -8 -15 -9 1 4 6 -6 11 -7 5 9 2 6 -2 12 10 9 7
5512 7 20 23 17 10 18 15 10 18 6 9 -1 18 9 2 0 2 6 4 0 -5 -1 5 0 -6 -5 -1 4 6 -2 -10 -9 -7 -3 1 -11 9 5 -6 1 8 2 4 5 4 9 4 10 6 4 7 9 8 15 17
5566 17 25 13 10 11 -2 1 6 4 2 -1 -5 -8 -4 0 2 -15 -4 -5 -11 -8 0 -4 -17 0 -5 -5 9 3 9 6 9 8 5 7 3 17 15 18 12 9 6 15 3 18 15 16 19 7 11
5615 11 2 11 11 6 0 -3 1 10 -4 7 -2 2 3 2 -8 2 -7 -6 -13 -5 -2 -9 -8 -8 4 -5 5 0 1 4 9 11 8 12 11 11 16 10 15 15 10 11 3 3 18 24 9 8 10 7 10 11
5667 11 -7 -4 7 4 0 5 -4 4 -10 -3 -2 8 6 -14 4 1 -4 2 3 -7 -10 -3 -1 3 8 1 -2 15 12 20 10 11 16 12 19 16 14 15 17 2 9 15 12 17 6 9 5 9 3
5716 3 4 -4 -5 0 -1 -1 -2 -11 0 -5 -12 4 -5 3 1 5 -8 -4 5 3 -9 4 4 8 12 8 13 19 17 7 14 2 23 9 6 12 17 12 9 17 26 5 9 12 6 4 9 15 4 2
$$ packed form
5364a0J8j0JNNpLNj2QNoRrPmoOKlj0RpKo%oJ1j6J1%J2j7JKJMLJjMJ4k1LQlPj1
5412BrOQjkLOoOj1O%%NjmlPmkKj0LPopOlkPkpQmlmj0J3RjKkoJ3j2J1kMnklkJ7
5465A5nJjjMkJ%j5RMkrJ6j7Mj0NMQoRnj4J7j4mKLnpOJ0LKj2J7j8J2MpMqJ4kjk
5512GJ3LopQlnQj2Lj0J9rpkKMkmnMOnoJMNKqqJKMMj2K0mj1PPoKJjNnOmkLKjPK
5566A7Qj2lJj3LNkklmlMMKj7J1joLQmj3J7n%J4oOlLjlKmJ4kLollRj2J5lJLj2M
5615A1rR%nolMRj4J1rMJjj0J0rJpQLpJ%J2rJ0nJLNKlMj%NoN%nJq%J5Oj5jKlLJ
5667A1j8LJ1lmNrQj4PJJ0kk0J8lnOJj0lPKMNplJ7lQj0JNmPlkJKj5POlNj1LmMo
5716CJqjNj%jrJ1npJ6rQkMj3MRkj2J3%MMmNOkj0Pj2K1j4lONnlQRk1MLokNOj1k
$$ plain form
5766 2 4 0 10 -1 -6 1 2 -11 -6 -6 -3 0 2 6 -2 4 11 10 10 6 3 -1 -4 -5 9 19 7 9 18 10 5 10 3 16 8 12 16 21 15 12 11 14 12 5 -6 11 2 -3 -5 -11 -8 5
5818 5 -11 -7 8 -1 -9 -2 -10 -1 -10 -1 -6 -8 2 -3 11 -2 3 14 5 7 5 9 6 5 17 0 18 12 3 3 10 5 13 9 19 8 13 15 13 6 13 8 -2 11 13 4 -2 -6
5866 -6 -1 3 -4 -1 -5 -4 6 -3 2 10 -4 4 -7 5 9 4 12 11 15 12 11 7 10 13 20 11 15 10 19 15 14 11 4 14 11 18 5 14 8 16 12 6 3 -1 7 2 -17 -6 -1 -1 4 3 -8
5919 -8 -9 -1 9 1 3 -7 4 8 3 -2 11 13 1 7 6 16 15 22 18 24 21 15 18 8 13 11 14 13 9 -2 8 14 4 8 4 -10 6 7 -12 3 -4 -5 -2 -15 -2
5964 -2 5 3 -5 2 7 6 4 -1 -2 -2 7 2 -1 12 3 12 9 8 10 5 13 8 19 14 2 21 13 7 4 6 11 12 8 9 6 13 13 12 0 0 -4 7 0 -15 1 -9 5 2 4 7 -6
6015 -6 4 -6 -9 -10 1 -8 -6 5 2 3 10 3 4 3 14 13 11 15 24 19 18 25 15 20 9 15 14 5 21 20 12 1 15 7 4 0 17 3 2 6 -3 3 -9 -7 1 -4 -1 1
6063 1 7 -6 -4 5 4 2 4 1 2 4 -1 6 6 3 15 15 14 10 16 14 7 14 10 -3 15 7 9 8 18 9 10 5 12 4 4 14 7 2 -12 -8 -6 -10 -7 4 6 -5 -3 -11 -3 -2 3 -2
6115 -2 -4 1 -13 7 -10 6 3 10 9 7 10 6 12 8 19 13 12 18 13 8 -4 12 7 16 0 7 4 -11 -1 7 -6 -12 -11 -4 -5 4 -2 -3 -1 -9 -1 4 -6 -16 9 8 -3
$$ packed form
5766BKmJ0j1nPJj3N%LLKMqOPj%mlmljJ4J0j2KRqnNpJ3qMMNoljLkpj1J7rnkoLJ3
5818Ej6MJ5rqPqRrRnkJ0nJ4j3NJ1rKkMljJ2j7J8or%PnQmJ0j1NKkpPnj0J3Krom
5866fNMpLmJJ0rNQj4Qj1J2MnQjMljmLLPrMnRmjlpJ0lPj3RoQmolmQnj9J1N%Njj1
5919hjQJ0qKj0J1MnnJ3Kj2OjJ0jPmOloLj0NkLjmj1J0Oj0Mmj4J6Jj9J5pjLj3J3
5964bPkqPNjknj%RnlJ3rRljKnQnJ1nj2J9qolKNJmJlP%jj2%mJ1pj5J6j0J4lKLj3
6015fJ0j0ljJ1rKJ1lJPpJjJ1jkMRnjPj0Nj1OjrJ6jqj1J4qlmJ7j4jMrOj2KQnLK
6063AOj3KRjkKlJKnP%lJ2%jmOkpPmj3J8qKjJ0rJnPq%J0pnj4MKmLJ1Kj1KqQJNn
6115bkNj4K0j7J6lPjkLmOmJ1ojOnnj2J6nRj6Plj5J0Qj3oJPjRojKqQNj0j0K5jj1
$$ plain form
6162 -3 2 -12 9 -3 3 1 -6 6 4 2 10 13 6 6 16 21 7 20 15 11 7 10 20 15 17 9 5 -3 0 -1 9 4 6 4 -6 -5 -5 2 -1 0 3 5 -15 -2 2 -3 3 -4 -2
6211 -2 7 6 13 12 12 7 14 8 5 18 19 11 16 -2 5 11 10 20 23 8 11 17 13 17 -1 3 3 1 9 3 -1 1 -3 -14 -1 -11 -10 1 -9 -9 -3 -5 -6 -6 -5 -1 -6 7 -3
6260 -3 2 4 4 3 -1 0 3 7 14 9 3 7 2 6 3 -5 -6 2 -1 15 9 -9 -2 -5 -2 0 11 2 2 -7 -10 -3 -5 -9 -7 -12 -11 1 -10 -3 -10 -15 0 -2 -4 -6 7 2 6 9 5 5 16
6313 16 9 -1 4 19 28 21 10 12 9 18 21 16 2 9 5 3 5 3 12 -2 3 3 8 -2 6 10 5 13 -8 -8 -9 -4 -2 5 3 -4 -5 -3 -2 12 4 -1 2 6 -5 9 3 2 7 7
6363 7 17 18 11 3 9 14 6 16 6 12 0 10 13 -4 2 4 -3 5 5 7 -8 -8 2 5 -5 7 -4 -11 -8 -8 -2 5 -5 -11 1 0 -6 6 16 4 14 9 17 4
6407 4 6 -5 4 5 4 5 13 10 20 26 10 13 13 26 19 3 6 7 17 7 8 10 2 8 1 3 2 -5 -5 -11 -3 6 -2 -8 1 -7 -1 -3 3 -3 3 15 10 5 -2 3 -3 10 5 14 1
6458 1 5 6 7 14 18 10 16 6 8 15 17 13 4 14 5 3 8 6 7 2 1 -5 -3 8 -17 -6 -5 -2 -10 -9 -2 2 5 -1 -9 0 2 10 -10 10 3 10 6 10 4 13 9 17 17 -1 7 3 17
6511 17 8 9 17 19 11 2 7 6 9 4 6 8 4 1 10 7 15 7 1 -6 1 -1 6 1 8 -10 -2 -5 -14 -15 -6 4 -15 3 6 3 0 8 14 9 17 16 -1 10 8 23 20 3 10 15 10 15
$$ packed form
6162cNj4K1j2OkpJ2kkQLp%J0Nj4J3nmmLJ0nKqmqLjJ0nKkj0J%PlJLKk0J3MnOpK
6211bRjPj%nPolJ3JqNj8POjJ0Lj5LOmMj8M%kQomKmj1J3j0JJ1j0%Okj%JMnJ3j0
6260cNK%jmJLMPnoMnMlqjQlJ6oj8PlLKJ1r%rlPkmKnJJ2j1PpnJ5kkkJ3nMLm%J1
6313A6pj0NJ5Rpj1KlRLnj4PmkKkRj4N%Nj0QMnQk1%jNKPkpjKJJ4qnLMj1J4ojN%
6363GJ0JpqONqJ0j0Oj2J0Lj7OKpQ%Kj5%J0Lj0J2j1pL%OPj0oJ2joJ2J0j2J0nQj3
6407DKj1RJjJQlJ0Oj6L%J3pj6LJJ0j0JKqOpKjp%oQRqoRqOkOoOJ2nnpNoJ3nRj3
6458AMJJPMqOj0KPKmrJ0rkNkJnjoKJ1k5J1JLqJPMLoqRKQk0K0pPmMoRmQ%j8QmJ4
6511A7rJQKqrNjLnKKmlRlQqopPkPnPj8QlrjRJ0j9J8LllQOnQjj7J1kJ5lj7PNnN
$$ plain form
6563 15 4 15 8 1 11 -5 8 4 10 4 -8 3 11 4 3 11 7 1 3 10 4 -4 -4 1 -1 -3 8 5 -8 -1 -2 7 0 -7 2 3 15 8 8 9 9 19 4 21 18 11 16
6610 16 13 -3 7 1 5 5 -1 1 -1 5 -4 0 0 16 -14 -3 -9 4 3 5 4 -2 -1 -13 2 0 -6 3 8 9 10 13 -1 9 11 5 8 13 11 -4 15 16 9 11 7 11 14 18
6658 18 19 5 20 11 11 11 -3 5 10 4 -2 -6 -14 -9 -6 -2 -1 -11 -8 6 -2 4 -5 2 4 1 4 5 4 12 6 6 1 4 9 2 -4 16 3 11 14 21 11 8 31 6 10 3 14
6707 14 8 7 10 8 6 3 -8 -2 5 -8 -4 1 6 2 6 4 -2 -11 -6 -8 -4 -8 -4 5 -14 0 0 3 0 8 -4 14 2 7 1 7 1 -1 10 23 6 17 2 21 -7 5
6753 5 10 25 -1 12 1 5 10 12 -1 -4 -16 -11 6 -2 -1 -1 7 -5 3 -14 -5 -9 -3 -5 -1 -13 2 -3 2 -12 5 -9 1 6 10 13 9 7 3 11 6 -2 7 15 18 7
6799 7 18 20 2 21 10 12 6 5 11 7 -6 2 -5 -2 -5 2 -6 1 2 -2 4 0 -1 -7 -7 -8 -5 -1 -3 1 -3 13 -11 -9 -2 3 6 13 -1 -4 14 7 18 8 6 10 13 14 19 7
6849 7 12 6 8 19 6 -3 3 -8 -4 1 -8 7 -13 -4 -6 -10 -5 -2 1 -5 11 1 -3 -1 -1 10 1 2 9 14 1 2 4 6 4 0 23 6 8 11 13 7 19 5 4 10 8 9
6897 9 2 9 8 6 2 2 3 -10 -12 -6 -4 -3 -9 5 -16 -7 -11 4 -5 -9 -6 -2 -10 -3 -4 -6 -4 2 -4 2 2 -1 15 0 12 6 14 7 -4 -1 7 6 -3 0 4 9 9 12 4 15 20 4
$$ packed form
6563A5j1J1ppJ0j6J3mOoj2J1QpjQmoKPoq%NkkJ1lj3PjRppRJJ2p%J%J0j5J7lpN
6610A6lj6J0oM%oKkOrM%J6l0J1oJ3jKjoJj2J5koRNJJLj4J0KoLNkj5J9JpKmMLM
6658A8Jj4J5r%%j4QNoomqNLMJj0LJ4qOrPKlLJjQo%nLNpoK0j3QLPj0lK3k5MpJ1
6707A4ojLkklj1OPj3MNNmMkorNkMmMRj9J4%LlQj2J8j2NoOokJ1J3j7J1j5J9k8J2
6753ENJ5k6J3j1MNKj3lj2NJ7qJ%Qj2Qj7RmOkMj2J5nNj4J7j4J0NMLmkmQnqRQLj1
6799GJ1Kj8J9j1KojOmj3QpLlPqPJmOmjo%jLMkMmJ6k4KPNLPj4lJ8pJ1j0kMLJNj2
6849GNoKJ1j3rOj1MNrJ5k0RkmNLLoJ6j0mK%J1rJPNj3JKKkmK3j7KLKoJ2j4jOkJ
6897IpPjkm%Jj3kOKJoJ4k1RmJ5rmLMqPjkKOoO%lJ6j5J2oQpj1LQjrLMN%LqJ1Nj6
$$ plain form
6949 4 -3 7 -1 -3 12 2 -3 0 1 -2 7 2 -3 0 -4 -1 -10 -20 -10 3 -15 -8 -3 -3 -2 4 7 6 10 17 17 12 19 7 14 6 6 16 11 6 7 9 13 15 7 15 8 0 12 1
6999 1 -12 1 7 -6 -3 -3 -4 -5 -13 -4 -6 -5 -6 -9 4 3 -2 6 -8 0 -6 -1 -12 5 6 2 -1 4 7 12 13 9 16 18 11 -2 3 9 7 12 11 12 6 -1 -1 -3 -2 -6 1 3 -4 -10 -10
7052 -10 -5 0 -8 -14 -8 -5 -11 -10 -6 0 2 4 1 -14 -4 8 4 -6 7 7 0 9 4 7 9 -4 9 2 12 -3 17 1 -1 2 10 9 10 8 -9 1 10 -5 11 -3
7096 -3 -4 -3 -1 -7 -14 -16 -5 -5 -3 -5 -5 1 2 3 -1 -7 -10 1 2 -3 -6 5 10 -2 4 9 17 12 10 3 4 4 -7 8 5 5 10 11 10 2 4 5 9 5 13 -1 9 -9 -6 -2 -6 -5
7148 -5 -14 -6 -12 -5 -7 -8 -15 -5 -3 -14 -3 -17 -15 -6 1 4 7 6 4 7 4 18 10 18 4 10 10 11 6 7 2 1 -8 8 8 -4 -5 5 3 1 9 -4 6 -6 -13 3 -11
7195 -11 -8 1 -19 -5 -7 0 -10 -13 -5 1 -2 -6 0 -12 -6 3 4 -5 -1 -8 -1 6 2 13 -1 20 17 14 6 7 9 4 11 -1 12 7 2 4 2 -2 -2 -4 -4 3 -10 -3 -14 -4
7243 -4 -13 -7 -6 -11 -9 -10 -12 -5 2 -13 -2 -4 -10 -6 -19 -11 3 -1 0 -1 8 0 8 14 -1 4 16 4 4 9 9 6 9 8 17 13 5 2 -4 6 1 -6 1 -6 -14 -10 -13 -2 -7 -5 -11 -13
7295 -13 -11 -4 -4 -7 2 -11 8 5 1 -3 -9 3 7 11 0 9 12 3 7 8 5 12 13 12 1 -7 4 4 -2 5 -4 -4 7 3 8 9 7 -8 -7 -7 1 -7 -11 -11 -12 -5 -13 -2 -2 0 -12
$$ packed form
6949DpJ0qkJ5j0nLJlRnnLmLrj0J0J3j8PN%JOLjMP%nPj2Pq%J0nnJKMKqQpqJ2j1
6999Aj3J3Oj3L%jjqRkJjlJ3jnQj4QoNj1J7JmlNLNJmPKpj3NOkNjJop%kJmPKpo%
7052a0NNqoOLoJMOKKlj5J0J2mj0J3%pRnLKj3J3pJ0j5K0j6kLQjJkj7J0Rj5J6j4
7096cjJKopkJ1%Kk%OJJmolJ1JnlJ1Nj2ONQnkpJ%j1J5l%NJjqKJMmQj4J0j8LMmJ
7148erQoPkjpJ0Kj1J1j4KRPLLjkLlJ4qQj4O%JnJnjrJ6%j2jJ0kkQj3J0j2pJ6j4
7195a1LRk0J4kPj0lQOlmOj2ORJrMpPPmJ1j4K1llqJKnPj2J3nnKkm%k%Pj3Pj1J0
7243drOJnKjkPPj5J1koMj3QJ4mJjRqQOj5NJ2j2%N%lLjRmqloJ0npPpqMlJ1nKok
7295a3KP%lRj3J9lmmoJ2MMj1RLrMJlPJjj1qJ1%oPr%J1mNJkj5J%Qqm%jPqJ1%Kj2
$$ plain form
7346 -12 -18 0 -15 0 3 -6 5 -1 9 1 6 -3 14 5 4 9 9 9 1 11 7 8 11 19 11 10 2 10 1 21 4 -4 -5 -2 2 -6 -4 2 -10 0 -10 -8 -21 -5 -15
7391 -15 -10 -5 -9 -2 -6 -5 -14 -11 -10 1 -2 -4 5 0 -3 2 9 5 11 13 9 20 19 7 13 3 1 7 -2 3 -1 1 11 5 7 2 -2 4 4 -1 8 1 -7 5 -4 -7 -7 3 -7 -21 -7
7442 -7 -4 -2 -4 3 7 4 -4 0 -6 5 9 12 1 3 14 18 15 6 20 13 14 0 3 9 17 3 4 2 3 -2 7 -11 -19 -7 -6 -14 -4 -18 -1 -10 -8 -1 -13 -11 -5 -2 -12 0
7490 0 -1 1 3 -9 5 3 6 -2 -4 1 8 2 4 14 17 6 10 18 -1 10 13 12 2 9 3 2 1 7 13 6 -1 2 -1 -1 -4 -1 -13 -9 -20 -16 -12 -5 -16 -17 -3 2 -15 -7 -6
7539 -6 -7 0 5 8 8 11 8 -4 -6 -2 2 -2 3 5 13 -1 1 15 4 7 -2 6 1 7 -1 1 4 3 1 -2 7 -1 -8 -7 -8 -11 -1 -6 -4 -11 -14 -11 -11 -6 0 -3 -18 4 10 4 -1 3 5 3
7593 3 7 3 5 5 7 17 17 16 6 18 13 14 6 10 18 7 5 2 -1 -4 -2 0 -5 0 -2 -8 4 -1 -18 -10 -15 -8 -13 -14 -10 -3 -7 -4 -7 -8 -5 1 -6 8 0 -12 8 5 -2 -1 1 -1
7645 -1 6 3 1 -9 0 2 3 1 1 2 9 9 -6 -3 -1 -2 -2 -5 -1 -2 -1 -10 -2 0 -14 -19 -9 -13 -13 -5 -9 -2 -6 -8 -8 -6 -3 7 1 -6 -4 2 4 12 -10 10 3 9 4 6 4 7 7 -1
7699 -1 4 5 6 11 7 4 10 -6 2 -3 8 -2 3 -7 -1 -8 -15 -7 -8 -16 -9 -17 -12 -7 -4 -4 -12 -8 -11 -13 0 -7 -2 0 -1 5 -5 8 -6 2 5 2 5 10 -4 12 1 6 3 8
$$ packed form
7346a2oJ8j5J5LrJ1oJ0qNrJ7rjN%%qJ0mJLQqjqQrK0j7qjLMqKOj2J0j0Kj3J6j0
7391a5NNmPmJrLJJ1lkRnlNPmOKmJ1jj2Oj0kOrNmKJ0oKnmO%nRpqJ2rl%J0j0j4J4
7442gLKkPMlqMoJ1MLj1KJ1MlrJ4pJj4LOQj4JkJnRj8qJ2JqJ0j4J7rKPj2KOLj0J2
7490@jKKj2J4kLqkNPoKJ0Lj1MQj9J1Ljj0PojjOOppLl%lLj2Mj1MMPj1jJ4Nj7QJ
7539fjPNL%Llj2kMMmNKQj4KJ4j1LrQnOqKLjklRqpJjlJ0nKplL%NOlj5K2OonMKk
7593CMmK%KJ0%jj0J2nJqMQj1klllKKnNkoJ2nj7QnPnjMPmLljLOpJ4qj2K0lpJKk
7645aPlkj0RKJk%JP%j5LKj%lMjJrQKj4nJ0m%QmPmk%KLJ0opKOKQk2K0pOnKkL%q
7699aNJJNmlOj6QnJ1j0Nj0OppQjqPqNNL%qMlkJ3pNKjOj0J3j4QLlLNj4J6j1NlN
$$ plain form
7749 8 -1 -1 1 5 13 5 5 -6 0 1 -11 -7 0 -11 -11 -5 -4 -20 -21 -13 -15 -17 -13 -6 -13 -12 -9 -11 -6 -8 -5 -2 5 -3 4 4 11 0 6 5 5 24 6 6 7 8 2 1 -8 2 2 2 -1
7802 -1 3 6 -4 -2 -4 -7 -3 0 -8 -5 -3 -4 -13 -21 -1 -24 -12 -9 -2 -9 -8 -6 10 0 -7 -10 8 9 -5 -2 6 11 3 1 -5 13 6 16 11 6 14 9 19 16 6 -2 13 10
7850 10 -11 -7 1 -4 1 5 -4 7 4 -1 -4 -15 -12 2 -11 -1 -7 0 -7 -5 -11 -3 -6 -7 2 4 -7 -5 -1 -13 4 4 9 9 13 5 7 18 5 17 8 14 11 2 20 5
7896 5 21 6 7 -7 -4 1 -16 -5 -6 5 -15 -7 -11 -6 -8 -6 -9 -1 -3 -7 -11 0 -3 -10 -10 -10 -2 2 4 3 0 0 9 4 -8 6 3 14 11 11 13 2 8 16 4 15 11
7943 11 3 5 -1 8 14 -4 -4 0 -3 -9 -6 -8 -8 -10 -10 -4 -15 -4 -7 -12 -12 -8 5 -9 3 -4 -7 10 2 -9 3 9 12 8 10 21 4 18 1 3 7 11 4 15 9 1
7989 1 0 14 4 12 4 9 -4 3 1 5 10 -6 -3 -1 -5 -1 -11 -12 -13 -15 -3 -8 0 -10 8 1 -5 -2 0 1 14 4 3 5 15 17 21 19 9 14 12 9 12 6 13 2 3 14
8037 14 6 -6 -8 -3 5 3 -15 -7 -12 -10 -7 -4 -9 -4 2 -11 -1 -3 -8 -1 -5 -4 -2 4 -5 -9 1 -4 13 -4 1 2 2 2 14 8 3 5 15 3 11 23 16 13 6 16 13 9
8085 9 12 18 -6 6 5 3 2 -3 -1 -1 -5 3 -11 2 -8 -16 -6 -10 2 4 -10 6 4 -2 -8 3 5 10 -3 9 5 4 3 -2 14 9 -4 5 9 7 8 -2 4 -4 9
$$ packed form
7749Hr%KMQq%j1OJj2MPj1%OJj6jQkkMPpJLkNkLLPqP%Pj1Oj%J9j8%JJojrJ0%%l
7802aMLj0KklMLqLKjrqK0k3J2LPpJKJ6j0plJ8Jj4LQNqkoJ8pJ0nnQnJ0lj0qJ5l
7850A0k1MQnNMrJ1lnlj1LJ4j3J0oPpKoQljRKj1KMj2J7%N%MqKJ1j3J2rOlrJ8j5
7896EJ6j5Jj4LNj7J1jJ1k0QmNkKlQkmmJ1lp%%QMKjl%Rnj2J4lJ1l%Kj1OQj2J1m
7943A1qKoROj8%MloLk%k%Oj1J1ln%MJ3j4J2plJ7qj1J2OLmKJ1j7J4j7KMMpJ1oq
7989AjJ4j0QqNj3PkMNj6LKmMj0jjkJ2nQj0J8poLKJJ3j0jKJ0KMkj0NklLoPj1JJ1
8037A4qj2kNQkj8QnKLLnNOj3J0knPmJKOrmJ0nJ7j7NJ%%J2onKJ0j2QJ2plpJ0lm
8085ILOk4J2jkjnK%mQj4J3j0qJ0mJ2Kj4J6kooJ1KNj3J2mjjnJ6nj3RMkJj0OqJ3
$$ plain form
8130 9 10 16 7 -1 8 7 10 7 5 -8 3 -8 -4 -1 -3 -11 -1 -6 -5 -1 -8 -4 -21 -16 -2 -5 -6 -3 0 -6 17 9 9 7 10 20 15 10 15 4 6 1 -4 6 1 6 -2 6 15 12 11
8181 11 8 13 -3 -7 0 -2 3 -6 -5 -5
$$ packed form
8130IJOrqRjLlkj3J1j1MLkqJ0nJMpMj7NJ4ljLLoK3q%kLJ0nnNj1KnnJ0nNqQRlj
8181A1lNj6mPkNrJ%
8191e
$$ Imaginary data points
##PAGE= N=2
##DATA TABLE= (X++(I..I)), XYDATA
$$ plain form
0 0 0 0 0 0 0 0 0 0 0 0 0 0 0 0 0 0 0 0 0 0 8 -8 8 -8 8 -8 16 -16 16 -16 24 -24 30 -32 36 -40 48 -49 56 -64 72
41 72 -80 88 -96 107 -120 131 -145 160 -177 193 -212 235 -259 286 -317 351 -391 437 -493 557 -639
62 -639 740 -870 1047 -1304 1705 -2442 4191 -17259 -738 32144 -12032 -17293 24218 25058 -23543
77 -23543 -19127 18174 8483 -22603 -777 24894 -510 -24099 2577 18380 -6455 -14799 13076
90 13076 17247 -10075 -15810 5235 6490 -9439 -5615 12360 9725 -6711 -7575 3115 138 -9732
104 -9732 -2475 13498 9919 -4751 -1327 9945 -1115 -17083 -4303 13758 892 -13540 4372
117 4372 16966 -5894 -17221 8015 16162 -10079 -12948 13699 9432 -19378 -11042 16821 5792
130 5792 -15776 2906 21700 -2311 -19904 3099 13736 -9956 -13006 13533 13943 -10822 -9065
$$ packed form
0@%%%%%%%%%%%%%%%%%%%%Qj6J6j6J6j6K4l2L2l2M0m8N4o2O8p6Q8r7J05j20J36
41G2j52J68j84K03k27K51k76L05l37L70m05M47m94N45o03O68p42Q28r30J050j196
62f39J379j610J917k351L009m147O633k1450J6521L2882m4176n261M1511Q40m8601
77b3543M416L7301r691l1086K1826K5671k5404k3589K6676J5803k4835q344K7875
90A3076M171k7322n735K1045J255j5929L824J7975k635j6436q64J0690k977r870
104i732P257J5973l579j4670L424J1272j1060j5968J2780J8061j2866j4432J7912
117D372J2594k2860j1327K5236Q147k6241k869K6647m267k8810Q336K7863j1029
130E792k1568J8682J8794k4011j7593K3003J0637k3692l050K6539M10k4765J757
$$ plain form
143 -9065 9731 1952 -14129 -2577 12254 1915 -7475 3126 7354 -4921 -7560 3730 5281
156 5281 -3332 -3256 3142 1656 -3734 -2392 2842 4249 1709 -463 96 522 -2793 -5182 -878 3612
172 3612 544 -1648 3543 4158 -4246 -5317 3721 3651 -5165 -2184 7555 2551 -7684 -2010 6521 -389
188 -389 -6283 2624 6735 -3067 -5435 3774 3312 -5416 -2280 6195 1619 -5875 -930 4166 -1671 -4649
204 -4649 2012 4341 -956 -1508 2396 664 -3210 -1353 1537 168 -789 903 1043 -472 -702 -539
220 -539 -586 697 1220 -641 -815 1265 38 -2772 -461 2875 74 -2385 1767 3266 -2428 -3492
236 -3492 2804 2965 -3399 -2121 4416 1876 -4657 -1471 4203 332 -3972 842 4030 -1306 -3515
251 -3515 1719 2603 -2392 -2023 2788 1722 -2474 -971 2298 449 -1856 256 1779 -275 -1119 525
$$ packed form
143i065J8796p779j6081J1552J4831j0339r390J0601M228j2275k639J1290J551
156E281q613P6O398j486n390J342N234J407k540k172N59M26l315k389M304M490
172C612l068k192N191O15q404j071R038p0q816K981R739n004j0235N674Q531o910
188c89n894Q907M111r802k368R209m62q728L136Q475m576p494M945N096n837k978
204d649O661K329n297n52L904j732l874J857K890j369r57J692J40j515k30J63
220e39m7J283N23j861j74K080j227k810K311L336k801k459M152J499n694j064
236c492O296J61o364J278O537k540o533L186N674l871m304M814L188n336k209
251c515N234Q84m995L69M811j066m196J503L269j849k305K112J523k054q44J644
$$ plain form
267 525 362 -1310 -719 904 391 -592 226 945 -34 -865 -258 331 -75 -389 148 541 -110 -700 53 868
287 868 -35 -998 317 1579 -196 -1979 -138 1756 -383 -2260 169 2075 -416 -2038 637 2019
303 2019 -554 -1340 1224 1290 -1577 -1430 1362 915 -1601 -650 1852 796 -1588 -623 1406 570 -1002
320 -1002 -293 814 112 -724 -320 116 -82 -34 268 246 170 336 256 15 151 250 -188 -458 -28 146 -427
341 -427 -469 437 820 -38 -574 142 656 -109 -728 -36 611 -51 -784 -253 410 27 -376 254 716 89 -328
362 -328 293 493 -429 -835 -46 306 -454 -778 78 665 91 -414 56 567 147 -433 -197 253 32 -425
382 -425 -202 267 62 -317 70 559 183 -332 44 511 94 -417 -210 35 -174 -362 -220 -26 278 545
402 545 259 -173 45 392 2 -349 98 339 -126 -190 143 -182 -437 399 707 -329 -547 661 602 -849
$$ packed form
267E25j63j672N91J623n13r83Q18P19r79q31O07N89m06l14N37L93o51n90P53Q15
287H68r03r63J315J262j775j783J841J894k139j877K429J906k491j622K675J382
303B019k573p86K564O6k867J47K792m47k516R51K502j056k384R65K029q36j572
320a002P09J107p02q36M04M36j98M8L02k2p6J66q0k41J36R9m38k70M30J74n73
341d27m2R06L83q58n36P16N14p65o19O92O47o62p33N31O63l83m03O30M62o27m17
362c28O21K00r22m06P89L52p60l24Q56N87n74n05M70N11m20n80K36M50k21m57
382d25K23M69k05l79L87M89l76n15L76M67m17n11K07K45k09j88J42J94L04K67
402E45k86m32K18L47l90l51M47K41m65o4L33l25k55Q36L08j036k18J208n9j451
$$ plain form
422 -849 -637 772 287 -930 -147 701 -454 -794 916 1010 -804 -395 1429 267 -1802 -382 1533
439 1533 -125 -1512 455 1293 -952 -1271 1066 869 -1236 -403 1528 129 -1576 20 1264 -459
455 -459 -1134 608 810 -737 -304 1097 289 -888 154 946 -409 -1090 202 764 -294 -679 237 620
473 620 -62 -530 -19 664 269 -574 -122 857 31 -1224 60 1561 -212 -1761 623 2054 -992 -2150
491 -2150 1496 2235 -1859 -2072 2129 1389 -2907 -1144 3148 639 -3114 240 3293 -884 -3244 1312
507 1312 2827 -1745 -2117 2277 1534 -2575 -982 2433 46 -2420 737 2389 -1207 -2129 1472 1601
523 1601 -1827 -1296 1836 910 -1702 -481 1562 253 -1212 146 1185 -149 -1040 131 991 -69
539 -69 -1086 -78 1336 312 -1615 -546 1823 515 -2185 -391 2585 236 -2801 156 2908 -721
$$ packed form
422h49K12J409m85j217P83Q48j155l40J710R4j814M09J824j162k069J420J915
439A533j658j387J967Q38k245l19K337j97k105Q33J931j399j705J596J244j723
455d59o75J742K02j547M33J401q08j177J042P92j355o81J292N62j058l85R16L83
473F20o82m68N11O83l95q43M52R79q26j255J284J501j773j549K384J431l046j158
491b150L646P39m094k13M201p40m296J763M292k509l753L354L053m177k360M556
507A312J515m572l72M394p43m109J593L415k387k466L157J652l596r22L601J29
523A601l428N31L132r26k612J221K043j309j465J358J039j334q91J171Q60j060
539f9j017J008J414j024j927J069K369j308k700J794K976k349l037K957K752l629
$$ plain form
555 -721 -2969 1458 3067 -1942 -2728 2611 2412 -3094 -1930 3381 1214 -3657 -644 3500 -162 -3271
571 -3271 998 3022 -1594 -2627 1933 1912 -2435 -1425 2652 1132 -2334 -483 2117 -81 -2017 272
587 272 1695 -333 -1137 639 889 -885 -1101 514 918 -413 -882 510 1170 -453 -1496 372 1699
604 1699 -355 -1653 835 1848 -1276 -2149 1412 1906 -1790 -1387 2652 1357 -2980 -1157 2868 278
620 278 -3170 319 3295 -736 -3017 1259 2547 -1881 -2083 2499 1939 -2500 -1341 2473 609 -2681
636 -2681 -314 2606 265 -1959 186 1494 -765 -1627 574 1355 -366 -747 744 804 -936 -1293 438
653 438 1176 -355 -1044 792 1586 -644 -1694 686 1592 -1008 -1581 1265 1303 -1808 -1250 2040 939
670 939 -2122 -231 2594 -149 -2935 185 2499 -799 -2184 1557 2306 -1538 -1747 1698 949 -2191
$$ packed form
555g21k248M427J609n009p86N339j99n506J164N311k167m871L013M144l662l109
571c271M269K024m616j033M560k1m347J010M077j520l466J851K600k198j936K289
587B72J423k028q04J776K50j774k16J615M04j331m69J392O60j623j043J868J327
604A699k054j298K488J013l124q73L561M94l696M03M039j295m337J823M025k590
620B78l448L489K976m031k281M276J288m428k02M582n60m439J159L814j864l290
636b681K367K920k341k224K145J308k259q62K201P81j721l81J491O0j740l57J731
653D38P38j531o89J836P94k230j050K380R06k600n73K846L8l111N58L290j101
670I39l061J891K825k743k786L120K314l298j385L741P49l844k09L445p49l140
$$ plain form
686 -2191 -586 2361 355 -2102 213 2013 -695 -2135 630 1756 -758 -1389 902 1158 -951 -952
702 -952 997 946 -743 -616 850 436 -1196 -775 1096 926 -868 -520 1340 623 -1678 -984 1391 585
720 585 -1551 -213 1918 130 -1966 0 1810 -328 -1597 879 1700 -1018 -1585 948 1069 -1135
736 -1135 -524 1547 478 -1481 -369 1015 -336 -1161 625 1362 -328 -917 358 405 -821 -596 600
753 600 547 -147 64 438 -102 -519 -12 389 -66 -409 79 489 -136 -742 -40 833 221 -710 -81 794 -123
774 -123 -1057 -9 923 -81 -663 571 835 -691 -863 647 577 -799 -322 1138 463 -982 -406 604
792 604 -121 -785 135 714 -60 -340 258 192 -368 -147 332 119 -153 42 39 -153 -9 106 -107 12 410
813 410 124 -447 -208 289 6 -362 45 335 -78 -293 32 82 -123 78 318 48 -195 19 111 -111 -123
$$ packed form
686b191J605K947k006k457K315J800k708j440K765J126k514o31K291K56k109j
702i52J949n1j689J27J466m14j632M21J871j70j794L48J860p17k301O94K375q06
720E85k136J338K131j788k096J966J810k138j269K476Q21k718n67K533J21k204
736a135O11K071j069j959J112J384j351q25J786P37j690n89J275M7j226K25J196
753F00n3o94K11L74n40m17N07M01m55l43M88M10o25o06P02Q73o12r31O29Q75r17
774a23r34J048R32j004n82J234K64j526j72J510p0j376M77J460o75j445N76J010
792F04p25o64R20N79p74k80N98o6n60K21M79k13k72J95lj92J44J15k13J19L98
813D10k86n71K39M97k83l68M07K90m13k15L25N0k05K01K40k70k43K14R2k22j2
$$ plain form
834 -123 111 81 -59 -38 -24 -111 -24 154 81 -67 -30 0 -81 -89 -17 -31 31 119 -8 -155 55 229 66 -19 171 26
860 26 -330 -148 182 -57 -283 231 481 -223 -560 128 429 -198 -305 365 351 -336 -304 206 66 -267 115
881 115 431 -84 -383 135 358 -176 -304 242 311 -280 -434 21 157 -100 -49 248 182 -165 -157 93 41 -156
903 -156 19 331 107 -321 -198 207 111 -231 -36 334 112 -284 -94 191 -51 -242 106 207 -199 -286 157
924 157 269 -144 -156 286 249 -191 -231 83 123 -83 -34 96 0 -100 3 12 -106 -35 150 96 -125 -103 66 32
948 32 -120 -52 106 46 -55 25 116 5 -90 67 123 -86 -205 23 130 -82 -169 80 186 -83 -164 67 95 -143
972 -143 -98 179 113 -180 -104 174 71 -233 -98 254 187 -126 -112 141 95 -120 -153 -19 44 11 -12 -31 -7 34 41
997 41 -47 -28 71 66 -10 -11 7 -76 -35 126 95 -125 -74 175 95 -216 -140 208 152 -173 -123 147 13 -213 -57 174
$$ packed form
834a23K34l0j40K1J4q7Q7J78p3j48L7L0q1qP2j4O2Q8j27j47K10J74j63q5J90j45
860B6l56J82L30k39k26N14K50p04l37O88L01o27j07O70j4o87L2N10j40l33L82
881A15L16n15k99N18K23n34j28N46O9n91j54M55J36k57N1K97o6l47QK50n2j97
903a56J75L12k24m28J23M05r6l42J95L70k22l96J90K85k42j91L48J01m06q7M43
924A57J12m13j2M42l7m40m0L14M0k06M9J30r6j00J03Rj18P1J85n4k21K2J69l4
948C2j52O8J58o0j01Q0R1j11r5J57N6k09j19K28J07k12q7K49J06k69q1K31K8k38
972a43M5K77o6k93P6K78j03l04J35L52o7l13J4K53m6k15l3J34O3l3k3j9K4M1P
997D1q8J9R9np6jJ8q3M1J61l1k20N1K49q0l11P6L48n6l25N0K70j34k26J56K31
$$ plain form
1023 174 59 -62 131 192 -87 -200 26 121 -43 -73 115 149 -27 -132 -94 -32 20 74 79 24 9 8 -74 -177 -100
1048 -100 116 198 39 -47 59 43 -134 -127 150 190 -22 -27 80 -143 -341 -23 305 52 -158 180 240 -306 -420
1071 -420 154 286 -141 -26 378 68 -467 -163 287 7 -180 302 417 -183 -328 35 -4 -251 50 337
1091 337 -20 -211 120 90 -322 -156 373 206 -199 6 193 -140 -259 124 136 -148 68 333 -47 -342 46
1112 46 269 -135 -225 192 201 -181 -151 64 -71 -141 131 213 -36 -23 155 38 -197 -123 70 87 78 48 -48 -10 35
1137 35 -142 -205 121 263 -31 -67 196 -55 -431 -40 379 -73 -289 386 439 -456 -473 453 348 -467 -63 684
1159 684 0 -744 39 516 -378 -451 662 532 -689 -403 644 63 -833 97 950 -77 -752 239 552
1178 552 -571 -548 673 561 -506 -228 597 -16 -786 -78 636 7 -447 221 476 -308 -582 146 425
$$ packed form
1023A74j15j21J93O1k79j13K26R5j64l0J88L4j76j05L8O2N2N4Nn5j5jq2j03P7
1048a00K16Q2j59q6J06j6j77PK77M0k12nJ07k23j98L18L28k53k10L38O0n46j14
1071d20N74J32m27J15M04l10n35L04M50k80j87M82J15o00j45L63l9k47L01K87
1091C37l57j91L31l0m12J66N29j67m05K05J87l33j19L83J2k84K16K65l80k95L88
1112D6K23m04r0M17Rl82L0K15j35p0K72Q2k49J3J78j17k35P4J93J7rl0r6L8M5
1137C5j77o3L26J42k94l6K63k51l76L91M19m52k16O75N3q95j7R26j05q15M04P47
1159F84o84p44P83M77q94p3J113j30j221K86J047n81q96R30Q53j027o75R91L13
1178E52j123K3J221j12j067K78Q25o13p70P08P14o29m54O68K55p84k74P28K79
$$ plain form
1197 425 -128 -277 314 450 -241 -539 66 388 -129 -342 309 474 -314 -481 297 292 -486 -195 735 184 -826
1218 -826 -159 740 -163 -890 392 1062 -293 -801 466 531 -836 -521 927 439 -797 19 919 -345
1236 -345 -1122 349 968 -470 -709 743 630 -891 -597 783 324 -724 8 825 -123 -812 149 619
1254 619 -278 -444 498 512 -433 -485 242 204 -355 -168 394 233 -247 -169 205 87 -280 -109 323 158 -348
1275 -348 -162 363 140 -394 -35 528 46 -514 26 458 -211 -504 335 499 -389 -368 535 252 -686 -220
1295 -220 659 44 -651 145 697 -219 -588 345 478 -503 -411 542 282 -565 -125 600 39 -542 62 451
1315 451 -195 -414 198 270 -294 -203 353 191 -277 -76 290 29 -291 -67 203 79 -127 -35 126 50 -118
1336 -118 -88 92 53 -127 -52 145 -6 -227 15 255 -34 -260 114 317 -157 -320 176 272 -211 -194 304 142
$$ packed form
1197D25n53j49N91J36o91k98O05L22n17k13O51J65p88j67P78np78K91R30n51j010
1218h26O67Q99r03p27J282O70j355n08J267O5j367L15J448m88j236Q16R00j264
1236c45p77J471O19j438k39J452j13j521K94J380m59j048P32Q17r48o89R61M70
1254F19q97j66R42J4r45n2P27l8n59J87N62j61m80P8L74j18l67J71M32j65n06
1275c48J86N25k23n34L59N63m82n60N40M32o69k93Q39J64q88K1R03k83r38M66
1295b20Q79o15o95P96N52r16l69R33J33r81R2R53k60q47M40P25n61n81O04L89
1315D51o46k19O12P2n64R1N56j62m68K01L66k61l20K24K70j24k06R2J61p6j68
1336a18L0J80l9j80P5J97j51k21K42K40k89k26L74K03m74j63M96R6m83J7M98j62
$$ plain form
1358 142 -318 -78 308 -36 -350 90 321 -162 -284 197 244 -216 -170 236 90 -252 -53 216 -27 -186 111
1379 111 235 -63 -164 100 122 -117 -158 45 82 -45 -63 39 60 -11 -42 6 39 -30 -64 35 71 -71 -97 111 132
1404 132 -116 -103 141 99 -174 -116 167 56 -193 -21 186 -23 -185 44 163 -107 -175 123 150 -116 -85 172
1426 172 96 -148 -57 133 0 -160 11 138 -25 -119 64 127 -68 -128 31 87 -79 -114 47 96 -25 -25 91
1449 91 75 -73 -45 59 18 -109 -18 142 34 -135 -16 146 0 -167 -20 145 -14 -133 30 140 -46 -83
1471 -83 72 87 -100 -95 99 80 -99 -33 137 89 -100 -65 93 28 -106 -26 80 -10 -80 1 88 -25 -89 37 86
1496 86 -49 -99 45 94 -47 -77 57 83 -40 -57 54 48 -70 -17 96 12 -104 6 96 -22 -106 25 97 -33
1520 -33 -99 41 106 -32 -67 74 81 -68 -47 75 40 -86 -37 90 21 -92 -13 99 3 -92 -2 77 -9 -92 18 76
$$ packed form
1358A42m60K40L86l44l14M40K31m83j22M81M7m60M6M06j46l42J99K69k43j59K97
1379A11J24k98j01K64K2k39m1K03L7j27j8J02K1p1l1M8L3o9l4R9L6j42k6K08K1
1404A32k48J3K44m2k73N8K83j11k49J72K07k09j62K29J19k70o8K98K7k66L1K57
1426A72p6k44R1J90j33j60J71J27j63r4J83O3j95o0J59N6j66l5J61M9j21%J16
1449I1j6j48K8J04m1j27R1J60j08j69J19J62j46j67J47J65j59j19J63J10j86l7
1471h3J55J5j87NJ94j9j79O6J70m8j89L5J58o5j34Q0J06r0p0Q1Q7j13o4J26M9
1496H6j35n0J44M9j41l0J34K6j23j7J11oj18N3J13q4j16J10R0j18q4J31P2j30
1520c3o6J40O5j38l5J41Pj49K1J22l5j26M9J27o9j13P9J12r6r5R0P9q6q3J10N8
$$ plain form
1546 76 -29 -81 60 80 -51 -88 47 76 -67 -60 88 66 -77 -45 63 26 -75 -17 78 -5 -76 24 76 -40 -94
1571 -94 52 88 -63 -81 70 79 -59 -47 62 38 -66 -9 75 -13 -83 -1 73 -27 -60 45 65 -55 -74 31 34 -43
1597 -43 -20 52 8 -59 0 41 -17 -33 35 57 -20 -39 15 26 -42 -27 2 11 6 10 9 -19 -20 13 9 -15 -2 28 9 -20 -17 3 8 6 9
1632 9 3 5 18 -4 -31 -9 7 19 1 -1 -5 8 2 -14 -5 27 22 -14 5 11 -19 -22 28 18 -16 -5 41 9 -63 -34 58 -11 -32 30 46
1667 46 -51 -53 39 27 -66 -15 90 13 -78 -17 57 -14 -71 43 66 -41 -45 43 19 -76 -6 80 6 -72 1 50 -33 -63 32 54
1697 54 -9 -21 20 -6 -48 -21 30 10 -25 2 33 8 -29 -25 15 31 4 -12 26 14 -31 -32 25 22 -23 11 41 -11 -78 8 48 -19
1729 -19 -54 55 60 -38 -61 48 21 -61 -5 76 0 -61 17 32 -49 -42 68 57 -49 -20 52 2 -68 -3 49 -2 -21 28 20 -50
1759 -50 -22 7 -18 -31 24 16 -8 -31 -2 -23 -17 8 27 -10 -3 7 -11 -30 7 19 -12 -7 19 -2 -53 -17 20 -7 -26 36 35 -16 -23
$$ packed form
1546G6j05n2J41K0j31l7J35K9j43PJ48k2j43L2J08l7j01N8R5q3p1J00N2j16n4
1571i4J46L6j51j8J51Rj38J2J09k4j04N7Q4q8p0Q2P4j00l3J05K0j20j9J05Lp7
1597d3K3P2m4o7N9M1n8j6O8K2p7j9N4J1o8J5K9RnMjk8jL3mk4J3L0j9k9LK0NkL
1632IoKJ3k2k7K2J6J2j8kmJ3oj6RL2nl6J9Ol0lN0j0l4J1M6l2p2K9R2o9k1O2J6
1667D6r7kR2j2r3N1J05p7r1O1P4p1n7J14K3j07mQ8k4r5P0Q6p4p8P3M9q3l0R5K2
1697E4o3j2M1k6m2K7N1k0l5K7L1k5l7MM0J6k7j6L8j2m5jN7lm5L4L0n2o7Q6M0o7
1729a9l5J09Nr8k3J09k7q2N6Q1p6o1P8J5q1PJ10j1j06K9P2n0p0O5N2n1j9M9qp0
1759e0K8K9k5j3N5qk4k3K9k1OK5J9l7PJ0j8j9L7J2l1NK6k1n1L6L7k7j9O2jn1p
$$ plain form
1792 -23 12 -6 -12 2 24 -1 -6 9 -8 -21 -19 27 3 6 10 -16 -20 -9 8 -20 4 34 9 -40 -13 19 -30 -26 47 25 -36 -10 44 -6
1826 -6 -54 23 62 -9 -45 37 34 -55 -23 46 -2 -63 15 60 -35 -63 47 38 -44 -26 47 42 -32 -6 40 -4 -38 17 31 -8 -25 29
1858 29 8 -21 -12 23 6 -17 -8 15 1 -22 -20 2 10 3 -7 16 26 -8 -26 26 26 -20 -17 37 3 -47 -8 28 0 -45 0 39 -25 -38
1892 -38 33 34 -38 -12 60 8 -58 -3 43 -7 -28 36 38 -23 -33 20 22 -32 -14 44 -10 -42 -1 24 -17 -19 13 14 -14 -28 -1 6 -12
1925 -12 -4 16 18 4 -8 2 1 -8 -10 2 7 -7 -26 5 10 -12 -18 16 17 -24 -15 18 -6 -33 3 30 -6 -32 28 17 -18 -33 14 8 -35 -13
1961 -13 16 4 -15 3 5 -17 -39 15 9 -18 -14 30 3 -9 -19 -6 -15 -23 0 0 0 0 -4 6 -1 6 -7 -6 -2 -11 -14 4 -2 -11 0 2 -4 -22 -11 16
2001 16 -15 -14 7 27 -13 -15 26 30 -17 -22 16 -1 -36 -13 20 1 -21 -4 11 -12 -21 -1 9 -29 -22 8 4 -22 -9 14 4 -16 -13 8
2035 8 15 -13 6 13 5 -6 -13 6 -12 -19 5 10 -9 -16 3 13 -10 -19 2 12 -9 -26 16 7 -24 -14 14 -11 -28 -10 12 -19 -32 -1 22
$$ packed form
1792b3L5j8oJ4K2k5nJ5j7j3KM6k4LMk6mJ1J7k8K4L0k5m9K7L2m9MP3k2o1K6N4n0
1826fm8P7L9p1l6Q2lq9L2O9m8o1P8M5r5k8J10rq2J8P3np4K6M6m4l4N5J4l9j7N4
1858B9k1k9RL5j7k3RK3j4k3KK2Qpj0K3J0l4j8N2%m6LN4l4n0L9L6k8m5M5L9o4j3
1892c8P1Jp2K6P2n2o6N5M6n0k1O4Ko1j0N3Kn4J8N8n4l2M1K5m1kL2Jk8j4K7Pj8
1925a2QK0Kj4j2J0jrkJ2Nj4j9L1Nk2oL4Jm1RL3k4k7L6K7l6k6O0j1l5j5M7om3K2
1961a3K9j2j9J8Kk2k2N4ok7MM4k7j2j0J3rqK3%%%mJ0pPj3JMrlJ8orJ1Koj8J1K7
2001A6l1JK1K0m0kM1Mm7nL8j7l5K3L3j9k2J7J5k3rK0J0l8PL0mk6J3K3j0k0LK1
2035HPk8J9Pqj1pJ9j8pK4Nj9pJ9J0k3rK1J0k1j7M2rl1J0K8k5j7J8K2l1j3L1K3
$$ plain form
2070 22 -11 -15 -2 18 -13 -22 0 5 -25 -25 11 8 -17 -4 20 -3 -20 -4 11 -9 -26 -9 22 -1 -26 -8 13 -3 -40 8 8 -2 -10 13
2104 13 13 -22 2 16 -15 -22 -12 21 0 -26 -7 23 -7 -20 -1 23 -21 -26 9 9 -20 -25 20 11 -34 -20 4 18 -15 -11 19 -5 -29 -1
2138 -1 18 -12 -25 -7 15 -2 -22 7 17 -4 -15 7 15 -15 -10 9 2 -19 -7 10 3 -31 3 26 -7 -36 5 16 -6 -25 -3 28 -16
2171 -16 -12 8 16 -29 -24 27 13 -27 1 33 10 -31 -12 27 -11 -19 7 20 -20 -6 13 5 -22 1 18 8 -31 -10 33 1 -27 0 18
2204 18 -3 -18 -9 -6 -16 -17 8 14 -11 -3 10 1 -17 -10 18 9 -21 3 21 -1 -28 -15 24 0 -16 4 24 -14 -19 12 5 -22 -11 30 12
2239 12 -34 -8 7 -4 -27 6 25 -10 -8 14 12 -24 -18 27 13 -26 -5 13 -17 -29 7 8 -14 -16 21 -7 -25 -3 19 0 -3 16 12 -14
2273 -14 -14 17 -5 -11 11 18 -4 -13 -3 -9 -12 6 20 -8 -10 0 -21 -24 0 9 -13 -3 5 -12 -21 -10 0 -15 1 21 -1 -15 2 12 -24 -30
2309 -30 21 26 -12 -18 16 -18 -31 2 22 -15 -16 21 19 -41 -36 38 8 -30 11 44 -6 -48 13 12 -41 -14 46 20 -36 3 28 -24 -36
$$ packed form
2070B2l3mJ3K0l1rK2Nl0%L6lk5J3K4k3j7J6J5k0j7J7L1k3k5J8K1j6l7M8%j0qK3
2104A3%l5K4J4l1pJ0L3k1k6J9L0l0j3J9K4m4nL5%k9nM5rm5J4K4J4l3ML0k4k4K8
2138aJ9l0j3J8K2j7k0K9J0k1j1K2Ql0NJ9pk1J2J7pl4L4K3l3k9M1J1k2j9K2L1m4
2171a6MK0Qm5NN1j4m0K8L2k3m1J9L9l8qK6J3m0J4J9qk7K3J7j0l9K1M3l2k8K7J8
2204A8k1j5RLj0jK5Ok5QJ3rj8PK8rl0K4J8k2k7J3L9k4j6K0K0l8nL1pk7J1M1j8
2239A2m6K6J5j1k3L3J9l5KK2kl6OM5j4l9K1J8l0j2L6Jk2kL7k8j8K2K2j9lJ9mk6
2273a4%L1k2oK2Pk2rJ0olJ8J4k8kJ0k1lK4Rk2J0Qj7rJ1J0j5J6K0k2j4J7J0l6o
2309c0N1Nl8oL4l4j3L3K0l7jL7ko0NP4l0l8M1L3n0m2O1jn3K7O0k6n6L9K5n2j2
$$ plain form
2342 -36 17 41 -24 -18 35 0 -36 -8 26 1 -17 17 21 -21 -12 2 10 5 2 7 -1 -19 -4 -7 -9 -1 0 4 0 -7 -14 -16 -3 1 -9 19 29 0 -29
2381 -29 8 7 -19 -13 37 16 -18 -1 22 -12 -35 18 35 -22 -25 11 0 -46 -15 34 -16 -34 33 34 -39 -21 28 16 -28 1 39 -6
2413 -6 -37 4 13 -17 -13 31 9 -22 0 20 -10 -22 9 16 -7 -7 3 -1 -25 16 -1 -18 -2 30 9 -29 9 -4 -17 -21 5 3 -17 -4
2447 -4 4 -18 -9 16 11 -18 0 21 -10 -19 10 18 -4 -4 19 -2 -26 -2 19 -11 -6 14 24 -11 -6 24 -6 -25 13 27 -10 -19 20 17 -19 -3
2483 -3 25 4 -17 10 20 -8 -11 15 5 -27 1 9 -16 -17 8 21 -9 1 19 3 -16 5 22 -11 -11 4 7 -3 -12 7 6 3 3 9 -3 0
2519 0 2 11 -9 0 9 4 -1 2 -9 5 5 -4 -3 -4 10 9 -11 10 -11 -9 -15 -1 -2 -8 -1 7 -11 -16 8 10 -11 -5 13 0 -11 -11 15 -1 -10 2 7 -9 -14
2562 -14 10 4 -13 -7 -6 9 -12 7 21 -3 -23 -8 4 -1 -13 1 6 2 -15 9 5 -13 -7 -2 6 -13 0 2 -8 -17 -4 -10 0 -1 8 17 -6 -17
2600 -17 -5 8 10 -5 -2 11 5 0 2 10 -5 -6 5 3 -2 -9 8 -1 -7 -9 15 4 0 1 9 -4 -16 1 5 -4 -14 3 9 -20 -10 8 4 -15 -15 6 2
$$ packed form
2342c6N3K4o5ON3l5l6K8L4k5j8L4Mm2RJ4QnlNqj8J5lkQJMmppkJ3Mj0K8J0k9k9
2381b9L7jk6ON0k1l4J7K3l4k3N3J7n7lL6j1m6L1M9n0j8O7Jp3J8M9j2m4K9L8m5
2413fl1M1Rl0MM4k2l1K2K0l0j2L1Pk3%J0mk4M1j7j7J6L2k1l8L8j3j3mK6kk0J3
2447dQk2RK5nk9J8K1l1rK9Qk2%K3k1k4K4K1l0NK0J0l5NL0l0j9L8J4l7rL9ll6J6
2483cK8k1k1K7J0k8lK6j0l2K8Qk5jK5J3l0J0J8j6j9K1J7l3%J5Lj0rJ9jl%Oj2L
2519@KRk0RRnnLj1J4%rJjJ4jk0K1k1KoJ4joPQj8nK4Kk1OJ8j3j1%K6j6rJ2Nj6n
2562a4K4oj7OJJ5k1J9J4k4k0J5J2nj2J4Nmj7K4mj8ONQj9J3Kj0rJ3oJ0jRRk3j1
2600a7J2J3Kj5LJ3onKQj5jJ1knpJ7rokK4j1mJQj3j2J7Mrj0J7Ok9J0J8mj9%K1m
$$ plain form
2641 2 -12 -10 20 3 -11 3 12 0 -16 2 11 -18 -9 8 17 -10 -3 16 -4 -8 -16 7 -2 -8 2 7 -2 -8 -7 -2 -7 -2 -4 8 -4 -12 5 1 2 -18 -1
2682 -1 -4 -14 -14 -4 -1 -3 -17 -9 -6 -19 -6 8 -3 -5 -4 -2 3 0 -4 -2 -9 -4 -2 7 5 -11 -12 -4 -5 -8 2 0 -13 -4 -16 -5 -12 -12 -6 1 4 -5 -12 1 0 -7 2 -1
2730 -1 -15 -3 -14 -9 -11 -12 2 -7 -14 -23 1 -3 -15 -5 -7 -11 -9 -5 2 -11 -17 5 -5 -17 -6 13 7 -2 -1 4 8 -18 -10 0 1 -4 -17 -13 -18 -18 -4 4 -18
2773 -18 -17 -2 4 -14 -25 9 12 -10 -8 0 -1 -20 4 12 -5 -11 6 7 0 -8 8 3 -12 -3 5 -1 -6 5 -6 2 -10 -1 -1 8 -10 -1 8 -4 -13 3 -5 -2 -21
2816 -21 -9 3 -15 -7 -5 15 -15 -8 -6 0 -13 -5 5 -2 -20 -3 10 -5 -9 13 7 5 4 9 -8 -13 0 -6 -14 -4 4 -13 3 -6 -1 6 -2 -5 -7 0 -12 3
2858 3 3 -5 -13 -4 -5 -9 -6 -1 -2 -10 -11 3 -7 -14 -4 5 -3 -13 -7 -2 -6 0 -2 7 -1 -6 -2 -1 -8 8 2 4 3 -6 6 -2 0 -17 -7 7 -3 5 5 -2 -7 4 17 6
2906 6 12 11 6 -5 -6 -7 2 -11 4 4 0 -12 -6 -1 1 -9 -8 -2 -21 -15 0 -6 -3 -7 -8 -8 9 6 -6 -4 -6 3 -4 -13 2 13 -13 -2 4 5 -1 -7 -4 6 -8 5
2952 5 -4 -4 -3 3 4 -8 -7 -12 -5 -5 -5 -2 -6 -3 1 0 12 2 -4 -3 3 0 -5 10 -5 5 -4 3 1 6 0 -9 3 -9 6 1 -11 3 -10 -12 -3 -3 -7 3 -7 -9 1
$$ packed form
2641Bj4KL0j7j4J4Rj2j6J8Rk9RJ7Rk7PJ9k0mqK3roJ0NroJNnNkJ2j2qJ7mJk0J7
2682alj0%J0Lkj4QLj3J3J4j1kJKNlmKpNKRkj6jQjlJ0kj3Rj2J1p%OPLrpJ3jpRl
2730aj4J2j1NkjJ4rprK4mj2J0kmKMPj3oK2j0j2J1J9orJNMk6QJ0Jnj3Mn%J4Qk2
2773a8JJ5Oj8j1L4Lk2KQjj9K4Qj7oJ7JpqJ6nj5RQonJ1j1Qj2R%Rj8RRj2rJ6qLj9
2816b1J2J2j8QKK0l0PKOj3QJ0pj8J7J3j5mK2okjNj7nJ3oqJ0Qj7J6rNPqlkPj2J5
2858C%qqRjmLNjqjJ4j0pJ0Rqj0ONmOkRqnMJpJ6oKjrJ2qKj7J0J4j0Q%pnJ1J3j1
2906FOjnj1jjRj3J5%mj2ONKj0JOj9OJ5oLmj%J7lj2KkRprJ5J1k6J1OJooLJ0j4J3
2952Er%JOJj2JnP%%LmLMjJ2j0oJOlnJ5j5J0rPkNorJ2j2J5nj2J4j3kR%mJ0j0kJ0
$$ plain form
2999 1 -1 2 -3 0 -12 -5 -7 -15 -6 -7 -6 -9 -2 -1 8 -5 -2 -3 -10 4 -3 -2 -3 -3 1 3 16 3 -4 -4 -7 3 -1 6 0 -12 0 -2 -5 -1 6 -2 -4 -1 4 -8 1 -9 11 1
3049 1 0 11 -6 -8 -2 -1 -5 0 -4 0 7 -8 -2 -3 -6 -13 1 0 -7 5 -12 -3 -4 -11 -4 1 4 4 -8 -3 5 0 3 -10 1 2 6 0 -7 -1 2 -4 -19 3 9 8 -7 -3 -5
3098 -5 -4 6 0 4 -9 2 -6 -14 -3 -1 -8 -9 -1 -2 -6 -11 6 -15 -11 -8 4 -7 -1 -1 5 -7 6 7 -3 1 -2 5 7 -7 3 -4 -6 1 -4 -12 -1 -1 0 2 -3 -6 -3
3145 -3 8 -7 -2 -1 0 -9 -11 -11 -1 -9 -11 6 -3 -3 -7 5 4 9 -3 4 9 1 -11 -7 6 -5 -1 -1 7 3 -5 0 -1 8 0 7 -2 14 -8 2 0 -9 3 -1 3 2 8 8
3193 8 4 3 9 2 -8 -13 -2 -20 -9 -3 3 3 -6 2 3 3 10 5 7 0 1 2 7 0 -5 11 9 2 -4 -6 -1 2 6 -2 1 1 -6 4 7 5 6 3 6 -4 13 9 0 4 1 1 2 -2 7
3246 7 3 -1 -3 -2 0 -6 -3 -1 1 0 -2 4 4 5 -5 -12 4 0 -9 6 0 -10 -4 -7 -3 8 2 17 8 3 4 -2 11 7 2 7 3 -1 -9 -2 3 6 6 1 -17 6 -12 -8 -7 -3 2
3297 2 -4 -5 0 -2 -5 -12 -1 0 -4 -8 0 2 -3 -9 2 -7 -12 3 0 7 -3 3 0 0 -3 0 -4 5 -6 4 -5 -4 -7 -5 -8 3 -10 1 -1 5 -7 -6 -6 -2 -6 -5 -9 2 -9
3346 -9 -17 -9 -6 0 -8 -5 3 3 -14 1 -1 5 -6 -3 -1 6 -4 -2 -1 5 2 6 5 2 -10 -4 2 -5 2 10 -6 3 -9 -11 -6 -5 3 1 -9 -2 -1 7 -17 -6 -8 -10 -6 -4 -1 -4 -9
$$ packed form
2999AkLnLj2PkqRjJlPJRj3LjpJ4pJj%MKJ3j3p%lJ0mPoj2J2klMPqkLNj2Rj0K0j0
3049AjJ1j7kOJmNmMPj5OjlpJ4jpJ2j7RjpPNL%j2NQnLj3J1JMopOLoj5K2Ojj5Mk
3098eJJ0oMj3J1qqJ1KpjQjmnJ7k1MLJ2j1O%Oj2J3Jj0MlPKj4J0pkPnqJ1%JKnlL
3145cJ1j5NJJrk%J0qkJ7r%mJ2jNj2PNqj2MJ3j1M%QmqNjRqPrJ6k2J0krJ2mMjO%
3193HmjOpj0nJ1j8J1OO%rQJ%PnKpJJNpnJ6kpokNLMqL%pJ0LkJlLj0J7mrMl%JmR
3246GmmkJKoLKKjkO%Jj0pJ6mrJ5oj0OlMJ1oJ5rnJoJ3mnNmmqPNL%nj8K3j8MJMN
3297BojNklpJ1JmmQKnoJ1rnJ5lPj0Ol%lLmRj1J0rJlKlJ1j3J1kOj2J%MmJmJ1j1
3346iqQLOqLQ%j7J5kOj1LKPj0KJOlMjlj2OOpPQj6Rj2kNJQkj0PJQk4J1kkMKLln
$$ plain form
3397 -9 -2 8 -4 -4 2 3 -5 -7 4 8 -1 -13 0 -3 -6 6 3 10 10 6 12 8 1 4 2 2 -1 -2 -6 -13 -11 -3 -3 -7 0 1 -13 -20 -2 -4 -3 -18 -10 -5 -15 -16 2 -4 -9 -2
3447 -2 0 -8 2 -3 4 1 -1 4 7 -7 -14 -4 -6 -5 2 -5 2 -11 0 2 -4 5 -5 -8 5 -10 2 -12 0 -12 -15 2 -13 -14 -7 -1 -2 -13 -9 -6 -8 -14 -1 -5 -13
3492 -13 -13 -6 -2 -5 -6 6 -5 -3 6 5 -3 -7 10 1 -14 5 1 -8 -9 1 7 -7 -4 1 -6 -7 -14 -11 -9 -10 -2 -1 -6 -5 7 -6 2 3 -1 2 -2 -3 -3 -13 -4 -1 -4 -9 4
3541 4 -10 -3 0 10 -11 3 -1 -1 -2 2 -4 -2 3 7 -9 -7 13 19 -5 -10 15 8 -3 9 5 0 -4 2 8 -2 -11 -1 2 -15 -5 2 -3 -7 -7 8 4 0 -9 -15 -18 -7
3587 -7 -7 -5 -17 -6 -4 -7 -1 4 4 -8 -4 0 -7 -2 3 -11 -1 4 0 -6 6 5 -7 5 8 -1 -5 3 8 7 -2 -5 -4 -11 -22 -13 -1 -11 -2 2 2 5 -6 1 -5 -13 -12 0
3635 0 -6 -12 2 7 -19 13 2 -13 0 -5 -6 -3 -9 7 2 -5 -4 -1 8 -9 -6 -1 2 10 -1 -14 -9 -1 -3 -3 3 -14 -9 -6 -4 -9 -6 4 -6 5 0 -5 -6 -9 -2 0 -11
3682 -11 -5 -5 0 -1 -6 -9 -6 7 -3 -1 -5 -4 -7 -8 -2 -8 -1 3 2 -1 3 -4 -1 7 3 -1 1 0 3 -5 -2 0 -12 -12 1 -9 0 -10 -1 -2 -4 -9 -3 -10 -16 4 -3 -13 -4 2 -5 0
3734 0 2 -3 5 -8 -3 -1 6 5 -1 4 3 -2 -11 -6 0 2 5 -1 5 1 1 19 -3 -1 0 4 0 -9 -4 -3 -6 3 3 -2 -9 5 -2 3 -7 -1 2 -10 -14 -2 -6 -8 -4 -12 -9 -4 7 -4
$$ packed form
3397iPJ0j2%OJqkJ1Mrj2J3llJ2lP%mOmpLk%ljmpKQ%mPJj4pJ8kJj5QNj0jJ8onP
3447bKqJ0nPlkNLj4pJ0kJPpPj3J1KoRj0lJ3j5J2j4J2j2lJ7j5jPOjj1MLkoJ3mq
3492a3%PMljJ2j1KRjqmJ7rj5J9mrjJ0Oj4LNpjpLKjQJnJJ2j3QJmLmj%j0RLlnJ3
3541Dj4PLJ0k1J4m%jMoKNMj6KK0Ok4nK5pj1J2mnmOOj0rJ0Lj7J0Pnm%J5mmrolJ1
3587g%Kj2J1KlON%j2MMpNNj4J0NmoJ2jj2J2LrmQNjrlJpj1RJ2j0RM%Lj1PoqJJ2
3635@ooJ4Nk6L2j1j5J3njLoJ6npJLRj7LNLQj1j3NQk%Oj7NLKnLJ0j0J1nnjlPKj1
3682a1O%NjnlLJ3j0KmJljOoPMjlMpLQmmKjLqLKj2%J3j0Rj0RjknOpoK0pj0ROpN
3734@KnQj3NKPjoNjnrNOKLoOm%J8k2KJMmrNJlR%npJ4pNj0OLj2mJ2mkMqLNJ1j1
$$ plain form
3786 -4 5 -14 3 -4 4 -4 -6 -2 0 1 -10 4 1 -14 -2 -3 -3 7 -3 -8 6 -5 -10 5 -10 -14 -10 -12 -11 -10 -6 -14 -13 0 -13 -9 -2 -11 -4 -4 -12 -17 -3 -4 7
3831 7 -16 -7 3 0 -3 7 9 -3 -1 -2 -2 6 6 -4 0 2 13 3 0 1 4 -6 5 3 -2 -10 -8 -4 0 -5 1 6 -14 -8 -7 8 -3 0 2 0 -7 -12 8 -11 -1 6
3877 6 2 0 3 11 -4 5 -8 0 5 1 2 4 3 0 4 4 4 4 10 0 1 8 2 -5 -3 -11 0 -1 -6 1 -11 -15 -6 -7 -12 -4 -4 1 -12 -3 -10 -12 -11 -15 -1 -7 -8 -4 1 -4 -16 -5
3929 -5 5 -1 -3 1 -2 -4 -7 -5 6 -9 -3 -5 -9 -3 -9 8 -6 -6 1 -2 0 -4 -3 -14 -5 -7 -1 3 -11 1 7 -16 -2 -7 7 -4 -11 0 -3 -6 -2 -5 -5 -11 -11 -3 -9 -13
3977 -13 7 1 -7 -1 12 -1 3 4 -12 -3 1 6 3 2 -7 -8 -3 -13 2 -5 -4 -8 -15 2 -3 2 -12 1 7 4 -10 -2 -4 -15 -10 0 -9 -12 -13 -12 -5 2 -5 -6 4 -5 -3
4024 -3 6 7 -10 2 -3 2 -4 -9 -12 -2 -5 -7 3 -11 -4 0 -6 4 -1 -9 -6 -7 -13 -12 -4 -15 -3 -7 -14 -8 -6 -4 -7 -12 -20 -2 -9 -6 -5 -4 -10 -10 -6 -7 -4 3 4 -11 6 -5
4074 -5 -10 2 -7 4 -1 -17 9 9 4 9 -13 4 7 -6 5 -6 -8 3 -10 1 -4 8 -2 -3 -9 -10 4 -3 -10 8 -3 -12 -5 -8 -11 3 -15 -2 -3 -2 0
4115 0 -3 3 6 -3 3 13 6 6 2 2 -5 -2 -1 -2 -3 1 -6 -12 -11 2 4 -1 3 1 5 -7 -13 7 -1 1 -7 -5 -7 -2 0 -11 -13 8 -6 -8 1 -5 -8 -8 0 -5 -4 -9 -1 -1 5 -2 3 -11
$$ packed form
3786dRj9J7pQqkMKJj1J4lj5J2j%J0j0nJ4j1nJ5j5mMkJJMqJJ3j3MPrP%qnJ4jJ1
3831Gk3RJ0llJ0Kj2Kj%Q%j0MKJ1j0lJLj0J1knqKMMnONk0OJJ5j1LKkpnK0j9J0P
3877FmkLQj5Rj3QNmJKjlM%%%Oj0JPopKqJ1jnPj2mRjnQ%Nj3RpkJmJ4ojMNnj2J1
3929eJ0okMlklKJ1j5OkmOoJ7j4%PlKmJj1RkOMj4J2Ok3J4nJ4j1pJ1llMl%o%Qom
3977a3K0oqOJ3j3MJj6RMNljrjNj0J5pJmpJ7nNj4J3Olj4Qkj1NJ0rljJPPpjJ0rK
4024cRJj7J2nNonlJ0lkJ0j4PMoJ0nqLjoJQj1J2mpOKKlnqJ8pLJJo%MjLPJj5J7j1
4074enJ2rJ1nj6K6%nNk2J7Lj3J1j1kJ1j3J1nJ2j0jojJ4ppJ8j1rPllJ4j8J3jJK
4115@lOLrOJ0p%m%pLJjjMpoJJ3KnMkMj2oK0qKqKkNKj1kK1j4kRol%QnJnQ%OpNj4
$$ plain form
4169 -11 6 -8 3 4 -4 -6 8 -1 -3 -3 1 2 -8 -2 -9 0 3 -2 1 1 6 5 -4 -13 -8 -5 -13 -4 0 3 2 2 -1 0 -6 -10 -3 -2 0 2 -5 -11 -2 -8 -6 1 -6 -13 2 -3 -3 -3 -8 -4
4223 -4 0 -5 6 5 2 1 4 -13 -5 8 -7 -13 -6 0 -3 -6 -8 -3 -6 -8 -11 -1 -6 -4 -2 -8 1 -3 -1 -4 6 -5 -13 -15 -4 -10 -10 -14 -4 -8 -1 0 -8 9 0 0 -9 -3 -2 2 3
4274 3 -10 2 -2 1 13 -4 -14 6 10 -3 -3 5 6 2 -6 -9 -11 -9 -7 3 3 3 -10 3 8 -5 -6 -9 10 8 5 1 -2 -3 -3 -1 -2 12 9 8 2 2 1 -2 -5 0 -2 6
4322 6 -7 7 1 4 5 -12 4 5 -5 3 2 5 0 3 -3 0 0 -1 -8 1 -2 -14 -13 -5 -4 -3 -14 -16 -11 -4 -8 -1 1 1 -4 12 11 13 4 11 29 7 -1 6 9 9 5 6 -1 -2 0
4373 0 -1 -2 4 3 -1 1 1 -5 0 0 -4 -9 -4 -14 -17 -5 -2 -9 -1 12 -1 2 9 -1 -8 -4 6 -1 -2 -10 5 15 -5 3 0 6 -3 6 7 -3 4 -3 -6 -5 -8 -8 -7 7 -11
4422 -11 -6 0 -15 -5 -3 -2 1 -5 -5 -4 -7 1 -5 -2 -3 -9 2 3 -1 -2 0 -2 -2 2 -2 -3 -8 -3 -2 2 -1 4 4 -4 5 5 3 -2 0 -1 9 8 -1 2 -6 -6 -2 -9 6 -6 3 -6 -5 -1
4476 -1 -2 -8 -3 -17 -6 -2 -12 -11 -5 -5 4 -5 -5 -6 1 -5 1 -7 2 -11 0 -1 4 -1 -1 2 -6 -1 2 2 -7 -12 8 -7 -3 8 -10 0 -9 -8 -2 -2 -1 -2 1 2 -6 -9 -6 -4 4
4527 4 -4 -7 -5 -12 -2 -6 -7 -4 -1 -1 -9 -5 -7 -7 -9 1 10 0 -1 -9 -1 9 13 4 8 9 -4 7 7 4 -4 0 -1 -6 -5 -4 3 0 0 1 7 -13 -5 -5 -1 -4 -9 -7 0 -8 -5 -9 4
$$ packed form
4169a1J7j4J1JqkJ4rk%MJj0OpRLnL%NjrrNLqRMLj%lJomPJKKpoRoKPppJ5n%%nM
4223dMnJ1jljLj7QJ3j5oPOllkNlklJ0nKKoRmKlJ0j1qkJ1o%mJ0mPJqJ7r%rOJMJ
4274Cj3J2mLJ2j7j0K0Mj3%QJmqlkKKJ0%%j3J3Nj3jlJ9klmlj%KjJ4ljo%jllNkQ
4322Fj3J4oLJj7J6Jj0QjLnLoL%jpRlj2JQJJj1kNPmPK%nJ6jKrPJ8k2qPL%mJpjK
4373@jjOjmK%oN%mnNj0lJ2LpQJ3j3LPj0pMJ0pjqJ5J0k0QlOrRJj0PplJl%JJ4j8
4422a1NOj5J0KJLo%JlQoLjoJ1JmjKk%MmjnNJMlN%qR%knKjJ0jrLq%MpJ5j2RrJM
4476ajoNj4J1Mj0JO%Rr%jPoOqRj3J1jNn%LqNL%rnK0j5MJ1j8J0rJO%JjLJqlLKQ
4527DqlKpJ0mjLL%qMk%kJ0Rj0jqQJ0MrMJj3J1%lqMjnJJPl%JOk0Q%MlnKPqLmJ3
$$ plain form
4580 4 -1 -5 -10 1 -5 5 0 -7 -3 -2 0 0 -1 -5 -15 -10 -1 -4 6 7 -3 -5 12 8 -3 -3 -8 3 -1 1 3 -5 -2 3 -8 -5 5 -10 -6 -10 -4 2 -12 -22 -9 -23
4626 -23 -11 -12 -6 -11 1 5 4 5 -8 -8 -3 -4 9 -8 -4 -15 -11 -3 -8 -5 -5 -3 -2 -2 2 6 2 8 0 3 1 1 -4 -1 0 -1 -5 -10 -5 -12 -4 -5 -5 -6 -7 -9 -8 -19 2 -10 -12
4677 -12 -1 -4 5 -12 -3 1 4 4 -1 1 -5 14 2 -3 -4 0 8 -2 6 10 6 -3 1 -8 4 -5 -1 -3 -10 -6 3 -9 7 -7 -9 7 6 -14 -4 -24 -13 -16 -13 -11 -5 -4
4723 -4 -4 -12 -7 -6 -16 -11 -2 -3 -2 2 -1 0 7 1 2 -3 1 7 1 0 5 3 13 3 3 7 0 3 -2 -3 -10 -16 -11 -4 -10 -4 -10 5 -7 -6 -1 7 -13 -16 1 -5 -17 -12 -12 -14 -4 -11
4775 -11 4 -4 -9 -12 5 -12 -5 -4 -5 8 -4 -5 3 4 3 -10 -9 6 -5 0 -1 8 -3 -1 -1 -5 -1 -3 -7 -9 -10 -8 -6 -3 -4 -2 -6 -1 -13 -6 -9 -19 -10 -4 -10 -5 -8 -9 -2
4824 -2 -12 1 -4 -9 -4 0 -4 -3 -2 11 -9 -7 10 5 5 5 11 7 9 8 2 -7 3 -4 -8 0 -4 -2 -12 -4 -11 -2 -5 -1 -19 -9 -2 -16 -5 -7 -15 -7 -14 -6 -8 -10 -4 -1 -12
4873 -12 -6 -10 -5 -3 -9 1 -1 1 -12 1 -10 -3 6 0 7 3 -2 7 9 10 3 -1 -7 -2 -11 4 -1 -5 -9 -6 -13 -11 0 -3 -13 -8 -8 -13 -10 0 -12 -12 -18 -6 -20 -9 -3 -13
4921 -13 -2 -2 -6 8 8 -11 0 -6 0 -10 -1 -6 -4 -6 -5 9 0 2 0 6 -4 -11 -1 0 4 0 -7 -12 -9 -19 -12 3 -5 -9 -1 -13 -9 -17 -17 -21 -15 0 -8 -1 -3 -3 -9 -5
$$ packed form
4580DnmnJ1oJ0npMJK%jmj0NRlJ0Jj0kJ7mj1%nJ1mKKqLNj1LJ0j5MmOOj4j0J3j4
4626b3J2jOnJ2MjJj3%NjJ3j7Mj1MQnL%KJ%MMmOqLk%nLJjmnNpQj%jjkJj1K1j2k
4677a2J1lRj7RML%nKoJ9j2njMQj0QMmrMrJ2rMkpMRj2J6j4kJ6jk0J0k0J1lLKOJ
4723d%qNJj0NRjJMlJPoJnMOojNkJ0j0%MpLnjpoNPoOoJ5j2JNQk0lJ7oj2N%kJ0p
4775a1J5qnlJ7j7PJjJ3j2jQJjj3JJ5j1NjRj1K%mMkmkjKKLjKmNj2Plj0ROoNljP
4824bj0J3nnNMmJJJ3k0KJ7n%%OmKjorJ0pmQmKj0QpRlMj8J0Pj4J1kqQpQkkOLj1
4873a2OmNKoJ0kKj3J3j1PRoPmnRKJpmoNrJ5nmmLpKJ1lj0N%nLJ0j2%oJ2j4J1Oj0
4921a3J1%mJ4%j9J1oOj0RnKkJJ4rKkOj0pJ0JMmpnLj0PJ5qmQj2Mq%mOJ5qPk%oM
$$ plain form
4969 -5 -9 -1 1 6 -9 -1 3 3 -4 -3 -9 9 -3 -3 9 2 -1 -8 -5 7 0 7 0 3 1 2 -9 -3 -13 5 4 3 6 -2 -3 0 -3 -6 -14 -14 0 -9 -10 -20 2 0 -10 5
5017 5 2 5 1 0 -10 -4 -3 12 13 5 4 -8 -7 0 -5 11 7 6 15 -8 -7 6 3 -1 2 -6 -6 -5 2 -10 -8 1 -5 -5 -3 -10 1 -7 -9 -5 -15 -10 -11 -8 2 -8 -1 -5 -4 -7
5067 -7 4 4 -8 2 -4 2 -5 3 -2 7 11 4 15 9 0 -8 8 6 3 6 -3 6 -14 1 -16 -3 -13 -12 -2 -1 -5 -2 -9 -7 -12 1 0 5 -12 -5 3 0 -11 -7 -11 -3 -1
5114 -1 1 -8 10 9 15 -7 -8 -1 -11 -6 -8 3 0 7 -12 5 -2 -13 1 7 0 0 1 2 -1 -10 2 3 -11 -11 -12 -3 -18 0 -4 -7 -3 -10 -4 -9 -13 -9 -10 -5 -4 -5 -6 2 -4
5163 -4 4 1 5 5 3 0 4 -10 0 -4 -8 -4 -7 0 12 5 -1 3 -14 7 -5 -6 -5 -10 -9 -13 -8 -5 3 0 -6 6 -10 1 -1 -5 -5 -10 -2 4 -9 1 6 -5 3 3 1 1 1
5212 1 5 11 0 4 3 -1 3 5 1 1 0 6 -3 6 0 0 2 -5 -2 3 -9 -1 1 -5 -18 -2 -5 -4 -3 -1 0 5 -6 -10 -9 -7 -3 -4 -4 0 -4 -3 -3 -15 3 6 -6 4 3 2 3 0
5264 0 0 2 3 4 -4 -5 -5 10 -3 -1 -2 1 -3 -1 -6 -2 -1 -3 -7 -18 -11 -11 -4 -7 -4 -3 -15 -3 0 7 1 1 -3 -10 -12 -5 3 -15 -8 -8 11 4 7 -1 2 -1 -3 -2 3 6 0 7 -2 2
5318 2 7 0 6 -1 0 -2 3 4 6 -5 -9 4 -14 -5 -8 -5 -4 -9 -13 -15 -7 -2 1 -10 -12 0 -9 -5 -7 -1 4 -12 3 -6 -11 -2 0 8 14 -6 4 -1 -3 -2 -9 -6 1 5 1 2 -8
$$ packed form
4969emQKNj5QM%pJoJ8j2%J2plpLJ2pPpLkJj1Oj0J8jjLqjLllq%J4rjj0K2kj0J5
5017ElLmjj0OJJ5Jqjj2JPnJ6mjRk3JJ3lmLq%JPj2KRo%KpJ1qkMj0NjLJ0j0PmJl
5067gJ1%j2J0oOpQnRMpJ1orqJ6klLrRk0J5j7J3j0JJ0JmLpKnJ3jNj7PQlj1MmQK
5114aKrJ8jOk2jPj0NkJ1lPj9J7pj1J4Op%JJlrJ2Jj4%jRj5J8mlMpOnmMjNJjjQo
5163dQlM%klMj4J0mmMlPJ2poMj7K1j2jJnJmNLQloJ2j6J1km%nQOj3J0Nj1Q%k%%
5212AMOj1MjmMKm%jOrRo%KpLNj2QKoj3J6lJJKJNj1mJKMj%MmJ%j2J8Lj2J0jjJl
5264@%KJJqj%J5j3KjLmKnMJkmj1P%PlLJj2J2LPo%mpkPQj8P%J9pLqLlkJNLoPrM
5318BNpOpJkNJKj1mJ3j8RlLJnmkQNLj1kJ2rMkONj6J5rnRKQOk0J0nkJpLPMmJj0
$$ plain form
5369 -8 -8 -7 -2 -3 4 0 -6 -5 -12 -1 -4 -5 -10 -4 -5 -20 -3 -8 -3 0 -9 -5 -1 -4 -8 -9 -22 -5 -5 2 0 -1 4 0 4 0 2 6 1 1 6 3 -1 -4 -3 1 6 3 6 8 -1 0 10 -2
5423 -2 -2 -4 3 -7 -7 -18 -6 -8 -6 -10 -5 -6 -6 4 -12 -15 -3 -11 -1 -7 -1 0 -8 3 3 -1 3 6 6 0 10 2 16 -6 13 4 8 7 5 -3 10 -1 -8 4 -2 -8
5469 -8 -4 8 6 -12 -20 -2 7 -4 -15 -12 -16 -1 -11 -7 -12 -10 -5 -1 5 -1 -8 -3 -8 -8 4 -3 0 2 -3 5 -5 4 -1 3 6 -3 -8 -5 -7 -9 -13 -1 -2 3 -17 -3 -1 -21
5517 -21 -12 -2 -2 -20 -7 -8 -5 -14 -11 -10 -9 -1 -9 -21 -11 -10 -2 -11 -10 -2 1 -8 -8 -10 -1 6 -3 -16 -5 -4 0 4 -3 7 -4 -4 -3 -6 -17 5 -4 -2 -12 1 -4 16
5563 16 2 -4 -6 -5 -15 -11 -15 -8 -6 -7 -4 -8 -17 -14 -6 -12 -9 -7 3 -6 -5 -13 4 -5 -8 7 -4 0 -6 -4 0 2 -11 4 6 -6 7 -16 0 -4 -2 -6 -10 -3 -11 -10 -9 0
5611 0 -4 -9 -8 -6 -9 -8 -21 -16 -8 -15 -14 -3 -13 -12 -13 -9 -15 -12 -8 -5 -10 0 -9 -4 -13 -3 -3 -15 -3 -3 3 -2 -1 5 0 -6 -3 1 9 9 9 0 2 2 -5 -7 -4 -14 -8 -12 4 -9
5663 -9 -10 -15 -23 -6 -7 -17 -5 -17 -15 -17 -9 -7 -11 -2 -4 -12 5 -6 -7 3 1 -1 2 -2 -6 -2 2 12 13 -1 -7 5 2 -1 -1 -1 -5 6 -3 -6 -6 -10 -1 -5 -16 -10 -1 -10 1
5712 1 -9 -8 -4 -16 -19 -11 -4 -3 -6 -7 -13 3 -3 8 -9 1 -2 -5 -4 -8 0 -8 -8 -6 2 -4 4 -4 8 9 1 -4 -7 0 7 -2 -1 4 0 -3 2 -9 -1 -18 -16 3 -7 -19 4
$$ packed form
5369h%JNjPmoJpJ1ljnOjj5J7nNLrMMlmjj3J7%PkjNmMmKMn%NlmlJMNlLKrJJ0j2
5423b%kPj0%j1J2kKmNj%J0j6lJ2qJ0oOJqJ1%mML%oJ0qJ4k2J9rMjkqJ3j1pJ2oo
5469hMJ2kj8qJ8Rj1j1LmJ5j0MnKNMOopNn%J2pLKnQj0RnMLrnLkkmJ2jNk0J4Kk0
5517b1RJ0%j8J3jLrLJJQqj2J0JQrJQLr%kRPrj3J1JMMpJ0j1%Jlj1K2rKj0J3nK0
5563A6j4okJj0MmPKjLmrLQoLKJ0rJqJ7rlJ5j1MoKMKj3J5Kj2J3k3J6mKmmPqJJR
5611@mnJKlJj3NQpJJ1j0JjMoLMLnJ0rNrJ0%j2J2%OnJOnoLMQ%%rK%pkLj0OmJ6j3
5663ijnqJ7jj0J2j2KkQKmRkqJ7j1jJ0kkLmmMMJ0Jj4oJ2ll%%mJ1rl%mRmj1ORrJ1
5712Aj0JMj2lQPJljoJ6oJ1j7J0llJmQq%KQoQqJ2JqnlPPrJNmlNj1Qj7KJ9j0j2K3
$$ plain form
5761 4 -4 -3 -9 -7 -14 -7 -4 -2 -4 -14 -2 -10 -2 -4 -7 -8 1 2 -3 2 -3 2 -4 0 -2 4 -5 4 -4 -4 4 4 -2 0 -6 -6 6 -7 2 1 6 2 -6 0 2 -10 -5 -7 -12 -1 -3 -13 0
5814 0 -14 -13 -18 -5 -10 -12 6 -4 1 1 0 -3 5 -4 -3 5 -5 -3 1 1 4 -2 5 -2 7 -5 -3 -7 -7 0 3 0 -4 0 -4 -6 -1 5 -5 4 -1 -9 -1 -4 -18 -15 -6 -6 1 -17 -10 -6
5866 -6 -14 -3 -16 2 -7 -3 8 4 -5 1 8 -7 -3 16 8 7 8 8 7 5 8 7 4 -8 -1 4 9 -3 -8 -5 -15 -7 -4 -13 -11 -10 -4 -11 -11 -5 -7 -6 -9 -2 -19 -2 -10 -9 -5 -19
5916 -19 -8 -4 -2 -10 -3 -13 -7 -3 2 6 12 5 4 5 -1 2 3 0 9 4 4 -5 -6 2 5 -11 -7 1 -3 -3 -9 -2 -21 -16 -16 5 -16 -14 -14 1 -10 -11 -3 -8 -6 -8 -8 6 -8 0
5966 0 -3 8 2 4 6 -4 -2 -2 3 -9 11 2 2 10 5 3 7 -4 5 10 -10 3 -1 10 -9 -11 -1 2 -7 0 -7 -8 2 -4 -4 3 -12 -3 -8 -12 1 -10 4 1 0 -5
6012 -5 -2 -2 6 -2 8 -4 -4 6 3 -6 9 5 3 7 7 -7 12 -5 2 4 0 3 -12 -5 -11 5 -1 -12 -4 7 0 3 -2 2 -4 7 6 -9 -6 -6 -7 -18 -2 5 -14
6057 -14 -4 0 3 3 1 -5 -6 -1 3 1 -8 2 8 0 -4 6 3 3 -5 6 11 5 5 -1 8 -3 -3 -7 -7 3 -7 -8 -11 -3 -5 -2 -5 -6 -3 -5 -24 -12 -4 -12 -5 -3 -17 -6 -5
6106 -5 0 -6 9 -1 7 -3 -1 -2 -7 3 -5 7 1 17 -3 3 5 4 8 4 5 15 1 7 -6 -2 9 0 -6 -6 -5 2 -6 8 1 -1 -3 -2 -11 7 -6 -1 -11 -1 -2
$$ packed form
5761DqJoKpPLKkj0J2qQkljRJnNnNoMkOrRq%Q%oKo%J2j3RjNmqOKj2NknJ1kj0J3
5814@j4JnJ3nkJ8j0N%jlQrJQj0KM%LoPpRj2Km%PLlmMmkNOj0RnqQlj4LR%Pj8PM
5866fqJ1j3J8rMJ1mrOPj5MJ9qjJ%jkLjlj2PNNj2nLj0QLrKJOp%OkJlPj7J7qJMj4
5916a9J1MKqPj0OMNMOpjJoLJlRn%rjQLj6MQm%oPj9N%K1k1K%J5j1jQnKk%J4j4Q
5966@lJ1oKKj0K%Nj2K0r%QnkMj1RNk0J3mJ1j9kJ0LrPpjJ0o%Pj5RnmJ3j1J4ljn
6012eL%QqJ0j2%J0lrJ5mkM%j4J9j7PKmLj5PoJ6oj1QJ1pLnMoJ1jj5L%jj1J6Pj9
6057a4J0ML%kojNMkrJ0OqmJ0l%qJ1No%oRj1%m%J0j0jlQkLljLkj9J2QqPKj4J1J
6106eNoJ5j0Qj0KjnJ0qJ2oJ6k0OKjMmJJ0j4Oj3MJ1ro%JPqJ4pkkJrJ8j3Nj0J0j
$$ plain form
6151 -2 -7 -7 9 -5 -6 4 -8 2 -14 -8 2 -11 -4 0 -8 4 -1 10 6 5 -3 10 7 6 -5 5 -7 -6 4 2 -4 -6 -9 12 0 -7 -7 3 6 -18 -11 -1
6193 -1 -9 -9 -6 -7 -10 -6 7 -1 0 -2 -11 -3 10 4 3 2 16 5 -2 6 10 -3 4 -7 1 0 7 -15 1 -8 1 8 0 5 6 3 3 0 -8 -1 -4 -2 2 -2 5 -6 1 -7 -9 -7 1 -2
6245 -2 -3 -12 -5 -4 -8 1 -1 6 5 -5 8 4 3 7 2 -4 4 -8 6 5 5 8 -5 3 -12 -2 0 0 -11 -9 -14 -6 -3 3 -2 -6 1 2 -1 -3 -2 -9 -16 -10 -12 -8 -7 -7 -9 -1 -6 -15 -5
6298 -5 -3 4 2 0 -2 1 -2 -5 2 6 17 1 -4 6 -2 -1 10 4 2 7 -1 -1 -4 -1 -15 -4 -13 -1 -3 -3 1 -10 -9 -8 -3 -10 1 -5 13 0 -8 -5 -12 5 -2 0 -2 2 1
6347 1 -1 11 -1 -3 -1 7 -8 3 -5 -13 4 -1 1 0 -3 5 2 2 8 2 5 -3 -4 -3 1 3 1 -7 -15 -11 -12 2 -7 -10 -11 -3 -4 -8 -12 -11 1 -8 -7 -5 0 3 1 -7 5 10 2 0 1
6400 1 14 0 -4 7 10 8 -1 4 25 4 3 15 0 1 9 -3 11 5 -7 -6 -12 -3 -3 -9 -5 -13 -8 -11 -10 -2 -2 -11 -13 -15 -3 -9 -8 -2 6 -1 -4 -6 -3 3 -5 8 -3 3
6448 3 3 3 0 8 -1 2 0 1 4 1 -4 -4 9 1 -7 2 -7 -7 -9 -7 -6 -6 -12 -7 -2 -6 -10 -7 -6 -12 -2 -4 -1 -9 -9 -5 -5 4 5 -11 -5 5 -7 0 6 4 -6 12 12 5 4 -6 1
6501 1 -1 7 6 1 11 -5 -3 3 5 -1 -4 -2 -5 -5 -15 -11 7 -9 -11 -8 -7 -7 -10 4 -5 -4 -12 2 -7 -8 -12 1 -2 -12 -5 2 -2 -2 3 -6 0 0 -15 -5 -3 -2 6 1 -5 -1
$$ packed form
6151bn%J6j4jJ0j2J0j6OJ0j3PMqJ2nJ1mjqJ3ljj1J0j2JJ0koklK1j2p%J0Lk4PJ0
6193aq%LjlMJ3qJkrQJ3ojjJ4j1pQMj3Pj1QjPk2J6rRPqNJl%lqPlKMmPj1PqkKQl
6245bjrPJmRkPjj0J3mjMnoQj2J4j%Lj3Qj5J0K%j1KnQLOnmPJlkJppOkMJ%kQnrJ0
6298eKPkkkLllPMJ1j6nJ0qJJ1okNq%lLj4J1rJ2k%Mj1JJNpJ1oJ8j3qLpJ7pKkMj
6347AkJ2j2kKQj5J1qqJ7nKjlQl%OoLqjJMKkqqMjJ4rljQjmmJJ2rJKNLkqJ2NqkJ
6400AJ3j4mJ1LkrNK1k1jJ2j5JQj2J4oj2JoR%oMqNlJQ%rkkJ2oJOQplkLOqJ3j1O
6448C%%lQrLkJLln%J3qqRr%kKJ%oNNmmLJoJ0kLq%M%RJj6OJ0j2POkj0J8%pjj0P
6501AkQjnJ0j6KOKolKl%j0MJ8j6kLJ%lJ4rJqJ4rjmJ3lj0PPm%NrO%j5J0KJQnoM
$$ plain form
6551 -1 -4 -4 2 -7 -4 -11 -4 -5 -8 0 -9 -13 -11 -10 -11 -14 -8 -6 -15 -20 -17 -6 -4 -6 -11 -11 -6 -5 -5 -12 -12 -14 -6 -4 -1 -9 -10 2 13 -7 3 -1 11 4 5 0 -2 -1 2 -1 4 7 1 2 -8
6606 -8 -9 -14 -11 -14 2 -8 -17 -10 -8 -13 -15 -21 -3 -7 -8 -14 -16 -1 -5 -3 -4 -4 -9 -11 -4 5 3 -2 -1 5 5 9 11 -3 3 6 9 9 1 -9 -3 0 -4 -3 0 -7 2 -2 -5 3 -8 -2 -7 -13
6660 -13 -7 -8 -21 -2 -9 -5 -10 -1 -12 -4 -11 -8 -11 -5 -5 -12 -8 -10 1 2 -3 10 4 11 1 5 17 11 18 11 11 4 16 13 0 -7 2 -1 -7 9 0 2 -12 -1 -18 2
6706 2 -1 -15 -3 -12 -13 -3 -7 -8 -4 -11 -9 -14 -9 -10 -5 -10 -10 -8 -8 -9 -10 3 -11 8 -1 0 6 2 7 1 -6 2 -6 -7 -8 -6 1 -2 -1 -5 -8 6 3 -6 3 -10 2 -11 -4 -8 -1
6757 -1 -4 -8 -8 -2 5 -6 -12 -4 0 1 -9 -3 -9 -2 -7 -9 0 -4 -7 -3 -8 -3 10 12 -15 -2 2 2 8 14 1 3 -1 -6 5 11 -6 2 -1 1 2 -14 -1 -5 -8 -14 -8 -2 -12 -17
6807 -17 -15 -12 -13 -8 -7 -15 -12 -8 -15 -18 3 -8 -10 -12 1 2 -4 -3 -5 -5 3 3 -1 12 -1 -5 1 -2 -11 0 2 -8 6 -3 -3 7 -6 -10 1 -2 -9 -4 -10 -7 -4 -11 -11 2
6855 2 -9 -11 -12 -7 -3 -11 -13 0 -4 -7 -4 -11 -9 -14 -5 -1 0 7 -11 4 13 3 8 -1 10 -3 4 -4 0 0 -1 4 -4 -9 -9 -4 -9 2 -7 -7 -7 1 7 -4 -10 -12 -19 -15 -8 -6 -18
6906 -18 -9 -4 -1 -10 -14 -13 -5 -16 -5 -9 -7 3 -9 0 2 6 13 3 3 2 1 6 4 3 4 2 10 7 -6 -15 3 6 1 -17 7 -1 -3 -4 -1 -13 -4 -7 -6 -12 -13 -14 -14 -3 -14
$$ packed form
6551al%OrLpPjlQrmKJjlOKrnLJ1Kkn%NJ%p%kQKLqjJ2J1k0J0mJ2pJnkJLlNLoJj0
6606hjnLlJ6j0rPKnkoJ8mjokJ5mKj%nkPRknJO%MKj4OLL%qj0OLmJLpRmlQj1Ono
6660a3Ojj3J9pMnRj1QpLlO%pMkJ1JnJ3oPj0MJ2oPp%pJ2lj3pRloJ6rKj4J1j7K0
6706Blj4J2rjJ0mjMpKnNjNn%K%jjJ3j4J9rJOmNopQqjjKPlJmlJ4lrRj3J2j3PmP
6757alm%OPj1oQMJj0OoPnkRmlMnNJ3Kk7J3M%OOj3KmnJ1Oj7QlKJj6J3mloOOj0n
6807a7KLjNJqLMplK1j1kkJ3JoJk%Q%mJ3j3mOlrJ1Kj0J4r%J0j3mJ1lpNoLLp%J3
6855Bj1kjNMqkJ3mlLpKnRMJPj8J5Rj0NrJ1j3PqM%jNqn%NnJ1r%%QOj1okpMPKj2
6906a8RNLrmJQj1J1mKJ0j2RKMPj0%jjNkjJkQlj3rJ8Lnj8K4qkjLj2RlJojj%J1j1
$$ plain form
6955 -14 -8 -15 -14 -5 -7 -11 -12 -16 0 -1 -8 -7 -6 7 -6 13 0 6 6 8 5 2 5 -9 -8 6 -2 -10 -6 -4 7 -2 -2 -10 0 -2 2 5 -4 -13 -17 -19 -14 -14 -8 3 0 -3 -9 -6
7005 -6 -10 -8 -8 5 -3 4 -5 -5 0 6 -8 -9 1 -11 4 5 11 10 14 -2 6 3 -2 1 -5 8 4 -5 -7 1 -13 -9 -4 -12 -10 -13 -6 -9 -4 -3 -10 -2 -10 -3 -10 -11 -11 -2 -7 -13 -8 -4 0
7058 0 2 1 5 4 -1 -4 -5 0 5 2 -6 8 3 -5 7 10 0 -11 1 -4 1 7 0 6 14 2 -1 -2 4 -4 -11 -11 -7 -13 -13 -5 -17 -4 -6 -9 -4 -16 4 0 2 -3 -1 -4 -2 -6 -3
7109 -3 1 -6 0 -2 0 -4 6 -3 7 2 5 10 8 4 6 4 1 -1 -12 -2 -12 -7 -11 6 -5 -2 15 -5 -4 -3 -3 -11 -9 -8 0 1 -8 -6 1 -12 -4 -7 -3 1 -9 -7 3 1 -10
7158 -10 1 13 4 4 4 2 11 5 -1 0 -1 -2 -7 6 -12 -7 2 -10 -13 -8 -12 -10 -6 -8 -11 -3 -9 -15 -4 -12 -8 -17 -9 -10 1 -7 -11 -8 2 -9 -2 1 -9 -5 -7 0 3 -5 -6 -4
7208 -4 -1 9 3 -1 2 13 16 14 -7 12 13 3 8 -5 -17 3 -2 4 -5 -12 -12 -8 1 1 -6 -1 -12 -8 -14 -11 -12 -8 -11 -8 -12 3 -3 -7 -7 0 3 1 0 7 -12 16 9 -6
7256 -6 -1 -3 1 4 -5 8 5 7 11 5 -1 7 7 -8 4 -3 -2 -15 3 -16 -8 2 -8 -10 -11 -4 -14 -12 -20 -7 -17 -13 -1 -2 -5 -2 0 2 -5 1 7 1 10 2 -4 8 0 -2
7304 -2 4 4 12 3 1 8 4 6 6 6 4 -6 1 -2 -5 0 -4 0 -6 1 9 -6 -10 -2 1 -4 -10 -1 -6 -5 -6 -20 -9 2 -4 3 3 -1 10 -4 5 -2 7 1 7 12 13 0 9 14 -4 0
$$ packed form
6955a4OpJRkmjmJ6jpJJJ3j3J9j3O%KllLj4JJ4qqMKJ1r%qJ0kMLrrmkN%OJ1lloL
7005fmK%J3qPr%NOj4jJ0j2J5JOjMj6QlnLoJ3mrkQj4MNqKlPlNJpQqPpj%RnoNMM
7058@KjMjnljNNlqJ4nqJ2Lj0j1J2nNOpOQj2ljOqp%Mo%Qj2J3klNj2K0mKnKlKmL
7109cMpOkKmJ0rJ0nLNkmKklkj1J0j0NmJ7j1LJ7k0JJ%qKJQJrKPj3QlMMj0KJ0kj1
7158a0J1J2r%%kRooJjjnJ3j8NRj2lNmKMklQooJ1qMrQjJ1qmLJ0j1PLj0MkPLqjK
7208dLJ0omLJ1Lkk1J9Jj0Nj3j2K0nOrp%MR%pNj1MoLjMlLmJ5om%PLkjPj9K8pj5
7256fNkMLrJ3lKMooQ%j5J2pJj3J8j9QJ0j0kjPj0KqJ3j0MJ2jlLKKpOOoRqoJ2qk
7304bO%QrkPmK%%kj0PllNmMoPQj5mQLnoRnJjj4J1J1oP%mJ1j4RpRoONJj3RNj8M
$$ plain form
7356 0 12 13 6 7 2 4 -5 6 5 6 -9 -3 -4 -6 -4 -11 -12 -8 -7 -4 -2 -3 -8 -3 -6 -10 -12 -6 -1 -7 -8 -3 -7 -9 0 -8 -5 -2 -6 7 7 -2 4 9 6 -3 11 7 21 4 -8 11
7408 11 -6 3 -7 8 -3 -1 -11 -7 -9 -2 -7 -11 -12 -13 -12 -5 -16 -14 -13 -9 -9 -11 -9 -2 -12 -11 -18 -5 -2 -9 7 -4 -9 -5 11 -6 -5 -8 -1 3 4 -4 10 -4 7
7453 7 13 2 8 4 3 -2 -3 1 -2 -3 -9 -13 -4 -6 -11 -16 -6 -9 -5 -14 -7 0 -8 -10 -7 1 -6 -17 -13 -10 -12 -5 2 -4 -6 14 4 10 2 3 0 3 4 0 0 12 6 18 4 8 8 12 3
7506 3 -4 -10 -8 -10 -7 -7 -6 -10 -4 -13 4 -5 -15 -9 -10 4 -17 -19 -12 -22 -9 -9 -8 -16 -12 -14 1 13 5 -3 8 -5 21 -3 -7 -5 8 -5 2 11 7 4 -5 1 -4 11
7552 11 -7 -3 0 5 0 -11 -4 2 -8 -10 -13 -4 -11 -5 -4 -5 -7 -13 -16 -14 -15 -4 -5 -13 -2 -6 -3 -2 14 -2 -6 3 3 0 1 0 1 -5 -6 3 0 -4 -5 6 4 1 -2 -5 -3 5 -4 -4
7604 -4 -10 -7 1 -15 -8 -14 -21 -10 -7 -12 6 2 -11 -3 -14 -2 -10 -14 -1 -19 -4 -6 -19 -5 -9 -1 0 -11 0 4 2 4 -5 4 -3 5 9 1 7 12 6 -4 2 7 3 4 9
7651 9 -7 -3 -7 -3 -9 -16 -14 -14 -14 -9 -2 -9 -4 -12 -3 -6 -7 -12 -12 -14 -1 2 -3 0 5 -1 -7 1 6 1 14 11 3 9 5 -2 0 -8 -3 0 8 11 7 0 -4 -2 -1 -4 -6 1 -9 -17 -16 -6 -9 -13
7707 -13 -1 -19 -17 -9 -7 -16 -13 -1 0 -6 -18 -7 -7 -13 -13 2 3 14 -1 18 9 4 13 8 11 -2 -6 7 2 -1 -5 -6 2 9 7 14 4 -10 1 -5 -6 6 0 -2 -8
$$ packed form
7356@J2JpJnKrJ1jJj5OjkKpjMJLKjnNlmkONojNmkRqLLmJ3%rONlrJ4mJ4j7j2J9
7408A1j7Rj0J5j1Kj0MkPnmjjJPj1KJM%kKPj0JpJ3LpJ6j1nMJ6j7JlPMJqJ4j4J1
7453GOj1OmjnjMljomRknnJ0lMrPPqkLQpj1MLkPPokK0j0OqJlLJm%J2oJ2j4M%Mr
7506CpoKkL%JmOrJ7rj0OjJ4k1kPj0J3%JqMkJ5J2qqJ1j3K6k4mKJ3j3PRmlrOnJ5
7552A1j8MLNnj1POj0klRpOJjkolKjJ1jqJ1mLJJ6j6mR%lJjJojRlmjJ1klllKQr%
7604doLQj6PopJ1LnJ8mj3Qj1J2qmJ3j8J5kj3J4mQJj1J1MkKrRpQMqONoj0ONmJN
7651Ij6MmMopK%%NPpNqRljn%kJ3LnLNooQNnJ3lqOmpKqNLQLmpmKJlkPj0qJJ0lm
7707a3J2j8KQKrLJ2Joj2J1%o%J5JJ1j5J9rnRnLj3mJ3nlmjQPkPj0j4J1ojJ2oko
$$ plain form
7752 -8 -9 -3 -8 -15 -13 -14 -7 -10 -4 4 -11 0 -11 -6 -10 -5 -6 -3 -1 7 -4 6 1 11 8 10 -8 14 1 -1 6 11 11 -2 2 10 11 3 0 -2 2 -1 -11 -3 5 -17 -7 -14
7800 -14 -17 -15 -15 -10 -10 0 1 -7 -6 -14 -10 -9 -16 4 3 -7 -7 -4 -4 -5 -7 -1 3 0 -3 3 7 6 6 9 -1 8 2 -1 -4 -2 -5 7 2 7 8 -8 3 3 -5 -13 -16 -8 -11 -14 -10 -16 -15
7853 -15 -16 -10 -5 -4 -14 -11 -12 -4 -10 -15 -4 -15 -2 -5 -4 12 -2 3 -8 3 13 13 6 7 6 -2 0 8 0 9 1 13 4 -5 -3 3 -2 -6 -14 -3 0 -8 -3 -8 -11 -13 -9 -20
7901 -20 -14 -1 -3 -11 -20 0 -7 -5 -12 -7 -5 -14 7 -4 6 9 10 0 1 3 -5 9 4 1 -1 1 0 1 -1 1 1 0 -1 -5 2 1 -4 -7 -2 -3 -5 -15 -20 -18 -6 -17 -8 -20 -13
7950 -13 -1 -7 -11 -13 -7 0 -6 -4 -3 -3 -7 1 2 -2 -2 16 7 4 -2 6 3 -1 -4 -11 -7 -4 1 5 -3 -10 -2 -8 6 4 0 -8 -9 -5 -2 -21 -10 -11 -9 -5 -4 -11 -10 -14 0 -3 -11 0 -17
8003 -17 0 -9 -3 -10 -11 -7 -6 4 1 0 4 2 -2 15 8 1 7 2 3 -2 -3 2 7 -3 -3 2 2 -7 -2 4 -2 -5 -1 -5 -14 -4 -10 -16 -14 -15 1 0 -10 -7 2 -7 -5 -5 0 5 -7 5
8055 5 7 2 2 -1 3 -1 3 5 13 -4 3 5 4 -3 -7 1 3 4 -13 -7 -3 -2 0 2 -1 -4 -7 -4 -9 -12 -18 -17 -14 -14 -19 -15 -23 -9 -22 -8 -19 -12 -15 -5 -3 11 -1 0 -11 -2 -5
8106 -5 2 5 7 1 -10 2 2 7 -3 6 -1 -8 -8 -10 2 -10 7 -6 -2 -7 -2 -7 -12 -4 -12 -3 -20 -13 -16 -7 -17 -15 -20 -12 -12 -10 -15 -17 -12 -12 -2 -4 -10 -5 -2 9 -12 -5 5
$$ packed form
7752hjOnpKjPlOQj5J1j1NmNjLKQj1J0nJ0lKj8K2j3kPN%j3MQJqlkMlj0QQk2J0p
7800a4lK%N%J0JqJqMJpK0jj0%L%jkOMllOMj%Lj0RollKlJ2nNJj6J1%qqlQllMoJ
7853a5jONJj0LjQonJ1j1J3lJJ6j4Nj1J1J0%pJjqKQqRqJ2rrKOnmqJ1LqNnlkMj1
7901b0OJ3kqrK0pKpNKrK1j1J0LJj0JKqJ4nlkKjJkK%jjmPjnlNjkj0nKJ2j1Rj2P
7950a3J2omkOPoKJ%mQJm%J8rloQlmlpMLNMqpQoJ4kmqjMLj9J1jKMJpJmJ4lqJ1j7
8003a7J7rOpjMJJ0ljMkmJ7ppOnJnjNNj0%N%rNOolMmrJ0ooKjJ6jj0LRrK%NNj2J2
8055EKn%lMmMKQj7PKjpmQKJj7OMJKKlllLnloJL%nMqJ4j3J4j1PlJ0KJ4j2Jj1Rl
8106ePLKoj1J2%Nj0Rpp%kJ2j2J7j3MnNnnQqRj7PlRj0KnQ%KnkN%J0koNLJ1k1PJ0
$$ plain form
8155 5 -3 4 14 11 7 1 10 20 5 1 3 5 -2 4 -5 1 -6 2 -3 10 -13 -1 3 -3 -8 -6 4 -18 -22 -11 -7 -9 -11 0 -13 -2
$$ packed form
8155EqPJ0lmoRJ0j5mKKpOrOpQnJ3k3J2MonKJ0k2mJ1MkkJ1j3J1
8191b
##END NTUPLES=NMR FID
##END=
