##TITLE=1H_IBIP1701
 CDCl3, 8 sc, 
 18.1.2019
##JCAMPDX= 6.0         $$ Bruker NMR JCAMP-DX V2.0
##DATA TYPE= NMR FID
##DATA CLASS= NTUPLES
##ORIGIN= UXNMR, Bruker Analytische Messtechnik GmbH
##OWNER= root
$$ XWIN-NMR		Version 3.5
$$ Fri Jan 18 14:10:06 2019 Russian Standard Time (UT+4h)  she@DPX200
##.OBSERVE FREQUENCY= 200.1313
##.OBSERVE NUCLEUS= ^1H
##.DELAY= (6, 6)
##.ACQUISITION MODE= SIMULTANEOUS
##.ACQUISITION SCHEME= undefined
##.AVERAGES= 8
##.DIGITISER RES= 18
##SPECTROMETER/DATA SYSTEM= spect
##.PULSE SEQUENCE= zg30
##.SOLVENT NAME= CDCl3
##.SHIFT REFERENCE= (INTERNAL, CDCl3, 0, 15.7039)
##AUDIT TRAIL= $$ (NUMBER, WHEN, WHO, WHERE, WHAT)
$$ ##TITLE= Audit trail, XWIN-NMR		Version 3.5
$$ ##JCAMPDX= 5.01
$$ ##ORIGIN= Bruker BioSpin GmbH
$$ ##OWNER= she
$$ F:/spectra/data/she/nmr/H-F/1/audita.txt
$$ ##AUDIT TRAIL=  $$ (NUMBER, WHEN, WHO, WHERE, WHAT)
(   1,<2019-01-18 14:08:53.10 +0400>,<she>,<DPX200>,
      <created by zg, POWCHK disabled, PULCHK disabled
       configuration hash MD5:
       00 E9 B6 7A A2 85 ED C7 34 08 36 98 17 FE 4E 26
       data hash MD5: 16K
       2A 82 67 50 D9 E9 2B E2 E9 3E C8 F2 70 A2 98 80>)
$$ ##END=
$$ 
$$ hash MD5
$$ C7 17 80 32 94 38 65 F8 CC 1C 37 10 2E D7 B7 0E
##$RELAX= 
##$RELAX= 
##$RELAX= 
##$RELAX= 
##$RELAX= 
##$RELAX= 
$$ Bruker specific parameters
$$ --------------------------
##$DU= <F:/spectra>
##$EXPNO= 1
##$NAME= <H-F>
##$PROCNO= 1
##$TYPE= <nmr>
##$USER= <she>
##$AMP= (0..31)
100 100 100 100 100 100 100 100 100 100 100 100 100 100 100 100 100 100 
100 100 100 100 100 100 100 100 100 100 100 100 100 100 
##$AQSEQ= 0
##$AQ_mod= 1
##$AUNM= <au_zg>
##$AUTOPOS= <>
##$BF1= 200.13
##$BF2= 200.13
##$BF3= 200.13
##$BF4= 200.13
##$BF5= 200.13
##$BF6= 200.13
##$BF7= 200.13
##$BF8= 200.13
##$BYTORDA= 1
##$CFDGTYP= 0
##$CFRGTYP= 5
##$CHEMSTR= <none>
##$CNST= (0..31)
1 1 145 1 1 1 1 1 1 1 1 1 1 1 1 1 1 1 1 1 1 1 1 1 1 1 1 1 1 1 1 1 
##$CPDPRG= <>
##$CPDPRG1= <>
##$CPDPRG2= <>
##$CPDPRG3= <>
##$CPDPRG4= <mlev>
##$CPDPRG5= <mlev>
##$CPDPRG6= <mlev>
##$CPDPRG7= <mlev>
##$CPDPRG8= <mlev>
##$CPDPRGB= <>
##$CPDPRGT= <>
##$D= (0..31)
0 1.2 0 0 0 0 0 0 0 0 0 0.03 0 0 0 0 0 0 0 0 0 0 0 0 0 0 0 0 0 0 0 0 
##$DATE= 1547806132
##$DBL= (0..7)
120 120 120 120 120 120 120 120 
##$DBP= (0..7)
150 150 150 150 150 150 150 150 
##$DBP07= 0
##$DBPNAM0= <>
##$DBPNAM1= <>
##$DBPNAM2= <>
##$DBPNAM3= <>
##$DBPNAM4= <>
##$DBPNAM5= <>
##$DBPNAM6= <>
##$DBPNAM7= <>
##$DBPOAL= (0..7)
0.5 0.5 0.5 0.5 0.5 0.5 0.5 0.5 
##$DBPOFFS= (0..7)
0 0 0 0 0 0 0 0 
##$DE= 6
##$DECBNUC= <off>
##$DECIM= 32
##$DECNUC= <off>
##$DECSTAT= 4
##$DIGMOD= 1
##$DIGTYP= 9
##$DL= (0..7)
0 120 120 120 120 120 120 120 
##$DP= (0..7)
150 150 150 150 150 150 150 150 
##$DP07= 0
##$DPNAME0= <>
##$DPNAME1= <>
##$DPNAME2= <>
##$DPNAME3= <>
##$DPNAME4= <>
##$DPNAME5= <>
##$DPNAME6= <>
##$DPNAME7= <>
##$DPOAL= (0..7)
0.5 0.5 0.5 0.5 0.5 0.5 0.5 0.5 
##$DPOFFS= (0..7)
0 0 0 0 0 0 0 0 
##$DQDMODE= 0
##$DR= 18
##$DS= 0
##$DSLIST= <SSSSSSSSSSSSSSS>
##$DSPFIRM= 0
$$ [...]
##$SUBNAM2= <"">
##$SUBNAM3= <"">
##$SUBNAM4= <"">
##$SUBNAM5= <"">
##$SUBNAM6= <"">
##$SUBNAM7= <"">
##$SUBNAM8= <"">
##$SUBNAM9= <"">
##$SW= 20.0189088683792
##$SWIBOX= (0..15)
0 0 2 0 0 0 0 0 0 0 0 0 0 0 0 0 
##$SW_h= 4006.41025641026
##$TD= 16384
##$TD0= 1
##$TE= 0
##$TE2= 300
##$TE3= 300
##$TEG= 300
##$TL= (0..7)
0 120 120 120 120 120 120 120 
##$TP= (0..7)
150 150 150 150 150 150 150 150 
##$TP07= 0
##$TPNAME0= <>
##$TPNAME1= <>
##$TPNAME2= <>
##$TPNAME3= <>
##$TPNAME4= <>
##$TPNAME5= <>
##$TPNAME6= <>
##$TPNAME7= <>
##$TPOAL= (0..7)
0.5 0.5 0.5 0.5 0.5 0.5 0.5 0.5 
##$TPOFFS= (0..7)
0 0 0 0 0 0 0 0 
##$TUNHIN= 0
##$TUNHOUT= 0
##$TUNXOUT= 0
##$USERA1= <user>
##$USERA2= <user>
##$USERA3= <user>
##$USERA4= <user>
##$USERA5= <user>
##$V9= 5
##$VALIST= <valist>
##$VCLIST= <CCCCCCCCCCCCCCC>
##$VD= 0
##$VDLIST= <DDDDDDDDDDDDDDD>
##$VPLIST= <PPPPPPPPPPPPPPP>
##$VTLIST= <TTTTTTTTTTTTTTT>
##$WBST= 1024
##$WBSW= 4
##$XGAIN= (0..3)
0 0 0 0 
##$XL= 0
##$YL= 0
##$YMAX_a= 662385
##$YMIN_a= -761132
##$ZGOPTNS= <>
##$ZL1= 120
##$ZL2= 120
##$ZL3= 120
##$ZL4= 120
##$ABSF1= 10
##$ABSF2= 0
##$ABSG= 5
##$ABSL= 3
##$ALPHA= 0
##$AQORDER= 0
##$ASSFAC= 0
##$ASSFACI= 0
##$ASSFACX= 0
##$ASSWID= 0
##$AUNMP= <proc_1d>
##$AZFE= 0.1
##$AZFW= 0.1
##$BCFW= 1
##$BC_mod= 2
##$BYTORDP= 1
##$COROFFS= 0
##$CY= 11.3945322036743
##$DATMOD= 1
##$DC= 2
##$DFILT= <>
##$DTYPP= 0
##$F1P= 18.9103706918063
##$F2P= -1.10871071338519
##$FCOR= 0.5
##$FTSIZE= 0
##$FT_mod= 4
##$GAMMA= 1
##$GB= 0.15
##$INTBC= 1
##$INTSCL= 1
##$ISEN= 128
##$LB= 0.24
##$LEV0= 0
##$LPBIN= 0
##$MAXI= 10000
##$MC2= 0
##$MEAN= 0
##$ME_mod= 0
##$MI= 1.114404
##$NCOEF= 0
##$NC_proc= 0
##$NLEV= 6
##$NOISF1= 3.799351
##$NOISF2= 2.8
##$NSP= 1
##$NTH_PI= 0
##$NZP= 0
##$OFFSET= 15.70392
##$PC= 1
##$PHC0= -9054.267
##$PHC1= 12.80004
##$PH_mod= 1
##$PKNL= yes
##$PPARMOD= 0
##$PSCAL= 0
##$PSIGN= 0
##$REVERSE= no
##$SF= 200.130013532006
##$SI= 16384
##$SIGF1= 3
##$SIGF2= 2
##$SINO= 400
##$SIOLD= 16384
##$SREGLST= <1H.CDCl3>
##$SSB= 0
##$STSI= 0
##$STSR= 0
##$SW_p= 3612.71676300578
##$SYMM= 0
##$S_DEV= 0
##$TDeff= 0
##$TDoff= 0
##$TI= <>
##$TILT= no
##$TM1= 0
##$TM2= 0
##$TOPLEV= 0
##$USERP1= <user>
##$USERP2= <user>
##$USERP3= <user>
##$USERP4= <user>
##$USERP5= <user>
##$WDW= 1
##$XDIM= 8192
##$YMAX_p= 0
##$YMIN_p= 0
$$ End of Bruker specific parameters
$$ ---------------------------------
##NTUPLES= NMR FID
##VAR_NAME=  TIME,          FID/REAL,        FID/IMAG
##SYMBOL=    X,             R,               I
##VAR_TYPE=  INDEPENDENT,   DEPENDENT,       DEPENDENT
##VAR_FORM=  AFFN,          ASDF,            ASDF
##VAR_DIM=   8192,          8192,            8192
##UNITS=     SECONDS,       ARBITRARY UNITS, ARBITRARY UNITS
##FACTOR=    0.0002496,     1,               1
##FIRST=     0,             0,               0
##LAST=      2.0444736,     0,               0
##MIN=       0,             -761132,         0
##MAX=       2.0444736,     662385,          0
$$ Real data points
##PAGE= N=1
##DATA TABLE= (X++(R..R)), XYDATA
$$ plain form
0 0 0 0 0 0 0 0 0 8 -8 8 -8 8 -16 16 -17 24 -32 40 -48 57 -72 86 -99 120 -142 165 -190 221 -256 295 -335
31 -335 383 -437 495 -558 628 -708 794 -887 990 -1105 1228 -1361 1509 -1670 1847 -2036
47 -2036 2246 -2477 2728 -3005 3309 -3648 4024 -4442 4915 -5453 6066 -6774 7606 -8599
61 -8599 9809 -11316 13256 -15861 19559 -25248 35185 -57448 212883 -340594 -597882 370083
73 370083 202814 -581433 -296157 570109 226647 -387984 26444 468381 -167472 -501751
83 -501751 203350 507279 -224934 -444331 218505 335820 -331284 -377291 263407 364145
93 364145 -117990 -135778 211644 96396 -291087 -183053 171806 99698 -164019 6543
103 6543 317348 116798 -306354 -200784 187867 79724 -285679 -88064 364560 189288
$$ packed form
0@%%%%%%%Qj6J6j6J6k4L2l3M1n6P2q8J05j29J58j85K19k62L07l55M11m77N51o30
31c35P18q20R32j053J186j336J502j681J877k095K333k589K870l179L517l883
47b036M282m723N205n733O314o957P672q466R357j0368J1519j2840J4380j6205
61h599J8408k1125K4572k9117L5420m4807O0433r2633K70331n53477k57288R67965
73C70083j67269p84247K85276Q66266l43462o14631M14428M41937o35853l34279
83e01751P05101L03929p32213k19397O62836J17315o67104m6007O40698J00738
93C64145m82135j7788L47422j15248l87483J08034L54859p2108k63717J70562
103F543L10805k00550m23152J05570L88651j08143l65403J97615M52624j75272
$$ plain form
113 189288 -253746 -68675 277524 -58239 -413952 21603 381108 -96260 -366590 217689
123 217689 432553 -227313 -391752 285416 361640 -307536 -282124 328018 139593 -446900
133 -446900 -127998 427762 41757 -385148 142181 499763 -136074 -491037 100719 340803
143 340803 -222091 -323983 251136 304936 -181986 -150372 223348 54147 -278001 -29955
153 -29955 271263 -1127 -250351 37271 249922 -37907 -245648 -5900 188809 19684
163 19684 -141225 -27722 100525 26030 -71527 -5306 79884 8081 -71361 25013 94618
174 94618 -70388 -170156 54184 198867 -50395 -200009 91511 245323 -76300 -232624
184 -232624 71213 166635 -137366 -154302 155383 100078 -189733 -32405 258773 20705
$$ packed form
113A89288m43034J85071L46199l35763l55713M35555L59505m77368k70330N84279
123B17689K14864o59866j64439O77168P6224o69176K5412O10142j88425n86493
133d46900L18902N55760l86005m26905N27329L57582o35837l54963N91756K40084
143C40803n62894j01892N75119N3800m86922L1614L73720j69201l32148K48046
153b9955L01218k72390k49224K87622K12651k87829k07741K39748J94709j69125
163A9684j60909J13503J28247p4495r7557O6221Q5190p1803p9442R6374O9605
174I4618j65006r9768K24340J44683k49262j49614K91520J53812l21623j56324
184b32624L03837R5422l04001j6936L09685n5305k89811J57328K91178k38068
$$ plain form
194 20705 -269836 17001 279410 -47184 -281199 49505 233774 -74911 -178355 113060
204 113060 137885 -128773 -79547 152999 27086 -189015 -13452 191221 3150 -178351
214 -178351 38 149613 -4322 -118742 1503 81698 6941 -27763 15085 5898 -31187
225 -31187 -4994 35297 14928 -29796 -27890 26678 50457 -24990 -93549 -8046 107770 33724
237 33724 -99840 -29920 97475 16639 -98847 -9664 76344 -20951 -51123 78940 59157
248 59157 -111076 -60650 133068 56070 -148861 -52179 152096 48844 -134829 -35069 100268
259 100268 -5945 -83591 38529 65815 -68735 -50520 96117 42728 -116237 -47846 115580
270 115580 56413 -86982 -39554 70204 29883 -46690 -19350 16965 -5157 -1879 29327 4731
$$ packed form
194B0705k90541K86837K62409l26594k34015L30704J84269l08685j03444K91415
204A13060K4825k66658M9226K32546j25913k16101J75563K04673j88071j81501
214a78351J78389J49575j53935j14420J20245Q0195p4757l4704M2848r187l7085
225c1187K6193M0291k0369m4724J906N4568K3779p5447o8559Q5503J15816p4046
237C3724j33564O9920J27395q0836j15486Q9183Q6008r7295l0172J30063j9783
248E9157j70233N0426J93718p6998k04931R6682K04275j03252j83673R9760J35337
259A00268j06213p7646J22120K7286j34550J8215J46637n3389j58965O8391J63426
270A15580n9167j43395M7428J09758m0321p6573K7340L6315k2122L278L1206k4596
$$ plain form
282 4731 -42166 -18423 36365 25990 -29339 -39356 12983 48945 7323 -54700 -33064 43427
294 43427 45439 -22518 -31729 22311 25287 -12675 -4189 10584 -23252 -21154 43326 32756 -61453
307 -61453 -54455 56758 60190 -48604 -55409 40588 46510 -29197 -30298 15560 618 -15396 26584
320 26584 27291 -39448 -35546 48372 49850 -38746 -48539 32560 49567 -18254 -44907 -5944 15960
333 15960 5053 28 -3505 -15589 -4757 25120 18648 -22772 -28446 17387 40059 -292 -40233
346 -40233 -18513 27976 27379 -11805 -24289 3502 24319 12498 -9494 -18740 -10659 10139 18949
359 18949 -5832 -33859 -16262 26617 25852 -16037 -28397 8838 35031 13212 -20439 -21042 6113
372 6113 22290 6825 -19458 -20454 6201 25163 11161 -16171 -20168 5819 25763 6455 -28071
$$ packed form
282D731m6897K3743N4788j0375n5329j0017N2339L5962m1622o2023K1636P6491
294D3427K012o7957r211N4040K976l7962Q486J4773l3836K098O4480j0570r4209
307f1453O998J11213L432j08794o805R5997N922p5707j101M5858j4942j6014M1980
320B6584P07o6739L902Q3918J478q8596r793Q1099J7007o7821k6653L8963K1904
333A5960j0907n025l533j2084J0832K9877o472m1420n674M5833K2672m0351l9941
346d0233K1720M6489n97l9184j2484K7791K0817j1821k1992r246Q081K0798Q810
359A8949k4781k8027J7597M2879p65m1889j2360L7235K6193k1819l3651o03K7155
372F113J6177j5465k6283r96K6655J8962j4002k7332l997K5987J9944j9308l4526
$$ plain form
385 -28071 -25495 13268 26976 -6061 -30742 -9470 22205 22696 1368 -13575 -8250 13055 22475
398 22475 -3222 -30343 -11235 25974 19039 -17569 -23885 210 15257 13204 345 -18223 -13808
411 -13808 19793 23153 -24263 -40272 11966 41026 -405 -27470 880 15533 -265 5425
423 5425 13815 -14821 -20221 28964 31432 -40856 -51278 30083 50250 -23518 -41469 19580 28357
436 28357 -18041 -12887 17254 -7007 -22750 25028 33659 -34968 -45573 34697 53478 -23863
448 -23863 -46030 20990 43051 -10315 -29517 3658 11630 -7670 -1816 8262 -14329 -25661
460 -25661 11080 37218 -78 -39092 -6886 42432 16237 -43559 -26990 40115 36629 -24946
472 -24946 -27210 18893 9116 -25490 4988 36235 -12109 -36394 32022 45493 -54832 -74018
$$ packed form
385b8071K576L8763J3708l3037k4681K1272L1675M91k1328j4943N325K1305R420
398B2475k5697k7121J9108L7209o935l6608o316K4095J5047k053j2859j8568M415
411a3808L3601L360m7416j6009N2238K9060m1431k7065K8350J4653j5798N690
423E425Q390k8636n400M9185K468p2288j0422Q1361K0167p3768j7951O1049Q777
436B8357m6398N154L0141k4261j5743M7778Q631o8627j0605Q0270J8781p7341
448b3863k2167O7020K2061n3366j9202L3175P972j9300N854J0078k2591j1332
460b5661L6741K6138l7296l9014L2206M9318k6195n9796J6569O7105l486o1575
472b4946k264M6103r777l4606L0478L1247m8344k4285O8416J3471j00325j9186
$$ plain form
484 -74018 44066 73866 -38711 -58745 48781 50793 -54364 -42524 48093 17473 -47993
495 -47993 21282 76876 -28984 -90450 26744 80257 -42951 -80103 55221 90228 -39203
506 -39203 -71770 27715 30582 -51967 -20557 61942 16313 -54059 7284 62335 -24762 -85888
518 -85888 10645 86709 8860 -57809 7296 56840 -11469 -62169 -7124 36055 -1142 -13784
530 -13784 33965 27980 -44916 -46027 31855 31379 -49495 -34169 70961 62557 -55219 -64726 34972
543 34972 34547 -48705 -20486 68142 30538 -48789 -1311 48945 -39208 -86098 35265 97223
555 97223 -23614 -76014 42988 71332 -62896 -88186 40062 61479 -33582 -16290 67290
566 67290 10485 -81104 -14534 66788 -10937 -71457 34444 100765 -11317 -87963 -1842 52730
$$ packed form
484g4018J18084K9800j12577k0034J07526K012j05157J1840R0617l0620o5466
495d7993O9275N5594j05860o1466J17194N3513j23208l7152J35324L5007j29431
506c9203l2567R9485K867q2549L1410Q2499m5629p0372O1343N5051q7097o1126
518h5888R6533P6064p7849o6669O5105M9544o8309n0700N5045M3179l7197j2642
530a3784M7749n985p2896j111P7882m76q0874J5326J05130q404j17776r507R9698
543C4972m25q3252K8219Q8628l7604p9327M7478N0256q8153m6890J21363O1958
555I7223j20837n2400J19002K8344j34228k5290J28248K1417r5061J7292Q3580
566F7290n6805r1589O6570Q1322p7725o0520J05901O6321j12082p6646Q6121N4572
$$ plain form
578 52730 -22489 -50978 29151 53232 -13899 -26871 20895 1333 -55798 -19422 58278 34699
590 34699 -39895 -18922 50111 20518 -61085 -41414 43486 42379 -20184 -13007 33441 4237
602 4237 -46304 -10944 34010 -9825 -39454 32078 64638 -27926 -75469 14112 59177 -26080
614 -26080 -57152 34604 62835 -21168 -39173 26769 15942 -46864 -9132 58799 8078 -58661
626 -58661 4366 67646 -8304 -76459 -1866 65076 1296 -52209 3565 40248 -11333 -32440
638 -32440 16308 21526 -26147 -13857 41423 20808 -44402 -24625 44990 28257 -43846 -32465
650 -32465 39134 35472 -28381 -27364 24926 17189 -29074 -14657 23317 -3400 -33405 15044 51118
663 51118 -9671 -52337 12200 52070 -21017 -61665 16266 61073 -5434 -37284 21143 29971
$$ packed form
578E2730p5219k8489Q0129K4081o7131j2972M7766j9562n7131L6376P7700k3579
590C4699p4594K0973O9033k9593q1603J9671Q4900j107o2563P177M6448k9204
602D237n0541L5360M4954m3835k9629P1532L2560r2564m7543Q9581M5065q5257
614b6080l1072R1756K8231q4003j8005O5942j0827o2806L7732O7931n0721o6739
626e8661O3027O3280p5950o8155P4593O6942o3780n3505N5774L6683n1581k1107
638c2440M8748N218m7673J2290N5280k0615o5210J9777O9615j6733p2103J1381
650c2465P1599l662o3853J017N2290p737m6263J4417L7974k6717l0005M8449L6074
663E1118o0789m2666O4537L9870p3087m0648P7931M4807o6507l1850N8427Q828
$$ plain form
675 29971 -34229 -29410 33550 14892 -44046 -4261 59361 5269 -67316 -13914 57468 8811
687 8811 -49523 1499 50332 -1980 -43087 2115 24347 -19767 -17205 42927 35022 -34862 -30760
700 -30760 32940 18084 -52014 -35140 44568 43218 -22283 -22390 24704 8758 -37964 -16372 25583
713 25583 1898 -23268 21909 46245 -18468 -53999 12459 49733 -16079 -47118 23313 53199
725 53199 -16812 -46605 8919 22403 -23355 -10233 41389 13634 -42009 -8421 38739 -13156
737 -13156 -61469 5701 68232 13350 -41166 3576 35789 -16635 -42591 7419 25910 -10483
749 -10483 -3525 36793 10083 -44912 -19738 35263 10476 -39734 -9844 42760 15475 -35809
761 -35809 -18579 20118 6518 -14581 8313 22186 -7995 -19569 12213 15455 -24658 -24424 29616
$$ packed form
675B9971o4200M819O2960j8658n8938L9785O3622n4092p2585N3402P1382m8657
687H811n8334N1022M8833n2312m1107M5202K2232m4114K562O0132p905o9884M102
700c0760O3700j4856p0098J6874P9708j350o5501j07M7094j5946m6722K1592M1955
713B5583k3685k5166M5177K4336o4713l5531O6458L7274o5812l1039P0431K9886
725E3199p0011k9793N5524J3484m5758J3122N1622k7755n5643L3588M7160n1895
737a3156m8313O7170O2531n4882n4516M4742L2213n2424k5956N0010J8491l6393
749a0483O958M0318k6710n4995K5174N5001k4787n0210K9890N2604k7285n1284
761c5809J7230L8697j3600k1099K2894J3873l0181j1574L1782L242m0113K34N4040
$$ plain form
774 29616 38243 -15928 -31051 13006 21521 -22197 -27585 13234 18461 -9126 -37 21307 -5855
787 -5855 -31757 3836 30940 -9434 -33560 14430 41454 -6962 -35098 4895 25655 -6713
799 -6713 -14884 13184 7957 -18083 -3070 19762 -7313 -29503 7920 35573 -2047 -32126 -1088
812 -1088 23791 -1888 -19765 1469 13867 716 -816 8084 -2787 -14390 3448 19337 -545
825 -545 -20821 -3765 18942 5963 -16819 -10511 10516 10495 -4906 -9799 -2609 1543 2341 5318
839 5318 2477 -6964 -4342 10476 9344 -11465 -14106 11328 20238 -3665 -18270 -1000 10876
852 10876 371 -6056 1120 661 -3556 3386 4626 -11861 -14040 11129 20387 -4327 -17607 2331
866 2331 13901 -929 -9503 875 6616 2988 3642 607 -11106 -8995 10434 13388 -7206 -13417
$$ packed form
774B9616Q627n4171j5123M4057Q515m3718n388M0819N227k7587R089K1344k7162
787e855k5902L5593K7104m0374k4126M7990K7024m8416k8136L9993K0760l2368
799f713q171K8068n227k6040J5013K2832k7075k2190L7423K7653l7620l0079L1038
812a088K4879k5679j7877K1234J2398j3151j532Q900j0871j1603J7838J5889j9882
825e45k0276J7056K2707j2979k2782O308K1027k1j5401m893P190M152P98K977
839E318k841r441K622J4818j132k0809k641K5434Q910k3903j4605J7270J1876
852A0876j0505o427P176m59m217O942J240j6487k179K5169R258k4714j3280J9938
866B331J1570j4830q574J0378N741l628O54l035j1713K111J9429K954k0594o211
$$ plain form
880 -13417 4077 10818 -4563 -12402 -2494 6951 6814 2273 -3918 -8543 -929 10060 6304 -6154
894 -6154 -5077 7843 9241 -3778 -11456 -3768 7807 8856 -731 -8791 -5448 3709 4645 -3273 -7380
909 -7380 -772 7387 6288 -4032 -10157 -2907 9284 9441 -3099 -7854 1749 8766 2287 -7219 -5411
924 -5411 3099 7632 3677 -5776 -9483 -1607 8055 3927 -7708 -7291 4841 8391 -1140 -8999 -3976
939 -3976 5820 7956 1522 -5759 -4411 3838 7685 619 -7384 -3304 6649 7298 -3420 -10251 -3378
954 -3378 6393 5704 -3762 -7634 -1241 5517 3745 -3379 -6522 -768 7654 6659 -3527 -8281 827
969 827 9194 3877 -6280 -5259 3570 6488 949 -5273 -6393 -387 6613 3375 -7145 -7947 4154
984 4154 8621 -2037 -9229 -2160 5809 5348 830 -2895 -3860 2437 7974 1038 -9596 -3912 9648
$$ packed form
880a3417J7494O741j5381p839R908R445j37m541o191m625P614J0989l756j2458
894f154J077J2920J398j3019p678P688J1575J049r587q060L343R157R36p918m107
909g380O608Q159j099j0320o125P250J2191J57j2540m755R603P017o479r506J808
924e411Q510M533l955r453l707P876R662m128j1635M17J2132L550r531p859N023
939c976R796K136o434p281J348Q249L847p066q003M080R953O49j0718o831O873
954c378R771o89r466l872O393O758j772p124l143N754Q422r95j0186m754R108
969H27Q367n317j0157J021Q829K918n539o222j120O006P000l238j0520q02J2101
984D154M467j0658p192P069P969m61m518l725r65O297N537o936j0634N684J3560
$$ plain form
999 9648 7793 -5816 -7912 417 3219 326 -1752 -3653 -3575 4604 8548 -3404 -12229 -1104 11201
1014 11201 3815 -7079 -2290 6597 4321 -412 -2550 -4864 -2380 6898 7517 -4753 -8561 3083
1028 3083 7788 -3796 -10839 -2638 5798 5749 1475 -3900 -5485 402 4926 -641 -6273 373 9537
1043 9537 6921 -2422 -6565 -4635 1353 6485 2178 -6358 -1820 9375 3652 -12012 -10107 4124
1057 4124 5944 -416 1160 1239 -5162 -1319 7577 -1246 -13119 1349 18954 4374 -15009 -3720
1071 -3720 11383 422 -8616 2037 4743 -5790 -456 10773 -3209 -17153 1466 17422 -2816
1084 -2816 -18638 1969 16639 -419 -9939 2989 4867 -6111 -984 9417 -1711 -9265 7302
1097 7302 15215 -5842 -17592 154 11533 -914 -7651 2100 6300 -650 -3306 -2803 -5397 -3025
$$ packed form
999I648j855j3609k096Q329K802k893k078j901P8Q179L944j1952q825J1125J2305
1014A1201p386j0894M789Q887k276m733k138k314K484R278O19j2270l808J1644
1028C083M705j1584p043Q201Q436m9m274n375j585N887M524n567n632O646R164
1043I537k616r343m143J930N988N132m307q536M538J1195n723j5664J905J4231
1057D124J820o360J576P9o401L843Q896q823j1873J4468J7605j4580j9383J1289
1071c720J5103j0961r038J0653K706j0533N334J1229j3982j3944J8619J5956k0238
1084b816j5822K0607J4670j7058r520J2928J878j0978N127J0401j1128p554J6567
1097G302P913k1057j1750J7746J1379j2447o737R751M200o950k656N03k594K372
$$ plain form
1111 -3025 6323 8465 112 -5761 -1170 4823 2030 -6609 -6086 6781 12585 -432 -10439 -1728
1125 -1728 5337 -2758 -5904 3097 2650 -5554 1980 10705 -5389 -17605 4089 18931 -4969 -18564
1139 -18564 7277 19707 -5235 -13272 7767 6701 -13074 -2251 17399 -1137 -18017 8398
1151 8398 22634 -12616 -28709 7041 22008 -8450 -15243 14076 13752 -13520 -9359 10068 -3366
1164 -3366 -15430 10814 24638 -5447 -20505 7333 15983 -13362 -19340 10515 19043 -2087 -7428
1177 -7428 3724 -1614 -12744 -3557 8967 1097 -5632 7062 13449 -4172 -18821 -6002 11406
1190 11406 5802 -5933 1330 14037 5152 -12146 -8732 3432 -1848 -6808 9348 16386 -5493
1203 -5493 -15563 5843 9723 -17805 -17684 18149 22063 -10682 -12225 13364 3183 -23111 -4039
$$ packed form
1111c025R348K142q353n873M591N993k793q639N23J2867N804j3017j0007Q711
1125a728P065q095l146R001m47q204P534Q725j6094j2216K1694J4842k3900j3595
1139a8564K5841J2430k4942q037K1039j066j9775J0823J9650j8536j6880K6415
1151H398J4236l5250j6093L5750J4967l0458o793K9319l24k7272M161J9427j3434
1164c366j2064K6244J3824l0085j5058K7838Q650k9345n978K9855Q528k1130n341
1177g428J1152n338j1130R187J2524p870o729J2694O387j7621j4649J2819J7408
1190A1406n604j1735P263J2707q885j7298L414J2164n280m960J6156P038k1879
1203e493j0070K1406L880k7528J21L5833L914l2745j543K5589j0181k6294J9072
$$ plain form
1216 -4039 23000 2485 -15433 12642 22947 -18875 -31746 11234 23484 -12972 -13969 23081
1228 23081 16647 -21939 -15496 12228 -1971 -19044 9717 27623 -5544 -22067 9071 18675
1240 18675 -16403 -22101 14680 22855 -7250 -12187 8782 5917 -12468 -5207 10840 1620 -9850
1253 -9850 3705 13757 -5239 -19561 -1662 16011 2006 -13606 438 17203 4595 -14382
1265 -14382 -6226 8095 -611 -8948 5725 14339 -3408 -9966 9941 9583 -18757 -18447 15677 17393
1279 17393 -14715 -12425 18383 10604 -20260 -9886 16612 2589 -16005 6740 20659 -9527
1291 -9527 -21952 11360 20496 -13459 -17106 19023 18610 -16994 -16293 12095 5548 -15911 -1082
1304 -1082 18449 -46 -15833 4733 14814 -10378 -19089 7962 17879 -4839 -12524 7524 12191
$$ packed form
1216d039K7039k0515j7918K8075J0305m1822j2871M2980J2250l6456r97L7050
1228B3081o434l8586O443K7724j4199j7073K8761J7906l3167j6523L1138R604
1240A8675l5078n698L6781Q175l0105m937K0969k865j8385P261J6047r220j1470
1253i850J3555J0052j8996j4322J7899J7673j4005j5612J4044J6765j2608j8977
1265a4382Q156J4321q706q337J4673Q614j7747o558J9907l58k8340L10L4124J716
1279A7393l2108K290L0808p779l0864J0374K6498j4023j8594K2745J3919l0186
1291i527j2425L3312R136l3955l647L6129m13l5604P01K8388o547k1459J4829
1304a082J9531j8495j5787K0566J0081k5192q711K7051R917k2718p685K0048M667
$$ plain form
1317 12191 -5303 -8988 3936 4821 -5641 -2570 7312 1865 -8911 -2295 10542 3365 -12255
1330 -12255 -6160 11664 6697 -11711 -8227 10271 7125 -9190 -3906 10427 2459 -9222 2769
1343 2769 11052 -6613 -14241 8071 14950 -9477 -14695 11741 15216 -11305 -14365 8909 8098 -11484
1357 -11484 -5003 12223 1852 -11890 2983 14162 -5256 -15359 6192 15972 -5337 -13765
1369 -13765 5947 12295 -4933 -9102 4544 5682 -5320 -2861 6065 272 -8818 -980 8943 484
1383 484 -9891 -1669 10328 3968 -8632 -4740 6766 4462 -5380 -3255 5541 2350 -4445 465
1397 465 5574 -3250 -8243 4126 9348 -5595 -11375 5163 11509 -5612 -11501 4844 9462 -4971
1411 -4971 -6596 6525 4272 -7633 -1173 9775 -647 -11279 2143 12983 -1821 -12897 1259
$$ packed form
1317A2191j7494l685J2924Q85j0462L071R882n447j0776O616J2837p177j5620
1330a2255O095J7824m967j8408L484J8498l146j6315N284J4333p968j1681J1991
1343B769Q283j7665p628K2312O879k4427n218K6436L475k6521l060K3274q11j9582
1357a1484O481J7226j0371j3742J4873J1179j9418j0103K1551R780k1309q428
1369a3765J9712O348j7228m169J3646J138j1002K459Q926n793r090P838R923q459
1383D84j0375Q222J1997o360j2600L892J1506k304r842K125Q796l191o795M910
1397D65N109q824m993J2369N222j4943n780J6538O346j7121n889J6345M618j4433
1411d971j625J3121k253j1905O460J0948j0422j0632J3422J0840j4804j1076J4156
$$ plain form
1424 1259 11136 -2388 -10222 1720 7124 -2832 -4534 4072 2556 -6481 -1467 7752 1790 -8328
1438 -8328 -1822 8788 3183 -7643 -3327 7084 4369 -4555 -3055 3369 1063 -3871 -505 3222
1452 3222 -1844 -4231 2892 5331 -3759 -7737 3036 8434 -2473 -7842 2206 7734 -1611 -5565
1466 -5565 2743 4586 -2861 -2021 4835 712 -7133 -683 7844 548 -8960 -981 8113 804 -8212
1481 -8212 -1726 6273 1078 -4308 638 3402 -2008 -2188 3967 2854 -4710 -2666 5911 3938 -5903
1496 -5903 -4700 4793 4589 -3455 -4089 2192 2472 -2531 -2111 2033 -361 -3023 1203 4015 -1659 -5372
1512 -5372 1767 6485 -423 -5903 657 6265 110 -5037 -87 3728 -303 -2507 1570 1162 -3703
1527 -3703 -1967 4258 1681 -5380 -2239 5520 2759 -5413 -3479 4731 3525 -3139 -2053 3140 963
$$ packed form
1424A259R877j3524p834J1942N404r956j702Q606j516r037N014R219n962j0118
1438h328O506J0610n605j0826M316J0411k715q924J500O424k306m934L366L727
1452C222n066k387P123K439r090l978J0773N398j0907n369J0048N528r345l954
1466e565Q308J843p447Q40O856m123p845O450Q527p296r508P979R094p309r016
1481h212O486P999n195n386M946K764n410j80O155j113p564K044Q577j973r841
1496e903J203R493k04q044o34O281K80n003M20M144k394k662M226K812n674l713
1512e372P139M718o908n480O560N608o155n147M950L815m031k204M077m08m865
1527c703J736O225k577p061L141P759k761q172J934Q210j206o664J086N193k177
$$ plain form
1542 963 -2652 298 2942 -1631 -3396 2962 4451 -3303 -5863 2399 5297 -2523 -5653 2248 4865
1557 4865 -1864 -3662 1862 2256 -2910 -381 4443 529 -4875 522 6062 -503 -6449 275 6069
1572 6069 346 -5200 -78 3670 -1117 -3067 1036 1369 -2772 -1043 3672 1169 -4495 -1305 4669
1587 4669 1914 -4324 -2079 4160 2628 -2467 -1508 1746 617 -1894 -187 1682 -900 -2135 1642
1602 1642 2662 -2792 -4347 1333 4088 -1214 -3993 1864 4096 -1143 -3413 857 2059 -1681 -151
1617 -151 3752 688 -3863 -137 3899 -1301 -5588 833 5567 -258 -4018 472 2425 -2326 -2695
1632 -2695 1698 1297 -2372 830 4026 -611 -4492 67 3671 -87 -2649 1657 3065 -252 -1884
1647 -1884 -49 -628 -1654 451 1952 -215 -1182 1037 1276 -1495 -2312 -504 1087 1448 1090 191 -87
$$ packed form
1542I63l615K950K644m573j765O358J489p754k560Q262K898p820l130P901K617
1557D865o729j798N524L94n166K529M824l914n404N397N540o565n946O724N794
1572F069n723n546N122L748m787j950M103L33m141J729M715k503n664L190N974
1587D669k755o238K245O239j532n095R59L254j129k511J707J869k582j235L777
1602A642J020n454j555N680K755n302k779N857K232n239k270M270J202l740J530
1617a51L903l064m551L726M036n200m287O421M734n825l760M490J953m751l69
1632b695M393m01l669L202L196m637l881M559L604l758k562M306J408l317j632
1647a884J835n79j026K105J501k167r67K219K39k771q17J808J591L61l58q99k78
$$ plain form
1664 -87 574 -31 -1673 -1359 1471 1654 967 498 -379 -1808 -1081 343 -506 -1504 801 3383 634 -2550
1682 -2550 -1517 191 -1008 -739 2086 1896 -195 668 1447 -1987 -3520 414 3018 338 -996 2058
1698 2058 1534 -2543 -2349 150 -849 -903 2561 3120 -1420 -2522 1116 574 -3138 -1420 3072 2381 -308
1715 -308 1212 931 -2499 -2191 1613 1122 -1645 821 3698 763 -3187 -1681 524 -1081 -606 1872
1731 1872 1505 -673 397 998 -2279 -2930 718 2772 432 260 1865 198 -1681 -775 -408 -1379 -150
1748 -150 2988 1321 -1568 -1062 661 -1641 -2474 520 1924 271 168 1931 -368 -3143 -594 2012
1764 2012 -200 -1273 2506 2969 -1084 -2059 331 -299 -2047 514 2690 356 -1288 724 800 -2601
1780 -2601 -2426 1062 1478 -332 618 1296 -348 -1246 -35 -384 -984 554 2194 744 -759 160 -602
$$ packed form
1664h7O61o05j642L14K830J83o87m69q77j429P27J424q49r98K305K582k749l184
1682b550J033J708j199K69K825j90k091Q63P79l434j533L934K604k680j334L054
1698B058n24m077J94K499r99n4L464N59m540j102L638n42l712J718M492o91k689
1715c08J520k81l430L08L804m91k767K466K877k935l950J506K205j605M75K478
1731A872l67k178J070O01l277o51L648K054k340j72J605j667j879R06L67r71J229
1748a50L138j667k889N06J723k302q33K994J404j653j03J763k299k775K549K606
1764B012k212j073L779M63m053r75K390o30j748K561K176k334j644K012P6l401
1780b601J75L488M16j810R50O78j644q98J211l49o00J538J640j450j503R19p62
$$ plain form
1797 -602 -1629 -448 787 -495 -307 2140 968 -2601 -1965 1399 -2 -2015 938 3139 -222 -1929
1813 -1929 1332 1178 -3070 -1594 3518 1874 -2579 34 3441 -986 -4582 -180 2757 -1221 -1983
1828 -1983 2676 2177 -3142 -2424 2103 483 -2937 185 4019 633 -2588 183 1910 -1578 -2147 1500
1844 1500 2180 -720 -708 1467 94 -1944 -1443 830 805 -348 -410 579 468 -797 -1295 74 881 50
1862 50 -492 1212 1493 -1032 -1448 1320 1308 -2206 -1232 2748 1238 -2614 -771 2602 -149 -3637 135
1879 135 2844 -1069 -2498 2147 2447 -2742 -2889 2839 1943 -2855 -823 4045 976 -3795 -525 2907
1895 2907 -955 -2842 1970 3099 -1801 -2658 1673 1176 -3311 -1484 2833 1479 -1881 -698 1672
1910 1672 -151 -1842 318 2070 215 -774 747 1078 -835 -1604 612 1545 -19 -1294 -273 924
$$ packed form
1797f02j027J181J235j282J88K447j172l569O36L364j401k013K953K201l361j707
1813a929L261j54m248J476N112j644m453K613L407m427l596M402K937l978p62
1828a983M659m99n319P18M527j620l420L122L834l386l221K771J727l488n69L647
1844A500O80k900J2K175j373k038N01K273k5j153o2R89j11j265m98J369Q07q31
1862E0n42J704K81k525m16K768j2l514R74L980j510l852J843L373k751l488L772
1879A35K709l913j429M645L00n189j47N728q96m798K032M868l069m771L270L432
1895B907l862j887M812J129m900q57M331m97m487J827M317j354l360J183K370
1910A672j823j691K160J752j855r89J521L31j913p69K216R33j564j275J021J197
$$ plain form
1926 924 -17 -1531 -154 1221 396 -1321 57 1135 -872 -1232 1130 1723 -1204 -1763 2025 1629 -2225
1943 -2225 -1588 2132 1402 -1781 -777 1683 -216 -2219 554 2138 -1143 -2180 1480 1533 -1760 -1660
1959 -1660 1791 1823 -1407 -1058 1520 421 -1382 212 1353 -153 -941 707 1176 -1126 -1673 672
1975 672 1047 -802 -1191 160 530 -7 -563 30 385 -7 -235 436 391 -189 -81 740 906 -469 -445 851
1995 851 1057 -857 -1314 556 1043 -791 -754 566 441 -536 -212 955 -434 -1328 419 1393 -241 -1180
2013 -1180 660 1366 -245 -1187 343 677 -600 -692 428 62 -952 207 770 -278 -1142 3 1052
2030 1052 -278 -1344 -101 881 513 -231 -76 399 326 75 85 -11 -352 191 842 -93 -611 -491 609
2049 609 423 -530 -1315 181 461 -389 -906 -233 727 119 339 435 -395 -640 242 702 -374 -1053 320
$$ packed form
1926I24r41j514J377J375q25j717J378J078k007l60K362N93k927n59L788l96l854
1943b225O37L720p30l183J004K460j899k003K773J584l281j037L660N3l293J00
1959a660L451L2l230L49K578j099j803J594J141j506p88J648M69k302n47K345
1975F72L75j849l89J351L70n37n56N93L55l92k28O71m5n80J08Q21J66j375K4J296
1995H51K06j914m57J870M87j834L7J320j25r77L24J167j389q94J747R74j634r39
2013a180J840P06j611r42J530L34j277r2J120l66j014J159N63j048q64J145J049
2030A052j330j066J243R82l68p44J55M75p3k51J0r6l41N43O51r35n18J20J100
2049F09j86r53p85J496K80q50n17O73R60o08K20R6q30k45Q82M60j076o79J373
$$ plain form
2068 320 1225 -337 -1137 -173 954 321 -447 -278 -411 -288 -186 406 -199 -612 286 555 192 -1025 -149
2087 -149 837 658 -327 -313 399 481 160 -75 -420 -434 160 525 -145 -1033 -247 645 562 -548 -757 432 481
2108 481 -146 -524 -297 126 498 283 50 -477 64 546 248 -929 -812 379 620 138 -790 -345 683
2127 683 409 -280 -417 -319 189 425 27 -187 -476 529 777 153 -655 -264 886 620 -602 -614 127 566
2147 566 -33 -383 -56 -350 85 28 -230 -954 -77 984 553 -846 -621 447 617 -196 -311 -54 222
2166 222 443 434 -201 -838 26 790 257 -948 -425 677 558 -486 -835 348 543 359 -61 -303 -238 248
2186 248 871 139 -630 -302 837 708 -606 -730 -109 648 153 -563 -608 140 363 -137 -383 -700 -320 326
2206 326 563 -454 -772 239 998 107 -890 -111 581 453 16 -288 -28 -169 334 380 -402 -832 375
$$ packed form
2068C20R05j562q00R64J127o33p68J69j33J23J02N92o05m13Q98K69l63j217Q76
2087a49R86j79r85J4P12Q2l21k35l45j4N94L65o70q88P86Q92q3j110k09J189M9
2108D81o27l78K27M23L72k15k33n27N41M82k98j177J17J191K41m82r28M45J028
2127F83k74o89j37R8N08K36l98k14k89J005K48o24q08L91J150k66j222j2P41M39
2147E66n99l50L27k94M35n7k58p24Q77J061m31j399K25J068J70q13j15K57K76
2166B22K21ro35o37Q64P64n33j205N23J102j19j044l49J183J95j84m20k42O5M86
2186B48O23p32p69L28J139j29j314j24O21P57m95p16m5P48K23n00k46l17L80O46
2206C26K37j017l18J011P59q91r97P79O92j28m37l04K60j41N03M6p82m30J207
$$ plain form
2225 375 1156 9 -1403 -360 972 149 -658 -182 477 196 73 322 -128 -723 265 1140 -93 -1092
2243 -1092 111 1489 -91 -1130 -602 313 106 78 70 -63 -497 343 586 -498 -1017 284 1381 388
2261 388 -1053 -190 752 597 -461 -269 360 426 300 97 -421 -767 -436 720 419 -527 -380 726 569
2280 569 -1043 -1171 52 939 75 -187 15 -50 -243 30 243 -495 -419 953 1374 -660 -1393 231 963
2299 963 -584 -950 239 622 -121 -209 230 -399 -901 428 854 -409 -772 738 1499 -538 -1496 129
2317 129 948 -207 -438 385 278 -569 -376 277 -881 -1126 412 1603 -140 -1279 147 1008 8
2334 8 -1034 -176 570 495 328 1 -567 -464 243 417 -420 -530 383 1236 247 -1142 -1119 216 541 -267
2354 -267 -444 256 654 103 79 -340 -456 -193 1078 756 -498 -1004 795 1227 -715 -1144 364 1192 -159
$$ packed form
2225C75P81j147j412J043J332q23q07M76O59k81j23K49m50n95R88Q75j233r99
2243a092J203J378j580j039N28R15k07k8qj33m34Q40K43j084n19J301J097r93
2261C88j441Q63R42j55j058J92O29O6j26k03n18l46L31J156l01r46J47J106j57
2280E69j612j28J223Q87q64k62K02o5j93K73K13p38P6J372M21k034p33J624P32
2299I63j547l66J189L83p43q8M39o29n02J329M26j263l63J510P61k037r58J625
2317A29Q19j155k31Q23j07q47J93O53j158k45J538J191j743j139J426Q61j000
2334Hj042Q58P46p5j67l27n68J03P07J74q37j10R13Q53r89j389K3J335L25q08
2354b67j77P00L98n51k4m19j16K63J271l22j254n06J799M32j942m29J508Q28j351
$$ plain form
2373 -159 -492 252 85 -326 389 421 -935 -697 957 1151 -627 -1023 414 805 -430 -629 194 646 -82
2392 -82 8 186 -695 -448 406 609 -676 -870 691 826 -613 -957 -373 231 333 192 -372 -152 409 391
2412 391 -207 -573 -394 320 715 -97 -502 -243 247 428 -285 -887 116 934 626 -602 -473 175 170 -86
2432 -86 -9 -368 19 689 672 -433 -802 271 647 -26 -621 -19 585 131 -345 -142 -219 -369 431 475 -352
2453 -352 -549 432 679 -213 -1167 -99 645 549 -2 -327 -202 203 432 -225 -752 -12 798 470 -234 -511
2473 -511 -295 204 179 -278 -463 -89 727 536 -663 -681 663 461 99 -198 119 367 162 133 -121 -547
2493 -547 -44 788 280 -824 -510 718 523 -365 -512 198 302 233 319 -169 -245 111 669 25 -681 107
2513 107 444 702 -131 -771 245 718 61 -413 -277 248 381 73 -575 -302 -262 226 534 -101 -713 87
$$ packed form
2373a59l33P44j67m11P15L2j356K38J654J94j778l96J437L91j235j99Q23M52p28
2392h2R0J78q81K47Q54K03j285j94J561J35j439l44N84O04J02j41n64K20N61j8
2412C91n98l66J79P14L95q12m05K59M90J81p13o02J003Q18l08j228J29O48nk56
2432h6P7l59L87O70j7j105l69J073L76o73n95O02O04m54m76K03p7j50Q00M4q27
2453c52j97R81K47q92r54J068P44r6n51l25J25M05K29o57n27P40Q10l28p04k77
2473e11K16M99k5m57j85L74Q16j91j199j8J344k02l62k97L17K48k05k9k54m26
2493e47N03Q32n08j104L14J228j95q88j47P10J04o9Q6m88p6L56N58o44p06P88
2513A07L37K58q33o40J016M73o57m74J36N25J33l08o48K73M0M88L08o35o12Q00
$$ plain form
2533 87 502 144 -740 -253 649 632 76 -269 89 55 3 -186 -157 -184 -132 378 124 -680 -616 660 512 -506
2555 -506 -727 200 573 -160 -190 101 127 -33 273 289 -415 -323 303 416 -579 -1001 151 732 7 -576 -176
2576 -176 154 338 -149 -239 -27 -278 332 368 -192 -392 296 621 145 -529 -300 544 511 -419 -500 -85 356
2597 356 129 -103 -109 -282 4 286 -27 -455 -207 495 406 -371 -492 264 556 -14 -477 -184 271 63 -11
2618 -11 -151 -367 -257 320 327 -458 -749 314 608 -64 -734 -73 518 396 -294 -253 168 -96 280 274 -51 -527
2640 -527 89 695 121 -1048 -198 654 318 -616 -426 475 276 94 -306 -168 -220 -39 618 164 -705 -109
2660 -109 621 387 -363 -424 227 510 -34 -261 55 123 184 76 -87 -261 169 756 197 -474 -552 543 417
2681 417 -158 -654 89 587 105 -376 -328 -94 200 132 -120 -261 -184 219 492 -156 -651 84 310 110 -541
$$ packed form
2533H7M15l58q84M87R02j7n56l45L58l4n2j89K9k7N2N10k54q04O4J276j48j018
2555e06k21R27L73p33l0K91K6j60L06J6p04R2O26J13r95m22J152N81p25n83M00
2576a76L30J84m87r0K12k51O10L6n60k00O88L25m76o74K29Q44l3r30q1M15M41
2597C56k27k32oj73K86K82l13m28K48P02q9p77j21P56K92n70m63K93M55k08p4
2618a1j40k16J10N77Pp85k91J063K94o72o70O61N91j22o90M1M21k64L76ol25m76
2640e27O16O06n74j169Q50Q52l36r34J90R01j99j82m00J38n2J81O57m54q69N96
2660a09P30k34p50o1O51K83n44k27L16O8O1j08j63j74M30N87n59o71p8J095j26
2681D17n75m96P43M98m82m81M8K34K94o8k52j41P7M03K73o48m95P35K26k00o51
$$ plain form
2702 -541 80 276 575 -102 -176 -472 -98 120 201 -53 -398 173 486 -115 -546 -89 467 156 -234 -379 -78
2723 -78 -75 89 -22 -528 87 435 781 119 -416 -384 226 200 -52 -95 262 294 90 -484 -802 -255 317 499
2745 499 7 -149 -81 343 38 -699 -496 335 542 267 -95 -120 126 54 -53 -228 -201 279 827 199 -457
2766 -457 -411 233 220 -276 -187 304 366 359 64 -552 -461 -10 265 213 -137 269 590 154 -437 -537 -280 367 329
2789 329 44 -38 70 -50 -79 -423 -351 117 633 267 72 -302 -196 -118 -362 -122 -204 482 551 -235 -642 -449
2811 -449 140 20 -144 162 28 170 180 82 -801 -625 74 562 21 -395 110 699 90 -500 -130 -110 61
2832 61 302 349 -267 -299 277 60 -413 -545 109 775 444 -371 -195 164 -129 -115 -357 157 110 350 275 -179
2854 -179 -308 -130 250 294 -233 -287 750 656 -115 -926 -154 119 -146 -200 321 282 -81 -77 173 -358 -922 49
$$ packed form
2702e41O21J96K99o77p4k96L74K18Q1k54l45N71L13o01m31M57N56l11l90j45L01
2723g8LJ64j11n06O15L48L46o62n35L2O10k6k52m3L57L2k04n74l18N47N72J82
2745D99m92j56O8M24l05p37K03Q31K07k75l62k5K46p2j07j75K7M80N48o28o56
2766d57M6O44j3m96Q9M91O2pk95o16R1M51K75n2l50M06L21m36n91j00K57O47l8
2789C29k85q2J08j20k9l44P2M68N16l66j95l74J06P8k44K40q2O86O9p86m07J93
2811d49N89j20j64L06j34J42J0r8q83J76O99M88n41m16N05N89o09n90L70K0J71
2832F1K41M7o16l2N76k17m73j32O54O66l31q15J76L59k93J4k42N14m7K40p5m54
2854a79j29J78L80M4n27n4J037r4p71q11P72K73k65n4N21l9l63MK50n31n64R71
$$ plain form
2876 49 869 -10 -592 500 889 -215 -1059 -150 380 -118 64 608 -171 -742 31 597 -438 -996 211
2895 211 1012 33 -973 -302 382 -345 -801 98 611 51 342 701 -223 -1065 -323 852 187 -615 215
2914 215 766 178 -939 -716 -190 -32 -95 206 348 17 -413 -171 137 -681 -589 673 1128 79 -751 315
2934 315 439 -517 -806 403 745 128 35 452 -389 -1089 -263 746 -135 -853 774 1263 -347 -1357 -187
2953 -187 672 -333 -429 816 806 -527 -496 148 -355 -732 189 1518 54 -890 110 659 -502 -930 66
2972 66 695 -51 -63 556 -215 -552 -42 425 -207 -383 230 854 55 -550 -387 229 -162 -133 -39 224 163 105
2994 105 -294 -132 -481 -203 311 538 -75 -425 313 590 -203 -751 211 512 235 -258 39 198 -309 -201
3014 -201 95 -137 -170 59 829 -76 -758 -47 701 -15 -453 673 521 -193 -71 140 50 -416 371 733
$$ packed form
2876D9Q20q79n82J092L89j104q44R09N30m98J82N44p79n71P73N66j035n58J207
2895B11Q01r79j006O71O84p27m56Q99N13n60K91L59r24q42P42J175o65q02Q30
2914B15N51n88j117K23N26J58o3L01J42l31m30K42L08q18R2J262M55j049q30J066
2934C15J24r56k89J209L42o17r3M17q41p00Q26J009q81p18J627M89j610j010J170
2953a87Q59j005r6J245j0j333L1O44n03l77R21J329j464r44J000N49j161m28R96
2972F6O29p46j2O19p71l37N10M67o32j76O13O24p99o05J63O16l91K9R4K63o1n8
2994A05l99J62l49K78N14K27o13l50P38K77p93n48R62L01k77m93K97J59n07J08
3014b01K96k32l3K29P70r05o82P11P48p16m38J126j52p14J22K11r0m66P87L62
$$ plain form
3034 733 -41 -446 92 626 -146 -526 96 254 -218 -284 183 -16 -305 300 129 -255 -119 -35 310 -98 -141
3055 -141 -224 -17 85 -126 2 25 147 408 -163 -518 -145 227 -119 -97 -123 12 -56 160 -43 -258 58 406
3077 406 315 -534 -52 235 123 233 16 164 -148 -192 72 -345 -364 277 273 -129 -219 17 169 -101 -219 36
3099 36 179 46 475 107 -291 -330 281 452 -192 -142 286 17 -239 -80 174 160 105 464 10 -599 -145 221
3121 221 82 -417 89 256 -199 -233 -26 66 -253 128 329 -11 -445 132 270 -132 -142 -83 118 -107 -79 -32
3143 -32 -44 -122 270 59 -7 -263 175 11 -256 -216 116 326 27 140 -192 -346 -99 352 -61 -69 85 -16
3165 -16 -17 -48 -85 79 0 106 137 -175 -125 208 118 -298 140 533 377 -122 -43 126 -44 -431 -34 63 -167 -96
3189 -96 327 256 -231 -96 165 -71 -455 -70 348 69 -160 102 313 35 -107 262 -38 -26 120 -54 -68
$$ packed form
3034G33p74m05N38N34p72l80O22J58m72o6M67j99k89O05j71l84J36Q4L45m08m3
3055a41q3K07J02k11J28K3J22K61n71l55L73L72l46K2k6J35o8K16k03k15L16L48
3077D06r1q49M82K87j12J10k17J48l12m4K64m17j9O41mm02r0K36J52k70j18K55
3099C6J43j33M29l68l98l9O11J71o44N0M28k69k56J59K54j4n5L59m54o09M54L66
3121B21j39m99N06J67m55l4K07R2l19L81K01l40m34N77J38m02j0N9K01k25K8M7
3143c2j2p8L92k11o6k56M38j64k67M0L32K10k99J13l32j54K47M51m13qJ54j01
3165a6jl1l7J64p9J06L1l12N0L33r0m16M38L93j56m99P9J69j70l87L97R7k30P1
3189i6M23p1m87J35K61k36l84L85M18k79k29K62K11k78j42L69l00J2J46j74j4
$$ plain form
3210 -68 259 -190 154 -109 -67 -128 -206 -113 -228 -138 -178 -104 133 -30 173 125 170 76 8 283 -150 -201 152 105 -232
3235 -232 -46 -52 139 -60 -176 -43 -152 220 -237 249 17 27 32 222 227 90 102 -27 123 39 -46 -71 41 131
3259 131 12 -15 -44 65 -197 -128 -51 -214 -154 124 9 -339 -30 144 -79 -182 58 215 44 70 139 199 69
3282 69 -176 8 141 66 -489 -47 196 -297 -248 275 162 -159 -58 361 26 -222 -258 26 146 20 167
3303 167 714 32 -378 -56 85 -362 -294 135 403 -55 -157 339 106 -495 -469 499 80 -432 -86 599 227
3324 227 -207 -5 529 -33 -167 130 200 -103 -262 84 487 -246 -558 -29 311 -165 -280 57 232 -317
3344 -317 -363 145 186 -183 200 556 131 -506 165 394 229 -432 149 500 -97 -443 -119 243 -403 -355 210
3365 210 349 -378 -276 298 178 -565 -225 785 594 -220 -148 610 131 -708 -242 651 175 -400 421 391
$$ packed form
3210f8L27m49L44k63M2o1p8R3j15R0m0P4K37j63K03m8M5r4o8K75m33n1L53m7l37
3235b32J86oJ91j99j16J33j09L72m57M86k32J0NJ90Nj37J2j29J50q4q5k5J12R0
3259A31j19k7k9J09k62O9P7j63O0K78j15l48L09J74k23j03K40J57j71K6O9O0j30
3282F9k45J84J33p5n55M42K43m93M9N23j13l21J01M19l35k48l6K84J20j26J47
3303A67N47o82m10L22J41m47O8M29K68m58j02M96k33o01K6R68m19n12L46O85l72
3324B27m34K02N34n62j34K97P0l03j59L46M03p33l12N29L40m76j15L37J75n49
3344c17m6N08M1l69L83L56m25o37O71K29j65o61N81L51n97l46L24L62o46M8N65
3365B10J39p27J02N74j20p43L40J010j91q14P2P58m79q39M66Q93m76n75Q21l0
$$ plain form
3385 391 -320 -1224 77 496 -308 -263 767 666 -419 -672 151 136 -627 125 643 298 -143 298 405 -358
3405 -358 -873 86 851 26 -184 299 145 -292 -715 -37 349 -138 162 388 142 -264 -198 5 1 -208 -82
3426 -82 834 494 -458 -236 235 -189 -309 -99 585 179 -264 -54 28 -736 -576 183 640 -368 -262 456
3446 456 261 -547 -688 311 653 -128 93 554 -230 -346 82 190 -259 -325 495 844 -68 -501 199 214 -308
3467 -308 -275 112 267 48 145 14 -364 -297 -72 286 46 49 488 646 -215 -561 -363 176 180 219 -14 254 184
3490 184 -145 -301 -168 -145 330 181 109 -82 -444 277 331 -41 -368 356 350 315 -274 -95 -105 -274 32 81 -46
3513 -46 -211 203 287 -272 -637 -60 526 -145 -67 280 204 396 -18 14 -104 4 185 1 -204 12 25 268
3535 268 115 -466 -394 75 345 68 -268 -282 119 101 -190 80 -85 286 205 434 -336 -88 284 521 17
$$ packed form
3385C91p11r04J301M19q04M5J030j01j085k53Q23j5p63P52N18l45m41M41J07p63
3405c58n15R59P65q25k10M83j54m37m23O78L86m87L00K26k46m06O6K03mk09J26
3426h2R16l40r52K22M71m24j20K10O84m06m43K10Q2p64J60P59M57j008J06P18
3446D56j95q08j41R99L42p81K21M61p84j16M28J08m49o6Q20L49r12m33P00J5n22
3467c08L3L87J55k19R7j31l78O7K25L58k40LM39J58q61l46J98N39ML9k33K68p0
3490A84l29j56J33K3M75j49p2j91l62P21N4l72l27P24ol5n89J79j0j69L06M9j27
3513d6j65M14Q4n59l65N77N86o71P8L47p6J92m14L2j18J08J81j84k05K16J3K43
3535B68j53n81P2M69K70k77l36j4M01j8k91K70j65L71q1K29p70K48L72K37n04
$$ plain form
3556 17 -213 -85 383 237 -301 -315 -105 106 -85 -61 -108 -28 145 140 141 -368 -127 331 292 -335 -341 351 108 29
3580 29 -289 -61 -80 257 246 -51 -229 -86 337 -52 -392 -37 127 639 6 -300 -92 318 200 -17 -352
3601 -352 62 444 144 52 -249 -121 80 424 -187 -228 -26 252 165 -317 -323 70 243 -231 53 53 -25 203 -54
3624 -54 290 -154 -42 427 244 -348 -386 260 74 -115 -150 -161 103 165 4 -316 -191 70 243 48 -387 -57
3646 -57 314 544 -72 -169 220 306 130 42 -166 -23 62 227 -239 -524 72 154 104 -445 -333 1 251 -3
3668 -3 -288 -175 -49 238 129 26 -13 484 254 242 -252 -301 229 396 242 -475 -219 106 335 -150 -282 -40
3690 -40 153 189 -115 -397 -72 146 335 -59 -300 -84 271 158 83 -347 -168 298 159 -249 -414 -34 321
3711 321 294 -157 -457 99 344 -71 -514 -186 71 164 152 -20 -251 110 279 -45 -225 -245 172 487 146
$$ packed form
3556A7k30J28M68j46n38j4K10K11j91K4m7Q0J73nJn09K41M58l9o27oO92k43p9
3580B9l18K28j9L37j1k97j78J43M23l89l40L55J64N12o33l06K08M10j18k17l35
3601c52M14L82l00r2l01J28K01L44o11m1K02K78q7m82oL93J73m74K84%p8K28k57
3624e4L44m44J12M69j83n92l8O46j86j89l5j1K64O2j61l20J25K61J73j95m35L30
3646e7L71K30o16r7L89Q6j76q8k08J43Q5J65m66k85N96Q2n0n49J12L34K50k54
3668ck85J13J26K87j09j03l9M97k30j2m94m9N30J67j54p17K56L25K29m85j32K42
3690d0J93L6l04k82L25K18J89l94k41K16L55j13p5m30J79M66j39m08j65L80L55
3711C21k7m51l00N56K45m15m43L28K57R3j2j72k31L61J69l24j80k0M17L15l41
$$ plain form
3732 146 -272 -306 344 315 43 -437 -174 58 201 -83 -331 -203 127 414 74 -293 -21 230 384 -165 -317
3753 -317 85 571 243 -503 -118 -154 195 192 -314 -252 -3 306 170 -215 -293 143 533 -16 -388 -20 303 429
3775 429 -172 -255 -28 172 186 148 -156 -201 78 120 130 -507 -559 -38 340 -295 -418 -177 284 101 -268 -158
3797 -158 304 302 472 102 -277 -269 184 236 -126 -588 296 313 199 -356 -362 -64 250 -142 -173 -214 45 369 115
3820 115 -28 -247 90 645 212 -434 -263 633 552 -563 -259 -5 70 56 -86 -12 -344 243 387 -98 -137
3841 -137 -320 274 358 -550 -331 347 448 109 -279 -73 84 203 259 10 -394 -484 103 55 -337 -562 -55
3862 -55 521 169 -515 -343 315 -39 -286 -157 238 304 127 298 -153 -310 153 640 272 -571 -291 391 173
3883 173 -572 -890 168 478 165 -223 -149 -112 -188 157 143 -59 -66 540 807 -111 -685 -183 104 226 -434 -262
$$ packed form
3732A46m18l4O50k9k72m80K63K32J43k84k48J28L30K87l40l67K72K51J54n49j52
3753c17M02M86l28p46L85l6L49ln06O2K49L09j36l85p8M36L90n49l72L68L23J26
3775D29o01q3K27K00J4l8l04m5K79M2J0o37n2N21L78o35j23K41M61j83l69J10
3797a58M62kJ70l70l79QM53N2l62m62Q84J7j14n55oK98L14l92l1m1K59L24k54
3820A15j43k19L37N55m33o46J71Q96q1j115L04K54P5j4j42P4l32N87J44m85l9
3841a37j83N94Q4r08K19O78J01l39l88K06J57J19N6k49m04r0N87m8l92k25N07
3862e5N76l52o84J72O58l54k47J29L95O6j77J71m51j57M63M87l68q43K80O82k18
3883A73p45l18J058L10l13l88P4L7p6L45j4k02pO06K67r18n74N02K87J22o60J72
$$ plain form
3905 -262 332 357 41 -278 -312 -256 -135 205 -80 -438 66 489 -11 -562 -633 592 597 -141 36 138 302 -11
3927 -11 -100 -142 -135 163 522 308 -563 -543 18 234 -196 -541 368 868 10 -183 -297 -90 -364 68 257 -108
3949 -108 42 337 659 -234 -976 -33 921 97 -467 -48 705 117 -549 -308 284 -419 56 339 174 -351
3969 -351 -291 738 175 -765 -333 1089 510 -373 -437 320 141 -488 -174 302 -145 -207 386 392 -821 -779 361
3990 361 480 -630 -642 358 1012 -1 -724 191 239 -336 17 525 38 -261 105 609 -324 -829 56 622
4010 622 -114 -800 -87 658 -252 -925 -209 300 12 127 854 389 -637 -131 652 225 -942 -236 1007
4029 1007 615 -769 -580 515 -42 -852 -253 283 -104 -262 670 532 -663 -521 731 566 -455 -316
4047 -316 807 678 -684 -379 344 381 -203 152 781 55 -616 252 295 -231 -868 258 1111 -169 -517
$$ packed form
3905b62N94K5l16l19l4N6J21L40k85l58N04M23n00n51p1J225Np38J77J02J64l13
3927a1q9m2PK98L59k14q71K0N61K16m30l45R09N00q58j93j14K07k74M32J89l65
3949a08J50K95L22q93p42R43R54q24n64M19P53n88o66K41N92p03M75K83j65n25
3969c51O0J029n63r40M32J422n79q83o4P57j79o29L14M76m47o2N93Oj213M2J140
3990C61J19j110j2J000O54j013p23R15M8n75L53N08m87k99L66N04r33n05Q85N66
4010F22p36o86P13P45r10o73P16N09k88J15P27m65j026N06P83m27j167P06J243
4029A007l92j384J89J095n57q10N99N36l87j58R32j38j195J42J252j65j021J39
4047c16J123j29j362L05P23L7n84L55O29p26o71Q68M3n26o37J126Q53j280l48
$$ plain form
4066 -517 -29 555 -196 -667 309 478 -163 9 491 114 -573 -183 561 100 -733 64 981 151 -798 -397
4086 -397 183 65 -472 235 315 72 -366 255 -146 -638 -234 723 629 -513 -374 617 491 -650 -580 281
4106 281 358 -80 94 208 -310 -629 175 307 -587 -425 671 560 -268 -760 44 485 -132 -209 215 320
4126 320 -82 -58 277 -174 -282 150 485 -364 -610 198 282 -147 -587 -277 343 159 -113 -3 294 218 172
4147 172 151 154 -168 322 534 314 -575 -49 12 73 -236 -326 246 98 -268 76 -244 -111 -145 234 77 -44
4169 -44 -84 484 572 -267 -323 23 354 128 -46 14 194 57 54 5 -255 23 419 92 -214 -136 267 217 -106
4192 -106 -415 59 -23 169 37 -83 -53 44 39 -1 -10 64 165 136 -175 -353 -4 55 -199 -88 -531 -283 465 128
4216 128 -280 -117 181 246 102 238 -317 80 419 124 -132 -355 -90 159 242 -310 -157 134 223 -140 -433
$$ packed form
4066e17M88N84p51m71R76J69o41J72M82l77o87L90P44m61q33P97R17q30r49M01
4086c97N80j18n37P07Q0k43m38O21m01m92M04R57r4j142J39R91j26j141P0Q61
4106B81P7m38J74J14n18l19Q04J32q94J62J096j11q28m92Q04M41o17p7M24J05
4126C20m02K4L35m51j08M32L35q49k46Q08Q4m29m40L10O20j84k72J10K97p6m6
4147A72k1Ll22M90K12k20q89N26O1O1l09r0N72j48l66L44l20J33l4L79j57j21
4169d4m0N68Q8q39n6L46L31k26j74O0J80j37lm9k60K78L96l27l06P8M03n0l23
4192a06l09M74q2J92j32j20L0R7nm0rP4J01k9l11j78L49N9k54J11m43K48P48l37
4216A28m08J63K98O5j44J36n55L97L39k95k56k23K65K49Q3n52J53K91Q9l63k93
$$ plain form
4237 -433 -390 64 200 -89 -201 -194 91 311 12 -58 3 111 138 -2 -182 -3 -8 223 25 -314 6 304 25
4260 25 -312 -233 -118 32 68 -295 -196 151 -3 -17 -76 -268 153 271 35 -29 25 10 281 101 -150 -198 -67
4283 -67 101 -194 -189 -171 34 252 129 -268 -45 148 228 -224 18 74 313 310 -22 -402 -22 72 50 -345 -271 44
4307 44 -78 -41 -395 -440 154 203 154 -203 -249 173 239 302 -197 -44 301 355 92 -140 -116 212 204 172 -167 -177 128
4332 128 208 -82 -178 -204 67 212 -152 -121 -219 11 104 195 4 209 230 -7 310 -16 -11 314 200 -289 -726
4355 -726 -131 269 51 -268 145 139 -55 -168 -181 -90 -64 272 -304 -184 -195 270 405 230 -262 32 553 360
4377 360 -204 -73 136 -30 18 -98 -29 -217 -39 206 -4 -514 -318 63 283 166 -164 346 428 -308 -56
4398 -56 175 42 124 176 219 -81 -481 316 91 -268 -199 83 571 -124 -395 37 299 25 -20 246 308 -4
$$ packed form
4237d33M3M54J36k89j12PK85K20k99p0O1J08K7j40j80J79nK31j98l39L20K98k79
4260B5l37P9J15J50L6l63R9L47j54j4n9j92M21J18k36o4N4j5K71j80k51m8J31
4283f7J68k95NJ8K05K18j23l97K23J93Q0m52K42N6K39ll32l80L80R4k2l95P4L15
4307D4j22L7l54m5N94M9m9l57m6M22O6O3m99J53L45N4k63k32K4L28ql2l39j0L05
4332A28Q0k90r6k6K71J45l64L1r8K30R3R1j91K05K1k37L17l26NL25j14m89m37
4355g26N95M00k18l19M13oj94j13j3R1K6L36n76J20j1M65J35j75m92K94N21j93
4377C60n64J31K09j66M8j16O9j88J78K45k10n10J96L81K20j17l30N10Q2p36K52
4398e6K31j33Q2N2M3l00m00P97k25l59O9K82M88o95k71M32K62k74m5K66O2l12
$$ plain form
4420 -4 56 290 -132 -478 137 446 46 -437 394 448 32 -602 -263 282 -340 -332 193 118 -341 -194 341 -256
4442 -256 -632 -38 456 507 -163 -291 339 144 -524 -217 355 -77 -317 83 281 -312 -448 394 395 -531 -444
4463 -444 455 478 -292 -495 -54 -7 -263 102 350 276 -381 129 533 -489 -463 313 593 -288 -601 275 503
4484 503 -468 -866 27 394 -8 62 373 202 -349 -59 265 -64 -644 31 857 284 -556 -225 540 -47
4504 -47 -635 -349 276 87 2 229 35 -686 -420 409 399 -460 100 758 291 -388 -411 154 -58 -5 205 702
4526 702 -63 -82 296 129 -562 -585 489 537 37 -343 216 216 -458 -652 -32 474 -106 62 176 -297 -615
4547 -615 134 328 -94 -414 156 747 119 -543 -131 123 -139 -445 168 363 105 -181 -96 -415 -412 -68 510
4568 510 286 -230 31 425 256 -523 -541 259 384 36 376 236 -154 -367 286 -14 -393 -36 368 496
$$ packed form
4420dO0K34m22l46O15L09m00m83Q31N4m16o34L39N45o22QN25p5m59J47N35n97
4442b56l76N94M94N1o70j28O30j95o68L07N72m32k40M00J98n93j36Q42Jr26Q7
4463d44Q99K3p70k03M41M7k56L65K48p4o57N10M04j022K6P76K80q81l13Q76K28
4484E03r71l98Q93L67m02P0L11j71n51K90L24l29n80O75Q26n73q40L31P65n87
4504d7n88K86O25j89q5K27j94p21K66Q29j0q59N60O58m67o79k3N65k12N3K10M97
4526G02p65j9L78j67o91k3J074M8n00l80N59%o74j94O20N06n80J68J14m73l18
4547f15P49J94m22l20N70N91o28o62M12K54k62l06O13J95k58k86Q5l19LL44N78
4568E10k24n16K61L94j69p79j8Q00J25l48L40j40l90k13O53l00l79L57M04J28
$$ plain form
4588 496 -364 -503 -85 97 -186 -200 335 634 401 49 -47 -295 -111 18 238 75 -198 -20 184 -258 -514
4609 -514 -214 138 211 20 74 1 -76 -94 -238 -67 -66 10 371 276 -274 -243 154 -144 -230 -113 321 395 -198 -215
4633 -215 -204 -143 -3 -87 -2 10 22 184 -52 -299 -363 88 227 313 -190 201 468 21 -311 -260 142 -99 166
4656 166 359 -112 -221 -215 54 -88 -482 -185 386 230 -252 55 -49 258 -260 -2 121 53 -18 125 77 -517
4678 -517 -283 -27 216 -93 -181 383 35 -286 -340 -261 80 33 -123 -59 64 33 40 149 -200 -439 317 538 40
4701 40 -106 -161 215 -189 -159 -80 -72 -40 31 -76 -288 -508 29 167 -44 -305 -77 578 200 -329 -10 246 350
4724 350 30 -89 -33 255 170 198 -219 -310 40 181 84 -398 16 293 298 -322 -183 18 -72 220 -94 -74 140
4747 140 -301 269 100 -154 -219 310 209 -288 -391 57 321 -198 -230 -312 163 378 32 -49 -74 -19 354 314
$$ packed form
4588D96q60j39M18J82k83j4N35K99k33l52r6k48J84J29K20j63k73J78K04m42k56
4609e14L00L52P3j91N4p3p7j8j44J71JP6L61r5n50L1L97k98q6J17M34P4n93j7
4633b15J1O1J40q4Q5J2J2J62k36k47o4M51J39Q6n03L91K67m47l32N1M02k41K65
4656A66J93m71j09OK69j42l94K97N71j56m82L07j04L07n18K58J23o8p1J43m8n94
4678e17K34K56K43l09q8N64l48l21n4P9L41m7j56O4J23l1PJ09l49k39P56K21m98
4701D0j46n5L76m04L0P9QL2P1j07k12k20N37J38k11k61K28O55l78n29L19K56J04
4724C50l20j19N6K88q5K8m17r1L50J41r7m82M14K77No20J39K01r0K92l14K0K14
4747A40m41N70j69k54o5N29j01m97j03M48K64n19l2q2M75K15l46q1k5N5L73m0
$$ plain form
4769 314 105 -384 113 209 -37 -202 -11 207 152 48 -57 -140 46 225 -95 -346 -211 74 191 -94 -217
4790 -217 -251 242 105 -403 -192 -158 195 9 -221 -141 -109 267 368 144 -307 -28 59 366 -169 -421 -157 258
4812 258 -74 -128 34 183 78 -54 19 -390 268 385 35 -93 -109 -83 193 123 -86 -221 -49 124 -66 151
4834 151 45 -47 -102 119 -225 -104 42 263 -305 13 -2 277 160 8 -242 -86 200 238 79 -232 -121
4855 -121 348 99 -231 -154 -227 209 193 -31 -118 -48 253 65 -18 -306 184 211 303 -40 -74 175 307 -13 -49
4878 -49 -55 -12 99 -26 9 -55 354 36 32 -42 -191 61 217 145 -187 -180 43 463 86 -176 85 107 141 -23 -157
4903 -157 -48 21 275 -60 -200 -133 293 226 -174 -155 42 250 187 -251 48 140 177 115 -199 -51 -35 140 86
4926 86 -122 -297 140 154 -32 -497 -158 78 105 -245 -357 51 54 86 117 -33 -124 204 277 80 -181 190 168
$$ packed form
4769C14k09m89M97R6k46j65J91K18n5j04j05q3J86J79l20k51J35K85J17k85j23
4790b17l4M93j37n08K11L4L53j86k30Q0L2L76J01k24m51K79Q7L07n35k52K64M15
4812B58l32n4J62J49j05j32P3m09O58J17l50j28j6K6K76p0k09j35J72J73j90K17
4834A51j06r2n5K21l44J21J46K21n68L18j5K79j17j52k50J56K86L8j59l11J11
4855a21M69k49l30P7p3M36j6k24q7P0L01j88q3k88M90K7R2l43l4K49J32l20l6
4878d9oM3J11j25L5o4M09l18mp4j49K52J56p2l32PK23M20l77k62K61K2L4j64j34
4903a57J09O9K54l35j40O7M26o7m00J9J97K08o3m38K99R2L7o2l14J48J6J75n4
4926H6k08j75M37J4j86m65L39K36K7l50j12M08LL2L1j50r1L28P3j97k61L71k2
$$ plain form
4949 168 222 114 -354 -103 442 -120 -287 -9 39 134 -207 -182 -235 -96 218 174 -154 -183 -32 234 46 -211
4971 -211 -5 353 132 -163 85 -159 35 231 178 -289 -168 214 111 161 -173 -204 32 218 -428 -462 126
4992 126 414 -157 91 -69 162 -104 201 -48 -145 189 232 478 124 -286 -47 215 -63 -52 -43 91 132 216
5014 216 153 -137 -255 276 22 -205 19 186 410 -170 -488 48 271 5 -249 22 229 53 -322 -140
5034 -140 63 -191 -38 311 429 -283 -195 240 168 -238 42 364 292 97 166 89 -177 47 -89 142 -283 -170
5056 -170 318 434 -275 -472 -165 396 -45 -69 244 406 -138 -231 -150 -211 -245 221 440 -168 -363 54 229 -344
5078 -344 -553 36 903 197 -281 32 56 -56 -280 152 72 -261 -7 410 45 -488 -351 289 231 -315 216
5099 216 425 217 -251 -215 23 -88 -133 502 531 -240 -174 286 202 -464 -491 157 432 -233 -313 346 58 -266
$$ packed form
4949A68N4j08m68K51N45n62j67K78M8R5l41K5n3J39L14m4l28k9J51K66j88k57
4971b11K06L58k21k95K48k44J94J96n3m67J21L82j03N0l34l1K36J86o46l4N88
4992A26K88n71K48j60K31k66L05k49r7L34M3K46l54m10K39K62k78J1RJ34M1Q4
5014B16o3k90j18N31k54k27K24J67K24n80l18N36K23k66k54K71K07j76l75J82
5034a40K03k54J53L49J18p12Q8M35p2m06K80L22p2j95O9p7k66K24j36K31m25J13
5056a70M88J16p09j97L07N61m41k4L13J62n44r3Q1o1l4M66K19o08j95M17J75n73
5078c44k09N89Q67p06m78L13K4j12k24M32q0l33K54M17l65n33J37O40n8n46N31
5099B16K09k08m68L6K38j11m5O35K9p71O6M60q4o66k7O48K75o65q0O59k88l24
$$ plain form
5121 -266 -121 338 -126 -136 294 805 -150 -784 60 221 -110 -731 342 606 -38 -335 135 212 -400 -79
5141 -79 434 245 -251 110 245 -136 -685 -228 582 155 -272 -27 196 -229 -575 49 -11 -512 -107 508 336
5162 336 -183 -93 294 173 -510 -353 496 243 -101 -109 231 -85 -256 24 235 -209 -147 309 474 -403 -628
5183 -628 300 449 -129 -343 344 343 -340 -191 211 -204 -199 346 579 32 -360 218 124 -297 -684 211 671 41
5205 41 -229 246 67 -303 -323 -6 -81 -395 -12 468 -67 -217 -122 383 104 -209 -99 335 50 -207 -76
5226 -76 23 -229 97 259 325 -200 -44 390 196 -685 -497 527 444 53 -125 72 214 -265 -378 63 -65
5247 -65 -70 -66 421 -353 -228 92 194 -132 -222 162 131 -165 -389 11 -127 -129 -85 118 118 -413 313 143 83 -167
5271 -167 94 443 44 -207 115 418 -100 -141 -251 28 -38 140 170 114 -272 -11 123 -87 -108 -92 303 211
$$ packed form
5121b66J45M59m64j0M30N11r55o34Q44J61l31o21J073K64o44k97M70P7o12L21
5141g9N13j89m96L61J35l81n49M57Q10m27m27K45K23m25l46O24o0n01M05O15j72
5162C36n19R0L87j21o83J57Q49k53l44qL40l16j71K80K11m44O2M56J65q77k25
5183f28R28J49n78k14O87jo83J49M02m15NN45K33n47l92N78r4m21l87Q95M60o30
5205D1k70M75j79l70k0L17p5l14L83M80n35j50R5N05k79l13J10M34k85k57J31
5226g6R9k52L26J62O6n25J56M34j94q81J88J024q3l91j78J97J42m79j13M41j28
5247f5nMM87p74J25L20J02l26r0L84l1k96k24M00j38kM4K03%n31P26j70o0k50
5271a67K61L49l99k51L22L03n18m1j10K79o6J78L0n6l86K61J34k10k1J6L95r2
$$ plain form
5293 211 -185 65 28 145 34 -148 -45 -107 -50 135 141 -231 -176 9 55 -72 -119 220 212 98 -285 -61 15 363
5317 363 -37 389 200 -162 59 181 -88 -133 90 250 62 -154 232 -56 128 -60 -187 -192 -64 87 26
5338 26 -89 -37 47 198 -17 -144 -29 277 -140 -6 144 -76 147 110 -69 33 -100 26 -90 -35 -205 179
5360 179 -66 169 -165 -76 134 90 335 -51 -79 -42 1 44 -186 -268 -30 -93 37 -76 84 4 185 160 -60
5383 -60 -49 49 -62 63 -61 178 109 132 -38 -70 -1 117 -2 78 230 -159 60 247 129 -78 25 -66 23
5406 23 -258 -26 -139 26 98 125 -457 -310 98 -46 -43 -57 -24 160 -36 -181 -18 -16 -27 0 -189 32 -30 -48
5430 -48 -82 -60 -363 30 252 -91 -247 49 348 143 -176 -261 131 91 -188 205 110 29 84 -166 54 -254 152
5453 152 124 278 -196 14 284 -20 114 -221 -262 -113 -32 0 65 -23 -59 -145 148 -29 -298 220 126 -173 37
$$ packed form
5293B11l96K50l7J17j11j82J03o2N7J85Ol72N5J85M6j27m7L39qj14l83K24P6L48
5317C63m00M26j89l62K21J22k69m5K23J60j88k16L86k88J84j88j27nJ28J51o1
5338B6j15N2Q4J51k15j27J15L06m17J34J50k20K23l7j79J02j33J26j16N5j70L84
5360A79k45K35l34Q9K10m4K45l86k8L7M3M3k30q2K38o3J30j13J60q0J81k5k20
5383f0J1R8j11J25j24K39o9K3j70l2O9J18j19Q0J52l89K19J87j18k07J03r1Q9
5406B3k81K32j13J65P2K7n82J47M08j44Lj4L3J84j96j45J63Kj1K7j89K21o2j8
5430d8l4K2l03L93K22l43j56K96K99k05l19q5L92m0k79L93r5q1N5k50K20l08M06
5453A52k8J54m74K10K70l04J34l35m1J49Q1L2O5q8l6q6K93j77k69N18r4k99K10
$$ plain form
5476 37 73 -24 199 -127 32 -163 -69 25 31 -103 -413 -61 40 38 56 103 232 53 51 69 -30 -23 -5 -134 -78 -92 -161
5503 -161 7 123 -255 -37 84 292 -62 -190 137 -175 -261 -30 350 133 8 7 57 -185 -65 211 88
5524 88 -43 -167 172 313 -264 -378 236 -91 -133 -25 358 -67 -217 77 183 -121 -583 72 246 -280 -33
5545 -33 284 205 -124 -300 95 222 212 26 147 119 -248 119 627 80 -508 186 238 -258 -166 -163 302 265 -43
5568 -43 66 335 -52 -351 86 73 -308 -42 422 295 -260 -239 277 38 -318 -183 256 85 -290 73 221
5589 221 -240 -384 159 141 67 -172 276 400 -367 -312 -14 -73 -251 83 401 185 -67 -35 96 -37 -274 181
5611 181 831 296 -672 187 217 -51 -180 164 478 44 -114 153 137 -496 10 197 31 -151 -17 194 -25
5632 -25 -11 -178 -31 337 -283 -116 564 199 -178 4 -16 -213 -92 258 382 -88 -312 234 20 -533 -525 -22
$$ packed form
5476C7L6r7K23l26J59j95R4R4Oj34l10L52J01kJ8M7J29j79kJ8r9PJ8j29N6j4o9
5503a61J68J16l78K18J21K08l54j28L27l12q6K31L80k17j25jN0k42J20K76j23
5524H8j31j24L39J41n77j14O14l27m2J08L83m25j50K94J06l04m62O55J74n26K47
5545c3L17p9l29j76L95J27j0j86J21k8l67L67N08n47n88O94N2m96R2LM65l7l08
5568d3J09K69l87k99M37j3l81K66M64j27n55K1N16k39l56J35M39j71l75L63J48
5589B21m61j44N43j8p4k39M48J24p67N5K98n9j78L34L18k16k52L2J31j33k37M55
5611A81O50n35r68Q59L0k68j29L44L14m34j58K67j6o33N06J87j66j82J34K11k19
5632b5J4j67J47L68o20J67O80l65l77J82k0j97J21L50J24m70k24N46k14n53QN03
$$ plain form
5654 -22 95 -210 -123 378 -174 -289 -59 -119 -72 -402 116 154 97 -141 -113 107 -99 -311 84 106 106 5 20 -82
5678 -82 -114 -142 264 133 105 -39 419 309 -461 -374 266 213 -116 57 120 188 -307 105 -144 10 78 73 286 59
5702 59 -65 184 -12 -195 -255 27 113 -105 -14 -133 41 -85 115 318 169 88 85 302 46 -388 -116 201
5724 201 92 -98 11 7 112 -494 136 -192 -77 225 19 165 -28 -1 -15 291 -238 -175 317 186 -46 94
5746 94 248 152 -137 -165 15 295 -42 118 158 11 -399 30 129 -160 -43 82 373 -45 -281 -93 15 -125
5768 -125 9 343 133 -188 54 -4 -144 -275 36 82 -139 -100 116 219 -132 -309 41 89 143 111 457 240
5790 240 12 -137 -2 -102 -344 237 323 407 -126 -231 -99 -117 -225 -237 163 57 -218 -43 249 -32 -253
5811 -253 66 311 1 86 356 82 24 -349 -30 205 -98 -190 217 197 -162 2 316 -37 -128 -25 284 125
$$ packed form
5654b2J17l05Q7N01n52j15K30o0M7l30N18L8n7k38K8K20k06k12L95K2%j01J5j02
5678h2l2k8M06j31k8j44M58j10p70Q7O40n3l29J73O3O8m95M12k49J54O8nK13k27
5702E9j24K49j96j83o0K82Q6k18R1j19J74j26K00K03j49q1lK17k56m34K72L17
5724B01j09j90J09mJ05o06O30l28J15L02k06J46j93K7j4L06n29O3M92j31k32J40
5746I4J54r6k89k8J80K80l37J60M0j47m10M29R9k89J17J25K91m18k36J88J08j40
5768a25J34L34k10l21K42n8j40j31L11M6k21L9K16J03l51j77L50M8N4l2L46k17
5790B40k28j49J35j00k42N81Q6Q4n33j05J32j8j08j2M00j06k75J75K92k81k21
5811b53L19K45l10Q5K70k74n8l73L19K35l03r2M07k0l59J64L14l53r1J03L09j59
$$ plain form
5833 125 -224 89 -88 -275 -208 -45 255 4 -10 66 44 -226 -135 -24 160 -229 -151 135 199 -67 -386 93
5855 93 237 -227 5 98 131 -44 143 50 80 -101 229 255 -118 -22 242 200 -33 -176 247 301 -103 102 84
5878 84 133 -194 52 125 -3 -31 142 18 34 -252 -136 -68 -110 -4 134 -35 -169 -117 93 90 -210 -55 15 -267
5902 -267 -226 141 1 -16 -131 -91 183 -12 128 -170 -10 53 -69 33 -44 238 39 58 140 3 -40 14 48
5925 48 60 -158 34 220 167 -47 219 -186 26 -39 151 -223 -139 106 121 -84 10 -63 94 -114 -210 35 23
5948 23 -114 -135 13 210 122 -13 42 -65 -145 11 238 246 107 -17 -61 64 -74 178 62 -63 -178 -146 -27
5971 -27 117 -89 37 -44 -11 -153 47 -64 -58 8 -58 117 169 -67 94 11 24 -35 111 -211 74 49 -2 -27 95
5996 95 56 45 225 -148 -15 80 47 -51 -44 -219 154 -48 71 102 182 48 120 -71 -30 202 -126 -135 -76 -119 -129 -2
$$ packed form
5833A25l49L13j77j87O7J63L00k51j4P6k2k70R1J11J84l89P8K86O4k66l19M79
5855I3J44m64K32R3L3j75J87r3L0j81L30K6l73R6K64m2k33j43M23N4m04K05j8
5878H4M9l27K46P3j28k8J73j24J6k86J16O8m2J06J38j69j34N2K10ll00J55P0k82
5902b67M1L67j40j7j15M0K74j95J40k98J60O3j22J02p7K82j99J9Q2j37m3N4L4
5925D8J2k18J92J86n3k14K66m05K12o5J90l74Q4K45J5k05R4p3J57k08r6K45j2
5948B3j37k1J48J97q8j35N5j07q0J56K27Qj39j24m4J25j38K52j16j25j15L2J19
5971b7J44k06J26q1L3j42K00j11OO6o6J75N2k36J61q3J3n9J46l22K85k5n1k5J22
5996I5l9j1J80l73J33R5l3r8Pj75L73k02J19L1Q0j34P2j91M1K32l28rN9m3j0J27
$$ plain form
6022 -2 -5 72 -26 74 44 272 116 -142 65 103 62 -78 132 153 53 79 0 152 -44 233 186 110 73 48 285
6047 285 83 12 -193 6 -40 -99 -103 -115 5 22 2 84 -236 -11 234 65 2 115 245 43 125 -55 285 -178
6071 -178 171 -67 51 -9 105 -28 50 81 9 -24 88 38 -121 -78 -48 -178 32 32 233 317 200 284 97 -233
6095 -233 15 183 35 -295 189 -92 -99 -208 -118 98 167 -73 10 122 56 -3 -168 178 -256 157 105 160 216
6118 216 -70 -68 -16 -50 -256 -46 273 26 -42 82 -28 -48 -54 -118 49 73 -84 104 -42 54 -147 65 -112 187
6142 187 286 59 108 -90 -32 -111 165 123 -138 39 -28 -41 34 109 -64 29 -119 0 -69 183 -21 41 15 -76 161
6167 161 64 126 293 192 -119 -116 108 69 64 -90 -66 467 -87 40 161 10 -227 -25 -126 83 -13 106 52
6190 52 -166 151 102 180 -108 152 -56 135 203 -380 121 -153 46 1 58 0 228 -238 203 -217 -162 -272 74
$$ packed form
6022blP7r8J00l0K28j56k58K07L8m1j40K10K1j00K6p9J52j96K77m7p6l7k5K37
6047B85k02p1k05J99m6n9mj2J20J7k0Q2l20K25K45j69o3J13J30k02Q2j80L40m63
6071a78L49k38J18o0J14j33P8L1p2l3J12n0j59M3L0j30K10%K01Q4j17Q4j87l30
6095b33K48J68j48l30M84k81pj09R0K16O9k40Q3J12o6n9j65L46m34M13n2N5N6
6118B16k86KN2l4k06K10L19k47o8J24j10k0oo4J67K4j57J88j46R6k01K12j77K99
6142A87R9k27M9j98N8p9K76m2k61J77o7j3P5P5j73R3j48J19o9K52k04O2k6r1K37
6167A61r7O2J67j01l11LK24l9nj54K4N33n54J27J21j51k37K02j01K09r6J19n4
6190E2k18L17m9P8k88K60k08J91O8n83N01k74J99m5N7n8K28m66M41m20N5j10L46
$$ plain form
6213 74 159 114 -258 98 -155 -29 56 -35 -2 13 222 3 47 -227 71 -72 21 -73 -156 112 15 -194 -64 25
6237 25 -106 -121 -64 246 -198 -87 89 -528 114 -57 73 98 10 290 -66 -94 -108 -57 53 23 -29 -42 -286 171
6261 171 -5 -46 39 53 195 -74 -93 -108 -217 -79 207 38 117 -30 -217 -78 -150 67 -129 -78 -13 239 123
6284 123 -4 -45 49 -261 -249 120 48 167 42 -131 -1 -298 -25 -114 -164 -92 -146 210 -74 -46 167 69 -99
6307 -99 65 18 155 160 11 -24 -103 -183 19 226 107 -48 228 139 53 -214 25 130 45 87 -64 19 87 -126
6331 -126 47 -363 23 53 97 125 -115 -91 275 -118 42 49 42 279 -55 -25 -170 108 225 197 -9 26 161 100
6355 100 107 -170 17 65 154 -67 113 170 75 -122 -95 -58 -25 -125 320 171 -130 171 -95 133 -299 128 45
6378 45 -18 -18 1 -16 -153 -17 234 93 22 14 -39 -177 -65 60 150 1 123 -57 -44 27 -91 -1 69 9 -200
$$ packed form
6213G4Q5m5l72L56k53J26Q5r1L3J5K09k19M4k74K98j43R3r4q3K68r7k09J30Q9
6237B5j31j5N7L10m44J11J76o17O42j71J30K5q8K80l56k8j4N1J10l0n2j3k44M57
6261A71j76m1Q5J4J42k69j9j5j09J38K86j69P9j47j87J39p2K17j96N1O5K52j16
6284A23j27m1R4l10J2L69p2J19j25j73J30k97K73q9n0P2n4L56k84K8K13r8j68
6307i9J64m7J37Nj49l5p9q0K02K07j19j55K76q9q6k67K39J05q5M2j51Q3O8k13
6331a26J73m10L86L0M4K8k40K4L66l93J60PpK37l34L0j45K78J17k8k06L5J35o1
6355A00Pk77J87M8Q9k21J80N7r5j97K7L7L3j00M45j49l01L01k66K28m32M27q3
6378D5o3%J9j7j37J36K51j41p1qn3j38J12J25R0j49J22j80J3P1j18R0P0o0k09
$$ plain form
6403 -200 -8 7 -135 -99 -13 105 115 -136 -54 155 -11 3 65 -51 -82 89 75 188 240 -63 197 -63 194
6426 194 -13 -69 64 -65 92 -47 52 -46 -5 -92 84 97 -95 283 -178 -28 -97 15 192 -171 18 235
6448 235 90 71 -19 -205 61 -133 -7 -41 203 168 -101 81 50 18 -133 148 81 -127 -144 -30 120 85 -70
6471 -70 -112 -53 52 218 -11 109 75 113 -57 319 197 -3 234 388 59 170 -97 70 -223 1 -149 19
6493 19 -83 112 -172 105 -2 -10 83 15 -163 214 -155 -136 -33 115 -194 -23 55 17 237 132 -112 124 102
6516 102 22 64 -144 40 112 349 -110 78 13 13 115 -163 -35 75 49 -211 -33 -1 110 126 57 83 172 48
6540 48 -70 -116 10 -3 13 19 -150 59 39 15 -133 166 -180 152 -190 -100 -145 -78 -25 122 -87 -113 -86 -34 57
6565 57 -75 98 -6 -167 85 34 10 19 -91 86 19 193 98 245 18 157 89 -105 -96 17 21 123 2 -5 20
$$ packed form
6403b00J92J5j42L6Q6J18J0k51Q2K09j66J4O2j16l1J71j4J13N2l03K60k60K57
6426A94k07n6J33j29J57j39R9r8M1q7J76J3j92L78m61J50o9J12J77l63J89K17
6448B35j45j9r0j86K66j94J26l4K44l5k69J82l1l2j51K81o7k08j7J14J50l5j55
6471g0m2N9J05J66k29J20l4L8j70L76j22k00K37J54l29J11k67J67k93K24j50J68
6493A9j02J95k84K77j07qR3o8j78L77l69J9J03J48l09J71P8l8K20j05k44K36k2
6516A02q0M2k08J84P2K37m59J88o5%J02k78J28J10k6k60J78L2J11J6o9K6Q9j24
6540D8j18m6J26j3J6Oj69K09k0k4j48K99l46L32l42R0m5O7N3J47k09k6K7N2R1
6565E7j32J73j04j61K52n1k4Rj10J77o7J74r5J47k27J39o8j94RJ13MJ02j21pK5
$$ plain form
6590 20 5 214 142 144 -117 -175 77 146 -3 108 -56 98 -135 -224 -2 91 46 61 97 79 62 -231 228 142 -82
6615 -82 13 -118 -151 115 -79 -206 -157 51 327 23 -127 74 -60 -11 -1 -164 -84 287 48 148 109 -122 -23
6638 -23 158 -129 -251 140 -281 -94 -75 80 117 -122 69 33 123 -214 -150 11 71 -32 25 22 85 -184 24 -121
6662 -121 133 -149 -6 -30 125 -92 186 -105 -41 128 18 135 24 71 -84 16 217 -231 -96 16 86
6683 86 -132 62 -229 15 178 180 3 -201 263 -96 -8 -49 -181 259 24 -119 97 103 -129 -106 -316 218 62
6706 62 -291 193 52 -177 229 -131 -21 -126 -104 -142 115 -70 -293 138 -41 -91 146 127 -45 -62 125 10
6728 10 -69 83 232 -137 -7 -188 215 147 233 -262 53 440 -368 -28 178 -15 -273 -49 -98 127 99 65
6750 65 118 -210 -75 8 -67 -169 213 81 172 -264 -55 87 172 -44 -319 -57 -35 7 -38 44 64 68 28 82 180
$$ packed form
6590B0j5K09p2Kk61n8K52O9j49J11j64J54k33q9K22R3m5J5L6j8j7k93M59q6k24
6615h2R5j31l3K66j94j27M9K08K76l04j50K01j34M9J0j63Q0L71k39J00l9k31R9
6638b3J81k87j22L91m21J87J9J55L7k39J91l6R0l37O4J61O0j03N7lO3k69K08j45
6662a21K54k82J43k4J55k17K78k91O4J69j10J17j11M7j55J00K01m48J35J12P0
6683H6k18J94k91K44J63Kj77k04M64l59Q8m1j32M40k35j43K16Ok32K3k10N34j56
6706F2l53M84j41k29M06l60J10j05K2l8K57j85k23M31j79n0K37j9j72j7J87j15
6728A0p9J52J49l69J30j81M03o8Q6m95L15L87q08L40K06j93k58K24m9K25k8l4
6750F5N3l28J35Q3p5j02L82j32R1m36K09J42Q5k16k75K62K2M2m5Q2K0Mm0N4R8
$$ plain form
6775 180 -40 39 -97 -6 42 -258 71 49 -304 330 197 -70 105 -198 79 -212 29 282 75 120 -18 25
6797 25 -393 -38 -37 13 45 -149 -47 -46 -134 -227 155 -156 187 -199 98 4 -92 10 61 -93 49 62 64 335 -170
6822 -170 -179 14 -17 77 -132 149 165 -43 144 117 -133 -140 -15 38 21 109 52 -69 -34 -136 -311 -134 -225 -121 100
6847 100 160 -208 112 -47 60 34 -144 133 62 -227 99 132 64 -135 110 242 113 61 223 264 -334 -45
6869 -45 -56 299 -144 146 -45 -47 -47 -223 350 -84 -185 -84 147 -8 -64 114 -5 6 -236 -21 227 -7 91
6892 91 78 5 -13 -97 -25 -149 7 75 188 31 -69 -224 -18 201 -150 -38 -61 95 -120 53 227 237 100
6915 100 -127 -145 75 -36 89 287 -67 -183 117 155 88 -92 50 174 -145 -145 -149 -80 -2 210 149 96 -49 -134
6939 -134 -43 92 -411 223 308 64 -68 -43 39 122 -125 36 14 -129 202 57 157 6 -72 169 -65 -270
$$ packed form
6775A80k20P9j36R1M8l00L29k2l53O34j33k67J75l03K77k91K41K53k07M5j38M3
6797B5m18L55JN0L2j94J02Jq8r3L82l11L43l86K97r4r6J02N1j54J42J3KK71n05
6822a70rJ93l1R4k09K81J6k08J87k7k50pJ25N3j7Q8n7j21L5j02j75J77r1J04K21
6847A00O0l68L20j59J07k6j78K77p1k89L26L3o8j99K45J32j29n2J62M1n98K89
6869d5j1L55m43K90j91k%j76N73m34j01J01K31j55n6J78j19J1k42K15K48k34R8
6892I1j3p3j8q4P2j24J56O8J13j57j00j55K06K19l51J12k3J56k15J73J74J0j37
6915A00k27j8K20j11J25J98l54j16L00L8o7j80J42J24l19%mO9P8K12o1n3j45q5
6939a34R1J35n03O34Q5k44j32K5Q2Q3k47J61k2j43L31j45J00j51p8K41k34k05
$$ plain form
6961 -270 203 175 128 -31 45 78 138 32 135 -75 131 35 73 287 -151 -115 54 -50 69 129 -213 -124 184
6984 184 12 -183 21 7 -59 -95 -21 24 53 182 166 -42 71 24 -127 126 -127 79 54 -144 13 57 43 170
7008 170 54 5 -52 108 66 237 -88 39 147 30 30 64 99 121 28 127 -49 -101 -324 -28 50 222 -50 -95
7032 -95 -123 -136 65 76 -103 -54 57 -64 51 -112 -129 -148 -124 -53 36 -157 -93 -143 60 -26 -19 -113 263 -11 87 203
7058 203 -18 48 -16 74 115 280 0 -126 -121 -159 -85 181 250 17 297 -82 -19 -92 165 -40 70 -33 -33 -75 151
7083 151 31 -165 89 157 271 -45 -17 -38 -140 -9 -10 -4 -61 -103 112 -112 -26 99 243 147 28 -59 -132 13
7107 13 110 130 -458 -7 81 122 -74 -106 15 -83 9 -177 -170 -50 45 116 -177 -175 10 101 89 -99 -105 154 42 -136
7133 -136 -54 220 64 29 -34 -151 137 262 -28 324 24 -106 54 -83 61 38 -175 186 57 -22 -121 -20
$$ packed form
6961b70M73k8m7j59P6L3O0j06J03k10K06r6L8K14m38L6J69j04J19O0l42Q9L08
6984A84j72j95K04j4o6l6P4M5K9J29j6k08J13m7j51K53k53K06k5j98J57M4j4J27
7008A70j16m9n7J60m2J71l25J27J08j17%L4L5K2r3R9j76n2k23K96P8J72k72m5
7032i5k8j3K01J1j79M9J11j21J15j63j7j9K4P1Q9j93O4n0K03q6Pr4L76k74R8J16
7058B03k21O6o4R0M1J65k80j26Nl8P4K66O9k33K80l79O3p3K57k05J10j03%m2K26
7083A51j20j96K54O8J14l16K8k1j02J31jOn7m2K15k24Q6J25J44r6j19q7p3J45
7107A3R7K0n88M51Q8M1j96l2J21r8R2j86PJ20R5P1k93KJ85R1j2j88oK59j12j78
7133a36Q2K74j56l5o3j17K88J25k90L52l00j30J60j37J44k3k13L61j29p9r9J01
$$ plain form
7155 -20 99 143 43 -218 77 -87 101 48 -93 -151 123 47 -117 18 209 81 160 80 -101 -91 -44 309 -54
7178 -54 -40 45 40 43 -56 -139 -10 81 -120 91 -301 13 0 51 -191 -42 61 -137 -97 -126 81 -198 103 199 -201
7203 -201 -60 2 54 -174 -1 122 115 75 -111 -100 -143 -84 -7 -235 19 -132 -62 -23 116 292 -2 -43 -75 -96 -249
7228 -249 198 81 -173 331 43 -8 129 21 -179 -222 -59 -16 -100 -25 138 12 97 -32 126 74 -46 -70 -140
7251 -140 61 64 150 -140 139 -320 229 93 -17 -223 131 -10 82 -226 0 -25 207 -88 247 25 72 327
7273 327 6 -81 108 -184 -128 315 -20 -19 25 82 34 -49 -120 134 -206 94 163 30 28 66 55 -23 -238 16 126
7298 126 -88 45 52 210 -167 132 63 -145 139 56 31 46 -174 157 138 -229 -79 44 293 350 -114 -123 -6
7321 -6 27 -171 4 76 301 93 155 -37 -295 -214 32 158 -76 -154 79 71 26 -64 36 11 71 118 105 -156 -224
$$ packed form
7155b0J19M4j00k61K95j64J88n3j41n8K74p6j64J35J91j28P9q0j81J0M7L53l63
7178e4J4Q5nLr9q3J29R1k01K11l92L14j3N1k42J49J03j98M0k9K07k79L01R6m00
7203b01J41O2N2k28J73J23pm0j86J1m3N9P7k28K54j51P0L9J39J76k94m1l2k1j53
7228b49M47j17k54N04k88n1J37j08k00m3J63M3q4P5J63j26Q5j29J58n2j20k4p0
7251a40K01LQ6k90K79m59N49j36j10k06L54j41R2l08K26k5K32k95L35k22M7K55
7273C27l21q7J89k92N6M43l35JM4N7m8q3p1K54l40L00O9j33kL8j1p8k15K54J10
7298A26k14J33PJ58l77K99o9k08K84q3k5J5k20L31j9l67J50J23K49N7m64rJ17
7321fL3j98J75P2K25k08O2j92k58Q1K46J26k34p8K33qm5r0J00k5O0M7j3k61o8
$$ plain form
7346 -224 -15 -132 110 47 100 97 11 92 170 -68 82 -163 -71 -2 -22 122 181 -132 -274 -99 42 -55 -68 -17 154
7371 154 151 -340 -87 104 129 140 -65 -17 -74 -222 47 -92 -61 7 174 67 -191 -172 152 364 -240 99 176
7394 176 269 -233 -194 124 -161 62 195 178 -8 18 74 178 -225 -242 80 -92 161 -69 100 74 220 95
7416 95 -113 41 -138 60 265 -116 -46 -5 -212 85 -352 78 46 191 56 195 176 80 -138 26 138 -216
7438 -216 98 229 -230 -145 -76 220 29 -202 149 215 -204 -61 13 -71 -149 -34 79 12 79 -182 46 255 -67
7461 -67 -231 63 105 176 54 -192 -158 155 221 376 1 69 13 288 -97 -136 55 -153 98 -164 -196 21 90
7484 90 -132 101 2 -92 241 142 114 -30 178 135 -215 -265 28 -32 114 -273 -34 -60 -130 127 49 98 20 51 -35
7509 -35 -35 -210 -34 150 -113 29 -70 -29 17 31 -52 36 -183 72 -5 -195 -33 -126 -113 174 -274 50 -72 -65 22
$$ packed form
7346b24K09j17K42o3N3lq6Q1P8k38J50k45R2O9k0J44N9l13j42J75J41r7j3N1J71
7371A54lm91K53J91K5J1k05M8n7j48K69j39L1O8J67j07k58J9L24K12o04L39P7
7394A76R3n02L9L18k85K23J33j7j86K6N6J04m03j7L22j72K53k30J69k6J46j25
7416I5k08J54j79J98K05l81P0M1k07K97m37M30l2J45j35J39j9r6k18J64J12l54
7438b16L14J31m59Q5O9K96j91k31L51O6m19J43P4q4p8J15J13o7O7k61K28K09l22
7461f7j64K94M2P1j22k46L4L13O6J55l75O8n6K75l85l9J91k08K51k62l2K17O9
7484I0k22K33r9r4L33r9k8j44K08m3l50n0K93o0J46l87K39k6p0K57p8M9p8L1q6
7509c5%j75J76J84k63J42r9M1M6J4q3Q8k19K55p7j90J62r3J3K87m48L24j22PQ7
$$ plain form
7534 22 -53 216 -184 119 -49 2 -38 -19 -28 -5 -18 -31 6 -30 -42 -133 172 144 -81 -218 136 -159 -47 -89 -124 136
7560 136 27 122 -43 156 3 -247 2 -110 79 -10 177 73 83 4 26 144 134 48 286 -83 10 -2 -23
7583 -23 -192 -10 -34 197 59 -86 27 -37 159 131 -56 114 171 141 91 -2 -326 -174 94 30 -221 16 45
7606 45 372 -70 129 87 -207 -41 75 -103 -170 113 -92 165 29 9 12 279 -101 -203 205 238 -28 -123 -199
7629 -199 39 11 -74 99 0 -74 51 227 20 26 58 114 128 -212 82 46 52 -134 -126 92 22 81 130 19 101 -136
7655 -136 253 79 -95 -133 -79 -181 102 -182 -34 219 -38 25 -100 194 117 -17 -103 75 210 -23 -8 26
7677 26 5 -220 91 43 -81 60 -287 113 -61 177 -39 77 225 -230 -60 -166 -223 178 278 42 124 138
7699 138 -78 -25 -171 -89 -113 40 -58 -275 177 83 -114 2 -146 -147 24 -93 -36 7 -101 -72 64 111 -43 43
$$ packed form
7534B2p5K69m00L03j68N1m0J9rK3j3j3L7l6j2r1L05k8k25j37L54k95J12m2l5K60
7560A36j09R5j65J99j53k50K49j12J89q9J87j04J0p9K2J18j0q6K38l69R3j2k1
7583b3j69J82k4K31j38j45J13o4J96k8j87J70N7l0n0r3l24J52K68o4k51K37K9
7606D5L27m42J99m2k94J66J16j78o7K83k05K57j36k0LK67l80j02M08L3k66r5p6
7629a99K38k8q5J73r9p4J25J76k07OL2N6J4l40K94l6Oj86QK18p0N9M9j11Q2k37
7655a36L89j74j74l8N4j02K83k84J48K53k57O3j25K94p7j34q6J78J35k33J5L4
7677B6k1k25L11m8j24J41l47M00j74K38k16J16J48m55J70j06n7M01J00k36Q2J4
7699A38k16N3j46Q2k4J53r8k17M52r4j97J16j48jJ71j17N7M3j08K9J36M7j54Q6
$$ plain form
7723 43 0 -26 -23 -119 0 105 -32 -140 131 -140 87 -214 -121 -135 248 -30 -155 -8 40 57 203 72 -125
7746 -125 138 115 250 -141 -225 232 13 -149 -268 -227 -8 -107 9 -31 -120 160 269 -76 -80 -19 238 -24 7
7769 7 104 70 -26 172 -49 36 87 -97 128 81 1 -251 190 92 56 28 26 -53 203 44 24 -31 41 22 301 28
7795 28 -91 -8 -113 45 -95 56 5 135 -107 -158 -24 121 -13 -236 144 148 9 -211 -105 -234 -129 51
7817 51 28 -73 -22 -69 123 -5 32 -79 158 4 18 -65 40 -164 6 -25 79 -134 -56 140 9 -191 99
7840 99 96 -142 -10 126 434 -205 -31 -99 -154 -51 -182 166 -190 -123 87 45 283 94 -40 299 -58 -190
7862 -190 -25 -31 60 -190 -50 176 9 -150 -83 384 30 6 160 243 -316 -44 137 84 136 -40 189 -77 60
7885 60 -61 -35 135 118 179 -17 28 -206 -108 92 -22 0 -31 -155 48 153 -60 180 58 72 154 115 -240 25
$$ packed form
7723D3m3k6Lr6J19J05j37j08K71k71K27l01R3j4L83k78j25J47M8J7J46j31j97
7746a25K63k3J35l91q4M57k19j62j19M1K19r9J16m0q9K80J09l45mO1K57k62L1
7769GR7l4r6J98k21Q5N1j84K25m7q0k52M41r8l6k8kp9K56j59k0n5P2j9K79k73
7795B8j19Q3j05J58j40J51n1J30k42n1J34J45j34k23L80Mj39k20J06j29J05J80
7817E1k3j01N1m7J92j28L7j11K37j54J4q3J05k04J70l1J04k13P8J96j31k00K90
7840I9lk38J32J36L08o39J74o8n5J03j31L48l56O7K10m2K38j89j34L39l57j32
7862a90J65oR1k50J40K26j67j59O7M67l54k4J54Q3n59K72J81n3N2j76K29k66J37
7885F0j21K6J70j7O1j96M5k34R8K00j14K2l1j24K03J05k13K40j22J4Q2l9l55K65
$$ plain form
7909 25 232 -312 9 158 -71 -4 -129 -23 218 -118 5 -22 -145 -86 -14 153 215 43 -157 -107 33 -192
7931 -192 -312 -72 43 -104 -250 -86 74 80 -252 -202 2 -52 122 251 -142 29 -142 91 -89 1 59 97
7953 97 -163 -73 -103 -51 -252 157 53 177 -126 46 -62 64 -239 -68 340 193 -63 -94 -98 65 119 -35 225
7976 225 63 6 -179 113 -48 -73 -7 11 -226 136 73 213 1 -120 -82 -171 36 60 294 387 14 -226 35
7999 35 99 -311 -122 -126 -63 123 162 13 -11 -78 -59 -194 97 -153 100 117 -4 -35 -39 161 -130 -7 4 17 -110
8024 -110 -15 -178 31 -242 97 -95 -26 -44 170 -73 -189 -107 -232 66 -30 -35 193 64 -121 -28 44 79 -38
8047 -38 -196 3 95 -48 -190 67 -151 -184 -33 199 195 -256 -216 7 57 -32 77 88 -80 -113 47 -133 56
8070 56 -143 -14 45 -68 -60 -242 23 -15 -160 150 -308 -142 -109 -139 -186 -196 -261 159 -218 41 217 151 34 33
$$ packed form
7909B5K07n44L21J49k29O7j25J06K41l36J23k7j23N9P2J67O2j72k00N0J40k25
7931a92j20K40J15j47j46J64J60Ol32N0K04n4J74J29l93J71j71K33j80R0N8L8
7953I7k60R0l0N2k01M09j04J24l03J72j08J26l03J71M08j47k56l1mJ63N4j54K60
7976B25j62n7j85K92j61k5O6J8k37L62o3J40k12j21L8q9K07K4K34R3l73k40K61
7999C5O4m10J89mO3J86L9j49k4o7J9j35K91k50K53J7j21l1mK00k91J23J1J3j27
8024a10R5j63K09k73L39j92O9j8K14k43j16Q2j25K98r6nK28j29j85R3P2L5j17
8047c8j58J99R2j43j42K57k18l3J51K32mm51M0K23N0q9J09J1j68l3J60j80J89
8070E6j99J29N9j13Qj82K65l8j45L10m58J66L3l0m7j0o5M20l77K59J76o6j17j
$$ plain form
8094 33 152 71 12 119 -64 -90 135 -171 -187 -200 -38 123 -93 -46 -41 181 -211 -40 -181 -73 113 -106 160
8117 160 26 -125 -42 -98 -6 -57 -1 16 162 182 95 270 349 196 45 204 -16 11 -20 -117 247 -34 -155 107
8141 107 -77 -190 -40 245 240 -18 -13 68 208 12 -173 -125 41 -114 121 90 8 14 -4 125 -58 -69 -49 -103 -87
8166 -87 -197 219 93 -66 141 -1 112 163 69 138 -4 -81 -170 -45 16 -258 -122 28 149 -28 -187 128
8188 128 -114 -87 57
$$ packed form
8094C3J19q1n9J07j83k6K25l06j6j3J62J61k16M7NK22l92J71j41J08J86k19K66
8117A60j34j51Q3n6R2n1N6J7J46K0q7J75P9j53j51J59k20K7l1r7L64k81j21K62
8141A07j84j13J50K85nk58NQ1J40j96j85M8J66j55K35l1q2Oj8J29j83j1K0n4J6
8166h7j10M16j26j59K07j42J13N1r4O9j42p7q9J25O1k74J36J50J21j77j59L15
8188A28k42K7J44
8191E7
$$ Imaginary data points
##PAGE= N=2
##DATA TABLE= (X++(I..I)), XYDATA
$$ plain form
0 0 0 0 0 0 0 0 8 0 0 -8 8 -11 16 -16 24 -31 32 -40 48 -64 72 -87 104 -120 141 -163 191 -221 253 -291 331
31 331 -378 427 -482 544 -616 688 -768 859 -959 1066 -1182 1311 -1454 1607 -1771 1953
47 1953 -2155 2375 -2614 2880 -3175 3500 -3862 4272 -4735 5263 -5871 6581 -7427 8452
61 8452 -9714 11329 -13465 16434 -20852 28116 -42138 78909 -376097 -761132 354811
72 354811 358109 -417855 -201891 662385 297918 -459638 -133301 392903 -144507 -495258
82 -495258 193041 534297 -199620 -463145 216024 378821 -296843 -363533 299114 384116
92 384116 -182679 -246907 152260 101262 -262367 -136741 239886 157539 -152840 -38365 230568
103 230568 34107 -334704 -170046 253546 166877 -202245 -53354 342815 137557 -334330
$$ packed form
0@%%%%%%Qq%qJ6j9K7l2M0n5O3p2Q8j12J36j59J91k24K61l04L54m12M74n44O22
31C31p09Q05r09J026j160J304j456J627j818K025k248K493k765L061l378L724
47A953m108M530m989N494o055O675p362Q134r007R998j1134J2452j4008J5879
61H452j8166K1043k4794K9899l7286M8968p0254J21047m55006l85035J115943
72C54811L298p75964K15964Q64276l64467p57556L26337N26204n37410l50751
82d95258O88299L41256p33917k63525O79169J62797o75664o6690O62647Q5002
92C84116n66795o4228L99167n0998l63629J25626L76627q2347l10379J14475K68933
103B30568j96461l68811J64658M23592q6669l69122J48891L96169k05258m71887
$$ plain form
113 -334330 -170402 225160 -19686 -351443 53469 423774 -31926 -355870 164491 396817
123 396817 -235060 -427210 249713 377079 -297547 -326041 315200 210319 -384751 -123050
133 -123050 455991 103792 -393357 55128 432227 -165622 -526216 99272 411031 -156654
143 -156654 -319307 254683 327376 -215551 -235350 190915 92043 -251663 -32426 286537
153 286537 22170 -256380 22057 247186 -46291 -254467 16192 220681 16774 -162622
163 -162622 -24287 119125 26958 -85965 -19279 69805 2283 -80146 846 75122 -50088
174 -50088 -127644 72934 199164 -38901 -191087 75427 223376 -90505 -251874 62641
184 62641 195323 -104371 -159083 150819 133917 -167168 -63343 223642 19996 -273725
$$ packed form
113c34330J63928L95562k44846l31757M04912L70305m55700l23944N20361K32326
123C96817o31877j92150O76923J27366o74626k8494O41241j04881n95070K61701
133a23050N79041l52199m97149M48485L77099n97849l60594O25488L11759n67685
143a56654j62653N73990P2693n42927j9799M26265r8872l43706K19237L18963
153B86537k64367k78550K78437K25129k93477k08176K70659K04489k03907j79396
163a62622J38335J43412r2167j12923O6686Q9084o7522q2429Q0992P4276j25210
174e0088p7556K00578J26230k38065j52186K66514J47949l13881j61369L14515
184F2641J32682k99694n4712L09902j6902l01085J03825K86985k03646k93721
$$ plain form
194 -273725 -8812 270175 -37144 -284310 51030 265958 -53609 -199481 100042 161722
204 161722 -120045 -109159 138936 49492 -172969 -17281 193045 6728 -188816 -4055
214 -4055 161558 -6237 -137709 1463 100276 3608 -53842 2712 14234 -22823 -1104
225 -1104 37023 11675 -30603 -18840 29553 38525 -25790 -70037 12389 105750 23007 -107073
237 -107073 -38367 92741 18301 -103733 -16708 88610 -1529 -60627 50242 53366 -97523
248 -97523 -60602 124104 60876 -139174 -50617 156022 54048 -144033 -43181 118308 16047
259 16047 -91066 21626 72408 -56776 -60617 80006 42540 -109979 -45351 118429 53129
270 53129 -102502 -49640 77940 34415 -57933 -23242 34677 12144 -3384 21048 3489 -37045
$$ packed form
194b73725K64913K78987l07319k47166L35340K14928l19567j45872K99523O1680
204A61722k81767J0886K48095q9444k22461J55688K10326j86317j95544J84761
214d055J65613j67795j31472J39172R8813r6668n7450N6554J1522l7057K1719
225a104L8127k5348m2278J1763M8393Q972o4315m4247Q2426R3361q2743j30080
237a07073O8706J31108p4440j22034Q7025J05318r0139n9098J10869L124j50889
248i7523L6921J84706o3228k00050Q8557K06639j01974j98081J00852J61489j02261
259A6047j07113J12692N0782j29184l841J40623l7466j52519O4628J63780o5300
270E3129j55631N2862J27580m3525r2348L4691N7919k2533j5528K4432j7559m0534
$$ plain form
282 -37045 -11430 39862 21322 -34803 -34665 19486 41782 -6329 -55803 -22833 49287 41247 -32622
295 -32622 -39614 21939 29145 -16532 -14711 12209 -7314 -12311 36391 28574 -52144 -42283 62071
308 62071 59521 -52988 -60047 42561 48770 -38975 -43217 18422 13556 -15617 13275 20893 -33806
321 -33806 -30352 47067 45395 -42496 -47991 37687 50793 -25270 -48015 5970 32359 8449 -6203
334 -6203 -4464 -8843 -1044 19484 9097 -27742 -26320 18170 32050 -11916 -42971 -9990 36155
347 36155 26809 -16840 -23324 10633 27675 6746 -16783 -16381 -522 15144 14839 -9265 -28422
360 -28422 -5784 31170 21150 -22740 -28928 11215 30743 -34 -31337 -20056 12324 22111
372 22111 1359 -19779 -11354 16941 27795 5961 -19151 -14308 12384 23169 -980 -29657
$$ packed form
282c7045K5615N1292j8540n6125J38N4151K2296m8111m9474L2970P2120q040p3869
295c2622o992O1553P206m5677J821K6920j9523m997M8702p817q0718R861J04354
308F2071k550j12509p059J02608O209q7745m242O1639m866k9173K8892P618n4699
321c3806L454P7419j672q7891n495Q5678J3106p6063k2745N3985K6389k3910j4652
334f203J739m379P799K0528j0387l6839J422M4490J3880m3966l1055L2981M6145
347C6155r346m3649o484L3957J7042k0929k3529M02J5859J5666l05k4104j9157
360b8422K2638L6954j0020m3890o188M0143J9528l0777l1303J1281L2380R787
372B2111k0752k1138Q425K8295J0854k1834k5112M843K6692J0785k4149k8677
$$ plain form
384 -29657 -18598 19374 25261 -11506 -31290 -2529 27198 16734 -11282 -19950 -6650 12478
396 12478 14905 -9131 -26574 -2223 31349 18197 -19778 -19664 11626 23091 8570 -7653 -17469
409 -17469 -9291 16665 15522 -25506 -34567 17733 41582 -6340 -35963 -471 21617 472 -4300
422 -4300 7700 -9317 -16039 23087 26279 -34963 -40297 38760 54642 -24643 -45764 21094 34541
435 34541 -20190 -22849 14963 627 -21702 14408 25485 -32648 -40757 36258 51863 -27999
447 -27999 -48915 24178 46554 -14276 -35705 7413 21924 -4173 -5938 7831 -6443 -16070
459 -16070 14275 31909 -7538 -41062 -6150 38248 9237 -45147 -22879 42411 33108 -32690
471 -32690 -33356 21121 20278 -18321 1620 34293 -5841 -35160 21255 38497 -45984 -60410 51644
$$ packed form
384b9657J1059L7972N887l6767j9784K8761K9727j0464k8016q668J3300J9128
396A2478K427k4036j7443K4351L3572j3152l7975J14L1290J1465j4521j6223r816
409a7469Q178K5956j143m1028r061N2300K3849m7922k9623L5492K2088k1145m772
422d300J2000j7017o722L9126L192o1242n334P9057J5882p9285k1121O6858J3447
435C4541n4731k659L7812j4336k2329L6110J1077n8133q109P7015J5605p9862
447b7999k0916P3093K2376o0830k1429M3118J4511k6097j765J3769j4274r627
459a6070L0345J7634l9447l3524L4912M4398k9011n4384K2268O5290r303o5798
471c2690o66N4477q43l8599J9941L2673m0134k9319N6415J7242q4481j4426J12054
$$ plain form
484 51644 77174 -40178 -67882 40571 51314 -55548 -49969 50570 31870 -45761 2978
495 2978 61110 -28615 -86402 28208 88628 -30245 -75067 54280 88648 -48541 -85501
506 -85501 29813 49786 -38519 -22580 59223 18681 -60102 -8755 52693 -20999 -75793 20446
518 20446 91169 2366 -71535 -2872 54192 -12295 -60377 4271 54434 10507 -18987 18564
530 18564 17782 -44123 -40743 36763 39575 -38074 -29691 61602 45683 -69518 -71314 40313 49983
543 49983 -38037 -22574 62796 27812 -59837 -20487 44660 -20448 -64546 44503 99573 -25144
555 -25144 -86898 30141 68517 -58559 -82566 53037 79537 -32741 -38443 46300 6288
566 6288 -80701 -16278 74050 5267 -63401 28707 88588 -25074 -99381 948 70577 -6433
$$ packed form
484E1644K5530j17352k7704J08453J0743j06862N579J00539j8700p7631M8739
495B978N8132q9725n7787J14610O0420j18873m4822J29347L4368j37189l6960
506h5501J15314J9973q8305J5939Q1803m0542p8783N1347O1448p3692n4794R6239
518B0446P0723q8803p3901O8663N7064o6487m8082O4648N0163m3927k9494L7551
530A8564p82o1905L380P7506K812p7649Q383R1293j5919j15201j796J11627R670
543D9983q8020J5463Q5370l4984q7649L9350O5147o5108m4098J09049N5070j24717
555b5144o1754J17039L8376j27076k4007J35603K6500j12278n702Q4743m0012
566F288q6989O4423R0328o8783o8668R2108N9881j13662p4307J00329O9629p7010
$$ plain form
578 -6433 -46081 31412 55539 -21853 -43625 11328 8395 -40193 -8205 60973 29211 -49707
590 -49707 -29724 40141 14484 -58981 -30696 56466 47926 -27379 -26857 24942 6203 -41500 -7280
603 -7280 42750 4951 -31881 23516 50777 -34401 -75523 17363 66571 -19301 -56866 31874
615 31874 60411 -29602 -54844 20009 25727 -35778 -9465 56493 11494 -57133 -658 63497
627 63497 -6942 -72237 4350 72653 3327 -58746 -188 44614 -8861 -38206 12187 25819
639 25819 -21662 -17446 33172 15704 -44641 -23331 44985 27545 -43089 -28356 44268 37109
651 37109 -32049 -31601 25995 22006 -27363 -16399 26143 6292 -26718 10524 41630 -15225 -55921
664 -55921 7188 49524 -18581 -57020 20975 65416 -7789 -48422 12425 32115 -28314 -28998
$$ packed form
578f433l9648P7493K4127p7392k1772N4953k933m8588L1988O9178l1762p8918
590d9707J9983O9865k5657p3465K8285Q7162q540p5305N22N1799j8739m7703L4220
603g280N0030l7799l6832N5397K7261q5178m1122R2886M9208q5872l7565Q8740
615C1874K8537r0013k5242P4853N718o1505K6313O5958m4999o8627N6475O4155
627F3497p0439o5295P6587O8303o9326o2073N8558M4802n3475k9345N0393J3632
639B5819m7481M216N0618j7468o0345K1310O8316j7440p0634J4733P2624p159
651C7109o9158M48N7596l989m9369J0964M2542j9851l3010L7242L1106n6855m0696
664e5921O3109M2336o8105l8439P7995M4441p3205m0633O0847J9690o0429o84
$$ plain form
676 -28998 35827 24851 -35823 -7127 52247 3172 -65757 -11242 62526 11901 -53865 -5036
688 -5036 48007 -4941 -49744 -234 33380 -8180 -16347 34513 27156 -40581 -35411 31875 23585
701 23585 -40988 -22357 54534 44166 -31859 -35042 19135 10714 -34821 -14093 32383 11361
713 11361 -21848 10861 32779 -24014 -53488 14071 52858 -11996 -46141 22015 51710 -20175
725 -20175 -50879 12798 36444 -12543 -12627 33875 11061 -44911 -15061 36887 -4702 -49388 13024
738 13024 68635 5232 -56783 -9416 33677 -13691 -40151 14426 38697 -3871 -10314 25150
750 25150 5187 -43097 -16318 40495 16766 -35709 -8500 41841 11452 -42026 -19871 26477
762 26477 12589 -16283 635 16964 -10315 -23156 8441 17119 -17419 -16871 31282 34243 -21908
$$ packed form
676b8998O4825j0976o0674K8696N9374m9075o8929N4515P3768n0625o5766M8829
688e036N3043n2948m4803M9510L3614m1560q167N0860p357o7737N170O7286q290
701B3585o4573J8631P6891j0368p6025l183N4177q421m5535K0728M6476k1022
713A1361l3209L2709K1918n6793k9474O7559L8787o4854l4145O8156K9695p1885
725b0175l0704O3677K3646m8987q4M6502k2814n5972K9850N1948m1589m4686O2412
738A3024N5611o3403o2015M7367M3093m7368k6460N4577K4271m2568o443L5464
750B5150j9963m8284K6779N6813k3729n2475K7209N0341l0389n3478K2155M6348
762B6477j3888k8872J6918J6329k7279j2841L1597Q678l4538N48M8153K961n6151
$$ plain form
775 -21908 -35847 12972 25629 -17608 -23599 19828 25736 -9353 -9210 12850 -6140 -29362 3016
788 3016 30374 -6752 -32037 12700 38201 -11243 -39362 5603 31355 -4174 -18638 10965
800 10965 12067 -15099 -4782 19460 -1765 -23859 8733 33091 -5841 -35805 -2087 26265
812 26265 -1596 -22705 1369 17131 147 -7243 3095 -1703 -11022 4040 18454 -807 -19194
825 -19194 -320 21088 5912 -17278 -7728 13983 10468 -8414 -11677 -80 5167 2254 1266
838 1266 -1371 -7725 -4178 7963 6128 -11218 -11208 12752 18540 -6788 -19020 1894 15739 2350
852 2350 -7395 1045 3768 -2488 686 2752 -8642 -9761 11725 17146 -9272 -21008 1588 15135
866 15135 -1853 -11982 1637 8938 1918 -856 -1244 -7103 -3365 13176 13162 -8306 -13455 5484
$$ packed form
775b1908j3939M8819J2657m3237n991M3427N908l5089J43K2060j8990k3222L2378
788C016K7358l7126k5285M4737K5501m9444k8119M4965K5752l5529j4464K9603
800A0965J102k7166J0317K4242k1225k2094L2592K4358l8932k9964L3718K8352
812B6265k7861k1109K4074J5762j6984p390J0338m798r319J5062J4414j9261j8387
825a9194J8874K1408j5176k3190R550K1711l515j8882l263J1597N247k913r88
838A266k637o354L547J2141j835j7346J0K3960N788k5328j2232K0914J3845j3389
852B350r745Q440K723o256L174K066j1394j119K1486N421k6418j1736K2596J3547
866A5135j6988j0129J3619P301p020k774l88n859L738J6541j4k1468n149J8939
$$ plain form
880 5484 11953 -4758 -12397 694 9742 4100 -3533 -7267 -7387 450 9388 3770 -8102 -5366 7118
895 7118 7500 -5521 -9888 1203 11801 8357 -3073 -8726 -2651 6305 5211 -3497 -6121 955
909 955 6961 2358 -7365 -10005 -617 9738 6300 -6510 -8986 2222 8597 687 -7470 -2888 6565
924 6565 8235 1066 -6201 -6548 2661 9420 3011 -8157 -5852 5515 7220 -4217 -10157 -2151 6805
939 6805 5841 -2849 -7569 -3382 4954 6782 -1000 -6952 -986 8542 6427 -4494 -8247 690 9129
954 9129 4779 -5412 -6932 588 6111 1632 -5702 -6301 409 6484 3401 -6296 -8323 2087 9573
969 9573 2263 -7191 -3778 6192 6845 -582 -5253 -2986 3109 7225 2201 -7028 -6196 5035 7694
984 7694 -4204 -10307 -1461 6933 3444 -3176 -5154 -3006 2663 6174 -151 -8362 -1547 11316 7029
$$ packed form
880E484O469j6711p639J3091R048n642p633l734j20P837Q938n618j1872K736J2484
895G118L82j3021m367J1091J0598l444j1430n653O075Q956j094q708k624P076
909I55O006m603r723k640R388J0355l438j2810k476J1208O375p910q157M582R453
924F565J670p169p267l47R209O759o409j1168K305J1367J705j1437n940Q006Q956
939F805r64q690m720M187Q336J828p782n952N966R528k115j0921l753Q937Q439
954I129m350j0191j520P520N523m479p334n99O710O075l083r697k027J0410P486
969I573p310r454L413R970O53p427m671K267O095M116n024r229Q32J1231K659
984G694j1898o103Q846Q394l489o620j978K148N669L511o325q211O815J2863m287
$$ plain form
999 7029 -7340 -7757 3671 6484 394 -2293 -1679 -1009 4000 5133 -5307 -11835 -5 11396 2082
1014 2082 -9575 -3260 6715 3202 -3751 -3629 -1673 1455 7476 6621 -5006 -7640 4243 8339 -3595
1029 -3595 -9368 918 9117 4507 -3123 -6268 -4788 645 4435 -967 -5797 988 8546 3235 -6546
1044 -6546 -7319 -1206 4907 7363 2117 -5219 -984 8225 2167 -11542 -7370 8697 9013 -1955 -3092
1059 -3092 -582 -4557 -2759 4946 -410 -10710 1782 16680 1621 -17575 -4370 13444 2900
1072 2900 -9173 2002 8201 -2958 -1959 8557 -1774 -14554 1759 17190 -2737 -18723 2148
1085 2148 17430 -2014 -14230 657 6420 -5369 -2710 8135 355 -8682 5343 12933 -6848
1098 -6848 -16434 3708 15851 798 -8402 1991 6622 -2379 -5966 -2546 -1815 59 6113 5812
$$ packed form
999G029j4369m17J1428K813o090k687O14O70N009J133j0440o528J1830J1401r314
1014B082j1657O315R975l513o953J22J956L128O021q55j1627k634J1883M096j1934
1029c595n773J0286Q199m610p630l145J480N433L790n402m830O785P558n311r781
1044f546p73O113O113K456n246p336M235R209o058j3709M172J6067L16j0968j137
1059c092K510l975J798P705n356j0300J2492J4898j5059j9196J3205J7814j0544
1072B900j2073J1175O199j1159R99J0516j0331j2780J6313J5431j9927j5986K0871
1085B148J5282j9444j2216J4887N763j1789K659J0845p780r037J4025P590j9781
1098f848r586K0142J2143j5053r200J0393M631r001l587L420P31J874O054l01
$$ plain form
1112 5812 -3774 -8444 -1834 4614 1167 -5309 -2901 8079 10147 -3085 -11502 -1042 8569 440
1126 440 -4700 3897 5028 -3880 -884 7289 -4685 -15166 3902 17743 -4891 -19345 5698
1139 5698 19119 -6830 -17396 5851 10197 -9703 -3491 16739 1982 -16767 5159 20092
1151 20092 -11207 -26420 9983 26642 -6706 -18378 11037 13527 -15972 -13787 10409 2858
1163 2858 -11896 8343 20833 -8927 -23800 5256 17809 -9936 -16021 14349 21600 -4997
1175 -4997 -13567 1700 1653 -8869 -445 12179 3191 -6761 2262 7620 -8428 -18615 -1799 15531
1189 15531 7590 -7218 -1665 9868 976 -14913 -7990 8078 5770 -1989 7973 12646 -7460
1202 -7460 -17307 4038 11502 -12055 -13089 19596 21205 -14973 -19531 9314 5829 -18889 -3013
$$ packed form
1112E812r586m670O610O448l447o476K408J0980K068j3232q417J0460R611q129
1126D40n140Q597J131q908K996Q173j1974j0481J9068J3841k2634j4454K5043
1139E698J3421k5949j0566K3247M346j9900O212K0230j4757j8749K1926J4933
1151B0092l1299j5213L6403J6659l3348j1672K9415K490k9499K185K4196p551
1163B858j4754K0239J2490k9760j4873K9056J2553k7745o085L0370P251k6597
1175d997q570J5267m7j0522Q424J2624q988r952R023N358j6048j0187J6816J7330
1189A5531p941j4808N553J1533q892j5889O923J6068k308p759R962M673k0106
1202g460r847K1345P464k3557j034L2685J609l6178m558K8845l485k4718J5876
$$ plain form
1215 -3013 24630 5395 -18351 4454 17580 -17595 -27946 16318 30389 -9227 -16696 18837
1227 18837 14537 -24780 -18255 15711 7064 -14230 7482 24091 -8461 -26809 5356 18836
1239 18836 -13942 -20084 16776 24044 -9959 -17502 7597 8462 -10471 -4691 12720 4402 -9445
1252 -9445 1556 11232 -5853 -17689 1676 17941 2109 -14368 -1039 14585 755 -17404
1264 -17404 -6762 10739 3578 -6971 4913 13193 -4066 -12029 6075 9212 -14666 -13427 18744
1277 18744 19319 -14071 -14740 15692 10183 -20603 -11430 17835 6359 -16428 1946 18020 -9021
1290 -9021 -22106 10753 21914 -11942 -17746 17038 18209 -18280 -17730 14622 11717 -12632 -2055
1303 -2055 17820 413 -17894 1486 13678 -8964 -17343 9430 19194 -6263 -15448 6251 11998
$$ packed form
1215c013K7643j9235k3746K2805J3126l5175j0351M4264J4071l9616p469L5533
1227A8837m300l9317O525L3966q647k1294K1712J6609l2552j8348L2165J3480
1239A8836l2778o142L6860P268l4003p543K5099Q65j8933N780J7411q318j3847
1252i445J1001R676j7085j1836J9365J6265j5832j6477J3329J5624j3830j8159
1264a7404J0642J7501p161j0549J1884Q280j7259p963J8104L137k3878J239L2171
1277A8744N75l3390o69L0432n509l0786R173K9265j1476k2787J8374J6074k7041
1290i021j3085L2859J1161l3856n804L4784J171l6489N50L2352k905k4349J0577
1303b055J9875j7407j8307J9380J2192k2642q379K6773R764k5457r185K1699N747
$$ plain form
1316 11998 -6898 -10867 4581 7081 -4027 -2598 7382 2980 -7303 -1331 10242 2605 -11590
1329 -11590 -5349 11550 6278 -12388 -8177 10727 7447 -9968 -6149 9358 3230 -9895 190
1342 190 9943 -4474 -11991 8168 15651 -8006 -14368 11380 15496 -11513 -15359 9938 11205 -10217
1356 -10217 -6419 11768 3295 -12520 -172 12356 -5031 -15372 5837 16086 -5545 -14684
1368 -14684 6224 13740 -5105 -10397 5117 8056 -4386 -3830 5897 1481 -7598 -570 8856 491
1382 491 -9886 -1354 9691 2091 -10253 -4970 7406 4390 -6071 -3630 5739 2858 -4474 -597
1396 -597 5446 -1494 -6473 4258 9224 -4476 -10483 5540 11479 -5664 -11990 4714 10433 -5390
1410 -5390 -8461 5378 4795 -7362 -2856 8645 210 -10265 1856 12813 -1476 -12920 1796
$$ packed form
1316A1998j8896l969J5448K500j1108J429R980m402j0283N972J1573p637j4195
1329a1590O241J6899n272j8666M211J8904l280j7415L819J5507o128j3125J0085
1342A90R753j4417p517K0159P483k3657o362K5748M116k7009l846K5297J267k1422
1356a0217L798J8187q473j5815J2348J2528j7387j0341K1209J0249k1631r139
1368a4684K0908P516j8845n292J5514K939j2442N56R727m416r079P028R426q365
1382D91j0377Q532J1045p600j2344N283J2376l016j0461K441R369k881p332L877
1396e97O043o940m979J0731M966j3700o007J6023N939j7143o326J6704N719j5823
1410e390l071J3839n83j2157M506J1501q435j0475J2121J0957j4289j1444J4716
$$ plain form
1423 1796 12597 -1177 -10692 2113 8830 -2081 -6042 3053 2641 -5484 -2420 6564 1301 -8645
1437 -8645 -2095 8291 2381 -8451 -3091 7504 4348 -5318 -3425 3951 2354 -3053 -189 3647
1451 3647 -599 -3680 2526 4760 -3871 -7043 3237 7740 -3277 -8523 2073 7569 -2143 -6485
1465 -6485 2018 5283 -2232 -2837 3899 1718 -5402 -189 7988 984 -8087 -713 8464 928 -8710
1480 -8710 -1565 7053 1096 -5425 -523 3273 -1798 -3000 2861 2725 -4494 -2560 5526 3145 -5568
1495 -5568 -3906 5591 5270 -3519 -4122 3041 3537 -2418 -2227 2054 880 -2719 409 3029 -2003 -5174
1511 -5174 1533 5652 -1467 -6193 332 6155 117 -5247 301 4927 478 -2691 1167 1807 -2398
1526 -2398 -1456 4013 1622 -4925 -2490 5106 2231 -6151 -3753 4921 3397 -4086 -2925 3071 1535
$$ packed form
1423A796J0801j3774r515J2805O717j0911l961R095m12q125L064Q984n263r946
1437h645O550J0386n910j0832N360J0595l156r666J893P376j597n407K864L836
1451C647m246l081O206K234q631l172J0280M503j1017n246J0596N496r712m342
1465f485Q503L265p515o05O736k181p120N213Q177p004r071P374R177p536r638
1480h710P145Q618n957o521M902L796n071j202N861j36p219J934Q086k381q713
1495e568J662R497l21q789o03P163M96n955J91M281j174l599L128K620n032l171
1511e174O707M119p119m726O525N823o038n364N548M626m449l169L858O40m205
1526b398R42N469k391o547K435P596k875q382K398Q674j524p483J161N996j536
$$ plain form
1541 1535 -2764 -114 2789 -779 -2656 2566 4312 -2972 -4959 3121 5869 -2361 -5451 2200 4982
1556 4982 -2263 -4664 1352 2456 -2608 -1481 3272 304 -4724 309 5661 -267 -5683 712 6661
1571 6661 440 -5195 150 4631 -390 -3174 833 2143 -1920 -1194 3048 649 -4463 -1724 4447
1586 4447 1488 -4617 -1741 4115 2274 -3468 -2045 2047 1453 -1246 270 2345 -210 -1475 1299
1601 1299 2211 -2281 -3475 1972 4338 -1510 -4276 1199 3469 -1955 -4086 871 2526 -1142 -672
1616 -672 2771 670 -3693 -122 4331 -572 -4421 1541 5782 -264 -4675 195 2862 -1539 -2762
1631 -2762 2078 2048 -2001 -254 2748 -1105 -4645 323 4073 -70 -2742 1208 3413 -498 -2528
1646 -2528 149 463 -387 875 2429 -187 -1631 743 802 -1627 -2244 690 2075 1025 -440 -867
$$ packed form
1541A535m299K650K903l568j877N222J746p284j987Q080K748q230l090P651K782
1556D982p245k401O016J104n064J127M753k968n028N033N352n928n416O395N949
1571F661o221n635N345M481n021k784M007J310m063P26M242k399n112K739O171
1586D447k959o105K876N856j841n742J423M092n94k699J516K075k555j265K774
1601A299R12m492j194N447K366n848k766N475K270n424k131M957J655l668M70
1616f72L443k101m363L571M453m903l849N962M241o046m411M870K667m401j223
1631b762M840l0m049J747L002l853l540M968L750m143k672L950K205l911k030
1646b528K677L14q50J262J554k616j444K374N9k429o17K934J385j050j465m27
$$ plain form
1662 -867 -691 -346 -197 -1051 -481 2110 2113 370 -583 -632 -1189 -710 1060 954 -324 1040 2593 -508 -3615
1681 -3615 -1741 954 162 -218 1613 1391 -1218 -1069 531 -1665 -2644 1919 4158 644 -1531 957
1697 957 937 -2428 -2082 1422 1012 -125 2087 2139 -2389 -3378 756 992 -2301 -824 3558 1971 -1802
1714 -1802 -934 200 -2110 -1863 1973 2312 -866 287 2966 -34 -3558 -1258 1690 618 -343 1942
1730 1942 1362 -1431 -1180 -69 -1931 -1974 1709 3006 294 -1014 453 -203 -2032 -779 1208 405
1746 405 610 2893 1299 -2315 -1561 941 -479 -1452 1261 2448 -79 -1161 397 -972 -3248 -317
1762 -317 2578 433 -1154 1546 2105 -2161 -2506 783 975 -772 1213 2976 219 -2088 -34 649
1778 649 -2133 -1884 2023 1986 -334 -655 559 -1341 -1897 22 306 -102 935 1995 132 -1309 -540
$$ packed form
1662h67J76L45J49q54N70K591Lj743r53m9n57M79J770j06j278J364J553l101l107
1681c615J874K695p92l80J831k22k609J49J600k196r79M563K239l514k175K488
1697I57k0l365L46L504m10j137K212N2m528r89M134K36l293J477M382j587l773
1714a802Q68J134k310K47L836L39l178J153K679l000l524K300K948j072r61K285
1730A942n80k793K51J111j862m3L683J297k712j308J467o56j829J253J987q03
1746D05K05K283j594l614P54K502j420r73K713J187k527j082J558j369k276K931
1762c17K895k145j587K700N59m266l45L289J92j747J985J763k757k307K054O83
1778F49k782K49L907l7k320l21J214j900n56J919K84m08J037J060j863j441P69
$$ plain form
1795 -540 -206 -669 388 1680 435 -399 1445 474 -2852 -1905 1664 1013 -1865 355 2527 -685 -2835
1812 -2835 454 1135 -2124 -1276 3595 2283 -2820 -976 2886 -508 -3905 373 3827 47 -1996
1827 -1996 2008 1881 -3151 -2857 2422 966 -2833 -89 3464 -92 -3633 -445 1938 -649 -1704
1842 -1704 1976 2326 -1079 -1164 1148 604 -1771 -965 1780 1267 -777 -745 370 189 -1104 -1081 291 921
1860 921 -244 -926 699 824 -1376 -1366 1443 1277 -1753 -968 2817 1393 -2379 -962 2802 60 -3113
1877 -3113 196 3105 -527 -2656 1443 2365 -3115 -2863 3022 2275 -3044 -1442 3670 888 -4006 -762
1893 -762 3352 108 -2682 1815 3438 -1894 -2971 1700 1967 -2368 -1414 3052 1730 -2711 -1415 1618
1909 1618 222 -2291 153 2312 131 -1264 -12 756 -774 -1244 898 1753 64 -1261 106 1096
$$ packed form
1795e40L34m63J057J292j245q34J844r71l326R47L569o51k878K220K172l212k150
1812b835L289O81l259Q48M871j312n103J844L862l394l397M278L454l780k043
1827a996M004j27n032K94N279j456l799K744L553l556l541L188K383k587j055
1842a704L680L50l405q5K312n44k375Q06K745n13k044L2J115j81j293K3J372O30
1860I21j165o82J625J25k200J0K809j66l030P85L785j424l772J417L764k742l173
1877c113L309K909l632k129M099R22n480K52N885p47n319J602N112k782m894L244
1893g62M114l244k790M497J623n332j077M671K67m335R54M466j322m441J296L033
1909A618j396k513K444K159k181j395J252P68j530m70K142Q55j689j325J367R90
$$ plain form
1925 1096 62 -1508 83 1428 -76 -1105 -151 938 -714 -1445 914 1633 -1454 -1637 1528 1279
1941 1279 -1813 -1092 2411 1327 -2029 -976 1914 422 -1871 490 2279 -828 -2367 1129 1757
1956 1757 -1651 -1945 1675 1519 -1888 -1324 1474 578 -1450 -162 1863 113 -1218 624 1154 -1038
1972 -1038 -1308 880 1330 -345 -1434 311 790 -505 -781 -97 272 -216 -413 -39 52 -197 24 647
1990 647 656 -456 -760 709 863 -742 -1069 788 1136 -578 -740 592 719 -653 -533 585 -319 -1181
2008 -1181 247 1191 -535 -1318 856 1512 -694 -1320 326 891 -332 -546 348 404 -531 338 1200 -217
2026 -217 -1183 457 854 -638 -1247 -71 1052 513 -720 -181 72 132 -458 -272 139 -143 368 460 81
$$ packed form
1925A096j034j570J591J345j504j029R54J089j652p31K359P19l087j83L165k49
1941A279l092P21L503j084l356J053K890j492k293K361J789l107j539L496O28
1956A757l408k94L620j56l407N64K798q96k028J288K025j750j331J842N30k192
1972a038k70K188M50j675j089J745M79j295k76O84L69m88j97L74R1k49K21O23
1990F47Rj112l04J469J54j605l27J857L48j714j62J332J27j372J20J118r04q62
2008a181J428R44j726p83K174O56k206o26J646N65j223k14Q94N6r35Q69Q62j417
2026b17r66J640L97j492o09J176J123n39j233N39K53O0n90J86M11k82N11R2l79
$$ [...]
8191A60
##END NTUPLES=NMR FID
##END=
