##TITLE=1H_IBFP1204
 CDCl3
 8 sc, 
 13.4.2023
##JCAMPDX= 6.0         $$ Bruker NMR JCAMP-DX V2.0
##DATA TYPE= NMR FID
##DATA CLASS= NTUPLES
##ORIGIN= UXNMR, Bruker Analytische Messtechnik GmbH
##OWNER= root
$$ XWIN-NMR		Version 3.5
$$ Thu Apr 13 14:18:24 2023 Russian Standard Time (UT+4h)  she@DPX200
##.OBSERVE FREQUENCY= 200.13135
##.OBSERVE NUCLEUS= ^1H
##.DELAY= (6, 6)
##.ACQUISITION MODE= SIMULTANEOUS
##.ACQUISITION SCHEME= undefined
##.AVERAGES= 8
##.DIGITISER RES= 18
##SPECTROMETER/DATA SYSTEM= spect
##.PULSE SEQUENCE= zg30
##.SOLVENT NAME= DMSO
##.SHIFT REFERENCE= (INTERNAL, DMSO, 0, 15.7039)
##AUDIT TRAIL= $$ (NUMBER, WHEN, WHO, WHERE, WHAT)
$$ ##TITLE= Audit trail, XWIN-NMR		Version 3.5
$$ ##JCAMPDX= 5.01
$$ ##ORIGIN= Bruker BioSpin GmbH
$$ ##OWNER= she
$$ F:/spectra/data/she/nmr/H-F/1/audita.txt
$$ ##AUDIT TRAIL=  $$ (NUMBER, WHEN, WHO, WHERE, WHAT)
(   1,<2023-04-13 14:17:15.21 +0400>,<she>,<DPX200>,
      <created by zg, POWCHK disabled, PULCHK disabled
       configuration hash MD5:
       00 E9 B6 7A A2 85 ED C7 34 08 36 98 17 FE 4E 26
       data hash MD5: 16K
       60 4E BB BD 85 EB 6C DA 66 E0 FD FA 93 BC C9 E0>)
$$ ##END=
$$ 
$$ hash MD5
$$ 35 C1 AB 47 A2 A1 96 40 38 16 47 2F 6E 91 FA A9
##$RELAX= 
##$RELAX= 
##$RELAX= 
##$RELAX= 
##$RELAX= 
##$RELAX= 
$$ Bruker specific parameters
$$ --------------------------
##$DU= <F:/spectra>
##$EXPNO= 1
##$NAME= <H-F>
##$PROCNO= 1
##$TYPE= <nmr>
##$USER= <she>
##$AMP= (0..31)
100 100 100 100 100 100 100 100 100 100 100 100 100 100 100 100 100 100 
100 100 100 100 100 100 100 100 100 100 100 100 100 100 
##$AQSEQ= 0
##$AQ_mod= 1
##$AUNM= <au_zg>
##$AUTOPOS= <>
##$BF1= 200.13
##$BF2= 200.13
##$BF3= 200.13
##$BF4= 200.13
##$BF5= 200.13
##$BF6= 200.13
##$BF7= 200.13
##$BF8= 200.13
##$BYTORDA= 1
##$CFDGTYP= 0
##$CFRGTYP= 5
##$CHEMSTR= <none>
##$CNST= (0..31)
1 1 145 1 1 1 1 1 1 1 1 1 1 1 1 1 1 1 1 1 1 1 1 1 1 1 1 1 1 1 1 1 
##$CPDPRG= <>
##$CPDPRG1= <>
##$CPDPRG2= <>
##$CPDPRG3= <>
##$CPDPRG4= <mlev>
##$CPDPRG5= <mlev>
##$CPDPRG6= <mlev>
##$CPDPRG7= <mlev>
##$CPDPRG8= <mlev>
##$CPDPRGB= <>
##$CPDPRGT= <>
##$D= (0..31)
0 1.2 0 0 0 0 0 0 0 0.06 0 0.03 0 0 0 0 0.0002 0 0 0 0 0 0 0 0 0 0 0 0 
0 0 0 
##$DATE= 1681381034
##$DBL= (0..7)
120 120 120 120 120 120 120 120 
##$DBP= (0..7)
150 150 150 150 150 150 150 150 
##$DBP07= 0
##$DBPNAM0= <>
##$DBPNAM1= <>
##$DBPNAM2= <>
##$DBPNAM3= <>
##$DBPNAM4= <>
##$DBPNAM5= <>
##$DBPNAM6= <>
##$DBPNAM7= <>
##$DBPOAL= (0..7)
0.5 0.5 0.5 0.5 0.5 0.5 0.5 0.5 
##$DBPOFFS= (0..7)
0 0 0 0 0 0 0 0 
##$DE= 6
##$DECBNUC= <off>
##$DECIM= 32
##$DECNUC= <off>
##$DECSTAT= 4
##$DIGMOD= 1
##$DIGTYP= 9
##$DL= (0..7)
0 120 120 120 120 120 120 120 
##$DP= (0..7)
150 150 150 150 150 150 150 150 
##$DP07= 0
##$DPNAME0= <>
##$DPNAME1= <>
##$DPNAME2= <>
##$DPNAME3= <>
##$DPNAME4= <>
##$DPNAME5= <>
##$DPNAME6= <>
##$DPNAME7= <>
##$DPOAL= (0..7)
0.5 0.5 0.5 0.5 0.5 0.5 0.5 0.5 
##$DPOFFS= (0..7)
0 0 0 0 0 0 0 0 
##$DQDMODE= 0
##$DR= 18
##$DS= 0
##$DSLIST= <SSSSSSSSSSSSSSS>
$$ [...]
##$SUBNAM2= <"">
##$SUBNAM3= <"">
##$SUBNAM4= <"">
##$SUBNAM5= <"">
##$SUBNAM6= <"">
##$SUBNAM7= <"">
##$SUBNAM8= <"">
##$SUBNAM9= <"">
##$SW= 18.05172834244
##$SWIBOX= (0..15)
0 0 2 0 0 0 0 0 0 0 0 0 0 0 0 0 
##$SW_h= 3612.71676300578
##$TD= 16384
##$TD0= 1
##$TE= 0
##$TE2= 300
##$TE3= 300
##$TEG= 300
##$TL= (0..7)
0 120 120 120 120 120 120 120 
##$TP= (0..7)
150 150 150 150 150 150 150 150 
##$TP07= 0
##$TPNAME0= <>
##$TPNAME1= <>
##$TPNAME2= <>
##$TPNAME3= <>
##$TPNAME4= <>
##$TPNAME5= <>
##$TPNAME6= <>
##$TPNAME7= <>
##$TPOAL= (0..7)
0.5 0.5 0.5 0.5 0.5 0.5 0.5 0.5 
##$TPOFFS= (0..7)
0 0 0 0 0 0 0 0 
##$TUNHIN= 0
##$TUNHOUT= 0
##$TUNXOUT= 0
##$USERA1= <user>
##$USERA2= <user>
##$USERA3= <user>
##$USERA4= <user>
##$USERA5= <user>
##$V9= 5
##$VALIST= <valist>
##$VCLIST= <CCCCCCCCCCCCCCC>
##$VD= 0
##$VDLIST= <DDDDDDDDDDDDDDD>
##$VPLIST= <PPPPPPPPPPPPPPP>
##$VTLIST= <TTTTTTTTTTTTTTT>
##$WBST= 1024
##$WBSW= 4
##$XGAIN= (0..3)
0 0 0 0 
##$XL= 0
##$YL= 0
##$YMAX_a= 427183
##$YMIN_a= -268391
##$ZGOPTNS= <>
##$ZL1= 120
##$ZL2= 120
##$ZL3= 120
##$ZL4= 120
##$ABSF1= 10
##$ABSF2= 0
##$ABSG= 5
##$ABSL= 3
##$ALPHA= 0
##$AQORDER= 0
##$ASSFAC= 0
##$ASSFACI= 0
##$ASSFACX= 0
##$ASSWID= 0
##$AUNMP= <proc_1d>
##$AZFE= 0.1
##$AZFW= 0.1
##$BCFW= 1
##$BC_mod= 2
##$BYTORDP= 1
##$COROFFS= 0
##$CY= 11.3945322036743
##$DATMOD= 1
##$DC= 2
##$DFILT= <>
##$DTYPP= 0
##$F1P= 15.7292609196834
##$F2P= 12.9074282941183
##$FCOR= 0.5
##$FTSIZE= 0
##$FT_mod= 4
##$GAMMA= 1
##$GB= 0.15
##$INTBC= 1
##$INTSCL= 1
##$ISEN= 128
##$LB= 0.24
##$LEV0= 0
##$LPBIN= 0
##$MAXI= 10000
##$MC2= 0
##$MEAN= 0
##$ME_mod= 0
##$MI= 1.114404
##$NCOEF= 0
##$NC_proc= 0
##$NLEV= 6
##$NOISF1= 3.799351
##$NOISF2= 2.8
##$NSP= 1
##$NTH_PI= 0
##$NZP= 0
##$OFFSET= 15.70392
##$PC= 1
##$PHC0= -19632.61
##$PHC1= 13.60081
##$PH_mod= 1
##$PKNL= yes
##$PPARMOD= 0
##$PSCAL= 0
##$PSIGN= 0
##$REVERSE= no
##$SF= 200.130013532006
##$SI= 16384
##$SIGF1= 3
##$SIGF2= 2
##$SINO= 400
##$SIOLD= 16384
##$SREGLST= <1H.CDCl3>
##$SSB= 0
##$STSI= 0
##$STSR= 0
##$SW_p= 3612.71676300578
##$SYMM= 0
##$S_DEV= 0
##$TDeff= 0
##$TDoff= 0
##$TI= <>
##$TILT= no
##$TM1= 0
##$TM2= 0
##$TOPLEV= 0
##$USERP1= <user>
##$USERP2= <user>
##$USERP3= <user>
##$USERP4= <user>
##$USERP5= <user>
##$WDW= 1
##$XDIM= 8192
##$YMAX_p= 0
##$YMIN_p= 0
$$ End of Bruker specific parameters
$$ ---------------------------------
##NTUPLES= NMR FID
##VAR_NAME=  TIME,          FID/REAL,        FID/IMAG
##SYMBOL=    X,             R,               I
##VAR_TYPE=  INDEPENDENT,   DEPENDENT,       DEPENDENT
##VAR_FORM=  AFFN,          ASDF,            ASDF
##VAR_DIM=   8192,          8192,            8192
##UNITS=     SECONDS,       ARBITRARY UNITS, ARBITRARY UNITS
##FACTOR=    0.0002768,     1,               1
##FIRST=     0,             0,               0
##LAST=      2.2672688,     0,               0
##MIN=       0,             -268391,         0
##MAX=       2.2672688,     427183,          0
$$ Real data points
##PAGE= N=1
##DATA TABLE= (X++(R..R)), XYDATA
$$ [...]
1186A482k126m30K397j165r71J914j010j576J761L14j583J157N55j659K25J075
1202C60o83R0P41o39l78N20N5QN6J4J90l72k23P52k46n25R23q2j308J012N07j594
1224h22O93J334j887k12J708j326o44K191q86j499J957k64j862J876Q06k361R73
1241b25J468k028M31J767j641l20J537q34r59J681l00j214R05J52r49N31L10o98
1259c86L07K33l61o2J60j69L43j57k68M61k26l66Q16J3q44R00M7r77P86N23j242
1280d69N37P92j301J65J203j231k00J242p40q40J271l77r44J163R8j217P87M04
1298C43j045N30O33r00J97N85n54K1O74o50oP03m03j94N83l20l43N32m10k26N91
1319C41l00k76M37k56l61M91j03m54O35j80n80O24J01n50M15K37n75M16K75n40
$$ y = [1482, -644, -1074, 1323, 158, -813, 1101, 91, -1485, 276, 590, -993, 164, 719, -940, -715, 360, -323, -233, 508, -131, -509, 11, 66, 74, 130, 144, 334, -38, -261, 491, 245, -280, 643, 561, -747, 265, 772, -822, -129, 1205, -682, -894, 814, -512, -1156, 1035, 149, -1350, 607, 343, -1519, 357, 1163, -1198, -225, 1243, -785, -354, 1413, -228, -548, 989, 155, -804, 877, 577, -637, 268, 420, -529, 2, 312, -386, -79, 154, -207, -269, -109, -278, 65, -92, -360, 101, -125, -491, 325, 338, -506, 394, 441, -536, 250, 773, -469, 68, 860, -441, -276, 927, -304, -504, 738, -2, -842, 429, 52, -892, 271, 369, -848, -61, 343, -702, -172, 461, -439, -242, 343, -211, -190, 484, -166, -172, 531, 128, -66, 517, 197, -146, 386, -24, -250, 341, 41, -235, 202, -54, -415, 76, -27, -481, 154, -26, -606, 18, 119, -431, -16, 221, -354, 62, 337, -203]
1339b03J14P05o09j38O23k81k77N48l67l78O72l22k88L60p0m18K95L4m13M04L1
1360B2l64K32K27m43J83K46k85J51J97j58j39K97j64l9K76l9j67R6j49J35J62
1381B77l36j84L31J7k66K01j43j18L82l58k41N63q8m22L47Q3m04L07L25n20K40
1402gL22l79l3L76j44q1J99j15k07L65q3l22K89J22n60O5L65k00j91K51j07j89
1424b64K18q7k03L42K09m60q7M71k34j09N94n3m95K09K31m89K54O14n25k21L45
1445B60j96l05M53L4o17M17K23r83N44P76q02m46Q79l66o04P87K83p02M28L01
1465C64r50K44R67n42l23R24l54j014Q72M28j119O00P55j101n14J453n32q24J019
1484C53J60j355N19Q67j193L26J253j192q34J607k40j343J403P52j923M91J435
$$ y = [-203, -89, 616, 7, -131, 492, 211, -66, 482, 115, -263, 409, 87, -201, 159, 89, -329, -34, 0, -413, -9, 22, -342, -110, 117, -326, -143, 103, -182, -31, 166, 8, -131, 166, 2, -37, 239, 200, 33, 129, -20, 115, 277, -59, -243, 88, 105, -161, 40, -103, -221, 161, -197, -438, 125, 37, -385, -38, 45, -359, -52, 273, -247, -7, 315, -64, -97, 279, 135, 54, 253, 138, -69, 296, 213, -109, 180, 302, -258, -193, 172, -28, -219, 32, -75, -264, -46, -133, -336, 6, 215, -245, -332, 139, -95, -204, 390, 337, -158, 51, 282, -207, 47, 661, 136, -85, 260, 64, -241, 212, 246, -371, 46, 269, -714, -170, 606, -196, -642, 237, -129, -733, 54, 337, -365, 63, 364, -586, -342, 625, 83, -240, 684, 330, -684, 188, 616, -503, 97, 852, -249, -763, 690, 158, -666, 353, 513, -842, -323, 544, -649, -323, 930, -262, -1096, 511, 271, -1072, 331, 1083, -840, -349, 1086]
1501A086j395l37J924q45j459J639R1j873J361J136j848R9J496j497q44K286n10
1518E10j739J494N02k119P25J822j504o06J864j062j370J929M81j845R97J154
1534A233k167N5K234j116j211K070l18k164J489J227k142N10J805j872r72K233
1550H94n65j712J946M12k385R29J813k127j87K547j398j771K338J08k275J723
1566B90J498k520%K130j636r48K617n72k107J584O96k285R49J894k028o24K002
1583I40j133j331K101M12k113J052J004j832J6K026r46j054J545j76j709J208
1599A0J162j640K12J579j491r76J858J0j630J321N89k040L43J807j441m57J795
1616A011q95j445J534K56j451J079J031j817j35J585r37m23J511m14j424J042
$$ y = [1086, -309, -646, 1278, 433, -1026, 613, 704, -1169, 192, 1328, -520, -421, 1075, -422, -1266, 1020, 510, -1229, 265, 767, -1352, -627, 1195, -309, -915, 949, -113, -1483, 446, 927, -918, 79, 1233, -934, -879, 1355, 239, -972, 1098, 780, -1384, 105, 1332, -810, -300, 1505, -367, -1339, 894, 329, -1383, 563, 975, -1410, -481, 1332, -795, -982, 1565, 167, -1604, 734, 842, -1433, 290, 1788, -732, -732, 1398, -238, -1186, 1431, 859, -1248, 336, 1032, -1253, -304, 1590, -438, -1062, 940, -193, -1524, 577, 989, -1124, -72, 932, -900, -884, 1142, 196, -858, 687, 511, -1198, 10, 1172, -468, -256, 1323, -168, -1144, 714, 724, -906, 415, 1004, -1036, -693, 1114, -327, -784, 1011, 116, -1329, 205, 461, -990, 89, 1120, -697, -832, 753, -184, -607, 904, 490, -934, 108]
1632A08N32j104M68R19j036l38Q67m34l90P05K03q21J69M61p26J1P89j60m14J65
1652b6J15n80K88O22l10n33N85k11n68Q07L21o89J30L63n68l7R13m27m70O68l70
1673B3m82M98L59n82O4L04m75L0K88j67p8K99j74j81J66j0J08K10j70j53K35k31
1695a19M5L62j64j67M17l57k30M93m4l49L79j90m03M47P4l98J34L86o38J29L76
1716A83k10j82L30j12k28K85l8j66K23J2j64J39L0q5Q5K4P4mk67Q6K06k63o9M14
1740C03l37l69M83q1k86L57N0m07J95K61n12J60L73l71j27N42k53l11O82j85l98
1761b31K71K66m64K48J30l09K13J14k23r1K74k11j60K23j25P0q6K8p3J34r3J09
1783A4j15k0J54M2j58K2K18j61K3K21k46l5L32l23l0K81k01r8J72L5l42J23K45
$$ y = [108, 640, -464, 4, 923, -113, -451, 416, -18, -408, 297, 500, -321, -152, 309, -417, -406, 383, 223, -191, -26, 89, -491, -203, 419, 109, -424, 161, -50, -618, 189, 510, -179, -49, 314, -254, -291, 622, 195, -275, 393, 23, -459, 39, 398, -184, -120, 184, -291, -261, 27, -140, -218, 81, -93, -274, -108, -118, -10, 200, 30, -123, 112, -119, -74, 288, 124, -43, 374, 17, -213, 280, 236, -113, 266, 76, -327, 120, 194, -204, -70, 316, -322, -193, 183, -27, -209, 121, 9, -219, 66, 28, -138, 85, 97, -67, 72, 102, 17, 102, 126, 200, 196, -71, 15, 221, -42, -111, 303, -34, -403, 80, -1, -287, 70, 120, -287, -92, 169, -343, -183, 190, -181, -308, 234, -19, -330, 352, 167, -231, 40, 306, -158, 90, 220, -89, 124, 238, 15, -76, 198, -13, -173, 50, -75, -5, -91, -63, -136, -2, -95, 14, -101, -121, 33, 75, -83, -61, 157, -4, 19, 240, -6, -41, 291, -32, -62, 219, 18, -80, 92, 127, -215, -92, 153]
1806A53k80l5K73l19L5K21l32J17L17k22n4K07n5k16L30m7p3l2J28J24j93PKJ7
1830G3R1p5k0m4o9N9L3k29J35on6NJ23k18J68K5nj08Q6p4k8J95k4j25K10p5j08
1857f1J20K1N9qOk02J22J23q9r6P1j83J60q7O7j03Rp7J4KJ1K6N2NJ6q0J6M8J71
1886A33j25K7jN5LJ2J52k47L3J86j73n4J48k81J46L8r5k7R4r4n9J23k6p6R0K2
1912Dj58J33q3k9J0J71n2M3O9j9p8L6Q6lj04L5O0j12K4NN2p8Lqo0k6O0o8k7O5
1942d9m9r8K01L2k44K54m3j41J53L2p8P8O8o4m7J11r2j5J31L0l01N8K13j86K8
1967a8Q4qr8n1J13o5j14J44j38L1j7R2OKj2oP4L1q5O9J47j07n5J86m0j94J23j1
1995H3j04k7J53k06k1J18J0q9m8J11r8J29j1l1n6Q3o6r7K76l0j27P2p5M0Q5L3
$$ y = [153, -127, -162, 111, -208, -173, 48, -284, -167, 150, -72, -126, 81, 26, -190, 140, 93, 20, -12, 116, 240, 47, 54, 56, 73, 164, 89, 69, 25, -44, 15, 48, -181, -46, -52, -108, -103, 20, -198, -30, -5, -10, -118, -32, -106, -134, 61, 37, -88, 122, 47, -61, 59, 80, 139, 131, 137, -65, 57, 180, 91, -5, 66, -117, 43, -44, 23, -80, -71, -148, -134, -132, -121, -95, -43, -38, -22, -102, -86, -38, 133, 8, 35, 34, 89, 92, 104, 256, 9, 42, 228, 55, 1, 149, -132, 14, 52, -43, -70, 24, -70, -129, -6, -32, -108, -18, 4, -154, -21, -104, -133, -123, 48, -4, 39, 108, 89, 11, 47, 133, 130, 26, 61, 121, 9, 33, 38, 90, 12, 15, 7, -53, -79, -19, -87, -114, -49, -98, -196, 5, 37, -207, 47, 4, -137, 16, 48, -30, 48, 116, 52, 5, 116, 24, 9, 140, 170, -131, -73, 140, -46, -18, 66, 58, -40, -91, 22, -43, -157, -13, -151, -120, -137, -45, -39, -37, -49, -55, 19, 50, -35, 34, 181, 74, 19, 205, 165, -29, 94, 83, -21, -48, 105, -101, -122, -4, 6, -83, -131, -20, -118, 11, 0, -31, -87, -4, -70, -167, 109, 79, -48, 24, -51, -11, 74, 107]
2021A07n1R3k9k33J19J82q1o1o0m4k7L7%q2N9nr9O5J41j18k3K02j28j10J48O1
2047F3j64K0L80k07j19N5Rq4K65L4k87J4R4j95J16L08k46j77PN6j31K73K9k17
2071a04q8K51k95J23K21p0j43J54kk55J33K25k25L0L43l92q5K82O2k88K89Pl35
2094a62P1L43j69j64K24k44m12N47P9k10P6J99m45r9N05P7l80M28k61l87L80L52
2116C48m37Q2M93n41j60L97n9l23M08J7l56QK86l66m1N27j56n17M58j0m46L75
2138a3L44m93q1L88k65k03O56L8n84J76K18l48J04M65j89l23K67n7m47M30K50
2159C33n04J93J73l80j41N58j44l73L28J49n79J83N24m62J5L51j64m82N67J11
2179B56l78K66J44m27j13N71j55k98M34o1n09K64J70k98J9N06m58l02L10J81l56
$$ y = [107, 56, 149, 120, -113, 6, 188, 107, 46, -14, -58, -85, -48, -48, -130, -71, -76, -175, -110, 31, -87, -110, 92, -36, -146, 2, 63, -101, -81, 299, 92, -27, 28, 37, -47, 218, 252, -35, -21, 73, -122, -6, 302, 56, -121, -114, -58, -189, 84, 113, -104, -192, 59, -236, -113, 108, 38, -105, 49, 47, -208, -75, 150, -75, -45, 298, -94, -179, 103, 165, -123, 166, 173, -162, -91, 252, 83, -81, 143, -101, -513, 34, 113, -97, -21, 178, -267, -366, 139, 216, -164, 264, 3, -384, -4, 348, -89, -7, 486, -55, -215, 182, 123, -200, 208, 225, -131, -123, 163, -203, -244, 283, 127, -390, 68, 58, -388, -13, 331, -162, -243, 145, -120, -323, 333, 371, -213, -37, 181, -167, -63, 402, 213, -110, 157, 100, -347, 83, 333, -171, 22, 195, -185, -326, 232, 88, -285, 43, 192, -387, -204, 320, -142, -127, 224, 60, -422, 145, 256, -122, 144, 288, -139, -252, 319, 164, -134, 300, 239, -270, -6, 164, -134, -115, 391, -67, -369, -59, 122, -234]
2200b34J97K56m45J23K67k80k7K51j5k02J68R0k18n6M41k23k47K71n4k29K71J16
2222B21l51QJ96k75M2L25n7l91L51n9k90K59K03l56M3K99k53j26L26J29l86J51
2244IJ48k38P8J86j49j78L27j30o1J2J50j83K8M3j12M3q0J01q1PJ36j37n4J21
2268a4N4j70J19pj58K90n7q2P5J21k79k1K77p5k19K38Ql22J92K37l37Q6J14o2
2292Ho1o9n4J01J18j09j9K2m0L4J60j24j49K53k32J57J03p0PJ99j88l9O6l1r6
2317e3J77j49m9O1J70k42M9J14j26j2R3q0k8J36k72N8K88j59q5J30m8m5K05j43
2341a0j33K01k1m4J35J0j91J08k0q1O6m2m4mJ73k71O0K00k45O9P9k83J40J99j19
2366f8j3J39j07P8j7J05k53K35k2j85J10P5r2J19l7p0M0N2j75J07m5m1J08p0q4
$$ y = [-234, -37, 219, -226, -103, 164, -116, -143, 108, 93, -109, 59, 149, -69, -125, 316, 93, -154, 117, 63, -166, 105, 221, -130, -122, 74, -201, -159, 166, 109, -282, 69, 10, -280, -21, 182, -174, -131, 168, -85, -211, 115, 244, -142, 9, 157, -81, -3, 183, 34, -144, 183, 53, -8, 4, 154, -29, -1, 42, -70, -27, -107, -6, -87, -80, 56, -81, -135, -14, 40, -130, -11, -18, -176, 114, 57, -25, 50, 171, -108, -129, 148, 73, -146, 92, 100, -222, -30, 207, -130, -44, 70, 8, -53, -122, -176, -75, 43, -66, -85, -63, -103, -69, 91, -33, -182, 71, -161, -4, 99, 29, 36, 235, 47, 8, 74, 43, -53, 124, -25, -74, -13, 157, -85, -36, 78, -48, -60, 33, -47, -75, 61, -211, -153, 135, -24, -109, 21, -27, -72, 133, -10, -143, 58, 37, -7, 128, 138, -53, 55, 35, -46, 20, -22, -66, -70, 103, -168, -108, 92, -153, -84, -5, -288, -148, 51, -68, -81, 58, -49, 29, 12, 117, -136, 99, 77, -108, 2, 77, -15, 104, 67, -3, 37, 89, -86, 21, -24, -65, 43, -27, -111]
2391a11P7O2j56k5K98k18J1J04k7j25J19m0k6K38j59j16K30j14k08K07O6q8P1
2414G0J13k71J26N5j44n4J23l7n5k9N2p8K01j17o2pL1J10j25J63l5P5j98R2J58
2439A57k76J69J08j94l6K61k35M5J00r4j82L90j09k49Q1K24l53N3M30m83j42N53
2461B18l60q1K14J18m14K88K24l30O7J98k16j00L92q5k93M18j96l31J30M57l12
2482Fj54L17j33m46L85J74l47O9L02l76q4L87nl41L64J44n94K48M19n05J06L74
2504C10l69k86O16j24m28O02R8o66J7O19m85j4M59l22l74L50J88n56L56L18n02
2525a93r5N58l94k33P05j59l59L23K09p02K62M85l45j88L73j90l88M55K04n09
2545a81J35L39n89l1N92k38l31M42j25m47L67L95m00L8L23m80k05N97j50k97M50
$$ y = [-111, -34, 28, -128, -153, 145, -73, -62, 42, 15, -110, 9, -31, -57, 181, 22, -94, 136, 22, -186, 21, 87, -1, 70, 183, -88, 38, 93, -51, -105, 18, -19, -74, -103, -51, -129, 72, -45, -107, -114, -83, 27, -98, 65, 30, 105, -93, -1, 157, -119, 50, 158, -36, -72, 189, -46, -1, 99, 5, -177, 213, 104, -145, -64, 160, -193, -140, 290, -193, -335, 218, -142, -223, -9, 109, -305, -17, 207, -123, -56, 142, -74, -174, 218, 133, -160, 258, 62, -269, -139, 318, 6, -148, 169, 36, -410, -25, 149, -198, -129, 173, -203, -287, 100, 95, -246, 118, 262, -332, -84, 335, -170, -64, 310, -59, -345, 271, 147, -281, 321, 419, -247, -230, 389, -96, -110, 349, 27, -347, 3, 191, -365, -9, 309, -193, -288, 270, -124, -357, 348, 189, -170, 153, 362, -340, -78, 407, 62, -126, 247, 57, -331, 124, 328, -181, -46, 293, -296, -327, 265, 27, -304, 138, 13, -434, -67, 328, -72, -34, 289, -191, -396, 201, 51, -246, 204]
2566B04L0o83K77M98m89K26M15m66m00M26rl46M63K33o31RL56k30KM92k14n73
2588d10L81n1k40L64K67m75o0L43k50j33O45o0m59L07m9m48L73L21l19q5K96m29
2610a71r7M03J02l37J39Rm46K24L45k08PK52k77k56L27O0p6J78K2n45J74K71j87
2633h7J68J56k63k37L76k6k76M79M6m97K2K91k77L1L43p2l26J54m3l24N39K73
2655D50n12j52L66l72n2O15j91l33K50j2m36L54M36n58J71K85l69l20O55j9m51
2676a95L29P9n72L04K92l31j08M91m09k85N39m5l63L12L21o21M1M25k24j42N27
2697C65j12n59K89L16n83K75L73k95k99L25l7k95N05L1n83J90L25m45NN67k83
2718G5k45K95j18l46M32K57n23J95K29k91j00M30j41l73L83J06m88J20L71l03
$$ y = [204, 234, -449, -172, 326, -163, 63, 478, 12, -388, 38, 29, -317, 146, 379, -252, -243, 113, -117, -115, 377, 163, -410, -29, -80, -320, 44, 311, -164, -224, 119, -131, -264, 381, 321, -138, 169, 120, -328, 45, 366, 47, -38, 258, -171, -268, 135, 237, -100, 39, 48, -398, -174, 171, -37, -30, 222, -55, -311, 16, 76, 0, 178, 200, -345, -171, 100, -87, 81, 237, -26, -263, 113, 87, -189, 290, 336, -161, -139, 152, -125, -94, 249, 177, -149, 5, -38, -362, 177, 450, -62, -214, 152, -220, -272, 343, 152, -181, 69, 57, -379, -25, 411, -147, 24, 309, -60, -380, 275, 256, -195, 134, 213, -359, -55, 237, -94, -202, 289, -120, -405, 134, 89, -274, 38, 359, -262, -221, 204, -20, -162, 365, 253, -306, -17, 299, -284, -9, 364, 69, -230, 95, 58, -237, 268, 299, -284, -94, 231, -214, -209, 358, 75, -170, 125, 7, -339, 93, 350, -173, 22, 251, -40, -140, 290, 149, -224, 159, 265, -223, -103, 268, -35]
2738c5q0L54k24l93M81N1m48K52J34k97ML56j01k58L27p7l22K28K34k86j9L95
2760B76k46j13J55j1j71J81J03k57M3K24k12J6J41M3l63K48q4j05K07J54m49K2
2782a98L03j62q8K68n0k67J06J65j41j20M19k25j08J54k8J0p3J38j65l5J55j29
2804g1Q3N2j22K4R5k3j18MP9k5m7O2Jq5L7R7OPQr6j01J42M7r3N8nq5J10P3j27
2834a3q5O6Rj30J72l6q1P4L8j34J68r1K4pM9j84J20J44r0j34J56J4l6olR4o0J4
2862E2n7l3O8n0P9po2j6N8j19M2J8M1J7j7j63J13k5J8R4n5L8p6N5k7k4J40j91
2890h9J89j9q7K2J34p0k05K24n9L3k7L2m5J03j17m5m9N9j04O1J53j73k1R8l1J2
2916b1O3m7N3j48K74k79J71O2j95P2J7J3pN4j37K1K0J9k7P5l5r4K1N1oj2R7l3
$$ y = [-35, -115, 239, 15, -378, 103, 154, -294, -42, 92, -205, -201, 155, 54, -204, 123, 46, -276, -48, 186, -100, -119, 276, 30, -83, 72, 61, -110, 71, 174, -83, -40, 184, -28, -12, 129, 172, -191, 57, -27, -132, 75, 229, -220, -198, 105, -57, -145, 123, 73, -194, -88, 77, -64, -184, 235, 10, -98, 56, 28, 38, -35, 103, -62, -97, 58, -71, 12, 64, -58, -34, 61, 38, -80, -76, 3, -22, -69, -7, -6, -91, -54, 43, 49, 56, 64, -32, -133, 9, 56, -37, 21, 16, -69, 41, 114, -13, -98, -32, -23, -153, 19, -17, -98, -24, 14, -120, 48, -43, -19, -26, 23, -161, -41, 103, 13, -121, 35, 49, 13, 7, 4, 98, 38, 52, -5, -38, 30, -20, 59, 52, -10, -26, 32, -87, -45, -27, 14, 31, 14, -149, -36, -61, -43, 51, -4, 34, -42, 13, -14, -38, 102, -89, 100, 81, -6, 16, 150, 80, -125, 99, 40, 73, 46, 78, 33, 136, 19, -26, -75, -16, -120, -59, 94, -79, -100, -2, -33, -21, 42, -5, 48, -100, 174, -105, 66, 128, -67, 5, 22, 35, 28, 82, -55, -34, -14, 5, -22, 53, 18, -76, -55, -4, -10, -22, 75, 42]
2944D2r6l9O7n0J9K9j2k7R1k9l3O4Q4k26N4K01j18j66L38j11l00K36P5k33J39
2969aK19l08r1K15j11j27K85K6k47O6J47l52K71L31k14j61J33n5k48L58O4l04
2991a04J50K0j38L0K39j12k36K52k3l49K55J82k11l6K98k50k31L92k2k37K41J5
3013A25l76OL10j45j34M65l09j25L33j16k31K74K26m17o6L92l42J1L34m8n18K80
3035g1P9k80K66K11l44j95L72j09j50L13P3l41J80R8k99J25K67q9k55K42o9k62
3057b38L46K40m87L6L86l44k01M64r2l31K75O2m24J83L57l23L6K82k71k86M45
3078A15O8l27K69J12m23J24K82k66j24M82j07n17L55K8k17J47L06m15k12L95K
3099G7k98M19j2m16K36J69l57Q7K75j18k64K07o2k13L88M2k48k3K15k85O2M23
$$ y = [42, -54, -93, -26, -76, -57, -28, -40, -67, 24, -5, -38, 26, 110, -116, -62, 139, 21, -145, 193, 82, -218, 18, 93, -140, -1, 218, -90, -181, 34, -77, -204, 81, 107, -140, -74, 73, -279, -8, 323, 109, -52, 81, 26, -222, 136, 200, -104, 46, 66, -72, -42, 197, 85, -151, 101, 78, -271, -16, 166, -45, -81, 217, -33, -264, 128, 106, -131, 110, 125, -251, -245, 65, -80, -214, 251, -58, -183, 150, 34, -197, 77, 303, -114, -180, 212, -130, -119, 215, 167, -351, -71, 8, -272, -6, 205, -139, -334, 38, -71, -221, 92, 165, -176, 4, 102, -197, -72, 195, 106, -149, 93, 24, -238, 108, 348, -139, -103, 283, -61, -262, 202, 110, -221, 54, 116, -308, -125, 232, -91, -55, 227, -44, -330, 115, 183, -144, 125, 237, -186, -62, 220, -46, -170, 312, 205, -312, 43, 71, -146, 1, 307, -108, -320, 75, 77, -221, 198, 186, -230, 6, 175, -182, -95, 180, 62, -202, 5, -57, -270, 118, 160, -88, -111, 104, -181, -119, 304]
3121C04k28j72J28M9k47J1L60j83k6O0j57m0J15J91k73O7N5k45M7L18r6j63J86
3144F1m4j87P7L11k17J01K8j40r1J36Q4r2J28n8j70P2J2p2O8J40l2k34M5p0J06
3169c8J68m3k32J67j8j17J13QJ9O7q6o4k4O2R8L0j7k75J27J9K5J65j09o4O2q9
3195d6P5k0O3L2j57O4N7j12Q8Mk9k6L0n5o3Q5J31j28p7P3qo5J45M7o2q4MnL5Q3
3225G9Mr7N9L2j34K5J09j01o6R3n4J7J18l4J1m0M7o9j1L5M1m2K5Qj73Q5J00j23
3253e6Q1K3m5j06K17j13j7n4J08l4Rmj02NJ19p7j4O6n2oN4L8n8K1OJ3p4J23k4
3282D7o0O3l2l4N0O5j38j5J4q9J26Qnj18M7J46j36k3R4j18N8J34j61j09J57P8
3308D9q8N4p5J28j09J58k9k5l7O1l4J6rj22L9L9L9j34K23r8r0j3M1m3n1K56k04
$$ y = [304, 76, -96, 32, 81, -166, -155, 205, 22, -4, 56, -101, -141, -26, 165, -108, -41, 14, -231, -184, 134, 38, -125, 61, 17, -170, -93, 218, 1, 102, 130, -10, -101, 35, 119, 27, 155, 97, -73, -1, 11, -61, 7, 147, 115, -119, -74, -144, -38, 130, 87, -145, 22, 4, -113, 0, 8, 27, 94, 8, -56, -80, -18, 80, 110, 93, -182, -55, -36, -11, 154, 45, -19, 43, -46, 29, 9, 72, 104, -53, 11, 68, -44, 44, 48, 19, -7, 23, -32, -95, -10, 121, -7, -84, -11, -19, -84, 61, 108, 46, -38, -34, -39, -4, 79, 83, -14, 45, 77, -57, -32, 77, -24, -90, 3, -51, -34, 84, 50, 61, 21, 68, -1, -12, 23, 64, 22, 47, 55, -118, -33, 67, -56, 25, 48, 3, -103, 114, 1, -16, -70, 38, 4, 13, 9, -93, -88, 31, -46, -60, 6, -46, -52, 2, 40, -18, 3, 9, 22, -52, 71, 47, -13, 50, 18, -16, 34, 99, -39, -54, -40, -129, -3, 5, 0, -118, -71, 75, -61, -84, 10, -108, -50, 84, -77, -186, -29, 49, -39, 15, -60, 68, -41, 117, 88, 63, 26, 87, 53, 69, 60, -62, -23, 16, 55, -79, 144, 46, -44, -57, -16, -59, -110, 146, -58]
3335e8n2J96j04n9M2J17j09M6l5L6l7P5q3m6J3J47j1k08J57j66L3O6ko1J30j3
3361A4j4qN3j20JNN9K0l2l6m7J05MN2j34N1oN5p0J06lM2n7o6L4%l9J12o7l4o2
3392h2J70m4l7l4J3P4p3m7P1j00J32oj0Pp7l2N3R5j27Q5j06M8R1j31J12m9j0J7
3420CL8k0n5rKjP1q3J5J21j29M3m3n4N7J30p8j0K8J8q1J44p4%l8Q7l5r9R2oJ7
3451E1j9pr7J17m5k3M7j2j09M6N4L5j45J74o5J6m7l0L2j7lrJ05o8J4j07J72K1
3479H1o5K1Jm2On7J15q3R6j69Q8kj1K5j31Q4J6m6Q7k0q6l0J27j4J35j31m6J72
3507A21j48l6J81k7J2j36N5Q3j46m1J61q5m8M6NR6j40K5n5J33P6j92L8O5j36L
3533i0J31j11P3K6K9L4j57J52j09r6J69k1p5P9k1m6O8L7j65J04n1J14j05O2l6
$$ y = [-58, -110, 86, -18, -77, -35, 82, -27, 19, -16, 20, -17, 58, -25, -71, -58, 89, 78, -130, 27, -139, -106, -40, -42, -103, 27, 14, 0, -8, 45, -75, -74, -69, -10, 10, -22, -58, -105, 0, 4, 56, -78, -27, -33, 22, -48, 58, 55, 97, 40, -26, 8, 8, -31, 81, 14, -20, -82, 88, 44, 7, -27, -14, 60, -13, -60, 11, -89, 43, 37, 27, 34, -43, -75, -22, 73, -54, 31, -75, -27, 64, -67, 45, -4, -14, 3, 41, 21, -34, -43, -41, -42, 29, -54, -39, 82, -47, -4, -47, -101, -44, 86, 8, -2, 26, 44, -37, 107, 33, 33, -5, 82, 47, -52, 40, 34, 51, 32, 25, -72, 45, 0, -23, 24, 12, -97, -51, 3, 38, -107, 67, 2, 18, -29, -59, -27, -44, -47, -56, 49, -19, -5, -112, 60, 81, 16, 37, 38, -4, 2, -55, 60, -23, 73, -96, -8, -10, -21, 4, -127, -43, -27, -73, 14, -6, -92, -122, 5, -9, 126, -5, -51, 121, -27, -63, 118, 91, 103, -33, 22, 105, -41, -82, 79, -6, -54, -8, -3, 93, -47, -22, -77, 56, 132, -60, -22, 43, -93, -90, 41, -70, 3, 29, 58, 92, -65, 87, -22, -118, 51, 30, -45, 34, 13, -33, 35, 72, -93, 11, -40, 74, -31, 31, -5]
3558eo0J12M2j14K7L5l9m8P8pL4r1J10j72K0J97j04j05K05j59m2P2J31j17l9J79
3584A40k42O1J29j44l4J18k9j16P9K7p2Q8l6l3o4K05j22J01j6rr5M2Q9r3K8j3
3610a1k5P2Rn2L6L3p2p1M5J59j51mK5l6NJ36p0l9K1J37j31l5R6j38%J91j44MJ32
3639A22j26NO0k0j44J30O9q8j0Lm9n0J28Pl4l3P6M8J0p7n3j6J54r5p4K7J13j88
3667a05R9k3L9r5J71o0j29J8R1j19J67k3j11P1O0j35O8K6J0j30J80k1j91J35M
3692cLl0L1P3j60J41j06K9Q7j01M4N0j2n9j1M8p0R7r8k4L7nN2k4q9J44Om8Q0o5
3722A7Nr5J72j8%j2K6n7J9P0j85J23k5k0oj7JR1j5j1p5J02j08M6O7k0o0o8Q7m1
3752gp6Q8J9o6Q1l3k6j5N9k8Rm1Q0k0O6j25K2L2j25J27r4J03k9m9J5K6J5j6j3
$$ y = [-5, -65, 47, 89, -25, 2, 37, -2, -50, 28, 21, 55, -36, 74, -98, -78, 119, 15, -90, 115, -44, -86, -14, 117, 0, -39, 140, -102, -41, 88, -56, -90, 28, -1, -117, -38, -11, -83, 5, -31, -64, -128, 77, -45, 56, 40, 31, -64, -22, 67, -26, 2, -11, -36, 36, 45, -7, 29, 62, -10, -81, -36, 123, -28, -32, -7, -43, -38, 98, 28, -11, 10, 147, 16, -19, 77, -61, -61, 130, -14, -10, 122, -4, 1, 61, 41, -103, 27, 96, 8, -2, 1, -48, -98, 30, 37, 3, -30, 46, 94, 104, 27, -26, -42, 112, 17, -57, -30, 83, -105, -6, -29, 10, -85, 86, 26, -103, -85, 6, -113, 54, 31, -80, -9, 51, -84, -16, 10, 20, -110, 70, 49, -142, -7, -3, 0, -30, 1, 74, -86, 55, -51, -22, 65, -36, 8, 58, 46, -13, -24, 24, -46, 51, -47, -71, -34, -39, 13, -11, -100, 44, 50, 2, 82, 17, 22, -73, 99, 81, 81, 69, 95, 38, 57, 127, -58, 65, 40, 20, 14, -3, -2, 89, 74, 63, -12, 90, -18, 28, 95, 75, 15, -53, 34, -7, -83, 5, 24, -42, 39, 6, -20, -35, 24, -4, 5, -36, 44, 24, 90, -35, -13, 19, -106, 21, -73, 30, 1, -48, -33, -7, 8, -8, -21]
3781b1o2J97j68K1Jj4k4Q8j22O7N4nj8jl4J32j01J6Mq1J12j11O4M7k8nk4m1O2
3810Em2O4j8n8m0P6J4m4L4p2R0N0r1M8j14J61o0M6j5r7R5q6M0lL1j4r4J41l2o6
3840e1l2Q3K2p6LN1q0K5M2rn8N6n1J4J23q2R3m7P4r9Q9j58K2N4N1m1N9K6r3j4
3870dR6j7j11N6J6r6K3%l6J37j6j23J20q7J01n2%o6L9O8j47J69m6J8n4J18j13
3897gJ8p0l5J17km5K5l7o7J33O0j46J05j26J31l1M5m2rk0M7p4P9J7Kj00J63j58
3925b7K9L0rj8n1J6P8l8jl3J00q8j8p4O8O9q5P0j14J02l4pM6J7j30J86j34N5k2
3954a7N7k6P9j54k6J10K1j04J1J05n1JRRJ8j4N2r7J15j69m9O4p4J21K6lr1J09
3982C2K8m1J2P0k07N4R5j18L2m7J30j03j3J22l1j4k1R3j51Q8P0o8m8Q9j27Q8n
$$ y = [-21, -83, 114, -54, -33, -32, -46, -70, 18, -104, -37, 17, 12, -6, -7, -41, 91, -10, 6, 10, -71, 41, -70, -6, 41, 13, 8, -16, -57, 5, -37, 27, 9, -49, -89, -13, 1, -43, -9, -81, 9, 59, -32, 16, -98, 63, 3, 49, 34, -63, 32, -54, -14, -17, 14, 0, -94, 47, 15, -51, -83, 0, 22, -54, -51, 0, -80, -55, -13, -22, -80, -24, -75, -61, 62, -20, 73, 26, 100, 1, 90, -68, -46, 8, 59, 18, 77, 103, 10, -4, 92, 75, -36, 20, 36, -60, -37, -37, -73, 64, 48, -75, 45, -42, 59, 7, 7, -59, -20, 48, -99, 70, 24, 42, -12, 106, -7, 11, -59, -94, 23, 21, -24, 1, -36, -103, 30, 90, -56, 49, -77, 54, 23, 68, 26, 17, -3, 44, -30, 49, 66, 68, -32, 131, -27, 2, 32, 23, 5, -46, -30, 48, 10, 9, -24, 76, -12, -30, -104, -36, 33, -52, 18, -96, 6, -28, -35, 11, 28, -102, 84, -50, 5, -17, 40, 14, 93, -61, -87, 23, 44, -60, -49, 56, 5, 6, 15, 24, 42, 28, 80, -17, 98, -71, -120, -56, -130, -9, 17, 14, -77, 32, 60, 19, 31, 101, -106, -52, 43, -75, -43, -90, 40, -63, -76, 46, 15, 1, -20, 73, -78, 10, 80, 12, -36, 53, -74, 14, 9]
4009IK8p0NJ0j21K9J50j16L3J03J2j16P2m0L6LkN5j94K44o5q2mJ07j92K10j16
4036a2j24Q1J34o7j21J63m0j26J29J03j38j3M8j49J35J03q1r6N1M9j6M7n7j06
4060a03J73j04PjJ21j17l5J09oj12N0Nn2R9J7m1p4l3J16o2M7J00m4K1m5J3n1P8
4088G6o2Ql0P0o9M8R4k46N1L8p9P1N6p6o0J18p4q9J23O3l3k3r4J68j25Q2j23R7
4116b0j0N7o5J59q5lL7l5k9j06J63o0l6j01J88p3j4k1J7M5L5r0o0J08M1o3M7J36
4144A62k53J10M3j33L2J24l1Jk3K3l1J4L5r6k4%L9l4m0J08r5O7R0j18k5J76j68
4171d7l7J10l5q8K15j01nn2Q6lM2M0j38k5J67j01m3Q3l9p4J52m7q4K5R1r6j7o6
4199h7P1j04J46J45k35j2K46k36J8N7O7j64J40k7nk7Q3r7R2Pj49KO0K8m8O2K7
$$ y = [9, 37, -33, -28, -18, -139, -110, 40, -76, -43, 60, 72, -44, 28, -12, 24, 27, 25, 80, -114, 130, 65, -17, -21, 86, -106, 104, -12, -136, -55, 79, 12, -109, 54, 14, -112, 17, 120, -18, -31, 17, -132, 3, 106, 25, -71, -20, 29, 13, 60, 3, -103, 70, -34, -27, -28, 93, -24, -59, 50, 44, -68, -18, -13, -65, 34, 51, 10, -64, -97, 19, -43, 4, 104, 60, 81, 36, 49, -2, 76, 14, 22, -8, 62, -7, 41, 135, -111, -60, -22, -101, -30, 26, -50, -110, 8, -66, -155, -32, 31, -2, -25, -119, 49, -76, 6, -117, -20, -30, 27, -38, 121, 36, 33, 70, 35, 6, -100, 63, 3, -33, -134, 54, -19, -33, -54, -37, 8, 43, -47, -107, 1, 42, -21, 26, 162, -91, 19, 62, -71, -39, 85, 54, 55, 32, 55, 24, 38, 73, -23, -47, -47, -8, -42, -82, 26, -69, -2, 88, -30, -55, 121, -47, -84, 26, -9, -97, 118, 17, 12, -40, 46, 43, 85, 125, -13, -38, 129, 28, -15, 68, 29, -45, 107, 60, -24, 1, 92, -4, -21, -87, -16, -120, 26, 171, -64, -76, 170, -66, -48, 9, 76, -88, 52, 25, 20, -7, 76, -21, 71, 78, -71, -69, -9, 19, -29, 33, 60]
4226F0j11P1N6m6j09R1j15K5j0N0j15J08Q0r8N1J17r4j75K26nj73Q3J40j19j39
4251a51K35j31j00J39K8o8J03M1j44JR2j15j7J27n8L1NK5j12lJ02j8L8n2l0N0
4277A8N4l6r3N0m2K3J3Q1m9j29J42o6J5K2J60j61j1k2R2j25K2j7J4M7n2Q6o7J6
4305a5M2l9P0r1O2m8N6n4Jl5LM1R8j84N7Q0p7l5P4L1q3m4J38m9j5M0N9j44R8q
4335B9o1m5R6j37J28k5Pq1P4j4l0k8J14j40J38m1R3p5j49J35k8L5L7K7p3P4m9
4362A1Ljl8J2MkO1K2j31M5M9j8j9j15J29n3J58j63O4o8R9j26J17n1P2J5j81K01
4390I6j67J4L9J4q1K4J2J5J3J5o9P4L7j8l1M4m1m7K4q6R0J22j34J60k71J48oo0
4418g0N5N1po3P0p3J6o5M7K3Ml2k9Q0k7Q4n6l3O4j61P6Q9J5Ol1o4rJO5j1L9N1
$$ y = [60, -51, 20, 76, 30, -79, 12, -103, -78, -88, -38, -153, -45, 35, -63, -12, 105, 11, -164, 62, 57, -116, -33, 107, -12, -151, 84, -47, -147, -8, 20, -48, 55, 96, -48, -47, 45, -70, -87, 40, -18, 13, 18, 43, -69, -72, 30, 12, 50, -2, -32, 18, 72, 36, -57, -7, -49, -26, -13, 68, 19, -110, 32, -34, -19, 3, 163, 2, -9, -31, 61, -64, -42, -59, -45, 2, -50, 36, -31, -15, 27, -12, 58, -33, 29, -19, 37, -17, -16, -51, -48, -7, 91, -93, -36, 44, -33, -68, 6, 37, -46, -90, 48, -1, -16, 24, 83, -61, 37, 29, -32, -77, 19, -118, 10, -15, -8, -89, -15, -29, -59, -87, 27, -113, 25, -16, 77, 2, -147, -12, -40, -5, 32, 59, -14, 60, 11, 14, 13, -25, -13, -9, -11, 50, 72, -59, -14, 35, 17, -2, -117, 12, -41, 117, -46, 18, -50, 49, -77, 40, -11, 61, 76, -105, 96, -71, -57, -18, -4, -85, -61, -49, -34, -21, -6, -75, -1, 36, 18, -13, 31, -10, -57, -33, -119, -29, 93, -41, 119, -152, -4, -10, -70, -15, 36, 29, -34, 36, -37, -21, -86, -39, -16, -12, -44, -73, 7, -20, 64, 8, -25, 39, -122, -46, 43, 58, 64, 33, -31, -40, -39, 26, 15, 54, 105]
4450A05k00N4n0L2K5J9o7L3O6j53J09qJ02n5M8p2Mk6Q9n9M0q6Q9l0L6J7j55J41
4478D8l1q8J62k9n1K0J22k27O0O4r3m3J75m8j98J47M8j72J03Q1r5l3Q3p9J62j02
4504a4Po4N8P7n6k8k7O9p2P0jm7L2J11j40K4J26j19o0J05j9r6J88j34j59N1J92
4531G4j04m0J76j08M7p4O9r9Q9P5j02m1M9j2j3N1p1l7O2J3l5K6P4r9q8K15q2J3
4559B8P0j03j23J68k9k3L4O5j37l9K09Lk93K19L9j94Q8K1o6O5J13j11r1J26l2
4584Gr0O4L4j9J7L1o6j35J58O2j92J33J28k19P7J04l7j12J34j44k6J68P2j40o
4609CK03k11j19J04j2n2J12oj02J31Q9k33J44m7p5q7K37k6j49K40k87J03L7Q0
4633G7j49M6J31j61QJ05k2j68J44J09j30n0J83j94K8K10l21J24J16j08k2J04J9
$$ y = [105, -95, -41, -91, -59, -34, -15, -82, -49, 17, -136, -27, -35, 67, 12, 60, -12, -8, -34, 55, -4, 36, -50, 39, 9, 45, 62, -93, 48, 17, -71, 91, 62, 11, 31, 153, -74, -14, 50, -43, -86, 89, 41, -157, -10, 38, -134, -31, 50, -45, -78, 5, -74, 88, -14, -7, -71, -13, 64, 8, -20, -47, 22, -50, 20, 19, -28, 4, 115, -25, -1, 125, 6, -54, 51, 32, -64, 124, -10, -169, -118, 74, -30, -70, 106, -2, 45, -29, 40, -59, 30, 105, 3, -38, 11, -1, -14, 37, -34, -71, -9, 4, -31, -5, 69, -30, -118, 97, 15, 28, 98, -5, -128, 40, 11, -12, 22, 87, -50, -89, 120, 123, -170, 49, 88, -106, -18, 3, -63, 2, 115, 4, -87, 39, 7, -83, -19, 15, -4, 13, 44, -22, -157, 1, 63, -129, 4, 132, -87, -10, 94, 57, -55, 79, -65, -91, 77, 149, 9, 3, 206, -5, -124, -20, -32, -84, 28, 22, -80, 51, 140, -93, 51, 4, -71, -158, 79, 53, -96, 144, -143, -40, -3, 77, -72, -26, 105, -56, -48, 57, 35, -133, 11, 120, -10, -60, 123, -71, -43, 167, -154, -30, 86, -22, -44, 60, 79]
4656G9j51J19o1o0P2M1k8K2q6J06j09K3p2J35j32J11JJ04j13ppJ18K5j81OJ37
4682I2j22L6O1j31M6PR7r0l3J68k63J50K4k7j44K01Jn0q3K8J0J4J29q4l5rl5P4
4710C2p9nk9M2J28j06n7L0J20q6L7q4pQ5q2J17j12M6j4n5J07k9m9P2k3l8M1M0
4738D2q5lQ3m7R0k5j12K0k8J8L3M1j06O2j3Q3j32n1R2O9j28J55m0r5R0L7j61J41
4766C0m0M1l5j01R2P6J0r6M4o6R0j10L1Q5j39L6J5KoL5P4j45N5l3J00j49J37J6
4794D9j34R0O9R3j34J5q2J0R9q6K6J6j11K4N4Q5j10N8mj47J5k5K10n6J8%j28Q0
4822fml3L7J13j16J6j30J04K2J16q9r1N0P2p8K7J40j42n0K9N9o3J8rk4L8J3J1
4850C0J1k0L7j25P2O2r6M3oL6j74J32O1p3RJ2p2L6M0n7R7q1O0j21K6J40n9omj5
$$ y = [79, -72, 47, -14, -74, -2, 39, 11, 33, -53, 53, -56, -33, -105, 30, -102, 9, 10, 114, 1, -6, -13, 105, 130, -51, -45, 92, -30, 6, 67, -64, -18, -11, 86, -4, -37, 131, -132, 18, 42, 15, -129, 72, 73, 23, -60, -32, -22, -8, 121, 37, 2, -7, -42, 32, -47, -52, -81, -39, 89, -17, -74, -44, 76, -10, 27, -57, -64, 21, -61, 56, -56, -10, -24, -79, 28, -1, -50, 22, -1, -39, 2, 42, -43, -46, 37, -10, 80, 55, -57, -37, -65, -47, -14, 27, -79, -17, -30, 53, -79, -130, -38, 31, -97, 58, 18, -77, 13, 50, -111, 30, -10, 31, -4, -105, -13, 63, 73, -23, 21, -45, 45, -65, -34, 51, -88, -52, -37, -35, -41, -6, 68, -77, -22, -55, 45, -104, 33, 49, -85, 5, 74, 167, 33, 48, -34, -24, 75, -11, 15, 31, -80, -56, -2, 83, -27, 31, 27, -120, -105, -130, 80, 24, 42, 42, -86, -6, -10, -43, -6, 107, -9, 7, -123, -19, 3, 119, 30, -61, -11, 61, -17, 10, 150, 8, -42, -13, 46, -17, 1, -8, -32, 6, 19, 30, 41, 21, 58, -67, 5, 67, -29, 14, 8, 44, -130, 2, 63, -10, -1, 11, -61, -25, 15, -42, 55, -26, 34, -87, -61, 79, 20, 14, 10, -5]
4880eP0Qn2L8j18N2j1K8m4M7KR1j04n3M7l4J32j45k3J91r3O4o3M1j01R2j42M0
4908d5R4JQ7j50lRmm8J05r0L3l6P0j6L2k4n9L4J08j16L4N8Oq8n1R0l9J1M8L4j03
4939a8j6J06j23rM4n2RP7l8L7q1J3j01J38K2O4q8J45q1j03M5O7r5l2J33o4j28
4966a29R7K3M8n7J5l6J8Q6j08N4N6o6n0P0P3pj24O9m6K5o0Q5M6n2l0j13J06K6
4994A9J7O6q6j4k5J7j5K9j00O4m0ML7n8N7r1J61r6M3j2M0q5L0m2J78j36K0J1K8
5023B1m4L0L1n2j6J5m2r3R1Q8M8j30N4J3j6p3N4j12J63j3l9O0k4n9krP9j17J29
5052C5n3M5m7%M6o3Q5j3r8J7P3Ko8Q0p0P3l5p1R6Jp1pP4m7p4O2M0O7j6k7j14K8
5084e0jJ7m2j6Q0M8p3L9Mq4L3O3j52K08m8Q0r3L3l6L3p6J21j76Q5rq6Q2K1p4J37
$$ y = [-5, 65, 73, 21, 59, -59, -7, -18, 10, -34, 13, 15, 106, 2, -51, -4, -38, 94, -51, -74, 117, 24, 88, 25, 66, -35, 57, -85, -45, 49, 50, 137, -13, -16, -7, -11, -59, 46, -44, -11, -47, 23, 7, 39, 15, -44, -10, 98, -18, 16, 74, 80, -8, -59, 31, -8, 3, 51, 85, -18, -34, 72, -51, -60, -16, -68, -59, 18, -20, 17, -64, -51, -152, -14, 8, 72, -16, 129, 48, -55, -10, 57, -38, -70, 63, -1, -129, -32, -9, 39, -18, -3, -39, -21, 65, -43, 11, 67, 1, -49, 21, 94, 87, -37, 32, -14, 11, -49, 36, 82, 30, 0, -113, -7, 19, 36, 102, 16, 2, -23, -6, -21, 8, -92, -28, -68, -64, -27, -85, -28, -119, 42, -54, -11, -23, 17, -68, -38, -80, 98, -38, -18, -7, 21, -23, 7, 38, -14, -30, -15, -57, -150, -59, 29, 77, -53, 1, 14, -2, -75, -21, -133, 30, 17, -22, 38, 14, -45, -47, -56, 23, -94, 35, -18, 27, -20, -20, 26, -37, 48, 35, -63, -46, 27, 29, -39, 41, -29, 44, 9, -62, 34, 35, -36, -43, 31, -16, -90, -28, 12, 79, 63, 36, -78, -50, -51, -34, -76, -92, -12, 36, -37, 2, 6, -78, -45, 18, -134, 74, 26, 106, 13, 46, 10, 43, -33, 88, -88, -3, -12, -98, -16, 5, -69, 68]
5114F8J5j36J6J6K0j22J67J12k36PM6j3J18j36L4M2L6j03L8o2Q0n6Q0R9j65P5
5140D0j28R2k4R4n8r8J06M8j27N5l0lKJ33k36P2P3mk0mP3j6q2n2J37j4M6n6l9
5169b0lO7q3P4j1p1N9mL8j56J81p6n6L3Pj22J70k9j4j24J28Q6L7j51J13j51J13
5196C5j6o9P2j14J38p2J1R9j30o2Q7Opol3L9J02p5m5Qk1L8M0mj02J53%r9o6J10
5226A7o2J53r4Po2J09q2j20J58j18M5P9J8N0j56K4m9O3J7m6N6pj8m2N5O0K1r8
5254b2j8J17k4o2K3k7j5J12j88P9j6LJ5M2j1J3n3P0J0o1k6Q3Or5j7J16K1p3Q4
5283H6l4n9p7J04K3N8j16N1j1k5j20J9J68j15n2N5K5J0J2J20j76L1N1m3P1j83
5309a27J52l7L0N5ql7Rk6n8N3j33K59p7j14Q7j6Jl1K5q2R5L3j90N0J73q6l8O7
$$ y = [68, 83, -53, -37, -21, -1, -123, 44, 156, -80, -73, -27, -40, 78, -58, -24, 18, 54, -49, -11, -73, 7, -49, 31, 130, -35, 40, -88, 4, -20, 74, 16, -82, 24, 72, -55, 0, -30, -33, -31, 102, -134, -62, 11, 7, -13, -17, 56, 40, -42, -94, 43, 29, 75, 19, -20, -23, 44, -39, 35, 24, -47, 12, 8, 46, -110, 71, -5, -61, -28, -21, -143, 27, -2, -16, -140, -12, 74, 111, -40, 73, -78, 35, 19, -50, 22, -92, 46, -26, -15, 84, -46, -108, -21, -15, -22, -28, -61, -22, 80, 5, -40, -32, -53, -15, 25, 21, -81, 72, 72, -27, -93, 17, -45, 108, 14, 21, -41, 68, -14, -134, 24, -94, -49, 30, 48, 98, -58, -34, -83, -20, -3, -49, 7, 0, -18, -60, -5, 55, 76, -22, -40, 77, 53, -9, 14, -13, -28, 84, -104, -25, -41, -38, -23, 19, 8, 21, -32, 38, 48, -13, -39, 44, 50, -45, -62, 54, 75, 2, 86, 52, -7, -84, 20, 43, 101, -15, 36, 25, 0, -120, -101, 67, -48, -100, -45, -20, -10, 2, 122, -54, -23, 28, -15, 56, -127, 25, -12, 18, 73, 65, 28, 37, 11, -47, 6, -127, 132, 55, -59, 28, 12, 13, -18, 7, -75, 20, 53, -137, -87, 86, 0, -38, 29]
5337B9j07R6j2m3j0l3J20k9k7K0Kk0N7o4L5N3%r7K5O9j11P2l0j37J60L8m9k2O
5366il4J01n8k3n5Q9k7mp3J69q1m3O2j1K7j68J24j8R1q3J18r0jk5mJ2j7J25j62
5395f8Q1l5o5J03L2p3O7p7M3n0R8J6m5o4k1Q4q2N5o6l7R9N6n1l1J16k07K5O7m5
5424g5J48q0N5n7O6j23R6l6rJ02q2k4n1N3j0J0Rk9L9j09R5l0O6j6J9k5L8m7l2
5453c9M4k5k3J9%Mj5Q0l0m6L8N3n7O5j23O3nj01J81l5rj15R6Qq1K0j0R8j1Pj23
5484g2P3K4K8p2P3n8j06J48j1O4j27o2P8m0N1l4Q6pp5J58j95O4p4O8Q0q2RM5m3
5513imN1j47R2M3lm4Q7j33L5L4kK1k6jk1P6%n1p4j5Q5m2RK5r3J02K1j11P9J5J
5545@mj8Rq4J60q5j0K2R8j8j06L3Q8j63O7K0l8J11j34KQ0k0n4J05K7j11qP4pj34
$$ y = [29, -78, 18, 6, -37, -47, -80, 40, 11, -16, 4, 6, -14, 43, -21, 14, 67, 67, -30, -5, 64, -47, 25, -5, -142, 18, 56, 7, -15, -9, -43, 58, 0, -23, -78, 11, -16, -20, -93, 76, -5, -48, 14, 3, 30, -138, -14, -32, 59, -24, 94, 4, 3, -22, -26, -14, -31, 94, -68, 13, -22, -87, 16, 48, -25, 42, -35, 8, -42, 56, 72, 27, -37, -58, 26, -56, -1, -67, -104, -5, 51, 0, -31, 85, -122, -97, -30, -75, 73, -7, 48, -9, 57, -66, 30, -6, -15, 87, 5, -19, -70, -17, -27, -17, -8, -37, 2, -107, -12, -42, 24, 8, 27, 2, 40, -7, -39, 5, -20, -43, -24, -24, -20, -35, 45, 15, -31, 7, 60, 3, 68, -55, 8, 3, -98, 83, 48, 39, -76, 20, 28, -53, -33, -43, 55, 44, 51, -72, 1, 25, 53, -19, 54, -4, -110, 38, 27, 91, -36, -98, -20, -60, -9, -43, 43, 36, -39, 119, -76, -12, -86, -18, 62, -20, -11, 34, -9, -13, 38, -109, -17, 26, 23, -21, 66, -67, -32, 2, 0, 21, -5, -6, -27, 49, 49, -2, -76, -91, -6, -48, -39, -14, -107, -5, 16, -95, -16, -1, 0, -4, -22, -13, -97, 63, -22, -32, -10, 88, 70, -36, -3, 85, -78, -11, 9, -29, 82, -52, -50, 30, 10, -44, 61, 88, -23, -31, 43, 36, -98]
5575i8J41jm4j2J6p9N8R0r2M0qL0r7K8P2ml7Ll4K6m7J9Lm3J30r2l6J12m7R1j42
5606e4K5pL7RL1pk0Q3o8K7Lm2o7O0P5q6K5o0L8m5j6j1J07k7Po0L7N6k1O8r6J43
5638A44j71m7J22j0J9p6N6j10Q6Om9M2N5p4Qn8J7P6j49J33m7L9Rm0J8L3o2k6J17
5667F1m0k5l2J7M1nL0k5pm9J20l5r2M8L5K8j28Q5kO2pr3oJ2PJJ4k3P2p9k5q8O2
5700f6J23L3r4N0K2p6Q4j75J10j3n5N2K3L5o5K3J20o6m5k6k7PJ00j12J15m1o4
5727b8J41q5l3QK4Q4o4K2j27Q7mq3J47j9q5J33l0p1l3O4j1M4K6j24L1L8n0q7J15
5756C0P4n0j22P0J47k16k6J9J65j51j3K02j80N3k6P7j9q4K9J02k6j61J18Q6k8
5781G0r4P5q4K4o2J6M4m1mM4j1Mr8P3P4L1j17M0Krk2L5k4R5J9j40MN5N5o5K1k3
$$ y = [-98, 43, 42, -2, -14, 2, -77, -19, 71, -21, 19, 11, 41, -56, -28, 44, 40, 3, 6, -28, -2, -49, -30, -27, -70, 60, -32, -68, 44, -3, 88, -54, -29, -36, 1, 10, 41, 34, 14, 97, 29, 56, 59, 17, -50, 10, 85, -1, 24, -36, 2, -43, -59, -70, 37, 10, 17, -43, -6, 50, 29, 97, 1, 144, -27, -74, 48, 38, 57, -19, 37, -73, 13, 19, -30, 12, 67, -7, 1, -57, -40, 36, -113, 20, -27, 12, 21, -19, -1, 32, -30, -56, 61, 21, -4, -36, -19, 22, 17, 47, 22, 15, -34, 86, 51, -41, 7, 42, 70, -58, 27, 25, 87, 80, -13, -19, -7, 0, 1, 15, -8, 64, -15, -40, -128, -66, 57, 90, -4, 46, 68, -8, 76, -99, 11, -2, -57, -5, 18, 53, -12, 11, 131, 65, 20, -6, -33, -26, 74, -38, 77, 36, -28, 113, 28, -5, 3, 27, 111, 47, 69, -58, 29, 25, -58, 89, 70, -15, 118, 88, 17, -16, 48, 37, 81, 107, -17, 14, 52, 2, -85, 30, 104, 54, -68, 2, 149, -67, -93, -74, 91, -60, -73, 129, -51, 2, -24, 53, 34, -50, -21, 81, 55, -106, 12, 98, 70, -24, 51, -33, -9, -71, -55, -11, -52, -56, -12, -23, -19, -117, -44, 30, 61, -56, -16, -14, -23, -45, -10, -34, 61, 80, -60, -56, -1, 54, -11, 10, -13]
5813a3Q3r2Pj07J16n4J01l7l7R7j87P8j7L5J07j52J33p4kk5J03o3k9m1Q9K0j27
5840h8M6L9L8q4O1m0o7O0l9N9k4N3JN5M8o0n9oL0k3J4k4K0K5k9l1l9J41j04K5
5870bl3o1M5M2N9l4M8Kj24M1LJ18j30L1m0J8L4j2J2J0o6OJ39j18J03m8n3p9M3
5899d6J48n6m2L8l7M1m3o6K3J45j35P6n9l0J30j02l6R3kq4%r0J32Ok5J7Q7m3p4
5928c4J7k9KNj4N6J10p4m3j3O5o5j6O3Pm0j6k1n7J55q7M5m2Q7M7%j21L9o5R1o3
5959a1OP5k5k0o7PJ4Q5L0p9n3R1op3l2J15k9m9K4k8N8ln5N8m6j33J82l9Q3o6l
5990A1q9J33j34O6J7m8M4N9K7j60Lm2K28j04m6q3J33J2j6o1n3M7J93j02m9M7o2
6017b9J3M7l5J1Ql9M9oJk4M5J8K3m6J4ko7J2RrP6Nq4R7K6j72K9Q2k0l8q5J89j31
$$ y = [-13, 70, -22, -15, -122, -6, -60, 41, 4, -33, 64, -123, -45, -62, -27, 80, -72, 61, -13, -15, -40, 63, 0, -29, -70, 19, 39, -88, -42, -3, 35, -49, 12, -28, -95, -35, -74, -15, -39, 14, 15, 70, 118, 58, -1, -7, 23, 0, 14, -10, 10, 35, 6, -25, -64, 77, -27, -2, -35, -96, -51, -9, 50, 16, 64, 66, -58, -17, -14, 104, -26, 5, -35, -17, 17, 5, 17, 27, -39, -33, 106, -12, 91, 43, -10, -89, -46, 102, 46, 4, 42, 5, 46, 3, -63, -40, 105, -30, 46, -13, -43, 87, -15, -51, 42, 40, -44, -44, -134, -2, 4, -21, -4, 83, 40, -34, -17, -46, -44, -39, -53, 3, 113, 39, -4, -17, 48, -17, -33, 30, 37, -3, -19, -40, -97, 58, -29, 16, -26, 61, 108, 108, -13, 26, -39, 52, -11, -5, 70, 45, 25, -42, -35, -21, 64, 94, 15, -38, 53, 47, -26, -58, 57, 28, -21, 3, -25, 33, 30, -25, 33, -13, -146, 36, -3, 80, 14, 11, -78, 55, -79, -13, 4, -44, 0, 59, 86, -74, -71, -113, 115, 11, -35, -118, 15, 27, 11, -50, -103, -56, 137, 35, -14, 33, -29, -16, 31, -4, 7, 15, -24, 25, 19, 20, -4, 41, 59, 82, 36, 50, 48, -19, -7, 2, -7, 69, 74, -10, 87, 113, -59, -30, 52, 32, -6, -91, 98, -33]
6050c3J3N3p8K2L3L7j7n6j0%J05r8J4nJ12j09r6Q9P8p6k5Q5l4o6J34j56N7M8j4
6079Gj19OJ35j41O3R2n9NN4m8l0m5J28q8J66q5p1K8K5L4o7R3l6j00J38m0M0j57
6107g2J43j11L8O5j8j09LJ11j28K17n9j29M6N6q5L9j08R7k9jP2mj39kJ06r7J42
6134D4j5j69J94j6j18J12n0OpM2J5p5J08k2k4nL5j02J46p8qp7N3lJ5L7m6q7O3
6163c2Q2l3j36K7j5J15k2J02j0j17P9j42J34nm8Qm3M8P0k4%rq9J46j81K18p4j6
6191C3j05N3N4j54Q6P0k2j22N8M7n2P1J1k1O8q5j1O6m4k4r6R0O7q5N0pl2j2J08
6220F0p3O3m6o4K5N7J8qp8N7M0j23K9M7m0O9n4Pm5L2l3N6q9P2P4k8qp4K7L2k1
6251a9P9p4J2O7j01N4L9K3j34Q1P4q9Q6n2l9rR7j51Jj4k2Q6j6O5r7R8n7K1K4J8
$$ y = [-33, -20, 33, -45, -23, 10, 47, 30, -26, -36, -36, 69, -29, -15, -20, 92, -17, -113, -24, 54, -22, -47, 38, 4, -62, 72, -84, -27, 21, 7, -112, -106, 29, -112, -49, 43, -16, -11, 43, -5, -35, -80, 48, -40, 126, 41, -30, -2, 23, 57, -10, 83, 47, -53, 85, 45, 85, -72, 71, -40, -2, 63, 45, -64, -61, 50, -78, 139, 80, -49, -3, 53, -32, 7, -101, -4, -33, -34, 38, 34, -105, -107, -1, -98, 44, 29, -140, 54, 38, -80, 32, -18, -12, -19, 23, 38, -37, 71, 49, 25, 20, 55, -47, 99, 21, 13, -64, -11, -14, 1, 38, -8, -95, -32, 50, 17, -119, -92, -107, 8, -14, 88, 78, -39, 40, -102, 32, 27, -21, -13, -56, -8, 62, 38, 38, 29, -60, 86, -95, 123, 49, 33, -72, -19, 35, -119, -33, 37, 15, -107, -49, -2, -54, 17, 28, 7, 75, -10, -21, 45, 1, -23, -119, -29, 38, -47, 3, -4, -36, -48, 60, -13, 50, 4, -60, -35, 22, 40, 32, -46, 11, 51, -72, -43, 4, -36, 33, -21, -14, -59, -27, -60, -4, -93, -21, 53, 25, 17, -57, -30, 2, -19, 60, -14, -2, 65, -36, 18, 57, 80, -54, 27, 101, 12, 98, 46, 7, -2, 95, -56, -55, -69, -91, -5, -21, 44, -53, 45, -12, 9, 33, 51]
6281E1j45J28r6R7K0n0k9J07r0l9Q6o5r8R4j6O8o8J19p6k8Q1j53j8J27Rm7K8Q6
6309H3j60J25k6Okok0j03N3oJ02J0r6k8J09j7Mj0K5j5o8J23o2Ro4M8o7P5Qj58
6339a28P6j4J54j16N7q7Q4n4K6L3j7o4KQ7Kp8K9O8q3j5Q3l2j14R6lk3k8M0J03
6368H4p5j2J05j24K1L8j85O9J11r4M9l4kO6O0n0J3K5o3m4K4j1J4J8qM5k2j76K35
6397G7p3N1k0m2O1n6M3m5N3j07P9l2pj36K00M7j59L6O4j03qMP9M0m5j8PO3m4l4
6427b5j1O7k0nl4J21j48j8J05p2L1K5l3P1j39MJ29l2r2R9j00J23j5o1L0O7m6N6
6455G7JJ0j69O8j1k7J33j49Jm5Q8L6m9jR1q8P2n1o4R3Q4j17LJ9n4J0L4J4K5mo
6486B4MM3l4m5J24m7o5l8P1l8M0j14K7OK6rM8p1R9q0J32j50J14k3lL3k9K5l9j24
$$ y = [51, -94, 34, -62, 35, 55, 5, -24, 83, -7, -46, 40, -25, -123, -29, -45, 23, -45, 74, -2, -30, 51, -102, -120, 7, 16, -31, -3, 83, -77, 48, 22, 28, 26, 20, 0, -103, -50, -56, 46, 56, -40, -68, 41, 24, 28, 18, 43, 28, -40, 83, 21, 30, -34, 14, -53, 22, 30, -128, -52, -66, 88, -28, 29, -58, 26, -28, -2, 31, 14, -50, -48, 39, 41, -37, -8, 60, -23, -38, 45, 13, -101, -5, -8, -31, -59, -19, 84, 9, -3, 102, -22, -1, 37, -148, -79, 32, -62, -13, -47, -49, 17, 77, 27, 40, 65, 2, -42, -18, -29, -15, 3, -5, 40, 18, -158, 77, 4, 55, 35, -7, 54, -2, 41, -4, 49, -58, 21, -11, -18, -154, 46, 93, -66, -30, 34, -69, -77, -73, 6, 46, 1, -17, -10, 53, 9, -25, -36, 31, 11, 6, -28, 93, -55, -73, 32, -40, -9, 16, -17, 54, -85, -81, 48, 16, -76, 23, -77, 46, 31, -30, 0, 67, 21, 77, 78, 88, -81, -13, -24, -51, 82, -67, -66, -111, -23, 13, -36, -37, 54, -34, 38, -13, -77, 16, 100, -17, -14, 5, -49, -39, -5, 9, 34, 30, 24, 28, 71, 37, -8, 116, 69, 4, -34, 37, -1, 39, -75, -48, -42, -16, -25, 23, -48, 51, -29, 103, -47, 67, 44, 41, 74, 45, 70, 31, -93]
6516i3J3J05n8O0M1L4j66J09m2o7K8R5p3k0N4m5Nq4O0L2l3j6L8o4J09o2N5j9j4
6545a8J5j3J04k04R4j3l8N2p6R4m6K2ko3L3L1P8j25J34p2J9k1L4o9P7Rn6J4ol
6575a5j3k6K2L7kq5J4J01J7j33mK55j83l2J22k2l6q6R1q4K7L7L9n7J6k4N9m2p8
6604h5oO7oLK2Q6j62L4J66o6m8n7L5qP0m4p3O5M2q5O0o7K2NjK2m4J28q4P9j12
6635d2O1O3Pj9j21J0J02O1o5j10P8kp6Q8P3q9k0Pl8Q0n7P2r5M8r4J0N5J4N9m3
6665A7om0nrJ4J4J24p9n6K1K1j03J79o3m6r0J27M4r0L5q0rJ02K4o1Q6j29k9Q9
6694Bo8O5o0j1N7L7L6l7n7M7j1m5k1J62k7j28N3O3r7JnJ23j7o2l2pN9j4O0K4m6
6725D4j7M1j8N3j16L3o9P1KPjq5P6ln2q0K16j53J13m1k0M8m3n6qN3o8N9k6J12
$$ y = [-93, -80, 25, -33, 27, 68, 102, -64, 45, 3, -64, -36, 59, -14, -34, 20, -25, -20, -104, -44, -12, -45, -61, -23, -87, 22, -40, 15, -4, -18, -3, -16, 88, -116, -22, -35, -73, -21, -97, -3, -49, -27, -29, -92, -59, -28, 50, -75, 59, -13, 6, -15, 19, -50, 27, 36, -20, -6, -12, -15, -28, -54, -32, 5, 3, -82, -68, 33, 50, -83, -87, 168, -15, -47, 75, 53, 17, -69, 22, -62, -35, 2, 41, -16, 0, -24, 35, -7, -85, -91, -24, -30, -27, -5, 81, -81, -47, 119, 53, 5, -52, -17, -25, 45, 1, -72, -7, 35, -50, 10, -57, -35, -30, -31, -9, -53, 75, -9, 70, -42, 19, 82, 89, 70, -51, -41, 61, 122, 57, -53, 25, 23, -53, 35, 108, 19, -1, 6, -32, 48, -9, 63, -32, 16, -78, -68, -13, 1, 60, 17, 11, -29, -34, -43, -29, -15, 109, 30, -26, -5, 16, -87, 92, 29, -17, -107, 20, 64, -26, 9, -71, -80, 22, 46, -15, 71, -58, -87, 2, -66, -1, -61, -72, -15, 22, 58, 21, -36, 11, 0, -45, -66, 96, 69, -59, -6, 57, -40, -39, -44, 79, 62, 0, -32, -39, 20, 6, 66, 90, 44, 27, 68, 50, 103, -13, 20, -49, 22, 24, 31, 30, -55, 21, 18, -34, -114, 102, -51, 62, 21, 1, 49, 6, -50, -58, -5, -73, -14, -40, 72]
6755G2j9j8q3k9J07Ko3J5Q7n5j26J19Pl7K6o6L5m2K7J25j10O3oN9j23l6J65j28
6783c2j2rR2m8J23j62P5kj07J05Rm9o2P8M2l8Nr8L6L0P4k6n4J7L5M6m8j08J13
6812B5n5J0M7l5k0m2L8J01p6j3M5q6J9J07o7k7J4J6L3j19J72l8O0p5rQ7j18L3
6840B7k9P5Ll7p0N7L2n0j2QK6j6j7l5N7n9R2q0Q9N1k22N8o2J85q6l7J39q9m5J99
6870A52r7j9K8j9o5Q0K0p0m3l3J21n4MJ8O2J4r8k9PJ0R2n7k0J0Pq1P7o8J24j11
6900c8J53q4o1L0q6J32l6j6j7QO0k3n2L0L7j01Q2j2r1Q1J0pp8Q4N1J1j59J06L0
6929D4p6N5j5m7M1NL9j09k4M4J28p3o5L8o5Q9N2k8q3P2n1%N0p3Q9q3J39K2p8r1
6959e4M8P9j68J02n4O6m4L1m3l1J21jJ7o7r6P6K9j3N5j29QM5K9J9k4Q2n5n5M2
$$ y = [72, 53, 35, -48, -77, 30, 32, -31, -16, 71, 16, -110, 9, 16, -21, 5, -61, -26, -68, -41, 84, -26, 37, 31, 90, -33, -69, 96, -32, -44, -53, 39, -9, 114, -48, 27, 25, -82, 23, 32, -17, -79, -1, 41, 3, 8, -90, -54, -24, 50, 24, -30, -13, 22, 68, 20, -88, 25, -30, -20, 27, -8, -28, -70, -32, 69, -7, -20, 25, -61, -42, 65, -2, -29, -15, 1, 34, -85, 87, 49, 109, 34, 25, 112, -6, 27, -2, 73, 76, 39, -31, 26, 58, 8, -4, 4, 30, 14, -3, -38, 19, -40, 52, -28, 61, 112, -110, -52, -114, 71, -15, -52, 87, -2, -47, 152, 55, 36, 64, 45, -20, 60, 80, 10, -33, -66, 55, 1, 5, 23, 85, 99, 1, -28, -21, -11, 81, 24, 4, 14, 21, -60, 17, -51, 73, -38, 115, 31, -30, 0, -86, 46, 10, -6, -23, -15, 45, 22, -30, 0, 37, -64, 18, 6, -85, -4, 6, -1, -79, 5, 56, 67, -92, 14, 44, -32, 23, 8, -39, 2, 7, 46, -63, -87, -43, 85, 12, -53, -15, -80, 9, 61, 33, -50, 22, -29, -29, 21, -52, 37, -46, 93, 115, 37, -54, -6, 73, -95, 7, -47, 19, -25, 6, -37, -68, 53, 52, 69, 2, -94, -18, 11, -2, 53, -76, -68, -23, 6, 25, 1, 83, 28, -27, 15]
6988A5n5Q6N1o8j6k0N4mr4P5j40J12K3k9J9N0n3p0J0R8m7J4L9J8k3l5o6J23p8
7017a1L0l2m1KN9k8k3j5O6mm0J4J28o7j1L9j31P5N0o5nM5o0J2o7Q5m3N0L2L7j9
7048F2poo4kJK3j8O2kJ2m7Ln9R5q3k9R1q3K7O6j1j23L3O4k6j1O9Q9j54L1%k5K2
7081@p2oM0l6L4j13M6J36P7j71j5J45m9MK1M4j25J2L0J00j09m7N9R8j20J3nJ2
7109CjK6o3N6Ojo1o1J17J2m5klK1M9j12J89p5p2J4O0l2L1j3j14O6j1O9J8k01J57
7140B7J10j40R5q8o7PQ1k8J43j45o1R1nm7N6J9Nr9L2o1J7O2j10J56r0K6J4J3L2
7169D5j14R2mn4J1o0l1M4Q3M0k2n0L9L6j33Q5K9o2o6J38ol3nj7M3J2j40LJ81j93
7199a09R6K6M4n4K3M3j07m4N1l3R7L7mr1l1LJ8J00K1j50P1J4k2n9J16m8pM7N4
$$ y = [15, -40, 46, 97, 29, 13, -7, 47, 43, -51, 24, -116, -4, 19, -10, 9, 59, 6, -64, -54, 44, -3, 11, 50, 68, 45, 10, -56, 67, -11, 19, -13, -54, -52, 7, -21, -44, -59, 7, 3, -37, -23, 105, 38, 27, 66, -65, 10, 60, -5, -10, 35, -25, -13, -80, 5, -38, 12, 44, 81, 62, 55, 49, -15, -17, -16, 7, -11, 51, 49, 61, 14, 17, -42, 53, -30, -59, 32, -51, -24, 42, 31, -92, -59, 5, -21, -32, 37, 126, -28, 3, 3, -22, 0, -72, -78, -38, -74, -40, -153, -107, 29, 106, -65, -80, 65, 16, 20, 41, 85, -40, -28, 2, 102, -7, -54, 5, 103, -17, -4, -9, 3, 2, 28, -35, 21, 27, 26, -35, -96, 21, 33, -12, -14, -17, 4, 53, -59, 130, 55, -17, -3, 57, 25, 56, 43, -71, -5, -16, 53, 71, -130, 27, 137, -3, 92, 4, -63, -56, 25, -3, 140, -5, -66, 25, 20, -27, 29, 48, 53, -46, -14, -75, -58, 4, -106, 50, -40, -14, 0, 13, 45, -69, 23, 19, -35, -24, -84, -115, -71, 12, 52, 30, -20, 19, 55, -78, 7, 36, -26, -92, 46, 40, 7, 2, -15, 28, 40, -100, -97, 84, -109, -13, 13, 57, 3, 26, 69, -38, -82, -31, -64, 33, 70, 66, -25, -56, -53, -35, 65, 86, -64, 7, 21, -1, -60, 56, 8, 1, 48, 102]
7228A02r8j04Q2j1q5R3L6n4J01o1j1m9M6N9O8q5r8J33m8N6k3j57M5J34l6l3l5
7255c3M9k3L2oj3M6l5N9r3M0M5j07mJ01j17k3O9Nn1R0n1J19j25J8N2j07J7J17
7283G1j26L4n1Q9j9m8N0pR4j05L0J3m8L7M5J9j27k5R3r0P0m8J04o0J3n1J47q8
7311A6o9Q1o9P1l4j8Q5j05J48j35Q2q6j0J3o6R8m0L9j05R1J9r1J70q7rk9qJ60
7339A12r2q0L8r0R9J4j7N8k1n5m9O6jQ0j5j13L0o3Q0m3Q6n2RM6o1Oo2P9j5N1l
7370B2j06L9O6l9L8mM1q0P5k0O9j29L7KJ1m5k8J29o3n6J1O6l2Q1j5p9k0M1Pqo4
7401e3K4L4m2O0p2N5k4M5k6J6K2q2m9J55l3r2l5R6J3mM0l0nJRL8j19lo8J25m2
7432d6R3L1j29k9M3O6n0RM0n7l4J41n3m1O1j45M9m0R4ok0M9Q6j37n2kK4j0K6O
$$ y = [102, 4, -100, -18, -29, -114, -21, 15, -39, 62, 1, -10, -59, -13, 46, 114, 29, -69, 64, 16, 72, 49, -108, -63, 71, 35, 2, -33, 16, -7, 25, 19, 6, 52, 17, 76, -17, 23, 68, -39, -43, 58, -59, -82, -13, -8, -59, 31, -20, 99, -26, -8, 44, -63, -46, 71, -55, -21, -72, 17, -2, -50, 0, -7, 87, -18, 12, 25, -23, 14, 59, 78, -49, -74, 19, -71, -1, -49, 55, -5, 8, -43, 104, 16, -53, 28, -41, 30, -4, -22, 63, -42, 106, -29, 53, -33, -43, -30, -96, 2, -38, 1, -104, -13, 6, -85, 85, -2, -11, -40, -48, 112, 20, -60, -22, -112, -13, 1, -16, 42, 21, -34, -83, -17, -18, 62, 47, -66, -36, -99, -19, -62, 24, -28, -19, 27, -34, -28, -90, -11, -26, 25, 22, -84, -45, 21, -18, 20, 16, 57, -23, 52, 32, 101, -28, 9, 11, 22, -23, -51, 78, 15, -41, -30, 36, 4, 85, 70, -9, -29, 12, 19, 11, -53, -29, 5, -37, 23, -49, 6, -18, 27, 1, 17, 39, -43, -92, 63, 30, -62, -97, -1, 12, 8, 48, 18, 13, 14, 23, 61, -58, -61, -129, -4, -46, 47, 78, -51, -80, -37, 29, -21, -12, 28, -29, -63, 78, 25, -16, 45, -100, -51, -91, 3, -3, -23, 26, 112, -25, -77, -79, -55, -65, -39, -33]
7462c3J4q5K08j78J3P9j8o4K0Q2ll9NP2j34J28r7J06n1j2k8K7n6O7r2Nm1J57n5
7491cR1m1k5o3L6m2m6J07r9J56j17J01j15J36j40O1N6r9k4N8N3q2J4k6O3K9po7
7519c5R3j2k5p3O7J4q1P7QR4r3q3N6j4%M4r3L7J0O6p1P0j09R8Lr6J6O3m9Po1K3
7551d9L9l1J29j31K9K7n3J25j28J02j40J29M1j49K7N0p2Q7P3o6k2J2j05J2L2L2
7577@P1l3m0q0J15L8o4j5Q5p7J4k8m4L6K6K1K7n7M0o3O4j02J7M1j42J84m3M2m7
7606a4P3N9%j12J09j44O4j42L8J06M2n2l9n5P7r0L8P3K7j1o7j8K6n1j5J11n2K2
7634Clj7N5m8L3k4K9j9k8J2l0J27p0rLL7Pj5L8j90L0J24k3n7L8N8j24LMJ7K0O5
7666D6m9q2P3M9j38L9P2l7P7j05M5J6n0K10p2o9m5N4R4o5j07J15o1J2QK5l5J6
$$ y = [-33, -19, -104, 104, -74, -61, 18, 0, -64, -44, 38, 35, -4, 1, 73, -61, 67, -30, 76, 25, 13, -15, 12, -44, 23, -69, -64, -105, 52, -3, 88, 47, 22, -41, -5, -47, -93, 14, -85, 71, -46, 55, -60, 76, -64, -3, 53, -46, -70, -12, 41, -41, -27, -53, 10, 39, 32, -35, 58, 46, 21, -52, 15, 29, -52, 25, 33, 127, 34, -49, 7, -7, -7, 37, -56, -19, -9, 57, -14, 56, -53, 45, 48, -48, -32, 31, -18, -11, -72, -49, -10, -41, 88, -43, -14, 13, -40, 85, -43, 59, -81, 48, 89, -60, -33, 17, -55, 32, 105, 39, 17, 29, -76, -64, -32, 0, 71, 38, -2, -82, 33, 71, 7, -8, 77, 0, 14, -14, -58, -22, 4, 25, 52, -5, 35, -28, 36, -66, -49, -8, -150, 34, -9, 33, -14, 59, 118, 118, 6, 115, -29, 35, -107, -69, 37, 79, 27, -12, -67, 10, -80, -42, 31, 58, 47, -20, -38, -12, -63, -78, 33, -19, 3, 0, -17, 38, -10, 23, -1, 28, 9, -19, -7, -37, 90, 20, 11, 14, 51, 58, 43, 81, -109, -79, 45, 22, -35, 3, 61, -63, -60, -56, -39, -19, 46, -3, -85, -12, 37, -101, -62, 10, -27, 50, -55, -10, 6, -44, 166, 94, 25, -20, 34, 128, 63, -44, 71, 10, 22, 30, 55, 20, 36]
7694C6O8o0nn8k4J6ql6P0J8N7j58P9k8n6P7M8nr2L6%J23j32j7J28q1R3j16k9J04
7724D8o5mQ9j4k5n6o6K3J20m8K3n2J10o7J5p7N6N3j3O1m1j46O2L7j03J31l0k8
7752gk0J26j07Op4P2Jk0p2j9J08l4L4l4K0N0k8m3R7j3j46J18q6M5N7n1J18n8r6
7781e6L4N1j16M2K7n3K2OK5J25k35J27R1j44N2J7N2r0n6K1J27r5Kk8j3J86j00
7808B1J4J7o9qk3j14J05M0n0R2%J7j5j36R8o4N2J7k6oM6Lr3m8P7N1L8l1N6K6n7
7839C0l0kk0j7NL9k9rL8kn6O4l1N8K2p9L4k6R3j06nL2K6p6J7M6j31R6O3m7J8J4
7871B9j5n9K2M5k5J2L1j4j27R5J8o3M0r5MN3P0O0j23J11L4r8o2M6JK0j5R0r0j
7901fJ5rq5P4q7N2N8p8J3N3Q9j46O8R3j47L9K2j03J0L2o6J30l9L0n4j8K9J11j6
$$ y = [36, 104, 44, 39, -19, -43, -27, -35, -71, -1, 17, 74, -84, -5, -33, -89, -12, 36, 31, -61, -25, -25, 98, -34, -51, 77, -4, 89, -27, -56, 48, -17, -21, 68, 54, 29, -27, -93, -70, 50, 2, 25, -27, 83, 16, 31, -46, 10, 63, 50, 111, 70, -76, -14, 23, -80, 51, 21, -7, -27, 99, -8, -2, -76, -4, -3, -23, -95, -114, -6, -40, -6, -40, -20, 30, 2, -41, 56, 43, -103, 15, -71, -26, 31, -20, 98, 40, -56, -22, 29, -87, -45, -18, -71, -49, -43, -18, 107, -128, -1, 90, -54, -2, 15, 67, -23, -79, -58, 69, -26, -24, -52, -65, 121, 21, 35, 52, -17, -25, -48, -162, -57, -17, -67, 25, 25, 42, 27, -109, -11, -75, -23, -6, -32, -38, 8, 11, -82, -130, -53, -2, 36, 5, 61, 87, 30, 0, -2, -22, -39, -34, 5, -24, -33, 5, 3, -53, 11, -20, 38, 60, -19, 15, -11, 82, -24, -29, 3, 29, -47, -30, 16, -115, -19, 44, -3, 15, 29, 14, -45, -23, 22, -3, 9, 40, 26, -101, -6, 12, -51, -11, -106, -102, -49, 21, 81, -42, 69, 103, 5, -57, -11, -10, 10, -5, 85, -5, -6, 9, 0, -85, -11, -98, -46, 12, -66, -53, 0, 89, -57, 11, 104, -43, -4, 18, -85, -75, -43, -109, 21, -18, 12, -42, -60, -31, 80, 64]
7930F4k8j3r4J48j74M9RL3q1J61j7m7O6j8q4L3kL9m5LN4j08M4l9j36J72r2J47
7958D4l9N9r2M1o8O6N7m4r5J19n9J14k15J53Qj3r4N6o1M9N7k9l0M2r6J58k8q5
7986b5O6j64J00Rj3P6p0L6L7r9L3Q2j85J18j1M8o6OrN6n7o2R2oJ6M9j33O3jQ4
8016G0m1k1j4J11j13k7R7j02L6n8K2M9mJ5k5j8O3j11kK9Q2r8R1j03J2L6M7n2M6
8045A7o8m1L1N1M6M0j03J2j21J61L9j7l4k1k0l4Q0m8OR5p2O6n5l8k5j16J86k9
8073a2j20Q5RR4n2M8j1j15O9m5N5j7k9J11l4o9lM9MO1j47M0J03r8J5k3O4r2J50
8102I0Pj46Q5R4j58J29j53J9r4P9mP4o7j6J24m0Q4j42L7J38k05j3J77j65L6J01
8128G1o8j36J05K4L4k4L9j28J03N0j28O0m2R1k9k2J4k0p6J7N0P4q5P1j24J59p1
$$ y = [64, 36, 23, -71, 77, -97, -48, -39, -6, -87, 74, 57, 10, 76, 58, -26, 7, 5, 44, -1, 2, 56, -52, -8, -47, -183, -11, -103, 44, 5, 64, -28, 13, -55, 11, 68, 24, -71, 48, -11, 103, -112, 41, 49, 36, -58, -2, -63, -14, 43, 14, -16, 26, -70, 88, 60, -25, 41, -123, -23, -14, -27, 49, -21, 15, 52, -47, -14, 68, -117, 1, -10, 38, -28, -22, -31, 25, -32, -94, -2, -8, 8, 57, -76, -13, -14, 70, 29, 8, -6, 105, -8, -35, 62, -40, -4, -62, -40, 9, 5, 20, -5, -23, 40, -71, -73, -44, 38, -60, 31, -72, -60, -24, 23, -29, 17, -51, -92, -61, -10, 36, 76, -27, -15, -136, 25, 64, 47, 13, -8, -28, -62, 18, -30, -24, 71, -1, 65, 10, -28, -53, -169, 17, -12, -132, -47, -38, 56, 4, 52, 41, -74, -5, -50, 5, -12, -41, 70, 36, -33, -36, 13, 17, 78, -69, -29, 74, -24, -9, -32, 32, -60, 90, 97, -49, 36, 130, -28, 101, -52, -33, -127, -48, -52, 22, -45, -61, 63, 23, 107, -35, 2, 140, -65, -78, 99, -66, -30, 71, 3, -133, -28, -4, 30, 6, 45, -83, 20, 70, -58, 2, -40, 51, 22, 0, 14, -6, -82, -65, -15, 59, -26, 45, -79, 80, 9]
8155IK8q7JR5n5j06O7J28K2j04J10n0j11J04rp9M6j0J1L2m7J9o3q0J88Pj04Q5
8183D7k8j08Q7qJ08r7K9j4
$$ y = [9, 37, -50, -49, 46, -9, -115, -48, 80, 102, -2, 108, 58, -53, 51, 42, -37, 9, -1, 10, 42, -5, 14, -49, -129, 59, 66, -38, 47, 19, -89, -2, -10, 98, 1, 30, 16]
8191A6
$$ Imaginary data points
##PAGE= N=2
##DATA TABLE= (X++(I..I)), XYDATA
0@%%%%%%%%%%%%%%%%%%%%kOrJ1j1J1j2J2j3J4j6J9k1K2k2K2k5K7k7K9l2L4l4L7
44B0l9L9m4M8n1N4n8O6p6Q7j00J17j42J76k19K79l64M86o66R45j398K188l711
67b363P128j7323R2760L46981m64429j20049L76254k99671j81665M27915j1215
78A54323k31272J93957r1480k93919K30820K01267j72040L7442P1085k00521l0106
89a30444J54174P77R193P2757o8100j25412j3180R4902Q6320l3605l4880K2764
101C5266q7132o9894J09663N2657L492P0371j34734j57059J94531O6268j84226
112a00797J60512J39669l16845m4585K53753j15968m0131K51192j48017k19089
122a80306K12391O895j71878K16319P2874k59558O4301J10575j89466Q1430K12246
$$ y = [0, 0, 0, 0, 0, 0, 0, 0, 0, 0, 0, 0, 0, 0, 0, 0, 0, 0, 0, 0, 0, -2, 4, -5, 6, -5, 6, -6, 6, -7, 7, -9, 10, -11, 11, -11, 11, -14, 13, -14, 15, -17, 17, -17, 20, -19, 20, -24, 24, -27, 27, -31, 35, -41, 46, -54, 63, -79, 97, -122, 157, -207, 279, -387, 558, -840, 1348, -2363, 4765, -12558, 80202, 427183, -37246, -157295, 218959, -80712, -262377, 165538, 154323, -76949, 117008, 25528, -268391, -37571, 163696, -8344, 29098, 100183, -100338, -130444, 23730, 24507, 33700, 106457, 38357, -87055, -100235, -5333, 80987, 47382, 12502, 35266, -51866, -121760, -12097, 40560, 44052, 114423, -20311, -177370, 17161, 83429, -100797, 59715, 199384, -117461, -162046, 91707, -24261, -64392, 186800, 38783, -180306, 32085, 38980, -132898, 83421, 156295, -103263, -38962, 71613, -117853, -36423, 175823]
133A75823j79103r5021J65685p7512j04825J58305L5946r7006L1665j5472p1453
144g2968O5416N0246l8785J3778N354n0484j3149K0721M0153L0980m5427k6497
156b0662K7568l9612n531R1625j7994o3315N2425k2597p6725Q7246M7806q4912
168b4678L1071L0268r7761L2693Q3702p6104N583Q5155r2851m7588J10380k5881
180A3989n7572Q8133j5067q6225O2401J8337o7312N8672L6669q2459J3757M4174
192B7497n4454J3043N5571m3811j4032L7466l6263j1478N0626j4770k2264K7838
204A4969j8430k1651L2979q36j5566K3109r986k4114K1054J907j3024K2506k965
217I952k3915J6396J284j8103K2377O346k4492J3160N006k5124J7855J6254k6946
$$ y = [175823, -3280, -98301, 67384, -10128, -114953, 43352, 79298, -17708, 13957, -1515, -72968, -7552, 42694, 3909, 17687, 23041, -27443, -40592, -19871, 20282, 51262, 5835, -20662, 6906, -32706, -38237, 53388, 35394, -27921, 24504, 1907, -74818, 12428, 60234, -24678, 6393, 36661, -61100, -28407, 55295, -20809, -15226, 69929, -22922, -70510, 39870, 13989, -43583, 44550, 29483, -56742, 5659, 23996, -43316, 15356, 52025, -30434, -16677, 27497, -26957, -13914, 41657, -2154, -16186, 21280, -14983, -26461, 24165, 9395, -12869, 14969, -3461, -25112, 7867, 7031, -8535, 14574, 4588, -19526, 1528, 3435, -9589, 12917, 9952, -13963, 2433, 3717, -14386, 7991, 14337, -10155, 3005, 8011, -17113, 742, 16996, -9950]
230i950Q772J6689k9412L555K6675k1924l124K5655k2199j1248K9909j3031j5702
243a5335K9690p791k5573K5382L901k6223J9477J1763k7180Q771J6490k1560K826
256e362J9165j6587m893J7473j0323q201J5386m000r238J0097j329q243P223M23
270A591n581N741j99n649M574L18m231N488P9n472M623N36n229N217K121o762
286b835K936L132n627K864L676o085R48M206n594O49O030n384k554O042k986l064
302c646O158j194n210M218R83m274L575J662m581J467K638l156R00L230k854j605
318a689L325k27k066J278N92j041j89P18j00n96o25J15K91J15L14p93j569J125
336a022J461q64J19J253j736j343K364J605j084n72m9j085N17J516L43n04q24
$$ y = [-9950, -1178, 15511, -13901, -10346, 16329, -5595, -8719, 16936, -5263, -16511, 13398, 367, -15335, 14355, 6564, -19009, 6373, 10274, -15949, 3528, 15291, -11889, -3118, 13372, -8188, -5362, 13803, -2784, -7677, 9796, -527, -8728, 6658, 2658, -6580, 3517, 2188, -6055, 1168, 1591, -3990, 1751, 1552, -4097, 477, 795, -3436, 2052, 2131, -3341, 1282, 1818, -3411, 1806, 3927, -2835, 101, 3233, -2394, 470, 4146, -1939, -991, 3215, -2379, -1730, 4300, -1084, -3638, 2404, -582, -3646, 2512, 1318, -3892, 326, 1309, -2965, 610, 2272, -2309, -842, 1796, -1360, -460, 2770, -84, -1689, 1636, 1409, -657, 621, 1213, 172, -17, 701, 601, 5, -620, -505, -214, -99, 215, -578, -2147, -1022, 439, -425, -306, 947, -789, -2132, 232, 1837, 753, 181, 132, -953, -436, 1080, 1423, 919, 95]
353I5r88L18J240N97op15j517J38R49K0L1M46r66j607J092J374j398k78K226j346
373b95k302K902J744l824O33M757k588l701M065P87m252K415L320m353o36L278
389A950l669o74O540k257o065M570J718o512L342O216n465l253M675j945k200
404c029N736n59n053K947P83l925L486L333m908J60M088l858j684N840p68m923
420b334K512K822l676j496K550L94j097L53J74j426M5J035j035M75L606k123n212
437d433L454L759m510R81N442n086m039O377m30m262O120N32p776K683M176n066
453b078K308M525o294q86N834n262k499Q354j735o259M505P00n061L264K503l266
469a347K570P36n524J653L752k259J420K371m260j111K334j305J773L346l619
$$ y = [95, -893, -575, 665, 1262, 1256, 541, -976, -838, 111, 131, 162, 608, -358, -1965, -873, 501, -897, -1175, 1051, -295, -2597, 305, 2049, -1775, -1142, 3615, 1027, -2674, 1391, 2178, -2074, 341, 3661, -692, -1328, 1950, -1719, -2393, 4147, 1890, -4175, 395, 2113, -4399, -1057, 5159, -306, -3559, 1116, -829, -3029, 2707, 2148, -2905, 42, 825, -3100, 386, 3719, -1189, -1029, 3059, -799, -2483, 3357, 2589, -2334, 178, 3000, -676, -2172, 378, 772, -325, 28, 202, -1224, -1179, -144, -1179, -704, 2902, 779, -4433, -979, 2780, -1730, -749, 4693, -393, -4432, 1945, 1515, -2747, 3373, 3905, -3871, -1188, 2988, -2078, 230, 4755, -1539, -2425, 3409, -1853, -4352, 4002, 2267, -3992, 513, 1213, -3848, -584, 1919, -1347, 1223, 1959, -3565, -1912, 1840, -419, 1001, 3372, -888, -1999, 335, -970, 803, 4149, 530]
484E30k043J395k121J432M772k859k425K355l097j773N802J18l237K593j961m208
500d727M506K540l372K363R46n028J194K565k382L084K557n408m14L049l376J419
516d84M740l392j699K394m532l60P209k577l415N147l650n806P466K439o314M072
532A238K002q106J876O092l874R13M071n920j622N948l126j624O622j984o007
547c501L483J405l167K582J884k737j60m59j611K399J095j617J184n47k911J452
563a226J309l83K079r21l427K728O68l792M357L519p117PN750m627j861P248k319
580A992n082M985q22m599N137J216n969L672K578o883J619N720m664j708N296
595B488k195l406L237M32j691K206k67j872J315j52j018K051L69j720L89j55l49
$$ y = [530, -1513, -118, -2239, -807, 3965, 1106, -1319, 1036, -2061, -3834, 1968, 2086, -1151, 1442, -519, -4727, -221, 2319, -1053, 1310, 2256, -2772, -1578, 987, -1395, 1689, 4246, -1162, -1576, 1473, -1903, -484, 4256, 864, -835, 1559, -2973, -3333, 3876, 1299, -2116, 3031, -619, -6425, 1041, 3480, -2834, 1238, 3240, -4866, -2990, 3102, -772, 141, 4212, -1708, -3330, 2618, -508, -2132, 4490, 2506, -3501, -18, 1387, -1780, 802, 2686, -51, -211, -670, -2281, 118, 1213, -404, 780, 233, -2678, -1226, 83, -300, 1779, 858, -2569, 159, 827, -2965, 1392, 4911, -2206, -2199, 3551, -1076, -2937, 4311, 1992, -3090, 1895, 1073, -3526, 1611, 2827, -3142, 530, 3108, -3775, -2156, 3564, -1100, -2808, 2488, 293, -3113, 124, 556, -1135, 1071, 804, -1068, 247, 95, -923, 1128, 1497, -223, 166, 11, -338]
612c38J491q09o52K043j886k063L738k80m015L031K031m718J121L491l657m29
628a901L955k780j092M049k612k684N232n14m229L724J198m655J775L385l428
643e77k3K887k620r87K827j107j287J876r55j223J356k6q97P76k39l43N51q11
661h22M46J216j699n4K620j774j631L022n23k516L030N08l520J942J716l434J171
678c02L040l433q04L467k238j551L558j122k674K551J66k732K144J025k547J112
694c40J245k020N06J641j718K07J519j138l47J261o10k16Q91o73j32O38r62K7
712b21J059j017o8J132j480k85J704j222q32K142r08j979K213M30k352J791J092
729A199k616R29J938k240J81K259j710q31K137p69j122J601k49j425J208J71j185
$$ y = [-338, 1153, 344, -308, 1735, -151, -2214, 1524, 1244, -2771, 260, 2291, -2427, -1306, 2185, -1472, -1901, 2054, -726, -1818, 2231, -381, -3065, 2167, 1653, -2576, 1148, 2346, -2309, -534, 2851, -577, -600, 2287, -333, -1320, 1507, 400, -887, 989, 34, -1189, 167, 141, -756, 20, -219, -562, -11, -822, -376, 840, -859, -913, 1707, -67, -1698, 1324, 801, -1715, 1315, 1823, -1697, 245, 1961, -1473, -302, 2738, -695, -1499, 1968, -270, -1821, 1737, 615, -2059, 492, 658, -2074, 70, 1095, -1452, -340, 905, -1115, -609, 1032, -686, -479, 1040, -98, -445, 816, 206, -10, 881, 208, 76, 714, -248, -221, 838, -179, -247, 885, -595, -880, 824, -398, -1230, 912, 4, -1975, 238, 668, -1684, 107, 1199, -1417, -488, 1450, -790, -609, 1650, -60, -891, 1246, 477, -645, 956, 707, -718, 490, 661, -524]
746e24Q23J39q85M23J94r85O78J68q20N46L92r59M13O56r72N56P42r91K04J027
766H25j084n5J286p89m61J082o63n22J017k93p50Q45j37r63Q43J60r62N96L42
785C17j168M88P84r79j02R10p32o1R43l23l81O19j80l56O31J16n46L89r8k31L88
806D28j43k62J89o2l88M27j12m69K91J13n94M88J17n05N2M52l65O5M23l66j06
827c27N47k28j18N19r5k88J01L13k21Q0R3k29n7L8m9J05j95j11K6j05o9J48L2
850i0k81j20K16N2P4k9o7J87P8q1m7L46j5k47J6M42k1k85J16J28k15j63L09m1
874B62k72Q8j10j55J08J5j52Q5k9k27J38J50k58r3M94L6k91J48J89r8J7J09K58
897D12j19j64j69M03kk51j3K56j61m20J30L96l35j79K17l0k51j09K62j31K6J78
$$ y = [-524, 299, 438, -447, -24, 170, -815, -137, 31, -789, -243, 149, -810, -397, 259, -713, -157, 585, -406, -202, 825, -259, -314, 972, 183, -278, 804, 141, -381, 636, 343, -407, 438, 301, -662, 181, 341, -621, -25, 317, -851, -363, 421, -558, -660, 250, -482, -543, 400, 77, -304, 315, 135, -221, 410, 526, -20, 369, 271, 40, 428, 285, 23, 212, 150, -238, 189, 77, -392, -101, 12, -582, -94, 23, -482, -430, 22, -343, -278, 145, -221, -327, 220, -8, -126, 393, 298, 10, 111, 424, 203, 283, 376, 147, 90, 128, 79, 184, -11, -122, -96, -201, -270, -122, -90, -371, -491, -275, -223, -149, -178, -245, -58, 20, -61, -108, 238, 223, -24, -8, 434, 413, 128, 244, 372, 157, -6, 303, 262, -10, 78, -32, -187, -79, -64, -216, -131, -160, -387, -249, -99, -357, -450, 44, 80, -211, -63, 126, 28, 45, 154, 412, 293, 129, -40, 363, 361, 110, 97, 353, 192, -228, -98, 298, -37, -216, 1, -29, -280, -389, -127, -258, -232, -54]
919e4k05j17L00j23j52N75K7n83L93N55p94K6R28m87o58P32J12p98M38N66r57
940b76P1M69o78K5P80n77o88J122J6j339O54J230j031k98J013n51p72J205R4q57
960c88O89M16j196L66J141q65m22J003n11q80J067K32j188M63P89j146m27J257
978D00k25j135R92L19j180L90R65j094j82J582o76j257J650L06j799R43J541j823
996b83m78J984j063j229K189j15k183J290J088k283O19K063j976r78K204r44j417
1013a512K135J14k164J297J191k024J91J898j081q98J730l37j396J249N15j266
1029c58N63J041j366o61J453k30j075J001N77j708L9J384q29q50J806l63k142
1046a718J453J213j977M16K151k066r08K436o48j723K392L09k745J534J598k690
$$ y = [-54, -259, -376, -76, -199, -351, 224, 251, -332, 61, 616, -178, -152, 776, 289, -369, 363, 475, -323, 115, 681, -276, -205, 264, -414, -389, 391, -186, -874, 248, 264, -1075, -421, 809, -222, -520, 493, -58, -830, 375, 469, -388, 301, 717, -479, -113, 1028, 163, -259, 744, 233, -647, 420, 652, -536, -73, 716, -430, -857, 400, 175, -960, 32, 351, -829, -439, 526, -568, -750, 832, 156, -1101, 549, 855, -944, -1, 1540, -283, -761, 1223, 160, -1069, 1120, 1005, -1178, 112, 1200, -1083, -464, 1599, -377, -1355, 849, -95, -1512, 623, 737, -1427, -130, 1061, -963, -772, 1126, 45, -853, 877, 540, -856, 393, 908, -358, 205, 1246, -120, -781, 672, 442, -633, 368, 945, -763, -724, 660, -169, -1019, 787, 424, -1718, -265, 948, -1029, -613, 1538, -528, -1436, 1000, 352, -1371, 1021, 1330, -1415, 119, 1717, -973]
1062i73L22K498j728j079K152j061j704K241L90k103J141P71k056L71J732q89
1078B5p34J099q38p37J205N00p79L21L96o93l07P17M57n70o6O89o88n21J037Q7
1098F00j042R80K48j788N29J401j448J3J767j476j249J923m84j243K104M8k308
1115a425J033J127j720Q92J687j930l81J574j182l56K130q45j384J454k03j414
1131i43J283O43j375N42L18j358N35P95q93K27O69q41m52P20k54L19N86m14m54
1150c47M9j10M67N62m77J56j18p55N75Q06o36P2N33j243k04J472r02m64J567j096
1170i3j215J702j37j526J672L89k074J066J092k176Q06K004k023k96K021j540
1186c28q40K451n05j671J686j13j956J481J183j789L05J006j588j25J478n48n83
$$ y = [-973, -651, 1847, 119, -960, 1192, 131, -1573, 668, 1058, -1045, 96, 867, -1189, -818, 914, 25, -709, 390, -448, -1185, 20, 520, -259, 62, 458, -235, -542, 175, 632, 62, -4, 685, -3, -524, 513, 600, -442, 538, 786, -1002, -473, 928, -520, -507, 1260, -216, -1465, 458, -26, -1269, 835, 883, -1425, -392, 735, -985, -93, 1594, -336, -717, 857, -325, -681, 1449, 604, -780, 674, 471, -943, 340, 983, -392, 150, 468, -890, -355, 440, -453, -226, 443, -398, -850, -130, -384, -65, 521, 107, -347, -298, -408, 59, 621, 144, 300, 182, -573, 2, 808, 172, 244, 777, -466, -670, 802, -100, -564, 1003, -93, -1308, 394, 257, -1269, 403, 792, -1282, -216, 876, -1300, -494, 1510, -513, -809, 1212, -328, -1168, 1283, 778, -893, 793, 680, -1276, 205, 1388, -401, -96, 910, -678, -803, 675, 127, -456]
1203d56P68m71n41N00K55j93J36j21Pj38j19O23J27q21O51M30j231M98J023j193
1223b66l5J525j405p24J910q36j245K117l65k175J640Q90k254J040J473k346K35
1240h21J855j567m84K075r72j368J829j55j286J292M12j477O63Q06j131K71P28
1257F70p06L1M29m70k0K61k30N9jl03L26q6m73N97J72r35N93M63j131M75R13j098
1279d64J76J059j048k41J400o22q53J416m34j193J190L51j382P65P01j442L76
1296b45Q66j017kQ61p91k45Q82n72l15P32l79l39Q26k99l50N55m3l51L88j8m10
1317b66O30j81m50N84l7m68L91J18o47M35J81o56L39L77p48K42N11p79Q5O19p17
1338d37k1O88l75l71Q48k13m47N67j88l13N24O4n49M31J59m72J89L18o06K13K94
$$ y = [-456, 312, -159, -700, -200, 55, -138, -2, -123, -116, -254, -373, 250, 377, -444, 207, 637, -594, -96, 927, -266, -301, 1224, -181, -905, 1005, 169, -1076, 1041, 676, -1499, 141, 1031, -1223, -183, 1290, -1056, -821, 1034, -533, -1017, 1058, 86, -1282, 547, 392, -894, 398, 810, -667, -4, 802, -329, -58, 670, -36, -5, 424, -46, -66, 195, -35, 24, 23, -280, 46, -40, -513, 84, 256, -679, -86, 377, -754, -279, 634, -464, -288, 771, -277, -518, 882, 260, -593, 823, 389, -804, 386, 737, -645, 120, 821, -621, -245, 621, -396, -398, 463, -328, -573, 309, -263, -578, 154, -225, -564, 262, -37, -387, 168, 125, -226, 162, 144, -266, 364, 183, -267, 317, 280, -188, 203, 321, -326, 109, 290, -366, -27, 350, -398, -156, 355, -424, -339, 280, -437, -458, 230, -145, -516, 332, 119, -328, 239, 51, -262, 262, 326, -223, 208, 367, -105, 84, 402, -204, 9, 303]
1359C03m01NL89n29J4K22k37m7L28k50q8L04j17j64J49J67j89J62m8J02J20k42
1381d7l5K92oj28R1m5o7J61r1k54L21N7n76J85L03n24J96L58n17J4M53k95l00
1404d54N95k00k08L80o0k08L42M3l17K40K37m56m1M33j04k80K79p8k91K70n0j81
1426a09J29J94m81j33N00k28j72L03K8m78K92L48m37N8N51k89m21O14l4m92N54
1447B97K06o64K08L10o20N1R87o06o89P69j32p08O24M13r08J73N51o66j59R86
1467D23m03n47P14J25j122O92Q35r88M8J016r56o55J428J05j257Q08N32j455K85
1486c72J207r88k73J335q77j252J562K44j561Q90J039j734k48J854j015p05J745
1503H51m56j467J121P95j714O31J610j630o51J896q57j181J949J42k170R46J396
$$ y = [303, -98, -93, 296, -233, -219, 3, -234, -281, 47, -203, -291, 13, -104, -268, -119, 48, -141, 21, -27, 75, 195, -47, -82, 210, 204, 76, 167, 122, 55, 216, 125, -129, 192, 249, -327, -142, 161, -363, -167, 191, -326, -312, 141, -154, -454, 141, -59, -267, 113, 53, -155, 187, 230, -87, 153, 390, -66, -107, 326, 222, -58, 221, 143, -148, 122, 72, -109, 20, 214, -267, -400, 100, -128, -300, 3, 31, -447, -155, 193, -244, -186, 365, 76, -345, 269, 235, -257, 297, 503, -161, 47, 357, -263, -212, 775, 169, -520, 249, 117, -591, 33, 446, -462, -289, 262, -404, -563, 423, 20, -527, 187, 312, -810, -118, 717, -271, -223, 793, -163, -818, 610, 715, -542, 266, 798, -657, -372, 835, -153, -426, 909, 32, -1220, 342, 586, -975, -85, 954, -780, -1028, 826, -189, -894, 851, 395, -1072, 49, 844, -870, -239, 1371, -259, -910, 986, 129, -1052, 897, 1039, -1131, -185, 1211]
1520A211k049K9K147j302j200J613q7j814J546J085k030J84J717j698o00K363
1536A115n15j786J651O23k378R06J983j928l35K052j236j553K199L37k202J223
1552A56J192k432K43K150j581r09K321o55k236J843R84k264P67K076k332p65K495
1569A053r00j469K242L12k644J214J428k065K12K432j700j358J970j58j796J701
1585D74Q63k202K30J560j379n87J992m88j705J373M87j747P92J479j446n24J635
1602H07p25j257J746L46j609P51J125j850j53J949q13j081J561k40j806J220J098
1619A069j725M34J325j591o51J766l88j211J437L1j637P49J094j064J21J108q75
1636ho78R21J69q31P66L44r56J09N62m56j90P68n7p71N2M70n22J45O80m56n45
$$ y = [1211, -838, -809, 1338, 36, -1164, 449, 362, -1452, 94, 1179, -851, -667, 1050, -648, -1248, 1115, 600, -1186, 465, 1088, -1290, -384, 1599, -329, -664, 1388, 152, -1401, 798, 1135, -1067, 156, 1348, -1084, -841, 1309, -272, -1181, 1140, 485, -1751, 92, 1076, -1188, -421, 1655, -677, -1442, 1053, 153, -1316, 926, 1238, -1406, -192, 1236, -829, -617, 1815, 115, -1243, 727, 569, -1227, 474, 1337, -865, -635, 925, -454, -1041, 951, 463, -1242, 131, 618, -1129, -337, 1142, -304, -828, 807, 82, -1175, 571, 917, -692, 59, 1184, -666, -819, 1130, 317, -764, 797, 557, -1249, -29, 1069, -656, -222, 1103, -488, -1139, 627, 239, -972, 465, 496, -1141, -392, 702, -362, -241, 867, -8, -686, 235, 404, -427, 339, 683, -273, -164, 398, -58, -248, 520, 463, -308, -256, 214, -308, -163, 517, 61, -484]
1657d84L80N8m57N26N26p44k39O06l90j75R30k44o65M07L17o43M11M05n73j27
1677a75M80l76k23O78l40j78K30q2k99K35Ln1J31j19j24J32j26k5L08o1k53K83
1699D8n5k66M98J43n32J86J87m23L51K80l87r3L45l94L9M16j85k91K06m3l53K48
1721g5J13k52P0J79j63K2mJ7M7P5l9J11j88O1K11n7j30K56o1l67L60Q6m44K58
1745H6K37n50J10M36m29j78N53m59k44N87l7n54M63J66n58J87M07k95l6K57j63
1766a4r9L48k22j35L21n4j31J98n8j40R4P2q4l6nj35Q2j41J54L0j60o9J02r2J5
1791a59J43m5k44M04j5k64L29l1k44K22J74l30O7K78j86j60K69j74j04J44l2k49
1813b07K36n3j70K79j05l32K10K26k31o2J96p7K8K4j43J34J54j88N3O6n5J03L8
$$ y = [-484, -104, -46, -503, 23, 549, -195, -434, 172, -218, -393, 537, 293, -372, 35, 352, -291, 120, 525, -48, -175, 305, -71, -294, 384, 44, -134, 96, 14, -285, -50, -47, -98, 33, -86, -210, -78, -204, -229, 79, 18, -235, 48, -7, -273, 225, 368, -164, 22, 209, -214, 137, 417, 30, -63, 282, -112, -73, 343, 158, -133, 73, 30, -323, -75, 38, -214, -144, 35, -128, -106, -110, -93, -46, 29, -10, 101, -87, -26, 185, 128, -2, 254, 193, -174, 186, 272, -172, 86, 323, -227, -117, 319, -110, -288, 265, -194, -438, 149, 112, -442, 21, 187, -371, -184, 223, -72, -108, 149, -14, -113, 235, 13, -122, 199, 145, 14, 212, 154, 14, 108, 180, 96, 60, 55, -80, 2, -139, 15, 45, -115, -184, -82, -174, -159, -16, -61, -305, 99, 84, -180, 149, 118, -126, 96, 270, -60, 7, 285, 99, -61, 208, 34, -70, 74, 42, -207, 29, -24, -194, 85, -20, -352, -142, 84, -147, -209, -13, -90, -62, -38, -181, -47, 107, -81, -28, 38, -17, 86, 124]
1836A24l8nRj9O5l3j51OK0M6j33N5J19j94J60j07l2M7pp1Q4J70l03Q8J50q3M7
1863A4J32j12k0R5j5j12J70j56J11l4pj41M1L9q7R8q6m0P1l0j6J8k8M7R3j5k16
1890a86J68N7J7j0oJ1q2J70j6p1K4P7n8J1j5m9L9n1n2J11r5o4R2L6j88O0M5j38
1918a63mJ49O0j48K1P2p6M8M9N4n1l5J68m2j07Q8k2m8K0J2Mm8R0j15P3l5r6n5
1946a37J27O2j66j0J97j93N6J39j21p8O7J33j8n0J05m5j21J88j14M0R7p3K0l7
1970F8j7Nq%j54j24K28m4L4j07J08j25l1K93k80N5N7J2j53K03J9k3K6Q0j13K8
1996C7J9N0r5J57o9l9l6M3k1p0J60j22j41P5K4p6O0Q9j48n8K9n8J71J14p3p0N8
2023A0J7QJ03p4q0J22j2o7N8K9l8o5K7L4j06O3n0J4J8kk20O4O3N7l5J79j44j40
$$ y = [124, 86, 81, 90, 71, 136, 103, -48, -42, -22, 24, -109, -54, 65, -129, 31, -76, -108, -61, -68, -139, -55, 115, -188, -100, 50, -33, 14, 146, 34, 14, 109, 94, -18, 152, -4, 107, 73, 66, -75, -34, 5, -82, 16, -70, -110, -39, -69, -85, -67, -95, -48, 45, 30, -186, -18, 39, 56, 46, 40, 51, -31, 139, 123, 52, 76, 153, 95, 106, 91, 42, 81, 30, -22, 89, -6, -70, 22, 58, -130, -70, -25, -163, -167, -18, 42, -106, -85, -13, -89, -41, 8, 62, 11, -24, 144, 102, -5, 83, 61, 13, 33, 45, 49, 1, 91, -24, 49, 14, -82, -137, -10, 52, -114, -124, 73, -120, -64, 75, -46, -124, -57, 76, 58, 8, 113, 68, -53, 135, 21, 61, 158, 85, 105, 68, 51, 56, 48, 48, -106, -230, -2, -46, -12, -119, -11, -136, -167, 126, -154, -99, -42, -30, -183, 20, 39, 16, 42, 122, 9, 37, 56, 106, 11, 168, 99, 60, 24, 67, 46, -24, 136, 14, -127, -52, -28, -104, -44, 45, -103, -161, -132, -190, -19, 95, 22, -48, 10, 27, 35, 138, 64, -16, 106, 94, 27, 85, 114, 76, 11, 38, 72, -34, 29, -21, -7, 11, 9, -211, -147, -84, -27, -62, 117, -27, -167]
2051a67R0O6j21K67r0j38M5J4M9M3L42k76j41nR4n0J20J35k92j99L51k25QK46
2075A66j23j93J70l9k50J80K86j76j91J75q2j38K67J54k36K9J66m37J41N23k15
2096A77k58K85k47k22K79L30l47m2J93m21n1N54j18m10L26l6l78K26N64n39M3
2117i2L20k91k11L94N3l25K73J85m52o7L89j69k22O96k29o12K69K95l26J23L23
2138C24l57m00M66r4k57M06K42p17J46L30l10J08L82j18m19L44N7l13L29K84n37
2159a04k5L55j09l10L02J84m78K96J33n03RN30k06l59L95q7m44L69K16l14P7L63
2181B90n31k12O99k0l91K96Qm46J89M66k94j76L41j53l26L64J59l39J42K68m24
2202i0j06K51p6j26J64K1j90M4K47k09j0L49j38l33K85J0k47J93M14m62p1K65
$$ y = [-167, -77, -11, -132, 135, 45, -93, -48, -34, 15, 58, 400, 124, -17, -22, 72, 22, 142, 277, -15, -214, 137, -88, -80, 166, 43, -150, 20, -19, -269, -89, 197, 21, -170, 5, -77, -215, 52, 206, -30, -1, 165, -272, -131, 392, 177, -81, 204, -43, -265, 14, 344, -3, -45, 148, -273, -324, 230, 112, -298, 28, -8, -386, -160, 404, -135, -92, 228, -63, -274, 120, 173, -152, 121, 306, -146, -213, 176, 7, -215, 481, 252, -360, -91, 204, -122, 1, 324, -33, -433, 33, -61, -318, 88, 330, -387, -241, 89, -221, -113, 269, 151, -268, 76, 133, -180, 149, 433, -104, -129, 226, 117, -193, 109, 293, -185, 111, 244, -259, -250, 280, 74, -285, 110, 23, -421, -52, 164, -150, -73, 290, -241, -453, 246, 226, -165, 131, 139, -307, -118, 348, 54, -122, 219, 66, -260, 104, 263, -76, 66, 334, -90, -196, 55, -21, -147, 17, 38, -152, -108, 139, -70, -80, 269, 131, -202, 83, 93, -154, 39, 453, -9, -80, 185]
2224A85n6k60M15q9m28K92J08k61k4L38k35j94L16j21j84K58L0j95K6K51l43Q1
2246i0K45j11j64K94p1j31P8J20j37J1Q6k7q3R0O6j83o6J21q5J0Q4pj94j6J89
2271B9k74K6L71k86j12K97J3k21K55J19l40J21K13k76J41R8k10J0K56m8k33J13
2293F2m3L2R6o4p7L4pl8l1J22k36J26o4j23K00j6j62N2K09k28J85k7j41K79j5
2318A25j64J40Q9j92J22j2j66P3J18j42q9K31k23m1J80m5q9J52j32k7R4N1j64
2341a11Q7N0j78J11L6o5J19m8n7J40M6j58L4J64k10J22l5o0j2J49j01j94K34k8
2365C5j71O7J25j46L5O3q6L3l0L5J8L0o1K02j2j57M7J1r3O2l4l0m0K45k50M8J16
2392F2k11J09M8n1m6J90j89o6J21J7r5J39J4k40J81J43j92N9J64k61n6L51k16
$$ y = [185, 129, -131, 284, 195, -233, 59, 167, -94, -118, 220, -15, -209, 107, -14, -198, 60, 90, -105, -79, 172, -171, -90, 155, 44, -120, 174, 103, -28, 50, 170, 33, 44, 130, 103, 20, 110, 176, -7, -73, 48, -37, -27, 57, 50, -144, -160, 29, -245, -219, 152, -134, -246, 51, 64, -157, 98, 217, -123, -2, 211, -65, 76, 174, -36, -26, 230, 182, -51, 62, 19, 51, 147, 83, 6, 40, 33, -5, -36, 86, -150, -24, -88, -211, -11, -27, -189, -137, 72, -156, 29, 2, -139, 140, 125, -39, 101, 190, -2, 120, 108, -58, 15, 133, -9, -98, 133, -90, -131, 49, 4, -85, 67, -65, -92, 2, 53, -111, -24, 26, -152, -41, -5, -70, 49, 1, -56, 84, 130, -28, 6, 170, -40, 82, 47, -13, -25, 124, 23, -171, 63, 35, -136, -69, 56, -90, -55, 8, -78, -45, -75, -40, -22, 8, -53, 149, 137, -20, 27, 38, -55, 7, -27, -57, -97, 148, -102, -54, 62, -149, -40, 8, -43, -89, 101, -88, -154, -33, -16, -111, 28, 42, -198, -17, 126, -66, -7, 157, -104, -160, 191, -25]
2415b5o5K75j33r8K35j04o4K9M1j11M2%n3j49J99N2j73J40r1o6K1J27j8j03O1
2440c1J64j22p0K33j04j86K42m2k42J34J42j78N4K92l91J7K55k81q9L19%l34J06
2463a12K77m75K62K54l69n9L39k57q4L52M9m37J75K63k49k1L18j66k50L30q0l07
2485b47K57K23l13OL34k62k38L34J50n29L05K32m96J17L66k27k24L88p3m43N00
2506A60j8k99K93K24n62p3N81k39k30N42k80m67L37L67n95K23M67n93j06M21l9
2527A14l52N41j07o25L03L50m59J11N44l67k73J88J94l73L48L27o16K7M37n61
2547b49m4O72j72n09L97L5m86L25M17m03k89M84k35l45O46J3m93L23Q2n78J00
2568c09O03j74k23L21k68l29N43J09l08J54J82m44j07N34k01j95L98k22n29L65
$$ y = [-25, -90, 185, 52, -46, 189, 85, 21, 50, 91, -20, 22, 22, -31, -180, 19, 71, -102, 38, -53, -119, -98, 29, 11, -92, -31, 133, 11, -59, 174, 70, -116, 126, 84, -158, -24, 118, -60, -6, 286, -105, -88, 167, -114, -203, 116, 116, -218, -112, 165, -310, -48, 206, -163, -222, 117, -140, -224, 128, 177, -260, -85, 178, -71, -92, 226, 60, -190, 140, 60, -247, 10, 233, -80, -74, 260, -2, -240, 94, 244, -285, 20, 252, -244, -127, 239, 12, -212, 176, 103, -340, 160, 142, -157, 136, 360, -202, -275, 306, 67, -163, 379, 99, -368, -31, 336, -259, -36, 431, -162, -268, 153, 114, -238, 303, 196, -429, -126, 224, -235, -124, 420, 53, -220, -32, 162, -211, 137, 464, -152, -125, 312, -249, -293, 379, 207, -302, 95, 130, -356, -31, 386, -17, -306, 178, -57, -402, 244, 257, -236, 87, 169, -409, -309, 294, 120, -103, 218, -50, -379, 164, 273, -35, 119, 301, -143, -250, 284, 83, -112, 286, 64, -465, -100]
2588a00K27k74J43L00m97j96N23j84j75M07J03o14K26J91l15K00L96k98k79K78
2608F2n3j76M34M8l50N1J32m22K92L56k82k35K64j20l54N13J3j61N1j9m61J72
2630b45L73k2k39L91l12k99M55k1j29J62J87m47j06M92k73q8M93j70n16L03J31
2651A20k44K05L62n36j90L49k05j57O56l3n60P5K52m25J80N49l97k55M52k28l10
2672c40N38R2m59K24J12l66P9M45k53k45L76j08m31M49J81o07K37M65o32k39P06
2693B24r9m19M07J53o42K26L65k64n4M25k93m84O16k5l05L16K09m51j81N23j30
2714A17m23O74k77m06K50J44l16J16L91l39j65L49j37m01N31J05n03K32K39m33
2734b52Q8M90k63k39L49k9m54M74J96m24NK46k47k19M66k2l26K68l1m93L70K31
$$ y = [-100, 127, -147, -4, 296, -201, -397, 126, -58, -233, 174, 277, -337, -111, 80, -235, -35, 361, 63, -216, 62, 9, -167, 267, 315, -35, 16, 148, -274, 18, 374, 92, -143, 121, 1, -353, 160, 173, 12, 63, 44, -417, -245, 128, 106, -133, 258, -54, -353, 102, 81, -48, 114, 301, -146, -252, 240, -33, -121, 372, 202, -314, -11, 120, -124, 81, 443, -93, -283, 66, -139, -296, 360, 327, -233, -158, 94, -331, -151, 398, 1, -254, 198, -30, -340, 198, 290, -169, 55, 167, -199, -120, 325, 72, -173, 203, 95, -336, 113, 294, -313, -76, 389, -243, -482, 224, 125, -294, 113, 266, -376, -150, 215, -49, -103, 322, 29, -455, 161, 136, -169, 147, 356, -95, -276, 247, 117, -306, 368, 91, -315, -65, 79, -237, -121, 270, -69, -234, 115, -22, -423, 108, 213, -290, -58, 181, -252, -164, 326, 63, -176, 173, 144, -310, 164, 360, -64, -59, 187, -60, -279, 187, 165, -161, 107, 76, -417, -47, 184]
2756A84k79L4J53k07j76L09k8r6K16Q9k71N5K07j81n4K37m8k90J21P6j08L3K34
2779B10j29j84J60M9k98K03J9k12J15K03k05m6K65k26m0K04o2j23J53k9j20O9
2801b4J97j66l1R7l2j2O9j36N6p5j22J29J0q8j1J37j05J72j28L2O0j12M8K8Q0
2826G3j03r3K01p2oL6o6m0Q3R5p2k1J64k00Q8l9n0JK0J0j6J5npp1J74j29N7l9
2855a2l3O2Pj55J48%o8K8R8j65J26pN0J6m5J7p7J30q3q3J91j44j2l1R2k8%j06
2883h4O0J47j22rL2p9m7O1J7l1J5Q3j28K34r1j12Q9l9J8R8K3j69L6R8k59Q4J52
2910G7r5l2J34o3q7J17J3k05P3Q8p8r0L20k58J29O4r7O2J2m8l3N6J4m3m9J64j21
2937B4m9P2J7o0Q7k6r2j15J82J0j76K06rj37l3K26k49J42J16j60j09K30p9j55
$$ y = [184, -95, -61, 92, -115, -291, 18, -10, -106, 110, 199, -72, -17, 190, 9, -45, 192, 144, -146, -25, 51, -57, -24, 210, 81, -103, 57, 106, -192, 11, 30, -182, -67, 136, -69, -115, 150, -76, -116, 88, 26, -97, 56, 27, -93, -24, 173, 7, -24, 73, 41, 29, 98, -38, 18, -57, -179, -50, -40, -128, -139, -2, -107, 65, -63, -31, 29, -83, -35, -7, 73, -30, -123, 78, 6, 0, 36, -30, -70, 13, 108, 36, 15, 179, -21, 67, 28, -22, -21, -1, 9, -7, 8, 3, -4, -75, 99, -30, 27, -12, -45, 17, 24, -131, 17, 17, -51, -23, 75, -90, 36, 29, 79, 95, 50, 67, -10, 120, 37, -46, 145, 1, -11, -42, 50, 22, 22, -84, -24, 123, 1, -8, 24, -55, -102, -41, -24, -55, -40, 43, -85, 149, 58, -54, 35, -4, 14, 112, 135, -34, 2, 100, -159, -75, 77, -18, -50, 84, 21, -66, 51, 64, -141, -68, 20, -58, -148, 172, -86, 43, 107, 10, 72, 84, 36, 3, 59, 73, 30, -19, 145, 24, -25, 47, 64, 4, 91, 65, -27, -142, 40, 50, -126, 80, 71, -66, -99, 127, -122, 20, 136, -24, -133, 97, 18, -137]
2961a37J88j9j50J16J80l35J53K03k14j13L31k72l7K24J4l12J63P1k22L4K80j68
2983b2k12L17j16o1R3P1k87J14K28k84RL47L4k69M9P1l11K90J91k20j19K22j59
3006b4k75L51R3l12J40J38l59P8L68k36k00M43j99l62L19K43l46K36K15m29p1
3027a89L28j75j20L25K1n00K82K30l42Q3M29l41j93K84r2k42L88J7k99j94M02
3048A02j96n6M02j37m38L84Nl37K60M12m35k60M61k01j22L15J13l35LL04n17K12
3070f1M21k94k88L23j39k44M56L5k92m9L42l62n0K95P1l43K53K3m73L12K58k03
3092iK0L07n17j66M48q5q0J90O4l03QL08k52k3K69j14l20K10J34k66K47M7k44
3115a27r8K91j50j46M61o3l31J32J31k01J01K78j42k33Q9J3j45J66J16k23oJ50
$$ y = [-137, 51, 32, -118, -2, 178, -157, -4, 199, -15, -128, 203, -69, -106, 118, 132, -180, -17, 54, -168, -134, 146, -22, -234, 83, -33, -94, -1, 70, -217, -103, 125, -159, -150, 197, 231, -38, 11, 82, -229, 61, 252, 32, -87, 135, -24, -299, 52, 145, -167, -27, 111, -248, -170, 198, -38, -238, 205, 6, -356, -37, 206, -140, 96, 311, -118, -189, 139, -36, -156, 169, 190, -310, -28, 202, -140, -57, 372, 31, -162, 122, 30, -212, 176, 193, -106, -300, 102, -94, -150, 252, 115, -323, 61, 66, -271, -11, 401, -34, -294, 167, -34, -156, 159, 272, -63, -60, 244, -273, -61, 360, 66, -222, 101, -38, -282, 174, 209, -83, -132, 210, -152, -202, 93, 164, -179, 74, 97, -376, -64, 194, -9, 11, 318, -199, -365, 83, -2, -82, 108, 172, -131, -123, 185, -67, -90, 179, 65, -255, -45, 89, -177, 70, 117, -127, -225, 66, -84, -230, 231, 168, -163, -31, 100, -101, 0, 278, 136, -97, -8, 5, -140, 26, 142, -81, -87, 63]
3137F3j68n2K78J0k44J31lj19l4K73j51m5N1j33j9J65J09j67J71o2p0p6J57L9
3161A04n9Q1k03q2J81r1J56l3J6j46J2K1O7j81J27R1j38K5j9OK9J08m0q3j10J88
3187B7J8j4OM5p2j23J06N4J5p9O2n0QQ3l7Oj4N7k03J5N6j3N8L6r0K3n2K27j13
3216D2o5J1O4j37LP8q4J77Q4j88j5J06m1k0J12j06j60J93n7j09J18N8j61R2l9
3241d4m6JK87j27j83Q4P6j47Q8J29j28n9M5j0n0J42j07R7j23K7LQ2M4J3j49K9
3267b6R6j26K0K02j98r3K40j68p6L7J05q7J38l5j83Q8R6l8j1R6q4k1J47m2p7K
3293BJ11j27m0Q8M0j11O4n5m8LJ33l9l4Nk4R5j33L8rJ15j4j11J34J3j70K6N0P3
3321G5o4j1MMQ1k8j65Q4N5J2j14J8J48r9k8m7rJ0O6j2j4m2J6k8N7L0L1K0o3jl8
$$ y = [63, -105, -157, 121, 131, -113, 18, 15, -104, -138, 135, -16, -61, -10, -143, -162, 3, 112, -55, 116, 54, -16, -92, 65, 104, 45, 126, -77, -159, 22, -69, 87, 54, 70, -76, -64, -43, 24, -157, -30, 61, -77, -52, -71, -65, -36, 72, 32, -51, -161, 27, 45, 31, 37, 82, 10, -113, -7, 47, 62, -17, 45, -5, 3, 86, 49, 55, 41, 98, -105, -90, -34, -47, 11, 47, -43, -20, -72, 155, 42, -23, -12, 52, -85, -82, -4, -88, 89, 173, -15, -30, 76, 35, 15, 127, 21, -139, 54, -3, -112, 6, 64, -97, -5, -44, -90, -89, 198, 71, -112, -28, 48, -99, -11, 118, -10, -69, -24, -34, -84, 58, -49, 48, -75, -48, -45, 37, 81, 94, -55, -26, 70, -56, -36, 166, -32, -125, 115, -53, -129, -92, 13, -74, 64, 29, -154, -66, 30, -8, -19, 77, -7, -28, 119, 77, 0, 2, 113, -14, -54, 34, 74, -37, 27, -28, -76, -73, 60, 21, -13, -8, -32, 63, -70, -32, -41, 74, 60, -51, 83, 96, -74, -48, 2, 75, 11, 0, 4, 8, 89, 61, -104, -20, 35, 47, -67, -49, 99, 0, -28, -75, -84, -74, -8, -20, -34, -76, -60, -88, -31, -1, 30, 50, -13, -14, -52]
3352e2J06l2q1M1L8j11J22L6p8Q7q3j1nK0q8O4Pj5P7p2m1NO2N1J1k2n9R9j19Q3
3382D0n3J2P6O1m3j04L9M2o2n1J32j69O0k3L1M0k9l4L1K4Jp0O4J1o0m5J30r1l
3411d3J64j29L3J5n9MQ1n1q8M1J02k6J8J7q6j4j04J19r7J21l0n1P0k6K6j01J47
3438E3m0k0J5K3qq7k7J42k3K9k0j5J7M0j17K3k0M6Jk5N6r6R5J8j44Q6rp7M9j7
3468e2K9J0j6p8J3MJ40o3o8N2kJ1L9k5Om9J13Rj06K3Jj3J7Oj05J08l8N1K2K9j29
3499f1n2J04Kj8J33j80o9J12K9oo2R4j55J61JQ1jj06R7k00Q1O0o2J10j5j71Q9
3526dM0l7q3M5QN7k4Mp5j8K13k19J30L8j25n4J31jj8p7L5L9qJ49j16MJ0l0j59
3555a45K38Jj21P1R3j24j30K24q2j1j1J0j19J63j3l0K6M3k4q3P3Qr3J26l3o0P6
$$ y = [-52, 54, 22, -59, -18, 20, -91, 31, 67, -11, 76, -7, -18, -23, -3, -91, -27, -20, -35, 42, -30, -71, -66, -4, 47, 58, 36, -23, 76, -43, 40, -13, -1, 75, 136, 93, -11, 28, 70, 8, -43, 89, -80, -20, -43, -12, 28, -1, -35, -4, 20, 21, -49, 15, 26, -34, -79, 51, -40, -43, 121, -8, 25, 40, -19, -15, 66, 15, -73, -32, 70, 44, 62, 79, -7, -21, -125, -6, -103, 18, -12, -63, 7, -19, 7, -94, 53, 13, -7, 8, 31, 23, -64, -91, 51, 28, 57, 37, 22, 39, 79, -38, -15, -35, 11, 12, -13, 43, -53, 42, 60, -84, 2, -7, -84, -35, -52, -23, -13, -29, -107, -94, -90, 50, -13, -81, -29, -31, -20, 19, -6, 0, -49, 64, 73, -33, -10, -9, -22, -5, 1, -104, 4, -34, 17, 39, 68, -61, -113, -9, -7, -25, 108, -72, -141, -29, 0, -6, -68, 26, -129, 32, 33, 114, 113, 7, 104, -96, -15, 45, -17, 93, 78, -93, -4, 36, -1, -84, -39, -31, 26, 2, 6, -69, -87, 126, -93, 37, 75, -50, -104, 27, 26, 8, -69, -34, 5, -3, 146, 30, 34, 44, 14, -145, 93, 94, -27, 44, 137, 13, -117, 107, 25, 14, 3, 13, -106, 57, 44, 14, 40, 83, 59, -24, 49, 57, -36, 90, 57, -3, 73]
3582G3j7l6Q4n1j03k0P7j6J3L0Kk41K65n4n4R5M2p7o8L5lj5qJ66q7jJq2J0%N1
3613A1j43J15J03j87J36Q8j37p6J77j35oJ80q0m1k8Q4j18J0J22o3n5K0L0j8k7
3638c8l4RM9J52j84J3Q4j06MJ45J5j66P5P4j25Q1M8j76M5M3j06O1J32j44j04M7
3664a06J68j8p2J29rj43Q8J6j63J11J3o1O2l3n3l8J19L8j51K33k2j55P3L0j38
3689h2M6N0p5M1L8o8j5J25o7q3RJ53k03J78n1o7R6K0o2K1n8J47p4o8J19j06M8
3716A2n9Om7J44k7j72J41N5p7pJ9M7q8J39o8q3K2R9j14J01o3J9O3p9P7K7n1j11
3744g5J12Q8j89J41n1ml9o6L2O1j3j5Or5J48m2L3K9l7l3Qj3Ln3P9J1l9PrO4q1
3775c2m5L2JR8jr7Q1r5K7R7r9K9l7J01N4j64O7L7q1J18m9o4o0J22p2K3o4N5oP2
$$ y = [73, 56, 20, 104, 53, -50, -70, 7, -9, 4, 34, 36, -205, 60, 6, -48, 47, 89, 12, -56, -21, -24, -39, -47, 119, 32, 31, 32, -50, -40, -40, 11, -132, -17, 86, -101, 35, 123, -14, -90, 87, -48, -54, 126, 46, 5, -23, 61, -57, -47, 75, 12, -43, -23, 7, -11, -38, -72, -63, -14, 138, -46, -33, 51, -55, -51, 94, 109, -57, 18, 92, -33, 48, 96, -80, -35, 8, -98, -37, 95, -49, -153, -106, 62, 44, -28, 101, 92, -51, 37, 53, -110, 1, 14, -47, 15, -18, -71, -109, 10, 48, -103, 130, 108, -47, 26, 56, -82, -36, 14, -61, -20, 18, -50, -65, 60, -7, -90, -81, 72, -131, 47, -4, -71, 25, 45, -17, 4, -54, 93, 19, -49, 70, -36, 12, -47, -41, -88, 56, 29, -143, -2, 53, -24, -31, -12, 35, -53, 86, 18, -65, -43, 56, -58, 43, -20, -1, 62, -17, 60, 87, 36, -75, 37, 125, -64, 77, 26, 22, -17, -83, -51, 10, -3, -18, -12, -107, 41, -1, 32, 61, 24, -9, -1, -14, -11, -64, 15, 26, -13, -6, -15, 49, -32, -77, -45, -44, 54, 53, -44, 37, -58, -31, 66, -33, -4, -41, 60, 114, -50, 17, 54, -27, 91, 42, -22, -82, 40, -32, -9, -73, -18, -24, 48]
3805D8j5p5k8L1K1M1L3j01M0l1mL3j9J0K7m6k0Q4r0N5P3l6n6O2l0L6j5o7P7Jl8
3836AQ1l3Rm8o5O2jJ0R2r5nN9j05o5J9R7m1m0K8qj9P4m8O7kj6l7R9r5oJ14j26
3868d3J0L9M7l5K3m3l0m7J30l3o9J06n2j4l2mk9J13m3j6O0m7Q6p4r8N6J12o4O
3897A5%r2J28n6orN1Q2l8j00Pp3j0N8J03j09J62j12N7o5j31R3L8m9rJ28k2n2Q4
3926G3r8l8R0M3q7l4P0Q4n3J3o8n6N7J00j28M3k3J5N8l9p3L4j7l2O0r4J05j7R9
3955H7p8J04j63N2m2rJ26L3j40pP9o2n2N6J1l1N1P3j31K3n7J53j20N5Q6m4%pp6
3984c0Lk0M9K0L0n4k6J7%n2J64p9r1J74l8m4N3M8m8o3k8O2n5pL6o1k5J37q8k4
4014d0lM5Nq8J27r0l1J3L2L8J18j71J3J03q4JJP9j50R5K2k3M2l7K4r2M2R2j44
$$ y = [48, 33, -42, -70, -39, -18, 23, 56, -45, -5, -36, -40, -7, -26, -16, 11, -35, -55, 29, -61, -6, 67, 31, -25, 37, 7, 43, 28, -39, 38, 39, 1, 82, 49, 58, 10, -55, 7, 6, 16, 108, 13, 8, 67, -38, -103, -84, 13, -28, -68, -40, -48, -67, 7, -41, 26, 24, 8, -29, 70, -25, -31, 83, -43, -33, 6, 53, 18, 41, -2, -32, -79, 51, 18, -51, 55, 3, -11, -43, -47, -76, 37, -6, -22, 38, -9, 77, 3, -95, -39, 73, 9, 15, 15, -77, 51, -5, -11, -20, 31, 113, 75, -25, -18, -91, -101, -43, 60, -49, 113, 1, 58, -7, -138, -45, -7, -56, -65, 63, 41, -11, 73, -25, -63, 27, 70, -17, -51, 19, 103, 50, 63, -5, -61, -4, 96, -32, 11, -12, 3, 61, 22, -51, -17, -34, -66, -6, -100, 5, -12, 87, 9, 113, -50, 2, -40, -49, 77, 110, -30, -37, 42, -20, -72, -16, -5, -36, 15, 88, -43, -20, -77, 76, -44, 11, 97, 53, 53, 46, -30, -27, -47, 2, 22, 52, -2, -28, -11, -11, -63, 101, 22, -69, 105, 67, 23, 76, 124, 76, 13, -15, 47, -8, -15, 21, -40, -65, 72, -16, -40, -43, 2, 7, -81, 46, -44, -75, -62, -30, 8, 126, -45, -32, 71, -13, -12, -11, 68, -82, 13, 35, 12, 54, 17, 41, -51, -9, 83, -61]
4043f1Q2R3j20p3K41j99N1J8l2n5m3R5LlJ03p1j28J47j12LJ29n2n4JR1n6r6K27
4071A29r5j04K22m6j58K1P2j62J51O0j64P0Lm5MJ13j37j08R0J27m8l9N2r7J04
4096A5k1n8N1N4K7q2mR2l3n0O6nm3o5l7N2J39j06k3q7J85j80P7P0q0QK3R5l3L7
4126H4l8l5r8J10k4JM7J9q1M4M9o6o3M1j33O5L9O1o2Q5o5RJ2P0j56pM1p0J78N3
4156A10p3j13K2Q4j0k8kj07N5J53j27m0J58p3j24J13J0o6J14O4k29rK54k22J3
4181g3J83n7k05K09k2j51J97L0k28J14N5q1QN2l8j07J76J12k56O3Pm7J0O0k8M7
4207C0J3Rj06Q4L3j27L5Pm6M4J64j15l0K5K8q9o9J00j04R8ok8%K12j09j00L6P4
4235F3j81PK28j25k7J31r1M4o2k4J4k0J19j47R5j7j04P8j4Oj1LR8j12L4R2k9q3
$$ y = [-61, 21, 114, -6, -79, 162, -37, 14, 32, 0, -55, -98, -3, 0, -3, 100, 29, -99, 48, -64, -61, 68, 16, -38, -37, 54, -2, -98, 129, 34, -70, 152, 106, -52, -31, 41, -121, 30, 90, -74, -4, -1, -46, -42, 71, -66, -174, -84, 43, -5, -44, 8, -89, 15, -6, -64, -13, 41, 68, -14, -18, 74, 41, -9, 57, 52, 9, -56, -93, -41, 98, -8, -31, -118, 67, -113, -36, 34, -46, -38, -15, 80, 47, 84, 46, 11, -87, 23, -1, 0, 47, 66, -15, 29, 78, 12, -51, -10, -143, -78, -39, 22, -40, 45, -20, -11, 1, 71, -85, -92, -51, -121, 57, 110, 37, -76, -54, 30, 20, -8, -10, -117, -62, 91, -36, -76, 82, 9, -115, -2, 8, -58, 56, 120, -109, -118, 136, -86, -73, 110, 53, -152, 57, 35, -116, 81, 111, -117, -3, 52, -29, -21, 31, -7, -114, 62, 174, -82, -19, -12, -59, -49, 11, -17, 30, 43, 52, -54, 30, 63, -64, -29, -22, -68, -24, 140, 25, -5, 20, 48, -41, -110, -10, -114, -16, -22, -50, -50, 162, 53, -47, -11, 63, -118, -111, 117, -8, -35, 96, 5, 49, -13, -37, -23, -43, 76, -71, 24, 7, -97, -19, -33, -27, -38, -35, 63, -49, -15, 77, 48, -35]
4263c5J6K9k8L6M8j19l0J27o7K0P6qj68Q7J74j28j14M6mQ7m2on6R6j2j21J23M3
4291G0p0n9J51j28L3L7N3q5L8j1o4K9O1p1K2k1N6n6j2k1oK4J4K1pL7o5N9K0O0
4321A09j55lQ4n7P4J01k22J08n0Rm8L7K4pO3r7l6jJJ11n5M1l9n9L6J24j21K2N2
4350D6M9j59J04j29N2J06m4j7j38R9j08Q0P9m2m4J14o1k0O3Pj17R0ok9j3j6J40
4377H6p6l8j6KJ2R2m6l0O6o5J8J13r0O0r6K7M1J6p5rNL2L7p3J6Nj39L3K27j82
4407d7R1j00j3k3Q2n0P2m3l4oM5j7L3J41j09q1L2L2j52J01K3J03j42J12L1j42
4433f1M8J01j1o6L3o2m1R6Rk8K3N3j00k1J69j47j9O6m7k9J85j00L7m5RKj33J08
4461B9r1k9J46Jp0O5p5K4j12J80o1k3J3Km9J0K2j41K19j9L2p8N9K2j48J61K3k11
$$ y = [-35, -19, 10, -18, 18, 66, -53, -83, 44, -23, -3, 73, 65, -103, -16, 158, 30, -84, -38, -42, 45, 3, -3, -59, 37, 25, -96, 27, 70, 0, -59, 92, -36, -3, 34, 87, 2, 40, 29, -35, -6, 55, -16, 6, -15, 41, -15, -27, -48, -54, -30, -16, 5, -2, 35, -30, 29, 49, 109, -46, -49, 35, -22, 52, 153, -69, 39, -11, -2, -50, -13, 11, 4, 67, -30, -66, -67, -66, 45, -10, 31, -8, -67, -31, 93, -28, -6, 46, 95, -64, 40, -89, -37, 69, 25, 8, -130, -31, -139, -59, 20, -22, -66, 48, -13, -33, 30, 37, -80, 10, 4, -25, -38, -54, 86, 10, -28, -44, -42, -30, 62, 16, -14, 52, -13, 5, 118, 28, 88, -8, 19, 60, 76, 1, -8, -3, 29, 66, -7, 9, 14, -125, -92, 135, -47, 44, -56, -69, -92, -10, -60, 12, -31, -65, -71, -26, -43, -10, 131, 22, -59, -27, 5, -147, -46, -23, 80, -62, 50, 81, -61, -13, 88, 77, 11, 44, -18, -59, 37, 46, 18, 41, 94, -6, -27, 142, -5, -24, 42, -5, -34, 151, 51, 88, 43, 52, 54, -79, 29, -62, -91, 55, 56, -14, 51, -24, 0, -112, 68, 7, -16, -3, -1, -50, -40, -18, -159, 60, 41, 73, -5, 54, 76, -72, 89, 112, -99]
4489i9N7J57p2m3j6j0%Q2k3j19J06M0J8m4K3j09m2J45j20q1J95M9j74P4M6o5J10
4516H5j5r1k5J41p0q7O9K6j46J10P0q2J4P8l7j45J98j4m4%k8j14Q1Q5n6k5L4k2
4544a0K3RP3k03K22N5k23L0J82k27n0K55k1k28J74L2r3j01J64k14J40M5j18j3
4568i7P9P2j87J23L4j24p2K96j68m4J45j48o2J55R7r5J3R2j87J16P4j10m8J78
4592A32j08k04Q4J34r6J50pj16p3J89p6j27R3J1p9J09J00k13P6J92j38j15J95
4615A13lj74J38j08k0mR2K1n6J39j67j10J28N2n8m5K58j45j03J91j80q1O8M8j1
4640a7L4j1k7l8L9J6l9J50j28q4J83l4p3P0km5j25J66p3mJ38p4p9Q3%m5j3P0L1
4669F9o4o2J2kK2J3j1N0p4O4o4J55j09O9j4k6j5M4Mp0J29l1j69N2P7p3L8k8N8
$$ y = [-99, -42, 115, 43, 0, -16, -26, -26, 56, 33, -86, 20, 60, 78, 34, 57, -52, -94, 51, -69, -150, 45, 94, -80, -6, 40, -25, 85, 70, -21, -46, 95, 25, -62, 7, 33, -113, -3, 67, -15, -1, 77, 40, -105, 93, 79, 35, 35, 7, -107, -26, 59, 3, -22, 12, -10, 13, 22, 95, -108, 114, 169, -54, -24, 158, -69, -119, 136, 115, -113, 61, 93, 0, -101, 63, -151, -11, 34, -84, -97, -18, 54, -133, -10, 24, -100, -172, 124, -44, -88, 57, -91, -153, 2, 99, 4, 17, 109, -78, 38, 112, 2, -46, 132, 24, -180, -96, 38, -58, 92, 85, -31, -104, 85, 9, -118, -25, -14, -93, 16, 116, -97, -21, 171, 33, -82, 113, 110, -64, 74, -34, -54, -58, 34, 55, -1, 138, -29, -139, -11, 41, -17, -62, 196, 51, -52, 139, -41, -122, -54, -6, -17, 17, 6, -21, -59, -20, -4, -43, 107, -21, -105, 78, 44, -29, 41, 39, -6, -131, 35, -38, -42, 96, 22, -57, 26, 26, -19, -32, 38, 69, 5, -57, -45, -47, -25, -12, -23, 27, -47, 17, -47, 108, -1, 68, 54, 28, 13, 57, 61, -9, 120, 89, -80, -28, 49, -24, 14, -14, 44]
4698D4l7o1%J19j02J5K5RO2pn6J9J4p3n4J25j02J26q9Kl2Q9j7o5K0l1PL0O1r6
4728e5J5J0k0J9lKJ9K1O2j21N3l5J8Q4j93P7K8O6l1p7L2M6q8M0J92j07m4j19Q2
4757b7P9On5k5N0j2qJ5j0j08R9j6LP9kr4MJ33j07k7l2M2k0j4q3J05J45j16j8l0
4787d4o3J35M5j09k4R0j06N2N2qJ8n2R1j77P7L2p6J36L1j43J8N3J07j20Q7j29
4813b7M7L0k3q5k0J56r6O7j20J5nj5P0Qp2J8Q9m9J27o8p9rL6Jm0R2o3l9J08ko9
4844a7N1j0o3Q0j4n8oJ26j16M5j0K4p2O2n6P1l0nk7k0N7O0k19J43P9j07P4r5M
4873d9M0Ol5RJ9r7Q0P3j4j39L4J17kj60J60j38O9l1pO3j8o5Q0l2n2N7K0P6l4r8
4903f8J70l7j3n2m2P5K9M9j48M6k3R4k7kPj07LqN2n6J06q4J6P6J0l9n7k7K6Q2
$$ y = [44, 7, -54, -54, 65, -37, -22, 3, 12, 74, 67, 11, 30, 44, -29, -83, 42, -60, 66, -23, -21, -53, 36, 19, -46, -26, -57, -50, -20, 41, -55, -40, -30, -50, -31, -34, -32, -13, 8, 70, -51, 2, -33, -15, 69, -124, -47, -19, 47, 16, -61, -29, 17, -71, -31, 161, 54, 10, -109, -27, 52, 58, 3, -22, 28, 16, 8, 23, 13, -95, 4, -12, -9, 70, 68, -26, -22, 111, 4, -23, -55, -13, -33, -47, -130, -25, 120, 4, -14, -44, -107, 28, 73, -36, -60, 30, -76, -24, 28, 20, 38, -14, 77, -100, -23, 9, -67, 69, 100, -43, -25, 28, 135, 15, 102, -27, 20, 50, 27, -58, -78, 78, -18, 49, -71, -56, -61, -76, -6, 2, -70, -52, 37, -12, 115, 47, -32, -41, -5, -4, -44, 48, -15, -54, 54, 52, -17, 34, 24, -39, 41, 27, -31, -37, 89, -27, 18, 8, 32, -40, 22, -34, 37, 7, 2, -25, -45, 12, 72, -147, -4, 75, -32, 42, -53, -49, -9, -3, -38, -29, -10, -107, -27, 46, 32, -107, -73, 44, 42, -118, 42, -96, -27, -58, -65, -2, -20, -85, -5, -37, -89, -32, -12, 64, 30, -68, 102, 65, 52, 0, -42, 33, 62, 111, -37, 9, -14, 80, 53, 51, 58, -49, -46, -54, -2, -58, 48, -36, -20, 56, 66, 27, -30, -57, -31, 51]
4933E1j29J25p0L7m9K2O7l9OK5p5L0P8n4n1K5k0N7k4n3J9O6j5K2j14Q4J4l8%Q9
4963H6p7Nk8O4q6M7j5m0J52o8l8o9N0kK3m1K1J1L4j7K2K5p6%J15j05k5k4J06j04
4993e4J09j28R1l3l9J41o2l9J8j1m9J11m5o8J42q3K4k0L7o4J2jN7k4j71O1P9P4
5021F5q5k5P7rl7j2m9Q9L2n1P4l8j61J48J43j56j9O4j28J27k5j30N1K6%j2J36
5048I5j17J1L5l7NJ8K7j04N3J26j70P3m1O6k0j20R2kj0%O8J9J1j26M0P%j0K2k0
5078ik3j6L3l3J40j24P8n6j0P5j24J06l4J17j47%M3l1Q2L5l9n0K9m0k2P1p5PJ0
5107grjJ28o3m8M3j3J8j00O1j20J7P0J8mk2P4m5J1RN7r7R9l6k7j00J05M2p6OR
5138aMm9N0K1j78qJ58m5Q7m2Oq1L4m2J96j87L4L3pj2K8J27j20J0N0o5N4p7N3q5
$$ y = [51, -78, 47, -23, 14, -35, -13, 54, 15, 21, 46, -29, 1, 79, 25, -26, -1, -21, 36, 12, -41, -22, 44, 29, 51, -63, 21, 35, -3, -3, 86, 9, 14, -14, 50, -36, 11, -4, -44, 108, 40, 2, -67, -17, -19, 4, -37, -16, -5, 29, 12, 34, 59, -17, -17, 98, -7, -32, -56, 50, -54, 55, -73, 18, -15, -54, 87, 25, -14, 4, -7, -56, 55, 10, -58, 84, 1, 25, 5, 42, -22, -10, -11, 46, 22, -149, -88, -9, 65, -20, -45, 32, 23, -14, -26, -75, 14, 46, -5, 69, 31, -130, 18, 161, 5, -14, 50, -78, 49, 24, -106, -55, -29, -29, -41, 95, -22, -11, 24, -13, -8, 10, 37, -67, -14, 112, -58, 15, -26, 40, 20, -100, -8, -10, -20, -20, 48, 67, 78, -48, -8, -1, -1, -11, 11, -9, -32, -48, -15, -48, 92, -32, 46, -10, -20, 55, -69, 37, 3, 120, -27, -27, 16, -15, 67, 102, 63, 13, 42, 2, -20, 51, -24, -17, -7, -16, -17, 111, 48, 0, 43, 30, 48, -52, 9, -111, -94, -24, -6, -10, -32, 42, -3, 8, 17, 74, -23, 76, 40, 13, -87, 18, 60, -16, -10, -1, 3, -46, 4, 25, -153, -161, -3, -48, 39, -3, 3, -78, -44, -86, 110, -77, -43, -10, -17, -29, -1, 126, 6, 16, 66, 1, 55, -22, 31, -54]
5168e4O9Q7r8l4O6nn0n0J2L1O9q4Lj07J93P6kn8j3j64J94m1j3q6L2K2j0J8m1k2
5198f0LQ7n5J8L2K2n1J48j15j0r1K0Kj6P7l9J3M2k6m5J22j52M1L3n0R0p1J8l8
5227e1N4J15j08l1J56j10r3J51o5J5r6R1k6l5K5O8Nj2j17R6p6k7Q4m0pK3N3j5
5255B7N3o0m2O0p5O6M6j22%lQ6k0P4l5j12N6k4pJ2j12K17k64K00r1M2o5J36q1
5283c8n9O5P0m1O6j00MQ6m7ml6J02n5k7K4n6Q1l1K1l8k7J3L3p2J00m8k0K9Kk6
5313b9MRn0M5M6p2J6K0K1K7k5n6Q5q4P3o5pO3n9K7K0n2J36l9r1j7O9l9Q3r1l5
5344f7R2r1M7J05j37j5K0J28o2k0qK0Rp6K9N6q7J7J39j78K5LO4j3J23q4p4qK3
5373b0L5n7J21n0j6R0j08P0k7n9N6j03O4K3q2O5RJ43j24j9j9q6J13M4j06M2n7
$$ y = [-54, 15, 102, 4, -30, 36, 31, -19, -69, -57, -26, 43, -41, -38, -145, 48, 124, 122, 64, 51, -113, 81, 40, 27, -59, -27, -5, -15, 3, -38, -60, -57, 30, -25, -7, 25, 47, -4, 144, 29, 19, -72, -52, -50, -66, 11, -28, -15, 27, 1, -44, 78, -74, -33, 0, -50, 40, -31, -13, -51, 3, 118, 10, -21, 135, 25, -68, 83, 18, 33, -63, 28, 2, -33, -8, 60, 65, 53, -64, 32, -44, -71, 13, -27, -34, -11, 42, 27, 80, 20, -22, 38, -37, 29, 75, -47, -47, -50, 36, 16, 90, 55, -57, -1, -25, -32, -20, -132, 85, -179, 21, -70, -28, -93, 43, -38, -97, -32, 38, -3, 63, -37, -33, 53, 6, 2, -34, 68, 13, -14, 10, -46, 35, 4, 25, -13, -40, -27, 6, -66, 34, -14, -34, -5, -3, -29, -25, -16, -66, -21, 25, -47, -31, -11, 10, 37, 12, -44, 41, -43, 30, -35, -42, 21, -38, -11, 9, -43, 93, 54, -37, -54, 15, -24, 59, -32, -67, 25, -66, -19, 86, -51, -66, -46, 82, 20, 0, -8, 12, 21, -55, -26, 30, -57, -40, 99, -79, -54, -51, 13, 0, 123, 39, -35, -43, -20, 15, -42, 79, 29, 13, 103, -5, 65, 38, -21, 35, -68, -4, 19, -63, 2, 11, 154, 30, 11, -8, -94, 19, 63, -43, -1, -58]
5400e8J55o4m5K4j08O8K0QJ5M7j78P4N3Q3j15L7p4R1j5j6J4K3o2RJ20j43P4l0
5428Gn1n8J29m1o6n0J83o8Pj2p2J42j19Q1n1N7J02j36O1l0kl7M2Q2n4j77J14k6
5456d3R1l5r7oJ48o7JK1n9qL2K0J5O3j36J3K6n5J23k7l3k2N7l1k4J04j26O0p0
5485f5l1J25n6KR0O0j44P1M7j04l4Q6j8n8MJ9N2l2o6L2O4j6l4O5nn7Q6Qj02M2
5515C1m4o3k1K04j12N2L7o9n6P3j15Q1p5P1J8p1L7R3k7k6j6m6R0j04l6J20o8R0
5543D8j51K1O6M0m2p1J03J05j41j0P1j29j0Q5m3j6J29q2Q3p1m7j5M8J0Q4Rq7K5
5571A2j18J04l1NQ6J2J8m8m9QM9p4R3j23M9q4R1j2m6R8o2K9k3L4N4j34Q7j07J08
5600B6p1N1M0o8n4M7lK8K3p7MPJ09j16K4j7k6R8K5j65M9J24l5kR2j18k8L3Jl3
$$ y = [-58, 97, 33, -12, 12, -96, -28, -8, 0, 15, 62, -116, -42, 11, 94, -21, 16, -58, 33, 18, 2, 16, 39, -23, -14, 106, -37, 37, 7, -44, -102, 27, -14, -80, -130, 53, -15, -8, -20, -92, 50, -69, 12, -39, 18, 120, -16, 45, 15, 13, -24, 18, 100, 46, -131, -17, -43, 48, 13, -84, -90, 58, -9, -8, 13, -46, -54, -22, -2, 13, 76, -60, -47, -21, -76, 47, 20, -13, -35, 22, -9, -33, 71, -55, 5, -65, -96, 29, -27, -25, 65, 125, -19, 52, 99, -5, -39, 47, 29, -29, -25, -6, 46, 14, -52, -20, 44, 28, -6, 59, 54, -3, 83, 91, -11, 31, -13, -76, -97, 107, -5, 47, 84, 15, -41, 32, -83, -2, -77, -6, 12, -59, -22, 71, 44, 18, 2, -44, 46, -58, -94, 26, -42, 48, -103, -82, -16, 24, -18, -89, 14, 119, -22, -32, 39, -90, -100, -15, -58, -74, 55, -27, 56, -15, -62, -77, -29, -19, 65, 74, -13, 12, -106, -2, -33, -28, 58, 70, 88, 40, -9, -1, 48, -26, 67, -56, -7, -91, 0, -12, -58, 40, -22, 7, -16, 18, 72, -62, 25, -82, 26, -45, 6, 46, -22, -76, -29, -32, -4, 19, -58, -54, -47, 62, -54, -30, -47, -73, 25, 50, -115, -66, 58, 23, 21, 113, -5, -33, 0, 1, -32]
5630c2j11R2J19n7J9k1n6J40o7j66J59k7p7J00p5J6P0p7N5J10j17Kj7J3N0kL0
5657G3o8qJ37j38k4J7L5k1q2P2o7O6j29J72J4j13J41n3m0J14j76RO2J4P2p4rr5
5685i9L4M2P8j07k9O2p1Q4q8J89j18P6j03M4j6N2j4jo4K1M6J2j44L7P6k5M7q7
5713f6J14m7J29j24j1M8m0j6o0JN5o1oJ11r5O3l8P6k6l0k2k2Q5n2N0J4n8M0M1
5742E3o2K9RP7j08j7R4n1j1n9j4O6M8k6Nj32J73j49N2J05j16N1j34N4O8RN2j10
5770d4j3P9Lm0Ooq2J07J0K0m6r1J23j2jq2P6K0L6r3P6qk9K6l1J09j24o8J02j14
5800i1J47o3p5L0J15m5j7J8m9K7l2J14j7p2N5m1O9j2n7o1M8M2j2N0j10L4Q3j8
5828F0k4q9Q1k6L0Nln6r0J11p1M9m7J03q9Q0l3r5O5R8M5j06J5m4L8l9J15q6J08
$$ y = [-32, -143, -51, 68, 11, 30, 9, -47, 93, 26, -140, 19, -8, -85, 15, -60, -44, 26, -51, 4, 114, -3, -1, -18, -5, 45, 43, 73, 5, -3, 134, -4, -28, -11, 24, 3, -79, -7, -74, -8, -137, 35, 49, -64, 77, 24, -16, 98, -78, -69, -7, 7, 79, 5, -4, -99, -65, -23, 55, -52, -81, -19, -90, -6, -94, 95, -23, 53, -50, -6, -22, 30, 16, 15, -49, -28, 18, 30, -114, -77, -1, -26, 21, -66, 48, 1, 130, 6, -5, 43, 3, -13, -73, -72, -17, -78, -84, 27, -68, -5, -43, 33, 7, -23, -45, -67, 18, -34, 16, 30, -28, 12, 53, -9, 20, 29, 106, -2, -19, 75, 24, 13, -46, -60, 6, 54, 28, 33, -99, 74, -75, -23, 82, -34, 17, -117, -63, 5, 14, 66, -44, -57, 22, 25, -15, -9, -15, -97, 10, 20, 40, -6, -97, 26, 14, 13, -69, 7, 27, 63, -30, 46, 38, 9, 35, 4, 113, -11, -79, 23, -91, 56, -7, -82, -52, 63, 18, 1, 19, -30, -3, -35, 79, 62, -10, 45, 4, 73, 61, 4, -57, -9, 33, 21, 71, -39, -5, 78, 60, 36, -53, 28, 2, 32, 37, 34, -22, -112, -1, -72, -23, -70, 33, -56, 24, -9, -104, -39, 59, 104, -2, 13, -31, 7, -32, 83, -3, 105]
5857A05j29k6m8L9o3J39l8J0Q5ok0L5j14R3j95R7j8O4JO1j23n8J49jj14K3J5K2
5885a5M8j10Q2o6N9m1O6OO4j61P7K2j4q4J04q0o5J20l1J00r2k8N2O9m1j34N8N4
5913A9k5o9J05K5m4om3O3Po4N3P5j4mj07J1K6l4J7J8L6m2q4J06J0n2M1p5L3N3
5943C5Mk9Ml0M0j25N1L2rN7m7o0Q4O5j43J08j4q6k2J2J04l2O3m5N6J04k23J7N7
5972B8Kp4P3k5q0R2l6L9K0on7l1Q7J2j08r%M7o8J12n3r1K16o7o1k6M5Q3j44O8
6002a2J8mj4j28J74Ro0J7Q3j62N1l8J14l0j30L8j9J33J3o9R8n7j11J80r9J3o1
6029e3M1L9l6kL9n1J07j40L5Q3n0P1m0j36R6l7QO1J2p6j9Q0L0o3o2L0O5m3k9j9
6059e9O9k3p8J37l4N0j01N4l8k9l9J95mp8l6R8j74K4R4n8R1l3Lj6O7j58P6j8M1
$$ y = [105, -24, -50, -98, -59, -122, 17, -21, -11, 74, 68, 48, 83, -31, 62, -133, -36, -54, 10, 11, 72, -51, -109, 40, 39, -75, -52, -37, -15, 33, -77, 5, -61, -2, -43, 23, 29, 93, -68, 9, 31, 17, -67, 37, -43, -108, 12, -19, 81, -11, -39, 13, 82, 41, -93, -35, 19, -6, -75, 30, 55, 11, 5, -38, 25, 32, -32, 21, 96, 82, 78, -29, -18, 8, -26, -9, 9, 45, 3, -81, 25, 35, -17, 24, -51, -18, 35, 39, 10, 14, -16, 24, -101, -50, -18, -27, 30, -17, -77, 7, 72, -71, 37, 23, -63, -85, -73, 31, -1, 62, 17, 73, 177, -46, -29, 28, 30, -44, 29, 4, -76, 16, -20, 19, 39, 33, -24, -55, 32, 44, -64, -73, -73, -26, -94, 18, -35, -126, 90, 23, -38, -64, -19, 64, -80, -12, 6, 2, -12, -140, 34, 43, -17, 0, 83, -79, -28, -66, 48, 18, -112, -74, -93, 40, 53, -16, 82, 25, -86, 94, -5, 8, -53, -12, 27, -9, -11, 28, -23, 84, -56, -21, 62, 12, 83, 43, -93, 3, -34, -26, 35, 47, -29, -48, 32, 62, -1, -63, -33, 32, -11, -40, -59, 10, -13, -91, 46, 12, 62, -39, 15, -23, -52, -91, 104, 100, 22, -14, 84, -90, -66, 28, -30, 61, 28, 31, 15, 82, -76, 0, -18, 23]
6088B3n8LN5Oj16Q3K3r4O4J31j67K2Mlp2J47o7o5K9Q7o0R7p7j3P8j16J4n5J61
6117F4r0M2j3l3l2L4J12k24J68Q7j62O4l4l9N5N6K8j17Q4Q0j16o1O6K5q1J57o8
6144E2j05N8K9p0k5Q1m3k5N2p9L2J56j05o5O6k0k7J51l2r8k7J05m1N7j21nK6K
6172b1R4j56J20j10KR7pM9m5o9R1o4K9oo1m7M2J00o2QP1r5N4j3jN4j0k5m4l3M4
6203a4n1K9R6kj84K15l7j38J88j37m2K2l8Q3PP0n2j2L6o9k4P8p0N6m3O5k5k5R4
6232G6k02J08O1o6J3l9L6q9M3J72j13kk1M2nnQ5q8j4k2k6O0j3LQ0l8o1K8kl5N
6263b9R8r9N3k5Q8j40O9o3j03J57l2K0M9r8P9j04O6O3L2j44M7q6N4N0P3n6p1P7
6291B5N5o1N7j39J00O4j58L8J1Qj3J0l5o1J34r8L5K4m5L3K3m8K2Ol1M4Q3l5k6
$$ y = [23, -35, -32, 23, 29, -87, -4, 19, -75, -11, 120, -47, -25, -21, -24, -96, 51, -16, -81, -52, 35, -25, 72, -5, -18, 60, -56, -42, -97, 64, -26, 16, 3, -30, -62, -28, 84, -140, 28, 115, -47, 17, -17, -56, -1, 55, 83, -34, 50, 130, 14, -47, 19, 44, -37, 120, 52, -53, 5, 34, -36, -61, 20, -23, -48, 4, -75, -43, 113, 8, -57, 9, -11, -38, 113, 81, -17, -44, 61, 20, 77, -44, -49, -23, -21, 73, -83, 37, -73, -71, 26, 19, 68, 23, -46, 45, -19, 10, 4, -57, -104, -62, 38, -24, -16, 55, -40, 14, 1, 0, 54, 44, 19, -25, -58, -14, -65, -36, 60, 58, -126, 89, 52, -86, 102, -35, -77, -55, -93, -10, -3, 67, 15, 3, 39, -30, -54, 24, -46, 10, -33, 32, 7, -18, 76, -126, -18, 43, -23, -10, -49, -13, -102, -59, 113, 0, -2, -23, 19, 14, 9, 94, 6, -8, -30, -56, 4, -9, -6, 74, 36, -25, 3, 1, -34, -29, 69, -30, 23, -2, 86, -54, 15, -48, -151, 6, -26, -6, 43, -55, 24, -80, -14, 49, 81, -63, -16, -102, -48, 2, 75, 19, -52, 25, 80, 19, 76, -63, 37, 101, -57, -19, -8, 0, -13, -3, -38, -99, 35, -63, -28, -4, -49, -16, 7, -41, -19, -13, -44, 0, 83, 48, 22]
6320B2K7J2j45J33j4p0l6P9l6o0J88k9p1Mn8J56j07Q1o1J0q4J00n6Q2j30KK1L5
6348ekL6N5m0j43P2P0K3j3r3N4pp3J19m5J9ko9J83q6M4j04m1N6r2O6n2J10o3K5
6378Bj0Po9J8M3Mk2J04j28lJ00j39N5M4L2j09O0k7L0o3K4K8Rm3J13j0j21J22j14
6407f3P0J1L6p2k1J8k0M5L9k4k2o4P2l8P4m1l7M2J6o4L9K7k8j2J27j48J5M2n2
6436c3n3O3L7J6J4rn3m6M5L4l6j1L0o4J06j19O3k3J6J02p3P3Ro8k2j14J80k27
6464a63J23J5M5J8m9L9l3J03j59O9j20J50p6k7J40j20J35j13o1QJ16p4J05j16
6488d5P0j9M3j8j7o4Q0j88K12J11j01k4Nr8J26j01m9J96l2m4j21K8N9m8l3J07
6514C5j06J02oj46PN7P2J4m4K3j70J57r7M1L8M9Lq8j2j0L6OJ7k8O6p4R0rj07O0
$$ y = [22, 49, 61, -84, 49, 35, -35, -71, 8, -28, -88, 100, 71, 0, 4, -54, 102, -5, 76, 15, 25, -59, 41, -15, 67, -63, -61, -40, -5, -7, 29, 84, 44, -99, -27, 43, 66, 53, -40, 14, 7, -66, 53, 8, 27, 25, -44, 139, 53, 97, -7, -48, 8, -84, -18, -70, 40, -23, 2, -8, -1, -70, -52, -9, -5, -27, 77, -51, -54, 46, -93, -38, 6, 38, -71, -11, -38, -8, -71, -47, -19, -10, -53, 60, 50, -71, 51, -63, 7, 18, 54, -18, -39, -21, -41, 4, 43, 19, -3, -67, 5, -33, 41, 0, -37, 5, 21, -43, -4, 23, -5, -17, 110, -38, -23, 19, -33, -86, -23, 14, 30, 44, 35, -18, -64, -19, 15, -21, -32, -2, -66, 40, -79, -16, -39, -23, 79, 6, 79, 88, 20, -2, -116, 64, -163, -40, -25, 20, 38, -11, 28, -5, 98, -61, 8, -112, 38, -38, -65, 75, -45, 90, -23, -84, -76, 40, -34, 71, -45, 25, 6, 49, 31, 14, -50, 30, -158, 54, 165, 64, 40, 45, -53, 73, -28, -77, 119, 87, 43, -78, -50, 9, -39, -72, 35, -71, 31, 25, -121, -114, -57, 15, 29, -15, 8, -162, -5, -102, -61, -23, 26, 29, -59, -71, -81, -45, -39, -22, -50, 16, -58, 32, 23, -84, -24]
6544b4L2o3J3R0q2M8J9j30N1J11q3K2J43j51n0M0k7qm9J18jL2r6L3J1Mm3O9n8
6573b9L1j03P1J15j58N7k8k3J73o5r3K8okjR7r8j4J34k7j6n6J27l0k03J62p6Q5
6601E2j49M5M0oQ8j08j26N6J75j07J9p3M7N3J0Nm8L9m2L5K4n8L3l5R7or8R1r3
6630d0k0J47j13j50J02J19j23P0J0k7K5J60k24J38j07l7J77k5j08O7j12MJ98q7
6654D4L1r1p3J52j14M2m3K8L6j18J77k11J37N8Mj20N6j0o9J1L3M9j5J00j07p9
6680i2J01N1m2K9j12M9j5oK3p1J67p2n6J02j37Q2k0r8J50o8rq8J18K0j0p2O0N7
$$ y = [-24, 8, -55, -42, 48, -34, 14, 33, -97, -46, 65, -18, 4, 147, -4, -54, -14, -41, -49, -98, 20, 19, 51, -45, -12, -1, 3, -40, 29, -29, 2, -101, -30, 85, -73, -16, -44, -67, 106, 41, -52, -24, -30, -32, -33, 64, -34, -48, 86, 59, 43, -13, 114, 84, -119, 43, -33, 52, -97, -52, -12, -18, 70, -38, -164, -108, 67, -40, -21, -94, -47, 6, 16, 21, -27, 12, -30, 5, 29, -29, 4, -31, 66, 60, -38, 53, -40, -60, 87, -26, -176, -74, 45, -78, -8, 2, -25, 0, 160, -64, 74, -33, -70, 107, 82, -26, 41, -71, -67, 131, 44, 75, -16, -89, 63, -51, -9, -52, -24, 12, -106, 71, -140, -3, 55, 59, -61, -5, -15, -84, -73, -40, 9, -6, 94, -13, -92, 9, 60, 18, 47, -65, -16, -31, -37, -14, -85, 82, 10, -46, 56, -81, 1, -19, -117, 33, -35, -44, -132, -14, 6, -4, -76, -16, 41]
$$ [...]
8191e0
##END NTUPLES=NMR FID
##END=
