##TITLE=1H_IBEPA2709
 CDCl3,8 sc, 
 29.9.2021
##JCAMPDX= 6.0         $$ Bruker NMR JCAMP-DX V2.0
##DATA TYPE= NMR FID
##DATA CLASS= NTUPLES
##ORIGIN= UXNMR, Bruker Analytische Messtechnik GmbH
##OWNER= root
$$ XWIN-NMR		Version 3.5
$$ Thu Sep 30 08:32:53 2021 Russian Standard Time (UT+4h)  she@DPX200
##.OBSERVE FREQUENCY= 200.1313468511
##.OBSERVE NUCLEUS= ^1H
##.DELAY= (6, 6)
##.ACQUISITION MODE= SIMULTANEOUS
##.ACQUISITION SCHEME= undefined
##.AVERAGES= 8
##.DIGITISER RES= 18
##SPECTROMETER/DATA SYSTEM= spect
##.PULSE SEQUENCE= zg30
##.SOLVENT NAME= D2O
##.SHIFT REFERENCE= (INTERNAL, D2O, 0, 15.7039)
##AUDIT TRAIL= $$ (NUMBER, WHEN, WHO, WHERE, WHAT)
$$ ##TITLE= Audit trail, XWIN-NMR		Version 3.5
$$ ##JCAMPDX= 5.01
$$ ##ORIGIN= Bruker BioSpin GmbH
$$ ##OWNER= she
$$ F:/spectra/data/she/nmr/H-F/1/audita.txt
$$ ##AUDIT TRAIL=  $$ (NUMBER, WHEN, WHO, WHERE, WHAT)
(   1,<2021-09-30 08:30:52.37 +0400>,<she>,<DPX200>,
      <created by zg, POWCHK disabled, PULCHK disabled
       configuration hash MD5:
       00 E9 B6 7A A2 85 ED C7 34 08 36 98 17 FE 4E 26
       data hash MD5: 16K
       55 FE D9 2A 53 C4 B1 50 5B 8A 02 23 C3 EE 85 FC>)
$$ ##END=
$$ 
$$ hash MD5
$$ 8A 10 83 E1 A4 0E C3 93 97 D6 9F 70 34 BA 69 AA
##$RELAX= 
##$RELAX= 
##$RELAX= 
##$RELAX= 
##$RELAX= 
##$RELAX= 
$$ Bruker specific parameters
$$ --------------------------
##$DU= <F:/spectra>
##$EXPNO= 1
##$NAME= <H-F>
##$PROCNO= 1
##$TYPE= <nmr>
##$USER= <she>
##$AMP= (0..31)
100 100 100 100 100 100 100 100 100 100 100 100 100 100 100 100 100 100 
100 100 100 100 100 100 100 100 100 100 100 100 100 100 
##$AQSEQ= 0
##$AQ_mod= 1
##$AUNM= <au_zg>
##$AUTOPOS= <>
##$BF1= 200.13
##$BF2= 200.13
##$BF3= 200.13
##$BF4= 200.13
##$BF5= 200.13
##$BF6= 200.13
##$BF7= 200.13
##$BF8= 200.13
##$BYTORDA= 1
##$CFDGTYP= 0
##$CFRGTYP= 5
##$CHEMSTR= <none>
##$CNST= (0..31)
1 1 145 1 1 1 1 1 1 1 1 1 1 1 1 1 1 1 1 1 1 1 1 1 1 1 1 1 1 1 1 1 
##$CPDPRG= <>
##$CPDPRG1= <>
##$CPDPRG2= <>
##$CPDPRG3= <>
##$CPDPRG4= <mlev>
##$CPDPRG5= <mlev>
##$CPDPRG6= <mlev>
##$CPDPRG7= <mlev>
##$CPDPRG8= <mlev>
##$CPDPRGB= <>
##$CPDPRGT= <>
##$D= (0..31)
0 1.2 0 0 0 0 0 0 0 0.06 0 0.03 0 0 0 0 0.0002 0 0 0 0 0 0 0 0 0 0 0 0 
0 0 0 
##$DATE= 1632976251
##$DBL= (0..7)
120 120 120 120 120 120 120 120 
##$DBP= (0..7)
150 150 150 150 150 150 150 150 
##$DBP07= 0
##$DBPNAM0= <>
##$DBPNAM1= <>
##$DBPNAM2= <>
##$DBPNAM3= <>
##$DBPNAM4= <>
##$DBPNAM5= <>
##$DBPNAM6= <>
##$DBPNAM7= <>
##$DBPOAL= (0..7)
0.5 0.5 0.5 0.5 0.5 0.5 0.5 0.5 
##$DBPOFFS= (0..7)
0 0 0 0 0 0 0 0 
##$DE= 6
##$DECBNUC= <off>
##$DECIM= 32
##$DECNUC= <off>
##$DECSTAT= 4
##$DIGMOD= 1
##$DIGTYP= 9
##$DL= (0..7)
0 120 120 120 120 120 120 120 
##$DP= (0..7)
150 150 150 150 150 150 150 150 
##$DP07= 0
##$DPNAME0= <>
##$DPNAME1= <>
##$DPNAME2= <>
##$DPNAME3= <>
##$DPNAME4= <>
##$DPNAME5= <>
##$DPNAME6= <>
##$DPNAME7= <>
##$DPOAL= (0..7)
0.5 0.5 0.5 0.5 0.5 0.5 0.5 0.5 
##$DPOFFS= (0..7)
0 0 0 0 0 0 0 0 
##$DQDMODE= 0
##$DR= 18
##$DS= 0
##$DSLIST= <SSSSSSSSSSSSSSS>
$$ [...]
##$SUBNAM2= <"">
##$SUBNAM3= <"">
##$SUBNAM4= <"">
##$SUBNAM5= <"">
##$SUBNAM6= <"">
##$SUBNAM7= <"">
##$SUBNAM8= <"">
##$SUBNAM9= <"">
##$SW= 18.0517286264689
##$SWIBOX= (0..15)
0 0 2 0 0 0 0 0 0 0 0 0 0 0 0 0 
##$SW_h= 3612.71676300578
##$TD= 16384
##$TD0= 1
##$TE= 0
##$TE2= 300
##$TE3= 300
##$TEG= 300
##$TL= (0..7)
0 120 120 120 120 120 120 120 
##$TP= (0..7)
150 150 150 150 150 150 150 150 
##$TP07= 0
##$TPNAME0= <>
##$TPNAME1= <>
##$TPNAME2= <>
##$TPNAME3= <>
##$TPNAME4= <>
##$TPNAME5= <>
##$TPNAME6= <>
##$TPNAME7= <>
##$TPOAL= (0..7)
0.5 0.5 0.5 0.5 0.5 0.5 0.5 0.5 
##$TPOFFS= (0..7)
0 0 0 0 0 0 0 0 
##$TUNHIN= 0
##$TUNHOUT= 0
##$TUNXOUT= 0
##$USERA1= <user>
##$USERA2= <user>
##$USERA3= <user>
##$USERA4= <user>
##$USERA5= <user>
##$V9= 5
##$VALIST= <valist>
##$VCLIST= <CCCCCCCCCCCCCCC>
##$VD= 0
##$VDLIST= <DDDDDDDDDDDDDDD>
##$VPLIST= <PPPPPPPPPPPPPPP>
##$VTLIST= <TTTTTTTTTTTTTTT>
##$WBST= 1024
##$WBSW= 4
##$XGAIN= (0..3)
0 0 0 0 
##$XL= 0
##$YL= 0
##$YMAX_a= 344418
##$YMIN_a= -536076
##$ZGOPTNS= <>
##$ZL1= 120
##$ZL2= 120
##$ZL3= 120
##$ZL4= 120
##$ABSF1= 10
##$ABSF2= 0
##$ABSG= 5
##$ABSL= 3
##$ALPHA= 0
##$AQORDER= 0
##$ASSFAC= 0
##$ASSFACI= 0
##$ASSFACX= 0
##$ASSWID= 0
##$AUNMP= <proc_1d>
##$AZFE= 0.1
##$AZFW= 0.1
##$BCFW= 1
##$BC_mod= 2
##$BYTORDP= 1
##$COROFFS= 0
##$CY= 11.3945322036743
##$DATMOD= 1
##$DC= 2
##$DFILT= <>
##$DTYPP= 0
##$F1P= 2.36226072786647
##$F2P= -0.459571619588291
##$FCOR= 0.5
##$FTSIZE= 0
##$FT_mod= 4
##$GAMMA= 1
##$GB= 0.15
##$INTBC= 1
##$INTSCL= 1
##$ISEN= 128
##$LB= 0.24
##$LEV0= 0
##$LPBIN= 0
##$MAXI= 10000
##$MC2= 0
##$MEAN= 0
##$ME_mod= 0
##$MI= 1.114404
##$NCOEF= 0
##$NC_proc= 0
##$NLEV= 6
##$NOISF1= 3.799351
##$NOISF2= 2.8
##$NSP= 1
##$NTH_PI= 0
##$NZP= 0
##$OFFSET= 15.70392
##$PC= 1
##$PHC0= -13721.04
##$PHC1= 11.80085
##$PH_mod= 1
##$PKNL= yes
##$PPARMOD= 0
##$PSCAL= 0
##$PSIGN= 0
##$REVERSE= no
##$SF= 200.130013532006
##$SI= 16384
##$SIGF1= 3
##$SIGF2= 2
##$SINO= 400
##$SIOLD= 16384
##$SREGLST= <1H.CDCl3>
##$SSB= 0
##$STSI= 0
##$STSR= 0
##$SW_p= 3612.71676300578
##$SYMM= 0
##$S_DEV= 0
##$TDeff= 0
##$TDoff= 0
##$TI= <>
##$TILT= no
##$TM1= 0
##$TM2= 0
##$TOPLEV= 0
##$USERP1= <user>
##$USERP2= <user>
##$USERP3= <user>
##$USERP4= <user>
##$USERP5= <user>
##$WDW= 1
##$XDIM= 8192
##$YMAX_p= 0
##$YMIN_p= 0
$$ End of Bruker specific parameters
$$ ---------------------------------
##NTUPLES= NMR FID
##VAR_NAME=  TIME,          FID/REAL,        FID/IMAG
##SYMBOL=    X,             R,               I
##VAR_TYPE=  INDEPENDENT,   DEPENDENT,       DEPENDENT
##VAR_FORM=  AFFN,          ASDF,            ASDF
##VAR_DIM=   8192,          8192,            8192
##UNITS=     SECONDS,       ARBITRARY UNITS, ARBITRARY UNITS
##FACTOR=    0.0002768,     1,               1
##FIRST=     0,             0,               0
##LAST=      2.2672688,     0,               0
##MIN=       0,             -536076,         0
##MAX=       2.2672688,     344418,          0
$$ Real data points
##PAGE= N=1
##DATA TABLE= (X++(R..R)), XYDATA
0@%%%%%%%%%Qj6J6j6K4l2M0n4O3p4R7j20J38j63J93k30K72l15L67m24M88n63O44
32C43p34Q30r35J057j192J338j498J673j864K074k305K554k826L128l455L811
48A999m203M631n101N620o193O829p537Q331r228J0250j1430J2804j4430J6395
62H737j8820K1903k5973L1629m0092N4313q4304K61236k97908k03040L11258l47492
74c28553J27638L57523J92j5890J03044k42012j60501J10632j11173j32819L76853
85H4934R8089j07081J92692j66500k96042J37915j28626j10456L40627J81470
95B27022m8977R62r3440j98286j29856M7836J04952J65512J15244p8050n240m4452
107F3227j83410M4380n5744r9867L10377R3744j38474J68351m6832l02572m1125
$$ y = [0, 0, 0, 0, 0, 0, 0, 0, 0, 0, 8, -8, 8, -8, 16, -16, 24, -30, 33, -41, 56, -64, 74, -89, 104, -126, 146, -169, 198, -226, 262, -301, 343, -391, 439, -496, 561, -631, 707, -791, 882, -982, 1092, -1213, 1341, -1485, 1643, -1812, 1999, -2204, 2427, -2674, 2946, -3247, 3582, -3955, 4376, -4852, 5398, -6032, 6772, -7658, 8737, -10083, 11820, -14153, 17476, -22616, 31697, -52607, 208629, -89279, -292319, 18939, -328553, -200915, 156608, 156800, 140910, 243954, 1942, -158559, -47927, -159100, -291919, 84934, 183023, 75942, 268634, 102134, -193908, -55993, -184619, -295075, 45552, 227022, 178045, 179007, 85567, -112719, -242575, -194739, -89787, 75725, 190969, 112919, 107679, 63227, -120183, -75803, -131547, -231414, 78963, 172707, 34233, 202584, 155752, -146820, -187945]
118a87945M0293J7579J68524J33511n8045K9412N216l43173o3682K73183j19933
129a05060L9614L30638j56768j11130J40365k22712j26630J87015l6582n3527
139a14777K46419J05982j85597j6916k5719k43406Q0684J70669p7023J84837J24188
150B49341k34250k3080J536j71647M4099J25951K3497O7301P2914p2366j16304
161c3008P349n2550q1449J11101O9817M2151J06447q8282p8921j1786j58944J6673
173a51402J52252J8049P6770N1278r5651n6230l3070q0509r069J20141N3446j7553
185B8452J08254k7723j67582L8045m6419j04519J68082N7982m5625J31996k0259
196A20684j62744j7288r753o0550P3852J41029j3987j0353N9275j37439r5170
$$ y = [-187945, -147652, -130073, 38451, 171962, 113917, 143329, 148545, -194628, -258310, 14873, -105060, -65446, 265192, 108424, -2706, 137659, -85053, -211683, -24668, -61250, -114777, 131642, 237624, 52027, 35111, 9392, -234014, -153330, 17339, -59684, 125153, 249341, 15091, -7989, -6453, -178100, -134001, -8050, 15447, 82748, 155662, 83296, -33008, -25659, -78209, -159658, -48557, 21260, 63411, 169858, 81576, 2655, -9131, -168075, -151402, 850, 18899, 95669, 146947, 51296, -4934, -38004, -118513, -127582, -7441, 46005, 28452, 136706, 108983, -58599, -20554, -66973, -171492, -3410, 54572, 8947, 140943, 120684, -42060, -59348, -69101, -129651, -55799, 85230, 71243, 60890, 120165, -17274, -112444]
207a12444Q7117o4257N249J65417j5747j0487N1730j05959q3869J5357p194J6760
219e8327Q9580O9032l0189j4482k4793j14916o491M1880j3812J02713O1344n0935
231E0604J4440n5036q9882J5288p34K3425Q0340L2900R9j9839m2443o6774l2870
244i0482M2425J2243M8913Q9077m2335k7602p63j07678j0248N3911r640O8322
256B6143O0944k9262k0367l0783n5807l4748L0476M6970J2451O4447J9362p8815
268A1011o846l4648o8531N7408L5561J1145P0153o083m3349k5068m6917k3498
280f9662J2136M9100M1925J1666K9127l8156o2194k03l9811K235O8961J1384L6741
293E3249K1738n5186k5433l4657k8915K9063K6356M2534K6726o072r035n5996
$$ y = [-112444, -25327, -89584, -84335, 81082, 65335, 54848, 106578, 619, -83250, -67893, -75087, -58327, 31253, 100285, 70096, 55614, 30821, -84095, -90586, -48706, -62518, 40195, 101539, 50604, 65044, 10008, -79874, -64586, -65320, -41895, 38445, 71345, 71444, 51605, 9162, -57612, -90482, -48057, -35814, 13099, 102176, 59841, 32239, 31476, -76202, -86450, -32539, -42179, 26143, 87087, 57825, 37458, 6675, -49132, -83880, -53404, -6434, 6017, 70464, 89826, 11011, 4165, -30483, -99014, -41606, -6045, 5100, 75253, 69170, 25821, 753, -46164, -69662, -57526, -8426, 33499, 45165, 74292, 36136, -26058, -26261, -66072, -63837, 5124, 16508, 53249, 74987, 19801, -5632, -40289, -69204, -40141, -13785, 28749, 55475, 49403, 40368, -15628]
305a5628k9537O86j7316N5893M5718l604K7659l5171n0845p255l0779J6452M2511
318a216J8644L8417n553k6807k5607n0454M409J4251J4009O0185N458q479k9n5747
332a8519j9810m192p050N0806K4929J4837J5418m2588k4770k3299k2660L3439
344b3459J4521K7300L8654k4399j0214k4846m6521R131N522K5550M4413r05R131
357D3878k2118m4106n30k4492Q613M8372M260K8645O787m3026j2729k9565j1151
370d7162K6686J2552L6431J0735j2201K506m7483k0193J1944j4934M0983L3458
382C3322o267J7044l0534l3837l272k0428K0564K5124J3795L0681j6927j8893
394A0372j4025l9021J0976J1576J0912M3700m914m362k521m5242j773l370j0285
$$ y = [-15628, -45165, -44479, -61795, -5902, 39816, 36212, 63871, 28700, -22145, -29400, -60179, -43727, -1216, 17428, 55845, 50292, 23485, -2122, -52576, -48167, -33916, -19907, 40278, 45736, 37257, 37228, -18519, -38329, -42521, -49571, 1235, 26164, 41001, 56419, 13831, -10939, -34238, -56898, -23459, -8938, 18362, 57016, 32617, 22403, -2443, -48964, -39833, -34311, -8761, 35652, 34747, 43878, 21760, -22346, -22876, -47368, -38755, 9617, 13877, 42522, 49309, 6283, -6446, -36011, -47162, -20476, -7924, 28507, 39242, 27041, 29547, -17936, -38129, -26185, -41119, -136, 33322, 27055, 44099, 13565, -20272, -23544, -43972, -23408, 1716, 15511, 46192, 29265, 10372, -3653, -42674, -31698, -20122, -9210, 34490, 29576, 25214, 22693, -22549, -24322, -27692, -37977]
407c7977M5679J6151L831J0228k9712k0385j8610o298K3001Q441L3272J1878k9567
420I932J1566k8969l9360L1058k459P708M4240p449o434l897k6185j7879p902
433c6030K4430J3029M952M0327j9333l2683P996l8704l525M0273l033J9613J9948
446C7260j8763j3789k0400m570j374j697L3214N629J832J8739l2895j8651J784
459a3681k0539J6402J9958J5638K1754k3205j3073r559l1664J6398J5880L581
471b110L0360k400j6674n763j2803o061j1787J5049K3929j0847K4972O750m1357
484h742Q153j3224l2080L6880K2716k042J6293k183k4758k6235M895O808o364
497a9883L8675P090k8317K5170j2673l6949K0628m563j1139K5265J1358M069l21
$$ y = [-37977, 7702, 23853, 27684, 37912, 8200, -12185, -30795, -37093, -14092, -5651, 27621, 39499, 9932, 21498, -7471, -46831, -15773, -18232, -10524, 33716, 26267, 19833, 15936, -10249, -28128, -36030, -11600, 1429, 6381, 46708, 27375, -5308, 2688, -36016, -39541, 732, -2301, 17312, 37260, 18497, 4708, -15692, -20262, -21636, -23333, 9881, 15510, 17342, 36081, 3186, -15465, -13681, -34220, -17818, 2140, 17778, 39532, 16327, 3254, -6305, -37969, -21571, -5691, -2110, 28250, 25850, 9176, 3413, -9390, -15451, -27238, -12189, 11740, 893, 25865, 32615, -8742, -589, -13813, -45893, -9013, 13703, 11661, 27954, 25771, 1013, -25222, -20327, -13519, -19883, 18792, 25882, -2435, 22735, 10062, -26887, -6259, -10822, -21961, 3304, 14662, 18731, 18410]
510A8410n030k1307k7754J8859J0433k755M0561J136k9866n72j8659r216J5287
523a0473P537J3952O7J738L405k4393L208L240k4757J4983J7190J40J6940q57
537B1920j6463j9739r873Q244j670K6571K7863k8044j894J612l7213J0740K0039
550B093j0257J3382J1897q636p535N917j371k8798P092J8124j6618K7457K3251
563C5998l1385p39o599l0679J3368K3030P633N206K677p293k7305J844J2969j6089
577a7364J7502J5653k0213J3917P480j9250j329n260o067N27J3312K4073p922
590A5059m690J003l4394k216K2061l541J6501J3151j2641j0665p027J792n754
603a1361J648J8717j2155K643K2589j9431l898Q524k5792r12J6736N243R927N945
$$ y = [18410, 13380, -7927, -35681, -16822, -6389, -9144, 31417, 32553, 2687, 2115, -16544, -25760, -10473, -2936, 11016, 11083, 12821, 16226, -8167, -4959, -1719, -26476, -11493, 5697, 5837, 22777, 21920, 5457, -14282, -24155, -15911, -17581, 8990, 36853, 8809, 6915, 8527, -28686, -17946, 2093, -8164, 5218, 17115, 8479, 944, 6861, 5490, -23308, -16216, 1908, -14710, 12747, 35998, 4613, 3874, -2725, -33404, -20036, 2994, 10627, 15833, 18510, 11217, -16088, -14244, -1275, -17364, 138, 15791, -4422, 9495, 16975, -2275, -3604, -8864, -14931, -14404, -1092, 22981, 15059, 10369, 11372, -23022, -25238, -3177, -6718, 9783, 22934, 10293, -372, -7399, -5607, -11361, -9713, 9004, -3151, -508, 22081, 2650, -1248, 7276, -18516, -19428, -2692, 2551, 12478, 18423]
617A8423k734k3345j1799J3572j0235J1138K9571j7952l710Q706k1232q26Q218
630b205l811K340L851J0036k673l346P819k1978r071J5510p471J2761K1427j2106
644A1083o329p035j0726p09L742J7800O19n743J2414j5040j0494J3970j2765j688
658a0901J3975k767M853N229q88q171j3509N416l698k59K6232l610p733Q652k0513
673g692p737J1518k301O534O868J908l070q233N774q612r427J5526m678P99J8208
688A5385q582m164J87j2745k77J933P464R688l113N393o910j4517O657n122N91
703h132J4660l252J600K599o425q85p744P30M709n249J4076M785r694O182r508
718a548j0792P755j274M763P744R47N23r133j442j426q793J2389L501m948J3387
$$ y = [18423, 15689, -7656, -19455, -5883, -16118, -4980, 24591, 6639, 2929, 11635, -9597, -10423, -2205, -6016, -3676, 175, 10211, 7538, 4192, 12011, -9967, -19038, -3528, -10999, 1762, 23189, 11083, 4754, -2281, -13007, -13716, -9974, 7826, 8445, 2702, 15116, 76, -10418, 3552, -9213, -10901, 3074, 307, 5160, 10389, 9501, 1330, -12179, -6763, -10461, -10720, 15512, 11902, 4169, 12821, -7692, -15429, -3911, -6212, 322, 7190, 9098, 6028, -2205, 3569, -5043, -14470, 1056, -3622, -2823, 15385, 6803, 2639, 2826, -9919, -10196, -8263, -799, 8889, 5776, 11169, 4259, -10258, -3601, -8723, -8132, 6528, 3276, 4876, 7475, 1050, 165, -7579, -6849, -2140, -7389, 6687, 11472, 1778, 7960, -1548, -12340, -4585, -5859, -1096, 6648, 7595, 8118, -1015, -2457, -3883, -12676, -287, 3214, -1734, 11653]
733A1653n804q906N223q364j995N087R83P835J52J118k348j2066L656k068k734
748h578J4270r80j387N677j0071j401j403n420P736J698L264N422o857Q05l995
763a220p790O084j066L083P722l180L176m018q658L124n049K972J0178m167M379
778E570J280r012J155l940j677N355J7O460O57l199J731r945o54N385o017Q498
794A664N078m805M667n455n805J970m120M339M188J035M958o312j439P8q076N372
810b663J621j546R960l183k425K111q948M03J301q86P837n72N47J777o892J45
826a413k593k830P365p20L429M155o979Q91k908n697N838r76K420N913l616J600
842C879k264o767K773k389K465N924k183M129k184n839K698n619O14N854k516
$$ y = [11653, 5849, -3057, 2166, -6198, -8193, -3106, -2123, 5712, 5864, 6982, 4634, -7432, -3776, -5844, -8578, 5692, 4712, 3325, 9002, -1069, -2470, -3873, -9293, -1557, 141, 3405, 8827, 1970, 2775, -1220, -9010, -2926, -3992, -909, 6813, 3633, 6809, 2791, -5867, -2743, -7792, -4820, 5358, 1191, 5570, 6850, -2162, -1007, -4947, -6624, -1269, -1252, 5208, 5865, 2666, 4397, -5548, -6202, -817, -6834, 1664, 6742, 1937, 6604, 1149, -4656, -2686, -6806, -2467, 1721, 2756, 7714, 1402, -37, 41, -8035, -2663, -1042, -2588, 7372, 4189, 1764, 3875, -5073, -4670, -3369, -4255, 3582, 3010, 3557, 5334, -1558, -1413, -4006, -6836, 529, -191, 3238, 7393, 414, 1305, -1603, -7300, -1462, -2438, -18, 5895, 2279, 3879, 1615, -5152, -2379, -4768, -2303, 3621, 1438, 5567, 3383, -2456, 242, -5377, -4763, 1091, -1425]
857a425N909J142n314J243m930j457L290j754O021J268k391L332o157j918J728
872a413m528N691L100j842M665m039k541m6m608L931Q47j64O918l513j395J294
888B357p081J175J834o49N429n37K69J47n113J441k442j495O630k413K015M752
904F319o713L62q37m365L390R41K011K841j923P72l798l469M316l940K857N332
920D096l726K627m91m582J549k902P90L300j482M704n67l611K181m949j479L717
936h25p14L383J941j501l29m574Q98K76k991P020l90l626O652l972m181L948l739
953b724r64L557J971K34n52K469m457n548O287k249j603R764l709l623M981n649
969a815k196M314n08p16J605K302k247j818M838n554l587O654l598J198P252m086
$$ y = [-1425, 4484, 5626, 312, 1555, -3375, -4832, -1542, -3296, 2725, 3993, 1602, 4934, -1223, -3141, -1413, -5941, -250, 2850, 1008, 5673, 1634, -907, -953, -5561, -1630, -783, -947, 5971, 2458, 1063, 2357, -4724, -3549, -1715, -2364, 3065, 2528, 2797, 2944, -2169, -728, -3170, -4665, 1965, -448, 1567, 6319, -394, -32, -869, -5234, -1844, -903, 1108, 3949, 2026, 2798, -1000, -4469, -153, -4093, -1236, 4096, 370, 2997, 2506, -2076, -527, -3429, -2639, 661, -821, 3883, 3316, -295, 1886, -3063, -4542, -825, -1539, 1844, 3785, 2284, 1955, -2619, -1721, -1445, -4436, 2584, 2194, -1432, 5220, 1248, -2933, 1015, -2724, -3688, -131, 1840, 2074, 1522, 3991, -466, -6014, 273, -1976, -3579, 6185, 2476, -1147, 3834, -1815, -4011, 303, -205, -921, 684, 2986, 739, -1079, 3759, -1795, -5382, 1272, -2326, -1128, 6124, 2038]
985B038j356l38m244J121N84L588K176l142K187k506l871M302j336q79K569n09
1001C84Q25o06J037P51o257K130J738n183P790L693p004K707j535o325L303M211
1017A659l21j191L548j928p149O738R24q486Q600M04q487Q742J650o952L896n12
1033A135o232J044O481l85k184O034m851q310P661q57l742R253j715n883L643
1048A092j239j526J762Q04j185k983M278J329l158M297k030n462K007K43J280
1063d91L078M11P9n004j864M004l718L369N685o811QL935m652Q43L685k337l886
1080c666L160K991m652M698M028j1495J495N646q073N957P619p857q28L541o053
1095c489j117O898L13n441M710J299q483O225L683r069M302K326o947N099M230
$$ y = [2038, 682, 344, -3900, -2779, -2195, 1393, 3569, 427, 2614, 108, -3763, 539, -797, -1676, 893, 384, 1209, 603, 1640, 2391, -3866, -1736, 2, -5181, 2609, 6302, -702, 2005, 470, -5855, -2552, 1659, 1338, 147, 3695, 1767, -5382, 1356, 2280, -6206, 2394, 2798, -5689, 3053, 4703, -2249, 1647, 1135, -5097, -4053, 2428, 2043, -141, 5893, 1042, -7268, 393, -464, -4206, 5047, 3332, -2551, 1092, -147, -1673, 89, 893, -292, -3275, 1003, 2332, -826, 3471, 1441, -4021, -2014, -1771, -491, 2587, 2998, 3077, -1927, -3791, 213, -3505, -136, 5549, -1262, -1254, 2681, -1971, -1128, 2557, 220, -3666, -506, 2485, -2167, 2531, 6559, -4936, -3441, 2205, -5868, 89, 7708, -149, -977, 2564, -3489, -4606, 2292, 2605, -2836, 1874, 3173, -5310, 915, 4598, -4471, -169, 2157, -4790, 309, 4539]
1110D539l759l89K26k834k142M342L397l279K431m10o198K691J758j862L123p15
1126I19o21l06r50L229j663k717L471l294p95O051j570j172R45k258k981J076
1142b636N071j686p20M932o471k872P553m690j602P633m987k657N750j270l096
1157a748K637Q03n392J464N722m671R49N990q368j087N939n110J460N657l563
1172F82j694J880j047k027J982K266l662P47L271l649J404K527m667O78R62j353
1188a700K675K68L09l92l003J155k81j065L438j67r90O95j173k61p20J164O64
1205F16k712L042P17l859M350p28m762L529k33k407L811Q88k192j76Q65j897j700
1222b848M437r96k409N023k520l263M855k527k577M093j221j101K745l27j495
$$ y = [4539, 780, 391, 617, -2217, -4359, -17, 3380, 101, 2532, 2122, -4076, -1385, 373, -1489, 1634, 919, 298, -8, -958, 2271, 608, -2109, 1362, -1932, -2727, 3324, 1754, 582, 1527, -731, -3712, -2636, 2435, 749, 29, 4961, -1510, -4382, 3171, -1519, -3121, 4512, -475, -3132, 2618, 1348, -1748, 889, 1692, -3700, -2236, 3486, -1185, -236, 5754, -2614, -3701, 2238, -2872, -1412, 4245, 682, -1012, 868, -179, -2206, -224, 2042, -1620, -873, 2398, -1251, 153, 2680, -1987, -1309, -347, -1700, 975, 1243, 1552, 1160, -1843, -688, -969, -2034, 1404, 1237, 247, 942, -231, -492, -1212, -48, 616, -2096, 946, 1663, -2196, 2154, 1426, -3336, 193, -40, -2447, 1364, 2252, 60, -116, 749, -1148, -2848, 1589, 593, -1816, 3207, 687, -2576, 2279, -248, -2825, 1268, 47, -1054, 1691, 1364, -131]
1237a31l98J063j741q49L633j344m25L018l791n07K156k136R16J661j406J222
1253I41q55j00M78j565J063j05m82J336m81M23k0j740J399j362j49K891k044O67
1271B95J628k928N50L64j608J440O08O38Q11k36l12k166K24J276k415K194J359
1288A722k818K193K01l001J872m97n86J234L07rl49m3r1j552J507k5j342K682
1306A405o42j361J824j650n84J222j151J107M65n76Q99j348M62l30p67J759q07
1323g3L05R58j293k3L01j644J487K8k74J474p40n85N37j156J63J25l38J232l46
1342A38N34j85j269J458j481l91K064j541P13J037j331L50j3r26O03k57N23N22
1360E48m41P57j018m30J013j037J31J539j386Q84k5q51L70m75K07J76k12J012
$$ y = [-131, -529, 534, -1207, -2056, 1577, 233, -192, 2826, -965, -1472, 684, -1452, -536, 1125, -281, 941, 86, -14, 464, -1101, -38, -143, -625, 711, 230, 653, 633, -1107, 292, -1070, -1219, 1672, -372, 295, 1923, -1005, -455, -91, -1699, -259, 349, 987, 1798, 1562, 1250, -916, -692, 584, -1831, 363, 1722, -1096, 1097, 1298, -1703, 169, -328, -914, 320, 627, 618, 269, 226, 135, -1417, 90, 65, -1277, 1405, 763, -598, 1226, -424, -1008, 214, -937, 170, 635, 59, 958, -390, 72, -258, -1025, 734, -73, 232, 1190, -103, -126, 175, -1469, 18, 46, -228, 1246, 506, -79, 458, -698, -535, -410, -748, 484, 138, 672, 487, -782, 676, -805, -1196, 868, -673, 40, 1077, -254, 96, 83, -843, -240, -497, 26, 548, 107, 864, -154, -584, 429, -608, -477, 1062, -324, 560, 535, -316, 54, -421, -214, -38, -250, 762]
1378G62n37J64K64j298j00J011j093Q55O20o96O33r53Q5J62o81J333n49j25J209
1397A066j081m77Q99j223N16N22m56Q65m5l56J7q86P00m24m96K131j148m91R51
1416E84r70J82K78l78L27j30Q05m83m96J154j148o88J519r12j8J562p79k82M5
1435A72o79L6k04J171q4p70J368j045r32J970j235p64J637n27m83Q83J65m80q49
1454f50R49q16l64J911l96j391J945j414j028J520j11n47J015N5p57k78Q67n19
1472ij143J827p05j042K038n16p43J009q70r47N80O80K33n68J016k70j977J435
1490B8K21q15J201K47j828R63L41m38k37P99n96j255J633O22j782J759J31k531
1508a537J242Q57j348J473M57j299j041J324r9j454K299M54k588J643M98k108
$$ y = [762, 225, 389, 653, -645, -745, 266, -827, 28, 648, -48, 585, -368, -283, -121, -802, 531, -18, -143, 1066, -15, -492, 407, -816, -300, 222, -234, 631, 586, 230, 247, -639, 61, -363, -859, 1272, 124, -367, 584, -386, -204, 74, -304, 23, -107, 698, 215, -281, 873, -275, -963, 556, -356, -374, 1188, 409, 127, 172, -507, -471, -675, 496, 412, -358, 1010, -35, -967, 1003, -232, -996, 641, 114, -369, 514, 679, 199, -650, 299, -517, -881, 1030, 634, -757, 1188, -226, -1254, 266, 155, -392, 623, 678, -79, -357, 510, -9, -1152, 675, -30, -1072, 966, 450, -293, 716, -154, -1101, -521, 159, 392, -176, 840, 570, -1407, 28, 249, -566, 635, 882, -946, 17, 358, -80, -317, 482, -114, -1369, 264, 886, -896, 863, 994, -1537, -295, 562, -786, 687, 1144, -155, -1196, 128, 29, -1425, 874, 1328, -1260, 383, 881, -1227]
1524a227J632L76j684K54Q19l10k14J682o29j952J181J78j625K236Q04k459J075
1541A37L61j576O84J565o29j276Q71J90j415J489R82k390R69L97j719J258J493
1558A391r68o48K61m55r62J636J473k273Q97N93k788J235J728j233o8J045j268
1575d04n97J729M89j895O68O78k608J543K180j957M04R31k164m21J937m8o71Q02
1593E96m2k068J330J234k027J032J524k699K66J968j067J2R42j223j205J034J378
1610I85j171O96J073k536j92J565j163N03J493r23j350Q61K79p49R67R34j883
1627f11l58J688j028K8J944j488j165R11l09l11J434K87j406k04J209j563L39
1644f03K306j672q59J396j071m95J976l67j287L54N87j066P44J475j358q92J481
$$ y = [-1227, 405, 781, -903, -649, 170, -140, -354, 1328, 699, -1253, -72, 106, -1519, 717, 1521, -938, 137, 498, -1078, -394, 1171, 542, -734, 137, 327, -1088, 401, 1383, -1007, -38, 359, -1360, -102, 1391, 423, -225, 36, -419, -1381, 255, 1728, -545, 352, 945, -1843, -608, 1120, -113, -181, 864, -404, -1001, 728, 1217, -678, -10, 668, -1940, -397, 1783, -174, 230, 1161, -1003, -1424, 513, 465, -206, 596, 554, -1514, -184, 1050, -977, 55, 1579, -1120, -854, 1114, 47, 59, 1001, -222, -1427, -393, 985, -186, 510, 1583, -953, -1145, 420, -743, -240, 1253, 330, -1020, -159, 120, -629, 338, 1272, -611, -969, 719, -309, -281, 1663, 175, -990, -79, -388, -699, 735, 1022, -384, -588, 621, -942, -603, 1703, 31, -828, 568, -503, -998, 978, 611, -676, -322, 265, -801, -57, 1418, 60, -832, 649]
1661F49j233m37K130n12q90R18m89r42P56P11q45M7Q74j164j99J411l39j120J077
1680D03o14o16R06O62q20KP8m61o49J683j53r15J236m93j381J399Q9o86N47N1
1700B68p46j44J010l77m15P93m57o37J272k82p53Q68p8r79N30L22k14j83Q07m29
1720A76j000J162L8j038J022k12q75R21J74n08J06J55M9p54M79M24n84O75K8j563
1740a125J171J93o19O66%m35K13p4j82j31M15N0o59M26Q34j140M70L84j084P00
1760G3j76QM1L07J23m76R9N1o23O31J95q30Q00J95q10M86k25M3r0l1N34k39m08
1783c22R10q14K16J07q33J045j49j49K70j54J18k74m08M61j67P5N60p16J36L94
1803C06n86M88j37k31K92j38J06j54m7L12m67O6P22p27M28L2o44N48qk68J94j78
$$ y = [649, -584, -1021, 1109, 597, -293, 625, 136, -806, -50, 661, -184, -137, 737, -427, -626, 785, 446, -674, 403, -211, -827, 79, 741, -79, -77, 1, -460, -1109, 574, 421, -494, 742, 249, -1132, 267, 356, -330, 217, 268, -478, -622, 388, 11, -404, 389, -68, -705, 567, 285, -468, 400, 322, -657, -127, 195, -19, -202, 605, 176, -824, 338, 376, -662, 360, 148, -727, 194, 368, -140, -34, 121, 170, -584, -105, 319, -265, 410, 438, -1125, 46, 239, -380, 286, 286, -149, 64, -10, -192, -323, 92, 142, -517, -91, 743, -397, 73, 457, -627, 73, -103, -95, -54, 253, 376, -100, -1, 50, -573, 58, 253, -577, 223, 418, -392, 94, -131, -88, -178, -209, 325, 86, -322, 588, -226, -10, 97, -736, 309, 160, 11, 281, 127, 245, -29, -437, 24, -143, -68, 492, -224, -88, 306, -280, 208, 71, -160, 132, -6, 100, -54, -101, 211, -256, -190, 532, -195, 233, 265, -379, 169, 161, -107, 87, -91]
1825i1J79m9k66M54l73J18O13p92J08O24p07M22j97j74K17k41R1L14m51M04p3
1846A30l22N27o54L63J77l36J87j63l67O75m29L58J23l98M70l68M4N04n61K8K99
1867B87l72n8N9J7J0N0P1kk83L61Q5o25P10k86O6O3m72Q9P5P8L45n61N20j69m12
1892c54M41qm42O22p09M29L23l00l3K9j26K53m13M56Ml68N42l27m34O12l80n5
1914b38O50m56L9N5n1k4l25L82r3m92P50mo00Q83m08n46N55l73M89j53J52k36
1936d4l31N47j0n85P29Op19R52n88k33O94p98L47J4N7L41o14N19L8q37O82n3m04
1959b90M93j03l23L60j46p2k4K23K91p27K96L41p74N91J68o84N93l20k86O00k59
1980e2J26n9j84K49p07Q53K45p44M42n8o92J033m11n0o6J83j08j85M86N0q09L49
$$ y = [-91, 88, 39, -227, 227, -146, -28, 585, -207, -99, 525, -182, 240, 43, -131, 86, -155, -64, 250, -201, 203, 130, -192, 335, -319, 44, 221, -115, 72, -91, -458, 217, -212, 146, 269, -129, 341, -27, 17, 521, -40, -12, 287, -85, -143, -84, -67, -57, -7, 64, 62, -221, 140, 225, -400, 310, 24, 90, 153, -319, -230, -155, -77, 268, -293, 227, 58, -354, 87, 79, -363, 259, -450, -21, 302, 2, -31, -2, -128, 125, -288, 168, 172, -196, 346, 19, -415, 197, -183, -238, 412, -44, -5, 50, -1, -25, -350, 32, -61, -553, 197, 193, -407, 476, 68, -478, 77, -296, 193, 40, 192, -44, -375, 172, 162, -423, 306, 312, -407, 545, -43, -276, 418, -380, -33, -19, 38, 379, -235, 284, 322, -515, 167, 114, -290, 203, 100, -223, 137, -9, -81, -105, 118, 409, -318, -22, 319, -455, 136, 304, -380, 213, -107, -393, 207, -52, 74, 15, -169, 80, -627, 226, 471, -273, 169, 111, -581, 452, 41, -9, -75, 108, 0, -185, 301, 351, -458, -109]
2002a09K36q81J063J93q27N17j06o18P14m89O02k77j38N23r22M53O65q46N43j96
2022A00o54N64Q5K01m9l65L67n61L62O16r60N73L29j061K31P59q83M54%k50l01
2043d43K78N69n78K3R81j433L57Q28j151P57J77p63K81J16O3J99k43N18j161J20
2063e05Q90q55N73N81j351P07k8l33M75J21k53l30l3O65o90L82R13j403l8P35
2083B23r04R17J31m01K20m27J65m6kQ69r21l37J137r70N0Q42n36j34L28k14O8
2104E8j84N57n73j85R86j056m7J191r47M8N36o45K24J83p7P0k34L94m29j32R72
2125G10p56k29R48j155J89P90n66L40r4k57n8k51R02o16k75P37m73n4P63q53J75
2146h3L59o60L39q8L28Rl89N00n81l74Q45m8n82J003j029J92M36m28N08k55K62
$$ y = [-109, 127, -754, 309, 502, -325, 192, 86, -532, 182, -307, 295, 18, -120, 403, -519, -66, 599, -247, 296, 100, -554, 10, 95, 296, 247, -118, 249, -312, 50, 666, -294, 279, 608, -453, -222, 537, -346, 108, 108, -142, -443, -165, 404, -174, -151, 830, -603, -246, 582, -569, 188, 365, -398, -117, -1, 62, 261, 18, 536, -625, -505, 385, -470, 103, 684, -667, 40, 12, -321, 154, 275, 22, -308, -341, 324, -366, 16, 929, -474, -512, 223, -681, 236, 367, -34, 186, -241, -76, -122, -124, 745, -176, -513, 624, -346, -296, 546, 10, -124, 204, -10, 58, -126, 431, -142, -327, 659, -397, -444, 747, -200, -152, 384, -261, -37, 146, 69, 139, -95, 299, -130, -262, 710, -46, -275, 673, -482, -293, 497, -69, 271, 177, -80, -138, -389, 513, -103, -378, 359, -114, -168, 595, -258, -83, 276, -384, -45, -133, 195, 204, -185, 315, -266, -640, 205, 157, -425, 578, -451, -259, 177, -251, 257, 2, 264]
2167B64j68o62R13l11m00R47q69j92P44k17l21N24k79j01q7K45J70l91P08l77
2187A40q32J178m17n92J036o30O6K61m68N19K7k27J51p28P72j81o95J210o82k58
2207c50P54q00K73O12m18M55o46J52K58n67N80k35n67R80n82k71P83p90O71j37
2227A55n55O44n47M07K77p86P86j31p66R07j77l64N16l91N9O3l24O51q71K93O00
2248D46j166Q89Q5q62J086p36k03P71m20J86J19l46O29o33k5N54o51N20j64n82
2268e03Q90o05k47J021q82N53o6o71N53j55J61J18n99N48K30q29Q50m22j94M40
2288A91m54M69k19m37P26m98j50P05r17Q52p0l83N51m85K78J29o71Q47m94l77
2308d07Q83q89L77O28j174M01Q6l71R26r34L59M87n97L44J26o96R70p82K55L19
$$ y = [264, 96, -566, 347, 36, -364, 583, -286, -478, 266, 49, -272, 252, -27, -128, -215, 30, 200, -191, 517, 140, -692, 486, 69, -523, 513, -117, -51, 210, -258, 261, 288, 61, 212, -516, 256, 75, -620, 590, -92, -350, 404, -396, -123, 489, 71, 526, -120, 32, 290, -277, 303, 68, -499, 481, -101, -372, 411, -379, 292, 155, -400, 244, -303, 104, 381, -405, 381, 250, -516, 391, 214, -150, 366, -25, 34, 97, -227, 424, -447, -154, 446, -720, 169, 254, -608, 478, -258, -461, 310, -110, 76, 195, -151, 478, -155, -180, 374, -277, 243, 79, -503, 387, -218, -465, 556, -326, 227, 161, -510, 43, -112, 49, 167, -432, 116, 346, -483, 367, -55, -249, 191, -263, 206, -13, -450, 276, -222, -372, 333, -584, 268, 198, -185, 366, -119, 159, 288, -383, 464, -30, -407, 476, -413, -36, 592, -582, -181, -95, -466, 460, -474, -115, 372, -225, 119, 245, -451, 519, -263, -8, 311]
2328C11q72R91l18n92Q77o00K32N1n00R12m93n80J303q77J89M26r21P90l59m99
2348e29P81o50M75K20r78R18j53l54J021q26K09K17j015Q63k15k2M68q85M82L69
2368C96j076R91l64l74J198j039J75N76r26N42J15n72P02q36N84J05o59M62M6
2387D6k52P65j058P28M04j036P38k62k95O35p44L62L33o12N05k63l98P60q94O87
2407A49K24p84P73m25k22Q73q16J50M06r06P92j93m74R89o35n5L84n11N69l13
2427b5j54P24j043N36J85p60J059l53p09J234r25L06K34m11N40o44O9M11p55Q20
2447C39j43q60J276p35k35R89r53J74M12p29Q29m01r9M48p94L79J90o70Q77m45
2467a51j26N54l80O9L65o41P38k29k36L59p54Q96m31m81Q88l52o47R88p77N86
$$ y = [311, -561, 430, 112, -480, 397, -203, 29, 80, -420, 492, -1, -581, 722, -155, 34, 460, -461, 329, -30, -529, 252, -398, 77, 297, -681, 237, 84, -270, 751, -75, 134, 351, -664, 199, -16, -38, 430, -455, 27, 396, -680, 311, -53, -427, 771, -268, -93, 483, -443, 99, 214, -358, 344, -492, 92, 197, -462, 0, 46, -206, 559, -499, 229, 633, -403, 335, 73, -222, 413, -331, 31, 364, -248, 257, -6, -404, 356, -538, 149, 373, -411, 362, -63, -285, 588, -228, -78, 328, -578, 214, 21, -453, 536, -99, -154, 230, -281, 288, -25, -179, 545, -498, 38, 223, -537, 522, 169, -540, 694, -231, 75, 309, -102, 438, -206, -137, 274, -481, 339, 196, -664, 612, -123, -358, 631, -322, -148, 264, -465, 364, -37, -136, 312, -482, -103, 87, -583, 294, -151, -277, 277, -103, -34, 331, -310, 428, 199, -37, 322, -432, 464, 33, -448, 440, 88, -559, 429, -348, 238]
2487B38p3n32N32l54nP92j213R34k36l77P21o43J98M37o03K76J60n94Q66q21L53
2508E6K26q41Q99J3o23P14m18l08O89n34L87j60l83O52p26K61M93p88P21j58m99
2529c27P18n04j68O63m39J51Rl31M89o25M76N74j269M98R1m75Q31m07k69M76m09
2550b47L11l4k03L88m72J71M20q55Q68p5r13Q14k55l9N30n25K65o4l52N94o29
2571c02L20L02n99L28J7n81R82k48k68L45m25K52k0m68J123j134L08L80p58O73
2591B27j15n50P58j87j64O8j57L27j65j08K78o94L02O42p66O78k69n59L57j11
2611b08J55K56m48P05n11k67O54p65O36L09r66M50J66l33L93J1m30J96m06Q79
2631D76o13j83N04o17L60J87n79P44k8l29L81p61M75k5l65O94l96l41J118j211
$$ y = [238, 165, -367, 165, -189, -194, 598, -615, 319, 83, -294, 427, -216, -18, 419, -184, 92, 252, -342, 524, -297, 56, 282, -559, 340, 353, -270, 444, 26, -282, 407, -127, 260, 100, -283, 369, -357, -96, 397, -391, 330, 172, -327, 391, -113, -281, 382, -57, 94, 103, -228, 261, -364, 112, 686, -583, -85, 6, -469, 362, -45, -314, 162, -247, 64, 30, -173, 215, -257, -86, 334, -521, 347, 272, -641, 173, -82, -121, 409, -116, 149, 85, -267, 327, -302, 18, 320, -279, 49, 66, -515, 467, 219, -49, 296, -129, 123, 103, -365, 758, -376, -68, 312, -446, 227, 112, -438, 320, 133, -31, 37, -120, 207, 42, -66, 212, -482, -180, 462, -304, 374, 105, -454, -97, -208, -53, 203, -245, 460, -51, -318, 336, -429, 207, 516, -450, 0, 166, -167, 226, 237, -193, 3, -403, 476, -137, -320, 184, -433, -73, 114, -465, 279, 251, -78, 303, -458, 17, -8, -373, 321, -75, -416, 702, -509]
2651e09M60L26p46O69o1k58K15j76J52K22o54M40j81j33O02n52J85K67o43M60
2671H5n2j42J66j52O1K32m60P20p18J73O72j121M11N04p02O67n08K81j1k52M93
2692C47j77m47Q88n13l36Q27p72L44L30o22Q8J08PL04p03O05j15n80R25n60j03
2713a55P91p45j74K34p1K52Jk26K08m95O46k30k97L13j24o2N14o53L25K30m78
2734a96L69k82j61M46l74N09k90k25N72n49J44M58o37N28l68j52M41k67kL27o80
2755c89N36K8m48M42k43K2K34n04M28q3j35N70n57j03N27p83O12O7n54P11k12
2776A66j75K21l10M2kk99R14r51M89J15q01P71l53k36O90k43k32L78k29J13n0
2797A8k17N79n06J75J19l88O71n33q5M78m75J97N3m19K47M4L1K54n83L65J41n45
$$ y = [-509, -49, 277, -469, 200, 139, -119, 96, -80, 72, 294, -360, 80, -101, -234, 368, -184, 1, 268, -375, 85, 33, -109, 57, -95, -34, 198, -262, 458, -260, -87, 585, -536, -125, 379, -323, 344, -164, 117, 106, -146, 347, 170, -277, 611, 98, -238, 589, -183, 161, 491, -131, -43, 65, 72, 376, -327, 278, 163, -417, 508, -52, -155, 636, -109, -283, -49, -120, 132, 133, -93, 115, -380, 266, 36, -261, 52, -72, -134, 380, -273, 52, 282, -196, 173, -109, -270, 176, -198, 311, 21, -204, 368, -181, -37, 421, -216, 312, -56, -208, 233, -34, -36, 291, -389, 147, 175, -273, 169, -74, -52, 182, -322, 106, 23, -112, 458, -99, -202, 325, -458, 154, 221, -333, 378, 166, -9, 212, -98, -56, -58, -357, 557, -394, 95, 210, -591, 180, -173, -409, 281, 38, -194, 184, -45, 68, 18, -199, 380, -126, 49, 168, -220, 451, -82, -167, 311, -164, 33, 86, -333, -86, -42, -11, 243, -340, 25, 166, -379]
2819c79P53k51l22O09l99j14K21j90J38n6L8J63m90K64J02l26N11j45j48M38n91
2840a74K71J75k14M3J28m93K31j81J32L61m99L03J24n60N46r0j04K05l39N30l95
2861@m14P70m27KL32m20K06j20j45M68m03J03R2l03M52l26R9L21o12K69M09n49
2883a96K03K40m36K61k48M32o9l39K55j57o9N70m27pJ68m74L30K48m24L24m32
2904b47L53O9q8j1j34l8K51k43K70j28l66M25k41J42M0p1L1J12n0J66k87j01K06
2927F0k66K24L9j00J0J6l1L70n62K67J99k72M25l98o2J15l38P46l19l09J60N6
2949C0k05K76j01J73j33Oj57j68J89L83o14L23Rk65K59k37P6J90q6n8n8j4M05
2972B23k70j30M76l99J34J51l73L63k87K50J5n65O33l92J3L98m32K07J36j67j06
$$ y = [-379, 374, 123, -199, 410, 11, -103, 118, -72, 66, 10, 48, 211, -279, -15, 87, -239, 272, 127, -21, 417, -174, 97, 272, 58, 101, 229, -264, -33, -214, -82, 279, -220, 83, 207, -353, 193, 103, -1, 204, -135, 395, 0, -414, 356, -71, -69, 263, -157, 49, -71, -216, 252, -151, -48, 44, -259, 193, -133, -34, 287, -325, -56, 353, -196, 7, 247, -189, 72, -176, 256, 187, -152, 103, -54, -123, 447, 20, 13, 181, -293, 37, 285, -139, 185, -247, 106, 175, 87, 76, -58, -96, 155, -88, 182, 54, -312, 113, -128, 14, 54, -17, 14, 126, 76, 242, -45, -146, 60, -206, 18, 57, -43, -33, -17, -48, 322, -240, 27, 226, -46, 379, -19, -81, 34, -304, 442, 123, -186, -26, 30, -175, 101, 0, 173, 40, 46, -111, -279, -90, 293, -321, 2, 11, -254, 5, -232, -156, 34, -52, -110, -168, -182, 223, -47, -177, 299, -100, 34, 185, -188, 175, -112, 138, 153, -412, 221, -171, -158, 240, -192, 15, 151, -16, -122]
2993a22J15J63n2j30KQ4l54L68j92k6K30l03K15K01k75J00K42n09L71k10M8J73
3015A39m39M44l49N6K78j61j08M32n12P5Q1n6K15k77K15j52j47K83k03J06J48
3036F8o7p8Q7j24lK8J32J07l67K23K06l31K98k45l24N95l8j53J35l53M36m18J54
3059c2K44k85K03k6k72L89P7m88M67l76J76n8N4K3k3p1N4l30L66J05l48L75m00
3082a76j52K92K91l15j2m2K52j21J12j04k87M08J4l49R7J22k86L31Rn8k05J31
3104d8K65k38K37k79o3J52J36n33M52K97m90K76l4n7K03l50r4J4NJ56n33O02J81
3127B57l34K62J51l23Q0j04j69J75k60L65k79K89O1j55J23k11m04O53q1m2j3r9
3149e8K52j15q5j60l8J37J50N7p8K0k87M09M1l13J76n1r2J06k85K37k69K66K34
$$ y = [-122, -7, 156, 104, -26, -24, 60, -294, 74, -118, -144, 86, -217, -2, 199, -76, 24, 266, -243, 128, -82, -34, 139, -300, 144, -205, -149, 129, -32, -140, 292, -220, -145, -64, -120, 95, -182, 33, -119, -266, 17, -186, -80, 68, 1, -77, 10, -114, -117, -89, 43, 150, -217, 6, 212, -119, 179, -66, -390, 205, 167, 14, 149, -204, 232, -186, -32, 212, -73, 130, 104, -168, 221, 298, -190, 277, -99, 77, 19, 73, 96, 73, 2, 56, -274, 92, 197, -151, 224, -176, -328, -36, 255, -60, -72, -114, 138, 17, 129, 25, -262, 146, 160, -189, -92, 30, -256, 75, 84, 26, -179, -48, 217, -21, 216, -63, -126, 26, 162, -371, 81, 378, -112, 164, 130, 73, 276, -74, -168, -154, -149, 7, -526, 76, 257, -77, 185, 336, 13, 93, -11, -180, -5, -265, 100, -179, 110, 171, 16, 139, -72, -476, 177, 96, 54, 41, -58, 194, 79, -6, -166, -204, -67, 83, 140, 62, 82, -205, 204, 245, -68, 108, 57, -35, 71, -214, 23, -246, 20, 254]
3172B54m19J89J92n65L70R4l35L32j73J57k40m8L50j80p8K15m23N93n17J41Q1
3193a0NJj83K02O9Mj35K94k36k42N80m59Oj9lJ49O8j88K90l45K78r7k0J37k09
3218f3N9J19m7j67MQ7K78J8l10N6J60j05k1k60M08l72r1M31l18J90J41j87K6q4
3242d8m2K03l39J31k5j30L15R0j70O3j44K95n4J1k06nN6j25lK54k2j72N7mM1J38
3268A65k31J83L0k09J05j78l4K08q5o0J70m5K15l85J44L9q4J43Kn2j65p4K85p6
3292A1J4J31j03L7o6J73p4m8J29j93m6N1r0j83L29J55j43m0m3l1Q1r5k1K67j85
3317A7o2j59L35k46K43mK18p09L12K32j93j43n8K30K3l13L87l23L68j06j18P4
3339EJ92k32M6J71k21K10k06K58j70m7l6J14k52K79k62P5k3j10K40k4o0J9j41
$$ y = [254, -165, 24, 216, -349, 21, 115, -220, 112, -61, 96, -144, -192, 158, -22, -100, 115, -308, 285, -232, -91, -10, -5, -4, -187, 15, 84, 88, -47, 247, 11, -231, 349, -110, -104, -123, -126, 23, 91, -97, 193, -152, 126, 29, 9, 146, -63, -4, 115, 68, -99, -95, -8, 270, 288, -22, 34, 194, 89, 68, -192, 216, -156, -247, 184, -134, 56, 197, 10, 36, -48, -90, 113, -226, -95, -120, -250, 65, 155, -15, 48, -96, 199, 145, 156, -50, -55, 1, -124, -127, 127, 105, -67, -10, -14, 27, 165, -66, 117, 147, -62, 43, -135, -169, 39, -46, -106, 64, 19, 234, -151, -7, 32, -52, 91, 93, 41, -124, -198, 87, 11, 25, 156, 53, 90, 24, 197, 123, 75, 204, 11, -35, 16, -74, -257, 72, 227, 84, 44, 1, -30, 51, -44, -65, 202, 17, -45, -204, 131, -115, 128, 124, 342, -367, -55, 177, -16, -159, -217, 13, 36, -277, 110, -213, 155, 49, -69, 5, 197, -35, 11, 182, -39, 171, -35, 223, 53, 6, -30, 84, -168, 111, -151, -76, -99, -209, 31, 7, -53, -34, -175]
3362a75L79j84j52k2P0K49j36J5k55L17k76J74m9j09M4J68j29J48j26J27o7R8
3384A09j84J27p7J30L4m13N11j95Q5J29m36L70k16J30j42K37j29k66K3N03n19
3405a89N1J35k09n6J92J34J97k17k87K35j45J64J87l11J91j05J31k86N49j78j99
3426a6J15J3j82J09NK5J11l01J24J39l6j37L1Pk66P5R5M19m53M8K23j00m1o9O5
3451CL4J20J37k42J9j65J96j13Q1mk10J53j50J00m2K90j90j55J95k5j03K02k85
3474a54J53QJ01k52J39N6J76m06J13j38J83k8K67l98J10J6j50K41J41J04q9j72
3496B1j1k39J91K09k88R6J91P4k28j74K27j92L52k48q0j6L03j55j64Q2j62K97
3518H6l45K44m4J58r9j2J6J81j35k3K03k85K10o3k18J34J38j30J71k82O1O8n2
$$ y = [-175, 204, 20, -132, -154, -84, 165, 29, 44, -211, 106, -170, 4, -45, -154, -110, 58, -71, 77, -49, 78, 11, 109, -75, 52, -25, 105, 139, -274, 237, 42, 127, 256, -180, 190, -26, 104, -38, 199, 70, -196, -173, 330, -189, -138, -3, -212, -268, -76, 58, 255, 38, -249, -14, -159, 5, 192, -119, 72, -33, 98, -188, 361, 183, -16, 99, 112, -70, 39, 44, 69, 180, -121, 3, 142, 106, -31, 0, 7, -259, -184, -89, 330, -123, -75, 148, 48, 7, -62, 3, 37, 157, 294, 52, 71, -94, 102, -11, 70, 66, -144, 9, -141, -41, -83, 207, 17, -138, 57, 32, -71, 131, -154, -1, 7, 108, -144, -5, 51, 227, -179, -66, -204, -21, -49, 218, -180, -70, -54, -204, 37, 178, 282, 193, 21, 10, -229, -38, 171, -117, -21, 170, 244, 16, -158, 69, -123, 229, -19, -99, -115, 188, 33, -131, -49, -211, 86, -259, -15, -59, 99, 0, -12, 4, 185, 50, 27, 230, -55, 155, 92, -126, 8, 146, 16, 187, -95, -34, 34, -18]
3541a8Q9m2L6r7k7J0j2p6J06J7L4p3j86L57j74O0K04l51P3K44k24M5J12k44L26
3566A89l28M72n29J0K2j88M84j53R4k52K75N8k46j0k3J4r0J22n2l1L85j88j43
3589a08Q2Kj50L5J55J68q9p5j6j12LJ20j11Q4L00n09K52M4p7r1P6J46R0m76J56
3614a01J30k65K10k03J35kJ46j39J17o0O3j8K5j93JK32j14M3j66MK26J28m00L22
3638A21l56K25L1q8j59M14k55K06k64Q9O8j92K64o5k4R9j41J05L2r0nj61R9J0
3662c7J3O1j16M9p9J68j25l8nN1po1N6oK16m9rM9Qj57k08K8J52J98o4L1p3j07
3690f1J11k83L88l13R4J02n0J49k11R6k11M42j90j60q1J13J63j78q1J4L9K42J01
3713B35l15N38l23j02J13k64K95L2n9l14p2L22k4j74J86k08j36K75j2J04J94k11
$$ y = [-18, 71, 29, 65, -32, -59, -49, -61, -137, -31, -14, 20, -53, -239, 118, -56, 4, 208, -143, -70, 174, -50, -5, 107, -137, 189, -139, 333, -196, -186, -164, -352, 132, -21, 73, -179, 96, 154, -92, -102, -125, -111, -201, -79, -131, -162, 223, 35, -108, -26, -24, -174, -139, 16, 184, 95, 20, 4, -108, -105, 15, -96, -12, 288, -221, 31, 75, -2, -93, -17, 129, 219, -257, -101, 29, -236, -26, -229, -94, -96, 50, -89, 28, -32, 31, 13, 38, -155, -154, 78, -36, 7, -159, -155, 71, 199, -201, 121, -235, -10, 21, -67, -226, 188, -67, 139, -125, -36, 32, -160, 104, 39, 15, 114, -27, 78, 110, 20, 15, -146, -47, -37, -24, 37, -79, -30, -109, 59, -66, -104, -109, -58, -65, -126, -70, -76, 140, 91, 82, 131, 139, -18, -226, -198, -46, 152, 88, 119, 46, -61, 50, -233, 155, -158, -64, 38, -12, 137, -74, 22, -189, 253, 63, -97, -178, -65, 98, -80, -161, -147, -108, 134, 235, -80, 458, 135, 33, 146, -118, 177, 209, 150, -164, -236, 86, 62, -112, 74, -134, -270, 5, -7, 97, 291, 80]
3735H0k41J35QQ5j3N2j91M7NJ96k37N2k0P5pr8k1R9M9j30O0k27K45k88K46n7J71
3762G5J01j18k11K57Q9k63j11K41J9k18j33K94k07M6K30k60K53j81K09k69J70
3783A3j68J19j19M03j54p4J14k39J50J08j37qJ62J46n46L76Q5l70L82j56n4J3
3805D6j2j51p6J95J0k91R2J28O9j64K11j65l7L69n4j87N4j6r7k1O4k3K07j52j10
3830a11r5N19o15L52m5J54k49m0L42L0j94j32K42l19R8K51j65n4q8k2K84k72J15
3853a4K34j94J10K3j45k33K45Q5n5j20K62k77J53k27M61l80J95m42K25J26K9K54
3875C15k79j10K96K5j11J18k60J92j47L57n43K74K6j13K63l28q7Q4qJ52m4L3l68
3898b63K59p3o8K32k29P9j80L79l17M15k74J77l35K90ko0j6r3K94j87K77m76K49
$$ y = [80, -161, -26, -18, 67, 54, 106, -85, -38, -33, 163, -74, -22, -42, 33, 26, -72, -93, 6, 55, -75, -15, -242, 3, -285, -39, -96, 75, 176, 58, -153, 104, 193, -70, -181, 60, 79, -139, -272, 22, -185, -139, 91, -169, 84, -97, 112, -157, 13, -155, -36, -155, 248, 94, 20, 134, -105, 45, 153, 16, 8, 170, 316, -230, 146, 231, -139, 243, 87, 33, 46, 34, -117, -193, 2, 12, -279, -187, -59, 10, -154, 57, -108, -145, 224, 170, -17, 37, 21, -76, -97, -33, -56, 151, -1, -111, -206, 313, -302, 50, 5, 159, -90, -130, 212, 242, 48, -84, 158, -161, -63, 188, 23, -31, -119, -141, 143, -129, -14, 220, 26, 136, 159, 14, -219, 26, 111, 56, -64, 198, -79, 74, -153, 308, -72, 123, -319, -94, 32, 61, 315, 36, -74, 222, 247, 136, 254, -6, 186, 39, 396, -147, 127, 153, 40, 303, -25, -112, -28, -36, 116, 72, 105, -263, -4, -77, -145, 87, -142, -63, -243, 136, -181, 234, -40, 137, -198, 92, 90, 30, 14, -79, 215, 28, 305, -171, 78]
3921G8m4k51K86m3l84M73j41K59k82K0N1j94J57j14j3M6R1P8j60K02L00l03J97
3944C09l10kJ43k60j28K53n8L62j42m55M93k39R1o3O1K72k99J03m7l5j54ok56
3967c67L15J17o6J13n8j24J25j03l1k4L6j3j44J61j5r0J00o6R5J10PJ33j69k45
3991b03M01l04j06N7J98o1K73l66M4k5M7K72j84J15j32K7M3r2j86K90j30P6Q8
4014A42j51J9r1K75k91K3J13J6l3Q6Ok49K39k87K14k9r8J69j77K05k48J31L5L4
4038E3Lq1p9J57p7M4k43M09k31K04k42j02J02k12L33J2j25J10j95K75Ok12K70
4061A79J07m80J36J41P4K85l83J33k76J25j49nL13j02J21l06J53j31p3J40k30
4082b28J98k71L43J07k03K84k06J41N1k35K08k27M9L1J30j09j37q3K6J85M6j5
$$ y = [78, 34, -217, 69, 26, -358, 115, -26, 233, -49, -29, 22, -172, -15, -129, -142, -96, -5, 73, -87, 115, 415, 112, 309, -1, -3, 140, -120, -248, 5, -53, 309, 167, -288, 205, -34, 57, -6, 55, 327, 28, 131, 84, 49, -105, -111, -367, -52, 65, -1, 112, 54, -70, 55, -48, -79, -103, -67, -80, -224, -63, -78, -168, -68, -134, -39, 71, 78, 211, 42, -203, 198, -106, -212, -155, 43, -18, 255, -111, -67, -92, -45, 227, 43, 158, 26, 53, 96, 4, -182, 108, -22, 54, 142, -9, 10, -81, 194, -97, -74, 39, 55, 22, 108, 114, -135, 104, -183, 31, 2, -96, 73, -104, 101, -147, -16, 19, 53, 56, -25, -104, 53, -24, 20, -223, 186, -45, 159, -83, -185, -83, -295, 38, 50, -75, 35, -160, 115, 121, -91, 179, 286, -194, -58, 83, 157, 442, 59, 192, -84, 41, -108, -113, 200, 98, 219, -87, 66, -65, -138, 2, -228, -30, -301, 42, 149, -54, 230, 24, 165, 216, -19, 189, -38, 11, 42, 172, 63, -74, -157, -131, 54, 100, 85]
4104H5l8k74M4R3J50k13N4M3J0J8J02k24LJ43J19j15j36Q0J97o6j63mJ2K88k53
4129d5lJ64r6p4L4j13J75j76J11q5l2j2J74O8l8j47J11k6J74l1k12r2K29k2M0
4154G6K1l70L90r3J1L17m74j04J31P2M8K8k57J74N7N7q4j08K97l5j24Q1R8k57
4178d8K64k81J23n0j9M1K3J98k29l30M16l14K57P5j72M8J06l12K83k22K36k04
4200a11J84j03J13j06k00J08R1R5o7q1K09%P9j65j73K99k46l9J33l9R6j4j38K74
4224A99l33Q1l2L70k31q6j41J93j76L52m21K44nl01M97L5j14j37K2n5L49k74k0
4247A6j02J50j63K42j09K8n0k86M00j63K3J11J31q1R7k22l8n7P9J0R9Nr5j21p9
4272a75M9J25J78k19pK37m88J70j05P1K26l66K93j1O7J80r2q1j68J6P9q3J14q6
$$ y = [85, 47, -227, -183, -90, 60, -153, -99, -56, -46, -28, 74, -150, -147, -4, 115, 0, -136, -56, 141, 75, -88, -92, -80, 208, -45, -48, 116, 20, -54, -20, -133, 42, -134, -23, -108, -140, -152, 22, 90, 52, -95, 16, -10, 164, 133, -79, -171, 58, 36, 76, 97, -273, 117, 24, 35, 352, -122, -226, -95, -23, 25, 53, -204, -30, 27, 84, 0, -108, 189, 154, 30, 111, 209, -48, 216, -65, 58, 8, -11, 30, 53, 251, 22, -308, 108, -206, 51, 126, -46, 2, 108, -204, 79, -143, 93, -111, 73, -30, 83, -23, -223, -115, -24, 71, 4, -77, 132, 132, 211, 46, -127, 172, -74, -113, 20, -19, 77, 63, -75, 199, -134, -53, -85, 285, 54, -32, -173, 20, -156, 196, -225, 19, 14, -287, 210, 245, 131, -6, 16, -39, 310, 36, 16, -86, 64, -99, 143, 34, 62, 12, -274, 126, -37, -14, 97, 228, 147, 244, 22, -16, -73, 6, 16, 115, 120, 25, -96, -175, -126, -1, 177, -42, -49, 188, -300, -130, -235, -164, 62, -304, -11, -22, 45, 225, 133, 52, -116, -100, -21, -104, 10, -76]
4296g6J50Q0j55k19L13j47J30m2k66M60q4k74Q8K15k48J41k61L15r8j42J67j68
4318a21K05q2k16K51j25j56L57%k99J87J41j58m0o5L62j76N1j48j20K68p9J9J70
4341B26m06M38r5l90K49J53j04nm9j55K95O5k28J53k76N4L93l92O8L13k32l18
4363b43M41n39L09pM2j6J2K7J0M0k04K24q9k2M4l07R8K39n6j19L17j93M03l69
4387D2j45P2J6O4r5J5k7q4Q2J75m9M8j03k34K77M8j89L43k87J8J83j95k67N01
4411B09J6k58j29K80j21o4K8m1J9j04k1j0K02J60N4l34J39J77m29J06O1R5K58
4434B93k89P2j61k4j8j22J85J65m30P8L62j15l55L71J0j74J39l2L51m86J62n2
4456g0J5L12l12j87L06m9J33l1o7j16J59k57J96K4j13J28LJ30o3k28L6m6J69J37
$$ y = [-76, 74, 154, -1, -220, 93, -54, 76, 34, -232, 228, 144, -130, -42, 173, -75, 66, -195, 120, 22, -120, 47, -121, 84, 2, -214, 37, -88, -244, 113, 113, -186, 1, 142, -16, -56, -121, 241, 65, 116, -32, -152, 116, 37, 56, 226, -180, 258, 163, -227, 22, 175, 71, 66, 17, -138, 157, 222, -6, 147, -129, -75, 318, -74, -6, 307, 75, -243, 198, -341, -32, -39, 3, -13, -1, 26, 36, 76, -128, 96, 7, -15, 29, -278, -180, 59, 3, -116, 201, 8, 411, 42, -103, -31, -15, 49, -46, -31, -58, -142, -60, 115, 66, 114, 11, -223, 54, 102, -87, 256, -31, -13, 170, -25, -292, 209, 225, -33, -162, 118, -3, -67, -39, -80, -61, -165, -186, -196, 6, 166, 220, -114, 25, 202, -227, -121, -60, 35, 293, 4, 76, -85, -109, -127, -249, -64, 101, -329, -251, 111, -4, -359, 12, 22, -152, -13, -45, 306, -180, -18, -70, -55, 257, -55, -242, 64, 15, 148, 117, 50, -66, 93, -164, 32, 56, -57, 71, 74, 204, 141, -87, -51, -97, 72, 209]
4480B09l60Q1N9l04N70l51r5J92J12n4j5L5r1j2j28J89l00Q3J82j07J54L3l21
4503b39M41k35K88j62j96K85l37J97NPJ67m25L92j39mj3qj49Q4k13M89m5j99j25
4527a34n3K40k67K30L3k86j2l8L87M9no6l4J27m87L36p0P2N3l02J09J57k09L30
4551A60j0k6j34l02K50L13m58J27NJ97O9k70j54M74k70m3J77j43o2j02L44p5q4
4574a7j49J27j78K85j49r4K99mk35Q5p7o0K21m8k50j62M45J04l65L74k6j49K40
4597B17l30K49k24n9o5P5J21J23k57k1L67l54l6J79j0K7l5J44j79J19l6l0J46
4620A31j26p5pJ41M0l4k82L42p7q4K06l40j51K14K41J2j87O7K2N8J01l10L3L18
4644B53k45r7J79o5j23L60l68J86n9R7j59q1J61J25j71K22j56KJ0J64j67k69L49
$$ y = [209, -151, -70, -11, -315, 255, -96, -191, 1, 113, 59, 44, 79, -12, -24, -152, 37, -263, -180, 2, -105, 49, 82, -239, 202, -33, 255, 93, -103, 182, -155, 42, 47, 54, 221, -204, 188, 49, 45, 32, 24, -125, -41, -254, 235, 190, -9, -134, -187, 53, -214, 16, 49, -237, -249, -287, 100, 149, 144, 78, 44, 171, -316, 20, -50, 22, 75, -227, -118, 39, -170, 160, 150, 124, -10, -312, -62, 251, -207, -80, -75, 122, 191, -79, -233, 241, -29, -72, 105, -38, -100, -202, 142, 67, -17, -166, -39, -217, 68, -81, -175, 124, 120, -115, -30, -107, -167, 54, 6, -244, -406, 39, 143, -222, 152, 126, -23, 217, -113, 136, -88, -147, -212, -137, -16, 107, -150, -171, 196, -158, -194, -15, -25, 2, -33, 111, -68, 51, 15, -15, 131, 5, -70, -77, 64, 104, 70, -212, 130, 53, -31, 175, -165, -316, -102, 139, 151, -36, 31, 53, 111, 212, -98, -65, 253, 8, -89, 90, 25, -98, 262, -106, 80, 21, 118, -41, -122, 39, 164, -7, 215, 59, 61, 71, 235, 68, -201, 148]
4667A48j5q9j96K68q3m0k6P2J01k6j83J27lk44L7J71O7J94l59N4j02J09k6J01
4691E7p6K17l3J41m40qK05k34J87j55J37k04O9K83L11m42j46L61k46n9K50m19
4713b44L04j83J66n2j62L44l43K7L95n8j50k8j27O2J77k12j3n9P7J46j98O3k87
4736c55K92Q0o0p7J27%j46K26J59p8m17R4K56m10K27R9n9L46m33K08J69l69K89
4759A68q3m8l14j37M26k2J95P3j69j07L21j95J44k83L4L1q2n2P4J83j98K63k9
4782A93J40j55p7P5r2j52J05J11j37m9K08L8l48M8P3J05Pk59K46L3j1O1k29Rj52
4807b09K01j21J71n2J82o6k12P5J21o0n5J12k88K68q2K18k10n1L82k82N4m23K05
4830a22N68r1m03m1K72n11K48M6J8N4r4rj4J13r3N9K33j81k57M1J7K34j35K57
$$ y = [148, 133, 44, -152, 116, 33, -7, -33, 39, 140, 114, -69, 58, 55, -189, -152, 19, 86, 280, -79, -25, -127, -18, -44, 57, -19, 198, 165, 306, -134, -142, 63, -171, 16, -139, -2, -206, -137, 146, 457, 15, -131, 230, -16, -75, 175, -244, 60, -123, 43, -9, -171, 173, -170, -143, 252, 194, 44, 16, -111, -49, 128, -84, -97, -156, -79, 67, -131, -68, -355, -63, 17, -43, -120, 7, 7, -139, 87, 246, 168, -249, -155, 101, -309, -82, 17, -42, 304, -129, 79, 248, -121, 168, 85, 37, -277, -414, 12, -10, 185, 258, 89, -18, 303, 108, 252, -31, 3, 34, -48, -100, -26, 157, -41, 222, 193, 333, 178, 101, 176, 84, -68, 37, 148, 11, -38, 170, 208, -140, -92, -19, 86, 93, -166, 80, 113, 102, 163, -66, -57, -209, -8, -129, 42, -10, 172, 106, -106, -31, 90, 30, -25, 87, -201, 67, -15, 203, -7, -58, 324, 42, 96, -327, -122, 446, 355, -48, -89, 183, -328, -80, -34, -16, 38, -56, -65, -79, 34, -59, 0, 233, 52, -205, -164, -147, 87, -48, 209]
4854B09j56k45J66P0j72K3K09j93n2K63k24J53J53l03R9j98K05J7p6P8j34J75
4876F7j11J68j5J79j08j79K42k86j38o0L58o1m1k2J7J48k86J4L1Q6k67L81j61
4899d4q1L46p5k17O4j13L11l89RnK18J69j31k14L08k6k89J32R9N2J0k60K63k34
4923i7o5K65k52P2K74j99j66J18M41j15j81j1q1j8k5j05L30j29L7Lj75j29K49
4946D1k7m3k1k0mJ50o5Kr1L12l20J1nR6k41K20P4L4j50J7J35j77K33j31J5l46
4972c01L35J02j71j76J85N3J09j04k67L34j16O8J6q3k07L40K34n85K01J51k04
4993h6L25j36k53J86k38K7K47k67L67r4L9j8j78k08K66J01kj74rK9n7N32m28j3
5017d2J00l7M5r5K04j46J79o3k23j7J63k12J17QJ32j84J66o3j43L4n1K1J17j45
$$ y = [209, 53, -192, -26, 44, -128, -105, 104, -89, -141, 122, -102, 51, 204, -99, 0, -198, 7, 24, -52, 26, -108, 67, -44, 124, 109, 288, 180, 1, 243, -43, -181, -241, 117, 56, 15, -7, 10, 158, -128, -114, -83, 3, -264, 117, -44, -125, 221, 146, -71, -7, -120, 191, -198, -189, -194, 24, 193, 62, -152, 156, 130, -159, -27, 72, 124, 134, -126, 137, -97, -162, 103, -149, -77, 197, -2, -168, -50, 391, 276, 95, 84, 3, -15, -40, -145, 185, 56, 93, 96, -79, -208, 41, 14, -29, -50, -70, -74, 76, 11, 13, -78, 234, -86, -75, -80, 16, -225, -5, 69, 103, -47, -30, 105, -72, 161, 30, 45, -301, 34, 136, -35, -211, -26, 27, 136, 32, -235, 99, -17, 51, 67, -16, -223, 117, 351, -234, -33, 118, -86, 239, 103, -150, 36, -202, -175, 72, -195, 172, 78, 117, 99, -79, -287, -21, 80, 78, -96, -105, -76, -133, 399, -29, -42, 58, 21, 66, -29, 175, 29, 208, 145, -78, -95, 68, -144, -27, -19, 113, -71, 95, 32, -111, -77, -128, -107, 10, -135]
5041a35K02O7l9l35L40k36Q3R7Q4k63J16k29K25J19O8j83J5L32k58k4l15N74o17
5064c12L27J25j24J45k22n7Q3r5K09j39MJ3N9o7n7J09J50j18N1j24O0K47l68Q
5088i3N2m4L12l3Qk80j25L47j76O2J13l04J47l5K4J09P2k23Lk9m1L8J50j13R7
5113C8M3M8r7R5p3o3k05K99k97J68M6N2L5k14J3q8K72Q9r1j05j29N8L8K68q6p3
5139D1r6K2K14m56J93K46l06L25j37r4J2K47k50R9m0K7N5j13p8J59q4p2K19k20
5163h7J43j53J05j34K9R2j37K75J2q3n8j39J42j77K79Jk41P0n3J41j2Q8p9QP0
5188A02k43K79j05K5%J10Nn10N60n21M18j06q4N4j73K72k92k32L26J32J92k11
5210bn1J17J24l41P6r9L95j80k91L22j03J9J28j21Q9J96m25K78k68R9K90k85N9
$$ y = [-135, 67, 134, 95, -240, 100, -136, -53, 44, 128, -135, -19, -248, -23, 96, 164, -19, -4, 328, 70, 46, -269, 305, -312, 15, 140, 16, 161, -61, -118, -35, -130, 79, -60, -56, -43, 16, -51, -108, 1, 151, 33, 84, -40, 20, 267, -101, -93, -41, -85, 227, 194, 202, -78, -203, 144, -32, 30, 143, -161, -14, -49, -25, 84, 156, -67, -64, -93, -134, -96, 54, -59, 38, 81, 129, 32, 127, 54, -9, -214, 85, -212, -44, 2, 54, 89, -125, -112, -200, 72, 161, 70, -35, -164, -106, -68, 200, 114, 41, -55, -33, 181, -275, -82, 164, -142, 183, 46, -48, -36, 211, -39, 60, 20, 47, 102, -11, -89, 70, -14, -86, 133, -87, 56, -97, 8, -126, -97, -5, -142, 133, 145, 62, 4, -135, 7, -170, 109, 110, -131, -61, -114, 27, 15, 103, 24, 32, 102, -141, 138, 33, 58, 58, 168, 173, -337, 223, -298, 120, 14, -70, -16, -189, 83, -209, -441, -115, 17, 209, -2, -53, 64, 188, -153, -77, -176, 219, 39, -252, 70, -33, -14, 114, -7, 82, 278, -147, 131, -137, -38, 252, -33, 26]
5233B6j66R6L45k15J30k91l8J55j97j2J61j53J72k1q6K22j44J75j69l9m1R5q1
5256g6J75o1j10K02l61J35K20r8m7o5K92l41J6K86l44J74K94l67Q0j21M3N5p8
5279i7L09j06j57j0J1n3Q5P1Q0j20%R5j30k11K73K65l97j15K0L88k82J5k39K31
5303g4K1j30J87K52k24j07K1J09j56J06K60m53K12j91K82J30j17r9n7K63j45j97
5325a07J5L15j70m7K8n04M77J13r5j48j01J65Q9J03j74J25l8j56J53J14j39j74
5347a56Q9K03l0j44K01m8l20k1J66K44m50L93j59p9k1J55j51n2K22j05J64j4l66
5370b79J39M5J16Jk4L15m92J3O2QK83j42l30K32M8j84K24n6J25j26r4K57L9J03
5394B83k8j79o4k1m2N9Jqm6Qj83L9Q5K92j61K1O3n2j62J93N3k18J16N4K7k62J74
$$ y = [26, -140, -44, 301, 86, 216, -75, -113, 42, -155, -167, -6, -159, 13, -8, -94, 128, -16, 159, -10, -49, -90, 5, -76, 99, 38, -72, 130, -231, -96, 124, 26, -21, -86, 206, -135, -119, 167, -177, -3, 291, -76, 4, -117, -74, -19, -97, 212, 106, -51, -61, -50, -103, -18, 53, 133, 13, 13, 108, -22, -233, 40, 305, -92, -207, -187, 201, -81, -66, -305, -74, -53, -183, 4, 256, 32, -75, -54, 55, -101, 5, 265, -188, 24, -167, 115, 245, 128, 29, -28, 235, 90, -107, -92, 223, 53, 6, 34, -470, 7, 120, 25, -123, -224, -59, 30, 133, -41, 84, 46, -110, 43, 157, 18, -156, -67, 136, 106, -38, 163, 115, -205, -226, -60, 184, -266, 127, -32, -111, -132, 23, -128, -180, 42, -63, 101, 87, -279, -140, -95, 21, 22, -2, 313, -179, -166, -104, -96, 187, 45, -285, -53, -5, -189, 35, -21, 104, -22, -116, 141, 180, 283, 255, 76, 12, -9, -51, 8, 9, 1, -45, -37, -220, -181, -96, 196, 35, 56, 119, 67, -95, 98, 151, -67, 49, 103, 130, -132, 42]
5421D2k54K06m5P9k90M74j52j22j76J43K50k17j04L1K91j69l11K30J6L32m15K21
5443F0R6k6m40L69j35N8O7j8j34J82j8q0j9j66L88j73pQ4O1l40K9K96j82P8M5
5468G5o7r6j6M6O9J5l67L60j20J12j63K20j34j86K41j38N8L5O9j07J95j44%M9
5492Fr1j25M58j54l9r1m9O1M9k84L87L4j81j3l8J92l78R6J70j08J05lP3k11Q4
5517e0K04j9j23r8J89q4K03r4m92L83j41j87L46R2QJ64l23J12j46j13P9K24j42
5540hP5j11J9j37J22j50K02P3j10N6j98r4K83k07J57K31k15j08L23j38k70L58
5562A53m96L89q0N9j40J09j43R9K84k66j98K49k2j92J59K8k1J76m5k22J51l2l8
5585c9J5p1N1J3L2q0O7O2J13j27J42k61j96M43m22J59J69r6J12n9M2l38O4P9J29
$$ y = [42, -212, -6, -51, 28, -262, 212, 60, -62, -238, -95, 155, -62, -166, -135, 156, -13, -324, -94, -78, 254, -161, 60, 156, 130, -310, 59, -76, -18, 49, 31, -103, 79, 61, -19, -38, -204, 184, 11, 4, 88, 149, -191, -162, 134, -48, 30, 75, 8, -88, -104, -58, 11, 26, -341, 19, -101, 11, -152, 68, -66, -252, -11, -149, -91, -56, 13, -94, 101, -43, -43, 6, -85, -210, 248, 94, 55, -36, -85, -24, 25, -259, 128, 162, -19, -32, -70, 122, -256, -160, 10, -98, 7, 4, 77, -134, -50, 154, 135, 12, -86, 103, 19, 222, 128, -364, 19, -122, -309, 37, 129, 137, 301, -22, 90, -56, -169, -90, 134, -8, 67, -44, -25, -162, -40, -190, 12, 85, -25, 31, -167, -261, 22, -185, -28, 203, -12, -120, 203, 65, -205, 153, -343, 46, -34, 25, -115, -6, -149, -50, 234, -32, -230, 19, -3, -195, -36, -8, -29, 147, 102, -120, 31, -1, -39, -24, -95, -44, -31, 1, -79, -12, 50, 163, 36, 178, -83, -279, 164, -258, -99, 70, -26, 86, 27, 69, -269, -205, -126, 3]
5610CO2P3K7l40M5k6J09p3Q6j35J29J09j5k26K98o6q4K88l11J04j35J6l3K26k8
5635A03k22K62k57K64P9kk77p8J15r7K68j35j8l71K31n4L01n9m1K0k1p9K58m45
5659b55J67Q5j47L96k76j18K20q2m9L17k99J53j14q9L02l17n8p8R8n0j05M27P1
5682A99j84L27j31j51p5j62J77R4k75J42m0J4Jpj04K74l27N8K59p5Q5J05j64N8
5706I8p1O9k09J45r2j22K57N4k86P9N1R0L3K9j34l4J68q6R2p4j00q2J0J16J77
5731A78k77J49l0L6l60j11L48m7r1M69m42K50J38k51Kp3J60J39m32L61k54K00
5753F2k03J34q2K46j41k49M85j48o4l1k25L3J27J02j21J35oK77n07J87Jl1K15
5776A96k74J58j65K65j50j37N9rJ94Mj37k90L71k25L79m04K66qj96K44j57j60
$$ y = [3, 65, 138, 165, -175, -130, -156, -47, -120, -34, -169, -40, 69, 54, -172, 126, 60, -24, 264, -47, 57, -78, -62, -95, 131, 103, -119, 143, -114, 150, 229, 227, -50, -128, -13, -110, 158, 23, 5, -366, -135, -189, 112, 53, 12, 32, 11, -68, 190, -255, -88, -3, -150, 246, -30, -148, 72, -10, -59, 258, -41, 112, -2, -91, 211, -106, -164, -242, -144, -194, -299, 128, 199, 15, 342, 211, 60, -15, -177, 0, 94, -181, -39, -79, -65, -64, -71, -175, 99, -228, -170, 89, 14, 99, 204, 40, 98, 27, 96, -113, 32, -60, -182, 75, 129, -157, -78, -27, 63, 96, 125, -9, -43, 125, 39, 131, 57, -43, -125, -115, 1, 178, -99, 50, 20, 56, -304, -415, -67, -114, -205, 264, -178, 72, 210, -41, -39, -112, 48, 187, -245, 116, -138, 62, -141, -7, -89, 157, 16, -233, 252, 104, 40, 9, -216, -183, -56, 46, -75, 60, 54, 331, -176, 11, 12, -19, 196, -78, 80, -85, 180, 30, -107, -48, -57, 137, 141, 4, -286, 85, -140, 239, -165, 101, 93, -103, 141, -16, -176]
5798a76J55j1K37N5l06M9l9K34l8J33m38K04j70K94r2k36J49n0J76p2N8P7l1l03
5822a41J45l6J66qMj2j98K14k28k00K48L68m27Q4J47j9j14j63K86j35n2L5K56
5845B20k46j07r6K29j34K18km0Lk28P3J17J18j54K13op0j76k34L51K48j87k8o2
5869B0j32N6r5J69nJ91k92j45J84M3J44k59L39l85P6K9J99l25K11K13k23O6l73
5892b94M01l8j92JJ54L5n3o7J10k2J06n1k32J42k58K17K0J20R1k10j9K06m6j23
5916bK74m09K03r3p2J09k70K74q7O8o1n1J40J34j54P1j25K05j34k5K1L92k64j96
5940e2m5L39m96L83k86M3K25o2R4j26k31K76k57Q8L49k62J5J2J37j26o8j51L01
5963A00l73L27N3j91L23k01l46K60j53K91K66k17k76K30j97K60k55J94l4r6J5
$$ y = [-176, -21, -32, 205, 260, -46, 3, -36, 198, 160, 293, -145, 59, -111, 183, 91, -145, 4, -46, 130, 58, 116, 193, 162, -141, 4, -32, 134, 126, 130, 118, -80, 134, -94, -294, -46, 322, -105, -21, 126, 107, -7, -170, 116, -19, -71, -36, 220, -26, -133, -229, 0, -134, 84, 82, 42, 45, -183, -110, 7, 125, -29, 184, 178, 108, -68, -302, 49, 297, 110, 82, 20, -112, -56, -151, 18, 13, 204, -88, -233, -49, -6, 138, -121, 218, -167, -91, -62, 137, -188, 23, 236, 13, 79, -294, 107, 69, -123, -122, 32, 67, 14, -53, 57, 35, 141, 90, -142, 0, -258, -41, -21, 99, 190, -20, -39, 167, 121, -2, 272, -137, 66, -27, -99, 10, -260, 14, -73, -5, -66, -117, 23, 157, 3, 74, -51, 154, 20, -5, 16, 408, 144, -52, -97, 242, -254, 129, -157, -114, 111, 49, 143, 17, -214, 62, -195, -107, 242, -20, -5, 7, 144, 18, -50, -201, 100, -273, 54, 107, -84, 239, 38, -308, -48, -201, 90, 356, 139, -137, 93, -104, 156, -99, 95, 61, -35, -20]
5984b0J02o8J47m22K87k59K18N0Pk34K58m8m8J42K2j43j07j5oK83Q9k21J62j85
6008iJ1j20L78l24Q3j43J47j48K5K06j18l0P1j54J02k92L50K30m28K33j39N3K2
6031Fm0L9K01k89J27k69M21mk34n6JJ58q9k67L49o9j60J50j45J79J98P3k11J89
6055B58j51j34L38m36K30q3J14r5j87J06J22j16k15L36k61J90l9Q3mL9J42l35
6077i8J13K33l14j48P9K19k89M6M56l66J15j18N7J2J96k52j7J34%j48J26q8r1
6100a43q4N04k90K3Nj02N3m6J18K69k15r5l7n1K56m01K73K08j93k35K43K0K3j26
6124b3j93K31j47J70k07J32k0Q2r8J52M8k73N35n14J00R6N5k72q4K29j93K5K06
6147C7j10O8m0K03P4l85L48p4N7K7P4l37K83q8O6k00O9m7O2p5J89j02j6j33Rm3
$$ y = [-20, 82, 14, 161, -261, 26, -233, -15, 35, 42, -192, 66, 18, -30, 112, 134, -9, -116, -131, -137, 146, 235, 14, 176, -9, 2, -118, 260, -64, 19, -124, 23, -125, -100, 106, -12, -42, 29, -125, -23, -315, 35, 265, -163, 70, -69, -16, 6, -34, 5, 206, -83, 44, -225, 196, 192, -42, -98, -97, 61, -28, -295, 54, -15, -175, -25, -170, 9, 207, 280, 69, 258, 107, -27, 311, -125, 105, 22, 136, 41, -146, -40, 82, -34, -249, 87, -174, 16, -23, 60, 56, 95, 237, -98, 15, 248, -66, -214, -135, 84, -205, -159, 297, -69, 46, -72, -15, -3, 193, -59, -76, 58, 58, -90, 36, -52, -143, -227, 277, -13, 10, 15, -87, -34, -80, 38, 307, 92, -3, -40, -91, 165, -236, 37, 245, 52, -183, 60, 80, 103, -23, -216, 15, -132, 38, -169, -37, -57, 25, -73, 79, 127, -146, 389, -125, -25, 71, 126, -146, -230, -1, -194, -169, 37, -73, -5, -45, 158, 232, -153, 195, 121, 178, 205, 279, -58, 225, 137, 203, 3, 72, 25, 87, 12, 201, 99, 83, -50, -41, -84]
6173h4QM3k19k7L59k91J36j57K25J38j4m0j14Q2k35L6R5J8J47j27kp5j03K67L3
6198I9l06L23K7r9q2J23k25J79N4nl53L29N2l56L96k19L25m52M50j30p7R9j27
6221B5J07L5k12k21J72o3K57j2j71K69k39j44l7J72R7J85k11O3nm4j04p7N6j0
6245a12JK5J35J12q1k53M0J68K29j25k08J77j73q4K52L0N2j56q5K2P2o2R4l54
6269b84K28R7j18j67K58k2J79j64J46m53J33K74J1Rp8j6K5M0k48J01j64M42j20
6292A09j06j86K33J95j50N2l28j61K79N7R0q1j46K10L2k15m2K84j5j66R4o6m0
6315f7P9n4n6K15j57K62j50p2j58N0K44J7j91J65l02J99m3j00K97p2j07p6L81
6338C04l10j45J00p4l07K97K71j61j37J25Q9K9j2%m6M8P0j10J04l8K7Oj53j05
$$ y = [-84, -76, -33, -252, -279, 80, -211, -75, -232, -7, 131, 117, 77, -37, 45, -190, -154, -59, -41, 106, -21, -23, -98, -201, 66, 99, -207, 116, 143, 44, -38, 85, -140, 39, 93, 88, -265, 64, 116, -240, 156, -63, 262, -190, 260, 130, 53, 152, 25, 132, 167, -45, -266, -94, -157, 100, 88, -83, 186, -53, -197, -234, -62, 35, 220, 9, 72, 67, 23, -81, -158, -102, -112, -111, -86, 49, 161, 80, -173, -133, 35, 264, 139, -69, 108, -65, -149, 103, 133, 185, 29, -56, -34, 38, -24, 70, -284, -56, 41, -77, -244, 14, -8, 171, 7, 153, -300, -167, 107, 118, 127, 49, 33, 58, 98, -150, -49, -213, 229, 109, 3, -183, 50, 245, 95, 147, -181, -342, -63, -6, 84, 3, -143, 67, 99, -116, -158, 126, 111, -55, 39, -27, -67, 12, -42, -98, 117, -40, 222, 72, 0, -158, -108, 136, 153, -38, 127, -175, 24, -19, -119, 178, 106, -1, -77, 304, -6, -151, -51, -125, -432, -135, 136, -25, -162, -37, 52, 81, 69, 69, 23, 71, 141, 31, 135, 97, 124, 130, -23, -128]
6362a28j18n1M37j45n7j80M4P8N1j5J06l2%M4K1j17J12K8N1j87L31k09q9k00L14
6387H9k69J70J65J14l86J69j52Q5Oj28K73j74M1O1k91M03k66O1J15k58K55q1J63
6410A65l23J25j29O8P9n4J70j76J17O2k08NJ55O6j48r5L7M7k2J51j55K76l52L88
6434B49j83j51R0J82k69k11K52O3q3o2J67j79J15P4q0K21j80K91l93J70M5K1q
6457A41l52N4Q8J11p9J19R1Mk62L13k06K8j88o3J48P4r7qN2J7j4K55k50N0Q8m42
6483c28K85Q4O1J29j24Q5j85J3k04M48k27j65L4J2l7JK45j00j0K9K4k4K6l14J99
6508d3R2k5j5M6J14k55M21l56L2m2j06K83l9j53J83k56K88j14j23J23j15R3j05
6531g2j7L23O7m08%M9K77l32K72n0p4N7j57o5K46Nr2j00M0J62l15R0r9R2L12k50
$$ y = [-128, -246, -297, 140, -5, -62, -242, -198, -120, -69, -84, 22, -10, -10, 34, 55, -62, 50, 78, 129, -58, 273, 64, -25, -225, 89, -180, -10, 155, 269, -117, 52, -100, -15, -9, -137, 136, -38, 3, 64, -227, 176, -90, -29, 86, -172, 83, 2, 165, -158, -33, -162, -94, -15, -69, 101, -75, 42, 104, -104, -99, 56, 122, -26, -121, -84, -37, -59, 92, -63, 213, -139, 249, 66, -85, 5, 187, -82, -293, -41, 22, -61, -123, 44, -135, -20, 54, -26, 195, 15, 306, -87, 83, 128, 149, 141, -211, -157, -69, 42, -37, 82, 173, 177, -85, 228, 22, 50, -138, -201, -53, 21, -76, -84, -32, -15, -29, 226, -24, 26, 114, -328, -43, 41, 102, 231, 107, 192, 7, 20, -184, 264, 37, -128, -94, -82, -119, -118, 127, 27, 17, 46, 70, 46, 72, -242, -43, 49, 24, 9, 55, 169, -86, 335, -21, 11, -31, -137, 146, 107, -46, 137, -119, 169, 55, -68, 55, -60, 33, -72, -89, 234, 301, -107, -107, -58, 219, -113, 159, 109, 35, 92, -65, -130, 116, 121, 29, -71, -31, 131, -184, -94, -193, -101, 211, -39]
6557c9K16j09j03J45j63l2K1kN4o2j26K09J46j68j37K90k42K19k32K46k58M84
6579C57k71kNK9j69j6n3K32j14J7j60R5J02r6J18l08L47j44K39k59J10j35K01
6602A25j90j01J30o7J4K71r5k16L4J80R6n7j21J90l57J48o0J6k44J58K36q5j85
6625a80O0p5L28j81N4K8j29M04j42j85M5k6K60m30J49K9K7k41K89j13J9l3p1L73
6649B59l00P7n0k44L15Kq7M2j52L06Q5k73QK41k61R1L2m58J57K36j43K06j28j49
6673a88K32k8Mq5K7J49k6J29l26J73p%j96R8J92M6k13o1k0p9K40j23N0K06m19
6698b25J46M2M2J6k4R4j35j13K72l5j03K44l29P9m1J74O0kn9j96L69l95L32m61
6722b48L66J7P4j7k67K55j19k19K57j26L6J70k76m6K75j03j4k36m4O47l18k3m
$$ y = [-39, 177, 68, -35, 110, -53, -85, -64, -66, -12, -74, -200, 9, 155, -13, -150, 140, -102, 117, -115, 131, -127, 357, 86, 84, 89, 118, -51, -67, -120, 112, -2, 15, -145, -50, 52, -44, 74, -234, 113, -31, 208, -51, 59, -76, 125, -65, -166, -36, -103, -89, 182, 87, -129, -95, 85, 181, 124, 3, 193, -164, -16, -76, -60, -304, -146, 90, 5, -180, -120, -195, 133, -48, 6, 34, -95, 309, 167, -18, 27, 1, 261, -169, -20, 9, 36, -205, 84, -29, -10, -43, -114, 259, -41, 36, -14, -258, 57, 59, -28, 14, -138, 168, 253, -20, -12, 229, -32, 59, 91, -367, -210, 26, -117, 89, -39, -188, 44, 16, 20, -65, -38, 111, 85, 214, -112, 61, 54, 54, -142, -44, 148, 194, -19, -80, -100, -179, 61, -62, -12, 194, -225, -79, -37, 5, 21, -3, 91, -44, -157, 115, 80, -23, 221, -108, -29, -70, 104, 164, 162, 103, -93, 276, -119, 213, -248, 118, 135, 209, 192, -75, 180, 61, -158, 99, -27, 9, 179, -97, -143, 132, 29, 15, -221, -265, 382, 64, 41, 37]
6745C7j21R6l3n7O9qk15J07K06k57P1J74j9j39K62k5m5n7j28Q9n1J01qJ41m5p9
6771F6K7j79J41j53K56j96J99j06j42K65k65O4J50j13Lj36K57p2j44J14j17j99
6793b80k2L10J80k7k13M0Q2j47J22p0k1Q9R4j65k8J49l6lk8j6j38K06K49l44M2
6818B5q2J45J17M0l15l5J42j3K19p4j98M5j96P0J88j97J44R4r2J68k38J23k29
6841a49J48j86r4L28j68rK7N3p0J68l1k0j37P4k5m2n0K69q2J2L13l36R0J28m28
6866b17K38R6K51l75O5P7k39R5j81J76J54k11K60j32k22N4J08J84k32q4lL58k83
6889f3J3LM4Q9NJ32m26L55k08Q2J44j49p6J28j54J93l9m7j80J72l26N23r9p0N8
6914A04Qo9j74J49J2k5j21r2L57j91j5O8n8J70J8k76K7M11l59M9j77K04K26L1
$$ y = [37, -84, 12, -21, -78, -9, -17, -232, -125, 81, -176, -105, 69, 50, -89, 173, 148, 103, 46, -82, 7, -44, 57, 49, 190, 145, 66, 93, -86, 55, -98, 158, -38, 161, 55, -87, 178, -87, -23, 127, 14, 17, -119, 138, 66, -78, 36, -81, -280, -302, 8, 188, 161, -52, -12, 70, -77, 45, -25, -46, 43, 137, -28, -56, 93, 57, 54, 26, 10, -128, 78, 327, -17, 25, -57, 88, 205, 245, -70, -105, 37, 24, 243, 169, -29, 16, -180, -110, 78, -119, 25, 119, 27, 195, -43, 80, -149, -1, -187, -281, 47, -121, -130, -103, -50, -120, 48, 17, -3, -140, -66, -91, -133, -183, 86, 4, 16, 329, -7, 83, 211, -217, 21, 117, 368, -7, 58, 135, -104, -9, -190, -14, 140, -71, 189, 57, -165, -111, -3, 181, -51, -135, -138, 220, -63, -50, -47, -3, 86, 91, 223, -203, 152, -56, 26, 170, 21, -55, 73, -81, 112, 73, 26, -154, 18, -308, 215, 116, 46, 104, 112, 43, -131, 18, 30, 5, -116, -208, 149, -42, -57, 11, -47, 123, 141, -135, -108, 303, -56, -7, -184, 20, 246, 277]
6938B77m63j82N12j68J45q4J35k99j7P4R1j80J86nQ9j64J72m38K40P9m5j45P7
6961a13P5J26P3k27p5k4J24M6j9j42L36j20Ln6Q6k02M5J05j6p8r5K27j44K97k0
6986B12k47K89m36J69l6nK66m88J45j3J75J6l02L44j2J16n7r4K54l55Q4p0J01
7009E6N5J3j36R8j24K61j80k20J14K35k0m8J9j86n5j72L31n9K90j35N7j82J13
7032A25K3r6j47o7J77NJ1J18k31K7K4J26j17M0j22K14j97Q1J89J38k92j27J59
7055F1J1j24j87J21J2j9K4r7K76j13K2J03j10j12L26l43K10M2j98J75j22L36l08
7078a4J8j04J12J18j10j3m8J99o3l20P4K11j70J53k05J75j51O5N6J21j35MJ30
7101A03j68K95l19J61o3Q1j69K38J8l40L17j18kj85J9K44n2l5J57j33l14K90J06
$$ y = [277, -186, -368, 144, -24, 121, 37, 172, -127, -144, -70, 21, -159, 27, 22, 111, -53, 119, -319, -79, 0, -45, -190, -113, -38, 88, 161, -66, -141, -165, -41, 5, -14, -156, 180, 60, 63, 7, 93, -109, -64, 41, 25, -53, -148, 79, -65, 232, 212, -35, 254, -182, -13, -49, -54, 212, -276, -131, -144, 31, 47, -255, 89, 77, 193, 136, 42, 296, -59, 25, -45, 56, 111, 124, -12, 86, -38, 223, 43, -177, -63, 172, 152, 104, 123, -63, -118, -290, 41, -18, 272, 137, 194, 12, 125, 148, 52, -95, -162, 15, 20, 31, 149, -82, -55, -31, 95, -22, 18, -104, 110, -87, -6, 183, 321, 29, -98, 61, 72, -52, -239, -118, -106, -125, -101, -198, 78, -35, -13, 90, -20, -132, 194, -149, 61, 103, -95, 80, -42, 294, -14, 4, -100, 12, 130, 20, 7, -41, 158, 95, -225, -151, 60, -110, 43, -162, 13, -138, -73, -17, 104, -31, -27, 103, -65, 230, -89, 72, 9, 90, -79, 159, 177, -163, 154, 36, 34, -151, -132, 112, 60, 25, 182, 49, -265, 25, 131]
7124A31P0j98L39n69L00J4M2k72K01j67p0K26r1j67L72l07K73J4l3k32N5N6j06
7147a19L10k24n2J06k25OJ24n2L39l71J36K28l88K64p1q1k8k5kJ56J92j81m5q4
7171h7k1P6k21K02q1J31K1J7nj96J15ln0K02j76J55j69j8N1N3n5M0J60l90J34
7196a15J93j90k39J95L10k09J9o0m8M9K96q9q9J92j38L3M3k71q5J19K9J65j31
7219b1k34L27k3j87L08n3J25k86o0J77k3M1L8m5n2K35l94J88j32k7J76J02l49
7242a69J74N5K1k40J51J38Rk76M5P7J51K85l49j70L54l04q3J8J10j81L31k08j5
7265g6J77r0j46P2J40k71K24j91K39N0j65j38O1J22R6J33k88J90j13L28l04j20
7287g0J97j34N9j55K2j88J30O4K01j13N5j72rr0M08n8j19J61k85J5k9K40l2k77
$$ y = [131, 201, 3, 342, -227, 73, 87, 129, -143, 58, -109, -179, 47, -44, -211, 161, -146, 127, 141, 108, -124, -69, -13, -119, 191, -33, -85, 21, -204, -198, -74, -126, 213, -158, -22, 206, -182, 82, 11, -70, -98, -123, -125, 31, 223, 42, -3, -87, -108, -32, -253, -51, -132, -1, 20, 37, 32, -164, -49, -52, -102, 100, -76, 79, -90, -108, -57, -4, -59, -19, 141, -249, -115, 78, -112, -351, -156, 154, -55, -36, -96, -144, -95, 201, 112, 23, 215, 77, 110, 153, -118, -203, -84, -55, 110, -21, -255, 72, 49, -138, 170, 117, 242, -44, -104, 73, 50, 91, 129, 84, 32, 267, -127, 61, -71, -98, 78, 180, -169, 5, 60, 81, -159, -8, 130, 139, -137, -92, -15, 136, 421, 72, -98, 256, -48, -131, -113, -3, -184, 147, -61, -76, 101, 11, -135, -63, 77, -194, 30, -161, 78, 128, -37, -175, -114, 8, 104, 237, -51, 139, 26, 354, 50, -70, 127, -7, 52, -103, -81, -269, -139, -75, 126, 13, 68, -104, -113, -203, 205, 147, 28, 189, -96, -81, -110, 130, 98, -179]
7311a79J4L12k42J22MK0k21J6L00O3j41j21O1j12m7L34l8q7l0k69J64K00n3k79
7335b09J68J40j32J78l4J54o7j67j48K61k41K47m34K05J87j68K63j09k4p3q9J10
7357A8N9j4J7l26M96m12K12m3J83k29q4K10o7j43J26J9o2M9j71L93j75o2M3J92
7381B29j13k87o4K59J28L7p9j83J51k0l0j04P6P0j88j4K12n5j46P1K22j10m8M6
7405F0p0k38K14K4n0K08k66L95j40l7j0J6N2j52j11K58j0j28J10k3Lj65K42j77
7429EQ4k6m3n3l29N59k80j69J20M27m42K95l71J70k9K28j50N5m24O14m32J15k3
7452i9J79k88M63j98j35K01o7O6n3r0j54J03J19r8l6J58Q9k22j1O9j84K79j4j3
7476F4Q0O6l05K9M3P3j17O2j48Q5j11K41k43L84m8j72K57ok17j57J13J12m8j84
$$ y = [-179, -165, 147, -95, 27, 31, 51, -170, -154, 146, 209, 68, -53, 8, -104, -151, 183, 145, 58, 28, -241, -77, 123, 70, -209, -41, 99, -33, 145, 111, 265, 198, 31, -117, 144, -97, 150, -284, -79, 108, -60, 203, 94, 70, -3, -92, 18, 77, 63, 80, -246, 250, -162, 50, 7, 190, -39, -123, 87, 20, -123, 3, 22, -40, 9, -162, 231, 56, -6, 37, 229, 116, -171, -235, 24, 152, 189, 110, -73, 78, 58, 28, -76, 0, 70, -118, -132, 80, 25, -121, -50, 172, 62, 14, 60, -10, -248, -34, -10, -60, 148, -118, 277, 137, 100, 90, 106, 158, 6, -105, 153, 143, 15, 125, 102, 105, -60, 182, 5, 89, 63, 20, -33, -362, 197, -83, -252, -132, 295, -147, 148, -223, -53, -82, 146, -4, 51, -373, 241, -191, -76, -99, 80, -208, 255, 57, -78, 123, 56, 122, 69, -21, -175, -72, 47, -51, -87, 71, 160, -62, -73, -4, -188, 91, 77, 64, 144, 210, -95, -66, -23, 50, -67, -5, -153, -68, -179, 62, -181, 203, 155, -17, 240, 234, 17, -140, -27, 85, 37, -147]
7500a47K13mL1j83k1K28m19L63j28K0J87j95j19K54j2J4k5l07J06J4Q6j51J71
7523b4P2r4Q3J5K01l07k7R8J30k9J0k37J64j33J16o2J10J69q2k95K20r0o8P1J40
7548A51J52j65j79J12J41l50J68m0q2j7K22j88k3J03J11o0l8j75L79m51J60J34
7570F5j64Q6j69J7R7J89r3j0L5j69P9K09o7K51n50L9J49J12j44m5Rq5K13p5q2
7595a03K60k10J14Qj43r4l1L36j75M4M7P0J94l27j63L85o3l70J38N9R2l1k9J09
7619A17n1N4J11k84L0K69l1k99j43K52m4J04N6k59J66j0n2K3k62J44Q3j32K03
7642D5j44J48j24O0Q7r3J12j36J20K5j02j50J34pj34J08J86k93L75j96j56J78
7664D3Q1j66k0J71k4p9N2j08j6J43m6o8qL9m7KK19J30k76m3J02j4j11N8J1j14
$$ y = [-147, 66, 62, 93, -90, -111, 117, -302, 61, -67, -47, 140, -55, -174, 80, 68, 82, 57, -250, -144, -130, -44, -195, -24, 48, -46, 37, 52, 253, -54, -81, 17, 147, 118, 128, -109, 55, -78, 38, -24, 86, 255, 173, -122, 98, 8, -60, 11, 151, 303, 138, -41, 71, 212, -138, 30, -10, -92, -109, 113, -75, -98, 5, 116, 56, 18, -157, 222, -229, -69, 65, -99, -13, -182, -165, -68, 121, 28, 18, 53, -116, -37, 172, 105, 356, -194, -155, -6, 106, -38, -83, -74, -159, 54, -21, -103, 157, -53, 61, 69, -74, -168, -199, 137, -38, 6, 53, 123, 317, -10, -173, 212, 149, -221, -83, -24, 68, 37, 8, 117, 66, 120, 231, -53, -23, 246, 215, -84, -227, 25, -19, 85, 141, -118, 48, 38, -14, 9, -253, -109, -26, -158, 45, -99, 49, -75, -15, 72, -21, 91, -45, 75, 100, -2, -152, -18, -25, -159, -51, 135, -158, 217, 21, -135, 43, 124, -42, -62, 109, 85, 6, 58, -50, -66, 77, 31, -37, -45, -6, -53, -51, 168, 298, 22, -21, 81, 67, -44, 14, 25, -89]
7690h9j18J57J96k70Q4J89j72j28L74k68J66l07L56k69N0k49K5K90j16J8J36k74
7712b19K28R1p1o0K6j43K23l15L30j77J49j44J54j26J06r0J14p2k14K16j79n0
7734b23J66J67l26K49j6l5r3k6J13n3K30r2L0k45N26p07N69j43j12lr8K26r5K04
7758B13m03J74M7K5j32J47k26N1L11l89L00k84j3l7L42Q5o4k60L27l11j7J23p5
7781f6J20J68j91k11N87l39J85l44q1M15j54O0j20N0J4J13r1k83K23r8j52J09
7803h6L8j29L18K2k64J76J54j49K1m0j53J18O4M7q7j68p4J80k24M36k56n0j81
7826b87L25j47J27M9k09J70k52J1j6Q5J05k3J1K33l20O4j38J99J14p3r6r1R7j48
7850b10j59L15k7M1J69m15L05J22k36J49k87K10M1K2l14K40q6L91k77k53K79n2
$$ y = [-89, -207, -50, 146, -124, -40, 149, -23, -151, 223, -45, 121, -186, 170, -99, -49, -298, -273, 17, -99, -81, 55, -219, 9, 100, 29, -31, -5, -148, 75, -240, 90, -87, 62, -82, 72, -54, 52, -38, 76, 4, -210, 6, -173, -223, -57, 110, -216, 33, 17, -18, -111, -137, -24, -77, 153, 61, 91, -154, 372, -335, 234, 91, -21, -24, -122, 104, 9, 213, -190, -16, 31, 56, -76, 71, -155, -104, 207, -182, 118, -166, -179, -216, 126, 211, 147, -113, 214, -97, -114, 9, -66, 54, 222, 31, -180, 407, 68, 253, -91, -172, 243, 89, 149, 29, 79, 93, 206, 115, -168, 55, -43, -195, -86, -48, -177, 141, 163, -101, 75, 229, 80, 101, 61, -92, 26, 90, 137, 50, -118, -192, -12, -236, 200, -56, -106, -287, 38, -109, 18, 67, -142, 28, -224, -213, -229, -144, -39, -62, -51, 182, -138, -74, -212, -13, 101, 28, -68, -159, -62, -210, -369, -54, -81, -40, 129, -286, 19, 141, -95, 54, -233, -23, 18, 40, -274, -34, -120, 271, -6, -259, 20, -32]
7872c2j37J96m9O2R0j20%L13k49o7LJ25m9J32j06r4L5R6j9n3j32K00j41K4r4K68
7898B02o8j96J86k68K22j03q5J03J99l13J77j63K23J6j94j10J10R4j36p6L3L33
7920A86k76M1P8PJ64j25j55L62j9k43O5j91p8J18K44k13Q9Q5r1MN6j08J92k27
7944c5J13j61L9L3J29j21r6L44l63Q4J11J28k96P2l18N07k20L8K56j59J72m8n79
7967c70M37j95L82k49K0R0j74J72k08Q5q2K40Oq0l64K91n6j3J72l83J46R7j93
7990b29K14K4J91o0j34j61nJ23J00k62K46k31K64j71P0L7J43n6qP3k33K09k25
8013h1J59j38J33j54OK41p4j02q2J19L3l74L28PJ8j81N5K54l06J69j56o9M8K12
8037F5j97j64L39K9k5j09p2J06LM1j09J77n4P8J41l79J95j68J83L3j28j06j9J59
$$ y = [-32, -169, 27, -22, 40, 130, 10, 10, 323, 74, 7, 10, 135, 86, 218, 112, 18, 53, 149, 130, 77, -55, 145, 4, 28, -66, 202, 134, -62, 124, -144, 78, -25, -110, -7, 192, -121, 56, -107, 116, 132, -62, -172, -62, 32, -104, -180, -147, 186, -90, -49, 29, 36, 200, 75, -80, 282, 263, 20, 85, -106, -184, -66, 178, -35, 54, 139, 48, 52, 108, 0, 192, -35, 78, -83, -44, -11, 118, -3, -99, 245, -118, -34, 77, 205, -91, -19, -337, 170, -50, -12, 244, 85, 257, 209, -370, 67, -128, 254, 5, 25, 115, -59, 113, -95, -10, -92, 148, 154, 74, -290, 1, -55, -68, 104, -279, -133, -36, -229, -15, 9, 200, 140, 6, -155, -160, -37, 63, -199, 47, -184, 80, -91, -21, 16, 159, 103, 95, 168, -65, 144, -81, 78, -60, 73, -81, -75, 166, 92, -10, -92, 27, 60, -314, 14, 21, 39, -142, -87, 167, -139, 30, -126, -195, -147, 65, -132, -296, 43, 72, 47, -62, -134, -28, -25, 16, -93, 84, 30, 108, 249, -130, 65, -103, 80, 113, -15, -121, -140, 19]
8061A9p6rj30J78O2r4o2R1R3m21M06n3J67l65K48o9j18k4Q6P9j52Q2r1K53M9o5
8087H4l12L0K02r8J94mj71K11k91K16j1Jj49K06J08j57k7R3m19K38K2L6N7j02
8111d3m9k9K39j14O7j97J67j58R0p0n2L17l79K12J19k00L01j75n3J06j91Rr8K81
8135A00j13j97L05k10K39J47k80m1J04j21l7K23l25L45r6J5k58L0L02l62K29j42
8157a43K02j6n8O5j56lr6J18J06j90K16j01m8J2Kk34K04K84k90K89Kl15J37j36
8181a49J96r9J17K5m0n4j54L16j80Q7
$$ y = [19, -57, -66, -196, -18, 44, -50, -112, -21, 72, -349, 57, 4, 171, -194, 54, -15, -133, -157, -71, 8, -144, -62, -153, 100, 149, 84, -228, -198, 4, -94, 100, 96, -75, 136, -155, 61, 50, 51, -98, 108, 216, 59, 32, 125, -294, -56, -34, 2, 59, -43, -92, -121, 118, 4, 71, -126, 41, -117, -27, -97, -149, 168, -211, 1, 120, -80, 221, 46, -7, 99, -92, -83, -181, 100, -13, -210, 95, -115, 124, 271, -9, -50, 54, -67, -104, 119, -206, 139, 43, 58, -200, -170, 132, -230, -1, -143, 59, 43, -15, 50, -106, -109, -205, -87, 19, -171, 45, -56, -104, -92, -90, -324, -120, 164, -126, 163, 165, -150, -13, -149, 47, -52, 65, 90, 50, -4, -158, 158, -22, 65]
8191F5
$$ Imaginary data points
##PAGE= N=2
##DATA TABLE= (X++(I..I)), XYDATA
0@%%%%%%%%%%Mj2J6j6K4l2L8m6N6o7P5q8J07j31J54j78K07k38K74l16L59m08M64
33B46n23N90o66P46q34R32j040J158j283J423j577J743j924K122k341K581k841
50a488L129l448L801m195M636n137N705o359P122q025R114j0450J2143j4366J7412
65I594k1856K8949m1985P3362k79881l04259N66121j19766P788M04787o2973k27233
77C2648K9654j79565j57839J80764P3811j03387L04028J43497k87147K2462o4333
88e407l18561J82546J14822r6849L06362J61505k29080j23030q5249j30297j0028
99b33266J65983J70918Q8705J9896j52037j11132r96j26239M9792J11821o0197
110g6752K27491J27338k67735J7591R278k85494J9065K05086O4781J06298P2116
$$ y = [0, 0, 0, 0, 0, 0, 0, 0, 0, 0, 0, 4, -8, 8, -8, 16, -16, 22, -24, 32, -35, 40, -48, 59, -72, 82, -96, 111, -127, 147, -169, 190, -218, 246, -277, 313, -353, 393, -441, 491, -549, 609, -674, 749, -828, 915, -1009, 1113, -1228, 1353, -1488, 1641, -1807, 1994, -2201, 2435, -2702, 3003, -3356, 3766, -4259, 4855, -5595, 6548, -7818, 9594, -12262, 16687, -25298, 48064, -231817, -536076, 30045, -89721, -81933, 322854, 259881, 32648, 62302, -117263, -275102, -94338, -20527, -123914, 180114, 323611, 36464, 58926, -5407, -323968, -141422, -26600, -123449, 182913, 344418, 115338, -7692, -92941, -223238, -233266, -67283, 103635, 192340, 212236, 60199, -50933, -51929, -178168, -128376, -16555, -76752, 150739, 278077, 10342, 27933, 37211, -248283, -229218, -24132, 40649, 146947, 219063]
121B19063j35820j03114K784k08230m5053L67295Q484j12991K60847j30269k75816
132a52820J48282q5177j40720K50443O9798r9290J59778O8551k56393j00499P3133
143f4914j22010P6140K69453p0923J0811J03937k69010j02089J20014q6050N7122
154g7519J88306J079k1342P181r8945j23985K6436M4714l3389J16536J05359m3725
166I0706J7560r3801j36915L9569m2146L2160K04386J1000l5870Q502j26029p6063
178a06941K3353o843L5888J25448N5414p3540J1597j8929j75997K6351P8004o9816
190i6011J43633J07414j21429L4880r748j83461j361Q3002l029O9090J20221m2163
202A01038r9505K0360q3132r8322J34195L2829l0608J46107j5653j09381K5613
$$ y = [219063, 83243, -19871, -17087, -225317, -270370, 96925, 105409, -7582, 253265, 122996, -152820, -4538, -89715, -230435, 20008, 89806, -9484, 150294, 218845, -37548, -138047, -64914, -186924, -110784, 158669, 87746, 98557, 202494, -66516, -168605, -48591, -134641, -77519, 110787, 111866, 90524, 97705, -1240, -125225, -98789, -54075, -87464, 29072, 134431, 90706, 108266, 14465, -122450, -82881, -125027, -92867, 111519, 122519, 86649, 95151, -30878, -106941, -83588, -90431, -54543, 70905, 126319, 52779, 64376, 45447, -130550, -104199, -26195, -96011, 47622, 155036, 33607, 68487, 58739, -124722, -126083, -43081, -46110, 22980, 143201, 101038, 1533, 21893, -61239, -159561, -25366, 7463, -23145, 122962, 107309, -2072, 23541]
213B3541p6164p8796P4741N1860K3868O4223K7963p3745o7172j0478o2495J2888
225h9766J07509Q865M4544M6624j02305l9145j5121o9229N0445O1590J8477N9459
237H1947J252n2928m3931m0840k7006Q177P3831M3888Q470M5476o0036q4534J5465
250c0769n2037o35J07552R963J9150L9706o8326n4859j5305k4699P381N5546O1873
263E4541l04M669j810r5094k6944K4684l3584O6105P2050k2304K2992k1350p7905
276c4254j6709r886Q561M5806M8816K7891k3789j7463l6724o4787K0294J8774
288c3470Q700P7287Q908k1066J687o7616l3646J0466o85N0556L9911J2197K614
301E5843m0024k9326l5147j7753M1389J5255L9653M4738l9111j6076k7212n6440
$$ y = [23541, -52623, -131419, -56678, -4818, 19050, 83273, 111236, 37491, -29681, -40159, -102654, -89766, 17743, 26608, 71152, 117776, 15471, -23674, -38795, -108024, -57579, 4011, 22488, 81947, 83199, 30271, -13660, -54500, -81506, -73329, 502, 44390, 52860, 98336, 38300, -46234, -30769, -82806, -83441, 24111, 34074, 53224, 92930, 24604, -30255, -45560, -70259, -62878, -7332, 54541, 54237, 58906, 57096, -37998, -64942, -40258, -73842, -7737, 64313, 42009, 65001, 43651, -34254, -50963, -60849, -52288, -6482, 42334, 70225, 46436, 28973, -7751, -72538, -52244, -33470, -24770, 52517, 61425, 40359, 42046, -25570, -59216, -48750, -49435, 1121, 41032, 53229, 55843, 15819, -13507, -48654, -66407, -25018, -9763, 29890, 74628, 35517, 19441, -7771, -64211]
313f4211J8516J4187K1444N5463K039k122k0313n0734j4345j7158K0541M9688
325A2995J0547L2679n740m9895q661l6154j3495L8026J1853M2124K3239k5750
337C1768q232m4258l0466J3701J403M2967L0717l171J5464l8606l6690l680k5522
350e4605K6615L8264J3541L0388j9953k7620j6750m0288J3766J6992R437N2551
362D2338j293j3830k239n2296j4069P338K496M3370J7763Q256N13l8618r710k4366
376c4347j6424M1796P735K2884L3351l2928j2670k0715l6715J8732R256K0759
388G14L4768n141L445k3305l7463P71j4135J8335L8355J986K3049j0867l5546
401e034j454l0343K02L0512j922L5851J7243k8117n257k8247k1557Q923Q615L3011
$$ y = [-64211, -45695, -31508, -10064, 45399, 47438, 45316, 25003, -25731, -40076, -57234, -36693, 12995, 23542, 56221, 50481, 586, -8075, -44229, -57724, -19698, -7845, 34279, 57518, 31768, 23536, -20722, -51188, -37487, -36084, 6883, 37600, 34429, 49893, 11287, -25403, -29083, -54605, -27990, 10274, 23815, 54203, 34250, 6630, -10120, -50408, -36642, -19650, -10213, 42338, 41045, 27215, 24976, -27320, -41389, -34051, -31555, 11815, 29578, 37834, 38347, -271, -9981, -34347, -50771, -8975, -1240, 21644, 54995, 22067, 9397, -11318, -48033, -29301, -20045, 714, 35482, 30341, 33786, 10481, -26982, -26211, -40346, -22011, 16344, 18330, 41379, 30512, -5034, -6488, -36831, -36629, -6117, -8039, 27812, 45055, 16938, 11681, -16566, -38123, -29200, -20585, 12426]
415A2426J3253N046L361m3242o717r02l1514M0056K6460j0138L1547j3562l2974
428f900j819j7961m919J3694K6944K0492j1472J2958j6636m9980J4330l093m748
441b9110N3861K022r700J2262l0220k0747m493L390J7776M792K3633P082k2560
454G988N162k4951k5585K2411l94J5109K8759l111J653k6515k6985P394j1448
467c0513J8636L3650o021J1189o701l2001l243l256J775N900J2622K6028j3772
480A4293l030Q560m3775j693J7582k1333L4703L3724k1515l132q152k6374j3501
493c3643J4521K4314k013J9518J0340m2069O669O109l8522K1886J9797j4968K2388
506A4327J0863j2840q586j1943j2035j2305K4096K7924r596J7485K12m5760k194
$$ y = [12426, 25679, 30725, 34086, -9156, -15873, -16775, -48289, -8233, 18227, 8089, 39636, 26074, -6900, -8719, -26680, -31599, -17905, 9039, 29531, 18059, 31017, 14381, -35599, -21269, -24362, -29110, 24751, 26773, 17073, 29335, -885, -21632, -26125, -22735, -4959, -167, 23466, 30548, 7988, 13150, -11801, -37386, -14975, -15369, -260, 28499, 25388, 27041, 526, -26459, -19065, -30513, -11877, 21773, 15752, 26941, 20240, -11761, -15004, -18260, -16485, -10585, 2037, 28065, 14293, 11263, 19823, -23952, -25645, -8063, -29396, 5307, 39031, 17516, 14384, 6232, -20142, -33643, -19122, 5192, 3179, 22697, 33037, -9032, -2363, 3746, -34776, -12890, 6907, -8061, 14327, 25190, 12350, 3764, -8179, -20214, -32519, -8423, 19501, 9905, 27390, 27602, -18158, -20352]
519b0352L367m634K5673J0421K392k831j1828P86j7361l151J7935j4728J0452
532c859K7189r612N14n045k3406j0138J874J9940J0248J0045J8568l3264k1775
545a8721J5251k2269P629L5828j1262O28J1293j5466j0708K681K955j6811M498
558a4474L0706j0928M622K2509l7954j6051J2985j7858J7239L2326k253p629p791
571E449r842j7781K794K5318p514L984K0482k2660j800J3710k2284m040O832j196
585h548Q744J0745J3858j2027k1378L446j8035j349L5895R76k90Q746k0244j4150
599a3611N80N571M271L18J5886n452j0926J9515j4632j7504J6170j3765k362K7411
613A1470L597j815k299j0861j6637q169K2600M898k65K4371j7380k1006J3963
$$ y = [-20352, -16985, -21619, 4054, 14475, 16867, 14036, 2208, 2994, -14367, -17518, 417, -14311, -3859, 23330, 13718, 14232, 9187, -14219, -24357, -22483, -2543, 7705, 17750, 36318, 3054, -18721, -3470, -25739, -18110, 17718, 6456, 7084, 18377, 2911, -7797, -5116, -2161, -18972, -14474, 16232, 5304, 9926, 32435, -5519, -21570, -8585, -26443, -9204, 23122, 20869, 13240, 5449, -4393, -22174, -19380, 5938, -1576, 2408, 22890, 230, -1570, 12140, -10144, -14184, -7352, -8548, 196, 10941, 24799, 12772, -8606, -5160, -23195, -24544, 11351, 12327, 12037, 20783, 539, -13611, -13031, -7460, -3189, -2871, 13015, 7563, -3363, 16152, 1520, -15984, 186, -13579, -15941, 11470, 15067, 13252, 10953, 92, -16545, -24714, -2114, 2784, 2519, 26890, 9510, -11496, 2467]
626B467j3031m307J7776j780N26M530L306k843j1397M806j0255j0718K4580K475
640F135m86J7355j7232j6775R49m518O962J0015J1069R99j5601N439o485j5261
654a7435J7353r65p310J8042j367m351L037o445o804q732P560R054k219J7899
668A7317j403k1857O105r823r397K0427L260M03N928n242n046q165L428R41q930
683a2054J5723M297q512J4012p665j4339N094o892J699J0111M481P066p218m252
697A551k775j4223R353O197k998J3925k511q348L237p638j772k55L57R898k616
712A382N144O492j6112K46n28j0835J1949O380p91O931n069l790o602l639O191
727b651m122Q708R253j0648N927j720j4652O606k58l530J0049J434K631r96n932
$$ y = [2467, -10564, -14871, 2905, 1125, 1651, 6181, 9487, 6644, -4753, 53, -10202, -20920, 3660, 6135, 5649, 23004, 5772, -11003, -10054, -14572, -7610, 2405, 13474, 14473, -1128, 4311, -2174, -17435, -82, -1047, -8357, 9685, 8318, 3967, 7004, 559, -6245, -14977, -7417, 1637, -582, 17317, 15914, -5943, 162, -9661, -19058, 1369, 4629, 5032, 10960, 5718, 672, -7493, -4065, -3124, -12054, 3669, 7966, -546, 13466, 5801, -8538, -3444, -10336, -8637, 1474, 5955, 13021, 5803, 1551, -1224, -15447, -6094, 103, -2895, 11030, 8519, 171, 3408, -4230, -6002, -6257, -5900, 3998, 1382, 6526, 13018, -3094, -2848, -3376, -14211, -2262, 4118, 3327, 10258, 5189, 1399, -5203, -8842, -2651, -6773, 1935, 11188, 540, 6467, 4747, -9905, -3299, -3557, -7087, 2962, 4396, 7027, 6031, 99]
742I9j276q736K852P764l567J1126J454j0471M231p349m657O131k729P114N072
757G058l315K988p435l996J870n860P074N206j614O686n377l581k28q866N288
772d102K936k39J0444m042l769K773j0171K53K821j331P730R16N27J007p753K32
788a768m022k046J0604k657K336O988r025q5j106p577N544Q67K214O297k790Q38
804D612m788n512M075m342L842O932l954N543j586q358K789m780o77P324j041
819G9N060O40n491J456n729j347L661k219O986J902k524K837p376k532K722m748
835f623O732L678k697N222m349l401N28n500L310L112K86N556k699j435l11o980
851e571L051Q5q69P847j745j97K618p854l92J08j918O300l89K179K349o095J018
$$ y = [99, -1177, -9913, -7061, 703, -2864, 8262, 9716, -755, 3476, -3873, -8530, -2399, -5128, 1986, 7058, 3743, 6731, -704, -4700, -2830, -8690, -1616, 3590, 1976, 8662, 3285, -296, -524, -9390, -4102, -1166, -1405, 9039, 4997, 1228, 4001, -6170, -5917, -3096, -4427, 3303, 4219, 4746, 5753, -2000, -1768, -5790, -7836, 2768, 111, 2447, 9435, 410, 325, -781, -8358, -2814, -1947, 267, 6564, 3774, 4612, -176, -5688, -1613, -5955, -2113, 4819, 865, 6408, 4822, -3536, -747, -5527, -6204, 1120, 79, 5139, 5779, 288, 1744, -3985, -5332, -1671, -3890, 3096, 4998, 2474, 5311, -2065, -4597, -1875, -6623, 109, 3787, 1090, 6312, 1963, -1438, -910, -6410, -3100, 12, 298, 5854, 3155, 1720, 1409, -5571, -2520, -2435, -3304, 4543, 2798, 2601, 5219, -2635, -3027, -2919, -4837, 1463, 1074, 3253, 5602, -493, 525]
868E25k598m029N869j776K811N273m785R30j887m808K439j574K724M237k348L999
884E002k555n870K890l835M68N977j392K839J49l877O08m044P58J821j689O611
900C861n31l107M093n865l018L740l058L498L459q60J739l270j783j033l321N402
916e4N39p03O249m722j883J993n043J024J679r70N077j344O69O23o067J488p45
933b190k417O489K52P1J695l664j206k337J35L868k454M002K367o793M099l77
949A540o664M462Q1k234M864J177r97j875j15j932m416O023K677m573P299j184
965D133q760N253j713m040O484N21j900J540R81j814l215L356j552m787P309L70
981B166l371P017m071n257K152j794J513K964J219J423m191m47P00m405M277J572
$$ y = [525, -2073, -6102, -233, -2009, 802, 6075, 1290, 2220, 333, -4475, -2036, -3610, -886, 3351, 1003, 5002, 2447, -3423, -533, -4368, -3900, 2077, 685, 3524, 3673, -204, 404, -3640, -2882, -1061, -2750, 3861, 3330, 223, 4316, -1549, -4567, -827, -3885, -387, 3072, 2212, 3951, 681, -1102, -2135, -5456, -54, 485, -218, 6031, 1309, -574, 1419, -3624, -2600, -921, -1891, 3186, 1842, 2511, 3134, -2933, -1445, -2190, -4607, 1882, 2134, 2205, 3900, 236, -970, -3307, -3172, 696, -1758, 2244, 4611, -2182, 1917, 1540, -5124, -662, -581, -2815, 2049, 3226, 2229, 354, 239, -1693, -6109, -86, 2591, -1982, 5317, 4133, -4627, 626, -1087, -5127, 1357, 1878, -22, 1518, 2499, 685, -2530, 826, -726, -5513, 1796, 2166, -1205, 5812, 1741, -3516, -1364, -3158, -1645, 1319, 2538, 3961, -230, -677, 23, -4382, -105, 1467]
997A467k987L167j94j197M32j062J228m414l5O097l951L645M823r183l56K585
1013F5n203L335N890j066l122J654q62n940M420N164q732M620N393j0010N188
1028G94N350r434R73L757n503J557O790j56m866K721j303q824O803N103o045N984
1044C701J072r132L455J914l063K034R09j157j600K629K596l762P96J53n882L351
1060a986L495l31K311j582j871k648j998N529o82k19N469n986l148N668l184q94
1076b057M358j946l492K543M468m052j49M862r060j779J0252n398N91R221q750
1091c88m660O631l663j731O616J465o324J643L829p365K363O990r115P48O809
1106C848o599K268O023n494k094J035r33p35M003L608m314r86J234m997J829M870
$$ y = [1467, -1520, 1647, 1453, 256, 688, -374, 854, -3560, -3595, 2502, -1449, 2196, 7019, -2164, -2520, 65, -5138, -1803, 4087, 3021, -101, 1553, 691, -5249, -829, 4335, -4397, 223, 5616, -4394, 794, 6144, -3290, -2317, 1440, -4063, -2506, 4284, 4128, -738, 1983, 680, -8144, -1341, 3762, -2283, 3701, 4773, -4359, -904, 1010, -2053, -19, 890, -267, -1867, 762, 3358, -404, 392, 545, -5337, -1986, 1509, 1178, 3489, 1907, 36, -2612, -4610, 919, 237, 18, 5487, -499, -3647, 2021, -1163, -2057, 2301, 355, -3137, -594, 3874, -178, -327, 4535, -4525, -6304, 3948, -1450, -859, 8362, -388, -5048, 1583, -2080, -3811, 2805, 4270, -2054, -411, 3418, -3947, -1584, 5406, -3709, -2961, 3848, -2751, -483, 5540, 46, -2048, -1013, -1946, -2681, 1322, 4930, 616, -370, 864, -4133, -2304, 2566]
1122B566l167J786N26k554N69m01J532l1l641L080Jk296N627q21m306J319j247
1139a458j661K274M302r49l685L496k995n175Q329q17m924P089k306n462N745
1154A803L84m748K151J937m099K26O843l413l207O107n689m055Q439k470j923
1169a714O400l311m106K684o4j432J116K291k175j178L914k558j211L636l735
1184a443q36L422j567J653P49j692k12k265J023J641j422K596J89k652Q79m54
1200c91p38O47L72J152k157J221K377m321K122J784n640K828K672l354K801J339
1216B714l386j039J777q46j365L670Q47m263L285J80n166M376M60m320M208J58
1232A290k589K440Q1j689r28J377k28j325L194J18k656K464k177j916L352j427
$$ y = [2566, -601, 1185, 1711, -843, -274, -675, 857, 826, -2815, 265, 266, -2030, 3597, 2776, -1530, -211, -1458, -3119, -845, 3457, 2508, -1177, 2319, -676, -5851, 2478, 1661, -3263, 3826, 1520, -3942, 1803, 2187, -2561, -410, 1527, -2572, -2346, 4497, 1084, -2123, 3984, -1705, -5760, 2679, 209, -1714, 4686, 1375, -2731, -47, -111, -1543, -427, 1864, -311, -1489, 2425, -133, -1344, 2292, -1443, -2279, 1143, -424, 1229, 1978, 286, 74, -2191, -1168, 473, -949, 1647, 1836, -816, 63, -391, -1129, -482, -110, 1042, -1115, 106, 2483, -1838, 284, 2068, -3572, -744, 1928, -1426, 1375, 2714, -672, -1711, 66, -780, -2145, 1525, 2372, -1891, 1394, 1574, -3592, 784, 1244, -3076, 1132, 1290, -1299, 1141, 1222, -467, -1395, -18, -246, -1571, 1623, 1741, -915, 1549, -628, -2544, 808, -619]
1248f19Q7K165j344j5j38q58P92r13M89Q62q60J326k77j033P51j847J094K35q72
1267i75K486p03j788K630k681m26K303j509L63J750j593J102k708R84p03n19L247
1284A260k511R26K443k825L94J583l328J232J523j193J360J90q12k94m14O10j133
1301i89O88J327j629J198P02k630J451l93j153J946m36n7J011j041J55k22n54
1318f26P35p96J313K70q26J033j236p67J076j228P09J380j609J809o77j376J153
1335C37j013K97O30p2L07k78k46O84j629J017J8q20J710m04n53J124j567m04R82
1354A20j154J005M90m86P24p33K58k22j176J429n16k45J850j197m55J066j611
1371h53N36L56k73O50k42K35p7j121Q15m61j73J399o00k4O82q93O6j58m03N95
$$ y = [-619, -532, 1633, 289, 274, 136, -722, 70, -843, -354, 508, -352, 974, 697, -336, 415, -1432, -338, -103, -975, 1511, 808, -980, 1650, -1031, -1457, 846, -663, -300, 1450, -143, 959, -1749, -765, -1468, -1987, 1260, -1251, -325, 2118, -707, -313, 1270, -2058, -826, 697, -496, 864, 1054, 242, -52, -466, 144, -989, -301, 1026, -603, 595, 1297, -1333, 118, -275, -1428, 518, 82, 25, 1036, -5, 150, -72, -626, 109, -687, 626, 896, 70, 1103, -133, -900, 176, -1052, -343, 1037, -572, 1237, 560, -816, 337, -676, -379, 251, 179, 486, 208, -38, 646, -983, 34, 52, -768, 942, 538, -15, 1109, -458, -862, 120, -1034, -29, 461, -25, 699, -34, 224, 2, -1174, 255, -261, -506, 1344, 147, -308, 758, -853, -317, 39, -234, 416, 174, 409, 332, -789, 26, -435, -608, 791, 191, 167, 849, -44, 22, -136, -539, 56]
1391E6o16Q80K68o29P04n42r57J383r41m7J254q50P21n18k15j02q11J182J04q30
1411e06J403n32j211J378r18n51J150m19L46R4j42L01j033Q08J5j594J666K64
1429E19o73J056o01p13L29n03N87r4N96M00j530J034K20j857J487K20j456J623
1447F44j05j148J013j09p81k90Q75J61q22J452L49k216J398m75j501K071K25j022
1465b81P01l00l77l89J027p0j174J431nj659J866K53k038J344l79p21N31Q01K50
1484H11q84K91J54j825J264J198j688J088K35j501P20Q36r45j30P05r6j133R43
1502D3J458k153N48J058k835J163K100j230O3P37j426r20J282O52j234J114R74
1519A394l149J137J814k372J030J326k258QJ755k69p53J274j23k397Q44J495j607
$$ y = [56, -560, 320, 588, -41, 663, 121, -836, 547, -394, -441, 813, -37, 684, 166, -49, -151, -962, 220, 324, -506, 897, 365, -846, 532, -386, -937, 213, -206, 140, 234, 92, 393, -640, 168, 183, -1411, 255, 519, -154, 902, 301, -412, -83, -586, 1, -93, 503, 903, -627, 407, 627, -1230, 257, 477, -979, 644, 539, -609, 404, 295, -486, -776, 99, 260, -562, 890, 1239, -977, 421, -54, -1555, 516, 741, -281, 420, 120, -257, -646, 381, 311, -863, 568, 563, -1096, 770, 1023, -1015, 329, -50, -771, -240, 561, 811, -73, 218, 372, -1453, -189, 1009, -679, 409, 644, -857, -137, 699, -246, -376, 329, 233, -900, 43, 1501, -652, -104, 954, -1881, -718, 1382, 152, 215, 952, -474, -1394, -112, 540, -694, 420, 1394, -1755, -618, 1196, -1176, -146, 1180, -1078, -1070, 685, 416, -337, 937, 814, -1583, -739, 756, -851]
1536h51J325J582l038K14J246j401Q10J494n35j605N79P12j190O16J517k573K41
1553h57J553j493P09J653j090j367O75J5o70J277J111k019n04J861k017J63K606
1570A606j311j106J261p03q86J517Q22j747k21J488k021O73K612j934p91J563
1586H22j970l59K499Qj274N17P2j670M36K349j722j87J980k420m0K128p52o47
1604b30O92o05j338J188J693r83l98J049k057o04K433m90n26J266j172j283J322
1621d3N70r71N26R84j492q99K291m56j042J641j086j525J685N02r87N51Q64j798
1639f85p52J863l38m17J550j012j484J542J08j432J706j98j324O30O55q39J01
1656c26J468j073j311J330m0j092J965l6j751Q00L34j078R14Q24n31r97R35l56
$$ y = [-851, 474, 2056, -982, -768, 478, -923, -113, 1381, 846, -759, -180, 532, -658, -42, 1475, -1098, -857, 696, -797, -88, 1565, 475, -892, -217, -202, -872, 405, 1516, -503, -1007, 854, -1163, -1000, 1606, 295, -811, 450, -253, -1139, 378, 1200, -547, -768, 720, -1301, -628, 1984, 50, -741, 822, -1148, -1507, 992, 1000, -274, 243, 315, -1355, -919, 1430, -292, -479, 1501, -919, -959, 1169, 417, -230, 462, -143, -1481, -293, 1400, 417, 19, 1068, -989, -1593, 840, 350, -176, 1090, -82, -1365, -43, 527, -444, 82, 1066, -426, -1325, 966, 510, -532, 1109, 23, -1502, 183, 685, -302, 249, 1113, -685, -1437, 426, 88, -329, 1221, 209, -1275, 267, 375, -1057, 649, 451, -873, -243, 412, -427, -326, 1142, 69, -1242, 88, 48, -1044, 921, 885, -866, -66, 268, -810, 104, 928, 397, -600, 335, -21]
1674b1r45J907k57j595J217j52r31J173L91j112J30L58n84j81J457L7j514Q85
1692B63Qj410J358P12j023J58K61o30j86P83mq67O72J75q54Q84L54p49M2K57q31
1713f27M62N33k7l46K50N0r35O99L67q37N51M19j227N43P09o37j33J62j69k85
1733d78L10P37o45L3M34j284R01N86j011M83N95p87j70K90N0j58L53K60q33K25
1753a09O23r24K43N39p88O81j02k93J44l6P2k22K09M1l39R3J030j123K71L55o83
1774c18L90J68j64K5k48K97j54r1N02p78J59N04l34J69M38o38N6lj68N80n98M45
1796B39L0m93Q16o31k17N60l22l10M69k91J33J61o5l9p63Q58J01n23P52n99j04
1817b38O42o85K31J12l36N61Oj97j62j73M98k14l13K94k17o7M84l89J55J29l85
$$ y = [-21, -966, 941, 684, -911, 306, 154, -777, 396, 787, -325, -195, 163, -421, -602, 855, 892, -622, 263, 271, -1139, 219, 931, -92, 66, 327, -303, -489, 294, 290, -577, 95, 270, -584, 300, 654, -95, -53, 204, -627, -165, 368, 341, -5, 245, 295, -640, 59, 426, -411, 140, 559, -668, -125, 584, -53, -186, -24, -193, -478, -168, 569, -76, -43, 391, -893, 8, 594, -417, 66, 661, -126, -296, -6, 44, -114, 239, 499, -334, -109, 514, -410, -167, 372, -416, 265, 163, -130, 14, -22, 50, -172, 37, 78, -261, -168, 862, -261, 10, 365, -318, 72, 240, 76, 101, -147, 150, -4, -95, 407, -371, -212, 292, -42, 127, 565, -73, -17, -20, -188, 392, -206, 239, 269, -224, 592, -39, -256, 304, -18, -328, 141, -150, -17, 144, 79, 40, -723, 135, 236, -287, 465, -134, -238, 404, -281, -50, 62, -274, 287, 293, 96, -66, -239, 259, 45, -268, 26, -191, -258, 226, -163, -8, 121, -264]
1838b64L38J45k84M04k00K16r6m06L41j57kK30l63K53n8m56M13j54l31Q21n54
1859a64K61q1k91M58K4o27N95m15O7K02M2N0p0j70K02l42K12Q9j39L08r8k00L49
1882B62l99J92P3j35L9k6r6M54m94K99on02N20k50q9M10k84l63M80k65L64k68
1904h4Q0L66m73J74m4l86N12j50p0N66l76q3K82m41L69m35j38P30n96L70L12p40
1926b55K41M7m38N52l39L29j7j09L23l86M6L1k93M84K29q42O19N3n04M17l70r3
1948b75J50O0K17m36J26K52l88K74N05o31L50j7p19O13p3q4M3J6L57l62J22L65
1970D65o98L25J98p81P50J73n11L38j00j04m5k50P05q36N18M96r75J84M20p93
1990e21N53K61m65J54j00k61L02m0L50n79L2N83n85J43R16j027j46N72m17L12
$$ y = [-264, 74, 219, -65, 339, 139, 355, 259, -147, 194, 37, 35, 265, -98, 155, 97, -359, 54, -100, -431, 390, -164, 97, 16, -275, 183, 207, -420, 175, -240, -173, 29, 71, 121, 51, -119, 83, -259, -47, 42, -97, 211, 113, -87, 262, -137, 55, 128, -7, 32, 6, -90, 364, -130, 169, 163, -339, 181, -69, -158, 252, -32, -395, 85, -180, 184, -84, -4, 362, -111, 63, 19, -367, 145, -5, -75, 491, 115, 32, 314, -127, 242, -193, -331, 399, -197, 173, 485, -255, -14, 33, -405, 147, -192, 137, 120, 11, 334, -52, -6, 25, -268, 216, 445, -397, 222, 275, -229, 188, -182, -275, -125, -65, 152, -284, -158, 94, -294, -20, 485, -146, 204, 187, -532, 81, 8, -76, -33, -17, 340, -22, 100, 465, -233, 92, 290, -491, 259, 432, -79, 259, 159, 55, 10, -240, 465, -371, 147, 643, -332, -148, 272, -521, 32, 293, -172, -18, -118, -379, -77, -117, 233, -346, -314, 269, -316, -173, 743, -284, -430, 142, -275, 37]
2010C7LL68n38J08J23m56J36O73p48j40O01n97L02M45l52K8j2m3P7l23R77p24
2032e5k55Q43q85J36Q57o80q0J91k66J76j35M60j44l50Q17q12l90J474j024l51
2052d73R96p75r0M68J04l5j50L50o74j84R76n83j66Q81j004j09J036p18J85L33
2072C68n19Nj30L75K1k68P36q73l13Q45n64K32M54m14j48J01L1L74p40P57l30
2093@o30J027p68q9J342r60k07M68l46J65O1K22j26p07P21j0p77J571o84j098
2113h25J226p96J27O77m18j66J17J92K4o63J133k17j185J024m22o17J326o39j92
2132b94K56k93K83L7K41np32P56l81n97J138l0r27P62o64pO54O1O5o12K18K59
2154A88q23J185j5j261J116l12o43P17l4M4j35k46K36l52M83M87j223P53K48j201
$$ y = [37, 40, 408, -130, -22, 101, -355, -219, 454, -294, -434, 167, -430, -128, 317, -35, -7, -19, -62, 15, -308, 669, -55, -310, 533, -352, -216, 641, -39, -119, 72, -194, -18, -153, 307, 163, -187, 630, -182, -572, 902, -122, -473, 523, -252, -342, 126, 230, 195, 45, 395, -279, -463, 513, -70, -236, 645, -359, -468, 568, -150, 35, 368, -151, -146, -276, 99, 120, -148, 588, -285, -598, 247, -317, -85, 369, -45, -193, -92, -61, 313, -427, 330, 0, -630, 397, -371, -460, 882, -78, -285, 183, -163, 2, 63, 285, 159, -548, 173, 163, -614, 957, 273, -825, 401, -395, -268, 409, -9, -175, -58, 134, 158, -505, 628, 411, -774, 250, -172, -789, 537, -102, -294, -38, -331, -48, -11, 230, 225, -507, 249, -132, -729, 409, 379, -548, 214, -450, -457, 197, 258, 323, -289, -71, 188, -635, 550, 535, -726, 390, 78, -565, 152, 118, 162, 27, -219, 17, -335, 148, 635, -588, 165, 413, -788]
2174g88J410r3q34Q64p87l8K07P7L36o94M05N10j325Q34Q0q51J426p22m88O80
2194B09n65L07K62k02O3o44N93L44q82O54j09o17Q56o16L18L97o07J68K1l22O12
2215B40n87K26M77r21N06L86r54P23J12l21M22l86M98j93m37O31o88p7P59q53
2235d37K78N65q39O60j13j98L96m44M83m07k04P80q20P4O86j129N78M58q24O42
2255A85l35j04N92n74O28m30l36P88o04J09N91p69K23L30n70N13j61j72M55o26
2275b67N56k16l63M18j99j93P08p44M49J8n64Q00m97K00K19p01N41m14j69J034
2295F16q66n0Q16r98M87L36m92P74p59J00K62n62M30k44n33J218o26K35J22o59
2315c93O21k02k22N61o33L06L12p42O64k01n35J109q08j29O31o89P39r1n79O46
$$ y = [-788, 622, 529, -305, 559, -228, -266, -59, 18, 354, -340, 65, 575, -750, 84, 164, -687, 739, 17, -471, 209, -356, -49, 213, 11, 74, -570, 23, 367, -515, 139, 30, -587, 269, -347, -29, 368, -239, -71, -50, -372, 240, -347, -121, 356, -565, -59, 327, -627, 96, 208, -113, 309, -77, 421, 228, -209, 422, -266, -343, 416, -437, -159, 406, -433, 227, 114, -84, 312, -132, 351, -56, -260, 520, -300, -226, 460, -669, -91, 367, -457, 185, -150, -254, 338, -236, 392, -38, -374, 414, -190, -81, 510, -259, -36, 294, -276, 237, 76, -96, 359, -267, 289, 73, -290, 128, -71, -264, 444, -300, 149, 167, -397, 403, -94, 106, 325, -376, 165, -249, -418, 616, -250, -300, 516, -482, 5, 341, -151, 623, -136, -36, 226, -336, 94, -150, -683, 535, -91, 144, 266, -393, 228, 26, -196, 365, -268, 38, 350, -392, 272, 71, -464, 645, -163, -292, 339, -350, 389, 298, -281, 365]
2335C65p54L93K95p49P30j48o02J010o51P6L51p70P26k91j37M69m88K24K59j059
2355g51R73j65o65J072q63L30J30n85Q38l98j75P42j003N84J49q90Q62q3l45Q08
2375E65q11K81K34m43L92k07j28N67r86N50N4n51J017n79k09R56r62N32l1o01
2395c60P22m58r9N97m54L80J72p57M24k4m27P59p98L29J88k58K50j84r1M42n87
2416b34L84J70o17N04m31j56J012q92M20L2m76N79l81k07P10j010O42k9n24O53
2436A49k55j15L19l21L02j75l88Q83n04L2M34p68M99P3o50J002p86K31L04n81
2456c15K47L04n31O85n97M75j3p84P39j30m11M56l18mM45m75N90k49j62L92m28
2477h4q7M76q61Q93j42o70R82n19k06L62l52N13l95k52O91m45K2O20j047O58j7
$$ y = [365, -389, 4, 299, -450, 280, 132, -470, 540, -111, -35, 316, -454, 272, -19, -156, 313, -175, 49, 308, -751, 222, 57, -608, 464, -399, -69, 61, -524, 314, -84, -259, 483, -520, 64, 213, -677, 185, 102, -243, 565, -246, 35, 269, -174, 218, 11, -117, 450, -536, 14, 68, -483, 534, -45, -254, 702, -260, 272, 241, -360, 362, -96, -195, 402, -52, 328, 500, -257, 167, 143, -284, 475, -323, 6, 194, -64, 186, 2, -89, 353, -234, 150, 320, -297, 207, -224, -380, 632, -260, 160, 192, -284, 295, -86, -293, 417, -593, 49, 20, -504, 149, -106, -221, 98, -223, 79, -96, -484, 399, -105, -73, 361, -407, 92, 165, -485, 517, -269, -38, 266, -315, -68, 236, -295, 390, -207, 268, 255, -529, 210, 80, -331, 125, -193, -197, 248, -227, 363, 114, -48, 344, -84, -171, 305, -556, 337, 195, -475, 507, -12, -218, 144, -208, 305, -90, -342, 349, -96, -74, 546, -501, 157, 140]
2498A40m71M37j35l31N49m89M92j3n43Q48n92N4N03r47M25K45o37N05k70K42L76
2519C88o44P60o94o0P34r01L56N09q22N36J17o94R09n26j99K90l19M74k47k82
2539c15P69o53k51O46o62N07M10q71P66n60K47Rm14N48j09m38M23k31J07O83j117
2560e06N78K00n66O49j23ll9n36M81j18o9O20r10K10O43j028L32L77m87P25q13
2581c83K03K92o23P33j59m15P95q70L92L59p46M94J38n17L28j59%M50p25N12j26
2602b7l60J001p94L4N90p83L39J07l77N12o28M18j34k16P49m33k75Q58p27l8O71
2623D87p53P23l23l9p7k20K87r3n21J114o06l06P46q49L95M28n76J47q0p3M48
2644B59l59J98N9l81N92o08n9O63p08L34J47m47N56k41J4K80n01O01m42m80J055
$$ y = [140, -331, 106, -29, -360, 189, -300, 192, 179, -364, 484, -108, -54, 449, -498, -73, 172, -465, 40, -230, 12, 388, -256, 504, -190, -250, 484, -417, -61, 448, -374, 162, 279, -415, 494, -32, -231, 59, -260, 214, -33, -315, 454, -199, -450, 196, -466, 41, 451, -420, 346, -214, 33, 42, -372, 176, 67, -371, 52, -179, -72, 611, -506, 72, 272, -294, 355, 232, 229, 190, -346, 135, 17, -52, 568, -342, -132, 511, -517, -185, 192, -295, 430, -383, -180, 112, -511, 222, 63, -352, 443, -427, -35, 324, -422, 72, 210, -307, 21, -138, -138, 312, -413, 99, -27, -387, 614, -180, -146, 444, -339, 0, 107, -270, 242, -386, 32, -102, -318, 431, -2, -277, 581, -146, -184, 487, -266, 457, 134, 95, 18, -202, 85, -8, -529, 585, -21, -327, 419, -430, -35, 393, -183, -36, -116, -189, 259, -100, 98, 157, -224, 368, -240, -299, 364, -344, -10, 137, -310, 246, 5, 19, 299, -202, 399, -43, -523, 532]
2665E32n37l59Q35p26K95M53p68O13n92%L18m93R51m82m00O70m01j75O84n98L84
2686B04k31j54L53l45K49K16q13O69j37m76Q68l98l41N64m65P7K8J52K46n97K19
2707a12L22l25M53k24m85Q97m66k11J98k01L86k08l84O80p82N95O3n93L59R0l53
2728c01O89k78k88L87m07%P0m9M20k11k88O26p06N65j31m01P80m78L6M33o40M14
2750B42j87j48M71n75J21P4p31P48J03n25Q04m38j0N61p46K34o3k29N95n78pQ19
2772E35o68K19Q8m26M07k34m3K95j18J01j6n52N98k38P6Ln66P02mm74N28n16J80
2795a23K51k13K25Jj42K76m50J62R4j98L5J21m27P36k12k29J77j25J14k02q4L27
2817A14j9j83L77l42%J87m25M78k53R4K47m27K90n35K07N03m15K97j0k85K64l15
$$ y = [532, -5, -364, 471, -255, 40, 493, -275, 338, -254, -254, 64, -429, 522, 40, -360, 310, -91, -266, 418, -180, 204, -27, -181, 172, -173, 76, 292, -521, 148, 11, -465, 403, 5, -336, 228, -237, -160, -132, 20, 266, -331, -112, 210, -115, 338, 114, -371, 526, 60, -151, 47, -154, 232, 24, -360, 320, -462, 133, 196, -397, -38, 52, -301, 388, 110, -178, 209, -198, -198, -128, -177, 243, 32, -256, 370, -336, 229, 98, -303, 477, -1, 35, 468, -172, 242, 55, -93, 378, -197, -76, -2, -733, 15, 118, -407, 397, -41, -51, 510, -236, -2, -65, -294, 301, -277, -284, 535, -133, 86, 174, -252, 155, -79, -122, 173, 55, 156, 140, -412, 186, -52, 24, 27, -539, 163, 159, -315, 213, -303, -123, 128, -85, 140, 141, -1, 275, -175, -13, 81, -117, -82, 39, -388, 348, 136, -93, 84, -41, 73, -129, -213, 114, 95, -88, 289, -53, -53, 134, -291, 187, -66, 28, 275, -152, 138, -397, -190, 313, -102, 195, 185, -100, 164, -151]
2839a51k85L16J05K67j04k36O8O8r0M22n42j92O21n51J59K56n46N16j02j4K39
2860B24l85p3J94O4J08j46l5K89l88K58k2k70O45n22J27j40k14N51L8n04N22o01
2882b80J62K45l62L39j5l21O83n36l3K91k65L39j34l22K71j76rL29m37L97k87
2903a21K21P7j86OL38n08J65m9j09M25m63J89J98n43L69P3k09K61m22K33L79m69
2925a45q0K93l84O41l36Qj5k56L73K25k09J30o88M39J54j28O5j4m2m6j47K04J43
2948A85n05M71j06J69o0k34J22r0j79M70k07r6J17j24j72K91k23J30k40K50N53
2969E22n63Q8m7p3M17o45L17J42o8k38J13q0M38l74r5K37k03J85l8r9L76k53k68
$$ y = [-151, -436, -120, -15, 252, 148, -88, -20, 48, -42, 380, -162, -354, 267, -284, -125, 131, -415, 101, -1, -15, 224, -161, -234, -40, 24, 132, -14, -49, 240, -148, 110, 88, -182, 463, -59, 68, -72, -286, 265, 303, -201, 321, -280, -118, 127, -235, 104, 89, -232, 451, -85, -118, 173, -92, 247, 113, -209, 62, -114, -123, 206, -231, 166, -121, 100, 177, -9, -3, 335, -173, -8, -57, -166, 259, -204, -15, 183, -360, 9, 82, -127, 134, -288, -55, 324, -145, -225, 68, -316, 325, -11, -3, -18, -274, 99, 324, 115, 245, -443, -4, 150, 22, 87, 73, 31, -15, -162, 42, 185, -320, 151, 45, 214, 154, -80, 42, -48, -227, 243, 36, -60, 57, -67, -239, 52, -171, -41, -281, -31, 522, -41, 47, 0, -73, 344, -301, 16, 158, 90, -148, -35, -115, 323, -51, -146, 91, -112, 73, 35, -64, 312, 59, -209]
$$ [...]
8191f5
##END NTUPLES=NMR FID
##END=
