##TITLE=1H_IBEP3003S
 CDCl3, 8 sc, 
 1.4.2019
##JCAMPDX= 6.0         $$ Bruker NMR JCAMP-DX V2.0
##DATA TYPE= NMR FID
##DATA CLASS= NTUPLES
##ORIGIN= UXNMR, Bruker Analytische Messtechnik GmbH
##OWNER= root
$$ XWIN-NMR		Version 3.5
$$ Mon Apr  1 14:08:27 2019 Russian Standard Time (UT+4h)  she@DPX200
##.OBSERVE FREQUENCY= 200.1316
##.OBSERVE NUCLEUS= ^1H
##.DELAY= (6, 6)
##.ACQUISITION MODE= SIMULTANEOUS
##.ACQUISITION SCHEME= undefined
##.AVERAGES= 8
##.DIGITISER RES= 18
##SPECTROMETER/DATA SYSTEM= spect
##.PULSE SEQUENCE= zg30
##.SOLVENT NAME= CDCl3
##.SHIFT REFERENCE= (INTERNAL, CDCl3, 0, 15.7039)
##AUDIT TRAIL= $$ (NUMBER, WHEN, WHO, WHERE, WHAT)
$$ ##TITLE= Audit trail, XWIN-NMR		Version 3.5
$$ ##JCAMPDX= 5.01
$$ ##ORIGIN= Bruker BioSpin GmbH
$$ ##OWNER= she
$$ F:/spectra/data/she/nmr/H-F/1/audita.txt
$$ ##AUDIT TRAIL=  $$ (NUMBER, WHEN, WHO, WHERE, WHAT)
(   1,<2019-04-01 14:07:11.67 +0400>,<she>,<DPX200>,
      <created by zg, POWCHK disabled, PULCHK disabled
       configuration hash MD5:
       00 E9 B6 7A A2 85 ED C7 34 08 36 98 17 FE 4E 26
       data hash MD5: 16K
       FC 33 B0 80 56 E7 BB 1D 76 1B 9D A3 AE A8 A0 B6>)
$$ ##END=
$$ 
$$ hash MD5
$$ B3 E9 CF 43 93 DE B3 A7 3E 8F 5A 06 24 74 2D C4
##$RELAX= 
##$RELAX= 
##$RELAX= 
##$RELAX= 
##$RELAX= 
##$RELAX= 
$$ Bruker specific parameters
$$ --------------------------
##$DU= <F:/spectra>
##$EXPNO= 1
##$NAME= <H-F>
##$PROCNO= 1
##$TYPE= <nmr>
##$USER= <she>
##$AMP= (0..31)
100 100 100 100 100 100 100 100 100 100 100 100 100 100 100 100 100 100 
100 100 100 100 100 100 100 100 100 100 100 100 100 100 
##$AQSEQ= 0
##$AQ_mod= 1
##$AUNM= <au_zg>
##$AUTOPOS= <>
##$BF1= 200.13
##$BF2= 200.13
##$BF3= 200.13
##$BF4= 200.13
##$BF5= 200.13
##$BF6= 200.13
##$BF7= 200.13
##$BF8= 200.13
##$BYTORDA= 1
##$CFDGTYP= 0
##$CFRGTYP= 5
##$CHEMSTR= <none>
##$CNST= (0..31)
1 1 145 1 1 1 1 1 1 1 1 1 1 1 1 1 1 1 1 1 1 1 1 1 1 1 1 1 1 1 1 1 
##$CPDPRG= <>
##$CPDPRG1= <>
##$CPDPRG2= <>
##$CPDPRG3= <>
##$CPDPRG4= <mlev>
##$CPDPRG5= <mlev>
##$CPDPRG6= <mlev>
##$CPDPRG7= <mlev>
##$CPDPRG8= <mlev>
##$CPDPRGB= <>
##$CPDPRGT= <>
##$D= (0..31)
0 1.2 0 0 0 0 0 0 0 0 0 0.03 0 0 0 0 0 0 0 0 0 0 0 0 0 0 0 0 0 0 0 0 
##$DATE= 1554113231
##$DBL= (0..7)
120 120 120 120 120 120 120 120 
##$DBP= (0..7)
150 150 150 150 150 150 150 150 
##$DBP07= 0
##$DBPNAM0= <>
##$DBPNAM1= <>
##$DBPNAM2= <>
##$DBPNAM3= <>
##$DBPNAM4= <>
##$DBPNAM5= <>
##$DBPNAM6= <>
##$DBPNAM7= <>
##$DBPOAL= (0..7)
0.5 0.5 0.5 0.5 0.5 0.5 0.5 0.5 
##$DBPOFFS= (0..7)
0 0 0 0 0 0 0 0 
##$DE= 6
##$DECBNUC= <off>
##$DECIM= 24
##$DECNUC= <off>
##$DECSTAT= 4
##$DIGMOD= 1
##$DIGTYP= 9
##$DL= (0..7)
0 120 120 120 120 120 120 120 
##$DP= (0..7)
150 150 150 150 150 150 150 150 
##$DP07= 0
##$DPNAME0= <>
##$DPNAME1= <>
##$DPNAME2= <>
##$DPNAME3= <>
##$DPNAME4= <>
##$DPNAME5= <>
##$DPNAME6= <>
##$DPNAME7= <>
##$DPOAL= (0..7)
0.5 0.5 0.5 0.5 0.5 0.5 0.5 0.5 
##$DPOFFS= (0..7)
0 0 0 0 0 0 0 0 
##$DQDMODE= 0
##$DR= 18
##$DS= 0
##$DSLIST= <SSSSSSSSSSSSSSS>
##$DSPFIRM= 0
$$ [...]
##$SUBNAM2= <"">
##$SUBNAM3= <"">
##$SUBNAM4= <"">
##$SUBNAM5= <"">
##$SUBNAM6= <"">
##$SUBNAM7= <"">
##$SUBNAM8= <"">
##$SUBNAM9= <"">
##$SW= 24.9336934301222
##$SWIBOX= (0..15)
0 0 2 0 0 0 0 0 0 0 0 0 0 0 0 0 
##$SW_h= 4990.01996007984
##$TD= 16384
##$TD0= 1
##$TE= 0
##$TE2= 300
##$TE3= 300
##$TEG= 300
##$TL= (0..7)
0 120 120 120 120 120 120 120 
##$TP= (0..7)
150 150 150 150 150 150 150 150 
##$TP07= 0
##$TPNAME0= <>
##$TPNAME1= <>
##$TPNAME2= <>
##$TPNAME3= <>
##$TPNAME4= <>
##$TPNAME5= <>
##$TPNAME6= <>
##$TPNAME7= <>
##$TPOAL= (0..7)
0.5 0.5 0.5 0.5 0.5 0.5 0.5 0.5 
##$TPOFFS= (0..7)
0 0 0 0 0 0 0 0 
##$TUNHIN= 0
##$TUNHOUT= 0
##$TUNXOUT= 0
##$USERA1= <user>
##$USERA2= <user>
##$USERA3= <user>
##$USERA4= <user>
##$USERA5= <user>
##$V9= 5
##$VALIST= <valist>
##$VCLIST= <CCCCCCCCCCCCCCC>
##$VD= 0
##$VDLIST= <DDDDDDDDDDDDDDD>
##$VPLIST= <PPPPPPPPPPPPPPP>
##$VTLIST= <TTTTTTTTTTTTTTT>
##$WBST= 1024
##$WBSW= 4
##$XGAIN= (0..3)
0 0 0 0 
##$XL= 0
##$YL= 0
##$YMAX_a= 110776
##$YMIN_a= -95047
##$ZGOPTNS= <>
##$ZL1= 120
##$ZL2= 120
##$ZL3= 120
##$ZL4= 120
##$ABSF1= 10
##$ABSF2= 0
##$ABSG= 5
##$ABSL= 3
##$ALPHA= 0
##$AQORDER= 0
##$ASSFAC= 0
##$ASSFACI= 0
##$ASSFACX= 0
##$ASSWID= 0
##$AUNMP= <proc_1d>
##$AZFE= 0.1
##$AZFW= 0.1
##$BCFW= 1
##$BC_mod= 2
##$BYTORDP= 1
##$COROFFS= 0
##$CY= 11.3945322036743
##$DATMOD= 1
##$DC= 2
##$DFILT= <>
##$DTYPP= 0
##$F1P= 18.9103706918063
##$F2P= -1.10871071338519
##$FCOR= 0.5
##$FTSIZE= 0
##$FT_mod= 4
##$GAMMA= 1
##$GB= 0.15
##$INTBC= 1
##$INTSCL= 1
##$ISEN= 128
##$LB= 0.24
##$LEV0= 0
##$LPBIN= 0
##$MAXI= 10000
##$MC2= 0
##$MEAN= 0
##$ME_mod= 0
##$MI= 1.114404
##$NCOEF= 0
##$NC_proc= 0
##$NLEV= 6
##$NOISF1= 3.799351
##$NOISF2= 2.8
##$NSP= 1
##$NTH_PI= 0
##$NZP= 0
##$OFFSET= 15.70392
##$PC= 1
##$PHC0= -9373.193
##$PHC1= 17.20026
##$PH_mod= 1
##$PKNL= yes
##$PPARMOD= 0
##$PSCAL= 0
##$PSIGN= 0
##$REVERSE= no
##$SF= 200.130013532006
##$SI= 16384
##$SIGF1= 3
##$SIGF2= 2
##$SINO= 400
##$SIOLD= 16384
##$SREGLST= <1H.CDCl3>
##$SSB= 0
##$STSI= 0
##$STSR= 0
##$SW_p= 3612.71676300578
##$SYMM= 0
##$S_DEV= 0
##$TDeff= 0
##$TDoff= 0
##$TI= <>
##$TILT= no
##$TM1= 0
##$TM2= 0
##$TOPLEV= 0
##$USERP1= <user>
##$USERP2= <user>
##$USERP3= <user>
##$USERP4= <user>
##$USERP5= <user>
##$WDW= 1
##$XDIM= 8192
##$YMAX_p= 0
##$YMIN_p= 0
$$ End of Bruker specific parameters
$$ ---------------------------------
##NTUPLES= NMR FID
##VAR_NAME=  TIME,          FID/REAL,        FID/IMAG
##SYMBOL=    X,             R,               I
##VAR_TYPE=  INDEPENDENT,   DEPENDENT,       DEPENDENT
##VAR_FORM=  AFFN,          ASDF,            ASDF
##VAR_DIM=   8192,          8192,            8192
##UNITS=     SECONDS,       ARBITRARY UNITS, ARBITRARY UNITS
##FACTOR=    0.0002004,     1,               1
##FIRST=     0,             0,               0
##LAST=      1.6414764,     0,               0
##MIN=       0,             -95047,          0
##MAX=       1.6414764,     110776,          0
$$ Real data points
##PAGE= N=1
##DATA TABLE= (X++(R..R)), XYDATA
$$ [...]
2832a0701O519J0159m628n761O135L820p052m222M263K965M45K621k402r143N20
2847f462J1792J971j0751q23R940k328j2297L181J4686k55j3056k631P214J454
2861A635k025K548L47m739k60L365k637j794Q375L792j2428q095J1789J0132q538
2876A467p833P461M435r045l640R410N027n728m159K89q39K399O662j350r028
2891d472J82Q129k179q347N636J1384o203j4353K944J3104O7q166M19L874l201
2906a182k548L816K178j411J328n51p289j011J1482M966j1364o629R264M733q970
2921c188k404J0633K988j0822m956O810M603j438o89j341m044J114N717j282n114
2936c413M027N775p425r200Q050J2189n209j1576K552Q008k613m982M113M323
$$ y = [-10701, -4182, 5977, 1349, -4412, 1723, 5543, -1509, -5731, -1468, 1497, 1942, 4563, 2161, -6982, -6462, 5330, 7301, -3450, -4273, 5667, 3339, -8958, -5777, 8909, 8654, -4402, -7033, 181, 1635, -390, 2158, 2505, -2234, -2494, 871, -1766, -3560, 4815, 8607, -3821, -11916, -127, 10005, 1467, -6366, 1095, 5530, -3515, -7155, 2255, 7282, 1554, -2605, -2316, -3155, -756, 5906, 4556, -4472, -4290, 3839, 1660, -6687, -1051, 10333, 4130, -10223, -7279, 5825, 5892, -2274, -1855, 2019, -1182, -3730, 86, 2264, 853, 2181, 1630, -5659, -6670, 4812, 9778, -1586, -8215, 1049, 5782, -3188, -5592, 5041, 8029, -2793, -7749, -939, 3664, 2226, 1537, 196, -3848, -2734, 2983, 1701, -3413, 614, 6389, -1036, -10236, -2186, 10003, 4794, -6782, -4230, 3778, 1165, -3817, 296, 4619]
2950D619l478l714L99L69K038N054j192q948j377R425K456q653j055R253k55j1161
2966f220r39J1075L347p733l858L143J445n89J467q7k227J341J668m444k575P787
2982B601N753q475q545O599Q629m649o677M627N251m976n303L537M926k90k207
2997H01k220k226K340N426j095o494Q10O686j886q044K393R906r71j0159j451
3012f184P917K385m595j501K441M24j305l53n20R64L736k65o700k135P946M363
3028F618p154n011O220M416n952m286N600M886l933n102J003L415J475o22k482
3043i09j807K584L040l098m012L930N773m189p564K943Q310q82p266l78N508P92
3059B775l943j123K714J975p03k909j926K547M583j114o149n00O442J382o359
$$ y = [4619, 1141, -2573, -2174, -1805, 233, 5287, 4095, -4853, -6230, 3195, 5651, -3002, -4057, 5196, 4941, -6220, -7159, 3916, 7263, -470, -4328, -1185, 260, -329, 1138, 1051, -1176, 165, 1833, -2611, -5186, 2601, 8354, -121, -8666, -2067, 6562, 1913, -4764, -137, 5114, 138, -5165, -1628, 3298, 3008, 801, -1419, -3645, -1305, 4121, 3026, -3468, -2658, 4028, 2142, -5902, -3509, 6397, 5426, -4733, -6184, 1733, 4118, -477, -1978, 463, 887, -418, -771, -1291, -327, 3409, 3144, -3556, -5691, 2255, 6618, -536, -5547, 673, 5089, -863, -5149, 451, 5337, 1404, -3698, -2695, 720, 2195, 1573, -909, -2716, -132, 2908, -190, -4202, -272, 5501, 1312, -6252, -3309, 5001, 4119, -3147, -3525, 1983, 2775, -1168, -2291, 423, 2398, 1695, -1214, -3140, -593, 3990, 2876, -3273, -3773, 2669, 4051, -2308]
3074b308k047O291K960n988m074M473M654k039m274j11K848J671j450k710L23
3089a781L832J033m745k784N017M600m196n682K756N987j418n547L07M883Q72
3104C134l963k295K435L416l72l807j851L320L482k483m668J563N467n84n942
3119c148o76N667K319m881l457L362M059j445m080j26L589J821k930l271J867
3134a330M450l04n073j383M945K970m224m070L034M710j805m893K04M670J367
3149C268l881k867K552L804r09m294p35M153K323l611l659K731M702j388n122
3164b933j92N011J839m333l001L140L791j614m286J24M253J528l731l032K719
3179g17M000j263m709k54M656J703m188l041L267M020j899m601M02M536J179l910
$$ y = [-2308, -4355, 1936, 4896, -1092, -5166, -693, 3961, 1922, -2352, -2463, 385, 2056, 606, -2104, -1781, 2051, 3084, -1661, -4445, 572, 5172, 976, -4706, -1950, 4037, 2619, -2928, -2621, 2262, 3134, -829, -3124, -689, 2727, 2355, -1452, -3303, 17, 3499, 1016, -3652, -2089, 3378, 2794, -3148, -3824, 1843, 4162, -719, -4176, -814, 3245, 1800, -2280, -2406, 1183, 3004, 74, -3197, -1330, 3120, 2816, -2257, -3640, 1305, 4275, 51, -4019, -985, 3725, 1920, -2973, -2769, 1901, 3268, -613, -3480, -928, 2876, 1967, -2327, -3062, 1091, 3414, -197, -3856, -1125, 3577, 2189, -2933, -3125, 1886, 3725, -608, -3609, -469, 3322, 1708, -2578, -2454, 1799, 3327, -404, -3436, -717, 3283, 2020, -2689, -2943, 1713, 3416, -772, -3813, -546, 3474, 1575, -3026, -2624, 1912, 3091, -819]
3195h19k730L129L621j653m264J38M452J485m038k856L198L871j826m644M86M590
3211B140J163m288k467L329L544j987m279M81M329J059m002k523L079L709j888
3226A399m377M11M577J137m248k506L454L576k240m198R00M363O20l898k053L021
3242f2L351j929l985L96M312J113m158k457L449L544k407m363J096M562K87m231
3258a482j677L352K809k254l523Q10L892P17l689k382L185L671k026m575Q20M869
3274B517N13m608j678M128K713l148l513J658L809M7l603j583K766K841j631l904
3290b676N14M340Q75m719k324M414L579l438m358K105M428p43m036l64L321J594
3306B512k338k684Q65L513J042l557k783L035M102k334m772J651N193p98n377
$$ y = [-819, -3549, -420, 3201, 1548, -2716, -2578, 1874, 3359, -679, -3535, -337, 3534, 1708, -2936, -2450, 2140, 3303, -985, -3452, -123, 3421, 1434, -2845, -2364, 1965, 3024, -978, -3501, -422, 3287, 1399, -2978, -2567, 2010, 3147, -1101, -3607, -153, 3423, 1183, -3015, -2115, 2248, 2868, -1030, -3083, -62, 3289, 1360, -2625, -2229, 2083, 3196, -962, -3419, 30, 3574, 1167, -3196, -2100, 2462, 2749, -1482, -3159, 193, 3002, 748, -2775, -1965, 1927, 2644, -1045, -3427, -242, 3429, 1403, -3172, -2352, 2517, 3030, -1578, -3256, 872, 3585, 437, -3076, -1418, 2391, 2438, -1165, -2748, 18, 2859, 1228, -2676, -2162, 2178, 3053, -1666, -3990, 424, 4003, 565, -3793, -1688, 2740, 1997, -2039, -2403, 918, 2512, 174, -2510, -1645, 1868, 2910, -647, -3430, -395, 3707, 1373, -3399, -1748, 3445, 2647, -2730]
3321b730m31M970J722l819k605K033K577k14k265j208J732K612j360m071N72N349
3337B864Q47n834k338N293L341m310l410L355L407k544l426J274L057P61j826
3352E11k506r2L291J993l297l195L171L986l575m932L520N969k479o296P50N259
3368B078M76l404p95J736P67o31j170p72J882L068j728n444M71O603J134o311
3384b040j739N731J568n588j608N465K338m138k941J607K060J007j47k177j800
3399b402K539K359l349k649M737L892n784n704N009O563k993n670J742L861j854
3414B97k489J838K043n01p38j512j963K335N056j219o729k0O560J3o342Q88P110
3431D627j041p737n09O532J836l462j443N80o02P37J903j234j532K719J232n564
$$ y = [-2730, -3161, 1809, 3531, -288, -2893, -860, 1717, 1503, -762, -1970, -238, 2374, 1014, -3057, -2485, 2864, 3711, -2123, -4461, 832, 4173, -137, -3547, -192, 3215, 671, -2755, -1481, 1576, 2337, 511, -1995, -2087, 1204, 3197, -100, -3295, -124, 3862, 287, -4645, -1125, 4844, 2365, -3931, -3181, 2078, 2554, -850, -1645, 91, 858, 227, -943, -1715, 167, 3235, 1507, -3937, -3466, 3137, 4271, -2040, -3779, 1952, 3520, -2068, -3676, 1789, 4127, -11, -2952, -1345, 715, 1722, 1575, -602, -2402, 137, 2496, -853, -3502, 1235, 5127, -657, -6361, -1352, 5211, 2218, -3452, -1710, 2151, 297, -2192, -354, 1689, 1188, 450, -1062, -3025, -690, 4366, 3147, -3582, -3602, 2958, 2971, -3371, -2483, 4627, 3586, -4151, -4660, 1872, 3708, 246, -1197, -617, -1219, -482, 1421, 187, -1345, 1374, 2606, -2958]
3447b958k456P514M895o962o077N130M926m100l076M612K402m571k744K429K060
3462A024O15R90k105m605J338O196n29n858J412N825l172p511L437Q996j509p997
3478c453m52M769J1j830J934P49k537l18J228j736m8N599J069q238l578Q077M747
3495E993o347l427N891J564o944j614P054K771m274k648N38m99J485L901j115
3510B329n212R50M464k801m581N364O878n899q993L721Q320j644n097J978K484
3525B261l470j981L449J853j103O72r17m975J57P951K258q036k997O644J304o841
3541c771M22Q359K73q699k155N848K214j826M25l03l406K52L955n97k888L306
3557A409L167o525n527P232P938n319p431L550M753l995k687N088K794m305k919
$$ y = [-2958, -5414, 2100, 6995, 33, -6044, -914, 4012, -88, -3164, 1448, 3850, -721, -3465, -1036, 1024, 1639, 2629, 524, -4081, -2743, 3453, 2924, -2934, -1522, 4303, 1131, -6380, -2943, 6053, 4544, -3453, -3905, 864, 875, -955, 979, 1728, -809, -1127, 101, -1635, -1683, 3916, 4985, -3253, -6831, 1246, 5993, -354, -3781, 2110, 3674, -3270, -4884, 2170, 4941, 667, -1981, -1443, -1942, -457, 3444, 2329, -2883, -1933, 2531, -270, -4851, 513, 7391, 1492, -7501, -3780, 4540, 2896, -2201, -223, 2261, -1209, -3190, 259, 2112, 1009, 1681, 764, -4211, -4054, 3897, 6155, -1881, -4878, 1766, 3070, -3771, -3349, 5010, 5283, -3416, -5571, 277, 2491, 665, 1090, 787, -2619, -2367, 1588, 991, -1897, 1409, 4576, -1949, -7476, -244, 7694, 2375, -5056, -1506, 3247, -748, -3435, 1653, 4447, 142, -2777]
3572b777J323M86J125L764q84o755q26O828R21o038J032O800k537r002J653R253
3588D366O94o548j115K867q64r62K896R01k649J39J171l282j213O660L671p651
3604i19n782O122N393m870l307N475K145o370k946N143L332j930j270o52k463
3619b899P91M926K7n010N24M651k563n941L953Q091k913q577Q95O369j16l555
3635a347J522K056k521j929J670O88P9K472l8n843j811O918L340n988l088N457
3651A637J506o266j153O941K288n622l050K676J536o1J125n21k822N62K642j545
3667a27k739L900M071m971o153M121O859k377n531J767L680k373k897K441K759
3682B430j126j471q04j177J046M120j30n251j007N111P28n182J38N966J06o540
$$ y = [-2777, -1454, -968, 157, 3921, 3037, -3718, -4544, 2284, 3205, -2833, -1801, 4999, 2462, -6540, -4887, 4366, 5060, -1488, -2603, 264, -600, -1562, 1334, 2235, -414, -275, 896, -2386, -3599, 3061, 6732, -919, -6701, -579, 4814, -56, -3363, 2112, 4257, -2113, -5059, 84, 3416, 1486, 216, -436, -2899, -2108, 2818, 2845, -2165, -1641, 3010, 447, -5494, -1541, 6550, 3637, -4940, -4045, 2324, 2208, -1347, 175, 2231, -290, -2219, -549, 139, 218, 2690, 2652, -3191, -5002, 1916, 5256, -732, -3820, 1637, 3143, -3123, -4276, 2665, 4953, -669, -3719, -1043, 493, 432, 1557, 1036, -1786, -1224, 1418, -127, -2866, 1034, 5105, 134, -6019, -1898, 4961, 2584, -2947, -1180, 2500, 127, -2770, -329, 2430, 1304, -167, -971, -2148, -1102, 3018, 2888, -2363, -3370, 1741, 2469, -2713, -2575, 3391, 3497, -3043]
3698c043j365N586K220l092j621J041J48k20Q17l17o97J770Q56l765k188M932
3714A062L902m477m806L415M192k846l417K945L136k455l158Q24K311P83j67j593
3730c49j922J332L064j023l465J299M087j628n134J253N823n4n161j030L687J123
3746A902k140p58J192O83k77r39j231Q64K989J01m239j353M254K180l856k409
3762c037L556K430l289k824K585L109j191k714l48J539J291j33j582r24J998J601
3778B067k293k536K546L599k139m332J180M331j66l694n54K995Q04k154j389J267
3794d68J873K7j984j591J524K814q73l330k0L642N13l627j142L523J842k818k507
3811b602J831K754o92k336l78J697J382j091k031L25K617N64k958j642K758K533
$$ y = [-3043, -4408, 1178, 3398, 306, -1315, -274, -126, -346, 471, 154, -543, 1227, 2083, -1682, -3870, 1062, 4964, 487, -4319, -904, 3288, 442, -2975, -30, 3106, 651, -2507, -1683, 628, 1411, 1244, -349, -2271, -939, 2125, 1102, -2363, -1064, 3023, 1395, -3739, -2486, 3337, 3283, -1878, -2908, 779, 1902, -238, -996, 196, 879, 602, -337, -1568, -704, 2285, 2386, -1853, -3206, 1048, 3228, -628, -3037, 519, 2949, -340, -3164, -579, 2530, 1339, -1375, -1723, -184, 1107, 974, -608, -1532, 466, 2067, -226, -2762, -216, 3383, 1244, -3088, -1908, 2423, 2257, -1437, -1991, 1004, 1808, -346, -1735, -468, 1405, 1432, -552, -2143, -619, 2195, 1322, -2008, -2028, 1614, 2127, -1500, -2642, 881, 2723, -95, -2602, -771, 1983, 1291, -1045, -1423, 274, 1656, 565, -1466, -1141, 1476, 2040, -918, -2560, 198, 2731]
3827B731k150l052J367L072n04l061k93K693J160k108j857J035K376M4k350j187
3843b084K085K062j538k654Q67L159q5l214p18K939J656k361k264J466K560m89
3859A387k473n83K223J436j742k180R14K655K5k862j001K642J803k146k436J468
3875h70K801p00k833l68K709J301k152j882J342K407m15k550n50K488J394j977
3891A45k199J385K616n10k852m26K716J244k285j934J577K367p07k589l25K478
3907G01J185j979j969J212K536m28k768l53K629J343k290k007J677K520q24k698
3923a513r4K605J024k125j775J441K271n48k598m06K619J192k147k056J493K632
3939B015q43k932M7K813P63k387j585J747K094q71k417M3K343R91k106j735J540
$$ y = [2731, 581, -2471, -1104, 1968, 1464, -1597, -1890, 803, 1963, -145, -2002, -967, 1409, 1453, -897, -2084, 1, 2063, 525, -2129, -1262, 1897, 1812, -1402, -2120, 819, 2475, 114, -2150, -684, 1876, 1387, -1086, -1669, 554, 1990, 248, -1932, -1018, 1637, 1662, -1200, -2201, 441, 2244, 98, -2338, -870, 1931, 1231, -1602, -1970, 739, 2040, -112, -1994, -652, 1755, 1340, -1210, -1760, 728, 2122, 145, -2054, -669, 1947, 1437, -1415, -1841, 875, 2119, -166, -2100, -523, 1844, 1137, -1452, -1777, 701, 1886, -93, -2062, -850, 1686, 1258, -1510, -1863, 766, 2109, -181, -2188, -511, 2009, 1185, -1513, -1607, 998, 2022, -103, -1878, -437, 1834, 1286, -1312, -1718, 901, 2093, -54, -2110, -617, 2015, 1172, -1760, -1713, 1100, 1863, -524, -2109, -362, 1732, 861, -1556, -1513, 830, 1821, -285, -2020, -480]
3956d80K471o99k909q1K898R08k611j579K062K125j440k285M55K330M77k116j308
3973a782J364K087o39k412k75K544J062k455j870K136K524j534k851O40K907K02
3989A648k412q47J747J450j042j911K54K054J000j929k136J502K819p89l208J73
4005a627L202L39l053r65K677J445j925j949Q82J967K28j407j234R09J750l11
4021I28k302l96L101J069l215j992K944K566k152k685J447K453r01k106K98J758
4037H15N44j024j513j35J941J478j851k431J438K867j248l270J142L617o99l860
4053b189q1L323Q47k037j088Q94O32J52m57q20M60J892l73l103l16M044J263l874
4071h31k000L268K049k878j614K545J673k163j784Q23J443O59k09j557j352J624
$$ y = [-480, 1991, 1292, -1617, -1698, 1200, 2108, -503, -2082, -20, 2105, 665, -1620, -1165, 1165, 1642, -474, -1782, -418, 1669, 1030, -1382, -1657, 887, 1949, -506, -2376, -240, 2284, 750, -2101, -1461, 1446, 1648, -764, -1611, 136, 1586, 544, -1367, -1113, 941, 1941, 12, -2124, -622, 2197, 1408, -1800, -1627, 1575, 1914, -1139, -2104, 573, 2018, 93, -1856, -974, 993, 1221, -186, -1420, -511, 1239, 928, -1374, -1770, 1331, 2400, -815, -2807, 137, 2703, 551, -2134, -687, 1766, 865, -1241, -943, 815, 1359, 335, -1178, -1313, 628, 2106, 255, -2176, -738, 2129, 881, -2389, -1247, 2370, 1671, -2189, -2270, 1053, 1900, -137, -1225, -331, 301, 453, -4, -824, -364, 1528, 1155, -1948, -2264, 1780, 3043, -831, -2831, 437, 2486, -392, -2006, 539, 2212, 49, -1735, -912, 531, 1190, 981, -576, -1928, -304]
4087c04K249j618k527K090K877k676l685K468M528j592m047N63K739k30j549O16
4103i8Q11m74j08m33j042R01K893m06m300o45M454J163m018p44L840L74m251o59
4121b742L907J358k485j212L39N2Q78J403j112j869J379J737k508k114L938L351
4137D300m106m351K973M119j835k813J819J594k102j405J619J155j32L80j153
4152F2k695Q43M383J19m586k88M029n58m387J204N263o07n235o13L670P70j313
4169F1L90P9j624J41J663p72r04K564J179m561k560N027L842l985l581L020K172
4186B151l330j312L830J668l177j655Q44M02O55K263r08l832J32L860m61l380
4202b250J872M215k878n512K042N787n17m079J45J751j181o58K155O63j556J05
$$ y = [-304, 1945, 327, -2200, -110, 2767, 91, -3594, -1126, 3402, 1810, -2237, -1674, 1065, 835, -714, -98, 713, 239, 131, -302, -1344, -443, 2450, 2044, -2256, -2901, 1553, 2716, -1302, -2046, 1794, 2168, -2083, -2742, 1165, 2523, 38, -1174, -835, -783, 95, 1498, 386, -1483, -104, 1633, -875, -2989, 949, 4300, 194, -4157, -1184, 2935, 1100, -1713, 106, 1700, -402, -1807, -188, 967, 835, 1215, 62, -2633, -1790, 2593, 2712, -1874, -2162, 1867, 1309, -3078, -1874, 3389, 2782, -2453, -3066, 604, 1374, 61, 451, 530, -1094, -953, 710, -62, -966, 1598, 2777, -1784, -4344, 683, 4525, 540, -3041, -21, 2151, -1179, -2491, 1339, 3007, -170, -1825, -981, -579, 76, 2339, 1431, -2401, -2269, 1591, 1130, -2250, -378, 3837, 959, -4553, -2511, 3276, 2759, -1320, -1175, 576, -605, -1263, 892, 1555, -1, 104]
4218A04K43k435j47M705J704n440k871M513K415l830j101M496L50m976j324M104
4234E10J705j623m44l28j774N29L258k37k895R15K600k853l476M016N162l191
4250A874n644J690M110j330k110K338J297k828j529J695O81k9J800m06m310p70
4266c471N025J764m325j112L978l04m938N90N828M45m683j326K333L47m36J636
4282A351K0k368j00J925j165j427L254K554m634m184L980M663k722l372K410J873
4298B058l193j594L214J965j810j194r6j127P45L267J48m048n64L541j42l676
4314b506J393M888j404n718K57M795N96k705O0J140j404p57J717N55r20Q53M74
4331A314l082j449M391K861m117l239L227K274l165j393L847J453l628k046K095
$$ y = [104, 347, -2088, -2235, 2470, 4174, -1266, -4137, 376, 2791, -1039, -2140, 2356, 2706, -2270, -3594, 510, 2215, 592, 148, -180, -1954, -1425, 1833, 1596, -1299, -384, 2216, -637, -4113, -97, 5065, 1874, -3770, -2080, 2030, 700, -1410, 928, 2225, -603, -2132, -437, 244, 215, 2015, 1609, -2701, -3471, 1554, 3318, -1007, -2119, 1859, 1555, -3383, -2793, 3035, 3480, -1203, -2529, -196, 151, -285, 1351, 1371, -997, -1097, 828, -337, -1764, 1490, 4044, -590, -4774, -794, 3869, 1147, -2225, 185, 2058, -1135, -2729, 485, 2450, 640, -554, -650, -1777, -1032, 2235, 2383, -1665, -2229, 1312, 1170, -2506, -1113, 3775, 2371, -3347, -3090, 1705, 2301, -404, -344, 796, -608, -1365, 352, 907, -13, 840, 1314, -1768, -3217, 1174, 4035, -82, -3321, -94, 2180, -985, -2378, 1469, 2922, -706, -2752, -657]
4346f57J566k81L32m98k051J79K675j80k494J184L012k439m036K234M945j122
4362B369m432M17K843o87j683J206J423j131j044J99m69L21K472K98l680j419
4378b997L778J608l276j016L402O65l926j120L731J759k359j443P74K22M6R56
4394H04k47j219N92J289j748j720K663K907k681l786J905L449j217k633J215J995
4410A568j362j868Q88J490Q7k46p26j374N15K450L3k700j36K784k02l101J77L765
4428B042L23l491j065K466J204j270o45N00O0p6j5n74n9J671M54k522j458K730
4446B75K157k269k337J920K057j738j926J513J996p99j835kQ07Q75J68q76j108
4463a122Q84J575q81j946J019K504r60k955L71K962K86k425p35J784O06j061o51
$$ y = [-657, 909, 628, 960, 462, -1589, -1410, 1265, 1085, -1409, -225, 2787, 348, -3688, -1454, 3491, 2369, -2063, -1646, 1197, 510, -1173, 33, 1456, 325, -719, -520, -989, -668, 1804, 2102, -1578, -2997, 781, 2389, -887, -1903, 1499, 2164, -1762, -2882, 849, 2608, 249, -1194, -420, -198, -152, 804, 557, -662, -70, 1219, -529, -2249, 414, 3321, 640, -3146, -1241, 2208, 991, -1642, -427, 1568, 206, -1662, -774, 716, 803, 557, -169, -1543, -1028, 1422, 1455, -1245, -1381, 1403, 1201, -1900, -1723, 2042, 2365, -1126, -2191, 275, 1479, 209, -436, 64, 124, 48, 33, -541, -600, 1071, 1525, -997, -2455, 275, 2432, 163, -2174, -254, 1803, 65, -1861, -348, 1648, 849, -986, -988, -181, 694, 862, -14, -1122, -238, 1337, 456, -1490, -471, 2033, 1073, -1882, -1511, 1451, 1737, -688, -1423, 361, 967, -94, -745]
4480g45N46O78J65p39j148M93J979N6k265o75K279J023k063j325K024J546j689
4497A40j728J060J776l23j379m21P68R17j46j167l72J367Q54j516j463J337K077
4514A781j141k139M52K077J49j965m69J626O96j075j070M54J231L80j184j107
4530a304J058J523n51j821Q3K038L21j905q79J791J296j416j487O16J622q2j349
4547d46n54J021J073o57j420J49J630L65j676j002J436J507j036j768N52J856
4563A030o9j748l81J420R74j030j301M45J594P7j446o90J218J268r62j613N14
4580g00J763O6j856o32J697J021j290j400Q50J436j20j605l82J443R18j030j367
4597a188M73J629L7j578o42J454J143j178j388P08J693k04j686k92J434P81j035
$$ y = [-745, -199, 479, 644, -95, -1243, -750, 1229, 1285, -980, -1655, 624, 1647, -416, -1741, 283, 1829, 140, -1588, -528, 1248, 925, -454, -875, -107, 810, 664, -503, -875, 492, 1346, -170, -1633, -296, 1781, 640, -1499, -1047, 1030, 1179, -786, -1255, 371, 1067, -8, -1078, -624, 607, 987, -197, -1304, -246, 1277, 726, -1095, -1012, 1026, 1347, -558, -1437, 354, 1650, 234, -1253, -637, 985, 903, -446, -1000, 21, 1094, 437, -983, -834, 796, 1161, -515, -1517, -81, 1426, 390, -1378, -826, 1030, 961, -787, -1168, 252, 1226, 196, -1105, -660, 934, 1011, -435, -1125, 93, 1361, 399, -1214, -700, 1063, 1129, -727, -1359, 338, 1359, 69, -1331, -481, 955, 835, -770, -1152, 291, 1209, 179, -1188, -715, 914, 951, -627, -1269, 185, 1328, 150, -1238, -530, 1163, 959, -727, -1019, 415, 1196, 161]
4614A61j212N38J511p7j490n21J373R91j104j388N77J683j35j707m28J626Q45
4631A243j308j188P94J421l02j339l03J272Q69j054j234O14J526r1j726m41J720
4648D73R66j397j270R97J446n47j471n3J364N90j181r88O79J218q0j445m44J397
4666B54R75j235j326R47J683o26j740R7J626N01j353q38R50R56l25j116k04J159
4684C85P42j034j268O58J682j00j946l46J788O87j573r95J334J159q98j295K53
4701g67J241L47q73q05K60J269J47j334n94J516J013j600j419J414J808r52j856
4718a185M07J643l3j293j90Q36N26m37q62k30J146R28r35j682N75K006l52k004
4736a136N9K169J5k092m02J840Q24j211r74M27O13L67k23p18Q1J026J62j656m23
$$ y = [161, -1051, -513, 998, 921, -569, -1090, 283, 1274, 170, -1218, -641, 1042, 907, -800, -1228, 398, 1243, -65, -1253, -459, 962, 660, -679, -982, 290, 1159, 105, -1129, -515, 1011, 920, -806, -1247, 473, 1439, 42, -1228, -231, 1215, 668, -803, -856, 508, 1098, -83, -1071, -392, 826, 746, -699, -1143, 254, 1229, -6, -1332, -385, 1298, 672, -1068, -971, 655, 1156, -197, -1035, -85, 871, 546, -570, -774, 385, 1127, 93, -1175, -517, 1165, 1065, -881, -1227, 561, 1248, -325, -1320, 14, 1173, 275, -1020, -767, 474, 821, -52, -857, -597, 672, 819, -515, -1109, 407, 1420, -180, -1599, -185, 1623, 671, -1185, -778, 865, 832, -461, -651, 185, 711, 274, -588, -818, 328, 1256, 321, -1361, -786, 1220, 868, -1136, -1077, 1092, 1107, -985, -1387, 453, 1277, 66, -908, -481, 132, 499, 276, -442, -361, 665, 827, -829, -1252]
4755a252K076J037k193j557J811J682j360j396J033J150q36j018L64P46L69k05
4771D51r13q20J037J570p35j889P21J931q53k245R17K623m85k595p1J965K58q45
4789B2j34J94j64K07N6o17J27J454J12k526o24K714J196k396j312K035R67k088
4807g77o53J968R08j464r88M54L28M71O76o63j444O31J713j035j614J687K058
4824B256j953k802J545K909q28k137M64J258q88o08J020M58n44Q3k05j281K15
4841a038K607K81k979q63K668O46k504p5K844n2k972m92K340Q52j000j11j98p96
4859h42L42J424m08j205R74J186k122j806K754K653k295k906J573J983j341j084
4875a120J723Q12j790j007R68M58J07R86l76k382j85K864M55k476P8K497q02l181
$$ y = [-1252, 824, 1861, -332, -1889, -78, 1604, 244, -1152, -119, 1031, 195, -823, -459, 287, 656, 451, -462, -1282, -245, 1325, 590, -1299, -578, 1353, 500, -1745, -828, 1795, 1310, -1285, -1356, 609, 867, 22, -112, 82, -82, 125, 181, -436, -309, 1145, 1257, -1269, -1893, 821, 2017, -379, -1691, 344, 1311, -777, -1430, 538, 1446, -18, -1006, -552, -224, 247, 923, 260, -1184, -553, 1160, 125, -1489, 198, 2256, 303, -2499, -954, 1955, 1127, -1010, -546, 712, -176, -784, 236, 694, 150, 233, 28, -1253, -1038, 1569, 1850, -1129, -1992, 676, 1322, -1182, -1257, 1587, 1535, -1437, -1929, 411, 1263, 263, 152, -46, -842, -500, 924, 516, -689, 285, 1471, -651, -2457, 297, 2950, 655, -2251, -678, 1305, -36, -1120, 603, 1415, -375, -1382, -414, 44, 151, 1137, 761, -1621, -1806, 1058, 1513, -963, -885, 1612, 810, -2371]
4893b371Q71L749j74l027l41J520k13l94J269R8j500j2R04r34n05K246J241l189
4911g62k178K834K337k092j534J981P58k551o70K472J076j446n40L4q87M27K217
4928A476J4k516j05K158o68k294J692L148j743l701P87L117j52j722O17P72j534
4945f54o18J475N11p08N69J48k233p77L268J648k968j700K387R09k568j61L149
4962A677M69l151r47J904O38l91O19j28j749o3J907L6j709J148J744k221k650
4979b867K205L410j465k937R81J611j296r69J901R56j606p83M66k82J63J948J74
4996A610k807q91K646R32k374K2K668m65l315J5L204O87k035n15P05n33k23J414
5014G45J81j285J89Q03j376j073K418K005k528k633J811K368j468j422J751R75
$$ y = [-2371, -1500, 2249, 2075, -952, -1293, 227, 14, -380, 889, 987, -513, -525, 379, -555, -1060, 1186, 2427, -762, -2940, -106, 2231, 139, -1395, 586, 1344, -1207, -1877, 595, 1671, 225, -315, -281, -1168, -741, 1476, 1490, -1026, -1131, 1027, 359, -1935, -243, 2905, 1162, -2539, -1752, 1365, 1213, -509, 108, 880, -654, -1272, 203, 714, 6, 575, 723, -1510, -2287, 981, 2629, -339, -2039, 348, 1257, -1311, -1472, 1677, 2146, -1005, -1952, -48, 590, 199, 818, 690, -1059, -1122, 785, 821, -888, 260, 2004, -217, -2867, -662, 2748, 1283, -1654, -673, 938, -358, -1327, 574, 1530, -76, -859, -393, -675, -512, 1436, 1610, -1197, -2088, 558, 1490, -884, -862, 1806, 1341, -1974, -1959, 1245, 1932, -103, -618, 87, -446, -669, 745, 926, -359, -170, 633, -743, -1816, 602, 2607, 79, -2554, -743, 1625, 157, -1265, 486, 1461]
5030A461k061j123J615J069n32r8j75j309J06K084L86k098r3J970o71k435R60
5047i44L122m80l106j03K155J8j110N59O54j037m74O49k4k64J238L58k144j216
5065b149K370J771j972j472J714R60k073o88K182R94j503j116O43L08J51O34j56
5082E98j285J34J255m88j292J038J866j321k491Q96K555m08j904J96J271n42r48
5099h70O04Q14j99k67j66p36Q9J641M10j891p77J776O33j750l68K037M01k021
5117f40q44J614R21p82n46J66j29N0M24j31n26O26O78j257j169J504J648j195
5135D12j855Q28J606o60j173O07J124n50q90j7N99L90K16m67r28K71J266l4j433
5154f88R0J526j28j811j17J939M62j628o64R46N86m86l23J60J98J80j49o89J20
$$ y = [1461, -600, -1723, -108, 961, 429, 331, 156, -1153, -1047, 1037, 1423, -675, -768, 1202, 531, -1904, -944, 2178, 1698, -1408, -1511, 644, 662, -448, 111, 765, -272, -746, -97, -121, -385, 853, 1211, -933, -2149, 221, 1992, 20, -1452, 262, 1222, -851, -1539, 643, 1637, 134, -982, -339, -31, 120, 754, 598, -687, -553, 702, 214, -1078, -40, 1826, 505, -1986, -1090, 1465, 1057, -847, -651, 620, 78, -870, -266, 548, 349, 82, -84, -820, -731, 910, 1320, -571, -1348, 428, 1061, -689, -1057, 980, 1381, -640, -1484, 130, 1051, 269, -277, -111, -240, -190, 234, 103, -423, 203, 881, -376, -1545, -41, 1607, 412, -1443, -615, 991, 331, -842, -235, 889, 339, -551, -568, 31, 421, 637, 170, -758, -487, 779, 745, -688, -598, 928, 800, -1011, -1128, 811, 1273, -355, -1019, -73, 513, 27, -296, -136, 62, 242, 93, -596, -476]
5173d76J014M17j406p75J310J054j031j101R23J064q11j077N38J023l0p97l56
5190e17L59N29J68o21n39O11P54n09j124N27J337l63j503k7J463K85j137m09P26
5209A0N66n14n20J35O24L11n14q23K97J120K4j195l02J104O59j059q27R01R66
5228I63o57j047K33R68J41o98m46M03N89j14p43j99Q12N30p81q11N96J107m00
5247D46j103O5J078J49r16l89P34N86m14p88J23P42K96n72o96M47Q15j77r59j0
5267e43R34M07r82o52Q73P36n16r30K05Q51J64q14l39N69O46l29q48K4Q58M30
5287G44q40p00P10Q34m12r84J58J023R9r06m26P32O44m42p55J27P91J97p78n28
5307g12N65P85l37j008J52R67K61r86m05P60O85n53q82L29Q38J26q25l46N69O25
$$ y = [-476, 538, 955, -451, -1226, 84, 1138, 107, -994, -71, 993, 182, -895, -357, 666, 636, -161, -517, -158, 371, 539, -82, -621, -10, 744, 235, -889, -362, 975, 612, -891, -918, 545, 830, -307, -716, 10, 576, 62, -458, -323, 301, 612, 98, -725, -428, 692, 716, -479, -781, 323, 982, -77, -904, -3, 963, 306, -741, -508, 460, 601, -97, -543, -140, 449, 335, -408, -607, 205, 735, -46, -857, -261, 846, 446, -657, -592, 486, 635, -281, -670, 64, 650, 236, -552, -429, 313, 609, 37, -659, -212, 603, 426, -533, -543, 391, 798, -184, -836, 37, 773, 257, -673, -468, 383, 547, -267, -606, -37, 609, 280, -568, -544, 314, 744, -96, -796, -86, 748, 336, -648, -490, 533, 632, -274, -700, 32, 676, 234, -521, -394, 397, 594, -184, -712, -147, 638, 301, -707, -555, 412, 673, -313, -718, 42, 727, 174, -708, -379, 459, 585, -240, -586, -17, 608]
5327F08l27p75Q6P88K72r33m05P48P68o44q69L33P93O8q78j90O91M01m71o40K10
5348c66P82J29p83m65O88P39n08q89K45J012j8r20k92Q69N39p00o78M30O25K1
5368D60o90k83N26N80l10r28K08R28J56j013n09J005O04p64p28N37P93k75p87
5387d90PO68L46n04o08K33P04K23o93n10O33P78o12j012N87J069k78j192L1R99
5407C79J78o29l47L62L43j3m27l13M40O83m36r59J74J152Q1j122l18J164L63j049
5427b94m79Q65O19n69n43R3M32K66n2n80j10N61M33q54n10R42Q16j017j105Q21
5447b65J193n05j101K88P97k12n61J17M30J27j27l45n45N56R52l11j202M5J342
5466F73j54j234J80J381k3j460j48J119M05p00k64J69p0J52K09l35k65P46K77
$$ y = [608, 281, -494, -408, 380, 652, -281, -686, 62, 830, 186, -683, -350, 443, 511, -367, -557, 134, 535, 64, -576, -366, 416, 545, -238, -703, -15, 724, 216, -673, -428, 584, 566, -354, -646, 223, 762, 62, -616, -186, 439, 460, -230, -513, 13, 593, 283, -645, -437, 491, 647, -366, -875, 130, 734, -30, -758, -221, 572, 297, -490, -483, 185, 531, 27, -581, -348, 356, 579, -114, -624, 9, 787, 175, -837, -250, 819, 541, -651, -620, 379, 557, -72, -419, -57, 286, 273, -154, -467, -27, 656, 220, -739, -565, 587, 668, -454, -772, 392, 755, -294, -773, 92, 711, 142, -401, -308, 124, 390, 338, -242, -352, 209, 642, -212, -722, 220, 1036, 19, -1086, -265, 928, 423, -678, -390, 407, 195, -366, -249, 181, 308, 181, -164, -709, -153, 799, 488, -714, -669, 673, 519, -715, -535, 846, 823, -637, -785, 334, 739, 39, -225, -56, -126, 26, 235, -100, -365, 381, 658]
5485F58j225n31J417J027j371j132J016Q84q69o11Q97N36q31m50L82J95K52K73
5503E17l67r39K89J210j62j195M03J268o33j671O97J769l01j478j8Q98j56l73
5521b42L77J05l68K2J90n37o0J278L39j778p56J586R79j293o88J350L02j488l58
5540a040J376N74p77l09j4k72L09Q88j90j148L25R74p35j142J288J522j178j974
5558a523Q16J578m14r09M79N61r43l38O97K58k28M38j38j289j96J914N61j677
5576c53o12J512R1j554J75J926Rj880l44J078L14l48M68k8j011r6R82j63p01Q98
5596C63Q32j578j461J538J880j062j567Q73Q17j055n18J350N69j001n84M09k29
5613d24J75J134R7j734l94J563L46j387K93J723o98k177L34K086J39j387k6M71
$$ y = [658, -567, -1098, 319, 1346, -25, -1157, -141, 743, -126, -737, 160, 696, -135, -585, -203, -8, 244, 517, 150, -789, -500, 710, 548, -647, -244, 1024, 391, -1280, -583, 1186, 885, -593, -611, 287, 131, -242, 135, 240, -128, -106, 84, -453, -513, 765, 1104, -674, -1430, 156, 1135, -158, -846, 504, 806, -682, -1040, 336, 910, 133, -176, -190, -462, -153, 735, 545, -603, -278, 696, -39, -1181, 107, 1629, 451, -1523, -707, 871, 457, -452, 27, 588, -355, -693, 4, 262, 34, 472, 334, -955, -1151, 763, 1324, -353, -965, 547, 638, -916, -741, 1185, 1194, -686, -1030, 48, 362, 14, 482, 454, -557, -653, 329, 166, -535, 363, 1195, -383, -1844, -306, 1574, 512, -1055, -182, 635, -420, -938, 412, 981, -20, -604, -195, -424, -249, 885, 982, -752, -1146, 417, 763, -624, -331, 1392, 694, -1483, -1149, 937, 1076, -311, -337, 134]
5631A34n36k18R75K48p76P1L78r56m59J693J205j831j546J423J142j204m94J500
5649G49L98j748o25J292O87m57J6j06r14j23J430K75j265lJ149o84j626J096K182
5668A723p75k094J98J374j94p27P58M87j021n60P06J70j64P76K94j687q03J759
5686B20J117j423p10J325K02j689j35J946M98j486n96O28k5r9P71P8j042j63Q85
5705C02l26q02R47J313j267j865J003J847n75j229O00P37r86o88J112O80n83l39
5723a19J22o17r1J437M15j448o22J293K46j335R0J779p9k054j86J529L83q02l6
5742i5L66n72k68P01J57n81M45M74j099q52J404J395j131j428Q19R68p93o51J074
5761C33O67j013p75N57L54K3L29o2r39j00J035J25j000K27J104m75j571M00J760
$$ y = [134, -402, -620, 355, 603, -173, -102, 276, -680, -1139, 554, 1759, -72, -1618, -195, 947, -257, -751, 749, 1147, -601, -1226, 66, 753, 296, 312, 206, -708, -831, 599, 874, -391, -394, 755, 71, -1555, -459, 1723, 948, -1146, -948, 426, 232, -495, 263, 750, -271, -831, -125, 45, -119, 657, 951, -736, -1539, 220, 1337, -86, -796, 529, 731, -958, -1093, 853, 1351, -135, -731, -103, -128, -227, 544, 622, -420, -583, 302, -24, -826, 121, 1434, 167, -1698, -695, 1152, 577, -652, -52, 685, -301, -989, 123, 803, 220, -119, 3, -614, -705, 732, 1147, -301, -923, 370, 616, -719, -629, 1150, 1071, -983, -1169, 360, 743, -59, -95, 271, -301, -569, 132, 289, -292, 153, 627, -472, -1324, 80, 1475, 344, -1084, -265, 703, -90, -741, 333, 1000, -13, -788, -231, 123, 146, 475, 413, -526, -626, 409, 534, -466, -239, 865, 390, -1181, -781, 979]
5780I79q6j392j40Q21j16m03L40M33l75k75K02k61j37Q89N04j250q68J162Q98
5799I25r96o38R96N89j238n77J039O63n88n15J55M4jM29ko36J42O18m15q71P50
5820a27J133n36j407L25J203j18q91J85P11l14n53J92L74O0M4j66n96OR08K17
5840F50r17l32R06L09j086k21J069M70j015n11O24L47k07j80J3jJ04J20k69k06
5860c33M82M19o73o64O66Q62l90r62L28Q29m23n69K24O16p3m68j72K09K13K51
5880C72k58n18J31O70j02p39O3Q29rq69j81P86M56p45l67M59K29j18k41l1K74
5901I1J59j49m07o0O81K32o91m21O19N69n71n72M30N99l10o75J80N58M2l07l00
5922c03O7M18P7l89k06L13M52l18n91K12O45J9p75r1O58K88n26k57K60L39r6l95
$$ y = [979, 893, -499, -639, 182, 66, -337, 3, 436, 61, -214, -12, -273, -410, 479, 983, -267, -1135, 27, 925, -71, -709, 287, 876, -362, -939, 100, 763, 175, -340, -185, -141, -142, 287, 285, -351, -209, 409, -6, -877, -127, 1006, 470, -937, -612, 591, 473, -418, -233, 478, 164, -389, -197, 177, 237, 281, 115, -481, -475, 433, 650, -267, -599, 307, 616, -470, -691, 378, 848, -167, -678, -54, 293, 86, -94, -81, -82, 22, 142, -127, -333, 149, 568, -105, -769, -103, 759, 369, -593, -265, 564, 141, -428, -204, 412, 339, -129, -301, -92, 121, 372, 114, -404, -273, 397, 295, -444, -381, 448, 439, -430, -611, 175, 631, -114, -481, -22, 207, 89, -152, -183, 91, 250, 101, -306, -366, 315, 547, -144, -565, 54, 623, 52, -520, -90, 509, 199, -476, -296, 262, 304, -3, -303, -236, 182, 259, -130, -336, -23, 429, 111, -480, -268, 377, 396, -379, -470, 188, 476, -50, -307, -47, 292, 196, -199]
5944a99p3M03K73l42m16J34N64L0n66k69O69K86n55m85M69N32k95m84N2M68J46
5965C42l92k54K15L96n1m64j71M49L80l75n47L25O45j95n73o0N87J09m14l24L31
5986d1L70j60m00p8M52K30m62l17J82N14q6n26r4N96K05m95l29L21N09j80o11
6007d00J38N07Q0l10l81K98M00K7n48j41N73R5l02m31L40N19k84n66O2N38J80
6028C94n47k59L14M23k78l16k6M08J72l63l24L11L78j7o35M9O05J54n70k46M34
6049F1M61l40m98J59M35O8m73k16L35K66m3m97lM88J65n02l96M78N22l74n00J52
6071b52N02K6n17r3L47K44j50l58l2M63K64m18m21K07N93j26p08K12O11K5o95
6092b76r1N23K80m05k90N8L34K9k70j14J50L08oo01J1N37L16o36l96N84L93m82
$$ y = [-199, -272, 131, 404, 62, -354, -220, 344, 374, -192, -461, 208, 494, -61, -546, -77, 455, 160, -324, -272, 196, 342, -50, -304, -89, 307, 256, -208, -379, 70, 450, 75, -472, -147, 498, 303, -270, -330, 257, 366, -48, -372, -41, 329, 169, -231, -309, 143, 373, -89, -406, -224, 290, 204, -322, -416, 180, 385, -110, -439, -118, 391, 211, -400, -262, 245, 325, 15, -366, -68, 332, 359, -189, -330, 243, 338, 36, -395, -55, 464, 180, -386, -324, 214, 394, -153, -412, -98, 325, 47, -269, -295, 113, 285, -78, -402, -91, 287, 270, -365, -316, 289, 443, -127, -373, 61, 522, 182, -316, -157, 278, 346, -127, -343, -8, 258, 215, -282, -285, 203, 368, -134, -530, -52, 470, 96, -404, -252, 250, 276, -241, -334, 13, 257, 107, -251, -283, 180, 444, 26, -395, -188, 405, 279, -429, -217, 394, 419, -276, -367, 156, 436, 31, -259, -201, 133, 162, -108, -222, -72, 236, 230, -371, -360, 177, 493, -143, -539, 45, 438, -44]
6114d4m29M63M13k64l83J6K83J49ql07j90L19L57l24m62M02M55k97p77L91P30
6135D93j14p01o2M81N1k93PJ50K3pj16k43K16N23j2p65k17R44K02q16j64O93K28
6158E01p70k31O49K82l42k60l3J00J26K19k37k40J59M60m90n27O59P64p36p57
6178g04L74P90l66m56K99L70l52k64K08J79O1J35j96m69J10P15R4p94j32Q27j60
6199B69q21J48R95j4r43k11O44J03k02J21Kl41J27K72k51j55N36K96q59o13R33
6220C6P30o66p31N84N46p81k60P53L51n25k67Q3k2J10N01m0q46l2Q12p9p93L87
6242a49R73n70j141K90J170r7p25K8M11m15k21N38K59l92K9J18n40j64R80M83
6262H65r66p50R12M79p44k14R23J75j083k50P41L20l31J39r2n72o2Q20N6p27K55
$$ y = [-44, -473, -10, 403, 139, -244, -228, 55, 204, 196, -111, -301, 18, 375, 51, -411, -9, 446, 149, -628, -237, 493, 379, -322, -384, 97, 148, -145, -138, 12, 35, 28, -88, -331, -115, 408, 396, -369, -586, 358, 560, -256, -420, 273, 501, -269, -500, 149, 431, 89, -171, -204, -104, 22, 241, 4, -236, -77, 383, -107, -634, 25, 789, 53, -704, -330, 460, 94, -362, -63, 307, -45, -309, -101, 78, 139, 274, 78, -391, -281, 434, 528, -266, -398, 429, 269, -552, -404, 591, 577, -366, -577, 67, 170, -32, 89, 91, -250, -123, 149, -102, -257, 279, 575, -284, -897, 36, 766, 100, -631, -47, 499, -282, -542, 211, 562, 37, -230, -147, -169, -59, 442, 402, -444, -476, 336, 257, -536, -149, 824, 254, -887, -597, 573, 476, -249, -221, 190, -225, -446, 92, 351, -41, -12, 106, -434, -598, 382, 865, -101, -851, 61, 540, -204, -418, 505, 680, -403, -653, 88, 408, 77, 216, 124, -448, -510, 310, 366, -361, -106]
6283a06O55o03r31P46J315o59j157L02P76l50m48O90L37p20l42M56L1j16O12J05
6303E93j093l67J108N49r94j84R17m9j299J27J283K08r93k61M55j67j6M93J46
6322D56o75j67N18k23n12Q36P94r79j152P68J082n05p33O71L10q51l13Q68M15
6341F08n45l6N6m97j07J022K68r36m02Q49pr31L12J268k91j444J9J122J1n79L25
6362H5K55n78l16O38K03l07J65L92q87o37J159R06q13r11O33N07q64j73J126K80
6382H63j051m91O03R8pL36J09r06k05Q11J12o41K46Q38n86j187N17J280j26j009
6402c96Q2N40l35l84O60M20n91k16K65k62j60Q26M06j141n49Q58N17p00k40Q81
6422D81M3j095j77J018L58o08j97K19l54j9N53J24n38K2M77l72n85O53R12o22
$$ y = [-106, 549, -54, -985, -239, 1076, 417, -740, -438, 338, -12, -460, 230, 567, -153, -495, -39, -8, -124, 488, 593, -500, -867, 241, 790, -204, -388, 529, 480, -819, -692, 591, 799, -194, -455, 0, -167, -183, 310, 456, -219, -386, 132, -91, -603, 233, 1027, 48, -1104, -336, 746, 241, -492, 179, 489, -362, -675, 193, 608, 63, 27, 83, -414, -521, 501, 769, -167, -569, 280, 273, -658, -346, 922, 631, -813, -794, 328, 339, -240, 85, 340, -238, -554, 84, 287, -20, 145, 537, -350, -987, 172, 1078, 265, -646, -13, 494, -370, -543, 583, 863, -188, -679, -76, 22, 15, 351, 460, -446, -651, 160, 272, -369, -123, 715, 129, -1058, -541, 739, 613, -396, -314, 226, -109, -493, 167, 587, -4, -220, 45, -217, -377, 449, 855, -286, -835, 23, 540, -160, -400, 481, 524, -571, -748, 270, 628, 20, -177, 42, -312, -331, 222, 346, -192, -170, 307, -65, -650, 3, 915, 293]
6442B93j105L90R01l55n09N46L85n96m82M92K64j03L1K6n06j84P43L70p42k66
6462d07O79j6q22O2J017J37j011k03O32J13l01J98J87l23j44K63ok54M04L90p79
6483a84n54O17Q00n40o67N47M29n78l80N55M85m29l27R6j2K8L59J16n96n8M16
6504A23O1n54J42P70j95r23K0Q57J73o49K8L48j17l06J47K86j39J6K5l37j05N80
6526B51K97n52m60M63L93n35k85N43L90o40l77M15L68k12p3m0j26K9K56K0k79
6547a54J66L28l57m42K81O87r7p67N7O13j07l64M7L53p3k76lP5M6J50Qm21n6M45
6571A39J51m95j10M83J61n34k57N33K91m23k19J14K80k5j36k9j7J79N6k05j54
6592b17L44K53l22n05L13N08k35m04J15M09q8m22Q1K86rj44r9%J18J45j09l01
$$ y = [293, -812, -422, 479, 124, -385, 161, 546, -50, -532, -40, 224, 121, 152, 178, -328, -512, 231, 601, -141, -407, 272, 256, -566, -504, 513, 650, -361, -564, 68, 181, -120, 78, 265, -58, -202, 61, 55, -199, 205, 595, -184, -738, -121, 679, 139, -528, 19, 448, -130, -510, 45, 530, 101, -226, -130, -142, -114, 245, 361, -235, -293, 123, 184, -370, -228, 542, 347, -576, -556, 301, 474, -175, -147, 201, 84, -222, -75, 211, 72, 88, 113, -224, -329, 251, 548, -4, -464, -1, 392, -143, -428, 115, 505, -135, -512, -97, 271, 59, -14, -54, -180, -151, 105, 125, -154, 12, 340, -17, -459, -178, 509, 412, -355, -298, 315, 208, -156, -109, 244, 171, -105, -108, -33, 13, 163, 171, -250, -306, 139, 290, -205, -315, 168, 329, -205, -462, 71, 362, -61, -280, -166, 114, 89, -47, -76, -93, 86, 142, -63, -217, 127, 380, 58, -447, -134, 374, 139, -265, -150, 259, 171, -251, -170, 116, 107, -37, -136, -136, -18, 127, 18, -283]
6614b83J34L26K7m95K9N53mm27k01M56J76k25k23J32J58nj85k7Q8R5%k16j49L56
6638I0J52l37k25K30L61k08l14J01L69j18k93k4K92P6j25j59L5K33P3j93j75R3
6660f6L18j23l83J39L84l2l22j76L45J78k28k47J27K80o9k84j2J66K16j52k69
6681b10J06K15R2l24j26K94K55k82k84J63L22l1l01p4K58J07j00k26L3K69k4j62
6703c0k24K55K20j90k05R0K82J4l58j33L48R4k33j51J44K15j9k67o1K26J92j45
6725F4k07J0L04%l40o3K60K35k17l16K37K49j9l33L5J48J62k55j15J13J77J1k41
6748a01j03J75K88k30k76J91K67n3l65O0L00m7j57j16J67J51m6k50L5J52K33j74
6770A01l26J04K98J9l58k7L68L6k39k05K08K20k19j61N5J30R9j12j84J10J41J55
$$ y = [-283, -149, 177, 204, -291, -262, 291, 287, -140, -341, 115, 291, 66, -157, -25, 133, 128, -57, -84, 4, 99, 99, -117, -266, 90, 242, -95, -320, -90, 271, 63, -251, -150, 219, 101, -192, -216, 76, 152, 27, -132, -97, 136, 209, 16, -159, -66, 252, 129, -254, -115, 269, 237, -85, -261, 84, 262, 34, -213, -86, 194, 125, -159, -171, -5, 211, 59, -210, -104, 111, 203, -121, -247, 47, 302, 20, -264, -101, 221, 190, -111, -185, 73, 180, 80, -146, -113, 156, 132, -30, -254, 1, 221, 31, -174, -84, 198, 212, -146, -279, 69, 163, -70, -221, -77, 138, 119, -148, -209, 17, 209, 64, -143, -133, 171, 171, -169, -232, 28, 263, 46, -270, -33, 216, 197, -136, -101, 47, 209, -46, -161, -48, 129, 140, -101, -204, -29, 259, 29, -247, -56, 211, 158, -207, -147, 153, 106, -51, -167, 0, 151, 105, -145, -110, 42, 275, 101, -225, -121, 177, 196, -162, -189, 179, 215, -24, -229, -21, 199, -20, -181, -126, 4, 103, -9, -193, -83, 58, 213]
6792B13l34j54L26K15l00k04J96K74j07l39J08K41J1k61lJ76P6K7k06p8J18K08
6814B03j06l02J32L14q9m44J25L91m3l73q3L31R4j27n3qL8lPj67O1K14J33m46
6838b01j03L61L15l94k82L28K82l76j55L13K00j83j77rmJ52P5r6k28J03K79j52
6860D8l64K22M34k66m98K23M69o0l60K6K51j01j82J54P6OQl7l06J11M23J28n05
6883a00k25M44J66m98J0M19J21n21k08M09Q2j26R2n7j43m5K89K9l30J27L39l72
6905i8l20M57M65l43n18K75K79k27j97L54J95l31j57J08nK9L35j21n05o5O19R8
6927C27n29L1M96o8o85R6P08J2n56n9K37m1p9K35N3l42P9J75j53j92M24L63n31
6950An50N01M52l60j93L12N9m19k15N14J70j92r1L8l19k7N51O2m69r5M84j29n10
$$ y = [213, -121, -275, 51, 266, -34, -238, -42, 232, 125, -214, -106, 135, 146, -115, -118, 58, 134, 161, -45, -123, -5, 203, 97, -205, -73, 241, 152, -292, -167, 224, 181, -192, -275, 56, 150, 23, -30, -38, 0, -3, 4, -163, -102, 112, 245, -201, -304, 57, 372, -22, -304, 24, 306, -70, -225, 88, 288, 105, -72, -81, -85, 67, 142, 46, -182, -79, 200, 48, -316, -94, 340, 74, -424, -201, 268, 208, -152, -126, 125, 24, -158, -4, 72, 78, 86, 49, -257, -146, 277, 405, -100, -325, 119, 285, -213, -203, 216, 337, -184, -392, 17, 99, -27, 65, 8, -135, -180, 109, 138, -192, -65, 274, -98, -418, 39, 504, 161, -357, -82, 197, -30, -227, 127, 322, -9, -166, -58, -63, -34, 301, 180, -325, -390, 229, 327, -202, -171, 325, 257, -428, -332, 376, 388, -168, -227, 10, -31, -110, 125, 178, -164, -85, 90, -63, -255, 169, 532, 1, -549, -48, 404, 44, -149, 163, 222, -197, -412, 102, 272, 80, -11, 27, -292, -319, 232, 294, -175, -270, 214, 85, -425]
6973d25K65P11j96q37O7O24k7k83J68J67l22k12L28J65k13J70J48m70l54N73N57
6994F04n45m71N29J68o16o2P06J15n92k23L45L9j24L64l6l84j60M52jl87K10N82
7016E13m70p09L65Q22j59o49J43L34l41j49M65K16l75k01K47k33j5M41J90o13
7036a78l76N51K63m97n8P08o9p90p3P75J53m50l2J97l12j40M44K40l59j03L58
7057B52m00l24N70N81n19p13K97N40k60k95M39K39o03k40L44J97j01J42N9m55
7077b50k06N63K89n52q0M87q0o57J47R08j84o18p7M82m6k22K61J71l72k19L22
7098F7J0k20K76L45n64m83M27N87l74l73M12K22n98j99O26L03n00j63P1jr4M19
7120A96J06l81j86M34qn05K63N51j88p06J36O03m9l72J04K11l08k08L34K05k14
$$ y = [-425, -160, 551, 355, -482, -415, 209, 182, -101, 67, 234, -88, -300, 28, 193, -20, 150, 298, -172, -526, 47, 604, 59, -412, 117, 285, -331, -393, 313, 428, -164, -387, -42, -3, -127, 237, 201, -183, -343, 109, 108, -279, -69, 513, 43, -666, -301, 521, 362, -287, -144, 190, -151, -300, 165, 381, 6, -195, 52, -181, -196, 245, 435, -178, -554, -3, 260, -237, -295, 413, 344, -446, -519, 256, 409, -41, -73, 124, -188, -328, 116, 356, -3, -106, 252, -148, -472, 98, 679, 160, -553, -256, 284, 24, -271, 168, 407, -196, -436, -92, 105, 4, 146, 205, -250, -456, 107, 396, -156, -236, 251, 171, -486, -339, 569, 385, -233, -310, 172, 126, -96, 165, 336, -36, -255, 67, 77, -143, 133, 478, -86, -569, -142, 445, 71, -302, 110, 332, -266, -465, 161, 464, -36, -199, -128, -129, -223, 196, 302, -79, -265, 169, 161, -344, -81, 470, 282, -424, -288, 315, 266, -106, -2, 209, -99, -307, 27, 232, 18]
7141A8j07J93l11j72M23L97m57l40L11K77m10j37N48J28o36j38M71J10j77nJ79
7162A65k19j78K82J30k44Q4K95k74n54L20P00k58n64J95L35k18k26K72K90l42
7182ik61K07qQ8J42M6l44k26M07K26l77r0M00m5m87pN25J75m95J4J35j8r0J49
7206E7J11j77o3J38o8k34L35K36l04m29K66M35l17k11K85J77l06j95J73L09j68
7227E0j46K2j5pJ92J7j76k0K65n4l12N1M38mn49j4L29J43k40k6J29m5j05N0j4
7252d1K5P2R4k80j01K61K65k69k68K47J81k07k15L15J21j52j93O3J47m1m5Mj17
7275a34P7J35m0j43J24J88j29l17N5L87l8k83l6K09oj34J2R4J07k23O3kL7J40
7299A43r4j17p5K52M8k66p9K54J70l52q1K17J90j40j75O8R8%n7J0J8N2p4j11n8
$$ y = [18, -89, 104, -207, -379, 44, 441, -16, -356, -45, 232, -178, -315, 233, 361, -275, -413, 58, 168, -9, -14, 165, -54, -232, 50, 180, -64, 20, 315, 41, -513, -193, 507, 249, -315, -120, 215, -3, -229, 43, 333, -9, -270, -63, -71, 17, 159, 205, -139, -365, 42, 268, -109, -199, 201, 156, -331, -338, 187, 362, -133, -119, 16, -2, -92, 57, 168, -9, -72, 66, -2, -236, 99, 335, 31, -398, -132, 303, -14, -225, 60, 237, -69, -264, -91, 218, 50, -96, -74, -89, -96, 96, 113, -63, -83, 182, 128, -184, -133, 305, 301, -248, -262, 67, 210, -30, -56, 73, 28, -77, -27, -41, -16, 56, 150, -130, -231, 30, 295, 26, -242, 5, 186, -21, -236, 79, 200, 48, -145, -82, 65, 24, -21, -17, -134, -57, 78, 38, -105, 19, 207, 78, -239, -184, 203, 165, -118, -154, 55, 49, -85, -73, 21, 128, -95, -32, -34, 3, 143, 49, -68, -143, 109, 157, -109, -188, 66, 236, -116, -197, 20, 210, 70, -105, -37, 61, 61, 4, 14, 32, 84, 10, -101, -159]
7324a59J85J66j35k47J24K56j26j94kK28j5j91n1J73R1j29j0q1L3J58o8r8P7P5
7348F0K6j15r9K55L1j60j10J32J18j1j72j8P7J9m4l2l7J83K0j72l2K5J73q7k49
7373b19J92J91l9k60O5J94l0j29o1J03J11o0j34qJ58J02k19o8K6J67pk00l0K36
7397H1%j27j43J61J48j69p6J14J56r9j30j2P4J58n8j79J9J59M5j34j43J51J77
7420A73j22j55jJ91M6k04j6J20M7L3k12j1J20J12r2j89J58J83j32j80L4J55M7
7443A05j75m1J17J13j09j16O4J36l9n1j00J01Q9N0k35l2K16J7j32n3J23P3p0k04
7467a53J26J12j3j35K6L0O1l8k4q9J36M0j03j70K25R8q0j96J40J43n9j79L2J39
7491F9J0p2n2L4Q8l2Nj24O6J10n8j01j20K21oj17N0R9Rj51l7N1J46j6p5pj9R0
$$ y = [-159, 26, 192, 57, -190, -66, 190, 64, -130, -132, 96, 81, -110, -161, 12, 103, -26, -36, -117, -84, 74, 6, -92, -15, 60, 86, -29, -128, 127, 158, -2, -112, 20, 138, 127, -45, -63, 14, 33, -11, -43, -80, 103, 123, -49, -81, -56, 117, 30, -219, -27, 164, 125, -135, -70, 124, 94, -35, -96, 7, 118, 58, -76, -84, 74, 176, -43, -111, -85, 82, 75, -125, -155, 81, 81, -46, -189, -28, 120, -49, -125, -11, 145, 46, -84, -96, -22, 136, 78, -101, -82, 77, 122, -12, -155, -4, 173, 51, -104, -105, 86, 132, -72, -88, 32, 79, 112, -100, -111, 9, 121, 29, -160, -2, 181, 49, -131, -97, 58, 105, -70, -111, 6, 119, 10, -106, -42, 94, 55, 4, -96, 5, 94, 144, -91, -123, 93, 110, -22, -75, 48, 121, 51, -153, -27, 85, 72, -63, -37, -7, 54, 16, -8, -97, 39, 79, -24, -194, 31, 129, 49, -147, -7, 136, 77, -102, -70, 69, 79, 7, -45, -11, 77, 45, 50, -74, -8, 102, 44, -57, -177, 44, 38, -79, -29, 70, 79, -72, -109, -58, 88, 72, -3, -10, -29, 61]
7519F1k5lr8M5J00q6k23L18J48j80k65K16J47j36q4L9R4q2o9rM2O4M9j2j87J9
7545a17J94mj48p9K82k9k60K5K81O2k93K5J22k1q8O2R7j02k6M5l8p4K03P2k45
7570e4j37J92J97j78j66K18J07k79j58J89J24j9q4L8j11N7J39m3r4MK30j36k14
7593a78J30L44j32l84Q7K86p3j07M8P9r4j39J43J4m4J24L1k53j40L15J46k38r2
7616a27J94L7l07K1L04O9k93q0K39l0r8J25N2k48M8R1L0k10J23K86j92l06J47
7639a25L59j27k57J27J39k04j20K21K04k00j03J17j29PJ86J20l17j36K50J18k78
7660a48k5L74L6m13n5L67P2k14kJ44k10o0K09Q8j54k0J31j71k04K94K62j64m31
7683b94K25J84j81j05L00J65l44k27K80R2j58J84J1k47q7K12J75k33r0L29j38
$$ y = [61, 36, 33, -65, -20, 80, -6, -229, 89, 237, 57, -208, 8, 155, 19, -65, -26, 68, -14, -83, -92, -50, 14, 63, 51, -136, -117, 77, 73, -75, -154, 128, 99, -161, -136, 145, 207, -86, -61, 61, 40, -48, 14, 111, 9, -17, 28, -10, -84, 119, 191, -54, -191, 1, 198, 20, -146, 72, 179, -100, -258, -69, 55, 36, -48, -10, -121, -64, 75, 32, -62, -58, 172, 36, -178, -48, 296, 164, -220, -133, 153, 80, -27, 21, 100, 6, -133, 10, 24, -20, 104, 135, -118, -258, 57, 203, -35, -127, 67, 104, -203, -182, 122, 191, -102, -182, 57, 27, -71, 54, 106, -142, -94, -3, 27, -183, -60, 226, 34, -272, -125, 234, 107, -150, -23, 116, -88, -208, 13, 217, 17, -86, 31, -98, -91, 95, 215, -102, -238, 12, 130, -148, -173, 201, 237, -176, -231, 136, 208, -6, -8, 136, -74, -134, 75, 163, 9, -11, 120, -51, -255, 39, 301, 137, -294, -69, 115, -66, -171, 129, 294, -50, -277, 3, 95, -63, 121, 132, -115, -202, 10, 185, -48, -138, 191, 53]
7704E3l37J63M45q5m28N6K29j39o3J59J13k14o2N9J4n9J59K26l38k79K71K82j52
7727G3k52L10R2m64m4L89J20j96j08N5j10O9J92K6j35j00J31O2k45J18L67k38
7749A12l80L5M21q1k31J19J71k39j97K91R8r3p2J04j77j31K51K42k09k89K54J14
7771A13k41J2L21K1l61o9K34P4j62J52O5j82j65K43J08k49O8K02j99l46K09M11
7793B59j40l02Q9K23k02j12L27J17l06j11J25j6MR8P2j92j57K46J57k09k1K24
7815A73ol44l8M40N5l77JJ61p9j26J24J57r0j74J37q1j33J34L57k39l71J80L33
7838A94j96j32K49J10l31j37K61J59p9j29R7p5j39K27J36k49o6J42K1k46N7L23
7860A97ql09q1K57J2j54J11P9j51j24J21J04o6J4P9j06k20J83K24j21j41J65N2
$$ y = [53, -284, -121, 324, 239, -189, -133, 96, -43, -106, 53, 166, -48, -110, -51, -37, -96, 63, 289, -49, -328, -57, 225, 73, -179, 131, 223, -241, -285, 104, 224, 28, -80, -25, -135, -66, 126, 152, 17, -83, 48, 110, -135, -17, 350, 112, -268, -233, 188, 107, -124, -5, 166, -73, -270, 21, 119, 26, -46, 58, -119, -250, 1, 243, 34, -255, -1, 113, -128, -116, 205, 226, -135, -204, 30, 104, -58, 94, 159, -23, -188, 55, 163, -86, -18, 184, -15, -361, -152, 259, 119, -183, -94, 129, -73, -185, 142, 259, -47, -158, -33, -49, -45, 53, 125, -67, -224, 22, 179, -30, -51, 173, 167, -177, -215, 225, 280, -97, -96, 65, -14, -140, -16, 141, 51, -123, 14, -67, -200, -66, 291, 52, -319, -139, 194, -2, -134, 115, 225, -106, -243, 18, 177, 98, -31, 66, -9, -148, 79, 215, -34, -100, 42, 63, -183, -126, 197, 189, -120, -201, 56, 68, -86, 25, 104, -47, -171, -50, 54, -12, 2, 81, -25, -245, -62, 162, 41, -100, 65, 117]
7883A17j82j35K80J55k15j91K02j0p2J30Nj46k0Q0M4p2J6J95j78k22J14K50m8
7906I7j91L9Q8m7j10J07J46m8r1l8noR8J26j32j78J96Q0j67r2K49K5j95j20J96
7931B7J12j44l0M7M0j26N8M3n0N4m1nj51J53J44l7k31J10J01j06p6L1J75q9r2
7956h3M3O9n8P5qn3j3L0Q2j13k0J56m2j70kJ87K2q7j84J56J02j33l3Q2M6nj02
7983e6O0k8N6Kn1p9Q6J29j22j39J06J71q9j16P4J29j03k7q7Q7M5j1K6r6j1J19
8009G5m9j57J5J91L4k48P2Q6L9m2j29J24M5q8PN0j8O7n5Rr4R6M9q6m5M8M5k0j21
8038a00R6Q1n5l6LJ05j17K8K1l5M1n9l6mR2M4n9rm3PJ04p0n9P8n4K5q6Q3R1j52
8068g5OM8J5N3m1m7Q7kJ9j06J0N9L8q7j02J64J6oj17J6J01Lm4o7M8J8j1m5P2K1
$$ y = [117, -65, -200, 80, 235, 20, -171, 31, 21, -51, 79, 84, -62, -82, -2, 42, -30, -14, 181, 3, -219, -105, 145, 97, -94, -55, 33, -14, -124, -17, 129, 81, -10, -48, -53, -59, 39, 165, 33, -145, 51, 131, -36, -128, 121, 146, -49, -169, 27, 139, -5, -35, 12, 52, -74, -16, 27, -23, 31, -10, -15, -166, -13, 131, 94, -137, -27, 74, -32, -108, -77, 98, 9, -83, -40, 29, -29, 46, 38, -15, -28, 2, 84, -29, -49, 107, 65, -105, -107, 80, 102, 15, -169, -13, 89, -44, -77, 5, 51, 46, -56, 4, -24, 32, 34, -17, -96, -10, 119, -3, -142, -36, 135, 46, -70, 4, 133, 30, 3, -84, 3, 48, 37, 63, -33, -44, 75, 26, -131, -116, 75, 109, -139, -67, 19, 58, 16, -113, 11, 56, -32, -25, 25, 7, 74, 19, 28, -66, 30, 79, -7, -52, -4, 41, 21, -100, -4, 77, 22, -14, -11, 94, -23, 5, 26, -9, 32, -27, -63, -67, 25, 69, 10, 1, -42, -35, 69, -1, -60, 18, -36, -11, -97, -14, 77, -75, -69, -21, -6, 47, 6, -41, 46, 44, 63, -43, -33, 26, 64, -23, -125, 39, 55, 49, -68, -52, 49, 52, 8, -59, -11, 7, -4, -49, 23, 44]
8098D4q8O9m9j3J63q9k8l3O2kp2K5L4P6o7p9O4N0Jr0m6K8M5J3n9j1M2K2op9K6
8129d7J15r6n4jJ68l9m9j2P5Qo1p3O5Q7q9O5j06R3L4l5j16j3J51n1r5L0O1K8q4
8158d1L8n7O9N5q1J5k7NQ9n2n8M7Q2j15o4O7J37p0l4pO3j0n7NP0m4Qm3p6P5L5
8189B4p9l2
$$ y = [44, -44, 25, -24, -37, 126, 37, 9, -24, 38, 36, -36, -11, 23, 99, 32, -47, 17, 67, 68, -22, -68, -40, 5, 18, -41, -52, -10, 12, 6, -73, -47, 68, -28, -82, -83, 85, 46, -3, -15, 60, 68, 7, -66, -1, 86, -3, 62, -44, 49, 83, 48, -68, -81, 70, 19, -76, -46, 15, 43, -41, -3, -60, 9, 64, -17, -2, -29, -24, 65, 13, -45, 2, 84, -31, -95, -28, 109, 39, 5, -2, 61, 51, -6, -1, 69, 25, 33, -10, -86, -11, 24, -55, -87]
8191h7
$$ Imaginary data points
##PAGE= N=2
##DATA TABLE= (X++(I..I)), XYDATA
0@%%%%%%%%%%%%%%%%%%%%%%%%%JlOqQj0J3j5J8k0K1k3K6l0L3l8M3m6N1n6O1o7
47c5P4q1Q7r2R6r9R7q7O1Mj64N92k092J4307R6056o5971j17156L8196O8714l8726
67f219l9705N3170L4086m2289l2941J162o080K9044O5614k1097j07510p802J06308
80B5741J4894r2360P009R8587k3315j20643P900J20411K3753p7795k7684K4682
92a8820p60M299L2679m997l2146J8161J8883n5896k3499R8407N9488j03340q7506
105i5047P8636Q3031n4881n2158N8894L5623o6530m0414M9182M1973o092j0192
117B2025k5630m0507K4877P4634q583p6539J0721P1351l3026q5879M5438J10900
129H9782k7226j13328l059Q0378J1487l8671N191J6296k0341j1184J1487o910
$$ y = [0, 0, 0, 0, 0, 0, 0, 0, 0, 0, 0, 0, 0, 0, 0, 0, 0, 0, 0, 0, 0, 0, 0, 0, 0, 0, 1, -2, 4, -4, 4, -6, 7, -8, 10, -10, 11, -12, 14, -16, 17, -21, 22, -24, 27, -29, 32, -35, 39, -42, 45, -47, 49, -50, 47, -40, 21, 25, -139, 453, -1639, 12668, 108724, 42753, -74403, -36207, 32507, -6219, -45924, 7246, 41332, -957, -33898, -32736, -38816, -9772, 55842, 34745, -72765, -80567, 25741, 40635, -51725, -44716, 53871, 30556, -90087, -82187, 38224, 61977, -15818, -43502, -18820, -19580, -15281, 17398, 12401, -19745, -1584, 17299, -38597, -62096, 36311, 95799, -7541, -95047, -16411, 66620, 11739, -40419, 18475, 54098, -12432, -52846, -3664, 38309, 32217, 22025, -3605, -44112, -19235, 55399, 46816, -29723, -19002, 52349, 19323, -66556, -21118, 89782, 62556, -50772, -53831, 26547, 38034, -637, 4554, 20850, 509, -10675, 812, -6098]
141f098M429M6118j463q5893k6755R5053M9395q0872m8358O7302L0469p2206k6489
154e5368P4741L7012n5237m2323J5417K0511J4325J5098k0815l8876J7425M1905
166B3815k7185m3642M7982O1362n6685q4643M1471R0225j6903o9882P042M3772
178A6729j2031k9896J3788K4342R46o428j8064k7816J8633O0986p69p2981j4797
191d7358O8883J5287o5849q506P2769J3155p4171k7740N6974L6809k5042k5905
203a0694k46N818J1734P970j7885j0581L3170J6554n2473l4052O0787N5319n1009
216A4412o3929L3943N6277k4317m4746K0910L8713j3490l4880m280J9778K1463
228A9854O015k7044l1780J9894M5247j2908m9998J1860N4973j1713o3533K879
$$ y = [-6098, -1669, 44449, 42986, -42907, -69662, 25391, 74786, -6086, -54444, 12858, 43327, -28879, -55368, 19373, 56385, 1148, -41175, -25758, -5247, 9078, 24176, 3361, -35515, -18090, 23815, -3370, -47012, 970, 62332, 5647, -78996, -37525, 52700, 35797, -34085, -27043, 16729, 4698, -25198, -11410, 12932, 13878, 7450, -10614, -38430, -19797, 41189, 40420, -32561, -47358, 21525, 36812, -29037, -37543, 35226, 48381, -25790, -53530, 3444, 40253, 15211, -10694, -10940, -5122, 6612, 14582, -3303, -13884, 19286, 35840, -16633, -50685, 10102, 65421, 14412, -49517, -15574, 40703, 16386, -28360, -7450, 31263, 17773, -17107, -21387, -1609, 19854, 25869, -1175, -32955, -13061, 32186, 19278, -30720, -18860, 36113, 24400, -39133, -36254]
240c6254O6096J2370n4862k3713L4048K3578j4913j7561K072J3721R538j3211
252I09k6307P963M3685N687n3318k2713N0624L3126m2329l5900L5070L6006k8697
265C806l8148J7732L8320m17l0355j6219J4494K6212L184k8383j5969K8921K6291
278B9469k9262l6355K7197M7547j8049n2993M628N0111Q249m0025j5986K8321
290B852K0464j6800k4371L593K7132J2307k5145k8345J6734L9327n055m3748n801
303b6856M3167J4538m0243k2396L4572K9885k4202l4645J0147L4084M668k7693
315d974j6691J8500K5166q363l1101k359L4290J4028l3685k5889K7870L4255j8232
328A2815l8448O656L7545L896l3701j4054K6639K2453j6862k8960M169L1309R030
$$ y = [-36254, 29842, 42212, -12650, -36363, -2315, 21263, 6350, -11211, -9139, 4582, 14120, 909, -25398, -17435, 26250, 31937, -21381, -44094, 6530, 39656, -2673, -38573, -3503, 32503, 3806, -34342, -16610, 21710, 21293, -9062, -25281, -10787, 15425, 18609, -9774, -25743, 3178, 29469, 207, -36148, -8951, 38596, 20547, -32446, -27818, 22293, 30542, -9483, -25469, 2852, 23316, 6516, -17855, -14262, 12870, 25177, 32, -28313, -11579, 27748, 22693, -21055, -26856, 16311, 30849, -9394, -31790, 2782, 32667, 8465, -26180, -16033, 18051, 22719, -4974, -21665, -3165, 22001, 13638, -17463, -19822, 14468, 28496, -5189, -31078, -3208, 31047, 12815, -25633, -18977, 18568, 22464, -11237, -25291, 1348, 23801, 6939, -22021, -17852, 13457, 22487]
341B2487k9104k0876K3016K9850j4388l5243M526L7534O438l5564j6880K9588
353A384K5941j9864l1350Q226L3016L998l0785j5287K5112K4805j6590l1575N781
366a7188L4535N675l3264j6659K7838K5588j9517l1544R084L3905K432l2398j3333
379b4846K7224K2876j8683k9251Q408L2428L060l1233j3811K6806K3032j8886
391G124k9373Q963L2431K084l1716j2797K6981K1943j9463k8629R391L1649J367
404A9955l1374j2250K7068K1377j9904k8295J0139L1694P01l1592j1403K7722
416C838K0892k0571k7889J1225L1659k79l1763j0253K8159K0033k1251k7265J1932
429a1533L1414j187l1914r774K8653J9456k2303k7074J3112L1360k853l2193p950
$$ y = [22487, -6617, -27493, -4477, 25373, 10985, -24258, -19732, 17802, 24240, -11324, -28204, 1384, 27325, 7461, -23889, -15663, 17353, 21351, -9434, -24721, 391, 25196, 8606, -22969, -17188, 17347, 23022, -10242, -26901, 937, 26525, 7008, -24536, -15452, 18453, 20885, -11513, -24846, 2378, 25254, 6571, -22680, -14272, 18156, 21216, -10017, -23828, 2978, 26010, 7124, -22249, -13286, 19145, 21229, -10487, -23284, 3697, 25640, 6177, -22452, -13061, 18588, 19955, -11419, -23669, 3399, 24776, 4872, -23423, -13284, 18410, 19111, -12481, -23884, 3838, 24730, 4159, -23730, -12505, 19154, 18875, -12888, -23141, 5018, 25051, 3800, -23465, -11533, 19881, 18694, -13220, -22994, 5659, 25115, 2812, -24262, -11150, 20210, 17357, -14836, -22786]
442b2786K9142J7441k2685k5102J3582K9273k723l0171q022K7598J7989k1442
454B094k5839J2988L1168k712l2378p507K9994J6988k4140k3887J5941K8181o159
467A4732k9046m587K6577J4702k0608k3179J1634K8356j579l0154q849K8759J7944
480B4702k4722k5797J7846L0973q535l2536j671K9725J1142k3268j8128J4837
492e432K3026m997k5363n721K5428J6928k1538k6763J4263L2987n166l4903l469
505b0720L3295J0696k9702j7206K3056K2574j3410k5199R08K2900J0844j6604
517A432j9934Q625K5785q11l0171p208L2890J6687l1730k5669K5522L1083j5552
530A0949l0663O368K6398J140k0855p861J4582J5629n165k2427p915K4169K1359
$$ y = [-22786, 6356, 23797, 1112, -23990, -10408, 18865, 16142, -14029, -22051, 5547, 23536, 2094, -23745, -10757, 20411, 17699, -14679, -22186, 7808, 24796, 656, -23231, -7290, 20891, 14732, -14314, -18901, 7676, 22378, 1770, -21409, -9775, 18581, 17002, -13152, -22001, 6758, 24702, -20, -25817, -7971, 23002, 14467, -18069, -19740, 9985, 21127, -2141, -20269, -5432, 17594, 12597, -12766, -18487, 6941, 23869, 2331, -24432, -10169, 22818, 17652, -17251, -20720, 12575, 23271, -6431, -23637, -581, 21993, 8583, -16616, -15708, 7192, 18036, 1432, -18502, -9877, 15908, 15097, -15074, -22282, 10608, 27295, -4435, -30104, -4582, 26501, 10949, -19714, -13346, 13052, 14192, -6663, -14524, 58, 15687, 10522, -11905, -19820, 4349, 25708]
543B5708k0497l0453J4131L4253r415l6130N463L7311P24l6053r582K8208J6550
556B0218j4762j7205J022J3132Q871q726j6370O446K5737k657l5657n979M1246
569A5316J7481l8038k4793K9791K4881k2524k1628J7663K0146j0813j9513j569
581a3600J3037J5100O47k2542j6150K1668K5687j9349k9235K0411L2991k2211
593F454m0101J7825M4572o242l8868m213K4519O729r987l609J602L421N703p987
607a82j8677J0163L5937l092m7162r358M6333J6408l9329j4657L5378J1049l5202
620a2391j3755K9454J8766j3497j6095n851K414J6765J3129j8223k0210J9722
632B28K0956k7799k5279L6496L7118l4558m6204K1838M2447r717k7938P739J5414
$$ y = [25708, 5211, -25242, -11111, 23142, 13727, -22403, -16940, 20371, 21095, -14958, -24540, 3668, 20218, 5456, -11749, -10727, 2405, 11276, 2550, -13820, -7374, 18363, 15706, -19951, -25930, 15316, 32797, -5241, -30034, -243, 24638, 2114, -19514, -1851, 18295, 7482, -12031, -13600, -563, 14537, 15184, -7358, -23508, -1840, 23847, 4498, -24737, -4326, 28665, 6454, -33647, -15822, 28750, 22508, -16360, -20573, 3946, 10675, 688, -2921, -1319, 2102, 7805, -182, -18859, -8696, 27241, 24149, -23013, -32371, 13962, 30370, -8959, -23616, 11762, 22811, -12391, -26146, 3308, 22074, 8577, -7518, -13369, -10955, 5810, 18939, 716, -19494, 228, 21184, -6615, -31894, 4602, 41720, 7162, -39042, -17204, 25243, 15526, -12412, -4673, 10741]
645A0741j0080j0855N694O006O650R177j5438l1529J0701M6631P36m7403n494
658b4463M1907l6m2984M281M8618K380m5621j3587K7490J4543m453j852q270j1554
672a3601J0750J4267j5995j0241L1627J4382m7367k9426M8741M1958l5871l9029
684b9805K4313K4993k4063j5795K6582J6347j8041j4916j503r93J5491K5504j3888
697A4226m1616N005M1944n035l8240J5157M4221k0792n5073J1657N4583L392l6004
710f575o533J3141l992j709J3655j57r835Q184P74k9246k954M9744J8851n3660
724a0312l2005M2218K8653l3731j5929L6915J0737m0752j7389K9523J9979n770
736A2137n796j1631j8183J2520L2545p129l1335J2550K9002k7303l8698L4768
$$ y = [10741, 661, -10194, -4500, 1506, 8156, 17333, 1895, -29634, -18933, 27698, 28434, -18969, -24463, 17444, 17408, -25576, -21295, 27323, 29703, -15918, -29505, -2015, 12528, 8075, 6223, -2047, -13601, -2851, 11416, -4579, -14820, 16807, 31189, -16178, -45604, 3137, 45095, 9224, -29805, -5492, 19501, -4562, -20357, 6225, 22572, 4531, -10385, -11888, -12881, 2610, 28114, 14226, -27390, -22385, 19559, 14524, -23716, -8559, 35662, 14870, -40203, -28546, 26037, 29429, -6575, -13108, 33, -3959, -5668, 7987, 7830, -2005, 6179, 6953, -22293, -25247, 24497, 43348, -10312, -42317, -99, 28554, -5177, -21106, 15809, 26546, -14206, -31595, -2072, 17907, 12137, 6341, -5290, -23473, -10953, 21592, 14463, -16872, -4322, 24680, -2623, -41321, -6553]
748f553N4013k4550n5875Q365L9204m050j8836J2528J0426j7464r835Q045o6N191
762E43K3793n306m6648q736N1971J9440m3780j5084L9280L901m5820k689N0370
775B1235J3014l8064j8469J3737P141M580J2613p196k2598O192J9477j5961j7642
788b1941L4077K8950m2836m5411L3849M8857j9046l5702J5027K0125k1265j6112
800b1428K1796J7247q242q398q047j4756J0954L6587p71m2838o463L8141R03l8102
814b3417Q609M7417o444n3101n890M2423J3637k0543o289M332p181j43J2095k745
828B760p283J5899O019l5119j7311M4585L2364l8587l6910K7973K7896k5423j8816
841b1953K8943J8719k5694k1344J0358J3720O524N604j1737k3707P049L0152m858
$$ y = [-6553, 47460, 22910, -32965, -24600, 14604, 10554, -8282, 4246, 14672, -2792, -12627, -4582, -4648, 543, 24336, 19030, -27618, -36354, 15617, 35057, -8723, -23807, 15473, 19374, -26446, -29135, 21235, 34249, -3815, -22284, -8547, -1406, 3174, 15787, 8591, -14007, -7815, 11662, -4299, -21941, 12136, 41086, -1750, -47161, -13312, 35545, 16499, -19203, -4176, 15949, -5316, -21428, 368, 17615, 9373, 975, -7072, -21828, -10874, 25713, 24942, -17896, -24359, 13782, 14685, -23417, -14808, 32609, 26165, -26936, -32826, 9597, 23234, 2691, -3598, 734, -6447, -6590, 5505, 2760, -4523, 11376, 17395, -17724, -35035, 9550, 41914, 3327, -33583, -5610, 22286, -3137, -21953, 6990, 25709, 15, -21329, -10971, 2749, 9273, 14877, 3140, -20567, -13518, 16634, 11776]
854A1776k8867J1644L2780j8976m3333J5873M9562l654m1894m713K5255K073j2945
867e419M602Q233m184l281k601j0932M767K9009L569l9138j5664L7171J9858l1570
881e580j5699L1254J2669l3525j6299K8874K1054j4320j6796j139L909Q619Q599
894A1620r200j3832J1992J5499j9604k1968K5905L2659k3033l9570J3146L6273
906A9887n578k6943M147J9329m364j5659l90R533Q274L413j1914j8878P516K8802
920A7175P8l0980l236L0618K801l2607l981L4633J0076l0252j6098J8968J5814
933A3009o088r835j942L351O557m85j2563k044K0876Q185k6805j7887K5820K4934
947B5083j9981k5837J3978K3051j0620k0682O864J9209J67j4760q546N553J3732
$$ y = [11776, -17091, -5447, 27333, 8357, -34976, -19103, 30459, 26805, -15089, -19802, 5453, 7526, -5419, -817, 7416, 3232, -49, -2650, -13582, -8815, 20194, 23763, -15375, -31039, 6132, 25990, -5580, -21279, 9975, 22644, -10881, -27180, 1694, 22748, 8428, -8368, -9507, -5598, 3021, 11620, 2420, -11412, 580, 16079, -3525, -25493, 412, 33071, 10038, -29532, -16386, 19887, 14309, -12634, -8487, 10842, 6478, -9181, -9571, -38, 8236, 11649, -265, -19143, -11627, 17175, 17253, -13727, -16963, 13655, 16456, -16151, -20132, 14501, 24577, -5675, -21773, -2805, 13009, 6921, -2914, -4856, -1505, 5052, 4567, -7996, -10040, 10836, 19021, -7784, -25671, 149, 25083, 5102, -20735, -6757, 16294, 5674, -15008, -8144, 11065, 11232, -3528, -12074, -6521, 7211]
960G211N993j3594j4647J1115J9648r245k3251P976K7540m400l0229k443K8298
973I972R137k1352j2806J2823J2644n393j1789j426J1112Q974r240j7434M069
986a0709K3437L493k5137j0298K3033J4752j9598j7038J5869J9100j0517k0071
998a3684L034J8606N169j3209j1597O055J4994J227j6392p382J6562J3107j5441
1011A049j8817J1774K2778n731k4040r27K1501O596j7313j0688J1819J3834n530
1024F305j5888j723J5864R307j3101j5682Q303J9926k497k1355l175K1002Q662
1037A5948j8514j3579J4172J7425p944j8995O11J8063O307j5008j2073J0148J6353
1050A2914m542j9039k014J9266Q572j7330j4326J2988J8286p164k0168Q93J9730
$$ y = [7211, 13204, -390, -15037, -3922, 15726, 6481, -16770, -8794, 18746, 14346, -15883, -18326, 9972, 19109, -2243, -15049, -2226, 10418, 5025, -6764, -8190, 2922, 11896, 2656, -14778, -10709, 12728, 16221, -8916, -19214, 3819, 18571, -1027, -18065, -2196, 16904, 6387, -13684, -10650, 7956, 13125, -84, -11681, -5626, 9368, 10595, -5797, -13179, 3383, 16490, 1049, -17768, -5994, 16784, 11053, -12987, -13914, 7587, 14183, -3130, -13818, -1999, 11835, 6305, -9583, -11306, 4558, 13865, 764, -14918, -6615, 13311, 10814, -10541, -13716, 7286, 15948, -2566, -16145, -1973, 15452, 7508, -11487, -10876, 7187, 13494, -1514, -13587, -3439, 12914, 8372, -10667, -12681, 6585, 15157, -2173, -16499, -3511, 14775, 7611, -12557, -11664, 8066]
1063H066N577j7256j1159J2914J5677o909j8155K85J8460O443j6296j2173J2353
1076b173J6668p062j9067Q12J9308N554j7511j1251J3410J5499q006j8166J648
1089a0337J8417M691j6687j0615J3021J5153p803j7986J734J8575M704j7047j0316
1102a4496J3560J5068q466j7790K592J8498L957j7217r615J3778J4460q875j7430
1115a1976K826J8407L496j7314r531J4029J4342r379j7523L320J8723K701j7692
1128e571q771J4625J3673r922j6893L975J8142K478j7114q489J4344J3532r598
1141D411j6969L969J8634K297j8084q201J5598J3086j1128j6348N453J7665N24
1154A0907j7007o468J4240J1597j0001j5422M092J7242K113j7010q182J4845J3039
$$ y = [8066, 13643, -3613, -14772, -1858, 13819, 6910, -11245, -10960, 7500, 13943, -2353, -14526, -2173, 14495, 7433, -11634, -10822, 8486, 14040, -3471, -14722, -1312, 14187, 6181, -11985, -10337, 8080, 12771, -3916, -14531, -1510, 13643, 5840, -12146, -10412, 8163, 12867, -4180, -14496, -936, 14132, 5666, -12124, -9532, 8966, 12923, -4294, -13909, -131, 14329, 5454, -11976, -9150, 9257, 12753, -4561, -14092, -63, 14279, 4900, -12623, -9303, 9420, 12121, -5571, -14342, 283, 13956, 4034, -12859, -8884, 9258, 11736, -5378, -13867, 477, 14009, 4411, -12558, -8589, 10045, 12342, -5742, -13943, 1655, 14741, 3613, -12735, -7282, 10383, 10907, -6100, -12568, 1672, 13269, 3268, -12154, -8062, 9180, 11293, -5717, -13899, 946, 13985]
1167A3985j1137j6572O277J8624q15j8234m932J5870R957j1187j3390N630J4971
1180I047N77j4778o437J3021J2197r691j6830M778J9390R99j9584o571J7451J0646
1194A4215j3906j3672R160J5390l579j5604k958J3244R432q846j4009K980J6476
1207H323K914j7145q110J6854J3071j4910j7354J0884K0215n026j9652r16J6236
1220E384N471j1450q622O422J1088p08j3139o443J3247J3706j0266j9475N286
1233i499K1634p18k1519k614K0387N573j8463r211J4158J2334o794j2405j554
1246h691R153Q209m373j2016N82J5379K764j9038p410K1487J3555j9909j8436
1259a8744J4548J9270q703j6521M625J3148j648j0723l216O777R358O29j3564
$$ y = [13985, 2848, -13724, -7447, 11177, 10362, -7872, -12804, 3066, 13023, 1836, -11554, -5924, 9047, 9624, -5154, -11591, 1430, 13627, 3936, -12894, -8116, 11274, 12273, -7311, -13882, 3569, 14215, 309, -13363, -4203, 11187, 7608, -7996, -10954, 2290, 11722, 2876, -11133, -8153, 8323, 11237, -5908, -14018, 2836, 15907, 997, -16357, -5473, 14742, 9716, -9936, -10852, 5384, 10855, -595, -9217, -2795, 8293, 7585, -5554, -11997, 1250, 14956, 4690, -14785, -9499, 12135, 11417, -10102, -12716, 7671, 13244, -5219, -14430, -272, 12062, 5268, -7137, -8691, 462, 8671, 4298, -7718, -7136, 8243, 11007, -8031, -15441, 6046, 19601, -308, -18744, -4196, 15074, 6371, -10150, -5525, 7623, 5975, -4748, -7964, -1187, 8171, 8800, -4764]
1272d764j0339J2962J7788r410k1041P043K2151o548k3789M763K5794L90k3531
1285h531o332J5777Q872n936o437j345L299N805k653j1178K711J9188P22k6339
1299a2377q060K7333J4307k2846j5427J8038J2336j6028j0691J3858J1566p452
1311D557j0447k650L217J0575P494j1975j5205J0435J7533j1236j8519J5084K2938
1324B1801j5889k8372J0392K8321k337k0475j184J0303q60m231K437J077Q43N106
1338F932n685j6596M472K7500K556l0685q915K6896Q726k3798m905K4878M676
1351A6052k4824r248J7626J1378m328n197n966n286Q835J1920r066j1997J3866
1364C765J2444k2296j8611K5756K7200k0412k8912J1545K1338q102j2162J0161
$$ y = [-4764, -15103, -2141, 15647, 6237, -14804, -7761, 14390, 7842, -15947, -11184, 14610, 15000, -8531, -14863, 914, 9786, 3850, -2587, -3932, -633, 5172, 2519, -8659, -5948, 13240, 13962, -12377, -20437, 6896, 21203, -1643, -17070, 968, 13304, -2724, -13415, 443, 12009, 4557, -5890, -8540, -5323, 5252, 12746, 771, -14434, -3999, 13534, 2298, -16221, -1137, 21801, 5912, -22460, -12068, 16253, 13916, -6559, -7743, 2560, 1700, -2531, -94, 983, 1826, 6932, 1247, -15349, -10877, 16623, 19179, -11506, -20421, 6475, 15201, -8597, -13502, 11376, 16052, -8772, -18020, -394, 10984, 6656, 1459, -4507, -9793, -958, 10962, 1896, -10101, 3765, 16209, -6087, -24698, 1058, 28258, 7846, -21066, -9521, 11817, 3715, -8447, 1714]
1376A714Q151r856p302K342Q59O485J2792p918k5786J839K9774K989k6765j98
1390a0880K5886n065k9958M176L2400L132k4802p584J0307K736J001O498m051
1403C796j0334N389P281j3403o017K5511J2840l1689k2794K6777K5035j8460j7980
1416a4048J6176J0146j9012r232J7314J1074o536n761n421q348Q992K1525m436
1429A2433k5128K379K2723p772k4067J4407L1385j2502l5716L413K8708K542j4747
1442a942J006M631p995k296Q237l73k086J0851q36k5470o012L3111J5587k9540
1456c127j7621K3111J1056k2781n406K6518P558k3761j1751J1386P965K279M952
1469A0378p310j6419N109J8744n755j6270J3804J8910k1658k8101K0057L3664
$$ y = [1714, 9865, 9, -7293, -4951, -4092, 2393, 15185, 7267, -18519, -16680, 13094, 16083, -10682, -10880, 15006, 9941, -20017, -15841, 16559, 19691, -5111, -12695, -2388, 348, 1349, 7847, 3796, -6538, -1149, 6132, -7271, -13288, 12223, 25063, -6626, -29420, -2643, 22392, 3932, -14048, 2128, 12274, -6738, -15970, 1344, 12418, 5882, 121, -5300, -13648, -4656, 16869, 12433, -12695, -10316, 12407, 4635, -19432, -5025, 26360, 13858, -21858, -18445, 10263, 12805, -1942, -936, 3695, -4300, -6596, 1641, 1268, -818, 10033, 9197, -16273, -22285, 10826, 26413, -3127, -20748, 2363, 13419, -9362, -14768, 11750, 19308, -4453, -16204, -4818, 3147, 5426, 10378, 3068, -13351, -8242, 10502, 4747, -11523, 2281, 21191, -467, -28568, -8511, 25153]
1481B5153j0739k8314M441J6163o806q310J0871P242q000m702p82o532N493K1661
1495A6839n35k9683p302K7953Q271k4065k508K6182o00l0507l952K7835J0114
1508A8042j5670q272K394j158L013R300l262r826O776P602j6777j1317K5229K0736
1522B6810k4492k7058J6650K3674j1357j5206J2608J0588j4099j1227Q999R103
1534D993J320J119p238j4657M883K2504m5k2235N50K1277n549k5036P131L0035
1548A9052j673k8306n037J8125N291p220L76J898m765k01L387n329p98J5536L937
1563A4273k4054j1938K4617J7501j9474j6146J6264J1653j6882j0328J6592J2434
1575A4512j0121j1441J86L837O308O497o580j2772N251J3959p445j5453J1648
$$ y = [25153, 14414, -13900, -9459, 6704, -102, -8412, 2459, 9701, 1701, -3001, -3783, -10315, -4822, 16839, 16304, -13379, -20681, 7272, 15543, -8522, -11030, 15152, 14552, -15955, -19907, 7928, 18042, 2372, -5900, -3506, -4664, -1651, 7649, 4387, -5439, 1337, 8939, -7838, -19155, 6074, 26810, 2318, -24740, -8090, 15584, 4227, -10979, 1629, 12217, -1882, -13109, -4110, 4993, 6313, 7432, 194, -14463, -9580, 12924, 12879, -9356, -8806, 12471, 6922, -18114, -10983, 19052, 17379, -10927, -15964, 2161, 7452, 232, 608, 2506, -2259, -2460, 927, -4402, -5200, 10336, 14273, -9781, -21719, 2898, 20399, 925, -15221, 1043, 12696, -4186, -14514, 2078, 14512, 4391, -7050, -6864, -3027, 3281, 9778, 3198, -9574, -4323, 9636, 2191, -13262, -1614]
1588a614K0435j2173k5840O785K5468n01j9035j458J1476l86p311Q86M509K228
1602C469J482m918j1050L053J9088K753k1143p239J9562P509j8335o315J9015
1615F931P728j7834j0882J1866J1306l270o948l169N09N589L687p269n612J0560
1629C192Q351j4409j3719J4792J8880j0985k0036N978J7210l163j3306J953J0853
1642E591M77q186m507K826P856N118p730j1748M672J5353j940j6456O88J7563
1656I577N56j8914l679J7997P666j3648r909P125R000j657o447k525M499O074
1670E715k763j0449l06J4335N197j5482r943J3552J2937j0279j3449P434J3046
1683I545m483j2515P37J0991M050p205p960J768R369L854r240p890Q019J1021
$$ y = [-1614, 18821, 6648, -19192, -12407, 13061, 12560, -6475, -7933, 3543, 3157, -4154, -3268, 1241, 3469, 4951, 33, -11017, -7964, 11124, 13877, -7266, -14505, 5057, 12566, -5769, -12084, 6931, 14659, -3175, -14057, -2191, 9115, 5845, -1103, -4272, -3763, 1826, 5513, -1756, -7368, 3192, 11543, -2866, -16585, -1793, 17087, 6102, -13934, -7956, 9254, 6091, -7215, -5262, 5591, 6068, -2118, -6625, -3799, 4057, 9175, 1445, -10303, -5631, 9722, 7782, -8674, -7986, 9577, 10133, -8781, -12460, 5537, 13203, -445, -10354, -3229, 5771, 4114, -2333, -4858, -359, 5715, 2952, -7497, -7803, 6532, 11729, -3753, -13696, -144, 12793, 2514, -10935, -3501, 9545, 5062, -7453, -6716, 4275, 8325, 1120, -6840, -5072, 4297, 8151, -1089, -8979, -960, 10061]
1697A0061o855j3847M577J5853j065j6233l121J3995O459j0106q226N761R023
1710F276j715q935k733Q332P417o089j1332K623J3587J658j3882n211J2703Q053
1724A0752j0623j0242P609J1863l674j2151r98J0706N140p892q416M036J0414
1737F524k24j1203l856J0827P700r211j0840O225J2784k314j3129j601J1952N231
1751H865r603p989O365J0102k233j0962k073J0397O288q406r550N316J1599j717
1765F399j2335k160J1741N726r910q881O870J0775l075j1540j107J0859M961q922
1779e99q280O071J0506k400j1535j413J1115N459r551q426O797J0601l087j1613
1793f355o75J1275M481r601p683O786R994l288j1207n89J0901M369r511p762O860
$$ y = [10061, 3206, -10641, -6064, 9789, 8724, -7509, -10630, 3365, 9824, -282, -8508, -2747, 6276, 4561, -4374, -7107, 1225, 8642, 2553, -8779, -6156, 7431, 9089, -4793, -10004, 2699, 10752, 129, -10113, -2504, 9359, 5685, -6466, -7464, 3242, 8382, 490, -7926, -3890, 6524, 6300, -4903, -8759, 2068, 9768, 557, -10283, -4058, 8726, 6412, -6717, -8318, 3634, 8865, -738, -8727, -2362, 7740, 5507, -5455, -7528, 2869, 9157, 751, -8799, -3483, 8116, 6399, -5936, -8096, 3645, 9371, -539, -9420, -2550, 8225, 5150, -6390, -7497, 3362, 8323, -599, -8879, -2808, 7698, 5298, -6237, -7650, 3465, 8924, -627, -9053, -2256, 8345, 5258, -6355, -7030, 4245, 8726, -875, -8558, -1772, 8222, 4934, -6273, -6862, 4039, 8408, -1103, -8865, -2005]
1808b005J0149l510j1385m43J1303M179r918p408P292R810l857j1014M7J1057
1822D297L827r604p134P125R772l645j1220k7J1320L825j0064p221P614R763m407
1837D221j1086O02J1003L132r831o497P371R012m094j0649K82J0800L628r741
1851a847p110P474R829m496j1229J065J1600K509j0595n697Q448Q329n099r780
1865f599J311R949K639q883o229O949R015m130j1146P15J1925K981j1474o343
1879i320R365Q773o524j0134L157J0268L73r498l896P490P240m234r504J74J0519
1894D249L797r953p094Q678R758o660j1700L941J2814m56j2106l136R599N827
1908G558o062p264K194P666J510p579n575O733R411m556j2571J091J3798K390
$$ y = [-2005, 8144, 4634, -6751, -7194, 4109, 8288, -1630, -9038, -1746, 8064, 4207, -6807, -6760, 4297, 8124, -1480, -8614, -1489, 8283, 4638, -6582, -6609, 4711, 8536, -1528, -8749, -1135, 8628, 4221, -6865, -6263, 4740, 7872, -1959, -8456, -1085, 7927, 3833, -6816, -6534, 4266, 7894, -1847, -8957, -1483, 8346, 3850, -7379, -6314, 5286, 7795, -2800, -8497, -49, 8280, 3181, -6599, -5288, 4661, 7300, -1583, -7812, -863, 8152, 4022, -7124, -6409, 5516, 8497, -2977, -9320, 45, 8818, 2294, -7840, -4683, 5585, 5958, -3540, -7436, 54, 7294, 3060, -6444, -6270, 4249, 8046, -1907, -9001, -323, 9435, 2775, -8925, -4984, 7830, 7374, -4732, -7868, 1731, 7558, 1496, -5768, -3574, 4092, 5602, -1977, -7552, -819, 8592, 4036, -8535, -7444, 6354, 8744]
1922H744j3096m848J1385O353r276p623O621Q669k539q188k366N973O505k197
1936D117q705j462R784M213j0571o843J1154R889j0218j2699P093J3321l096j1535
1950e558K8Q384J528n496l270K729N474J381p338o966P030J1916m304j4397J547
1965g312J4630r8j4244o60J4378K526j3136n278R039O870k915n468k355K187N408
1980C572K37p560j278J0600L022j4340o923J5482J1161j3061j2767R029J0885
1993H059o432q225N363O831l134n652j570K111O280M559p622j0823N929J3697
2007I371m263j3767M927J4642n890j7041M113J7798J56j3925l236O929K272j280
2021H06N21j600j244L951l60r266N26J5734L181j9053q188J7153J0009j3542p627
$$ y = [8744, -4352, -9200, 2185, 8538, -738, -8361, -1740, 6929, 4390, -3798, -6164, -191, 6314, 4117, -4588, -6050, 3734, 7947, -2624, -9467, 1687, 11576, 1358, -11341, -4248, 9073, 5977, -5558, -5530, 2854, 4382, -1114, -4384, -1655, 3819, 5200, -2138, -9104, -2074, 9842, 5538, -8859, -7312, 7318, 7220, -7024, -7684, 6694, 9220, -3916, -9194, -155, 6715, 3800, -1668, -4023, -1836, 3572, 3809, -3751, -5029, 5571, 8593, -5747, -12670, 2812, 13973, 912, -11855, -2826, 8059, 1627, -6598, -1235, 5596, 2462, -3190, -4760, -2649, 3631, 8190, 568, -10255, -4326, 9371, 5108, -8659, -3732, 10910, 5020, -12021, -7908, 9890, 10046, -3879, -7115, -186, 2086, 806, 1327, -273, -1517, 2434, 2074, -7192, -6666, 9068, 12249, -6804, -14992, 2161, 12170, -1372, -8999]
2036h999J2269N254j2468n814J0148O958l256m205l789k786O686R405n808j1468
2050g873N694J1187r057j3071J2261J7502j0729k0054N067J6637j261r541K053
2063a185M168m231k499K908J86J503O545l366j5443OK0361N028j8842o156J6126
2078E109K920j6339q28J8329L186j6120o316Q065M570N51K186m239q114L957Q802
2093E719n798p588J1868R746j7155j5783J6092J9364j0423j6166O605R472p752
2106a799n514R328N591n931l718r92l769M735J3707k186j8786j825J7754J370
2120G965j6119K931J8475m656k2067P40K0180L998j1902l213K929k669O77O760
2134D029r63n650M517L082j2700n413J9541J2055j9222j6195J4155J3499j1220
$$ y = [-8999, 3270, 8524, -3944, -9758, 390, 7348, 4092, -113, -3902, -6688, -2, 9403, 3595, -7873, -2179, 9008, -49, -13120, -859, 16643, 5914, -14140, -9073, 7564, 6303, -3238, -1185, 2983, -1248, -3747, -839, -653, 850, 7395, 4029, -11414, -11408, 8953, 13981, -4861, -11017, 5109, 8029, -8310, -9138, 9191, 12377, -3743, -10059, -1994, 2576, 3127, 5313, 1074, -7040, -3083, 5719, -79, -7667, 4201, 13947, -3208, -18991, -2899, 16465, 6042, -10124, -3519, 5953, -1799, -7313, 2015, 7606, 1675, -2043, -3035, -6804, -2069, 11638, 9452, -9334, -11159, 6595, 7965, -8154, -5223, 13252, 8596, -13471, -12731, 7449, 11447, -455, -3668, -739, -3408, -2731, 4029, 3066, -2584, 1933, 5015, -7685, -13098, 6443, 18498, -724, -16919, -2764, 10735, -485]
2147d85p592J2962N509j3974p268R163O476n77R58m532j0473L146J5266o54j4365
2162f440K865J3689q365j7624R923K2414n511k1230K38J3283l95n545M796K839
2176D937o797k219L516k413K70J1704J532j8991p555J9538J1003j5650q290J4291
2190D876L824j6703l590J7458O801j1830p065K709R64K726O941k623j0592K042
2204d062R506n972r737J1889J4567j3746j9860R437J9558m384j3408M020P491
2217E299o684n727O739N354k017m30k634q473J857J5814K806j7079n133J4953
2231D645K612j5054L78J7928P01j8632m830J3398N817n274j463n3m062Q61N982
2246B954k165m672P195N277j3193j0077J5227J5008j1827j5308Q010J1298p507
$$ y = [-485, -8077, 4885, 10394, -3580, -10848, -1685, 4791, 4214, 5172, 640, -9833, -6687, 8579, 7925, -6440, -3575, 10114, 1749, -15875, -5952, 16462, 10951, -10279, -10041, 3242, 2847, -2698, 2098, 4937, -1860, -4079, -563, -2976, -2706, 8998, 10530, -8461, -16016, 3522, 14525, -1125, -9415, 4876, 8700, -8003, -11593, 5865, 12666, 836, -6229, -3520, -2556, 170, 7111, 4488, -6104, -4062, 5444, -528, -10265, 1624, 16191, 2445, -17415, -7978, 11580, 7196, -6212, -2192, 5299, -1385, -7112, -373, 4981, 2964, 2534, -100, -8573, -6716, 9098, 11904, -5175, -10308, 4645, 7257, -7797, -7419, 10509, 11210, -7422, -12252, 1146, 6963, 1689, 226, 173, -3889, -3028, 2954, 789, -3883, 3312, 8589, -4604, -14681, 546, 15554, 3727, -11581, -3571, 7727, 220]
2259B20p609Q782P278p190o995J743K827L277M670l654j1110J182J2779k66j2466
2274f532K426J3793m356j7068K417J7998J726j3962l790P639J836l295J114J458
2288A404j279R57o4o206l79J2022M398j4321q600J2723R696j0478p865J0005O728
2303H741j0245p592P775P834k441n063k340l94L847N025l541p045M128P999o216
2318D72j0452P311J3728n354j4993J829J2822N09q814n71N894L04l890j516J133
2333a588L269L757l236q750P14J1512K225j1696l629J1180L563j1209m372J0881
2347B621O111q559p305M116O239J45l402k718N78M173J191n884k831P984N665
2362H124q891q750P558J0831m962j0534K675R097j166p729k78O223K570l773m791
$$ y = [220, -7389, 1393, 8671, 1481, -5514, -3771, -944, 2333, 7003, 3349, -7761, -6579, 6200, 5934, -6532, -4106, 9687, 5331, -11737, -9320, 8678, 10404, -3558, -7348, 291, 2127, -1168, -54, 1404, 125, 1082, 1018, -5188, -5567, 6455, 10853, -3468, -12068, 655, 10351, -127, -7992, 2013, 8741, -1504, -9096, -1321, 6513, 4072, -991, -3331, -3725, 122, 5147, 1606, -5439, -1311, 6688, 472, -9980, -2669, 11059, 5705, -9288, -7459, 5363, 5872, -2942, -3513, 2381, 2685, -1205, -2721, -1588, 1681, 5438, 2202, -6548, -5834, 5678, 7903, -3793, -7422, 3758, 7321, -3888, -8260, 2621, 8732, 173, -7132, -3016, 3223, 3368, -34, -2752, -2174, 1999, 3190, -2694, -5525, 2459, 8124, -767, -9517, -1959, 8872, 3910, -6624, -3949, 5148, 3982, -3747, -4025, 2198, 4768, 995, -3796]
2377c796l4N416M077m407p119K852Q573j604r579L94J0340J299j0336l597Q559
2392A038N595n606o064K411N411M61m379k763L283N230j680p303p90Q504L712
2407G060q235n910O729P202m902p781L052P776q55p286j816N709M233l310n859
2422d193K55O377K477o130m692N200O762l887q240J871R025O25q462l041P062
2437A009M874m889n888K439O367K52o175k922N234N348l506p147J164P806J280
2452E246p673l535O628N312m938o797K903P268l14p062k353N921M525m039o012
2467d920J840O834P58o834l137O124N215m486o753K342P548J25p412k462O480
2482A262M425m710o029K537O818r3o880k551O079M644m589o275K422P250j16p332
$$ y = [-3796, -3830, 1586, 5663, 1256, -5863, -3011, 5562, 3958, -5621, -5227, 5113, 6412, -3924, -7521, 1038, 6633, 1027, -5037, -2626, 2785, 3246, -1133, -3896, -613, 4617, 2937, -4366, -5156, 3348, 7060, -1175, -7085, -356, 6846, 1944, -5837, -2785, 4991, 4136, -3150, -4966, 743, 4976, 1666, -4193, -3938, 2439, 4916, -1214, -5906, -706, 6056, 2169, -6071, -4200, 4825, 5450, -3012, -6053, 1009, 5883, 994, -4894, -2455, 3912, 4164, -2011, -4933, 301, 5649, 2143, -5004, -3840, 3966, 5246, -2427, -5962, 666, 5978, 1040, -5757, -2854, 4414, 4100, -2962, -5315, 606, 5131, 1092, -4920, -3080, 3754, 4512, -2322, -5459, 665, 5880, 1394, -5359, -3017, 4531, 4656, -2756, -5218, 1262, 5687, 977, -5052, -2515, 4303, 4210, -2670, -5221, 858, 5502, 913, -5362, -2940, 4310, 4194, -3138]
2498c138k338O609M482n132o044L062P069o52p149j785O611L983n054n759L012
2513b223O903o36p147j816O560M142n291n912L350O941j049p299j386O683L525
2528E345n315n416L296O378q50o741j568O300L890n146n608L255O841q76p260
2543c475j377O766L594n597n119L777O243j558o593r28O223L219m929n164K970
2558a948O528r27p015j489O866L616o043n610M390O760k188p180L9O625K071n354
2574h59m037L745N559j423o354j188O343L806n435n751L951P064k084p821L28
2589d156P775J668o959l572N102M940k756n366pN057K323m222m459K885O403j336
2605C320p627j128Q195L318p283n070N838N819m014n848K146N724Q7n009k490
$$ y = [-3138, -5476, 1133, 5615, 483, -5561, -2499, 4570, 3918, -3231, -5016, 1595, 5578, 524, -5235, -2223, 4680, 4044, -3103, -4919, 1641, 5783, 492, -5420, -2070, 4871, 3822, -3477, -4863, 1820, 5345, 30, -5386, -2090, 4288, 3438, -3303, -4871, 1429, 5319, 173, -5435, -2180, 4661, 3785, -3475, -4852, 1914, 5508, -89, -5208, -1431, 4812, 3254, -3339, -4267, 1956, 5175, 246, -4918, -1948, 4580, 3653, -3362, -4851, 2015, 5631, -412, -6022, -1632, 5128, 2940, -4240, -4201, 2424, 4495, -859, -4896, -1151, 4408, 2985, -3369, -4557, 1786, 5592, 157, -5594, -1643, 5421, 3337, -4484, -4156, 3619, 5287, -1672, -5244, -142, 4798, 2042, -3324, -3331, 1726, 4049, -173, -4632, -1747, 4656, 3320, -4307, -5435, 2760, 6078, -1205, -6275, -437, 5382, 1368, -4480, -2334, 3390, 3477, -1532, -4022]
2620d022L240M721n51n729k316N766M488n373o037M850P326l939q632K197Q896
2635D885np503k098N080K824k419l090K85L403J944l641m821L018P853j145r443
2651d873j204R472K730q512l156P725L564o674m469M558N136j308m003k199J386
2666a827M230J248n079k935N895L965p173n938P922Q261o651r616L952Q721j804
2681C171o254R71M220n31k805r23P28L241K959l913p254K576R892n48j0077j84
2697d731R519j27j0075j55J0552J830q743l693M523L245k20q64k049j549L167
2712F30J960n204j983Q564L766j0959p039J0374R124p650q094N699N641n472m280
2727d923N138M336k298l065j800j152M145O367l517r178J952R297k545r426M427
$$ y = [-4022, -782, 3939, 3388, -2341, -4657, 1109, 5597, 224, -5813, -963, 6363, 2424, -6208, -4011, 4885, 4880, -2623, -4721, 359, 3183, 764, -2326, -2041, 1362, 3306, -335, -5156, -2138, 5715, 4570, -4873, -6077, 3395, 6125, -2387, -5543, 2182, 5746, -928, -5397, -839, 4297, 2989, -1014, -3213, -1827, 2403, 3651, -1428, -4363, 1532, 5497, -1676, -7614, 308, 8569, 1918, -7698, -3746, 4975, 3171, -3083, -2112, 2108, 1577, -1228, -2151, -1423, 1818, 4777, 864, -6390, -3814, 6078, 5530, -4547, -4731, 4788, 4661, -5414, -5569, 4983, 6813, -1930, -5623, -1100, 2145, 1925, 1061, -988, -2537, 630, 2590, -2614, -4597, 3967, 7733, -3226, -10265, 109, 9233, 1583, -6511, -812, 4829, -643, -4923, 215, 4551, 2253, -812, -2612, -3764, 381, 6748, 3231, -5947, -3995, 5302, 2757, -6669, -2242]
2742b242J1163m685j3048J924J1941R06p353j191K776j130n15K476m77j191L411
2757B765k21q421j282J2509N050j2468p294J0049N992q742l320R436K945r360
2771b362m449N751M090k58P0l114n487K848P978k288p514M343P612p757j0584
2786a1121Q495J3818n568j3007K084Q539j969l938L986K605m290k004J256j335
2800b449J663P661p73j2634k633J3019M430j0972k519J0584n9j2591n21J2925
2814E131L272q927l842K567Q8J281M577j501o099J716M939n324n002J0099Q677
2829A1652j1501j2316Q448J2043n110p856N170M364o961l966O198M147j878o36
2843A798k162n940J780J1025J062j1618j875J0047p52j0874L222J3785k062j4525
$$ y = [-2242, 8921, 4236, -8812, -6888, 5053, 5959, -1394, -2585, 191, -939, -1454, 1022, 545, -646, 2765, 2544, -5877, -7159, 5350, 10400, -2068, -9362, 687, 6679, -2063, -5383, 4053, 6998, -2362, -6811, -1060, 3030, 2772, 2842, -272, -5759, -2911, 5067, 2779, -4735, -392, 7220, -537, -11121, -2626, 11192, 5624, -7383, -5299, 3240, 1271, -2667, 1319, 3924, -366, -2370, -1114, -2449, -786, 6875, 6102, -6532, -9165, 3854, 8284, -2688, -5207, 5377, 5318, -7273, -7794, 5131, 8403, -524, -4366, -1799, -1711, -430, 4147, 2646, -3453, -1737, 3202, -2122, -7124, 2975, 11652, 151, -12165, -3717, 8326, 3216, -4640, 530, 4894, -2067, -6033, 165, 4312, 2434, 1798, -364, -6304, -4524, 6501, 7563, -4055, -5930, 4117, 3365, -7509, -4287, 9498, 7436, -7089]
2857g089j475J0379K585m210M84P68m200l03M411p17k251N347K254j0789n993
2872a0799J2750R708j0177r493P510N987q061l544R634M278q117n119K898K009
2886e36J706L958k250q348L56Q852p75p947L996R597o429j3122M896J4361j104
2901G211j0900k68N690j814k883M035K555k889q95J12m172J90R785L113j1948
2916c078o253J0218N997q670l454R693K302j1164m058R208N308m064k971m21j877
2931c284J476N302r66n338K278N064n818p310Q278J0988o802j2428L581J0036
2945E057k196o295L495M360m144m210K033K513J083K213j961p399k06R606K283
2960F232r030j961Q657J37j0190k2J1545K236r816m032N484K807j497L01J04k211
$$ y = [-7089, -8564, 1815, 4400, 190, 674, 1442, -2758, -3061, 1350, 633, -1618, 3729, 5983, -4806, -10799, 1951, 11659, 1482, -8011, -501, 5486, -2575, -6119, 3515, 7793, -324, -5443, -2545, -536, 1170, 5128, 2878, -5470, -5114, 3738, 2963, -4984, -988, 8609, 2180, -10942, -6046, 8315, 7211, -3689, -3957, 1733, -81, -2964, 1071, 3626, 737, -158, -46, -4218, -4028, 5757, 8870, -3078, -9331, 887, 6884, -1786, -5240, 4453, 6755, -4409, -8467, 741, 6049, 1985, -986, -1407, -3284, -1808, 3494, 2528, -2810, -532, 4532, -1286, -8596, -318, 10670, 3868, -8560, -4979, 5057, 2861, -3434, 61, 4421, 277, -3933, -1900, 613, 1696, 3909, 1948, -5451, -5657, 3949, 6232, -2798, -4759, 3898, 4035, -6155, -6177, 5368, 7604, -2212, -6244, -760, 2047, 550, 851, 955, -1256]
2976a256N31J996k702j903O414M044q653p358P788R038n540p810M454N656m787
2991h8n146M556N215k002l884j224nK508M122j640o280O88O698j303p288K402
3007b671R079j901j0329l25R376K140o204k122L403Q13j759j82N10P72J874p92
3023A682n360p92P584L294p623m887O534M752o023m304N951M600n104n163K550
3038b309M556K86j995k220o41K405K745k799l561L679M808m271o766L748Q191
3053E856j821p997J10O411O89m670r99L452J422j919k489n09K812L370j900n528
3069c710K21O343J044o405j804O401K460o282l429N269M497l194m609Q45L672
3084A319J037k086k229P64L339L29m313j920N083L758m760n374L560N960k098
$$ y = [-1256, -725, 1271, -1431, -3334, 3080, 7124, -1529, -8887, -1099, 7939, 2399, -5411, -957, 4699, -88, -5234, -678, 4537, 2535, -1349, -2573, -2578, -70, 4052, 2412, -3868, -3180, 3518, 2215, -5073, -2671, 6408, 4507, -5822, -6147, 3229, 5369, -835, -2957, 446, 1259, -500, -682, -172, 600, 2474, 1682, -3678, -4470, 3114, 6408, -1215, -6102, 432, 5184, -839, -5143, 808, 5408, 304, -4859, -2309, 2247, 2533, 538, -1682, -2323, 82, 2827, 28, -3533, 146, 4954, 683, -6083, -2335, 5856, 4035, -3962, -3852, 2559, 3248, -1422, -2421, 1031, 2453, 534, -1955, -2464, 348, 3718, 1818, -3710, -3489, 2854, 3898, -2507, -4311, 2090, 4550, -1732, -5161, 108, 4605, 1411, -3198, -2353, 1319, 2356, 270, -1959, -1195, 2144, 2473, -1840, -3760, 1323, 5081, 321, -5053, -1493, 4467, 2369]
3099B369n775P69N299K12m535j573L323K808j455l724o76L613K762k921m169K051
3115a622N111j049n741q3N958J609n480k918M226L831k471m029O74L799J023l323
3131d85k609K483L843j008m864p19N066K333m736l583L690M423k428m934R95M960
3147B427O29m410k169L270L442j674m141L8M356J560l958l000L254M171k017m907
3163c129N59N048J046m640k459L644L504k439m103P56M368P74m105k318L210L589
3179C305j932m460M56M765R64m388k447L792L599k580m384J137M638M75m312j980
3195c352L609L208k373m049J002M328P12m249k232L618L351k451m404J168M675
3210B561L00m441j896L841L020k640l976J252M301L09m188j810L537L266k543
$$ y = [2369, -3406, -2637, 2662, 2874, -1661, -3234, 89, 2897, 1442, -2282, -2958, 655, 3417, 496, -3673, -1622, 3489, 2440, -3301, -3384, 2574, 4183, -1297, -4215, 11, 3842, 1371, -2658, -1984, 1815, 2838, -485, -3094, -611, 3232, 2224, -2640, -3359, 1707, 4040, -696, -4279, -589, 3834, 1406, -3528, -2533, 2427, 3056, -1354, -3523, -253, 3189, 1515, -2626, -2588, 1768, 3328, -630, -3630, -376, 3795, 1778, -3129, -2570, 2478, 3524, -1116, -3575, 69, 3573, 1134, -2969, -2213, 2155, 2929, -1176, -3494, -284, 3305, 1373, -3087, -2631, 2134, 3098, -1290, -3737, 55, 3654, 1074, -3310, -2173, 2465, 2940, -1372, -3352, 257, 3465, 1092, -2957, -1955, 2373, 3085, -1164, -3396, 222, 3573, 1122, -3282, -2114, 2561, 2861, -1580, -3476, 365, 3385, 745, -3231, -1979, 2322, 2631, -1557, -3367, 170, 3436, 893]
3225H93m083J145M615M03m514j824L947L045k920l865J578M275j34m148j408L530
3241E35K786k577l729J156M176L68m314j743L724L094k997l981J782M431l33m430
3257b052j040L852K327k831l077J490L741l8l899j485L578L020k681m143J525
3272a713M678j78m799j175M542K145l698l152K414L781r32l760q20L056K373k222
3288E40l432J147M106J96m605j599M697L030m057m021K932M366j435m206J85L768
3304A612R36k842k141J624L163J03l717j949L403L447k694m455J908M988j241
3319B145n281J37N332J074m498k318K912K747j074k459n34K010J938j598l316
3334b783J127M696J44n719j631N612L077m847l400L756L357k984l309J935L315
$$ y = [893, -3190, -2045, 2570, 2973, -1541, -3365, 582, 3627, 707, -3158, -1580, 2695, 2561, -1587, -2995, 535, 3321, 744, -2985, -1829, 2347, 2715, -1599, -3342, 382, 3476, 479, -3502, -1720, 2711, 2378, -2052, -3092, 760, 3087, 256, -2821, -1331, 2410, 2372, -1527, -3012, 566, 3586, 905, -3238, -1713, 2965, 2787, -2012, -3187, 1355, 3500, -198, -3350, -936, 2845, 1913, -1847, -2667, 389, 2762, 540, -2892, -1745, 2361, 2557, -2048, -3647, 1050, 4080, 23, -3998, -1066, 3300, 1865, -2341, -2156, 1612, 2548, -294, -2435, -811, 2352, 2455, -1262, -3211, 192, 3639, 945, -3510, -1602, 3386, 2145, -3136, -2999, 2333, 3407, -1091, -3409, -497, 2250, 1176, -1283, -1817, 193, 2131, 533, -2783, -1656, 3040, 3184, -2535, -4166, 1446, 4523, -324, -3724, 32, 3389, 405, -2904, -969, 2346]
3349B346k43k685j717R26L038J129l462k658L231L579l415m303L602N417l056
3364A729o373J630O006N2m434p33K458Q39j203q21O7J523J819j902m291J208O171
3381C745M08o669j598O049J681n609j474N652J801n046k734K895K738j14j257
3396D68j682j011K349K260k787k466M023L158n453m864N655O395m101o266K347
3411a975M699j707l042K021K187j335j573n39m96K186L557j960o175M53O873J53
3427C327o398N15O504j125p525L16P527J318n155j995J951N06L56J375q76j953
3443a332J791J292m097j499O794L622p544n716O051N661m354l928M301K434m768
3458a292k648L785K723r19p14j692k957J874N765q65o151P38N699k394o472L630
$$ y = [2346, 2103, -582, -2299, -1373, 1665, 2794, -668, -3326, -95, 3484, 69, -4234, -632, 4785, 1729, -4644, -3014, 2992, 3044, -1390, -2123, 335, 1174, -29, -850, -783, 740, 2559, 657, -3634, -2426, 3745, 4153, -2516, -4114, 1935, 3616, -1993, -3467, 2185, 3986, -1060, -3794, -899, 1839, 1725, 468, -1214, -2225, 124, 2384, -403, -2869, 1154, 4312, -1141, -6005, -350, 6045, 1944, -4322, -1975, 2724, 1017, -2025, -4, 2183, 848, -725, -1264, -1760, 426, 3983, 2023, -4152, -3699, 3174, 3327, -3071, -2556, 3948, 2823, -4702, -4386, 3141, 4459, -696, -2691, -740, -234, 122, 1497, 621, -1332, 459, 1751, -2346, -3845, 2949, 6571, -973, -6689, -638, 5023, 669, -3259, 1042, 3476, -1292, -3940, -155, 2568, 1649, 935, -757, -3714, -1840, 3925, 3060, -3091, -2353, 3346, 952, -5520, -1890]
3474a890Q470k696q826L57O530N24l023R41R70k425o11K088m60l69L632R5p165
3491c858k306Q444M461p159m364N844K400o444j252P280K109o011k959K323J246
3506b46R51K327j490m959R17M899j537m379M285N557o029q176N035R115k435o900
3522c065J446L676k791k028L820K052k475r65j57k717P64O907R80q254l039P293
3538A447K309o516j74P547l08q976j151P560K610l790j220M45j966L86M036j78
3554B061l536J808K677n005m185P234P116o539q029M092O189l481l405M602K482
3569D081n111l031K983J974K25J625j365n703J09P063J205o328j16O189j960p886
3585f046K383R402l08q268j240M635L21j636K158Q25k989p17J877j530r08N225
$$ y = [-1890, 6580, 3884, -4942, -4585, 1945, 2469, -554, 387, 1357, -1068, -1679, 409, -51, -420, 3212, 3307, -3858, -6164, 2280, 6741, -418, -4782, 1062, 3462, -2982, -4234, 3046, 5155, -856, -3815, -1492, -246, 705, 3032, 1542, -3417, -2500, 2399, 862, -3517, 768, 6325, 296, -7880, -2845, 6270, 3835, -3065, -1619, 2057, -734, -2762, 1058, 3110, 635, -330, -487, -3204, -2440, 4467, 5447, -2807, -5846, 1447, 3756, -2760, -2934, 4613, 4305, -4671, -5822, 1738, 4348, 558, -662, -217, -2183, -1797, 2239, 2061, -1475, 333, 3010, -1995, -6180, 1054, 8170, 1631, -6398, -2306, 3883, 402, -3003, 1599, 4081, -1030, -4061, -1078, 896, 1121, 2746, 1381, -4322, -4213, 2850, 4055, -2273, -2389, 3800, 1840, -6046, -3663, 5739, 5431, -2837, -4077, 558, 879, -757, 1401, 2226, -763, -1480, 397, -1133, -2041, 3184]
3601C184K252p538n023P012N938n258m445M974K398n971k417O100L259l599k540
3616a674K74n82J090L988m05n119K3M715j485n074L635O975l698q607J743P820
3632C619k79m798O65K627k258k045K289J531o91P96m16m375o43O572K816o633
3648a223l489N632K308n734j112O726J630o479k901M108K646j025l31l30k160
3663a734L99K932r08k533K642L278m641n193M712O868l204o529J898M552k023
3678E16l160K538K830j931k291M9K34J197K800o47m877p11N295J014m948k80N564
3695C192j58o471o92O337K001m449k087J955Q39m61M97m9q65R66O61k841j408
3712c033M601L045m945m464L903M633l081l762K943L077k832l144J803K909J3
$$ y = [3184, 5436, -2102, -7125, -113, 5825, 567, -3878, 1096, 3494, -2477, -4894, 1206, 4465, 866, -1674, -1400, -1982, -892, 3096, 2691, -2428, -2405, 2310, 825, -4249, -614, 6361, 2663, -5944, -4201, 3619, 3340, -1458, -793, 1834, -424, -2469, -180, 1351, 660, 1456, 1040, -3335, -3978, 2594, 5410, -1223, -4712, 920, 3228, -2506, -3618, 3108, 4738, -1741, -4642, -534, 2112, 1087, 756, 426, -1734, -1335, 1597, 689, -1844, 798, 4076, -565, -5758, -1046, 5822, 2618, -3911, -2013, 2539, 516, -2644, -106, 2724, 793, -1498, -1449, -1215, -18, 2782, 2135, -2742, -3453, 1842, 2856, -2092, -2372, 3192, 3034, -3437, -4129, 2208, 4209, -240, -2327, -372, 467, 6, 503, 454, -411, 555, 1216, -1625, -3033, 1568, 4613, -332, -4796, -893, 3740, 659, -3103, -160, 2917, 85, -3059, -1256, 1653, 1666]
3727A666j344j353r37J605K621j035l398J158L706j552m568J608N566o80n559
3742b496o81M439J182k846r33J653N42q15q18l69J069K099n42l745o98M308J916
3759C265m072k390L708K373l476k505L076K993k001k934L83K146J035q35j599
3774h33m30J929J196k216k020K577L030k526m032J705M333n62m119k21L305O75
3790A791k496j132J774J584n43k089q93J952K225j142l113L38L553L47l688q49
3806b381L666J481l285k147K476K584j254k543M6J981R91j450j768P32K319J59
3822A607k898j003K820K108k511k846J748L155r40l049M2K943P18k416j507J592
3838d37K186m66k381o14K206J626j724k466J253K887m65l250l48L157J257k744
$$ y = [1666, 322, -1031, -1968, -363, 2258, 1223, -2175, -1017, 2689, 1137, -3431, -1823, 3743, 3063, -2496, -3177, 1262, 2444, -402, -1335, 318, 860, 45, -773, -1142, -73, 2026, 1484, -2261, -2959, 1349, 3265, -807, -3197, 511, 2884, -592, -3097, -21, 2972, 971, -1963, -1580, 566, 1601, 766, -833, -1263, 666, 1862, -354, -2374, 203, 3233, 707, -3325, -1620, 2713, 2151, -1968, -2189, 1116, 1791, -705, -1837, -63, 1521, 978, -1111, -2004, -52, 2173, 1031, -2082, -1744, 1809, 2156, -1532, -2381, 1285, 2766, -519, -2666, -190, 2394, 1140, -1403, -1357, 624, 1615, 165, -1603, -871, 1448, 1607, -1291, -2294, 526, 2634, 123, -2723, -975, 2180, 1240, -1809, -1767, 1176, 1894, -522, -2029, -437, 1749, 1283, -1098, -1712, 494, 2120, 396, -2070, -817, 2070, 1605, -1645, -1993, 1164, 2421, -323]
3854c23j995J881K382q90k601o7K416R89k042j815J446K438n52k810m04K737J367
3871B157k411k105J902K580j015k872K12K770Q30k405j599J669K268q70k511k03
3887a603K653R71k329j754J627K505r83k860J42K757Q46k533j685K002K144j047
3903H53k544K08K504Q31k241j691J797K258q96k631jK766Q37k502j638J969K286
3920B165j174k743M12K659N29k370j409J800K062j056k430LK643Q21k474j646
3936b208J934K352j295k712M20K928M04k691j172K168J891j397k317N48K372M31
3952A656k158j367J836K125j176k703L91K830N58k828j234K357J814j745k290
3967a934R73K433j42k244r35J787J665q56k324J38K538O91k526j487K354K248
$$ y = [-323, -2318, -437, 1945, 1055, -1546, -1613, 803, 1792, -250, -2065, -619, 1819, 1267, -1543, -1947, 790, 2157, -254, -2359, -457, 2123, 1108, -1764, -1552, 1218, 2048, -357, -1956, -287, 1981, 1111, -1400, -1603, 1050, 2021, -308, -2062, -435, 2070, 1087, -1773, -1631, 1126, 1972, -561, -2246, -244, 1900, 853, -1691, -1483, 1021, 1852, -389, -2080, -283, 1975, 1079, -1552, -1553, 1213, 2050, -452, -2090, -121, 2165, 991, -1752, -1340, 1319, 1848, -522, -1931, -131, 1931, 875, -1555, -1552, 1091, 1912, -562, -2208, -274, 2078, 783, -1929, -1509, 1419, 1823, -868, -2040, 128, 2019, 622, -1695, -1147, 1225, 1656, -502, -1869, -33, 2092, 916, -1787, -1396, 1434, 1992, -836, -2070, 287, 2101, 356, -1934, -961, 1472, 1330, -914, -1849, -62, 1603, 747, -1577, -1439, 1099, 1790, -736, -2223, 131, 2379]
3983B379j853k729J119K922k55k590n58K059J260j444j605N36J946L70k023j629
3999b095J861K430j176l041L76L216K02l246n77K876J279k497j720J536J979l18
4015A085j715o81J086J589n83k034l2K765O00l124j561L196K290k515k767J774
4031f27K610j181k254N76J940P9j443j066N16J768Q09j950k044J663K718j335
4047G79l058J280L432j120l744M47L651M39k652r97J355R95l08n13n51N15J274
4064A224m90k557J63L658P53m019j772L637K086l143j744K685J596k438j733J507
4080e87J748r2r29j126o10J695J877j564k510J771K735k294l224K579M176k082
4096A563m355R09L475k04k079L63J111o13n55P5l59P00K045q28l771j26M527R66
$$ y = [2379, 526, -2203, -1084, 1838, 1583, -1007, -1565, 494, 1754, 310, -1295, -759, 1187, 1557, -466, -2095, -234, 2196, 1020, -2021, -1645, 1571, 1773, -1473, -2050, 826, 2105, -392, -2112, -576, 1403, 1085, -630, -1311, -225, 1364, 781, -1253, -1285, 1480, 2080, -1044, -2605, 591, 2881, 366, -2401, -627, 1983, 802, -1452, -876, 1064, 1143, -300, -1366, -850, 918, 1727, -223, -2267, -604, 2114, 779, -2279, -999, 2433, 1313, -2431, -1984, 1667, 2106, -546, -1543, -188, 807, 499, -14, -565, -50, 1224, 734, -1823, -1660, 1998, 2751, -1268, -3040, 597, 2683, -460, -2204, 481, 2077, -361, -2094, -587, 1161, 1069, 140, -986, -1596, 99, 1976, 412, -2098, -327, 2408, 114, -3110, -531, 3645, 1563, -2792, -1883, 1592, 1388, -691, -328, 783, 170, -385, -310, -669, 31, 2076, 1248, -2523, -2649, 1878, 2844]
4114B844m209j043L813M72l966m02M208J077l285j533J352Q68L72P42j046j770
4130a506J136J815j856j706L295K609m217l989L584M512k350l520J754K061k056
4145d34j392K002J273q59n81n95j559J171L711l79m617l53M253N4m142J004M854
4162C411j099n393o4M632Q78k366l05N28j107J33J736l06j282J594Q48l747j775
4179c684N055L298m558m015L440K827l030j560L633J421l719j767K053J228M9
4194F71J128j123l263M77M071q6l648J137L707k557m858K702N929j328n129P0
4210b100K977o47j150J870P10k038n67Q98j195J7L758P74n438k300N013K909m005
4227e14j816M017N76m873o77M825J574k847j391N35o20O15K759l30l237L26K718
$$ y = [2844, -1365, -2408, 1405, 1877, -2089, -2491, 1717, 2794, -491, -2024, -672, 196, 568, 1310, 264, -1506, -370, 1445, -411, -2117, 1178, 3787, -430, -4419, -835, 3677, 1327, -2193, -439, 1622, -434, -1826, 176, 1449, 590, 9, -586, -2145, -974, 2737, 2358, -2259, -2612, 1641, 1695, -2447, -1443, 3411, 2312, -3081, -3145, 1487, 2365, -1, -306, 222, -885, -752, 984, 678, -604, 990, 1838, -1909, -3684, 1371, 4669, 111, -3904, -464, 2363, -667, -2227, 1406, 2827, -892, -2659, -606, 622, 671, 1799, 676, -2587, -2110, 1961, 1875, -1773, -636, 3071, 514, -4344, -1642, 4287, 2959, -2170, -2100, 877, 230, -920, 950, 1660, -378, -945, -47, -1242, -1225, 2533, 3307, -2131, -4431, 582, 3491, -514, -2330, 1687, 2263, -2610, -3287, 1538, 3112, 265, -1126, -591, -1211, -596, 2163, 1833, -1404, -1078, 1640]
4244A640j857k851L567M417l872n651K454M994j311l064J810J454k723j426K409
4259a0J377p64L30m01l189j17M935J426m637j651M033L59m452P37N461n5n468
4276b086j171L619J074j214N89N3k232l7K261l60j577K183J765m106l461M555
4292a45M616l325m168K360K569k805j521L436J784k759j714Q45J18N94K388l15
$$ y = [1640, -217, -3068, 499, 4916, 1044, -4607, -2153, 2841, 1530, -1534, 276, 1730, -993, -2419, -10, 1367, 603, 933, 532, -2657, -2774, 2161, 3587, -1050, -2701, 1332, 1691, -2761, -2024, 3437, 3382, -2086, -3257, 362, 1436, 222, 811, 864, -1368, -1405, 856, 496, -1081, 1102, 2867, -1239, -4700, -145, 4471, 1146, -3022, -662, 1907, -898, -2419, 1017, 2801, 42, -1672, -827, -709, -115, 2273, 1958]
$$ [...]
8191C3
##END NTUPLES=NMR FID
##END=
