##TITLE=1H_IBEP3003
 CDCl3, 100 sc, 
 1.4.2019
##JCAMPDX= 6.0         $$ Bruker NMR JCAMP-DX V2.0
##DATA TYPE= NMR FID
##DATA CLASS= NTUPLES
##ORIGIN= UXNMR, Bruker Analytische Messtechnik GmbH
##OWNER= root
$$ XWIN-NMR		Version 3.5
$$ Mon Apr  1 13:59:11 2019 Russian Standard Time (UT+4h)  she@DPX200
##.OBSERVE FREQUENCY= 200.1316
##.OBSERVE NUCLEUS= ^1H
##.DELAY= (6, 6)
##.ACQUISITION MODE= SIMULTANEOUS
##.ACQUISITION SCHEME= undefined
##.AVERAGES= 8
##.DIGITISER RES= 18
##SPECTROMETER/DATA SYSTEM= spect
##.PULSE SEQUENCE= zg30
##.SOLVENT NAME= CDCl3
##.SHIFT REFERENCE= (INTERNAL, CDCl3, 0, 15.7039)
##AUDIT TRAIL= $$ (NUMBER, WHEN, WHO, WHERE, WHAT)
$$ ##TITLE= Audit trail, XWIN-NMR		Version 3.5
$$ ##JCAMPDX= 5.01
$$ ##ORIGIN= Bruker BioSpin GmbH
$$ ##OWNER= she
$$ F:/spectra/data/she/nmr/H-F/1/audita.txt
$$ ##AUDIT TRAIL=  $$ (NUMBER, WHEN, WHO, WHERE, WHAT)
(   1,<2019-04-01 13:57:47.57 +0400>,<she>,<DPX200>,
      <created by zg, POWCHK disabled, PULCHK disabled
       configuration hash MD5:
       00 E9 B6 7A A2 85 ED C7 34 08 36 98 17 FE 4E 26
       data hash MD5: 16K
       45 B7 7B A4 50 97 79 FA 6C A4 4E E1 ED D0 C9 8F>)
$$ ##END=
$$ 
$$ hash MD5
$$ 67 AF 15 3B 8B FD 59 6C 2F F1 1E 60 D6 F3 63 E2
##$RELAX= 
##$RELAX= 
##$RELAX= 
##$RELAX= 
##$RELAX= 
##$RELAX= 
$$ Bruker specific parameters
$$ --------------------------
##$DU= <F:/spectra>
##$EXPNO= 1
##$NAME= <H-F>
##$PROCNO= 1
##$TYPE= <nmr>
##$USER= <she>
##$AMP= (0..31)
100 100 100 100 100 100 100 100 100 100 100 100 100 100 100 100 100 100 
100 100 100 100 100 100 100 100 100 100 100 100 100 100 
##$AQSEQ= 0
##$AQ_mod= 1
##$AUNM= <au_zg>
##$AUTOPOS= <>
##$BF1= 200.13
##$BF2= 200.13
##$BF3= 200.13
##$BF4= 200.13
##$BF5= 200.13
##$BF6= 200.13
##$BF7= 200.13
##$BF8= 200.13
##$BYTORDA= 1
##$CFDGTYP= 0
##$CFRGTYP= 5
##$CHEMSTR= <none>
##$CNST= (0..31)
1 1 145 1 1 1 1 1 1 1 1 1 1 1 1 1 1 1 1 1 1 1 1 1 1 1 1 1 1 1 1 1 
##$CPDPRG= <>
##$CPDPRG1= <>
##$CPDPRG2= <>
##$CPDPRG3= <>
##$CPDPRG4= <mlev>
##$CPDPRG5= <mlev>
##$CPDPRG6= <mlev>
##$CPDPRG7= <mlev>
##$CPDPRG8= <mlev>
##$CPDPRGB= <>
##$CPDPRGT= <>
##$D= (0..31)
0 1.2 0 0 0 0 0 0 0 0 0 0.03 0 0 0 0 0 0 0 0 0 0 0 0 0 0 0 0 0 0 0 0 
##$DATE= 1554112667
##$DBL= (0..7)
120 120 120 120 120 120 120 120 
##$DBP= (0..7)
150 150 150 150 150 150 150 150 
##$DBP07= 0
##$DBPNAM0= <>
##$DBPNAM1= <>
##$DBPNAM2= <>
##$DBPNAM3= <>
##$DBPNAM4= <>
##$DBPNAM5= <>
##$DBPNAM6= <>
##$DBPNAM7= <>
##$DBPOAL= (0..7)
0.5 0.5 0.5 0.5 0.5 0.5 0.5 0.5 
##$DBPOFFS= (0..7)
0 0 0 0 0 0 0 0 
##$DE= 6
##$DECBNUC= <off>
##$DECIM= 24
##$DECNUC= <off>
##$DECSTAT= 4
##$DIGMOD= 1
##$DIGTYP= 9
##$DL= (0..7)
0 120 120 120 120 120 120 120 
##$DP= (0..7)
150 150 150 150 150 150 150 150 
##$DP07= 0
##$DPNAME0= <>
##$DPNAME1= <>
##$DPNAME2= <>
##$DPNAME3= <>
##$DPNAME4= <>
##$DPNAME5= <>
##$DPNAME6= <>
##$DPNAME7= <>
##$DPOAL= (0..7)
0.5 0.5 0.5 0.5 0.5 0.5 0.5 0.5 
##$DPOFFS= (0..7)
0 0 0 0 0 0 0 0 
##$DQDMODE= 0
##$DR= 18
##$DS= 0
##$DSLIST= <SSSSSSSSSSSSSSS>
##$DSPFIRM= 0
$$ [...]
##$SUBNAM2= <"">
##$SUBNAM3= <"">
##$SUBNAM4= <"">
##$SUBNAM5= <"">
##$SUBNAM6= <"">
##$SUBNAM7= <"">
##$SUBNAM8= <"">
##$SUBNAM9= <"">
##$SW= 24.9336934301222
##$SWIBOX= (0..15)
0 0 2 0 0 0 0 0 0 0 0 0 0 0 0 0 
##$SW_h= 4990.01996007984
##$TD= 16384
##$TD0= 1
##$TE= 0
##$TE2= 300
##$TE3= 300
##$TEG= 300
##$TL= (0..7)
0 120 120 120 120 120 120 120 
##$TP= (0..7)
150 150 150 150 150 150 150 150 
##$TP07= 0
##$TPNAME0= <>
##$TPNAME1= <>
##$TPNAME2= <>
##$TPNAME3= <>
##$TPNAME4= <>
##$TPNAME5= <>
##$TPNAME6= <>
##$TPNAME7= <>
##$TPOAL= (0..7)
0.5 0.5 0.5 0.5 0.5 0.5 0.5 0.5 
##$TPOFFS= (0..7)
0 0 0 0 0 0 0 0 
##$TUNHIN= 0
##$TUNHOUT= 0
##$TUNXOUT= 0
##$USERA1= <user>
##$USERA2= <user>
##$USERA3= <user>
##$USERA4= <user>
##$USERA5= <user>
##$V9= 5
##$VALIST= <valist>
##$VCLIST= <CCCCCCCCCCCCCCC>
##$VD= 0
##$VDLIST= <DDDDDDDDDDDDDDD>
##$VPLIST= <PPPPPPPPPPPPPPP>
##$VTLIST= <TTTTTTTTTTTTTTT>
##$WBST= 1024
##$WBSW= 4
##$XGAIN= (0..3)
0 0 0 0 
##$XL= 0
##$YL= 0
##$YMAX_a= 390161
##$YMIN_a= -270685
##$ZGOPTNS= <>
##$ZL1= 120
##$ZL2= 120
##$ZL3= 120
##$ZL4= 120
##$ABSF1= 10
##$ABSF2= 0
##$ABSG= 5
##$ABSL= 3
##$ALPHA= 0
##$AQORDER= 0
##$ASSFAC= 0
##$ASSFACI= 0
##$ASSFACX= 0
##$ASSWID= 0
##$AUNMP= <proc_1d>
##$AZFE= 0.1
##$AZFW= 0.1
##$BCFW= 1
##$BC_mod= 2
##$BYTORDP= 1
##$COROFFS= 0
##$CY= 11.3945322036743
##$DATMOD= 1
##$DC= 2
##$DFILT= <>
##$DTYPP= 0
##$F1P= 18.9103706918063
##$F2P= -1.10871071338519
##$FCOR= 0.5
##$FTSIZE= 0
##$FT_mod= 4
##$GAMMA= 1
##$GB= 0.15
##$INTBC= 1
##$INTSCL= 1
##$ISEN= 128
##$LB= 0.24
##$LEV0= 0
##$LPBIN= 0
##$MAXI= 10000
##$MC2= 0
##$MEAN= 0
##$ME_mod= 0
##$MI= 1.114404
##$NCOEF= 0
##$NC_proc= 0
##$NLEV= 6
##$NOISF1= 3.799351
##$NOISF2= 2.8
##$NSP= 1
##$NTH_PI= 0
##$NZP= 0
##$OFFSET= 15.70392
##$PC= 1
##$PHC0= -9373.927
##$PHC1= 20.00026
##$PH_mod= 1
##$PKNL= yes
##$PPARMOD= 0
##$PSCAL= 0
##$PSIGN= 0
##$REVERSE= no
##$SF= 200.130013532006
##$SI= 16384
##$SIGF1= 3
##$SIGF2= 2
##$SINO= 400
##$SIOLD= 16384
##$SREGLST= <1H.CDCl3>
##$SSB= 0
##$STSI= 0
##$STSR= 0
##$SW_p= 3612.71676300578
##$SYMM= 0
##$S_DEV= 0
##$TDeff= 0
##$TDoff= 0
##$TI= <>
##$TILT= no
##$TM1= 0
##$TM2= 0
##$TOPLEV= 0
##$USERP1= <user>
##$USERP2= <user>
##$USERP3= <user>
##$USERP4= <user>
##$USERP5= <user>
##$WDW= 1
##$XDIM= 8192
##$YMAX_p= 0
##$YMIN_p= 0
$$ End of Bruker specific parameters
$$ ---------------------------------
##NTUPLES= NMR FID
##VAR_NAME=  TIME,          FID/REAL,        FID/IMAG
##SYMBOL=    X,             R,               I
##VAR_TYPE=  INDEPENDENT,   DEPENDENT,       DEPENDENT
##VAR_FORM=  AFFN,          ASDF,            ASDF
##VAR_DIM=   8192,          8192,            8192
##UNITS=     SECONDS,       ARBITRARY UNITS, ARBITRARY UNITS
##FACTOR=    0.0002004,     1,               1
##FIRST=     0,             0,               0
##LAST=      1.6414764,     0,               0
##MIN=       0,             -270685,         0
##MAX=       1.6414764,     390161,          0
$$ Real data points
##PAGE= N=1
##DATA TABLE= (X++(R..R)), XYDATA
$$ [...]
1399a39n5M02j711O8K674O59j506j81j52j964O9M087J887m242l333K507K869j769
$$ -139 -194 208 -1503 -1435 1239 1898 392 211 59 -1905 -1836 2251 4138 -104 -3437 -930 1939 170
1417A70j224K643M28m176j273L884J917j967p34K88j970k77L990J072l924o38
$$ 170 -1054 1589 2017 -2159 -3432 452 2369 402 -332 -44 -2014 -2291 1699 2771 -1153 -1791
1433a791L350j484l692L501N221l648n847K614M665k027k291K890O44l722o56
$$ -1791 1559 75 -3617 -116 5105 1457 -4390 -1776 2889 862 -1429 1461 2105 -1617 -2273
1448b273L191M82j132R63q37l186Q83M668m51m457O15L415j986l307L153M269
$$ -2273 918 1400 268 1231 394 -2792 -1909 2759 2308 -2149 -1534 1881 -105 -3412 -259 4010
1464D010l111m623J963L635j234j690J687O46k449l71K415K41j533J065R06k877
$$ 4010 899 -3724 -1761 1874 640 -1050 637 1283 -1166 -1537 878 1119 -414 651 1557 -1320
1480a320j103M177J674m366j512M066K60m178P04M399j132m088J224K584j921
$$ -1320 -2423 1754 3428 -938 -2450 1616 1876 -2302 -1598 2801 1669 -2419 -1195 1389 -532
1495e32p24K955p05l748J465L814k543l136L948K793m992k732N237K565m453j640
$$ -532 -1256 1699 994 -2754 -1289 2525 -18 -3154 794 3587 -1405 -4137 1100 3665 -788 -2428
1511b428L831J89l126P06K540r30j409J215k93j924J535K815k124l269K310K991
$$ -2428 1403 1592 -1534 -828 1712 782 -627 588 295 -1629 -94 2721 597 -2672 -362 2629
1527B629k916k686L480K708l852k905L443K473k760j372K548K50k707M58K576
$$ 2629 -287 -2973 507 3215 -637 -3542 -99 2374 -386 -1758 790 1040 -1667 -1209 1367
1542A367q06j658J834M46k991K15M086k74m208P20L512j658k966K862K712l284
$$ 1367 561 -1097 737 1183 -1808 -1593 2493 2219 -1989 -1269 2243 585 -2381 481 3193 -91
1558i1k531K784J253k346O93K233k277k535K957K117l174j043L549k18m211O77
$$ -91 -2622 162 1415 -931 -238 1995 -282 -2817 140 2257 -917 -1960 1589 1371 -2840 -2163
1574b163M579m63l807M38K593r12j476J576J032j458n72R05m01l33J727N01k709
$$ -2163 2416 1953 -1854 -1416 1177 265 -1211 365 1397 -61 -633 272 -129 -462 1265 1766 -943
1591i43j035K765J096k371p67K511J53l120k82L390N95k908o11J766L4j175R62
$$ -943 -1978 787 1883 -488 -1255 1256 1409 -1711 -1993 1397 1992 -916 -1527 239 273 -902 60
1608F0J023j429p71J253rj187J398J678k320k065K494K007k140j231K203K76k403
$$ 60 1083 -346 -1117 136 127 -1060 338 2016 -304 -2369 125 2132 -8 -1239 964 1240 -1163
1625a163K47K337l44j711P31M30j421K90K148p43k458Q82K092j346j683J786J528
$$ -1163 -916 1421 1077 -634 97 527 -894 -604 1544 801 -1657 -775 1317 -29 -1712 74 1602
1642A602j875j619J399J461p23p48K59K79k29K05j14JM67M02r61p45J088J316
$$ 1602 -273 -1892 -493 968 245 -503 -244 35 -194 11 -103 -102 365 767 -194 -939 149 1465
1660A465p77j658N04J484k94j667N73J592n73j760K28J593o0j153oN46k47j45
$$ 1465 688 -970 -466 1018 724 -943 -370 1222 649 -1111 -883 710 650 -503 -509 37 -210 -355
1678c55L52j34k92O18N7j118J87J509j66j550K94J371k80r58M38P16m80m37M30
$$ -355 -3 -137 -429 189 246 -872 -685 824 658 -892 -598 773 493 -465 -27 689 209 -228 202
1697B02m5k26N25J37j013q3J022J16j001j48Q78L7q45j81N79L44k25o50O6N69
$$ 202 157 -69 456 593 -420 -503 519 635 -366 -514 364 401 -444 -625 -46 298 73 -577 -511 58
1717E8K57n20m53O72M72n30n16L87P05o6o30k62O48N62m77p87M93Q44m17j013
$$ 58 315 -205 -658 14 486 -44 -560 -173 532 466 -164 -426 222 784 307 -480 13 857 440 -573
1737e73L88R92l65r83J31P05k5m58q5J5K00J49k95l34M42M43m53n01M56N42l32
$$ -573 -185 807 442 -541 -410 295 270 -188 -273 -258 -58 91 -204 -538 -96 347 -106 -607 -151 391 59
1758E9m13K43L12j14k6km6J84K08l25k31L33L68m07k66P8K92Jl07k90K65L56j52
$$ 59 -354 -111 201 87 61 59 13 197 405 80 -151 182 550 143 -123 -45 247 248 -59 -349 -84 272 120
1781A20o25L0O98Mp82qP90K7o36j37N55K69l41k25O9M99K03n36l18N09N90o41
$$ 120 -505 -475 223 227 -555 -563 227 254 -382 -519 36 305 -36 -261 -192 307 510 -26 -344 165 755 114
1803A14o40O18O17m65o01L11M41r1m53j10K47K16k04l72L4M32O4n89l0M30J43
$$ 114 -526 92 709 244 -357 -46 395 304 -149 -259 -12 204 0 -372 -338 94 158 -431 -461 -31 112
1824A12l59p0J87J15K1n0j12O9K68O8k68p1L69Q7k38k00J79K06o0k18j58K55K39
$$ 112 -247 -317 -130 -15 6 -44 -156 -87 181 249 -19 -90 279 366 128 -72 107 313 253 35 -123 132 371
1847C71l61m08K88M93l40m54J43N14k08l69l2L26J68k36k94J05N92j02n69j6O78
$$ 371 10 -398 -110 383 43 -411 -268 246 38 -331 -363 -37 131 -105 -399 -294 298 196 -373 -389 289
1868B89J62o23j08M79K16l51k07K69J50n5j60j09J88J98k55l68K16L02p3m78N3
$$ 289 451 -172 -280 199 415 64 -143 126 276 221 61 -48 140 338 83 -285 -69 233 160 -318 -265
1889b65K49N0k13j14J31J18o2j99J8K76J98k60k16J23L71Q5l66k0K70J86k84j45
$$ -265 -16 34 -179 -293 -162 -44 -106 -305 -287 -11 187 -73 -289 -166 205 290 -76 -96 174 360 76 -69
1911f9J74L40j49n06J10M17Nm91K9K55P1k07k57Q7L09ml89k49L97L58l23l07K03
$$ -69 105 445 296 -210 -100 317 322 -169 -140 115 186 -21 -278 -191 118 114 -275 -524 -127 231 -92 -399 -196
1934a96M42m14k53M16L40j87l30J11K15oP3k0j69L3J14n9j1J00J52k26l21P5K66
$$ -196 246 -168 -421 -5 335 148 -182 -71 144 138 211 191 22 55 169 110 99 199 351 125 -196 -121 145
1957A45qj83m8r6l0J83N4j82l5J34R6m38J17M57J25n49k46N74K97l35k97M48K38
$$ 145 137 -46 -94 -190 -220 -37 17 -165 -200 -66 30 -408 -291 166 291 -258 -504 70 367 32 -265 183 421
1980D21l50l32L14M31j8l56l21K40L19r6l67K8L84j00o31m7P82J42p07m10N39
$$ 421 71 -261 53 484 466 110 -211 29 348 252 -115 -87 297 197 -434 -481 301 443 -264 -674 -135
2001a35L81l49k54L85J14l39k68L84L71Ok39l09L3L42K21j40j38J72Ol10m5M56
$$ -135 246 -103 -357 28 142 -197 -465 -81 290 296 57 -252 -219 123 344 204 66 238 244 -66 -111 345
2023C45K08l94l64J42J19k6O7J62l41k59K64R8j98LL90k26o47K20O42J09m62j42
$$ 345 553 159 -205 -63 56 30 97 259 -82 -341 -77 21 -177 -174 216 -10 -657 -437 205 314 -148 -290
2045b90L27j9j28J21K45M6j95k17j18L06N91j91p70rO36j2n99K74N32l59p76P3
$$ -290 37 18 -110 11 256 302 107 -110 -228 78 669 478 -292 -301 335 323 -276 -2 530 171 -605 -532
2067e32Q37J08n73k80K69Q6K4r3N4J07J6k67k18K79O56j66o59M0N30J32m08M8
$$ -532 305 413 -160 -440 -171 -85 -61 -154 -100 7 23 -244 -462 -183 473 307 -352 -312 218 350 -58 -10
2089a0M08l6n60p7N32J99k59j69l8k12J74L23j92k48J11J90m63j46N61L45o65
$$ -10 398 362 -198 -275 257 456 197 28 -10 -222 -48 275 83 -165 -54 136 -327 -473 88 433 -232
2110b32m60N25L19k20n7J57Lj60P8n3P7L05K05n54l86N98N64m80o73N52N07o18
$$ -232 -692 -167 152 -68 -125 32 35 -125 -47 -100 -23 282 487 -67 -453 145 709 229 -444 108 615 -3
2132cm54N83L74k98m99L3L23K7j19j01q1J18K09l56k16M59L50l46n83L41O51k07
$$ -3 -457 126 500 202 -297 -264 59 86 -33 -134 -215 -97 112 -244 -460 -1 349 3 -580 -239 412 205
2154B05n07K55M44k36l95J71L38N8j84q9j06Q2K39N8m09q9M97j50o10L7Q20J1
$$ 205 -302 -47 397 161 -234 -63 275 333 149 60 -46 36 275 333 -76 -165 332 182 -428 -391 429 440
2176D40q77r9O19O7l80MK45r1r6J3N4M0L74k0o49j68P72L67p12j24O25M8p32j13
$$ 440 -437 -536 83 150 -230 -226 19 -72 -168 -155 -101 -61 313 293 -356 -524 248 615 -97 -221 404 452 -280 -393
2200c93P98K25n31m54K50K60R3j31j50j32J96l6l66J90N28l1p12l50O87N43m93
$$ -393 405 630 99 -355 -105 155 248 117 -33 -165 31 -5 -371 -181 347 316 -396 -746 -59 484 -9
2221im44L63K65k88k60M73L53k54l33q9K06L03J42k45m25K22L67k09k84K73M57
$$ -9 -453 -90 175 -113 -373 100 453 199 -134 -223 -17 286 428 183 -242 -20 347 138 -146 127 584
2242E84n42o78L70P21j76n14p3K31p4mP1q1J47M8k87k48L52P40l04q57J82Q05
$$ 584 42 -636 -266 455 279 -235 -308 -77 -151 -155 -84 -165 -18 30 -257 -505 -153 587 283 -574 -392 413
2264D13o1o87L08M85k08n21k9N60K31j89m44j36M27J74k30l54L06K93m35m38K84
$$ 413 352 -335 -27 458 250 -271 -300 260 491 302 -142 -278 149 323 93 -261 45 338 -97 -535 -251
2285b51O09k9p24k27O11K72m00k85M09K12l56k20L06L88N8l82j99J03L22K50m61
$$ -251 358 329 -395 -622 -11 261 -139 -424 -15 197 -159 -379 -73 315 373 -9 -208 -105 217 467 6
2306Fj44L38K64n29k84O19K83m78n27K93M02j38k57n8J31J60r9l31M0M74P6n36
$$ 6 -138 200 464 -65 -349 270 553 75 -452 -159 243 105 -152 -210 -79 81 -18 -349 -309 165 241 -295
2328b95l07N42N15m54m35L36N31l01m06J50M57M7m33k10L27N07k06n45k5M62J26
$$ -295 -602 -60 455 1 -434 -98 433 132 -274 -124 333 380 -53 -263 64 571 365 -180 -205 257 383
2349C83n01j69L92K89m29m55K03N96l2o89q5M99L02m97k97M82K92k83l91P6M62
$$ 383 -118 -287 105 394 -35 -490 -287 309 277 -412 -497 2 304 -193 -490 -8 284 1 -390 -314 148
2370A48K48l96l90L38M54q8n35Q4N14J27n67l60O29L69m57m58K09L73n0m15j01
$$ 148 396 0 -390 -52 402 314 -221 -137 377 504 -63 -423 206 575 118 -340 -131 242 192 -223 -324
2391c24L38K05k71m04J82N75Ro39k37O43K48m12l32L82N03k76n32R2N56J93n77
$$ -324 14 219 -52 -456 -274 301 310 -329 -566 77 325 -87 -419 -37 466 190 -342 -250 306 499 -78
2412g8k03L28M53k31n36J46N15m7m64k28M34L06l61m72J35O14j00n81j03N88J62
$$ -78 -281 47 500 269 -267 -121 394 347 -117 -345 89 395 34 -438 -303 311 211 -370 -473 115 277
2433B77m51l07L99L53k38m19M6M30K17l24l25L31M66j89n02N7N43J22n20k38L78
$$ 277 -174 -481 -82 271 33 -386 -340 90 307 -17 -342 -11 455 266 -236 -179 364 486 -34 -272 106
2454A06L16l12l63J16M46o0l86k39L46L35l17m93J95N31N7o78r3N98K67m70m25
$$ 106 422 110 -253 -137 309 249 -137 -376 -30 305 -12 -505 -310 221 278 -400 -493 105 372 -98 -523
2475e23M07N62k20n59oN88J95n02k91M24M79k81n95J48N96O2o70j88N85K94n07
$$ -523 -116 446 226 -333 -339 249 444 -58 -349 75 554 273 -322 -174 422 484 -186 -374 211 505 -2
2496bn04L14N74j44o43q7O45J32n34l13M39M12k76l57J5N77P2m50k30M39L71k83
$$ -2 -506 -192 382 238 -405 -492 153 285 -249 -562 -123 289 13 -344 -329 248 320 -130 -360 79 450 167
2518A67m70J93N49l7o02q2M53K76l14m44K11L78O5m94k61M56L29l43n29K96M67
$$ 167 -303 -110 439 402 -200 -282 171 447 133 -311 -100 278 343 -151 -412 44 373 30 -499 -203 264
2539B64n2n78r7N53K24m89k75L37M21j20n38N3N35J96n31l41M46N34k89n89J57
$$ 264 212 -366 -463 90 314 -175 -450 -113 308 188 -350 -297 238 434 -97 -438 8 542 253 -336 -179
2560a79O37J8o89k04N84L98m92n66L42N75k08o79N5O23O1n27j86L34M03k17n13
$$ -179 458 476 -213 -417 167 565 73 -493 -151 424 216 -463 -408 215 276 -251 -437 -103 300 83 -430
2581d30J46N30R3n05l16N73M34m52m86L27O14j48n98J1M46K72l59l86J68L55M2
$$ -430 -284 246 339 -166 -482 91 525 73 -413 -86 528 380 -218 -207 239 511 152 -234 -66 289 331
2602C31m11k98M81L77n37n02L18O62l00o17Q2N73R8n18j87M16L51k69m43Q9N63
$$ 331 -80 -378 103 480 -57 -559 -241 421 121 -496 -414 159 257 -261 -448 -32 319 50 -393 -304 259
2623B59K06m77m19M91N81m34o08K09P58j19p67o7P06K23o55l49M39L89k84m30
$$ 259 465 -12 -431 60 641 207 -401 -192 566 447 -320 -387 319 542 -113 -462 -23 366 82 -348
2643c48L8M21J22m19k92L24M88j11o79k3P27J04o78j53O95K47o21k12M58L99k77
$$ -348 -310 111 233 -186 -478 -154 334 223 -456 -479 248 352 -326 -479 216 463 -158 -370 88 487 210
2664B10k40j13J79K46n2k90j15M12J21n27l68P63L72o94o21N86N63m30m84K52
$$ 210 -30 -143 36 282 230 -60 -175 237 358 -169 -537 226 598 -96 -717 -131 432 2 -482 -230
2684b30L53rm11r1L11L02l1m93k51O90N06n97o33O10P34n86q11O18Q34l64r44
$$ -230 123 114 -297 -388 -77 225 194 -299 -550 140 646 49 -584 26 760 174 -637 -19 815 451 -493
2705d93J35Q09J3n73p8K06J27j00k30j00M11L30n68o72N17Q65l04r40K35Q70l33
$$ -493 -358 451 464 -109 -187 19 146 46 -184 -284 127 457 -111 -783 -266 599 295 -645 -410 460 127
2726A27o52K37P07l1p12k3L81J95J4j49j91k4M42l2n21P0P47j10j043l7J020K82
$$ 127 -525 -288 419 388 -324 -347 34 229 243 94 -97 -121 321 289 -232 -162 585 475 -568 -605 415 697
2748F97r36l38O38K36m73j12L20Q8j81q8k63J60O25L4p35l91Q61N23q67m19R93
$$ 697 -239 -577 61 297 -176 -288 32 120 -61 -149 -412 -252 373 407 -328 -719 142 665 -202 -621 372
2769C72M49j047n45R32O71o18o12K83L84l2j37r7NJ94L7o06k17Q75M51q87q03
$$ 372 821 -226 -771 161 832 214 -398 -115 269 237 100 3 8 202 239 -367 -584 291 742 -145 -948
2790i48Q33P20o78o40O26O83o51o78N81N12j71l38jrJ50L58j34m37K11N42m02
$$ -948 -115 605 -73 -713 -87 596 -55 -733 -152 360 189 -149 -150 -159 -9 349 215 -222 -11 531 129
2811A29p15N48Q51l96j139K64R24l6q00P9O28k43l61oJ53J70K46k46p14K34R52
$$ 129 -586 -38 813 417 -722 -458 466 430 -370 -291 337 94 -267 -273 -120 50 296 50 -664 -430 522
2832E22k1j033pJ127j46j112J31J214Q3j148j75P38K83l87j04J79j2K5q0l43J28
$$ 522 501 -532 -539 588 442 -670 -539 675 758 -390 -565 173 456 69 -35 144 132 157 77 -266 -138
2853a38O95q2j033j64J001L73r53l99Q66K65r10j63R00L41p20l35K03K50K7J95
$$ -138 557 475 -558 -722 279 652 -301 -700 166 431 -479 -642 258 599 -121 -456 -253 -3 24 219
2873B19j94l19K65L87l98m01P00N87q89p86P89R45o01p19M13M49n38k42L68K06
$$ 219 25 -294 -29 358 -40 -441 259 846 -43 -829 -40 905 304 -415 -2 447 -91 -333 35 241
2893B41j83l1k69l47N26O91m39r74L47J004m07q90N48J072o34j117L30J127o2
$$ 241 58 27 -242 -589 -63 628 189 -785 -438 566 159 -731 -183 889 255 -862 -532 595 533
2912E33p80N6L30kj65L2N5J36K23l85o81L88J059k52j117o5J090j7j019J89J037
$$ 533 -247 -191 139 137 -28 4 59 195 418 33 -648 -260 799 547 -570 -635 455 438 -581 -392 645
2933F45k97j014QQ37J18k67o6j76j89M44K73l39k36N15J13q73o9J207L00j108
$$ 645 348 -666 -658 179 297 30 -36 -212 -401 43 316 -23 -259 256 369 -504 -573 634 934 -174
2953a74m49P18M13n30j86M76l4l41j03j3J88L25J12p48l99P73O29o64o58P49N27
$$ -174 -623 95 508 -22 -208 268 234 -107 -210 -223 -35 290 402 -346 -745 28 657 -7 -665 84 611
2974F11r00o42R73Q58p68r53M37O84p7k91J04J3n5J30k56j10O00M84q79q16P24
$$ 611 -289 -931 42 900 132 -821 -384 300 223 -68 36 49 -6 124 -132 -242 358 842 -37 -853 -129
2995a29R93n63r88N30P31n76p33N93P16l94n74O7J75J50K16j36n54K39N95k26
$$ -129 864 301 -687 -157 574 -2 -735 -142 574 180 -394 -327 -152 -2 214 78 -476 -237 358 132
3015A32o88N35P61n31q96L06J028r8o95m6L59O6k61nQ9J35K9k66l83K84P13j61
$$ 132 -556 -21 740 209 -687 -381 647 549 -146 -192 167 233 -28 -33 56 191 220 -46 -429 -145 568 407
3037D07r04j01R28J03q92o6Q33J61r34k80Q29L93m34m34K36K94Q7k77j21Q4N08
$$ 407 -497 -598 330 433 -459 -525 308 469 -465 -745 84 477 43 -391 -155 139 226 -51 -172 -88 420
3058D20j30p50K9R95J96j043m32J021M40r14l09O63L04n96l58M04K21l6j54l42
$$ 420 290 -460 -431 564 760 -283 -715 306 746 -168 -477 186 490 -106 -464 -60 161 125 -29 -371
3078c71M2N15J10n78j74N81K42n64k90O18L85n02l90K61M09nk71k02K43J84p0
$$ -371 -329 186 296 -282 -456 125 367 -197 -487 131 516 14 -376 -115 294 289 18 -184 59 243 173
3099A73l15n5N32N0m94l83M86N68l98p24K98O64j03q18kQ12R0p16k19N04L41k27
$$ 173 -142 -197 335 385 -109 -492 -6 562 164 -560 -262 402 299 -519 -521 291 381 -335 -554 -50 291 64
3121F4m00pM60K81m53m36N01O21m57q10L80R86l40p75P9P06M9o14j26M23J61j79
$$ 64 -336 -343 117 398 -55 -491 10 631 174 -636 -256 730 390 -385 -306 400 449 -165 -291 132 293 114
3143A14l93L3K78K47l19m42L42M75k73n16J90N01m1m46j35L77L28k48l20M6M78
$$ 114 -279 -246 32 279 -40 -482 -140 335 62 -454 -264 237 196 -250 -385 -8 320 72 -248 -202 276
3164B76N5m02k56M15L09j61n75K02M48J20n41l27M17N52m65n75K91O20j11p91
$$ 276 331 -71 -327 88 397 236 -339 -137 311 431 -110 -437 -20 532 67 -508 -217 403 292 -499
3184d99O5O92J05n78j87K76N01k38m80n4O71K51p24l78P45M67o04o18N36O06k82
$$ -499 -434 258 363 -215 -402 -126 375 137 -343 -397 274 525 -199 -577 168 635 31 -587 -51 555 273
3205B73n96J63M44Q5l66k93K79M03j12o29L3N58J01n87k78M97K82k73l29J42L89
$$ 273 -323 -160 284 369 3 -290 -11 392 280 -349 -316 242 343 -244 -522 -25 257 -16 -345 -203 186
3226A86ll56j65K86L86k61m12J11N19P4n33q5L89K51k40m68J47N77o8n35j93N35
$$ 186 183 -173 -338 -52 334 73 -339 -228 291 365 -168 -253 136 387 147 -321 -174 403 335 -200 -393 142
3248A42L41n45l84L94M22j68o37O7N50K10o28l25N26M68k71p54K86P49j05p52
$$ 142 483 -62 -446 -52 370 202 -435 -368 182 392 -236 -561 -35 433 162 -592 -306 443 338 -414
3268d14O1P28P2n67j84L27M08k86l19r9M96J14k78m19L20N55l61n47J93N97j61
$$ -414 -353 375 447 -120 -304 23 431 145 -174 -273 223 337 59 -360 -40 515 154 -393 -200 397 236
3289B36n02o6M36J02k41l11K09K27Pk81j47L25K87k13m21L9O14j2m86j28N06K52
$$ 236 -266 -332 104 206 -35 -346 -137 90 97 -184 -331 -6 281 68 -353 -314 300 288 -198 -326 180 432
3311D32m55k78K48N15k39m98J8M77J05k41m32K80L94j30n56m6P36J50p79l98P37
$$ 432 -23 -301 -53 462 223 -275 -257 220 325 84 -348 -68 326 196 -360 -406 330 480 -299 -697 40
3332D0M69n18n09L09O46l37m90K06M35O5m10k48K41M90l8n82m0N17J64n86j24
$$ 40 509 -9 -518 -209 437 100 -390 -184 251 316 -94 -342 -101 389 351 -231 -271 246 410 -176 -300
3353c00M48L27n01n00M21M31j09m51k3L02J02k01k00J60K23Rm16j67M45M04k35
$$ -300 148 475 -26 -526 -105 326 217 -234 -257 45 147 -54 -254 -94 129 138 -278 -445 0 404 169
3374A69n28O0N16L9m48l6N39P0n05k48L79M95k18m19j74L12L52k95l91K91M76
$$ 169 -359 -299 217 256 -192 -228 311 381 -124 -372 7 502 284 -135 -309 3 355 60 -331 -40 436
3395D36l26o30K58P22rq35j78N89L88n03l29M24L26l46m80K49N70R8m97l20K80
$$ 436 110 -520 -262 460 451 -384 -562 27 415 -88 -417 7 333 -13 -493 -244 326 424 -73 -393 -113
3416a13M51n2m39J5M08K3n27j56O32M19n89n29K49M53jl80L9K15j29j98o0J75
$$ -113 338 286 -153 -138 270 293 -234 -390 242 661 72 -457 -208 245 244 -136 -97 118 -11 -209 -269 -94
3438i4L02K4m77l01M04N79k28n28J56M91k27m77K16O81L7p81k91N86K82r1k94
$$ -94 208 232 -245 -546 -142 437 209 -319 -163 328 101 -376 -160 521 558 -223 -514 72 354 263 -31
3459c1j19J96J84k60k66M16M20l46q24J39R24J11r31q5O38N1o41KP27J04n93l49
$$ -31 -150 46 230 -30 -296 120 540 194 -630 -491 433 544 -387 -472 166 217 -424 -422 305 409 -184 -533
3481e33L57L51J46j44l42l4L55J05m18j7O65pr79j35R57L87p00m27M04J87m67
$$ -533 -176 175 321 177 -165 -199 156 261 -157 -174 491 484 -495 -630 327 714 14 -413 -9 178 -289
3502b89J68M05j20l07Q2j16k19N05M79n75p86N06O98l91n56O85M75q80m97P94
$$ -289 -121 284 164 -143 -61 -177 -396 109 588 13 -773 -267 431 40 -516 169 644 -236 -733 61
3522F1N00l45l10M8q0K3M02j8m30O8N65m82p26P84J012q56j218N56J201o05p40
$$ 61 561 216 -94 -46 -126 -103 299 281 -149 -81 484 2 -724 60 1072 216 -1002 -446 755 150 -590
3543e90O23O07p68n79O68L44k08Qj00m36L9Q46J6r68K04Q30m21r43P21J124o37
$$ -590 33 640 -128 -707 -39 305 97 105 5 -431 -392 454 470 -498 -294 536 115 -828 -107 1017 380
3564C80j137L91R36n00l26N52J33q13K9O26k66l04O52Q0j075j71J252L42j186
$$ 380 -757 -366 570 70 -256 296 429 -384 -355 271 5 -299 353 433 -642 -813 439 781 -405
3583d05j70J008k17j000M53J009l13q51K96L39l43J94O57n89o77O43O47r33l95
$$ -405 -575 433 216 -784 -331 678 365 -486 -190 149 -194 0 657 68 -609 34 681 -252 -647
3602f47J268K49j456m95J616L99j278k40J004j40q75K86P56l16m97L72p9m19N28
$$ -647 621 870 -586 -1081 535 934 -344 -584 420 280 -595 -309 447 131 -366 6 -73 -492 36
3621C6P16q69p64Q44Q18j084m36J261L33j422l18J320L53j049L6P53m83n31O80
$$ 36 752 -117 -881 -37 781 -303 -739 522 855 -567 -885 435 788 -261 -225 528 45 -486 194
3640A94L71o80j63P26l15r04P05J044p92j101P69Q32p93n90Q78L86r11k92P60
$$ 194 565 -115 -278 448 133 -771 -66 978 186 -915 -146 686 -107 -697 181 567 -344 -636 124
3659A24N5l93L80R6p69K8R88Nj095K74J172o91j140Q01J217p32j073N41P79n81
$$ 124 179 -214 166 262 -507 -479 509 514 -581 -307 865 174 -966 -165 1052 320 -753 -212 567 -14
3679a4m30O65J60o00N3L44l07j62P75j52j030J49J150k04j077L34J099n86j022
$$ -14 -444 221 381 -219 -166 178 -129 -291 484 332 -698 -549 601 397 -680 -346 753 167 -855
3698h55O56R27n28o61M11L56l69q5N28k09n24M12L09o10q5P44J05j026j48J029
$$ -855 -199 728 200 -461 -50 306 -63 -148 380 171 -353 59 368 -242 -327 417 522 -504 -652 377
3718C77J56q88O8O80k74n38K57M69l41j06K74k42l95N73M23o00n40P37M87q73
$$ 377 533 -355 -287 393 119 -419 -162 307 -34 -140 134 -108 -503 70 493 -107 -647 90 577 -296
3738b96k19Q74L29r94l11Q74K68n89j39M00p8j97J61n1j93L04J80n28l17O84M44
$$ -296 -515 359 688 -306 -617 257 525 -64 -203 197 119 -78 83 32 -161 143 323 -205 -522 162 606
3759F06p46m98P77K99o68k43O18L74o46l21M96J48j85m5P6j85J09K85j94k34J64
$$ 606 -140 -638 139 438 -230 -473 145 519 -127 -448 48 196 11 -34 42 -143 -34 251 57 -177 -13
3780a3L57k64m92L70N29l54m64L30K67k19l04K65J31j23p8nj31O5M04k39m84K15
$$ -13 344 80 -412 -42 487 133 -331 -1 266 47 -257 8 139 16 -62 -67 -198 -133 271 32 -452 -237
3802b37N33r5o12J78N80j31o23J12N40J07m92n3K59J32r0k06o0K46K53k91l66
$$ -237 296 201 -411 -233 347 216 -407 -295 245 352 -140 -193 66 198 108 -98 -158 88 341 50 -316
3823c16K73L91j46o05J64N78j70m56k0M39J40m01j60K58K01j40k47P1K12Pq8j92
$$ -316 -43 348 202 -403 -239 339 169 -287 -307 132 272 -129 -289 -31 170 30 -217 -146 66 73 -15 -207
3845b07J00K96o4k67J9K73J08l21j61L16J54j88k18R4K67j12q9j24M6J83K0k74
$$ -207 -107 189 125 -142 -123 150 258 -63 -224 92 246 58 -160 -66 201 89 0 -124 -78 105 125 -149
3867a49q7L04J72l29j97L05J87j66l65K66L62j69l56R7K35J70k57k81K84L47k30
$$ -149 -236 68 240 -89 -286 19 206 40 -325 -59 303 134 -222 -125 110 280 23 -258 26 373 143
3888A43l70O8M52n1l52r3L30K10k96l15K73K54o8m23%L22J07l08k06L20K22k49
$$ 143 -227 -159 293 242 -110 -203 127 337 41 -274 -1 253 185 -238 -238 84 191 -117 -323 -3 219 -30
3910c0j53LL57k5k71l6J06J85p2j96J5K95L6k25j33J75J59r1k36O8J15P9k02r0
$$ -30 -183 -180 177 152 -119 -155 -49 136 64 -132 -117 178 214 -11 -144 31 190 99 -137 -69 46 125 -77 -167
3934a67J18K33j22k58L2L28m6l31m6L02J94k47k52J67L24j26l38L2L96Q9l77j21
$$ -167 -49 184 62 -196 -164 164 118 -213 -259 43 237 -10 -262 -95 229 103 -235 -203 193 282 -95 -216
3956b16K80K92l01k42J38K85j2k86j60L21K12k68l71K47L52j29l90J01L23j1m14
$$ -216 64 356 55 -187 -49 236 224 -62 -222 99 311 43 -328 -81 271 142 -248 -147 176 165 -249
3977b49j9L54O5k26o5P3J33Q4k26r7J13K78j34k15M5K48nl18M7L11jj30k87K43
$$ -249 -268 86 151 -75 -140 -67 66 150 -76 -173 -60 218 84 -131 -86 162 157 -161 -114 197 196 66 -221 22
4001B2M5M0l1j73L4J78k8j55j49L71J25m92q6L68K04l47k03K73K93l51k38J67
$$ 22 67 107 76 -97 -63 115 87 -68 -217 154 279 -213 -299 69 273 -74 -277 -4 289 -62 -300 -133
4023a33L87j13j99n8K2L16j8k92j11L52K05n24j28N07J90n69k40N09K42m11k70
$$ -133 254 141 -58 -116 -94 222 204 -88 -199 153 358 -166 -294 213 403 -166 -406 103 345 -66 -336
4044c36M22N3j96p8J34J1rR4j68j88K51L40k95l84L96K78l54l00L95L01m75j33
$$ -336 86 139 -57 -135 -1 10 1 95 -73 -261 -10 330 35 -349 47 325 -29 -329 66 367 -108 -241
4066b41L46J6j82O4J49k87k0L74n8m01Q5N87k88o10K84O83l83n19K65M50k65l51
$$ -241 105 121 -61 3 152 -135 -155 219 161 -240 -155 432 144 -466 -182 501 118 -401 -136 314 49 -302
4088c02L47O9j88NQ3j76L0M46j23n72J55O91k21p18L15P43m12o53L14O86l05n99
$$ -302 45 114 -74 -69 14 -162 -132 314 191 -381 -226 465 244 -474 -159 584 172 -481 -167 519 214 -385
4110c85M13K28l83o1L78r6k07J71P6m23K4N90O5q69M4P88p0p33K76O28l71o25
$$ -385 28 256 -127 -188 190 94 -113 58 134 -289 -265 325 390 -479 -435 353 283 -450 -174 454 83 -542
4132e42N19M86n31n9L54j51m80M48M95m52n22O11L21q05j89R29J36r63n8P45q2
$$ -542 -23 463 -68 -127 227 76 -404 44 539 87 -435 176 497 -308 -497 432 568 -395 -453 292 210
4153B10n04K71L22l72k83M44Km47M18L78n94n62Q25O04p92n15Q19K43q19j24R25
$$ 210 -294 -23 299 -73 -356 88 90 -357 61 439 -155 -717 108 712 -80 -595 224 467 -352 -476 449
4174D49J45q87L8M52j30k47L19K36n48n5M78k53l53M99M72p86n56P81N55p74k90
$$ 449 594 -293 -255 197 67 -180 139 375 -173 -228 250 -3 -356 143 615 -171 -727 54 609 -165 -455
4195d55O28L8o64J58P14j58n46K15L04n00k7P31l4q69J64P32l13n88N63N70o98
$$ -455 173 211 -453 -295 419 261 -285 -70 234 -266 -293 438 404 -465 -301 431 118 -470 93 663 -35
4216c5o15O19M90m89j01L37j21m54L31M54l79j74M33j50p41K98Q87k90q84K60
$$ -35 -650 -31 459 -30 -131 206 85 -369 -38 416 37 -137 296 146 -595 -297 590 300 -584 -324
4236c24P68l21n89N34N30n85n56M49M29k93K3K46l96k84M79K58m34q1M55j07p25
$$ -324 444 123 -466 68 598 13 -543 -94 335 42 65 311 -85 -369 110 368 -66 -147 308 201 -524
4257e24K47Q95l28o19J30L96j86l43M75J41m57k01M11mk05K96K65n86l18O05L10
$$ -524 -277 618 290 -329 -199 197 11 -332 143 284 -173 -374 37 33 -172 124 389 -197 -515 90 400
4278D00m64j26M23l8n46J40N95o1l73k4J34j55K0L81j66l17O8L17l44j30N69J01
$$ 400 -64 -190 233 195 -351 -211 384 323 -50 -74 60 -95 -75 306 140 -177 -109 208 -136 -266 303 404
4300D04o70k64N79L12m64j56M18nm28L5L37J49k08q0Kq4K14K48k08k94K25J05
$$ 404 -266 -530 49 361 -103 -259 159 154 -274 -239 98 247 39 -41 -39 -123 91 339 131 -163 62 167
4322A67k65j46M70K27n92j73L03K17k43j3J37o1j99P7J64ml6J2j54j85K40L24
$$ 167 -98 -244 226 453 -139 -312 -9 208 -35 -48 89 28 -171 -94 70 66 30 42 -112 -297 -57 267
4344B67j59k89P3J56l2o9Q0J77j19k19j1J76J27M2j53k25Q0J58N8k34R5J77j56
$$ 267 108 -181 -108 48 16 -53 27 204 85 -134 -145 31 158 200 47 -178 -98 60 118 -116 -21 156 0
4367@k78J97L41m5l48j16K53P7j11n3J19P2j70k31J69K43R7j21k75R8K01p5j29
$$ 0 -278 -81 260 215 -133 -249 4 81 -30 -83 36 108 -62 -293 -124 119 216 95 -180 -82 119 44 -85
4390h5J09J58j21j83M7K02J8q5k24J19J66l6j23J24M0j22j74M7J84L0k0j47oJ2
$$ -85 24 182 61 -122 -75 127 145 60 -164 -45 121 85 -38 86 126 4 -170 -123 61 91 71 -76 -82 -70
4414g0J43k1j11L3P0K7j61M9J99n0j95m0P7J88n7k7k5P9j17J0p7J37R6o7k34n1
$$ -70 73 52 -59 -26 44 71 -90 -41 158 108 -87 -127 -50 138 81 54 29 108 -9 1 -76 61 157 90 -144 -195
4440a95L34L8k31j03J91J20k31j31K69R4j75j79J87N9J0m1m7m1J07K0n6L0J37
$$ -195 139 177 -54 -157 34 154 -77 -208 61 155 -20 -199 -12 47 57 16 -31 -72 35 55 -1 29 166
4463A66m0k32p5K89J10k61m2R3R0j78p6K70q5o7m3Q7jM6K8j05j22N5K07j39n8
$$ 166 126 -106 -181 108 218 -43 -85 8 98 -80 -156 114 29 -38 -81 6 5 51 79 -26 -148 -93 114 -25 -83
4488h3O2J84j72j61J27J75mk23K0R8oR6m8q5K8J22p4j65R7K75j46l69J88J78m8
$$ -83 -21 163 -9 -170 -43 132 128 -95 -75 23 17 113 65 -20 8 130 56 -109 -12 263 117 -252 -64 114 66
4513F6k72M5K74o3j65M8J51Np3r5k1Q2J00j44l1J54R6j51k06K50J38p6j86Q2R9
$$ 66 -206 -161 113 50 -115 -67 84 89 16 -79 -100 -18 82 -62 -93 61 157 6 -200 50 188 112 -74 8 107
4538A07j7j52kJ51m8ql8k7N7R3j38m9K8O3M7j36n3J79m4p6k7J49j8J5j48O2Q3
$$ 107 90 -62 -64 87 39 31 -7 -34 23 116 -22 -71 -43 20 67 -69 -122 57 13 -63 -90 59 41 56 -92 -30 53
4565E3k7N2j29rJ02R3j92o4L07k1k42n4K25P1k16j04J95J14j29j19P9J06q2M0
$$ 53 26 78 -51 -60 42 135 -57 -121 186 165 -77 -131 94 165 -51 -155 40 154 25 -94 -15 91 9 49
4589D9j50P4Q0j06l2m7J94Nj55k5J69R6j76o8J51K0q7l3M4J13j20mN3J7Oo5k7
$$ 49 -101 -27 53 -53 -85 -132 62 67 -88 -113 56 152 -24 -92 59 79 -8 -41 3 116 -4 -8 45 62 68 3 -24
4616b4l9J16M7j52k8J16N9m6j50O8J09j49L0J09j19N9L8q0N5n8J65m1j94P8J87
$$ -24 -63 53 100 -52 -80 36 95 49 -101 -33 76 -73 -43 66 -53 6 44 -36 19 -39 126 85 -109 -31 156
4641A56n2j95K5J85Mk83J12J71n9r4k3R5P1j33k5n2J27M9o0j83J25J36p0k10J69
$$ 156 104 -91 -66 119 123 -160 -48 123 64 -30 -53 42 113 -20 -45 -97 30 79 19 -164 -39 97 27 -183 -14
4666a4J57j15j74J50J30r1j07M4J14r0l3K6MP1j6%jq5J28k8q9p2J49L4k08M8J34
$$ -14 143 28 -146 4 134 43 -64 -20 94 4 -29 -3 1 72 56 56 55 -30 98 70 -19 -91 58 92 -116 -68 66
4693F6rq1Mj0nk2R1j6j25L1J65j65n3J44J59k69p5J89J56k20o4J69P3j62m5J02
$$ 66 57 -24 -20 -30 -35 -57 34 18 -107 -76 89 -76 -129 15 174 -95 -170 19 175 -45 -109 60 133 -29 -74 28
4719B8M5o2Q4j33rJ24N5j14j56K20L1k02m6K15J03l19r9K82Rj63j6J05R2q2p8
$$ 28 73 11 95 -38 -47 77 132 18 -138 82 113 -89 -135 80 183 -136 -235 47 56 -107 -123 -18 74 -8 -86
4744h6J14k7KJ24n0j49J28P6j12q6O6J18j69J5R7M4j51o8J83o2j17J16N6j47n4
$$ -86 28 1 3 127 77 -72 56 132 20 -66 0 118 -51 -36 61 105 -46 -114 69 7 -110 6 62 -85 -139
4769a39J96j1j74L9J93j3k82Q4L31j16k10P2J41j13q1Q4M4kJ3N2k04O2J87j31
$$ -139 57 46 -128 -89 104 91 -191 -107 224 108 -102 -30 111 -2 -83 1 45 43 56 108 -96 -34 153 22
4793B2o0o4K62n2k41N0L38j97k72P9K78j1k55O2J25j01q3J59%n3K1N2j76lK26
$$ 22 -38 -102 160 108 -133 -83 255 58 -214 -135 143 132 -123 -61 64 -37 -120 39 39 -14 7 59 -117 -120 106
4818A06J1k15M3J69p1q9M8J77j30k01Q2J73j30K8K9l5j39Q9J07j0j27P1J04j90
$$ 106 117 -98 -55 114 43 -46 2 179 49 -152 -70 103 -27 1 30 -5 -144 -55 52 42 -85 -14 90 -100
4842a00j22K36J40j88q0J08P4q8rP4J15k21P0L4j43K11L6o6j74M1J85p0j00J27
$$ -100 -222 14 154 -34 -114 -6 68 -20 -29 45 160 -61 9 43 -100 111 147 81 -93 -52 133 63 -37 90
4866I0J10k85j25K54J63k07q1M5Q3j44R5J15n6j37O1N1r0N9R1r8j54N1K19j1j08
$$ 90 200 -85 -210 44 207 0 -81 -36 47 -97 -2 113 57 -80 -19 32 -58 1 92 -6 -160 -109 110 99 -9
4891iL7jq4j14K10J28j21j19M1O4j01J06J63j70j66K8J44p5l5J20P2k07j16K51
$$ -9 28 27 -57 -171 39 167 46 -73 -32 32 -69 37 200 30 -136 -108 36 -39 -74 46 118 -89 -205 46
4915D6M8n0q8P9o1j68J42J89j3j06j5m4l5J31J12j49j57N7K09j33J6J37N7k35
$$ 46 94 44 -44 35 -26 -194 -52 137 124 18 3 -41 -76 55 167 18 -139 -82 127 -6 10 147 204 -31
4939c1k02J94K15p4k32J66j9j17J8J31K6j17N1m6j08J38K20j55k02J7J51l5k8
$$ -31 -233 -39 176 102 -130 36 17 -100 -82 49 75 -42 9 -37 -145 -7 213 58 -144 -127 24 -11 -39
4962c9J19O7k39o2K41P6j09o6R4j66j62K48K00m2k22J07P6k93J11K11Rk61q3K42
$$ -39 80 147 -92 -154 87 163 54 -12 82 -84 -246 2 202 160 -62 45 121 -172 -61 150 159 -102 -185 57
4986E7M1j71J99o0j28r6K24Q3r0LP1k29j25K70J54k41r7J96M9k58K0L27M3l97
$$ 57 98 -73 126 66 -62 -158 66 149 59 62 133 -96 -221 49 203 -38 -135 61 110 -148 -128 199 242 -155
5010a55K3J75O3j62P8J42k03k03K16J01r7L8O9k07r0K12J39j17j30J38N0k63P6
$$ -155 -132 43 106 -56 22 164 -39 -242 -26 75 -22 16 85 -122 -212 0 139 22 -108 30 80 -183 -107
5033a07L15j03j70J0J92j57n6J77P7k76p9K54jj58Q8J03j07j41J59J39j00j75
$$ -107 208 105 -65 -55 137 -20 -76 101 178 -98 -177 77 76 -82 6 109 2 -139 20 159 59 -116
5055a16J38P7k18L1K10q7j28N1J13j71L2J91P6k65q3K08l5j40J37K20k60k00J92
$$ -116 22 99 -119 -88 122 35 -93 -42 71 -100 -68 123 199 -66 -149 59 24 -116 21 241 -19 -219 -27
5078b7J41j37o7J35J0n4q5K00o0j55N8P3o9m8J49M3j96L0L7M7j51J46J30k13j10
$$ -27 114 -23 -90 45 55 1 -84 116 56 -99 -41 32 -37 -85 64 107 -89 -59 -22 25 -126 20 150 -63 -173
5103a73J17K16j87J0P6J1j35K2K00r8k19K30M1j39q0J41L1j31K5J38n5j81J53
$$ -173 -56 160 -27 -17 59 70 -65 -43 157 59 -160 70 111 -28 -108 33 64 -67 -42 96 41 -140 13
5126A3O6j18l9M8j6l4K2J29r6j28J17J37p4j61J51J24r4j03J34P1j79m1J26l9
$$ 13 79 -39 -78 -30 -46 -80 -58 71 -25 -153 -36 101 27 -134 17 141 47 -56 78 149 -30 -71 55 16
5150A6o4J4R6j5j27R7Qo4k9J56p7j93J91M5l8j21J32K5j26nR6O3q7l6P2l9m4R4
$$ 16 -48 -34 62 47 -80 17 25 -39 -68 88 11 -182 9 54 16 -105 27 52 -74 -79 17 80 -7 -43 29 -10 -54 40
5178D0Jp8n5J75m4o5kJ48n5r5K4M6p8PO2l3n0j5J36o3p6P7L7r0j10J75L9p5n9
$$ 40 41 -37 -92 83 39 -26 -28 120 65 -30 -6 40 -38 -31 31 -2 -52 -67 69 6 -70 7 44 -46 -156 19 58 -17 -76
5207g6O8P9j47l3K04j42m2P4P9n4n5O1loL4P7l2j44P0J7p7L0L5J7j34J12K9p3
$$ -76 -8 71 -76 -109 95 -47 -89 -15 64 10 -45 16 13 7 41 118 86 -58 12 29 -48 -18 17 34 -100 12 41 -32
5235c2m6N8P5j7p6M6O7k4m7lK6j03M2P0P1j19M3J2l4m1j3Q9qm2pQ4q5J5QL9j06
$$ -32 -78 -20 55 38 -38 8 75 51 4 1 27 -76 -34 36 107 -12 31 43 9 -32 -45 44 36 -6 -13 71 -14 1 9 48 -58
5266e8J17q4o7L5Q3Nj18Q8j8M9p0l7R7n7m5P2M7r0J3N7M5MMm0l1m5J02o8j3L7
$$ -58 59 -25 -92 -57 26 31 -87 1 -17 32 -38 -75 22 -35 -80 -8 39 -51 -38 19 64 68 72 32 1 -44 58 -10 -23 14
5296A4o0Q2q4P6NM4r4O9k6n9M6k3J2j02M3R1k3pm1M7Mo4L1M8Kj11Q3nplO1m3k9
$$ 14 -46 36 -48 28 33 77 -17 52 26 -33 13 -10 2 -100 -57 34 11 4 -37 10 14 -50 -19 29 31 -80 3 -2 -9 -12 49 6 -23
5329b3N0j9j1j6Q7j00mO3O3j17RK3J6k1j6M8m0Pk8RK2m6O7Qn9J7k6M1l2M5JN6
$$ -23 27 8 -3 -19 68 -32 -36 27 90 -27 -18 5 21 0 -16 32 -8 -1 -29 -20 2 -44 23 31 -28 -11 -37 4 -28 17 18 74
5361G4j36Q3K1l2p3J13mm1k0K7qk4N2M2j22oM1j8k4M3j3L4K0%n5QL8n5Q1j5K1
$$ 74 -62 21 42 10 -63 50 46 5 -15 12 4 -20 32 74 -48 -54 -13 -31 -55 -12 -25 9 29 29 -26 -18 20 -35 46 31 52
5392E2j11N0kk0R4p1l8K2lN7n7K2Q7j07m3Q1k5k2NO1rn1N6k4j0M6m4k7K5K4k0
$$ 52 -59 -9 -11 -31 63 -8 -46 -24 -27 30 -27 -5 82 -25 -68 13 -12 -34 -29 32 23 -28 28 4 -6 40 -4 -31 -6 18 -2
5423bN1n3mk1M2oL2Qo5MJ1N7k1m8J00j30J4O7M0j00L8Jl6L8kk8J1K5j13M4M8r
$$ -2 49 -4 -8 -29 13 7 39 47 -18 -14 -3 54 33 -15 85 -45 -31 36 76 -24 14 15 -21 17 15 -13 -2 23 -90 -46 2 -7
5455gj7NL8M7r3K3oJ2j4n5O2J7j8P7j03R2m3M7n6N8Pq1L2l6Pp3J05k1M0q4J9j5
$$ -7 -24 -19 19 66 -27 -4 -10 2 -12 -67 -5 12 -6 71 -32 60 17 64 8 66 73 -8 24 -12 -5 -78 27 6 46 -38 -19 -34
5487c4K6J8J8j8o5Q2k3k3O0m6J7n2J1N3J3J0k8k2l5mN8M2n1m8N6n2N4n7Q3K4p1
$$ -34 -8 10 28 10 -55 27 4 -19 41 -5 12 -40 -29 24 37 47 19 -3 -38 -42 16 58 7 -41 15 -37 17 -40 43 67 -4
5518dp5J37o4lo6M2M3r7M8P0o0N0p7ON8l1R5q9j0J0J1q0O4P2n1K8n7Q6nm2L6k9
$$ -4 -79 58 -6 -9 -75 -33 10 -87 -39 31 -29 21 -56 -50 8 -23 72 -17 -27 -17 -6 -86 -22 50 -1 27 -30 56 51 9 45 16
5550A6l3k4J2L2J0K5On9n2Q7L9o2lj8o6M9J4M4Pq1j7O1nL0J0N6j45O2LM4p3RR5
$$ 16 -17 -41 -29 3 13 38 44 -15 -67 20 59 -3 -6 -24 -90 -41 -27 17 24 -57 -74 -13 -18 12 22 78 -67 -5 -2 42 -31 -22 73
5583G3p5Rn9J27o6jq3O4p8O7M6Om3nJ0j2L3K1pj25N7J06J5q1K4M1j06k0Q4K5q0
$$ 73 -2 7 -52 75 9 8 -75 -11 -89 -22 24 30 -13 -18 -8 -20 13 34 27 -98 -41 65 80 -1 23 64 -42 -62 22 47 -33
5614c3N9j4m2J5N2Jj4n0pK3r1N9N8rq1j5J71j15K6l3N8m8j09J09P2l7J2l2j5k2
$$ -33 26 12 -30 -15 37 38 24 -26 -33 -10 -101 -42 16 7 -74 -89 82 -33 -7 -40 18 -30 -139 -30 42 5 17 -15 -30 -52
5644e2O2R7j53k4K4P4k1m6J40m4p5p9J11M1p2Q0j4l5p8M1nmJ1N2q9j7J17J32k47
$$ -52 10 107 -46 -70 -46 28 7 -39 101 57 -18 -97 14 55 -17 63 49 14 -64 -23 -28 -32 -21 31 -58 -75 42 174 -73
5673g3J8N5O7j13m8J70Kj01m8J27M0j09M7L4j79P5R9jj02M5P2j31LK3J06n2j07
$$ -73 -55 0 67 -46 -94 76 78 -23 -71 56 96 -13 34 68 -111 -36 63 62 -40 5 77 -54 -51 -28 78 26 -81
5700h1P8L8r1K1J37m0r9K5K0J4j08J46l7p6m0Q9R0j36N9Q3j47j0O3N3p3k7N3J
$$ -81 -3 35 -56 -35 102 62 -37 -12 8 22 -86 60 23 -53 -93 -4 86 -50 9 92 -55 -65 -2 51 -22 -49 4 5
5728El6Q9L2m7m9k5L2o3P0P1j1j58N4O9n0p0P4N3q6M1oP9j02L9Jm3k3J32J7j04
$$ 5 -31 58 90 43 -6 -31 1 -62 8 79 68 -90 -36 33 -17 -87 -13 40 -46 -5 -11 68 -34 5 6 -37 -60 72 89 -15
5758a5kK0Q2j04m6J44o0k8QML4r9N7j9RpK0rK2M7k9k9k8L7O4o7p6J36k3n1j2O9
$$ -15 -17 3 85 -19 -65 79 19 -9 -1 3 37 -62 -5 -24 -15 -22 -2 -11 11 58 29 0 -28 9 73 6 -70 66 43 -8 -20 49
5790D9m1q0J9L5m3K6R2J2j14Q3Rpl3M7J6q7K4O0N8j15j0L1%n6k8O4J2j04P0l4
$$ 49 8 -72 -53 -18 -61 -35 57 69 -45 38 47 40 7 54 70 -17 7 67 125 10 0 31 31 -25 -53 11 23 -81 -11 -45
5820d5P6n7P4k4n6mQ5j1r6Q3M6j04NO0J0m4Rl5R6o5J0M6n2%J05r8o5M9K6M1o1
$$ -45 31 -26 48 24 -32 -36 49 38 -58 25 71 -33 -28 32 42 -2 7 -28 68 3 13 59 7 7 112 14 -51 -2 24 65 4
5851Dk5M0kj13P4R5o9Rm5N0J6l9J3nnL0m7j9R1k9k6n6M7J43r3j58J25j6j1j6P2
$$ 4 -21 19 17 -96 -22 73 4 13 -32 18 34 -5 8 3 -2 28 -19 -38 53 24 -2 -58 -11 132 39 -119 6 -10 -21 -37 35
5882C5j7kLn3KK6P2q6l3K8N1j8o7L3M9k5oN3Qm7n6J31o1j0n9P0Qjn3N9j26Q4j0
$$ 35 18 16 19 -34 -32 -6 66 -20 -53 -25 26 8 -59 -26 23 -2 -8 45 53 6 -50 81 20 10 -49 21 29 28 -25 34 -92 -8 -18
5915a8l7O2k5P4l9j8n9O9pj0K7qQN2j03QM1L5j31Q1l4K6M5p0mP7k1r0O2L3J0j2
$$ -18 -55 7 -18 56 17 -1 -60 9 2 -8 19 11 19 71 -32 -24 17 52 -79 2 -32 -6 39 -31 -35 42 21 -69 -7 26 36 24
5947B4p3MJ2jO9o6k4J20o7m7l8J19l4p1MK4Q3nm0K1k8mk1l5R1l6j0M4J0ml6P2
$$ 24 -49 -45 -33 -34 35 -31 -55 65 -2 -49 -87 32 -2 -73 -69 -45 38 33 -7 14 -14 -18 -39 -74 17 -19 -29 15 25 21 -15 57
5979E7J1n0M9p1pj7N1J5r1J4L6n8P6j3k8L2K0j9j7n0J40j17n7K1R4k5p6K0R7k3
$$ 57 68 18 67 -4 -11 -28 23 38 -53 -39 -3 -61 15 2 -26 6 26 7 -10 -60 80 -37 -94 -73 21 -4 -80 -60 37 14
6009A4j1K4K3l3o1J3J2J06r4J7j7L0n8N2l6k0P7k0n3K5J5rm3L4L6R2j17m8k0J09
$$ 14 3 27 50 17 -44 -31 -19 87 -7 10 -7 23 -35 17 -19 -39 38 18 -35 -10 5 -4 -47 -13 23 115 -2 -50 -70 39
6039C9o6K7k0L2K8k3r7J04M6m8m9K9Ll5P4m3m7P5l2l9L0k2N3q0P8k7L9l7p0N4
$$ 39 -27 0 -20 12 40 17 -80 24 70 22 -27 2 5 -30 44 1 -46 29 -3 -42 -12 -34 19 -61 17 -10 29 -8 -78 -24
6069b4K9l2n5N9J8lKo5O8M7o6J0n1J32k2o5n3M8P4j8jrpM7j17OL3M1n8pk7M3M2
$$ -24 5 -27 -82 -23 -5 -8 -6 -71 -3 44 -22 -12 -63 69 47 -18 -71 -23 51 33 32 23 16 63 -54 -48 -15 26 -32 -39 -66 -23 19
6102A9mj15R6J8k3j5K0jK7q7JJ09l4m5qL6Q9l4l0j9M6l3m1K8J5k7J3k8QL9J4m4
$$ 19 15 -100 -4 14 -9 -24 -4 -5 22 -65 -64 45 11 -34 -42 -6 83 49 19 0 46 13 -28 0 15 -12 1 -27 -19 20 34 -10
6134a0qM4m3J3p0R6K6J6j12M3PM7l6p1O3N9M3j09Pk7M6N3m6nJ3l8np9N4Q1q2K8
$$ -10 -18 26 -17 -4 -74 22 48 64 -48 -5 2 49 13 -58 5 64 107 -2 5 -22 24 77 31 26 39 1 -4 -83 -29 52 -30 -2
6166bMM8l2o4O5PN1r9m2R5m0j4J7J4j6J5o0N1M1n0K8k8L8jL9o5k2J30m6r0L8m7
$$ -2 2 50 18 -46 19 26 77 -22 -64 31 -9 -23 -6 8 -8 7 -53 -2 39 -11 17 -11 27 26 65 0 -22 108 62 -28 10 -37
6198c7P1m1Rl5J14j19M1l4l3R6l3nn8Q1On8j6P5j8K2n7qQ4j7m1N2Jj5n0M8P8p1
$$ -37 34 -7 2 -33 81 -38 3 -31 -64 32 -1 -6 -64 17 23 -35 -51 24 6 28 -29 -37 47 30 -11 41 42 27 -23 25 103 32
6230C2Pl9kQL8n4q9J27kK6o6PJ6K3l4L2l1Nl5%RP4m7j6l9MJ07l4r3N4J5L1j19
$$ 32 39 0 -2 6 44 -10 -99 28 26 52 -14 -7 9 32 -2 30 -1 4 -31 -31 -22 52 5 -11 -50 -46 61 27 -66 -12 3 34 -85
6263h5Q9K8K6n0p0M9L5p5P8j3LJ9p1nrJ33j44J7N2K9j0m9l6J57j19Lj6K9N9k2
$$ -85 4 32 58 8 -62 -13 22 -53 25 12 15 34 -37 -42 -51 82 -62 -45 7 36 26 -23 -59 98 -21 -18 -34 -5 54 32
6293C2o9k6QL8kj3L3r2J36n2K2j3J1l1k3m1J81m1j27J41q7k2p5J08j4J6m9k5Q1
$$ 32 -37 -63 -55 -17 -19 -32 1 -91 45 -7 15 2 13 -18 -41 -82 99 58 -69 72 -15 -37 -112 -4 -18 -2 -51 -76 5
6322ErK9j21O2L2K8j4p1R1R3j42kJ5P7k8o2L9o%No5L9N5l4p3M8m7Q2j2r5Q3K1
$$ 5 -4 25 -96 -34 -2 26 12 -59 32 125 -17 -19 -4 73 45 -17 22 16 16 21 -44 -5 50 16 -57 -9 -56 26 14 -81 2 23
6354B3M4j07M4j6O5p2k6M3koQ9q0L3o7J7O9p8L8K5j41K5J40j4m9kk8L7Pl3P5k3
$$ 23 67 -40 4 -12 53 -19 -45 -2 -4 -10 79 -1 32 -35 -18 51 -27 11 36 -105 -80 60 46 -3 -5 -33 4 11 -22 53 30
6385C0J1n9n0P6M3p2Oj3N1R0j32n7J08l2l9J4j8Q2m9K7P7l0l3q3k5J32k2l4Kl5
$$ 30 41 -18 -68 8 51 -21 -15 -28 23 113 -19 -76 32 0 -39 -25 -43 39 -10 17 94 64 31 -52 -77 55 33 -1 1 -34
6415c4M0J22j08m5kO4r8M2J08m9n6l7R7o6N7m1n5N3jP9m9m1N9m0%q9J23l4J0q5
$$ -34 6 128 20 -25 -27 37 -61 -19 89 40 -16 -53 44 -22 35 -6 -61 -8 -9 70 21 -20 39 -1 -1 -90 33 -1 9 -76
6445g6K6J29M8j99N9k3Q6p4j8K4P6L2j16l4N5k8J05j14K5klj6o1J20j3n4L0l4
$$ -76 -50 79 127 -72 -13 -36 50 -24 -42 -18 58 90 -26 -60 -5 -33 72 -42 -17 -19 -22 -38 -99 21 8 -46 -16 -50
6473e0J47j35QP2K2k6j11OQ3L6k9q9J17j4J9p6k3J08l2p4J0O2j5k4p8R4QK4r8
$$ -50 97 -38 -30 42 64 38 -73 -67 16 52 23 -66 51 37 56 -20 -43 65 33 -41 -31 31 16 -8 -86 8 16 40 -58
6502e8N6Pl0LM7J6Qj8j4o8O4L6m2q0Q6j3l8O6l8Q7o0K0p7J67j14LqJ3k0Q3j08
$$ -58 -2 5 -25 -22 25 41 49 31 17 -51 13 49 7 -73 13 0 -38 28 -10 77 17 37 -40 127 13 16 8 21 1 84 -24
6533b4O5l1Qm0kM3O9q7k3l2N4L0q4L2PR4j15L0m0R5m3Nk2L9l5ql3N5J7no6k0N7
$$ -24 41 10 18 -22 -24 19 88 1 -22 -54 0 30 -54 -22 -15 79 -36 -6 -46 49 6 11 -11 28 -7 -15 -48 7 24 19 -47 -67 -10
6566a0M3%j16L2J02n5j9kK1M0L6j13PN5Kj00j4J84l8m9J4J6j8p3J4M6RM4j24Q
$$ -10 33 33 -83 -51 51 -4 -23 -25 -4 36 72 -41 -34 21 23 -77 -91 93 55 6 20 36 18 -55 -41 5 14 58 -66 -58
6596e8N3M8J08j81O9j9J1p5k3J52Nj04n6Q9o9N1o3L6K7M3p7k1J06l9j6k1J5K8
$$ -58 -5 43 151 -30 39 20 31 -44 -67 85 90 -14 -70 19 -50 1 -62 -26 1 44 -33 -54 52 13 -3 -24 -9 19
6624A9K0n0j3J6j0K6K0k4M7q2K6N4m2L5j02m2J30oj8Qp2P3k3j9J0j9Q4J1p4J0
$$ 19 39 -11 -24 -8 -18 8 28 4 51 -31 -5 49 7 42 -60 -102 28 22 4 12 -60 13 -10 -29 -19 -38 46 57 -17 -7
6654gK4j8j0m4M2K0J7n9P2n0O7j05j2Q9J8j3l4l0Q2K8j41PM7L6m8m8P1P7o5%m0
$$ -7 17 -1 -11 -55 -13 7 24 -35 37 -13 54 -51 -63 26 44 31 -3 -33 49 77 -64 -57 -10 26 -22 -70 1 78 13 13 -27
6685b7J7K3m7l8N0j9N7j2j8L0klk5Qm3J14j06O1N0n5p2K8Q1n3LOm6J06o3k6pJ0
$$ -27 -10 13 -34 -72 -22 -41 16 4 -14 16 14 11 -14 -6 -49 65 -41 20 70 15 -57 -29 52 -1 2 8 -38 68 5 -21 -28 -18
6717a8P4n9j5j0O3j9j7RM5l1p9J2K7L1J3m0K0l1l5Q5m2j4L1J5o5m5J66m8m7m6
$$ -18 56 -3 -18 -28 35 16 -1 8 53 22 -57 -45 -18 13 26 -14 6 -25 -60 25 -17 -31 0 15 -50 -95 71 23 -24 -70
6747g0N9LLNj9M6N5j04M4k5qm5J6N2O1m5p0l0M4O3o6M0L1k2jp4P4N6r2Qm%M2q0
$$ -70 -11 -8 -5 0 -19 27 82 -22 22 -3 -11 -56 -40 12 73 28 -42 -72 -28 35 -31 9 40 18 17 -57 17 73 -19 -11 -15 -15 27 -53
6781e3j1J16k5N1m4j31J09Qj5k1NP2m1l4j8O5kmo8R4Kp4o3P4J5O6j20M0J9K7m9
$$ -53 -64 52 27 78 34 -97 12 20 5 -16 -11 61 20 -14 -32 33 31 27 -41 53 55 -19 -82 -8 7 73 -47 -7 12 39 -10
6812a0N0p9J02l2n9N4k9J6k9J5LJ2L2r1M9o0L4Kk0JM4Oq4Q7KM2j16K2P6m1KMk6
$$ -10 40 -39 63 31 -28 26 -3 13 -16 -1 2 14 46 -45 4 -56 -22 -20 -40 -39 5 11 -73 14 16 58 -58 -36 40 -1 1 5 -21
6845b1M6l9ok8M4O4j2o5k0K7N3j03M4MP3j14N3NOl7K8o0L6K6pj4K3KMq0J9M1K3
$$ -21 25 -14 -20 -48 -4 60 48 -17 -37 -10 43 -60 -16 -12 61 -53 0 5 11 -26 2 -58 -22 4 -3 -17 6 8 12 -68 -49 -8 15
6878A5n9M5O2o0No2L0N1m7j8Q9j08j0O0o2P1L3k6j02K0J81k9j24m2P3Mj4k2M7
$$ 15 -44 1 63 3 8 -54 -24 27 -20 -38 51 -57 -67 -7 -69 2 35 9 -93 -73 108 79 -45 -87 -14 -10 -24 -46 1
6907AL3m0k5ON5K5l2p9Q3K3K2p3M1j5n2nqQ4j6m5oL2l7J7k3N2j9PN8p6k2N3L7
$$ 1 34 -6 -31 -25 30 55 23 -56 27 50 72 -1 40 25 -27 -32 -40 44 28 -17 -23 9 -28 -11 -34 18 -1 6 64 -12 -34 19 56
6940E6j05j9J15Po0l4J0J34q8n3Q1N1q7Kj3L4J9q8Kj3J23q8J4p1L1K4M7o4J7P9
$$ 56 -49 -68 47 54 -6 -40 -30 104 16 -37 44 95 8 10 -3 31 50 -38 -36 -49 74 -14 0 -71 -40 -16 31 -33 -16 63
6970F3m4r6NR3n7K5MP3q9M7M5n7m9J14q9k4m0N8J9o4M6K4Kp8MO8K5n8k9M7l3L9
$$ 63 19 -77 -72 21 -36 -11 -7 66 -23 24 69 12 -37 77 -12 -36 -76 -18 1 -63 -17 7 9 -69 -65 3 28 -30 -59 -12 -45 -6
7002fK4j9n6M3L8m9l7O7k0p4%J00M4r1k3J09rj7l7O5l7Pkm5Jj2L1Jk6L9J5j5l1
$$ -6 18 -1 -57 -14 24 -25 -62 5 -15 -89 -89 11 55 -36 -59 50 41 24 -13 52 15 22 20 -25 -24 -36 -5 -4 -30 9 24 9 -22
7035b2N1Km3j5l2J81j56M6p3M3n1O8N2l1m0j2Q5r0L8L9Pn3m2O8j8o0O3J6p3K3
$$ -22 29 31 -12 -27 -59 122 -34 12 -61 -18 -69 -1 51 20 -20 -32 53 -37 1 40 47 -6 -48 20 2 -58 5 21 -52 -29
7065b9m8J05%p5L0M1j6M0Mn2pK1M2p5J2L3on8L5L4J4j02P0N7mq0rM2J2k4L5r2
$$ -29 -77 28 28 -47 -17 24 8 48 52 0 -7 14 56 -19 -7 26 20 -38 -3 31 45 -57 13 70 66 -14 -23 19 31 7 42 -50
7097e0K4Q0k2l1k4Q2%j64J6K00r7l9k5O6j10L9O2j4kklN0K4K8r8l5j6M3L2Ln8
$$ -50 -26 54 32 1 -23 59 59 -105 -89 111 14 -25 -50 16 -94 -55 7 -7 -9 -11 -14 36 60 88 -10 -45 -61 -18 14 17 -41
7128d1P2Qm6l5Q9j1j01M8m1Q5k6J2jJ5p0J01m6%mN2k8j33N4P5r3OO0N0Qo6M8n5
$$ -41 31 39 -7 -42 47 36 -65 -17 -58 27 1 13 12 27 -43 58 12 12 8 60 32 -101 -47 28 -65 -59 1 51 59 -7 41 -14
7160a4M1k2k2Kl0J30q0k0j4P3K6j47P6J27j47p0J26l7M7n7%l3PN2kJo6L1j2n0
$$ -14 27 5 -17 -15 -45 85 5 -15 -29 44 70 -77 -1 126 -21 -91 35 -2 45 -12 -12 -45 -38 14 12 13 -53 -22 -34 -84
7190h4J02M5j7l2mK4M4o9j8mPK6K0j4qnM4j3k4jQo7QN3M0j03J6R4k6r6j3J00m
$$ -84 18 63 46 14 10 34 78 9 -9 -13 -6 20 40 26 18 13 57 44 20 19 27 -40 -32 21 61 -42 -26 68 42 -54 -67 33 29
7223B9m4n3P2L7o8K8L7pJl4M0j9QLl9J0P6j7l5p0P9Pk4nkl1L2Lm8K8L0j9K7m3
$$ 29 -15 -68 4 41 -27 1 38 31 32 -2 38 19 27 30 -9 1 77 60 25 -45 34 41 17 12 10 -21 11 14 -34 -6 24 5 32 -11
7257a1JJ2M4o3j3L8lj8j0P1o0k2Q3j3m4k2Q9r9P4oKq9J6P1J1j39J04M7j9j3j13
$$ -11 -10 2 46 -17 -30 8 5 -13 -23 48 -12 -34 49 36 -8 -30 59 -40 34 28 30 -59 -43 28 39 -100 4 51 32 19 -94
7288i4J55m6l0oO4m9lll8K9M6n3m7K3J00m9p2M7L6P0j37L1k9J44j26OR4m2m2r
$$ -94 61 15 -15 -21 43 -6 -9 -12 -50 -21 25 -28 -75 -52 48 -1 -73 -26 10 80 -57 -26 -55 89 -37 -31 63 21 -21 -30
7318c0K2m3Q1j1o6N2RL8j31O4N9k7l3n1M2K9l7o5J02m6pJ5K9j4J1K6k3PP6r2j1
$$ -30 -8 -51 30 19 -47 5 14 52 -79 -15 44 17 -16 -67 -25 4 -33 -98 4 -42 -49 -34 -5 -19 -8 18 -5 2 78 -14 -25
7349b5L5m2O3p1pK4J06j10JK9o6R5p8N7K8n6j3M4p6O1N9j10L7j0J2K7m7j1J50
$$ -25 10 -32 31 -40 -47 -23 83 -27 -26 3 -63 32 -46 11 39 -17 -30 14 -62 -1 58 -52 -15 -25 -13 14 -33 -44 106
7378A06j00j6K3j6O0q9K6J2k5J5j7RK1N1j2r3K1J0j1oo3J44n4m6N7L7p8L7l7P4
$$ 106 6 -10 13 -3 57 -32 -6 6 -19 -4 -21 -12 9 60 48 -45 -24 -14 -25 -31 -94 50 -4 -50 7 44 -34 3 -34 40
7408D0k8M4m0j5J1N2Po6k7O1K1q4kK3K3J1l1J9j4m4m9R8jj3rJ2J1M0n0l8rO6L7
$$ 40 12 56 16 1 12 64 71 5 -22 39 60 -24 -26 -3 20 31 0 19 5 -39 -88 10 9 -4 -13 -1 10 50 0 -38 -47 19 56
7441E6l6l9O3J5l6n8L1N7l4m1j2O9l6l8J0jR8k7Mn5J0L9o2kl7L7m6K8M8M9p3K6
$$ 56 20 -19 44 59 23 -35 -4 53 19 -22 -34 35 -1 -39 -29 -30 68 41 45 -10 0 39 -23 -25 -62 -25 -71 -43 5 54 -19 7
7473Gk8M6j8m1k5L5OOK0l1J4j7MRJ0Q1p7rK6n9M0Oj3qJ5k4K8j8M5l9K9p6J21p8
$$ 7 -21 25 7 -34 -59 -24 -18 -12 8 -23 -9 -26 -22 -13 -3 78 1 -8 18 -41 -1 5 -8 -16 -1 -25 3 -15 30 -9 20 -56 65 -13
7507a3O1p2J0J6l0O5n4N0l0N3r0J3R7r3O1n6M6Rj6o3l4J44m5k9k1L6q7L9K9L7
$$ -13 48 -24 -14 2 -28 37 -17 33 3 56 -34 -21 76 -17 44 -12 34 43 27 -36 -70 74 29 0 -21 15 -72 -33 -4 33
7537C3m4N0Mn7Q2j21L5o7O9o0Q0%o4O6L6nr7L8J03m6k9M3M5j05J2L7Kk3oK2k6
$$ 33 -11 39 43 -14 68 -53 -18 -85 -16 -76 4 4 -60 6 42 37 -60 -22 81 35 6 49 94 -11 1 38 40 17 11 33 7
7568GJ6K1p5LL1K2j2J9Qj3%o0Q0Kr2N6qJ9k4n6M4j9L5J0P0r4L3m2Q4o1o0J13j1
$$ 7 23 44 -31 -28 3 25 13 32 40 27 27 -33 47 49 -43 13 5 24 0 -56 -12 -31 4 14 84 -10 23 -19 65 4 -56 57 46
7601D6p2k6P2L5q1J7M4n3j9P0j1q4O4k5J7m3Q1K9j51K6M0k7K0m4J42l6k8j6O0
$$ 46 -26 -52 20 55 -26 -9 35 -18 -37 33 22 -62 2 -23 -6 -49 32 61 -90 -64 -24 -51 -31 -75 67 31 3 -13 47
7630D7o8K3N1%m9nM0ln5J01n0j31O8Q2J6j02J3M9j0p2L0M4M6j61P5M1n4j8Q6n9
$$ 47 -21 2 53 53 4 -1 39 36 -19 82 32 -99 -31 51 67 -35 -22 27 17 -55 -25 19 65 -96 -21 20 -34 -52 34 -25
7660b5rJ5L8n9M0LR7j21n0J17k3o0N8K6j19QM5P8n3pK2J5r8M4J4j0k2rJ3lo4J12
$$ -25 -34 -19 19 -40 0 3 100 -21 -71 46 23 -37 21 47 -72 -64 -19 59 6 -1 21 36 -62 -18 -4 -14 -36 -45 -32 -35 -99 13
7692A3Q1j09m6Q9k6l4J0M5j2m3P0l2n3N7J8K3r8N5L7k2j8k0J3J0p3O7M0q8K8M8
$$ 13 94 -15 -61 28 2 -32 -22 23 11 -32 38 6 -47 10 28 51 -47 8 45 23 5 -15 -2 8 -65 2 42 -46 -18 30
7722C0j3nm9O2l9rJ08j9n0j4M7j15K7K7L6Pn5O7j8n6m2J05Kn8j5N0m7l5J52o3
$$ 30 17 12 -37 25 -14 -23 85 66 16 2 49 -66 -39 -12 24 31 -24 43 25 -31 -73 32 34 -24 -39 11 -36 -71 81 18
7752A8o3j06K01l5j9m2J39q4o2M0O6l4k0K2k1m0J4NJ3j10J01M4q6J0M2N6r0j8
$$ 18 -45 -151 50 15 -4 -46 93 9 -53 -13 53 19 -1 21 0 -40 -26 -21 -8 -118 -17 27 -59 -49 -7 49 -41 -59
7780e9Q9ok3oRk9L9j0j8rn7J12l6o0P0M4n1k5mK2k2n9J48m8l1l1L5L5l5K1Mk5
$$ -59 30 24 1 -5 4 -25 14 4 -14 -23 -80 32 -4 -64 6 50 -1 -26 -30 -8 -30 -89 59 11 -20 -51 -16 19 -16 5 9 -16
7812a6m7R6l4J1l3P2m8k3RM2L4j20Q9K4j13j6J10L0j18MN3j9nKM9p3mK0J7n3J07
$$ -16 -63 33 -1 10 -23 49 1 -22 -13 29 63 -57 32 56 -57 -73 37 67 -51 -47 6 -13 -18 -16 33 -40 -44 -24 -7 -60 47
7843D7Rj7j23J41J4l5l3n1R9j33N8L2O1lj12N8Jk0J4qqk3k3O3l1J05m9o4J4O1
$$ 47 56 39 -84 57 71 36 3 -48 51 -82 -24 8 69 66 -46 12 13 -7 7 -1 -9 -32 -55 8 -23 82 33 -31 -17 44
7873D4Jp2N1k2K0J6n7M4K2n0pL7qK2Jk2j5j10J07K1k4J4J6J5j1o9K5M4k9K0j5
$$ 44 45 -27 24 2 22 38 -19 25 47 -3 -10 27 19 41 42 20 5 -105 2 23 -1 13 29 44 33 -36 -11 33 4 24 9
7904Ij9J4J2j8M3o3K1J8n9J5Q4m2j9P9m6ro6K0K4o1J3O1Jqk5J3K2J1Pm0j3N8l7
$$ 9 -10 4 16 -2 41 -22 -1 17 -42 -27 57 15 -4 75 29 20 -46 -26 -2 -63 -50 11 12 4 -21 -8 14 25 32 -8 -21 37 0
7937@M3j06Q2q0R1m7OJ3Qk2K8l4mM2o4J9jR6qj22K2N8K6Oj8o5j7M8m8O4k5j4Q5
$$ 0 43 -63 19 -61 30 -17 -11 2 10 -12 16 -18 -22 20 -44 -25 -26 70 62 -60 -38 20 46 52 34 -31 -48 0 -48 16 -9 -23 62
7970F2k3l9j2%J1n3kL6LK0MJ8q3K5J2Lk1Pk6O6L0k3l3oL6J8j0N5o2J4l7M2l1J
$$ 62 39 0 -12 -12 -1 -54 -56 -20 -17 3 7 25 -58 -33 -21 -18 -39 -32 -58 8 38 15 -18 -24 12 30 20 75 13 27 -10 32 1 2
8004Bmo0M7Q3q1J5J4%l7m3K3P5j8n4ON2K6j2m5Mj1%N6J5p5M2m0L6l2N1k4J6N0
$$ 2 -2 -62 -15 68 -13 2 16 16 -21 -64 -41 34 16 -38 -32 20 46 34 -11 -7 -18 -18 38 53 -22 20 -20 16 -16 35 11 27 77
8037G7p6%oJ6L2o8O9l8Nj4J0k1j1L6J7P8j52j9R7n0L2Nk7l2J5k5N2L5n6J4j1O5
$$ 77 1 1 -5 11 43 -25 44 6 11 -3 7 -14 -25 11 28 106 -46 -65 32 -18 14 19 -8 -40 -25 -50 2 37 -19 -5 -16 49
8069D9kJ4p3k9L6L8k8n%J8K8l0j1k0ML8j1km2M9K6l4l7M9j1L8l3Qm5LL3ok6L2
$$ 49 47 61 -12 -41 -5 33 5 0 0 18 46 16 5 -15 -11 27 16 14 -28 21 47 13 -24 25 14 52 19 27 -18 -15 18 12 -14 18
8103A8L2r3J09m1k7j0L2Jk8L9k8J6j5k7J2J7l1k6L3P5J8j64L9L9j4N7j6J2m9k8
$$ 18 50 -43 66 25 -2 -12 20 21 -7 32 4 20 5 -22 -10 7 -24 -50 -17 58 76 -88 -49 -10 -24 33 17 29 -20 -48
8133d8L4J6j2P5mo4Nk1L8q2R3j3npK9j5j2%K5N2m2m6k7L3qL4l9P6j06oN8nJ1k1
$$ -48 -14 2 -10 65 61 -3 2 -19 19 -63 30 17 12 5 34 19 7 7 32 84 42 -4 -31 2 -6 28 -11 65 -41 -47 11 6 17 -4
8167dl0J6oQ4n9N0m1N5n8NK2n1O1m5M7m6p7Q3M6p4k5k5M3J9
$$ -4 -34 -18 -24 60 1 51 10 65 7 12 34 -17 44 -1 46 0 -77 6 52 -22 -47 -72 -29 -10
8191a0
$$ Imaginary data points
##PAGE= N=2
##DATA TABLE= (X++(I..I)), XYDATA
0@%%%%%%%%%%%%%%%%%%mJ2j4J4j8K2k4K5l2L9m5N3o0P0q1R2j02J13j30J49j66
$$ 0 0 0 0 0 0 0 0 0 0 0 0 0 0 0 0 0 0 0 -4 8 -6 8 -10 12 -12 13 -19 20 -25 28 -32 38 -43 49 -53 60 -70 79 -87
39h7J85k06K27k51K78l08L39l71M07m46M83n20N59n91O13o09N41l40j94J724p269
$$ -87 98 -108 119 -132 146 -162 177 -194 213 -233 250 -270 289 -302 311 -298 243 -97 -291 1433 -5836
60e836N5091L40906k92001l68845K70897J61008k89024k2732L25655m3084k80143
$$ -5836 49255 390161 98160 -270685 212 161220 -127804 -150536 175119 132035 -148108
71a48108N1489J39674j04397L1346K20715r4723k98522O4252K47035m0920j16665
$$ -148108 -96619 43055 -61342 -29996 190719 95996 -202526 -138274 108761 67841 -48824
82d8824R8094K8641j69834l1888J67696O1693p6317l4936j4745m6902K8372J09901
$$ -48824 49270 77911 -91923 -123811 43885 105578 29261 -5675 -20420 -67322 -38950 70951
94G0951L9049p8750q9868j5242N1072M7312Q145N122q311p2664m6036Q9720Q9902
$$ 70951 110000 31250 -58618 -73860 -22788 24524 32669 37791 29480 -43184 -89220 500 90402
107I0402n1987n8816J6737m7471n5575J27660J21387j32118j21769J13162M2445
$$ 90402 38415 -20401 -3664 -51135 -106710 20950 142337 10219 -111550 1612 44057
118D4057j30424N9587J87198j15135k19207J22406J75083j32664p0705J87163
$$ 44057 -86367 -26780 160418 45283 -173924 -51518 123565 -9099 -79804 107359
128A07359j8106k49138N1452K52970n6708j73935R4261P3594j56882p407J88731
$$ 107359 89253 -159885 -108433 144537 87829 -86106 8155 81749 -75133 -82540 106191
139A06191l0606j62758O8200Q8393j34068k0992K04376k611k23503P632J77311
$$ 106191 75585 -87173 -18973 69420 -64648 -85640 118736 116125 -107378 -99746 77565
150G7565l9805j17568Q4649P6477j10405n6044R3878L1376m5737J6939R945o7089
$$ 77565 37760 -79808 4841 81318 -29087 -85131 8747 40123 -5614 11325 21270 -45819
162d5819n773Q4927J6248o1125r203L0232j1316k0283J9689K9985K524l1969l5384
$$ -45819 -51592 33335 49583 -11542 -20745 9487 -1829 -22112 -2423 27562 30086 -1883 -37267
175c7267J9448N5649j047m6530j678J8040k2650j394M4441m392m2078J8036J9799
$$ -37267 -17819 37830 36783 -9747 -11425 6615 -16035 -17429 27012 22620 -19458 -1422 18377
188A8377m8801K022Q2863j5884j03917K0204R4294l3429o5363N8975L8026p8797
$$ 18377 -30424 -28402 54461 38577 -65340 -45136 49158 15729 -49634 9341 47367 -31430
200c1430j6543P7158o747n2524M1524K3077p6713K496R9362k1674r8392M2709
$$ -31430 -47973 29185 22438 -30086 11438 34515 -42198 -39702 59660 37986 -60406 -17697
212a7697P9907o6770n5762Q7005L7622q7450j8122O7510q776m2128L4413J6746
$$ -17697 62210 -4560 -60322 26683 64305 -23145 -41267 26243 17467 -24661 9752 26498
224B6498n2559K852N4469k0969m3003M0073K8344n5825k0046N5666J2002m1123
$$ 26498 -26061 -23209 31260 10291 -32712 7361 35705 -20120 -40166 15500 27502 -13621
236a3621q61K0325j1380j925J9277j0262j6309K1143O515l1792L314M1130m488
$$ -13621 -14482 5843 -5537 -7462 11815 1553 -14756 6387 12902 -18890 -15576 25554 21066
249B1066l9740J210K6940P58r795k48k617K949R702j1228j4179K3092J9278l2099
$$ 21066 -18674 -17464 9476 10234 439 191 -2426 523 10225 -1003 -15182 7910 27188 -4911
263d911k5866L0315K4936k1834j6796J2436O233m317p00n448L27J8526k425l3498
$$ -4911 -30777 -462 24474 2640 -14156 -1720 4513 196 -504 -5952 -5625 12901 10476 -23022
277b3022K408M3472n06m3441J711L6210o026k6270J0823J6831r924n506M282q425
$$ -23022 -20614 22858 22352 -21089 -19378 16832 10806 -15464 -4641 12190 2266 -3240 1042 -7383
291g383L149K2739q268l2671J1120L4657j4178l0442J8101K3864j9990j7232J6571
$$ -7383 -4234 18505 10237 -22434 -11314 23343 9165 -21277 -3176 20688 698 -16534 37
304C7Q617q746K176l58j3718P319K1950j2014k5095J5971K4296j9163k2260J9687
$$ 37 8654 -92 2084 1726 -11992 -4673 17277 5263 -19832 -3861 20435 1272 -20988 -1301
318a301J9975j5711j6287Q011J0461N13l410p731k114J3111N706j7724q235K0922
$$ -1301 18674 2963 -13324 -5313 5148 5661 2251 -5480 -7594 5517 11223 -6501 -14736 6186
332F186J0973k1492j3873J8778J6339j3109j7339O477J7026o90j6684m498J6601
$$ 6186 17159 -4333 -18206 572 16911 3802 -13537 -7060 9966 9276 -7408 -11906 4695
345D695R603j4792j3520J1551J5501o790j5518J365J3428L611j0401q039P372
$$ 4695 14298 -494 -14014 -2463 13038 6248 -9270 -7905 5523 9134 -1267 -9306 -1934
358a934J2222m458j5874P73J7656K632j7255n515J4635P257j0679q355N547Q094
$$ -1934 10288 5830 -10044 -9271 8385 11017 -6238 -11753 2882 10139 -540 -8895 -3348 4746
372D746n80p348m108O753Q925m592j2126K088J3846Q39j4102m187J2486P610q785
$$ 4746 4166 -3182 -7290 -537 8388 3796 -8330 -6242 7604 8443 -5659 -9846 2640 10250 1465
387A465r671N081J1508n85j2547m014J2025P856j0957j1413Q329J3935m934j5724
$$ 1465 -8206 -3125 8383 7798 -4749 -8763 3262 11118 161 -11252 -2923 11012 6078 -9646
401i646L94J5478M132j4303q256J1973J1715q805j4040M622J4723j001j4655k684
$$ -9646 -9252 6226 10358 -3945 -12201 -228 11487 2682 -11358 -6736 7987 6986 -7669 -10353
415a0353J3909P397j1003j0260P740J3162l755j4767q59J4303M617j2541o743
$$ -10353 3556 10953 -50 -10310 -2570 10592 6837 -7930 -8789 5514 10131 -2410 -9153
428i153J0560Q657p558r531L940R337k12q888m419O546Q140l435j0987o75J1588
$$ -9153 1407 10064 2506 -7025 -3085 6252 6040 -2848 -7267 -721 7419 3984 -7003 -7678 3910
443C910L757j1150n951J0104Q017p991r362N093R980j573j0134l081Q611Q001
$$ 3910 7667 -3483 -9434 670 8687 696 -8666 -3573 6407 4834 -5300 -8381 230 8231
457H231m706j0399J581J2634K303j3721o190J3340R382j2733j2370J0802J4999
$$ 8231 3525 -6874 -5293 7341 9644 -4077 -10267 3073 12455 -278 -12648 -1846 13153
470A3153p293j6312L387J5840L27j4752m365J2157P549q867j0586M297J1946J30
$$ 13153 5860 -10452 -7065 8775 9102 -5650 -10015 2142 9691 824 -9762 -5465 6481 6611
484F611j2466m373J2352Q629j0872j1461R721J4189p885j6549M742J6624j283
$$ 6611 -5855 -10228 2124 10753 -119 -11580 -1859 12330 4445 -12104 -7362 9262 7979
497G979j4365o83J1473K334o941k730K929K609P63l838n789M212J1020l787j5086
$$ 7979 -6386 -7069 4404 6738 -203 -2933 -4 2605 3368 -470 -6259 -2047 8973 5186 -9900
512i900K255J6875q70j6220K72J3547j018j0083J482N915j734n76J023o071m73
$$ -9900 -7645 9230 8360 -7860 -7588 5959 4941 -5142 -3660 2255 521 -55 968 -5103 -5576
527e576J3228J329j8507j453K2178J957k3494k161K2207J840j9696j546J5493
$$ -5576 7652 8981 -9526 -10979 11199 13156 -10338 -12499 9708 11548 -8148 -9694 5799
540E799K283r429k663K654L292L837m007j0749L664J5735l201j9186K344K0654
$$ 5799 8082 -1347 -4010 -1356 1936 5773 1766 -8983 -5319 10416 7215 -11971 -9627 11027
554A1027j118k0604l09J9457K008j6891l908J3681N507r834o338N907O197k039
$$ 11027 9909 -10695 -11004 8453 10461 -6430 -10338 3343 8850 -984 -7322 -1415 4782 2743
568B743n256j241L949N299r52q579k829J0719N966j2404q265J3351Q911j4734
$$ 2743 -2513 -3754 195 5494 4542 -4037 -6866 3853 9819 -2585 -10850 2501 11412 -3322
582c322q577J5654Q140j4385o729J0165K424n329M036O56j0304K758J4354o689
$$ -3322 -11899 3755 11895 -2490 -9219 946 3370 -1959 2077 2733 -7571 -4813 9541 2852
596B852j5439J2375J6129j7784j6880K0426J6908j8344j3351J3851N998r819J622
$$ 2852 -12587 -212 15917 -1867 -18747 1679 18587 243 -13108 743 6741 -3078 -1456
609a456O577o377j548Q831n998j1166J4034J4398j8994j7333J8857J5878j6993
$$ -1456 5121 -1256 -2804 6027 29 -11137 2897 17295 -1699 -19032 -175 15703 -1290
622a290j1201J5930O785j4973n325J1281N095l852l086l450j552O880N219o301
$$ -1290 -12491 3439 10224 -4749 -10074 1207 6302 2450 -636 -4086 -5638 1242 6461 160
636A60m663O063K213p993k066J0532O552q784j1077K742J1185K007p509j761M905
$$ 160 -4503 1560 3773 -4220 -6286 4246 10798 2014 -9063 -6321 4864 6871 -638 -2399 2506
651B506k374o346L867Q577p10n612l142l601J602J2354L827j5465o906J3936L464
$$ 2506 132 -6214 -2347 6230 5520 -92 -3234 -6835 -5233 7121 10948 -4517 -11423 2513 5977
666E977j3974L004J8390n004k1351J361J6823K281n080j54n592n122J0137O114
$$ 5977 -7997 -4993 13397 8393 -12958 -11597 5226 7507 2427 2273 -3319 -8441 1696 7810
680G810j1112N8J5743p403k4473Q573K9963m033k6001M27J5489l722p469Q419
$$ 7810 -3302 -3244 12499 5096 -19377 -10804 19159 15126 -10875 -10448 5041 1319 -6150 2269
694B269N757o823n355k003j191J0173J2310j0333j9152M747J6139k130q183O588
$$ 2269 8026 1203 -4152 -6155 -7346 2827 15137 4804 -14348 -9601 6538 4408 -3775 2813
708B813N043j0983q619P691J1868L103p174j1081k590R860P375l485l116J512
$$ 2813 7856 -3127 -11746 -4055 7813 10916 3742 -7339 -9929 -69 7306 3821 705 2217
722B217l866o351L782J0116L297n137r019o321N911J3306J353j0970l079M605
$$ 2217 -1649 -8000 -4218 5898 9195 4058 -4961 -11282 -5371 7935 9288 -1682 -4761 -156
736a56l117l808R411R100o803j1645k398N167Q770O459p016j2080K603R184m095
$$ -156 -3273 -7081 2330 11430 4627 -7018 -9416 -4249 4521 10980 3964 -8116 -5513 3671 -424
751d24m260J2203N627j7725j1945J3748J4116m127p789k168j621J063M759O63
$$ -424 -4684 7519 13146 -4579 -16524 -2776 11340 7213 -576 -2744 -4365 -3302 1457 2120
765B120o64L864l387j3339N12J8560O046j4627q368O574L406k124K643L447k072
$$ 2120 1456 5320 1933 -11406 -10894 7666 13712 -915 -9283 -2709 697 -1427 1216 4663 2591
780B591l783l998j842Q424J1026o156j5169J069J1595j43n134M193K826p554m484
$$ 2591 -1192 -5190 -7032 1392 12418 6262 -8907 -7838 3757 3614 -1520 2673 5499 -2055 -6539
795f539M388M075K714J828p466r831O290J2882l774j0018M696O028q696n839J0385
$$ -6539 -2151 1924 4638 6466 -1000 -10831 -4541 8341 4567 -5451 -755 5273 -3423 -9262 1123
810A123P975o229p390l70K302M592L569m489n481M378L832o791k619J0681M701
$$ 1123 9098 2869 -4521 -4891 -2589 2003 5572 1083 -4398 -20 3812 -2979 -5598 5083 9784
825I784j1510p766P925Q298l133n981N16L519l16m018q26N891L559n913o663L133
$$ 9784 -1726 -9492 -1567 6731 3598 -2383 -1867 1652 1336 -2682 -3508 2383 5942 29 -6634 -3501
841c501O651J45m054j576J221J880p0l155K14O253Q14r072k712R823L982q070
$$ -3501 3150 3295 -759 -2335 -1114 766 696 -2459 -2245 4008 4822 -4250 -6962 2861 6843 -1227
857a227k741O055K60m573J907K536k698R94L184n757m538R509N852j1558o160
$$ -1227 -3968 2087 2347 -2226 -319 2217 -481 513 3697 -2060 -6598 2911 8763 -2795 -8955
872h955J2105M626j2177k969J1336J740q915j045M816k42j7J938l970k859P384
$$ -8955 3150 7776 -4401 -7370 3966 5706 -3209 -4254 562 320 303 2241 -1729 -4588 2796
887B796K863j0244k367J2980K570j4078l073J3047L300j0295k682P549K094n222
$$ 2796 5659 -4585 -6952 6028 8598 -5480 -8553 4494 7794 -2501 -5183 2366 4460 -762
901g62k450K494L307P88l849m278K719O227j081o583j29N934O76n708j714N783
$$ -762 -3212 -718 2589 3377 -472 -4750 -2031 4196 3115 -3468 -3597 2337 3013 -2695 -4409 1374
917A374L735n138n925L617O916j886o180J449M932j641l509J852K050q91O07k79
$$ 1374 5109 -29 -5954 -2337 4579 2693 -3487 -2038 2894 1253 -2256 -404 1646 755 1362 1083
933A083m288N22P667l53r438N26R661j812r541L116R197l570p967K317M827j252
$$ 1083 -3205 -2683 4984 4631 -4807 -4281 5380 3568 -5973 -2857 6340 2770 -5197 -2880 1947 695
949F95l10O96l733m76O406n95p881K809R450m567j0866M898J1456l937r640K572
$$ 695 385 1081 -2652 -3128 3278 2683 -5198 -2389 7061 2494 -8372 -3474 7982 4045 -5595 -3023
965c023O825j609m041Q67K215R32p50l390j409N412L242o064m698N314M759m362
$$ -3023 3802 2193 -1848 -981 1234 2166 1416 -1974 -3383 2029 5271 -793 -5491 -177 4582 220
981B20m275L349L926j979m156k31M078K637l381m313K461M832j775m299J808L757
$$ 220 -4055 -706 3220 1241 -2915 -3146 932 3569 188 -4125 -1664 3168 1393 -2906 -1098 2659
997B659j332k676L0J205J722J325l108l769L648N289m000n590M483N069m796m701
$$ 2659 1327 -1349 -1319 -114 1608 2933 -175 -3944 -296 4993 993 -4597 -114 4955 159 -4542
1013d542M353L867k842k719K67M33K060J951l899l657N404M307o462m461P321
$$ -4542 -189 3678 836 -1883 -1616 -1183 877 2828 -1071 -4728 676 4983 -1479 -5940 1381
1028A381M596p285m449O126M180l868l431J504K581J101j702l335J324N147j065
$$ 1381 5977 -1308 -5757 369 4549 681 -2750 -1246 1335 2436 734 -2601 -1277 3870 2805
1043B805o429O98O672l33o285j85M975P09l488j469J546K312K18l099k011L533
$$ 2805 -3624 -2926 3746 3413 -2872 -3057 1918 2627 -861 -2330 -784 1528 1746 -1353 -3364 169
1059A69L118l641l472L348L355k634k558J834J727l88o51j224k63K928J389m237
$$ 169 3287 -354 -3826 -478 2877 243 -2315 -481 1246 858 207 -1017 -1280 1648 3037 -1200
1075a200k205M800K768m761k683M003K310k951j965J468J369L43j219k517Q41
$$ -1200 -3405 1395 4163 -598 -3281 722 3032 81 -1884 -416 953 1296 77 -2440 -1599
1090a599M290m08n876P0O376N45o258p81N235J346m100j645K651K414p78l154
$$ -1599 2691 2283 -3593 -3523 2853 3398 -2860 -3641 1594 2940 -1160 -2805 -154 2260 1482 -1672
1106a672p89L898K461m183l618M017M246l446m269K612L765j690l276N40K387
$$ -1672 -2461 1437 3898 -285 -3903 114 4360 914 -3355 -743 3022 1332 -1944 -1404 983
1121I83Q13j655k415R02L456k08m115n45M151Q05l557j007K679J136j393r62J00
$$ 983 1796 141 -2274 -1372 2084 1876 -2239 -2784 1367 2172 -1385 -2392 287 1423 30 -932 -832
1138h32R66J342p91k499P26L491m58l772K4L682N00k991j001J774J508m98j907
$$ -832 134 1476 685 -1814 -1088 2403 1945 -1827 -1803 1879 2379 -612 -1613 161 1669 1171 -736
1155g36j068K130K228k323l547K311M334k095m985J500N151n79m834n20M098J550
$$ -736 -1804 326 2554 231 -3316 -1005 3329 1234 -3751 -2251 2900 2321 -2513 -3033 1065 2615
1171B615l072k401K073L226q42l587k84L987J467l740k516L239L503k534m071
$$ 2615 -457 -2858 -785 2441 1599 -1988 -2272 1715 3182 -558 -3074 165 3668 1134 -2937
1186b937J458M446m43m517o08M085J205l525j832K873J963k001k262J004J925
$$ -2937 -1479 2967 2524 -1993 -2601 1484 2689 -836 -2668 205 2168 167 -2095 -1091 834
1201H34K22j484j439Q59K306J6k778n81L201J069l319j244L218J540k646j487
$$ 834 1056 -428 -1867 -1008 1298 1314 -1464 -2045 1156 2225 -1094 -2338 880 2420 -226 -1713
1217a713J896J278r08n25j11k57R33R02j833j643K546K366l295l074L314L610
$$ -1713 183 1461 553 28 -83 -340 593 1495 -338 -1981 565 2931 -364 -3438 -124 3486
1233C486l202l952K851L725k472l309K007K612j138j806J92N79R13J083j643k212
$$ 3486 284 -3668 -817 2908 436 -2873 -866 1746 608 -1198 -1006 -427 486 1569 -74 -2286
1249b286K156L406k813m008L498M644l795n075L566M929k987m095K373K751j990
$$ -2286 -130 3276 463 -3545 -47 4597 802 -4273 -707 4222 1235 -2860 -487 2264 274
1264B74j630J295N59m99O01o75k221J321L535j396m241J238M354j271m274J702
$$ 274 -1356 -61 498 -1 600 -75 -2296 -975 2560 1164 -3077 -1839 2515 1244 -3030 -1328
1280a328M185j459m048R94L240j32j604J41N5o24J014J098j711j003K698O16m211
$$ -1328 2857 1398 -2650 -1656 1584 1452 -152 -11 44 -580 434 1532 -179 -1182 1516 2132 -2079
1297b079r46N543J632o016k204N341J669m692o85M446p2m300L19K734l00m14J294
$$ -2079 -3025 2518 4150 -1866 -4070 1271 2940 -1752 -2437 2009 1937 -2363 -2044 690 390 -24 1270
1314A270j840k626L174L340l496k769M469J782n986j335P154J695o440j719M593
$$ 1270 -570 -3196 -22 3318 -178 -2947 1522 3304 -2682 -4017 3137 4832 -1608 -3327 1266
1329A266M56k993J365K384k298k221J759P04j128J597J686l481l250L381L954
$$ 1266 1722 -1271 94 2478 180 -2041 -282 422 -706 891 2577 -904 -4154 -773 3181
1344C181k343l020J879J634k879j224L729K352l015k750J173J503J59R82N42k571
$$ 3181 838 -2182 -303 1331 -1548 -2772 957 3309 294 -2456 -1283 220 379 1361 1903 -668
1360f68j606K572J425k403L03L655j705n958J293P169k7o265k31M018j363k865
$$ -668 -2274 298 1723 -680 -377 3278 1573 -4385 -3092 4077 4050 -2215 -2446 1572 209 -2656
1376b656K794L017k567k537O61qN36L473J49n400j416N198J167m208R15M674k392
$$ -2656 138 3155 588 -1949 -1288 -1296 -760 2713 2862 -2538 -3954 1244 2411 -1797 -882 3792 1400
1393A400o159K008O497j99m325n06J333p69J10K388K90k242q54O05p46L78L149
$$ 1400 -4759 -2751 3746 3547 -778 -1284 49 -720 -610 1778 2068 -174 -1028 -423 -1169 -791 2358
1410B358P54m472k872L420L401j945k014J958N06l380o65M319J722l166j507J065
$$ 2358 3112 -1360 -4232 -812 2589 644 -1370 588 1094 -2286 -2951 1368 3090 -76 -1583 -518
1426e18n32K5L173O48m084j063L614k57l255K561M428l852n759L236N500k269
$$ -518 -1050 -1025 2148 2796 -1288 -2351 1263 1006 -2249 312 4740 888 -4871 -1635 3865 1596
1442A596l556K327J223l410n69L745O06k183n0k9k081J078M185p26m716K78M038
$$ 1596 -1960 367 1590 -1820 -2389 1356 1962 -221 -271 -300 -2381 -1303 2882 2156 -2560 -2282 1756
1459A756j220l179K747L757l301m505K533M310j359k672J301J060k088n31K652
$$ 1756 536 -2643 104 3861 560 -3945 -1412 2898 1539 -1133 168 1228 -860 -1391 1261
1474A261L72k080K71J128k002r74L644J437m359j797M033R83l960J97M419j011
$$ 1261 1633 -447 -176 952 -1050 -2024 1620 3057 -1302 -3099 934 1917 -2043 -1846 2573 1562
1490A562m433J173L448j449j627K418Rl505J185L952j930l449L216L006m686k691
$$ 1562 -2871 -1698 1750 301 -1326 1092 1101 -2404 -1219 2733 803 -2646 570 3576 -1110 -3801
1506c801N210K730m861k236M104R06l403K44K870r49k029J057N08j560J003K325
$$ -3801 1409 4139 -722 -2958 1146 2052 -1351 -1107 1763 814 -1215 -158 350 -1210 -207 2118
1522B118j904l129K247L012k414k840L238K670l731k699L580K899l088j940K619
$$ 2118 214 -2915 -668 2344 -70 -2910 328 2998 -733 -3432 148 3047 -41 -1981 638
1537F38Q16k611J35K755o44k138J210J018k306r1L595k51m292L32L980j122l343
$$ 638 1454 -1157 -1022 1733 1089 -1049 161 1179 -1127 -1218 2377 2126 -2166 -1834 2146 1024 -2319
1554b319K277K847l182k794L084K017k530l22K235j543k440K750K448l031j682
$$ -2319 -42 2805 -377 -3171 -87 1930 -600 -922 1313 -230 -2670 80 2528 -503 -2185
1569b185L334M46l878O16M592o96m326M23L255o40j904J304J176j765q58J300
$$ -2185 1149 1595 -2283 -1667 2925 2229 -2097 -1674 1581 941 -963 341 1517 -248 -1106 194
1585A94J65o54J096K96k320p85K776J129k606r70K433K65k830m7L376M80l257
$$ 194 359 -295 801 1097 -1223 -2008 768 1897 -709 -1679 754 1019 -1811 -1858 1518 1998 -1259
1602a259p63K404M95j415M84J097j249q97J409N64j241P78J222j878j806K405
$$ -1259 -2022 382 877 -538 -54 1043 -206 -1103 306 870 -371 407 1629 -249 -2055 350
1618C50K147k410j701K103P10k303QK512m42k121N02J061r96j0J782n74k404P29
$$ 350 2497 87 -1614 489 1199 -1104 -1096 1416 974 -1147 -645 416 -580 -590 1192 618 -1786 -1057
1636a057K364j085j862J599J626j863j475J751J579j166j063N34M51j90K8N6j39
$$ -1057 1307 222 -1640 -41 1585 -278 -1753 -2 1577 411 -652 -118 333 143 171 227 88
1653H8L03J08p96m53J034R79j000j394M87J532l92j538M41J539n77j776M60J790
$$ 88 391 499 -297 -750 284 1263 263 -1131 -644 888 496 -1042 -601 938 361 -1415 -955 835
1671H35j40j423J5R00l1l09L45j50j94M49J48r32J43J413j95j567J63J444k01
$$ 835 695 -728 -713 187 156 -153 192 42 -152 297 445 -487 -344 1069 874 -693 -530 914 713
1690G13j185K72R25n26o14M16K12m35K75K15p39k25R97J26j037j49J050Q6r45
$$ 713 -472 -200 725 199 -415 1 213 -222 53 268 -471 -696 301 427 -610 -759 291 377 -568
1709e68j04P85L64m55m95J89O89K16o55m43O49N92o14n71M88O24l01o84o9O24
$$ -568 -672 113 477 22 -473 -284 405 621 -34 -477 172 764 150 -421 67 691 390 -294 -363 261
1729B61M22o04o91N06P32m56j024M02J070l42j013K02Q10j29n25J7J80K20Q3k47
$$ 261 683 79 -612 -106 626 170 -854 -452 618 276 -737 -535 275 146 -379 -362 -182 38 121 -126
1749a26k62L98M72m60m71N08N94m20m63L08K64j15j31k7p8J51J35k88l59M11K29
$$ -126 -388 10 482 22 -449 59 653 233 -230 78 342 227 96 69 -9 142 277 -11 -370 41 270
1770B70l24m02K40L99k13k57j48K74K27j20m36J37P03j02p21M7Q52L9p19q0N65
$$ 270 -54 -456 -216 183 -30 -287 -435 -161 66 -54 -490 -353 350 248 -473 -426 426 465 -254 -334 231
1791B31K86m22k64J67M48K4n25k47N12M53o81n68O18N36n71n70L56M96k48l89
$$ 231 517 95 -169 -2 446 470 -55 -302 210 663 -18 -586 32 568 -3 -573 -217 279 31 -358
1811c58n0K89K48j78m03J38M64K2m81n2N54J22l52j22K79J80j12m1q4N5J95l1
$$ -358 -408 -119 129 -49 -452 -314 150 172 -309 -361 193 315 -37 -159 120 300 188 147 63 118 313 282
1833B82l40jK62Qk55j72K38J82j58l05K8K88K3k14l32K64M50l06n25K85M81j03
$$ 282 -58 -59 203 211 -44 -216 22 204 46 -259 -231 57 80 -134 -466 -202 248 -58 -583 -298 183 80
1855H0m14P0L98J40k39j68J37M26j39m69J6N10J32n75j17M88J30l32l09K97J85
$$ 80 -334 -264 134 274 35 -133 4 430 291 -178 -162 348 480 -95 -212 276 406 74 -235 62 247
1876B47j53k70k0J92J13l03k37J45M29q8n03J08L82jk61M7K31M5q9j18L5K63J73
$$ 247 94 -176 -196 -4 109 -194 -431 -286 143 55 -448 -340 42 41 -220 -173 58 103 14 -104 -69 194 367
1899C67l06j46P4L67l6l61j32M33L3k93k49L35J82k45m21J97M05j25l63j04K80
$$ 367 61 -85 -11 356 320 -41 -173 260 293 0 -249 86 268 23 -398 -201 204 79 -284 -388 -108
1920a08J66k84j33K36K06n5l60l9L94L78l43m05M04L72l46k76L67L40l08l45J85
$$ -108 58 -226 -359 -123 83 28 -332 -371 23 401 58 -347 57 429 83 -193 174 514 206 -139 46
1941D6K14L4j90Nj92K0R6N2j19n3J57k49j74J38K97m5l04o9J29P9Q3L3j07J7J19
$$ 46 260 294 104 109 -83 -63 33 85 -34 -87 70 -179 -353 -215 82 37 -267 -336 -207 -128 -45 -12 -119 -102 17
1966A7R2k09K9M24J10n73k15N83L26m41l51L92J63l37k98L04L90j58n29j08L11
$$ 17 109 -100 -71 353 463 -110 -325 258 584 143 -208 184 347 10 -288 16 406 248 -281 -389 -78
1987g8K89q5l48o7M06j97m97K22O57J03q37k08O06M19l62k78L42K20l38j93M51
$$ -78 211 126 -222 -289 117 -80 -577 -355 302 405 -432 -640 -34 385 23 -255 87 307 -31 -224 227
2008B27K54j34l61j76J83L60K3k62j96N6M0j64j3L20J11m63k61K68J26j1J7K6
$$ 227 481 347 -14 -190 -7 353 376 114 -82 -26 14 -150 -163 157 268 -195 -456 -188 -62 -73 -56 -30
2030c0j82j69K76J92j78L3K19j37m42K33P07m6n75j51L52L6q3J54Q3p9k31j24
$$ -30 -212 -381 -105 87 -91 -58 161 24 -418 -185 522 476 -99 -250 102 138 55 209 292 213 -18 -142
2052a42OK85M33m35o88J71N87K5n81P4N20k87o62J72Q09J15o62k52L62K11L1r9
$$ -142 -136 149 582 147 -541 -370 217 242 -339 -265 255 -32 -694 -522 287 402 -260 -512 -150 61 92 -7
2074gN6L6o9p1j06K92M73j99o29j02O12J95m60j25L82On75j9N42J25m47k45R8
$$ -7 49 85 16 -55 -161 131 604 405 -224 -326 286 481 21 -104 278 284 -291 -310 232 357 -90 -335 -237
2097b37L1J11K17j15l23J16K36l10r7M80L76o05m16M98N41l24k09J23qn0l5J43
$$ -237 -206 -95 122 7 -316 -200 36 -274 -371 109 485 -120 -536 -38 503 179 -30 93 85 35 0 143
2119A43J3P1J67m20l92N87M45n36n66M57M79n70m28M75M77m61m63J67L48M9j88
$$ 143 156 227 394 -26 -418 169 614 78 -488 -31 448 -122 -550 -75 402 -59 -522 -355 -7 42 -146
2140a46q5L6J53J46j90j83L82L14l99m36L80O19k09o09K06M72k37m73J60M81j49
$$ -146 -231 -195 -42 104 -86 -269 113 427 28 -408 -28 591 382 -227 -21 451 214 -259 -99 382 233
2161B33k85q0R6j2K13jm08j24M54K1n31k8P95p4p48j23P41J22m00j2K79Jk32J11
$$ 233 -52 -132 -36 -48 165 164 -244 -368 86 107 -424 -452 343 269 -479 -602 139 261 -139 -151 128 129 -103 8
2185HK1J84R8ln91m4P63K90q52k85P29O2o99p1Q16O4p55l61M35L17o7j22j94m6
$$ 8 29 213 311 308 -283 -327 436 726 -126 -411 318 380 -319 -390 426 490 -265 -626 -191 126 59 -63 -257 -303
2209c03K36L7k04P4M17k6o20j32P19M28n50m97M04L71l45j55M09K56l91m04R7
$$ -303 -67 -30 -234 -160 257 231 -389 -521 198 626 76 -421 -17 354 9 -146 263 519 128 -276 -179
2230a79M19J23q1k66l27J61L63j41l81K65L49m34o44M81Q40l35p08Q0M60rp4J31
$$ -179 240 363 282 16 -311 -150 213 72 -309 -44 305 -129 -773 -292 548 213 -495 -415 45 36 -38 93
2252I3L8j14K6j10j55M16M89m38p64K68P91q0o39N9O00k94n46J11N59K09n40l87
$$ 93 131 17 43 -67 -222 194 683 245 -519 -251 540 460 -179 -120 480 186 -360 -249 310 519 -21 -408
2274d08K9L80J94k29l33J83L69k82m12K79O63j03p70j39P69K65m66l07L97K72
$$ -408 -379 1 195 -34 -367 -184 185 -97 -509 -230 433 330 -440 -579 190 455 -11 -318 79 351
2294C51k55k57K34L45j16l68j86K75M30m4n65r3L70J46m20l72O35K77n31m16L50
$$ 351 96 -161 73 418 302 -66 -252 23 453 409 -156 -249 121 267 -153 -525 110 387 -144 -560 -210
2315b10M91j58m14l6K80R7q2j70N6L69J04n94j35O41L78n46m50L75N47l11m97
$$ -210 281 123 -291 -327 -47 50 -32 -202 -146 223 327 -267 -402 239 617 71 -379 -4 543 232 -265
2336b65K20M40l4n04j82L91K95j83n32L7M69N8n05j01L91L01m00m19L70M87o8
$$ -265 -45 395 361 -143 -325 66 361 178 -354 -317 152 210 -295 -396 -5 296 -104 -523 -153 334 266
2357B66o70LN35K57n49k20M82L56l36l97K13M72p3m44j43L29M05k60m81%N90M4
$$ 266 -404 -401 134 391 -158 -378 104 460 124 -273 -60 412 339 -105 -248 81 486 226 -255 -255 335 379
2379C79n96k55N68L21n00l64K33M35j45m40j8M13J72k69l55J65O07m9n69j8M34
$$ 379 -217 -472 96 417 -83 -447 -214 221 76 -364 -382 31 203 -66 -421 -256 351 302 -267 -285 149
2400A49K79n00j92L56L71k75n86L10M99k2m97k61M87L50l60n34K04N22j31n27
$$ 149 428 -72 -264 92 463 188 -398 -88 411 389 -108 -369 118 468 108 -426 -222 300 169 -358
2420c58p1N04J92l13m37L19M61j22o36K0O67J72n01l13N08L90l22m30K10M22K4
$$ -358 -429 75 267 -46 -483 -164 297 175 -461 -441 226 398 -103 -416 92 482 160 -270 -60 362 386
2441C86l63k60K94L54q0o04P2N90o9m84k09M50K53l85l61J45M85j18m22o1M20
$$ 386 23 -237 57 411 331 -273 -201 389 320 -164 -373 77 330 -55 -416 -271 214 96 -326 -387 33
2462C3K27l63l85K67O27j32o18m8N90K52m35l92M33M42k43n10M8O60l5n32k28
$$ 33 260 -103 -488 -221 406 274 -344 -392 198 450 15 -377 56 498 255 -255 -207 453 418 -114 -342
2483c42N12L04l88n11J27O96j22o34j13N64K60n29l88L35N46j98n96j1P88R5o00
$$ -342 170 474 86 -425 -298 398 276 -358 -471 93 353 -176 -564 -229 317 119 -477 -488 300 395 -205
2504b05j96M50L84l00l94J55N61m9n12j27M19K79l46m00J29N45j02m95q8M14J74
$$ -205 -401 49 433 133 -261 -106 455 406 -106 -233 186 465 119 -281 -152 393 291 -204 -292 122 296
2525B96l51k76K14L50j19m79k0M44K24m34k98K71N26r7n99k0O13J27m66k92M02
$$ 296 -55 -331 -117 233 114 -365 -385 59 283 -151 -449 -178 348 251 -348 -368 245 372 -94 -386 16
2546A6M38k36m34J38N07nm78l41N11L97l94n98K98O00j38o32j48O29K29m87n03
$$ 16 454 218 -216 -78 429 424 -54 -395 116 513 119 -479 -181 419 281 -351 -499 130 359 -128 -631
2567f31M84N03j93p12J56O77k4n94q1M76M15l27n20J74O22K4n77k11N64L92n24
$$ -631 -147 356 163 -549 -393 284 260 -334 -415 61 476 149 -371 -197 425 449 -128 -339 225 617 93
2588I3m77L72N43l35n08K3M91O8l34k61J83L04k0m14j54M97K82n19l88M46O44
$$ 93 -384 -12 531 196 -312 -289 202 270 -64 -325 -142 162 142 -272 -426 71 353 -166 -554 -108 536
2609E36l14o55P4P37q3m66j36M64L14l05m55J50N49M1n25l33M97M82m31o18K80
$$ 536 222 -433 -359 378 295 -171 -307 157 471 166 -289 -139 410 451 -74 -407 90 572 141 -477 -197
2630a97P02j67r09R5P88J31p19l63N73M51m31m94L29L60ml73j38L91M10k47o27
$$ -197 505 338 -571 -476 312 443 -276 -639 -66 385 -46 -540 -211 149 145 -228 -366 25 435 188 -439
2651d39J54P46M7o66j55O66K36p10k41N53L00l85m29J98K14Q1k1l94p1M25J14
$$ -439 -285 461 508 -158 -313 353 589 -121 -362 191 491 106 -323 -125 89 170 149 -245 -316 109 223
2672B23n19k44O87L49p23m96O32N65m14n09K44M29p7l10k6L18K83j87n00q6O51
$$ 223 -296 -540 147 496 -227 -723 -91 474 60 -449 -205 224 147 -163 -189 129 412 225 -275 -361 290
2693B90L52n79o01N89O34n97p43O29P90n95q92L26Q97j54p28l7L61J74k07k16
$$ 290 642 63 -538 51 685 88 -655 -26 764 169 -723 -397 500 346 -382 -419 -58 116 -91 -307
2713c07J09L58J13m76m63O25P50m26r60L64R43k89p45L17P36k48p42m7P02O0k08
$$ -307 -198 160 273 -203 -666 -41 709 283 -677 -313 630 341 -404 -87 649 401 -341 -388 314 374 166
2734A66j55k24J57K68M6n22K6N55n3p97o8J037J66j001l11P15L78m72k63M34J09
$$ 166 11 -213 -56 212 258 -264 -238 317 264 -533 -601 436 602 -399 -710 5 383 -89 -352 82 191
2755A91k35j24j2J52M15K9p15k35Q77M29q96m68R47M32j008n90J084O71r07o60
$$ 191 -44 -168 -180 -28 387 416 -299 -534 343 772 -124 -592 355 787 -221 -811 273 944 37 -623
2775f23M76L94j39k04ML6Q7K7l78j16O98M09q99o89Q69Q03o58p33P09N78o72n71
$$ -623 -147 247 108 -96 -92 -56 31 58 -320 -436 262 671 -228 -917 -48 755 97 -636 73 651 -21 -592
2797e92N87O82m08m88Q4K42P4K43j27n57J54M66l32o69N26Q78n15j057K10J110
$$ -592 -5 677 269 -219 -135 107 181 424 297 -260 -106 360 28 -641 -115 763 248 -809 -599 511
2817E11j43q34J31O24j89m47J64K26R2M4k24l86J44Q83k8j010oR70Mj059P3J194
$$ 511 368 -466 -335 289 100 -347 -183 43 135 179 -45 -431 -287 596 568 -442 -448 522 526 -533 -460 734
2839G34P6j295k23R66K80n34k27J88J12j21%j54N8N04j30q68l3J020M20j149m17
$$ 734 810 -485 -708 258 538 4 -223 -35 77 -44 -44 -198 -140 364 234 -634 -667 353 773 -376 -793
2860g93J002L54q91k56R58L53q47l80N01L02p5n4j22k48K02L90l48m28O38M23
$$ -793 209 563 -328 -584 374 727 -120 -500 1 303 228 174 52 -196 6 396 48 -380 258 681
2880F81q90o76Q64Q93o84q53M21N49l97k98M02K15k47j74j18n6M54N48n42q19
$$ 681 -209 -885 -21 872 188 -665 -244 305 -92 -390 12 227 -20 -194 -312 -368 86 634 92 -727
2900g27M55R14l85q90N35R97o06j166N38J160j77j001K4N69m7j86j2%O0Q4k44
$$ -727 -272 642 257 -633 -98 899 293 -873 -335 825 648 -353 -329 240 193 7 -5 -5 55 139 -105
2921a05m90M30R19l88j153J20J183j36r61J69J042l10j021J65J007N9o14q5J02
$$ -105 -595 -165 754 366 -787 -667 516 380 -581 -412 630 320 -701 -536 471 530 -84 -169 -67
2940f7o7L03K64l83l52N96J04p54m9J001K43j245l78R58M30o81k54M35R4m77n9
$$ -67 -134 169 433 50 -302 294 398 -356 -405 596 839 -406 -784 174 604 -77 -331 104 198 -279 -338
2961c38K18K02J15m0n66l05Q67N48p78n95O75O35q10n91R17Q78r13q51O11P33
$$ -338 -120 82 197 157 -409 -714 153 701 -77 -672 3 638 -172 -763 154 1032 119 -732 -121 612
2981F12k50m87R4J26Qj5j70o3L28M31p99p68R13R31p00j005N02Q64n63p46O90
$$ 612 362 -125 -31 95 103 88 -82 -145 183 614 -185 -953 -40 891 191 -814 -312 552 -11 -757 -67
3002f7P27n73o19K48L62P5N6j63l56J05O30j73o43L51O95n05p82L91R43j87q65
$$ -67 660 87 -532 -284 78 153 209 46 -310 -205 425 252 -391 -40 655 150 -632 -241 702 515 -350
3023c50j11P05Ll69n5K75k0j04j69k41L22N35j59q80N6R03J60r13j61R47K23r60
$$ -350 -461 244 247 -122 -177 98 78 -26 -195 -436 -114 421 262 -618 -562 341 501 -412 -573 374 597 -363
3045c63k48Q85M25o64m75L82L44j23j63j56J97L15j36n99N0Q58J03j070l05R95
$$ -363 -611 274 699 35 -440 -58 286 163 0 -156 41 356 220 -379 -329 529 632 -438 -743 252
3065B52L79q51m54Q74K62p31k86N11K82j46k53j06L6N00P7n63j79N99K44n39l10
$$ 252 631 -220 -674 200 462 -269 -555 -44 238 92 -161 -267 -231 269 346 -217 -396 203 447 -92 -402
3086d02O36L93n62m22L19L68o6l65q1K44J86j58l35L8L81P8n05k26M99M37m24
$$ -402 234 627 65 -357 -38 330 264 -101 -182 62 248 90 -245 -207 174 252 -253 -479 20 457 33
3107C3n86K59O89q8q49J62O98J43p83j09N73L96m18m42J97M12J54m54l79N18N05
$$ 33 -553 -294 395 307 -542 -380 318 461 -322 -431 142 538 120 -322 -125 287 441 -13 -392 126 631
3128F31m66p89N18P77l27q85J82Q08j45n92j14M93J10l16k20O7L51J49l88k34
$$ 631 165 -624 -106 671 344 -541 -359 449 304 -288 -402 91 201 -115 -335 -268 83 232 -156 -390
3148c90L58M53k90n18J94N68j18m26m5L92K07l13k50J29L22ll43k43L35L66l77
$$ -390 -32 421 131 -387 -193 375 257 -169 -214 178 385 72 -178 -49 273 270 -73 -316 19 385 8
3169Hl65K35M05Lo15j60N59K98l70n52L48O46k95o77K23O79n8o04j01M60L84l47
$$ 8 -357 -122 283 286 -329 -489 70 368 -2 -554 -206 440 145 -532 -309 370 312 -292 -393 67 451 104
3191A04m64R3O22J55o94l24O70N00o91n48M90O69m37n76J86N28ml92k44L16L31
$$ 104 -360 -267 355 510 -184 -508 162 662 -29 -577 -87 582 145 -431 -245 283 279 -113 -357 -41 290
3212B90k37m36J22N93l9n11k06N67K43m26l73L18M07j09l29r0L13L08k77l59J46
$$ 290 53 -383 -261 332 293 -218 -424 143 386 -40 -413 -95 312 203 -126 -216 97 405 128 -231 -85
3233h5M47o2n05j19M98K63m11m09K31N23j21o13q0O93J11n58l44M92M56k17o66
$$ -85 362 300 -205 -324 174 437 26 -383 -152 371 250 -363 -443 250 361 -197 -541 -49 407 190 -476
3254d76J53N46J11n89j75M03N54l75o60K60Q41k10p68P2P35j2o45r5M84K64l22
$$ -476 -323 223 334 -255 -430 -27 527 152 -508 -248 593 383 -385 -313 422 410 -235 -330 154 418 96
3275I6m18N6M50K30n53l38M40M45m40n08L11N86j04n75n7N66J05l96j81K53K34
$$ 96 -322 -266 184 414 -139 -477 -37 408 -32 -540 -229 357 253 -322 -379 187 292 -104 -285 -32 202
3296B02j5l34p9L76K21k54m10J70M79rn27j31N03K22m56l15L71M60l31n31Q8M81
$$ 202 187 -147 -226 150 371 117 -293 -123 356 347 -180 -311 192 414 -42 -357 14 474 143 -388 -300 181
3318A81L7l75k20K55M05j57n35P4O37J71q40k88Q42M08n83o15N91N43m26m59K65
$$ 181 218 -157 -377 -122 283 126 -409 -335 302 473 -367 -655 187 595 12 -603 -12 531 105 -354 -89
3339h9M68n9n02r1L53L38j60n02l9M92J09n49j65N55K49n28l16L43M23k01m26
$$ -89 379 320 -182 -273 80 418 258 -244 -283 209 318 -231 -396 159 408 -120 -436 -93 330 129 -297
3360b97Q6K97Oj08o5K1J88M8l75m4L66L03k42n55J93N84j29m36l0M30P6m62k29
$$ -297 -211 86 92 -16 -81 -60 128 176 -199 -243 123 426 184 -371 -178 406 277 -159 -189 241 317 -145 -374
3383c74M74L98l74m55K8L47K52k97l70K52N09l78n63K87P29o5q46j15P39L89o49
$$ -374 100 498 124 -331 -303 44 296 -1 -371 -119 390 12 -551 -264 465 400 -446 -561 178 567 -82
3404h2k32M03K60l15l44K45N39j18m66k60L31M81q9n36K9M42j08m55m7N50K09
$$ -82 -314 89 349 34 -310 -65 474 356 -110 -370 -39 442 353 -183 -154 288 180 -275 -322 228 437
3425D37o04m27L72O02j61m05K1K52j14j29k5K48K19j70m04j51M60M85k72n79J59
$$ 437 -167 -594 -222 380 219 -186 -165 87 -27 -156 -181 67 286 116 -288 -439 21 506 234 -345 -186
3446a86M58o2m55J83N74p0p77j25O29L19k98l34j28K17J73j25j65J89L37l87p18
$$ -186 272 210 -245 -62 512 442 -335 -460 169 488 190 -144 -272 -55 118 -7 -172 17 354 -33 -751
3467g51L77R74m1j017k30Q83J51o57pP34j7o50j87M92L19l6k47k96l9L69K01m33
$$ -751 -374 600 559 -458 -688 195 346 -311 -318 416 399 -251 -438 54 373 337 90 -206 -245 124 325 -108
3489a08j01N54K1q24j58J044L22r56l59N46K57m49L2M65j54m43R0J59j01L23L34
$$ -108 -209 345 366 -458 -616 428 750 -206 -565 -19 238 -211 -179 286 132 -311 -221 -62 -163 160 494
3510D94o28o16O24Q28n43o32N86L83p56l56Q20N21n68m54J83M6L3L41m6n41P1
$$ 494 -134 -750 -126 702 159 -473 113 496 -260 -616 204 725 157 -297 -114 -68 -35 306 260 -281 -210
3531b10N20l23n81O46Q05q23j104P05J179n34r09N08O59p20n13P32N07m15k35
$$ -210 310 -13 -594 52 857 34 -1070 -365 814 280 -629 -121 538 -182 -695 37 544 129 -106
3550a06P4k59P7P33k9q42J4Q39k80q72N31J073o75j276P07R23m76n58M35K25o40
$$ -106 -32 -291 -214 519 490 -352 -338 501 221 -651 -120 953 278 -998 -291 632 156 -402 33 258 -382
3571c82kO24l6m60M19J34q01j95J252K33j227k45J132N7j026K74J001l75r18K52
$$ -382 -384 240 204 -256 163 297 -504 -699 553 786 -441 -686 446 503 -523 -249 752 377 -541 -289
3591b89O29l62J6L93l76o23N76P22p95m87J027K75j426k84J496N13j500l51J137
$$ -289 340 -22 -6 387 11 -612 -36 686 -109 -596 431 706 -720 -1004 492 1005 -495 -846 291
3610B91J58r78J83Q87l65o08K93K54m15L87O01p18p90Q50Q47j005o09J130M91
$$ 291 449 -529 -346 541 176 -432 -139 115 -300 87 688 -30 -820 30 877 -128 -737 393 884
3629H84j403k76J296M33j181j74P28k27n20M83N44p70k29O84j37q48O17R57p27
$$ 884 -519 -795 501 934 -247 -421 307 80 -440 43 587 -183 -412 272 135 -713 -96 861 134
3648A34j140Q20Q94p20o48Q49L82q35l37R21N7n62J80L14o23m3Q99N3j138J50
$$ 134 -1006 -186 708 -12 -660 189 571 -264 -601 320 377 -185 -5 309 -314 -357 542 595 -543 -393
3668c93J092m30j171O86J273p73j243O03J113p32m65M89K94n78o2L77j54j32N16
$$ -393 699 269 -902 -216 1057 284 -959 -356 757 25 -440 49 343 -235 -297 80 -74 -206 310
3687C10j42p81J74J064j04j200K73J201n95r65N93R91n30q94M46N67m33j07M13
$$ 310 168 -613 -439 625 521 -679 -406 795 200 -765 -172 819 289 -605 -159 408 -25 -132 281
3706B81k15m13L23L78n58k23P96O0r47p5J032O5q98m8P42n8o81K84M93k61l51
$$ 281 66 -347 -24 354 -204 -427 369 429 -518 -593 439 504 -394 -442 300 242 -439 -155 338 77 -274
3727b74K83K8l31L99M93o91n00O72N36q24l22Q85K92r42l93R84K15p07j84M40
$$ -274 9 37 -294 105 598 -93 -593 79 615 -209 -531 354 646 -296 -689 295 510 -197 -381 59
3747E9P9j79j6Q7k11J94J45l83j82O38K92p41m43P88M22o85l63P31K23o71j56
$$ 59 138 -41 -57 30 -181 13 158 -225 -407 231 523 -218 -661 127 549 -136 -499 232 455 -216 -372
3768c72M88K35l40j14J50p9O7J94j36l00J41M43m04l82L93M85m54m99K89M49k62
$$ -372 116 351 11 -103 47 -32 35 229 93 -207 -66 377 -27 -409 -16 469 15 -484 -195 254 -8
3789hk68K21J82j52p2P3m4J4K92j87l94K36N49k20n40J47N62j12o44J27N96jn05
$$ -8 -276 -55 127 -25 -97 -24 -68 -54 238 51 -343 -107 442 222 -318 -171 391 279 -365 -238 358 357 -148
3812a48j55M28O7j24k20j6J97J42k28j78J82L79k91m23J43N76r0n72M0M89P7m84
$$ -148 -303 125 192 68 -152 -168 29 171 -57 -235 -53 326 35 -388 -245 331 241 -331 -291 198 275 -209
3834b09m3L47J69k01k29J29K52k9j96j72J74K49j17k78O6K69J6l48r6L18J53k92
$$ -209 -252 95 264 63 -166 -37 215 186 -10 -182 -8 241 124 -154 -88 181 197 -151 -247 71 224 -68
3856f8k15J74K24r1j39n9J22J60m4k53%L19P6l28k06L62K64k34l55K24L68j18
$$ -68 -283 -109 115 24 -115 -174 -52 108 64 -189 -189 130 206 -122 -328 34 298 64 -291 -67 301 183
3878A83m14J16L72l2l28k00L71K80k38l32P9M29n2m77o7L74K13l34k37K56L57
$$ 183 -231 -115 257 225 -103 -303 68 348 110 -222 -143 286 234 -243 -310 64 277 -57 -294 -38 319
3899C19k48l85J22K91R2l12j35K79J69j99j63Q9K60J3k64j0J17J52j16j98J21
$$ 319 71 -314 -192 99 191 -121 -256 23 192 -7 -170 -81 179 192 -72 -82 35 187 71 -127 -6
3920fJ37M2k73k8J84J13j33j99L2J81N3k55j02K31J28j01k47J33K03J6l02n3L36
$$ -6 131 173 -100 -128 56 169 36 -163 -131 50 103 -152 -254 -23 105 4 -243 -110 93 109 -193 -246 90
3943I0J51k40k66J51M04j51l82R7M04j9l36j09L06J60j75l21J68K88p5l56n0L67
$$ 90 241 1 -265 -114 290 139 -243 -146 258 239 -97 -206 100 260 85 -236 -68 220 145 -211 -261 106
3965A06J02k14l28K24M07k96l18J54L82jm64J08K31P2k77n1J21K03rk01p3J40
$$ 106 208 -6 -334 -110 297 1 -317 -163 219 218 -246 -138 93 165 -112 -163 -42 161 152 -49 -122 18
3987A8K43j43k83L7L23r2k40j6L12M5k58k06K59J33j02p6m1K3J06j1j67lK08J50
$$ 18 261 118 -165 -128 195 103 -137 -153 159 204 -54 -260 -1 132 30 -46 -87 -64 42 31 -136 -139 69 219
4011B19m34r3M71J67m27k38L59K80l38k03K94K00j51j97n5J69J32L2k52r8L41
$$ 219 -215 -308 163 330 -97 -335 24 304 -34 -237 57 257 106 -91 -146 23 155 187 -65 -163 178
4032A78R4m46j95N45J50m53l96N96K96n14k38M04J30k84NJ68Nj8K4j08j82K89
$$ 178 272 -174 -369 176 326 -127 -523 73 369 -145 -383 21 151 -133 -128 40 45 27 51 -57 -239 50
4054E0K52l14k65L17K74l28k56M26J77m62j97L90J48k27K6N0k09n0L47M2n04J52
$$ 50 302 -12 -277 40 314 -14 -270 156 333 -129 -326 64 212 -15 11 61 -148 -198 149 191 -313 -161
4076a61N68l41n67K19P96l35o27K59N51k80m18L79J88k21j90K93j77O5K87p2n56
$$ -161 407 66 -501 -282 514 179 -448 -189 362 82 -336 43 231 10 -180 113 -64 1 288 216 -340
4097c40J25P16k52o39J83O99l55p91M46P39m06n44L22L63l51j38M17j02l93K84
$$ -340 -215 501 249 -390 -207 492 137 -654 -208 531 125 -419 -97 266 -85 -223 194 92 -301 -17
4117a7J72l45n5N86l4p89P1P83n3o84K43N58l54n24M07N11m62k60L96m0m48M24
$$ -17 155 -190 -245 341 307 -482 -411 372 319 -365 -122 436 82 -442 -35 476 14 -246 150 110 -338 86
4139H6L80m38n57N93L97p13j94P65J35q72p1P23N7n85J62L74k71k82M15Q0l60
$$ 86 466 28 -529 64 461 -252 -446 319 454 -418 -489 234 291 -294 -132 242 -29 -311 104 184 -176
4160a76J65K99m01n11P16O13q00m57P60K95q92j18R40J52r07j48P41m1m85K82
$$ -176 -11 288 -113 -624 92 705 -95 -552 208 503 -389 -507 433 585 -322 -470 271 230 -255 27
4180B7K82n43j04N76j32m91M08M02n72n59P96N91p56m71O55K43p73J45P24p9p19
$$ 27 309 -234 -338 238 106 -385 23 425 -147 -706 90 681 -75 -546 109 352 -421 -276 448 369 -350
4201c50K07M05k92j46N56M3r42J67P31j33o70M17N58n48o73O24N94n41l23L59
$$ -350 -143 262 -30 -176 380 423 -519 -352 379 246 -424 -7 551 3 -670 -46 548 7 -316 43
4221D3n1l23K51M69m25k13L46L9o29L12Q26l13r35K58Q73k71o56M28N14n48n36
$$ 43 -8 -331 -80 389 -36 -249 97 136 -493 -181 645 332 -603 -345 528 257 -399 29 543 -5 -541
4242e41N49M38l98j42K19j80k56M08L12n59p9M03m0o54K65P88k96p81K31O27k47
$$ -541 8 446 48 -94 125 -55 -311 97 409 -150 -229 174 134 -520 -255 533 237 -544 -313 314 67
4263F7l81M39K37n49j21L52J64k18J16J77m04k88N71L29n37k07M34nm58P9N88
$$ 67 -314 125 362 -187 -308 44 208 -10 106 283 -121 -409 162 491 -46 -253 181 176 -282 -203 385
4284C85j09n35L4L09l7q6K29j62l12J30L08k23j28L66J60o30k79P11L21m41l36
$$ 385 276 -259 -225 84 47 -39 190 28 -284 -154 154 -69 -197 169 329 -301 -580 131 452 11 -325
4305c25M30Q1l85M4L46M1k23j11M5L1K34J38l03l42K99J20j97j32M22J15n29k05
$$ -325 105 186 -199 -155 191 232 9 -102 -57 -26 208 346 43 -299 0 120 -77 -209 213 328 -201 -406
4327d06M56K90l67j44J96o2r3J30J02j5r1Lr7n8K14K21j90k54J5L03m5r0Q4Q3
$$ -406 50 340 -27 -171 25 -37 -130 0 102 87 -4 -1 -98 -156 58 279 89 -165 -150 153 108 18 102 185
4351A85j92j59J04J57Q8o9j80j83J55J29M0k18O9J57j03l31K37L67l2m40n0K98
$$ 185 -7 -166 -62 95 183 114 -66 -249 -94 35 75 -143 -74 83 -20 -351 -114 253 221 -219 -269 29
4373B9Q6r3j20J59M1j63j28K12K12nl06r0J14J98l9j27M4J11j41r7N6J42L7k21
$$ 29 115 22 -98 61 102 -61 -189 23 235 230 -76 -166 -52 146 107 -20 24 135 -6 -103 -47 95 132 -89
4397h9j58K41J03o2q9N6Jn8q5R8O5Q9o7j32K1J14R5o9m4j00N6J06j66LK05kk19
$$ -89 -247 -6 97 35 -54 2 3 -55 -140 -42 23 112 45 -87 -66 48 143 74 30 -70 -14 92 -74 -71 134 132 -87
4424h7m4J74J39j50p8j6j0J03j43M7M8J18j35j61L0K92Q7l29l1K12R1k39l0K62
$$ -87 -131 43 182 32 -46 -62 -72 31 -112 -65 -17 101 -34 -195 -165 127 214 -115 -146 66 157 -82 -112 150
4448A50M0j93j79K26J04n9j86J00K3M0q6jL7J08o6k60R0K02P0k43j00K07O1j54
$$ 150 190 -3 -182 44 148 89 -97 3 26 66 -20 -21 16 124 58 -202 -112 90 160 -83 -183 24 85 -69
4472f9m7J15J28j84k6N2PL8jl8j19K42j0n4j89J19J96q4j84P1J63o1j20K9O3p
$$ -69 -116 -1 127 -57 -83 -31 -24 14 13 -25 -144 98 88 34 -155 -36 160 76 -108 -37 126 65 -55 -26 37 30
4498C0O1j19p2J24J03j70j59J47K56j74k37R1L21j56k02R9K02l5k81J35J84l3
$$ 30 91 -28 -100 24 127 -43 -202 -55 201 27 -210 -119 202 46 -156 -57 145 110 -171 -36 148 115
4520A15j09p2oJ19O3j67q0J83J28j50j48J61J38j69j56J41J39q6j36K2J26m6r7
$$ 115 6 -66 -72 47 110 -57 -137 46 174 24 -124 37 175 6 -150 -9 130 44 -92 -70 56 10 -87
4543h7N7j1K3LJ3j30P6J12R9k40pJ40L9j33q6K42j3j17k0N6O7j1q3N1r8J30J6
$$ -87 -30 -41 -18 -15 -2 -132 -56 56 155 -85 -92 48 87 -46 -132 110 97 -20 -40 16 83 72 -11 40 -58 72 88
4570H8j73L0J11J25l32p3L01J4j26j52K47J00j97q3P5R6o4o7n7J15J24n7j76O2
$$ 88 -85 -55 56 181 -151 -224 77 91 -35 -187 60 160 -37 -120 -45 51 -13 -80 -137 -22 102 45 -131 -69
4594f9K31o7j98OK20Oj23j15K01M4j58o1J03O9r2o1Q8J6rn2oj24J10J26q1p2J02
$$ -69 162 95 -103 -97 123 129 6 -109 92 136 -22 -83 20 89 -3 -64 24 40 31 -21 -27 -151 -41 85 4 -68 34
4621C4M3j35n1R9J23r2q7K7O6Nk8lj01R5K23j38j25J4J82q5k04Q9J98m6j67r7
$$ 34 77 -58 -109 -10 113 21 -66 -39 27 32 4 1 -100 -5 218 80 -45 -31 151 66 -138 -49 149 103 -64 -161
4647a61L08p3j34l5J81r7o3K7j6N3J50j46j01J00J40j43k09J11K79j02k06J12
$$ -161 147 74 -60 -95 86 -11 -74 -47 -63 -10 140 -6 -107 -7 133 -10 -219 -108 171 69 -137 -25
4669b5J68n4j92N9J48mk23J43l0N5K5q9l5K1J15j8j62K6J42m5j40O7J60j40q4
$$ -25 143 89 -103 -44 104 100 -123 20 -10 45 70 -19 -54 -33 82 64 -98 -72 70 25 -115 -48 112 -28 -112
4694a12O7J00n4JK2L3r8L7J28j77o9K49P6k75n8J53J35j34j18J21J06j55j04Q0
$$ -112 -45 55 1 2 24 57 -41 -4 124 -53 -122 127 203 -72 -130 23 158 24 -94 27 133 -22 -126 -46
4718d6Q7k6o3kqP5N0j27q2J75P5k25l2K28O8k34n3K00N8k41L8J78l9j02l6J43
$$ -46 41 15 -48 -50 -58 17 67 -60 -142 33 108 -117 -149 79 147 -87 -140 60 118 -123 -85 93 54 -48 -84 59
4744E9r7M4J11j04j23Q2J49j36j07J23N7j50n3K08K7j28j42J60J34k38O0J44j24
$$ 59 -38 6 117 13 -110 -28 121 -15 -122 1 58 -92 -145 63 90 -38 -180 -20 114 -124 -64 80 -44
4767d4m9J09Q1j34n7K83j18k64M8L28o3j92K4J43q0p7LJ44q2n3Q3j22O0J38n2
$$ -44 -93 16 97 -37 -94 189 71 -193 -145 183 120 -72 -48 95 15 -62 -59 85 3 -50 33 -89 -29 109 57
4792E7j60m1K78r2k44J39K34j18l02J42K26L4l14J01J24p1n6J14K4j02M4P0r7
$$ 57 -103 -144 134 42 -202 -63 171 53 -249 -107 119 153 -161 -60 64 -7 -63 51 75 -27 17 87 -10
4815a0n1J74O3k06q9K13j6j17j3J66r8j74L9K11j3j41J39k3j94R4J45k4k08N8
$$ -10 -61 113 176 -30 -119 94 78 -39 -52 114 16 -158 -119 92 79 -62 77 54 -140 -46 99 75 -133 -75
4839g5J50j83m9J58J71j69j25Q8J61j20O6L5rj74LM0R4k8N2o7j15R6J50r2k13
$$ -75 75 -108 -157 1 172 3 -122 -34 127 7 73 108 99 -75 -72 -32 62 34 86 19 -96 0 150 58 -155
4864a55R8J49j86p2J96J48k13j90J59J07n7o2J88k0k18l1K03j4n8R8r5j35M8J72
$$ -155 -57 92 -94 -166 30 178 -35 -225 -66 41 -16 -78 110 90 -128 -159 44 30 -28 70 -25 -160 -112 60
4888F0R0j89K5O3o1j38J97J43j61j55P0R6m5QJ52j29k29K5K30K1j30J76p1k06
$$ 60 150 -39 -14 49 -12 -150 47 190 29 -126 -56 40 -5 3 155 26 -203 -178 52 73 -57 119 48 -158
4912a58l5K31J35j82j3J3k7k9K5J48J7j75%RP8K6J12j56k21O1K29J0q5N0J7k35
$$ -158 -193 38 173 -9 -22 -9 -36 -65 -40 108 125 -50 -50 -41 37 63 175 19 -202 -141 88 98 13 63 80 -155
4938a55j51L17K18j86j52R5N7j36R9J59k0j91k9R9j0O4P3q4k41K7K17J1p3M0P3
$$ -155 -306 11 229 43 -109 -14 43 -93 6 165 145 -46 -75 24 14 78 151 67 -174 -147 70 81 8 48 121
4963A21k50r4K78J06j22j40J03l3j25K26N7p0k43J28P8j48R8J81l9k40j9J63N3
$$ 121 -129 -223 55 161 39 -101 2 -31 -156 70 127 57 -186 -58 20 -128 -30 151 112 -128 -147 16 69
4986F9r2K8R1j20j01J64J20r7r2N3r0r9K48Q9j72j57R4R5j73R0K15k4l60L0K98
$$ 69 -23 5 96 -24 -125 39 159 62 -30 23 -67 -166 82 171 -1 -158 -64 31 -142 -52 163 139 -221 -191 107
5011A07q1q0O1N2j07j22K58N2k02O3K7r0q7K00J38k10j24J56J65k51L2K22j01
$$ 107 26 -54 7 59 -48 -170 88 140 -62 1 28 -62 -149 51 189 -21 -145 11 176 -75 -43 179 78
5034G8k15rK12m3j41J89O8k76n9L58k2k49P1R6q9j43J50J22l9k13J23J12r0n9
$$ 78 -137 -146 66 23 -118 71 139 -137 -196 162 140 -109 -38 58 -31 -174 -24 98 59 -154 -31 81 -9 -68
5058f8K22p8j86R2P0j7p0J92l8k79j4K84L9k93Q1K23j36j33Q9K09k14j00J26R1
$$ -68 154 76 -110 -18 52 35 -35 157 119 -160 -174 110 149 -144 -63 160 24 -109 -20 189 -25 -125 1 92
5082I2j65q1K33o1j10RQ6J7j14K24n1j79j9K09Ok04O3J95j74r4J27J42j89j3J49
$$ 92 -73 -154 79 18 -92 -83 3 20 -94 130 79 -100 -119 90 96 -108 -45 150 -24 -118 9 151 -38 -51 98
5107I8l9k00J19J89n6k04L6J70j03j71K18L7j36j05J80O8k12J00J9Lq6J48ro2
$$ 98 59 -141 -22 167 111 -93 -57 113 10 -161 57 94 -42 -147 33 101 -111 -11 8 11 -75 73 64 2
5131Bo0J79j10j02J08Q6j18j01J90R4j89q0J33Q3j50n6J39m0r6N3O9j30J3N9O1
$$ 2 -58 121 11 -91 17 103 -15 -116 74 168 -21 -101 32 115 -35 -91 48 8 -88 -35 34 -96 -83 -24 37
5156C7j36P9L6l0o3N2J26j20o8R9J19j80o7J22L7j13k1J37J6j34J57M4j28o3J60
$$ 37 -99 -20 16 -14 -77 -25 101 -19 -87 12 131 -49 -116 6 43 -70 -91 46 62 -72 85 129 1 -62 98
5181I8j8j24jR2jp5pQ9n7m9N5J1j11P7K8op7J33m0n9j6J22j3p9l5R4J00j76lJ42
$$ 98 80 -44 -45 47 46 -29 -36 53 -4 -53 2 13 -98 -21 7 1 -76 57 17 -42 -58 64 51 -28 -63 31 131 -45 -48 94
5211I4Oq3m5Q8Oq7k8N2L5l8K2K4n9K1L4j25j7J10M3j02N7K1L0j04N2N9J4j18N3
$$ 94 100 17 -28 60 66 -21 -49 3 38 0 22 46 -13 8 42 -83 -100 10 53 -49 8 29 59 -45 7 66 80 -38 15
5240A5M6o6l7N6K5l7l7O2L1r7J6M9J0kl5k1J7j5PK5%j6J8o7k1j6J26l8o7M2P4
$$ 15 61 -5 -42 14 39 2 -35 27 58 -39 -23 26 36 34 -1 -22 -5 -20 -13 12 12 -4 14 -53 -74 -90 36 -2 -69 -27 47
5271D7j13P0R6j2j40qQ4J4p5J9OL3j02O1P9m3m2M3k3N5j3m4k4k4Q8j4p9M7J4r6
$$ 47 -66 4 100 88 -52 -60 24 38 -37 -18 -12 21 -81 -20 59 16 -26 17 -6 49 36 -8 -32 -56 32 18 -61 -14 0 -96
5301i6j7J36p8J6PL4l5J8MO6o2k1lN5K2l1J5QLj36J14m4O1k2L3nn8j9O3Ql9N9
$$ -96 -113 23 -55 -39 -32 2 -33 -15 -11 55 -7 -28 -31 24 46 15 30 38 41 -95 19 -25 36 14 47 42 -16 -35 28 36 -3 56
5333E6p6k0J3R9o7l6N2j5J3o4J01nm6j13J40o3j6J2l1J04p3M7J2lrJ2j37P2J7
$$ 56 -20 -40 -27 72 5 -31 21 6 19 -45 56 51 5 -108 32 -31 -47 -35 -66 38 -35 12 24 21 12 24 -113 -41 -24
5362b4M9k8M9jl1M0j25J15p0rN0J9n9k9KP2p1P5qK1m5l5J18j04N8j1L3Mj1k4l3
$$ -24 25 -3 46 45 14 54 -71 44 -26 -35 15 34 -25 -54 -52 20 -51 24 16 37 -8 -43 75 -29 29 18 51 55 44 20 -13
5393a3oR9m5n6k2P9p6Rm1J44n6p5O7j4L6q2k2L5J7j6kN8l9ML0O1p5l9NK7J2NJ4
$$ -13 -19 80 35 -21 -43 36 -40 -31 -72 72 16 -59 8 -6 30 -52 -74 -39 -22 -38 -40 18 -21 -17 13 74 -1 -40 -35 -8 4 9 23
5426B3RK6Mm4Rk5O5n2Nl8L8k9L0qQk5n7J05l0q9j1J08j1k0L6J5l7j9P1o6k6M9
$$ 23 32 58 62 18 27 2 67 15 20 -18 20 -9 21 13 21 -4 -61 44 14 -75 -86 22 11 -9 27 42 5 -14 57 -9 -35 14
5458A4J4m8L7p9O8p2K1J15%p7M0j9pr3O0P4p8Lp3J08J5m5K5j4QM3j00O9n3P2p4
$$ 14 28 -20 17 -62 6 -66 -45 70 70 -7 33 14 7 -86 -26 48 -30 -27 -100 8 23 -22 3 -11 -3 40 -60 9 -44 28 -46
5489d6jL2R3n1j0jj8J1k3Q6%l4j1o1Q5j9r5J75p3j1p1M8L2l6PL6j08K9M8K7l3
$$ -46 -47 -15 78 27 17 16 -2 9 -14 72 72 38 27 -34 51 32 -63 112 39 28 -43 5 37 1 8 44 -64 -35 13 40 7
5520Gm5L0m6K5M3k2l4J02n9o9P2J3N4l0n7Q4n2j7m6J02k1Jr5k0J29K8j01MK2n
$$ 7 -38 -8 -54 -29 14 -8 -42 60 1 -68 4 17 71 41 -16 68 16 -1 -47 55 34 35 -60 -80 49 77 -24 -20 2 -3
5550cK1k2kmQ2q2k0k2MN8jq9Q2M3m9kO5m2l4jP3l1OL3k9j31J20nJ6J6k6o5M3j13
$$ -3 18 -4 -6 -10 72 -10 -30 -52 -48 10 9 -80 2 45 -4 -6 59 17 -17 -18 55 24 30 63 34 -97 23 18 34 50 24 -41 2 -111
$$ [...]
8191e9
##END NTUPLES=NMR FID
##END=
