##TITLE=1H_IBEPO504
 CDCl3, 8 sc, 
 8.4.2019
##JCAMPDX= 6.0         $$ Bruker NMR JCAMP-DX V2.0
##DATA TYPE= NMR FID
##DATA CLASS= NTUPLES
##ORIGIN= UXNMR, Bruker Analytische Messtechnik GmbH
##OWNER= root
$$ XWIN-NMR		Version 3.5
$$ Mon Apr  8 14:00:44 2019 Russian Standard Time (UT+4h)  she@DPX200
##.OBSERVE FREQUENCY= 200.1315
##.OBSERVE NUCLEUS= ^1H
##.DELAY= (6, 6)
##.ACQUISITION MODE= SIMULTANEOUS
##.ACQUISITION SCHEME= undefined
##.AVERAGES= 8
##.DIGITISER RES= 18
##SPECTROMETER/DATA SYSTEM= spect
##.PULSE SEQUENCE= zg30
##.SOLVENT NAME= CDCl3
##.SHIFT REFERENCE= (INTERNAL, CDCl3, 0, 15.7039)
##AUDIT TRAIL= $$ (NUMBER, WHEN, WHO, WHERE, WHAT)
$$ ##TITLE= Audit trail, XWIN-NMR		Version 3.5
$$ ##JCAMPDX= 5.01
$$ ##ORIGIN= Bruker BioSpin GmbH
$$ ##OWNER= she
$$ F:/spectra/data/she/nmr/H-F/1/audita.txt
$$ ##AUDIT TRAIL=  $$ (NUMBER, WHEN, WHO, WHERE, WHAT)
(   1,<2019-04-08 13:59:27.92 +0400>,<she>,<DPX200>,
      <created by zg, POWCHK disabled, PULCHK disabled
       configuration hash MD5:
       00 E9 B6 7A A2 85 ED C7 34 08 36 98 17 FE 4E 26
       data hash MD5: 16K
       C9 56 AA A8 53 B7 A4 06 35 0C 8C 8A B2 51 C2 8C>)
$$ ##END=
$$ 
$$ hash MD5
$$ 5E 91 93 5F 4E F6 09 A7 EF FA F2 69 1A 04 1C B5
##$RELAX= 
##$RELAX= 
##$RELAX= 
##$RELAX= 
##$RELAX= 
##$RELAX= 
$$ Bruker specific parameters
$$ --------------------------
##$DU= <F:/spectra>
##$EXPNO= 1
##$NAME= <H-F>
##$PROCNO= 1
##$TYPE= <nmr>
##$USER= <she>
##$AMP= (0..31)
100 100 100 100 100 100 100 100 100 100 100 100 100 100 100 100 100 100 
100 100 100 100 100 100 100 100 100 100 100 100 100 100 
##$AQSEQ= 0
##$AQ_mod= 1
##$AUNM= <au_zg>
##$AUTOPOS= <>
##$BF1= 200.13
##$BF2= 200.13
##$BF3= 200.13
##$BF4= 200.13
##$BF5= 200.13
##$BF6= 200.13
##$BF7= 200.13
##$BF8= 200.13
##$BYTORDA= 1
##$CFDGTYP= 0
##$CFRGTYP= 5
##$CHEMSTR= <none>
##$CNST= (0..31)
1 1 145 1 1 1 1 1 1 1 1 1 1 1 1 1 1 1 1 1 1 1 1 1 1 1 1 1 1 1 1 1 
##$CPDPRG= <>
##$CPDPRG1= <>
##$CPDPRG2= <>
##$CPDPRG3= <>
##$CPDPRG4= <mlev>
##$CPDPRG5= <mlev>
##$CPDPRG6= <mlev>
##$CPDPRG7= <mlev>
##$CPDPRG8= <mlev>
##$CPDPRGB= <>
##$CPDPRGT= <>
##$D= (0..31)
0 1.2 0 0 0 0 0 0 0 0 0 0.03 0 0 0 0 0 0 0 0 0 0 0 0 0 0 0 0 0 0 0 0 
##$DATE= 1554717567
##$DBL= (0..7)
120 120 120 120 120 120 120 120 
##$DBP= (0..7)
150 150 150 150 150 150 150 150 
##$DBP07= 0
##$DBPNAM0= <>
##$DBPNAM1= <>
##$DBPNAM2= <>
##$DBPNAM3= <>
##$DBPNAM4= <>
##$DBPNAM5= <>
##$DBPNAM6= <>
##$DBPNAM7= <>
##$DBPOAL= (0..7)
0.5 0.5 0.5 0.5 0.5 0.5 0.5 0.5 
##$DBPOFFS= (0..7)
0 0 0 0 0 0 0 0 
##$DE= 6
##$DECBNUC= <off>
##$DECIM= 24
##$DECNUC= <off>
##$DECSTAT= 4
##$DIGMOD= 1
##$DIGTYP= 9
##$DL= (0..7)
0 120 120 120 120 120 120 120 
##$DP= (0..7)
150 150 150 150 150 150 150 150 
##$DP07= 0
##$DPNAME0= <>
##$DPNAME1= <>
##$DPNAME2= <>
##$DPNAME3= <>
##$DPNAME4= <>
##$DPNAME5= <>
##$DPNAME6= <>
##$DPNAME7= <>
##$DPOAL= (0..7)
0.5 0.5 0.5 0.5 0.5 0.5 0.5 0.5 
##$DPOFFS= (0..7)
0 0 0 0 0 0 0 0 
##$DQDMODE= 0
##$DR= 18
##$DS= 0
##$DSLIST= <SSSSSSSSSSSSSSS>
##$DSPFIRM= 0
$$ [...]
##$SUBNAM2= <"">
##$SUBNAM3= <"">
##$SUBNAM4= <"">
##$SUBNAM5= <"">
##$SUBNAM6= <"">
##$SUBNAM7= <"">
##$SUBNAM8= <"">
##$SUBNAM9= <"">
##$SW= 24.9337058887773
##$SWIBOX= (0..15)
0 0 2 0 0 0 0 0 0 0 0 0 0 0 0 0 
##$SW_h= 4990.01996007984
##$TD= 16384
##$TD0= 1
##$TE= 0
##$TE2= 300
##$TE3= 300
##$TEG= 300
##$TL= (0..7)
0 120 120 120 120 120 120 120 
##$TP= (0..7)
150 150 150 150 150 150 150 150 
##$TP07= 0
##$TPNAME0= <>
##$TPNAME1= <>
##$TPNAME2= <>
##$TPNAME3= <>
##$TPNAME4= <>
##$TPNAME5= <>
##$TPNAME6= <>
##$TPNAME7= <>
##$TPOAL= (0..7)
0.5 0.5 0.5 0.5 0.5 0.5 0.5 0.5 
##$TPOFFS= (0..7)
0 0 0 0 0 0 0 0 
##$TUNHIN= 0
##$TUNHOUT= 0
##$TUNXOUT= 0
##$USERA1= <user>
##$USERA2= <user>
##$USERA3= <user>
##$USERA4= <user>
##$USERA5= <user>
##$V9= 5
##$VALIST= <valist>
##$VCLIST= <CCCCCCCCCCCCCCC>
##$VD= 0
##$VDLIST= <DDDDDDDDDDDDDDD>
##$VPLIST= <PPPPPPPPPPPPPPP>
##$VTLIST= <TTTTTTTTTTTTTTT>
##$WBST= 1024
##$WBSW= 4
##$XGAIN= (0..3)
0 0 0 0 
##$XL= 0
##$YL= 0
##$YMAX_a= 423393
##$YMIN_a= -292586
##$ZGOPTNS= <>
##$ZL1= 120
##$ZL2= 120
##$ZL3= 120
##$ZL4= 120
##$ABSF1= 10
##$ABSF2= 0
##$ABSG= 5
##$ABSL= 3
##$ALPHA= 0
##$AQORDER= 0
##$ASSFAC= 0
##$ASSFACI= 0
##$ASSFACX= 0
##$ASSWID= 0
##$AUNMP= <proc_1d>
##$AZFE= 0.1
##$AZFW= 0.1
##$BCFW= 1
##$BC_mod= 2
##$BYTORDP= 1
##$COROFFS= 0
##$CY= 11.3945322036743
##$DATMOD= 1
##$DC= 2
##$DFILT= <>
##$DTYPP= 0
##$F1P= 18.9103706918063
##$F2P= -1.10871071338519
##$FCOR= 0.5
##$FTSIZE= 0
##$FT_mod= 4
##$GAMMA= 1
##$GB= 0.15
##$INTBC= 1
##$INTSCL= 1
##$ISEN= 128
##$LB= 0.24
##$LEV0= 0
##$LPBIN= 0
##$MAXI= 10000
##$MC2= 0
##$MEAN= 0
##$ME_mod= 0
##$MI= 1.114404
##$NCOEF= 0
##$NC_proc= 0
##$NLEV= 6
##$NOISF1= 3.799351
##$NOISF2= 2.8
##$NSP= 1
##$NTH_PI= 0
##$NZP= 0
##$OFFSET= 15.70392
##$PC= 1
##$PHC0= -9008.333
##$PHC1= 11.20026
##$PH_mod= 1
##$PKNL= yes
##$PPARMOD= 0
##$PSCAL= 0
##$PSIGN= 0
##$REVERSE= no
##$SF= 200.130013532006
##$SI= 16384
##$SIGF1= 3
##$SIGF2= 2
##$SINO= 400
##$SIOLD= 16384
##$SREGLST= <1H.CDCl3>
##$SSB= 0
##$STSI= 0
##$STSR= 0
##$SW_p= 3612.71676300578
##$SYMM= 0
##$S_DEV= 0
##$TDeff= 0
##$TDoff= 0
##$TI= <>
##$TILT= no
##$TM1= 0
##$TM2= 0
##$TOPLEV= 0
##$USERP1= <user>
##$USERP2= <user>
##$USERP3= <user>
##$USERP4= <user>
##$USERP5= <user>
##$WDW= 1
##$XDIM= 8192
##$YMAX_p= 0
##$YMIN_p= 0
$$ End of Bruker specific parameters
$$ ---------------------------------
##NTUPLES= NMR FID
##VAR_NAME=  TIME,          FID/REAL,        FID/IMAG
##SYMBOL=    X,             R,               I
##VAR_TYPE=  INDEPENDENT,   DEPENDENT,       DEPENDENT
##VAR_FORM=  AFFN,          ASDF,            ASDF
##VAR_DIM=   8192,          8192,            8192
##UNITS=     SECONDS,       ARBITRARY UNITS, ARBITRARY UNITS
##FACTOR=    0.0002004,     1,               1
##FIRST=     0,             0,               0
##LAST=      1.6414764,     0,               0
##MIN=       0,             -292586,         0
##MAX=       1.6414764,     423393,          0
$$ Real data points
##PAGE= N=1
##DATA TABLE= (X++(R..R)), XYDATA
0@%%%%qJ6j6J6k4L2m0N6p2Q8j04J28j55J85k22K56k98L54m08M70n44O24p13Q10
$$ 0 0 0 0 0 -8 8 -8 8 -16 16 -24 32 -40 48 -56 72 -83 102 -120 136 -162 192 -216 254 -290 334 -379 431
28D31r19J041j175J320j482J660j853K066k300K557k838L147l488L862m276M735
$$ 431 -488 553 -622 698 -784 876 -977 1089 -1211 1346 -1492 1655 -1833 2029 -2247 2488
44B488n244N815o455P179q013Q975j0100J1442j3073J5103j7713K1214k6185L3847
$$ 2488 -2756 3059 -3396 3783 -4230 4745 -5355 6087 -6986 8117 -9596 11618 -14567 19280
58A9280m7304P7715k60171J8746N51531k45284l08979J73820K52320l00604k23656
$$ 19280 -28024 49691 -210480 -191734 359797 114513 -194466 -20646 231674 -68930 -292586
69b92586K76536K74167k01950j57573J39164J8870k52112J2437L14131Q9528k41356
$$ -292586 -16050 258117 56167 -101406 37758 56628 -195484 -183047 131084 220612 -20744
80b0744r1253J10019j4746j14011R4222J79259k7978j50928j9609M1354l1981
$$ -20744 -111997 -1978 -16724 -130735 -36513 142746 114768 -36160 -55769 -14415 -46396
91d6396j0230J04538P7296o0858j21782o4022K7076R4438P1517j7950m3271N730
$$ -46396 -56626 47912 125208 64350 -57432 -121454 -94378 60 71577 53627 10356 16086
103A6086j7546p6633j757J16991O3422n3199l3188j0203r6506m9210J69531J52888
$$ 16086 -1460 -78093 -79850 37141 100563 47364 14176 3973 -92533 -141743 27788 180676
115A80676j34702j67007J07658J09762j74605j11968K47462J88959k12570k00127
$$ 180676 45974 -121033 -13375 96387 -78218 -190186 57276 246235 33665 -166462
125a66462J47741J12711j67963l5793K51423M9483k82734r3005K19849M6976j82977
$$ -166462 -18721 93990 -73973 -109766 141657 191140 -91594 -184599 35250 82226 -100751
136a00751M3527K28156o1808k56123L0064K06257m3440j37383J24765J42350j78617
$$ -100751 -57224 170932 109124 -146999 -116935 89322 45882 -91501 33264 175614 -3003
147c003j92650J45173J83895j03763j19462J19548Q3467j50976j01416J22629
$$ -3003 -195653 -50480 133415 29652 -89810 29738 113205 -37771 -139187 -16558
157a6558R8023o1370l0521N4829k7226r2063K1910R9353P665n5457J780J8203
$$ -16558 81465 20095 -10426 44403 17177 -74886 -52976 46377 54042 -1415 365 18568
169A8568m0512l5190L2524M6753J4738n041k9640m4065K524M6482J2726j4853
$$ 18568 -21944 -57134 -24610 22143 36881 31840 2200 -41865 -39341 7141 19867 5014
181E014K3459J4841o4668n0743N8584N8360m0439k5103N9097q25j01527j4951
$$ 5014 28473 43314 -21354 -72097 -13513 44847 4408 -20695 38402 37577 -63950 -78901
193g8901J10778L2971p9968m551O7991l9842r0421N4804J07476m6108r0435N5148
$$ -78901 31877 64848 -15120 -19671 48320 8478 -81943 -27139 80337 34229 -56206 -1058
205a058O3586r2846o9242J12337Q5983r7120p2492Q4222L8029r5588j6062J13564
$$ -1058 62528 -30318 -99560 12777 98760 1640 -70852 13370 51399 -44189 -60251 53313
217E3313J8025j06043j2271Q4880j6579q2481L9058R1946l8502q5940L1493N9728
$$ 53313 71338 -34705 -46976 37904 21325 -61156 -22098 69848 31346 -54594 -23101 36627
229C6627m2536l9054O2636L9018o3617l5670N1620J5924m8835N011N8299q950
$$ 36627 -5909 -44963 17673 56691 -6926 -42596 9024 24948 -23887 -18876 39423 30473
241C0473n9913K718M1898j0574k5415K8175K5285l3873k7059K5696J6627j9429
$$ 30473 -29440 -26722 15176 4602 -20813 7362 32647 -1226 -28285 -2589 14038 -5391
253e391J454K6096p580l1121K144J9944m524n553J6776J476k5010m069K0614o26
$$ -5391 -3937 22159 14579 -16542 -14398 5546 1022 -4531 12245 13721 -11289 -15358 5256 4630
267D630j3557J4319J5526k2234j9596K1016J4415k0908l326K8280l141l6224K563
$$ 4630 -8927 5392 20918 -1316 -20912 104 14519 -6389 -9715 18565 15424 -20800 -18237
280a8237L4943n817k9885J5301K9421k3093l1275K5000K8299k5441j9858L0483
$$ -18237 16706 10889 -18996 -3695 25726 2633 -28642 -3642 24657 -784 -20642 9841
292I841J3083l7333j1192L8576P966l6074m19L5537p278l7741J0726L7060j2153
$$ 9841 22924 -14409 -25601 12975 20941 -15133 -15552 19985 12707 -25034 -14308 22752 10599
305A0599l2077J6160K7027k1772k4490K4593K2321k4266j7479K3982J1304k5778
$$ 10599 -21478 -5318 21709 -63 -24553 40 22361 -1905 -19384 4598 15902 -9876
317i876p241K6737N299k4508k430K1551j663j9862M295J8135n209j5282N946J1557
$$ -9876 -17117 9620 14919 -9589 -12019 9532 7869 -11993 -7698 10437 5228 -10054 -4108 7449
331G449p102q403Q093O822p274m477N953J372n437Q54M980j447l217J928M33l392
$$ 7449 347 -8056 37 6859 -415 -4892 1061 2433 -3004 -2150 2830 1383 -1834 94 527 -2865
347b865J362M567k242m377L421L805m886k605P107L039p751l103O947J196p131
$$ -2865 -1503 3064 822 -3555 -134 3671 -1215 -3820 3287 6326 -1425 -4528 2419 3615 -3516
362c516M77P436j779p851K504P756k446n927L866M812n495m748O284M651n740
$$ -3516 -3039 4397 2618 -5233 -2729 5027 2581 -3346 520 5332 -163 -4911 1373 6024 284
377B84l566N209J484n672j57O245n00o667J73N324o90l730L114M236l610m496
$$ 284 -3282 1927 3411 -2261 -2418 3827 3327 -3340 -3167 2157 1467 -2263 851 5087 1477 -3019
393c019L478M203l493l846L061K405m277k796M478L644l192l322K416K916j743
$$ -3019 459 4662 1169 -2677 384 2789 -1488 -4284 194 3838 646 -2676 -260 2656 913
408I13k250J448J669j625j694J629J982j123k212M27J321q48j446J098J551j481
$$ 913 -1337 111 1780 155 -1539 90 2072 949 -1263 -836 485 -363 -1809 -711 840 -641
424f41k572J462M003P11k657j092J304m53j871R21K468q03l229q33J780P89M55
$$ -641 -3213 -1751 2252 2963 306 -786 518 65 -1806 -885 1583 780 -2449 -3282 -1502 -713 -258
441b58J894M77l426k789K324L411n25j466J158M15l344j952L976L896k089m283
$$ -258 1636 2113 -1313 -4102 -1778 1633 1108 -358 800 1215 -2129 -4081 -105 3791 1702 -2581
457b581m51J655k52k80K516K017j686k598L16J593L82M39O92j335k933k29K754
$$ -2581 -3032 -1377 -1629 -1909 607 2624 938 -1660 -1344 249 631 1070 1762 427 -2506 -2735 19
474A9J180k142l77K746N95l497j517L779K596l228k797L287L358l088m266K343
$$ 19 1199 -943 -1320 1426 2021 -1476 -2993 786 3382 154 -2643 644 4002 914 -3352 -1009
490a009L972j560k780K131J434m313k194N209L237m261j216N815r51r544L87J2923
$$ -1009 2963 1403 -1377 754 2188 -2125 -4319 890 4127 -134 -1350 4465 3514 -6030 -5643 7280
506G280K774j3337m509J1359K298j2524o82J5942K855j6676n180J3437L994j0752
$$ 7280 10054 -3283 -7792 3567 5865 -6659 -7341 8601 11456 -5220 -10400 3037 7031 -3721
520c721O06J2166l030j4851J991J4002j849j0873M913J0024q977j2229R229J3074
$$ -3721 -3115 9051 6021 -8830 -6839 7163 5314 -5559 -646 9378 401 -11828 -2599 10475
534A0475p857j1182Q379R286r891r256J0036R747q011q145O181N442o076m444
$$ 10475 2618 -8564 -185 9101 -790 -10046 -10 9737 1726 -6419 -238 5204 -872 -5316
548e316M670K960k530K33K322k741l849K279M001l70j778M88K87j845j855l41
$$ -5316 -646 2314 -216 17 2339 -402 -4251 -1972 2029 1659 -119 369 656 -1189 -3044 -3385
564c385L080N660K78q344n326O183N235n128j768R256J181j3631m682J3406O055
$$ -3385 -305 5355 5633 -2711 -8037 -1854 3381 -1747 -3515 5741 6922 -6709 -11391 2015 8070
579H070r879j507J0562l696j5684K970J7278q84j3132M380J0198j1166j2439J4046
$$ 8070 -1809 -3316 7246 3550 -12134 -9164 8114 7230 -5902 -1522 8676 -2490 -14929 -883
593h83J5153j2382j2513J2931P795j7607p346K0465R403j7144o317J4069j018
$$ -883 14270 1888 -10625 2306 10101 -7506 -14852 5613 15016 -2128 -8445 5624 4606
606D606j6507M319J9359l245j6110M715J0965j1422j0603J6003J3962j3028j1168
$$ 4606 -11901 -7582 11777 8532 -7578 -2863 8102 -3320 -13923 2080 16042 3014 -8154
619h154R735K096j4038K543K0365P88j8398j974J0776n522q970J3343J4203j2027
$$ -8154 1581 3677 -10361 -7818 12547 13335 -5063 -7037 3739 -1783 -10753 2590 16793 4766
633D766j4763O618N681r117K160J8575R44k0536o544J2075J964o583Q115J0580
$$ 4766 -9997 -3379 2302 -6815 -4655 13920 14864 -5672 -12216 -141 1823 -4760 3355 13935
647A3935j0266j4576M359Q283l489J225J1797q20j6482n786R259M464p15N726
$$ 13935 3669 -10907 -6548 1735 -1754 -529 11268 10448 -6034 -11820 -2561 1903 1188 6914
661F914J976j1364o650P088K257n042P550J2386r595j9096L539J3825l288l969
$$ 6914 8890 -2474 -9124 -2036 221 -4821 2729 15115 5520 -13576 -10037 3788 500 -3469
675c469J3642L784k1528r560J8135O791j4408M180K0918r526k9976M432K7466
$$ -3469 10173 13957 -7571 -17131 1004 7795 -6613 -2433 18485 8959 -21017 -16585 10881
688A0881k773j7429J3624J6018k5034k4059K3920K5968j7677j5996K1343P416
$$ 10881 8108 -9321 4303 20321 -4713 -28772 -4852 21116 3439 -12557 8786 16202
700A6202l1698j0509L2960J4053k3761n304J9740q894k7741J2321L4862o118k9134
$$ 16202 -15496 -26005 6955 21008 -2753 -8057 11683 2789 -24952 -12631 22231 16113 -13021
713a3021O266K0250j5581k1571J9941K7399j2471k3368N382J0263r700l777J7172
$$ -13021 -6755 13495 -2086 -23657 -3716 23683 11212 -12156 -6774 3489 -6211 -9988 7184
726G184Q249j3855r851M473J435k909O023Q970k086q508n232j688L102Q847L842
$$ 7184 15433 1578 -8273 -3800 -2365 -5274 749 9719 7633 -875 -6107 -7795 -4693 4154 7996
741G996n393j976J976q274q749J3367J8495r108j8472P910J2761j6491j4061K4481
$$ 7996 2603 627 2603 -5671 -14420 -1053 17442 8334 -10138 -2228 10533 -5958 -20019 4462
755D462K2057k2142k3725J6524J4959j9581p452K8239R047l0132j0455K4618K791
$$ 4462 26519 4377 -19348 -2824 12135 -7446 -14898 13341 22388 -7744 -18199 6419 9210
768I210k3628P945L1050j0509l6039O750L1485q537k5290J6785K6557k0934l0327
$$ 9210 -14418 -6473 24577 14068 -21971 -15221 16264 7727 -17563 -778 25779 4845 -25482
781b5482J6634K6409j3040j6774J7144J2036k2336j3623J9808J2189j4095m138
$$ -25482 -8848 17561 4521 -12253 4891 16927 -5409 -19032 776 12965 -1130 -5268
793e268J4359k376j9289R02J9164K554j2530l61P934m219r409L006R752K852l583
$$ -5268 9091 6715 -12574 -11672 7492 10046 -2484 -2845 5089 870 -8539 -5533 4219 7071 3488
808C488n239l769K158N021j106l208O053N113j0600j0549R782J2002p601q352
$$ 3488 -1751 -5520 -3362 1659 553 -2655 3398 8511 -2089 -12638 -2856 9146 1545 -6807
822f807J0190N401j5359o575J6675P103j4775k480J5367l100k0023M927K3149
$$ -6807 3383 8784 -6575 -13150 3525 10628 -4147 -6627 8740 5640 -14383 -9456 13693
835A3693m309k1956O115K0509j0430k1946J2042K3271j0208k0341R697J5197j2575
$$ 13693 9384 -12572 -6457 14052 3622 -18324 -6282 16989 6781 -13560 -3863 11334 -1241
848a241j2505J5360J2128j4503r868J3116N012j4378j764J6409K016j5536k172
$$ -1241 -13746 1614 13742 -761 -10629 2487 7499 -6879 -8643 7766 9782 -5754 -7926
861g926J1933m66r708L703J0206l701r511K019N931j702k450L470J240l482j013
$$ -7926 4007 3541 -6167 -2464 7742 4041 -5470 -3451 2480 778 -1672 1798 3038 -444 -1457
876a457J042j256R34M648o39o171K9N623j354m823L684N546m914n574N489L783
$$ -1457 -415 -1671 -737 3911 3272 -2899 -2870 2753 1399 -3424 260 5806 892 -4682 807 4590
892D590p069k209R612J723j1353j793J1626Q15j1829Q50J2655j347j2714J571
$$ 4590 -2479 -4688 4924 6647 -4706 -6499 5127 5942 -5887 -5037 7618 6271 -6443 -4872
906d872J1380k848j0225N030R964o177j0134O047Q564o433o401P698N455q567
$$ -4872 6508 3660 -6565 -1535 8429 2252 -7882 -1835 6729 296 -6105 1593 7048 -1519
920a519n481P843M896o474k597O289O50p030p88O630J046m851m45L116j055k778
$$ -1519 -7000 843 5739 -735 -3332 2957 3607 -3423 -4211 2419 3465 -1386 -1831 1285 230 -2548
936b548J629K637p21j379J40m27n74J548J051j582p67J507k72k206R63K653j619
$$ -2548 -919 1718 997 -382 -242 -669 -1243 305 1356 -226 -993 514 242 -1964 -1001 1652 33
953C3k793K242K760k903k629L881K670m399k633M962K484n378k400N053J852m976
$$ 33 -2760 -518 2242 -661 -3290 591 3261 -1138 -3771 1191 3675 -1703 -4103 950 2802 -2174
969b174p30N208o5n833L88O048n42n472J413N261k311n491K677N809k245n350
$$ -2174 -2904 2304 2239 -3594 -3206 2842 2300 -3172 -1759 3502 1191 -4300 -1623 4186 1941 -3409
985c409J985L964k779l441L865L597l831l713L542L272l092k308L396J969l632
$$ -3409 -1424 2540 -239 -3680 185 3782 -49 -3762 -220 3052 -40 -2348 1048 3017 -615
1000f15k083L095J898k196j247J733K80j922L35K040j30j749j36J268K36l74J31
$$ -615 -2698 397 2295 99 -1148 585 865 -1057 -722 1318 1188 -561 -697 571 807 433 564
1017E64M2l21Q3P0m78P2J025k51j897mK098L72j594J68J377q99j856J491K532
$$ 564 606 285 368 438 -40 32 1057 806 -1091 -1095 1003 1375 -219 -51 1326 427 -1429 62 2594
1036B594j480k693J125K201j651j746K236J896k536k315K241J785j829p60K334
$$ 2594 1114 -1579 -454 1747 96 -1650 586 2482 -54 -2369 -128 1657 -172 -932 1402
1051A402qk920R0L220J14l073J33K189r50k074J432K236j621k027J618J391j827
$$ 1402 1394 -1526 -1436 1784 1898 -1175 -1042 1147 197 -1877 -445 1791 170 -1857 -239 1152 -675
1068f75n35K429J74k939k26K792P0k357M15K103j457k092J724K317j878j977J843
$$ -675 -1210 1219 1393 -1546 -1772 1020 1090 -1267 -852 1251 -206 -2298 -574 1743 -135 -2112 -269
1085b69J244j991n33K649K85k705k39K353l59k019J102J856j789k033J948J956
$$ -269 975 -1016 -1549 1100 1385 -1320 -1559 794 435 -1584 -482 1374 -415 -2448 -500 1456
1101A456j566j425J769O43k026j38K440n8k339L16J890r21j604J667J535j823
$$ 1456 -110 -1535 234 877 -1149 -1287 1153 1095 -1244 -928 962 41 -1563 104 1639 -184
1117a84j824J931J301j740l82J880o8k168M20K341m85j930P25J501j588j253K082
$$ -184 -2008 -77 1224 -516 -898 982 914 -1254 -834 1507 1022 -908 -183 1318 -270 -1523 559
1134E59J338k204j188K089P32k057k8K554j72k740M2K319p9j524M94J219j397
$$ 559 1897 -307 -1495 594 1326 -731 -759 1795 1623 -1117 -1075 1244 1165 -359 135 1354 -43
1151d3j134J545J120j442o95J537J49j864RK255L4j799k4R99l64o16Q88M00j286
$$ -43 -1177 368 1488 46 -649 888 1037 -827 -818 1437 1471 -328 -352 647 283 -333 555 955 -331
1170c31k22J332j00j631N46J867o29k062O06K093o69j797N48J700r05j489R20
$$ -331 -553 779 679 -952 -406 1461 832 -1230 -624 1469 800 -997 -449 1251 346 -1143 -223
1187b23J323j120j261J066J119q49q74Q25M64r63k48J091M12j179m48P44M21p25
$$ -223 1100 -20 -1281 -215 904 55 -819 6 470 -493 -741 350 762 -417 -865 -121 300 -425
1205d25l96R24O77r58j256L42J546L96j280o91R84N88q99o77R47R94o54r92jM76
$$ -425 -821 103 780 -178 -1434 -1092 454 850 -430 -1121 -137 451 -448 -1125 -178 816 162 -830 -831 -355
1225c55R6J59L53l79q04L75R23m51q01P02J230p63j645M34J766j38j561J64J570
$$ -355 -259 -100 253 -126 -930 -555 368 -83 -884 -182 1048 285 -1360 -926 840 702 -859 -695 875
1244H75k39j804Q5J878K05j605j79J628j24j679J45J921p3j836M07J810j187k117
$$ 875 636 -1168 -1083 795 1000 -605 -784 844 720 -959 -814 1107 1034 -802 -395 1415 228 -1889
1262a889J746K810j806l301J925L449k294l719K651M417k589m701K080M415k004
$$ -1889 -143 2667 861 -2440 -515 2934 640 -3079 -428 3989 1400 -3301 -1221 3194 1190
1277A190l839K557L530k907l483K948K968l053k159L743J635m440j819M792J761
$$ 1190 -2649 -92 3438 531 -2952 -4 2964 -89 -2248 1495 3130 -1310 -3129 1663 3424
1292C424m536j437M572J073n003j086M849J347m160j271L580O50l508m69L453
$$ 3424 -1112 -2549 2023 3096 -1907 -2993 1856 3203 -957 -2228 1352 2002 -1506 -1975 1478
1307A478Q21k834j045J998N57j814k18K135O99k315j302J766J377j708r84K327
$$ 1478 2299 -535 -1580 418 975 -839 -1057 1078 1777 -538 -1840 -74 1303 -405 -1389 938
1323I38J291l201k582L363L441l085l410L411L335m473m041N108M891m922m792
$$ 938 2229 -972 -3554 -191 3250 165 -3245 166 3501 -972 -5013 95 4986 64 -4728
1338d728M755L968n631l610O891L790p268l642P135K588p718j490Q919J313r457
$$ -4728 27 3995 -1636 -5246 1645 5435 -1833 -5475 1660 4248 -3470 -4960 3959 5272 -4185
1353d185j571R134J001q776L16R043q06r409P68Q524r35p616K268P236l013p379
$$ -4185 -5756 3378 4379 -4397 -4081 4962 4156 -5253 -4485 4039 3104 -4512 -2244 4992 1979 -5400
1369e400K802O767k236n470K812M523l597m631L387M584k249l380J865K238k630
$$ -5400 -2598 4169 1933 -3537 -725 3798 201 -4430 -1043 3541 1292 -2088 -223 2015 -615
1384f15k313K780L322j439l248n2K394L0k062M96L250Q0m198j670L896K020l203
$$ -615 -2928 -148 3174 1735 -1513 -1565 829 859 -1203 -707 2543 2623 -1575 -3245 651 2671 -532
1401e32r39M100J86n970o93O791J487o482p32O597o40p911Q51Q967k19q538O11
$$ -532 -1471 2629 2815 -3155 -3848 2943 4430 -2052 -2784 3813 3173 -4738 -3887 5080 4861 -3677 -3066
1418c066P498k315p630L692Q444l894q210L993P085n128o545O349O801o431o531
$$ -3066 4432 2117 -5513 -1821 6623 2729 -5481 -1488 5597 469 -6076 273 7074 643 -5888
1433e888N595N027n825l419O797K979p058k838O131J646n544j41O138k88o526
$$ -5888 -293 4734 -1091 -4510 2287 5266 -1792 -4630 1501 3147 -2397 -2538 3600 3312 -3214
1448c214j75N055J70l535J136L067k035l709J618L160o36j628R19Q79j734j574
$$ -3214 -3389 1666 1836 -1699 -563 2504 469 -3240 -1622 1538 902 -726 193 1072 -662 -2236
1464b236J095K134P53j205j925j98J471L46j253P42K189j091l419M70L367m36
$$ -2236 -1141 993 1746 541 -1384 -1582 -111 235 -1018 -276 1913 822 -2597 -2127 1240 804
1480H04k484J868K770l406l960L479M515l103l752L506L042m628l045N003L090
$$ 804 -1680 188 2958 -448 -4408 -929 3586 483 -3269 237 3279 -1349 -4394 609 3699
1495C699m469j872M355M75n324J79O005n8n660P64M770j873m869K672N034k592
$$ 3699 -770 -2642 1713 2188 -3136 -2957 3048 2990 -2670 -1906 2864 991 -3878 -1206 3828 1236
1511A236m131K759K784l964k015N027K415m871k119M019Q40m039K69M718l20m506
$$ 1236 -2895 -136 2648 -1316 -3331 1696 4111 -760 -2879 1140 1980 -2059 -1790 2928 2608 -1898
1527a898J59L316j177k389K657K900l089l192K175K518j864j136K466P00k886
$$ -1898 -1739 1577 400 -1989 668 3568 479 -2713 -538 1980 116 -1020 1446 2146 -740
1542g40j095K119Q54j203M22J144j272j714P77J658Ro75J04j3o31l8J60J77P61
$$ -740 -1835 284 1138 -65 357 1501 229 -1485 -708 950 959 284 388 375 -256 -294 -134 43 804
1561H04M12j220j250J053J155j212n85J944O05k734j028K817Q16k765n9L341m89
$$ 804 1216 -4 -1254 -201 954 -258 -843 1101 1706 -1028 -2056 761 1577 -1188 -1247 2094 1605
1578A605m032M06L847m65l489J406L391k375l920K625M017k509l288L042K566
$$ 1605 -2427 -2021 1826 1361 -2128 -722 2669 294 -3626 -1001 3016 507 -2781 261 2827
1593B827m007k712M410K875l892k465L629J416m184p94M715R30m378q01L639L
$$ 2827 -1180 -3892 518 3393 -499 -2964 665 2081 -2103 -2897 1818 2748 -1630 -2431 1208 1211
1609A211l571Q47M021q73m019M23L401n05k796J027K747j147k827O97K469k72
$$ 1211 -2360 -1513 2508 1635 -2384 -1961 1440 935 -1861 -834 1913 766 -2061 -1364 1105 833
1625H33j734M72J379n89j621L98J667O0j270l19J134K42j293m10J640O76j531
$$ 833 -901 -429 950 361 -1260 -862 805 865 -405 -724 410 652 -641 -1051 589 1265 -266
1642b66q57J495P58j727o13K140Q43k404q97K401P68k554m93K932M62l163o06
$$ -266 -1123 372 1130 -597 -1210 930 1773 -631 -1528 873 1641 -913 -1406 1526 1988 -1175 -1781
1659a781L062M88k845Q8K872l88l159M28L082n15k786Q59K797j348k813J380K785
$$ -1781 1281 1769 -1076 -988 1884 1496 -1663 -1235 1847 1332 -1454 -595 2202 854 -1959 -579 2206
1676B206j118k622J188K116j391j987J574K065j538j918J265J594j269j380J405
$$ 2206 1088 -1534 -346 1770 379 -1608 -34 2031 493 -1425 -160 1434 165 -1215 190
1691A90J296j284j389J034J189q52j029R65P00p88q76P48Q43n98r06N76Q36n80
$$ 190 1486 202 -1187 -153 1036 184 -845 120 820 32 -844 -96 747 149 -757 -181 655 75
1709G5r10M69R72m36r56L66R60m07j008N13Q96l79q97L49Q81n28q64N51R54n13
$$ 75 -835 -366 606 170 -786 -420 540 133 -875 -362 534 155 -742 -393 488 -40 -904 -353 601 88
1729H8r22M37Q81n60p58N84P68o38o49N12N94m98m79O09L56o15l76O06M04n67
$$ 88 -834 -397 484 -76 -834 -250 518 -120 -769 -257 337 -161 -640 -31 325 -290 -666 -60 344 -223
1749b23l65N87L57o02l68N77N26o07l99M44L87l20l68L15L85m20k64L69L63m20
$$ -223 -588 -1 356 -246 -614 -37 489 -118 -517 -73 314 -6 -374 -59 326 -94 -358 11 374 -46
1769d6k24L73M12m14m02M20L87m45l61M23L71m56k14M09J92m32q0L56J28m45n9
$$ -46 -270 103 515 101 -301 119 506 61 -300 123 494 38 -176 233 425 -7 -87 269 397 -48 -107
1790a07M87L7l50k2K72r3m5O7J5k14J15J47j2k68J4L46o3k41jO0O1j00J96j45
$$ -107 380 417 67 45 317 224 179 246 261 47 162 309 297 29 43 389 326 85 84 144 205 105 301 156
1814A56k17Q1L16o2l74J3L49j80j18K5J19j35l5K48j96k93J83M80j87m82J0M56
$$ 156 -61 20 336 274 -100 -87 262 82 -36 -11 108 -27 -62 186 -10 -303 -120 360 173 -309 -299 157
1836A57n4k29K3J38k27j20M36j4m40RM57On82j8O36r6l60p2M15k78j77L97K64
$$ 157 103 -126 -103 35 -192 -312 124 110 -330 -321 136 142 -440 -458 178 82 -278 -350 65 -213 -390 7 271
1859B71o15l25N98L58m77l51M99J20k85j52L61p0k33K17K39n21k79O07N29n75
$$ 271 -344 -669 -71 287 -190 -541 -42 78 -207 -359 2 -68 -301 -84 155 -366 -645 -38 491 -84
1879h4n51L49N11j96l55J08L36k35o9J87N3k82K22K96j66l89R4M14Qk33j57J84
$$ -84 -635 -286 225 29 -326 -218 118 -117 -186 1 54 -228 -6 290 124 -265 -171 243 251 18 -139 45
1901D5R3n6J9mp3M3M6Q3n2q3p7J48K20j57l33J05N74q2n12j55N51J23k88j49O9
$$ 45 138 82 101 97 24 67 113 196 144 61 -16 132 352 195 -138 -33 541 459 -53 -208 343 466 178 29 98
1926I8LNK40M3l62k10N39K81p07l46Q05M32p84o07P27M70n25l78O65M3p39L0Q07
$$ 98 101 106 346 389 27 -183 356 637 -70 -416 389 821 37 -570 157 627 102 -276 389 432 -307 -277 530
1949E30o5q85N1R35j46r84K76R18k34j032K92R79m51q39N18R13p18j091O83J341
$$ 530 465 -420 -369 566 420 -564 -288 630 396 -636 -344 635 184 -655 -137 776 58 -1033 -350 991
1969I91o40j374L44J396m31j144M49J037m59j000M82R40o67p21Q12P61j162j007
$$ 991 351 -1023 -679 717 286 -858 -409 628 169 -831 -349 591 -76 -797 15 776 -386 -1393
1987a393J293J135r86j381J010J189r63j208J099J187j005j146R53R87j121q46
$$ -1393 -100 1035 49 -1332 -322 867 -96 -1304 -205 982 -23 -1169 -216 771 -350 -1196
2003a196J307R46j324j048J288J082j347r59J389R85j384r91J415Q82j465p94
$$ -1196 111 1057 -267 -1315 -27 1055 -292 -1251 138 1123 -261 -1252 163 1045 -420 -1214
2019a214J666Q92j884r83J848J110j852r97J899J154k067j269J895J354j649j060
$$ -1214 452 1344 -540 -1523 325 1435 -417 -1414 485 1639 -428 -1697 198 1552 -97 -1157
2035a157J753Q32k077r20K356J082k268j009K217R14k689p87K984R83k671j254
$$ -1157 596 1428 -649 -1569 787 1869 -399 -1408 809 1723 -966 -1753 1231 2214 -457 -1711
2051a711K549R02k576n25K776N82l003o96K815N87k789k36L029P6l250k51L124
$$ -1711 838 1740 -836 -1361 1415 1997 -1006 -1702 1113 1700 -1089 -1325 1704 1780 -1470 -1721 1403
2068A403K90k867N2K815k87l050K46L032j12k813K61K752o39k953M87L099j75
$$ 1403 1693 -1174 -1122 1693 1406 -1644 -1398 1634 1522 -1291 -1030 1722 1083 -1870 -1383 1716 1541
2085A541k869J55K555m34k568N45K673k94k703K02K377m72k451P80K833o51k988
$$ 1541 -1328 -1173 1382 948 -1620 -1075 1598 1304 -1399 -1197 1180 708 -1743 -963 1870 1219 -1769
2102a769K39K824l09k626O84K834p48l197L24L080q8k801N61K751r88l263R05
$$ -1769 -1530 1294 985 -1641 -957 1877 1129 -2068 -1744 1336 1248 -1553 -992 1759 771 -2492 -1587
2119a587L404n24l132Q08K821j295l165J523L463j191l268J043K798j444k707
$$ -1587 1817 1293 -1839 -1031 1790 495 -2670 -1147 2316 1125 -2143 -1100 1698 254 -2453
2134b453J957L003j793l056J449K601j616k236K075K516k143k699J709K399j541
$$ -2453 -496 2507 714 -2342 -893 1708 92 -2144 -69 2447 304 -2395 -686 1713 172
2149A72j794J923J704k162k009J784K109j509j538J709J309k068j629J926J878
$$ 172 -1622 301 2005 -157 -2166 -382 1727 218 -1320 389 1698 -370 -1999 -73 1805
2164A805j313j528J246J018j597j190J668J830j312j703Q69J264j235j163J779
$$ 1805 492 -1036 210 1228 -369 -1559 109 1939 627 -1076 -207 1057 -178 -1341 438
2179D38J627j554j991J176J514j114j181J635J458j887j828J380J758j254j149
$$ 438 2065 511 -1480 -304 1210 96 -1085 550 2008 121 -1707 -327 1431 177 -972
2194i72J711R23k031j510J899J573j362j111J514P20k221q05K107J216j620r25
$$ -972 739 1662 -369 -1879 20 1593 231 -880 634 1354 -867 -1672 435 1651 31 -894
2210h94J413L54j864k20K055O35j663p25J225J09j359J84J716J11j544m59R18
$$ -894 519 873 -991 -1211 844 1479 -184 -909 316 425 -934 -750 966 1077 -467 -926 -8
2227hJ19p95M22J106j86j301k64P40L07l19J31N44l40q30k15O91M75k05o0N4k01
$$ -8 111 -684 -262 844 658 -643 -907 -167 140 -179 -48 496 156 -674 -889 -198 277 72 12 66 -135
2248a35n53K5N65N20k52l33o2n6l19J08O33L40m71l71R8Q1k21J64O78j3n64m20
$$ -135 -688 -663 -98 422 170 -163 -225 -281 -600 -492 141 481 10 -361 -263 -182 -403 -239 439 426 -138 -558
2270e58L36J20j45L35L96k05o99%L05j9J64M33k7n39m11L20L39p2J39L17k74o27
$$ -558 -222 -102 -247 88 484 279 -420 -420 -115 -134 30 463 436 -103 -514 -194 145 73 212 529 255 -372
2292c72N1M52L4j00L76J28o02n03N11M52k09j62M26j6p79j98Q25L18n89N0M66
$$ -372 -321 131 165 65 441 569 -33 -536 -25 427 218 56 482 466 -313 -511 314 632 43 93 559
2313E59k23p80P7R21J59p29o8N12k62n50K10Q14p5p37L4M80k57n33L99P13k28
$$ 559 336 -444 -367 554 713 -16 -84 428 166 -384 -174 640 565 -172 -138 342 85 -448 -49 664 436
2334D36q65K01N72k27n99M69O24k89p74Q7O18m2n34K75O52n14p06K65P59j65o39
$$ 436 -429 -228 344 117 -482 -13 611 322 -452 -365 253 211 -323 -48 604 90 -616 -351 408 243 -396
2355c96K85N62m19p52K93Q60k24o65K55M94l56o15M09P30l23p71L57N21k74n82
$$ -396 -111 451 32 -720 -427 433 209 -456 -201 293 -63 -678 -269 461 138 -633 -276 245 -29 -611
2375f11L01P21k42q73L39N73k69n64L95O58m71n74L31O36l46o37M75N63l14o93
$$ -611 -310 411 169 -704 -365 208 -61 -625 -230 428 -43 -617 -286 350 4 -633 -158 405 91 -602
2395f02K59P27l00n94L14O23l81o15M07M74l32l91L97M80n59m74N62N86m71n42
$$ -602 -343 384 84 -510 -196 427 46 -569 -162 312 -20 -411 -14 466 -93 -567 -5 581 110 -432
2415d32M41M67m61m77N86M00n14l58M76K97n01k02M97K90n68k70N19K92m82j53
$$ -432 9 476 15 -462 124 524 10 -348 128 425 -76 -278 219 509 -59 -329 190 482 0 -153
2435a53L96J7k72j12M20J1l18n5K96R7m26M7K71J01k57j21J43K22j03k26kK43
$$ -153 243 260 -12 -124 296 307 -11 -66 230 327 -99 -52 219 320 63 -58 85 307 204 -22 -24 219
2457B19p3j65P4J90j40k31J18L11k94k33K85K29j83l90J62N00k56m57K40L86l18
$$ 219 146 -19 55 245 105 -126 -8 303 9 -224 61 290 107 -283 -121 379 123 -334 -94 292 -26
2478b6k26K73L56m64l13M36L29m31k70L67J39l93j33M90l2l68j7M48j52l94K59
$$ -26 -252 21 377 -87 -400 36 365 -66 -336 31 170 -223 -356 134 102 -266 -283 165 13 -381 -122
2499a22K63k52l16K37L25k10j55N6J86j43q7J22N8j56R3J11k06j06K17J71k03
$$ -122 141 -111 -427 -190 135 -75 -230 -174 12 -131 -218 -96 -38 -194 -101 10 -196 -302 -85 86 -117
2520a17m1J03j6j38J55J37j66j16J58O3j83j6K61P5k90L7K19qk70J79K31k04k58
$$ -117 -158 -55 -71 -209 -54 83 -83 -199 -41 22 -161 -177 84 159 -131 -94 125 117 -153 26 257 53 -205
2543b05K08K85j92k97L23J30j35k68L05J53l17m9L77k9m52J66M16k46l55K27L55
$$ -205 3 288 96 -201 122 252 117 -151 154 307 -10 -59 318 289 -163 3 419 173 -182 45 400
2564D00k39k80K25J96k73j06L72J24m58r8L82L6l18PL66j03l10O2J74l5j15J08
$$ 400 161 -119 106 302 29 -77 295 419 -39 -137 245 281 -37 -30 336 233 -77 -15 159 124 9 117
2586A17J42k02j86J72J80j65j2N3j7n0J6kn0R7K0r7j26l8K63j52q5J60L1j33j98
$$ 117 259 57 -129 43 223 58 46 99 82 32 48 46 -4 93 113 16 -110 -148 115 -37 -122 38 69 -64 -262
2611b62K73J12l15PL99j07l87J9L79m4l85J98K70k17m18K30L56j36j84K77K4k87
$$ -262 11 123 -192 -185 214 107 -280 -261 118 74 -311 -113 157 -60 -478 -248 108 -28 -212 65 89 -198
2633a98l02M23L02l39j54L21o3l69J00L24P4k45P7M3k23k04L58L21j39l26J94
$$ -198 -500 -77 225 -114 -268 53 -10 -379 -279 45 119 -126 -49 -6 -229 -433 -75 246 107 -219 -25
2654b5k5k24P2K59J59j28j93J1N4j69K43J72o3k30J2J10j94K3K91J03j64r0K8
$$ -25 -50 -274 -202 57 216 88 -105 -94 -40 -209 34 206 143 -87 -75 35 -159 -136 155 258 94 4 32
2677C2p0p0J42K73m8j94j71K4J02J07J35J00j67k46q9P1J95J53N6j05q7k93j9
$$ 32 -38 -108 34 307 259 65 -106 -82 20 127 262 362 195 -51 -140 -69 126 279 335 230 143 -150 -169
2700a69K64K63k5j67k0p6l01k4L95L90k73l01nJ14k61K0M55L29l37n30J36J94
$$ -169 95 358 333 166 146 70 -231 -255 140 530 257 -44 -49 65 -196 -176 279 608 271 -259 -123 71
2722G1k51J72M82J46p22m46M24L24l35J44N28j23q18l49O48M53k73p5M93l18q34
$$ 71 -180 -8 474 620 -102 -548 -124 200 -135 9 537 414 -404 -753 -105 348 75 0 493 175 -659
2743f59n3Q30L66m62r2L44l11p95J38J066L02o48m07M08j71o03L85J010L5r50
$$ -659 -712 118 484 22 -70 274 -37 -832 -694 372 674 26 -381 27 -144 -747 -362 648 683 -267
2763b67l53N12j2n06M03J066j40j326k72Q10J74m53L48Q20m07j271j31J112J76
$$ -267 -620 -108 -120 -626 -223 843 703 -623 -895 -85 89 -364 -16 804 397 -874 -1005 107 283
2782B83n66L87P51p70j253K66J397J73p92Q0O61o68j098M76J462J61j100j31N55
$$ 283 -283 104 855 85 -1168 -902 495 668 -124 -44 617 -51 -1149 -673 789 950 -150 -281 274
2801B74m81p83P53J456k13j408j54O16j52n63P62J239n97j444j66J076Ko63P46
$$ 274 -207 -990 -237 1219 1006 -402 -556 60 -92 -655 107 1346 749 -695 -861 215 217 -446 300
2820C00J009p63j778K67J497J16q74M59R28r75j564N80J744o3j021K66O40r33
$$ 300 1309 546 -1232 -965 532 648 -226 233 1161 186 -1378 -798 946 883 -138 128 768 -165
2838a65j156R70J659m27j277L44O27r61q91J264J587p22j535K60P41o98n27J245
$$ -165 -1321 -351 1308 881 -396 -52 575 -386 -1277 -13 1574 852 -683 -423 318 -380 -907 338
2856C38J197j014j544L79Q69l48l89J128P22j259j404N68J181j70n25P20M19j204
$$ 338 1535 521 -1023 -644 225 -123 -512 616 1338 79 -1325 -757 424 254 -271 449 868 -336
2874c36j132Q61J325j62r11N14M23j139j029J175J586m95j265J63P23p42p97J201
$$ -336 -1468 -607 718 556 -355 159 582 -557 -1586 -411 1175 680 -585 -422 301 -441 -1238 -37
2892c7J435q08j452L04Q00o70n73J216J217j121j630O56J192p09n04J175P78j434
$$ -37 1398 590 -862 -558 242 -428 -1001 215 1432 311 -1319 -663 529 -180 -684 491 1269 -165
2910a65j245Q47J128m75n70J131K85j433r64J195J148n82n68O62J70j192n70J218
$$ -165 -1410 -563 565 90 -480 651 936 -497 -1461 -266 882 300 -268 394 564 -628 -1198 20
2928B0J003n36o99K59J38p56k58J155Q35p05r08K13M17m40j55Q80O68q54j028
$$ 20 1023 487 -212 47 185 -571 -829 326 1161 456 -452 -239 178 -262 -417 463 1131 277 -751
2947g51K85P35j96l24P32N66r96r85O00R85l34n06N95M44j000r03Q24J125m37
$$ -751 -466 269 73 -251 481 1047 51 -934 -334 651 317 -189 406 850 -150 -1053 -229 896 459
2966D59p56O08K86j000n35J090Q69p44o44N40L10r62k86J181O07q64o79M90K61
$$ 459 -297 311 597 -403 -938 152 1021 277 -367 173 483 -479 -765 416 1023 159 -520 -30 231
2985B31n63j34R19L88q37n88L92L53l08o9O77J02p90m45M23M97j59k01K66Q5n46
$$ 231 -332 -466 453 841 4 -584 -192 161 -147 -216 461 563 -227 -672 -249 248 89 -112 154 239 -307
3006c07m74N20O15j64l96J58K19m29l87N32O42k80o63J86L39l58k93M97N87m25
$$ -307 -781 -261 354 190 -206 -48 171 -258 -645 -113 529 249 -414 -228 111 -247 -540 -43 544 119
3026A19o84L22M51l66m18O33N23o54n63M32M39l73k93O06K98n97m60M52L21j77
$$ 119 -565 -243 208 -158 -576 57 580 -74 -637 -205 234 -139 -432 174 472 -125 -585 -133 188 11
3046A1k07M68M4n37k12M28K99l38k1K27J4l28k07L27M04j82k49mJ19j36q6K38
$$ 11 -196 272 316 -221 -433 -5 294 -44 -65 162 176 -152 -359 -32 372 190 -59 -63 56 -80 -166 72
3068G2K73r3l18o8K61L6k87K35K51j46m07O6L63k3l18J46K95k13m55K58M45j87
$$ 72 345 252 -66 -134 127 163 -124 111 362 216 -191 -125 238 215 -103 43 338 125 -330 -72 373 186
3090A86k84K12K39k65l38K01L74j52k37J65J79k57k08K03K46k65l9J18P5j92n7
$$ 186 -98 114 353 88 -250 -49 325 173 -64 101 280 23 -185 18 264 -1 -40 78 153 -39 -96
3111i6J56J36j34j72O7J46j12n9J14J24j03k16L0J75o4j2j7P2K8k05k9K83k6k14
$$ -96 60 196 62 -110 -43 103 -9 -68 46 170 67 -149 -119 56 -8 -20 -37 35 63 -142 -171 112 86 -128
3135a28n0J13R7k26NK32J2k15J0J09Mk17J82K07j80j61L2K60k17j60K09J64r4
$$ -128 -178 -65 32 -194 -189 43 55 -160 -150 -41 -37 -254 -72 135 -45 -206 -174 86 -131 -291 -82 82 -12
3158a2j86J22J19j07j36K06k1l5q1J62o4k2n0P8J1Olo2L6RN7n9j1O2n5jO7L3o0
$$ -12 -198 -76 43 -64 -200 6 -15 -50 -131 31 -33 -55 -105 -27 -16 -10 -13 -75 -39 -30 27 -32 -43 19 -36 -37 30 63 3
3187Cm5N2J58j84m6J13J56j57j49J59L6m8j02R6O1r2n7J66L1j15k8J63j5j44P4
$$ 3 -42 10 168 -16 -62 51 207 50 -99 60 96 48 -54 42 103 11 -46 120 151 36 8 171 156 12 86
3212H6L7K8j20J9R4j3j90R7J00p5l1jR2r0N6l1J9J9M6j10j5O8j3m8l3J18k7p1
$$ 86 123 151 31 50 144 131 -59 38 138 63 32 31 123 33 89 58 77 96 142 32 17 85 72 24 -9 109 82 11
3240A1mJ39Pj65l1J63n4j60J12P3o9k33K15J33j72j42J77J77k52j70K32J34p5
$$ 11 7 146 153 -12 -43 120 66 -94 18 91 22 -211 4 137 -35 -177 0 177 -75 -245 -13 121 46
3263D6j92J51L9j40q4K19J5k28K6K71j15k24Q0K71o8k27k4J90j1j54K4J61Rj28
$$ 46 -146 5 44 -96 -180 39 54 -174 -148 123 8 -216 -136 135 67 -160 -184 6 -5 -159 -135 26 35 -93
3287i3p0J40l0q5l1K63m2j49j19J54J17j42k0J26K6j99n1J89O9q0n9J85P0l10
$$ -93 -163 -23 -53 -138 -169 94 52 -97 -216 -62 55 -87 -107 19 45 -154 -205 -16 53 -27 -86 99 169 -141
3311a41j56M28R9k38j25K76K6l66k9M85J09m14j95L43K8l92K25M53p2n64L1M04
$$ -141 -297 131 230 -8 -133 143 169 -197 -226 259 368 -46 -241 102 130 -262 -37 416 344 -220 -189 215
3333B15j10l44K69M16k59n00J42M63q6l01K19L80l30n09K26M51j41l17K51K76
$$ 215 105 -239 30 446 187 -313 -171 292 206 -95 124 504 174 -335 -109 342 201 -116 135 411
3353D11m13l77L33M47j28l10R6K14l37l22L36M94j62m49P0K54k63k59M00N03j67
$$ 411 -2 -379 -46 401 273 -37 59 273 -64 -386 -50 444 282 -167 -97 157 -106 -365 35 538 371
3374C71o79Q1L81j86l13M25N00m21p10J76N97j86l57M82M20o45o65L58P46k79
$$ 371 -308 -227 154 -32 -345 80 580 159 -551 -375 222 36 -321 161 581 -64 -729 -371 375 96
3394I6l67L60L30p13m87O19O90l32n38M57J20o22l61P78O25n37n22M35P7n44j93
$$ 96 -271 89 419 -294 -781 -162 528 196 -342 115 235 -387 -748 30 655 118 -404 31 108 -436 -629
3415f29Q90M48p14n52M72K02n52J0Q86K33q32m97N03K26l61J07O56J23r33m07
$$ -629 261 709 -5 -557 -85 117 -435 -425 461 694 -138 -635 -132 94 -267 -160 496 619 -314 -721
3435g21N70M17k81k4N52j33r12j69P05M70l93r0L28j94q25O1J015K95n35k32K23
$$ -721 -151 266 -15 -39 513 380 -532 -701 4 474 81 -9 319 125 -700 -639 376 671 136 -96 127
3456A27j86o03L54R07J54p61k90L06o1l27L98P63q7q91k34M88r2k65N21N84m58
$$ 127 -59 -662 -308 599 753 -8 -298 8 -53 -380 18 781 694 -197 -431 57 -35 -300 221 805 347
3477C47q28q6O43J6p0L42L48o61p91L53O69nk59L42J80p12n63M68P38p6l66K12
$$ 347 -481 -567 76 92 22 364 712 51 -740 -387 282 277 18 360 540 -172 -735 -267 471 395 29 241
3499B41o0p37j63P80O24l51m51J30q0n85J25R61L13o18m91J57k9k68L83P08O8
$$ 241 181 -556 -719 61 685 334 -117 13 -67 -652 -527 434 747 129 -362 -205 -234 -502 -119 589 657
3520F57r16l61M14N4k21L99O97l11r79j37N62J33j11L65L18n65p81K39O71Qj73
$$ 657 -259 -620 -206 -152 -373 26 723 412 -567 -704 -142 -9 -120 245 563 -2 -783 -544 127 135 -38
3541c8L29J16p67n64M95Q93j54m46K63O7o09m20P17P41k89n51K31N0n79j57R12
$$ -38 291 407 -360 -924 -429 464 310 -136 127 194 -415 -835 -118 623 334 -217 14 64 -515 -672 240
3562B40N99n72p38L00K88n98nJ009L47q16p92N85L75n52M8R90K03j239o09Q44
$$ 240 839 267 -471 -171 117 -481 -486 523 870 54 -738 -153 222 -330 -282 708 911 -328 -937 -93
3582i3O01o80L5Q31k2j309l09J191M05o76j32Q49k45j262oJ435K68j044o4Q63
$$ -93 508 -172 -137 694 672 -637 -946 245 650 -26 -158 691 446 -816 -822 613 881 -163 -227 636
3602F36l65j132K82J432J6j206m0Q17l01r60M77J393k67j326J2R49l12q46O96
$$ 636 271 -861 -579 853 869 -337 -377 440 139 -821 -344 1049 782 -544 -532 417 105 -741 -45
3621d5J074n55j263J93J053k62p37N00R46o12j263M26J198l10r11O31Q33p18j297
$$ -45 1029 474 -789 -596 457 195 -542 -42 904 292 -971 -545 653 343 -568 63 896 178 -1119
3640a119N70J405m07j041M13Q83o96j108P65J331o07j096M40Q48p52q69R72J187
$$ -1119 -549 856 449 -592 -179 704 8 -1100 -335 996 389 -707 -267 581 -171 -1040 -68 1119
3658A119r11j113O22R42q12p94J063R62r99j122Q24R34p82q05J037Q58j178r57
$$ 1119 208 -905 -283 659 -153 -947 116 1078 79 -1043 -219 715 -67 -872 165 1023 -155 -1112
3676a112J041Q41q22p37J028O43j181p94J124P83q72n90R32M00j045o01J098P08
$$ -1112 -71 770 -52 -789 239 882 -299 -1093 31 814 -58 -648 284 684 -361 -962 136 844
3694H44q88o07Q97L45r22m12J011O19r99n84R02M02r23l47J041M21r74m47P59
$$ 844 -44 -651 246 591 -331 -743 268 887 -112 -696 206 608 -315 -662 379 800 -174 -621 138
3713A38M81r02k47R68L38j041m24R07M79q48l43R76K08r82l62R55L86q51k29Q27
$$ 138 619 -283 -530 438 776 -265 -689 218 697 -151 -494 482 690 -292 -654 301 687 -164 -393 434
3733D34J53r53k53J040K07q91p8P26J04q82q5R72P0q57l5O86L5p73L7P52Rp62
$$ 434 587 -366 -619 421 628 -263 -341 385 489 -393 -478 494 564 -293 -328 358 393 -380 -343 409 418 -344
3755c44l1P60j25o04P4O14L3p50P4O02p0n60J36N26j16n79J18N41q0o17J96M70
$$ -344 -375 385 260 -344 -270 344 377 -373 -299 303 233 -327 -191 335 219 -360 -242 299 219 -398 -202 268
3777B68j07n04J2O18p5n00Q0L99j8n17R5M86p3l80K1M42j35m29J23L80j1m44J29
$$ 268 161 -343 -331 287 212 -288 -208 191 173 -344 -249 237 164 -216 -195 247 112 -317 -194 186 175 -269 -140
3800a40L32j81l48J97L48j98l58J63L06o6k99J16K88r1l15P5L10j22j95Q0K63
$$ -140 192 11 -337 -140 208 10 -348 -185 121 55 -244 -128 160 69 -246 -171 139 17 -178 -98 165
3821A65j58j65J29R0n6j77J77J21k04j24K01J01p3j88J17J85J4j68n2J42l4o4
$$ 165 7 -158 -29 61 5 -172 5 126 -78 -202 -1 100 27 -161 -44 141 155 -13 -65 77 43 -21
3843b1Q8M8r2o3M7O9L0p6J0J02p5o1MJ11l9o3qO0r8M1J43n3j26rM5J14o2n2NP5
$$ -21 67 115 23 -40 7 76 106 30 40 142 67 6 10 121 82 19 11 71 -27 14 157 104 -22 -31 14 128 66 14 19 94
3873I4j01J2LQ7m1l6J0n6M7j2J15j39k1l1L3OK2N7o5k3K2kL0kll1n0J2K8P0p4
$$ 94 -7 5 8 95 54 18 28 -28 19 7 122 -17 -38 -69 -36 -30 -8 49 -16 -39 -17 -19 11 9 6 -25 -75 -63 -35 35 -39
3904c9Q%l8RN0M9n0o4K1N5K1k6k0%r1J22j51M2M3N3l7n6j1J56r9k3O0m8m8K2J57
$$ -39 -31 -31 -69 -60 -10 39 -11 -75 -54 1 22 -4 -24 -24 -115 7 -144 -102 -59 -6 -43 -99 -110 46 -53 -76 -16 -64 -112 -90 67
3935F7n5q5j4J22j3k31Q1K69j37k38J45J66r8j07J06J58j43k23J88J78j16j95
$$ 67 12 -73 -87 35 22 -209 -128 141 4 -234 -89 77 -21 -128 -22 136 -7 -230 -42 136 20 -175
3957a75K60L8j40q0K13O5j22j95K15L4j53j4K17J6k21p5K44P8j67m9R6P3j72r1
$$ -175 85 123 -17 -97 116 181 59 -136 79 113 -40 -54 163 179 -42 -117 127 205 38 -11 85 158 -14 -105
3981a05J14J30j45l4P2R3j73mJ63Q7j26j54J36J13j44j20J70J94j96k38K48J24
$$ -105 9 139 -6 -40 32 125 -48 -52 111 198 72 -82 54 167 23 -97 73 267 71 -167 81 205
4003B05k18k17L85J29k69l00M60O5l89n5M00J34m92j29M28R6m26n6N32L6o13l8
$$ 205 -13 -230 155 284 15 -285 175 240 -149 -204 196 330 -162 -291 137 233 -193 -249 283 319 -294 -332
4025c32N63mm15j3N48j29o22P6N73j7n47J28N29k31m58O7N54j10m52J59L64j64
$$ -332 231 227 -188 -201 347 218 -404 -328 245 228 -319 -191 338 107 -351 -284 270 160 -292 -133 231 67
4047F7m92K77N14j23o10J79M51j69n13J96O46k65n61J21N72k48n33L12N98k22
$$ 67 -425 -148 366 243 -367 -188 263 94 -419 -223 423 158 -403 -282 290 42 -491 -179 419 197
4067A97o72J41O57j52n92K94N95l27p31K61P19k31o09L66O21m99p21M55Q77m31
$$ 197 -475 -334 323 171 -421 -127 468 141 -590 -329 390 159 -450 -84 537 38 -683 -228 649 218
4087B18p49M81N91n72p08O87Q47o19p24N26N98p41n00Q17N96o69o96O83N45p20
$$ 218 -531 -50 541 -31 -739 -52 795 176 -548 -22 576 -165 -665 152 748 79 -617 66 611 -109
4107a09m62Q30M47p60o00P26M87p63l14Q99L51q76n08Q00M87p46l90P84L99r58
$$ -109 -571 259 706 -54 -654 72 559 -204 -518 381 732 -144 -652 148 635 -111 -501 283 682 -276
4127b76m35Q81N04o90m42P61K56r05l67J025L96q53l97Q10K91j004k28J052M48
$$ -276 -711 170 674 -16 -458 303 559 -346 -713 312 708 -145 -542 268 559 -445 -673 379 827
4146H27r87m41Q51L55r86j74R92K89j163k44R45K09r60k8J045J25j160j75J065
$$ 827 -160 -601 250 605 -381 -555 437 726 -437 -681 264 473 -487 -515 530 655 -505 -680 385
4165C85J56r62n6J072j60j056q3J143N4r77Q1R46j54j129J06J086M1r25O8Q95
$$ 385 541 -421 -477 595 435 -621 -704 439 493 -484 -403 543 389 -740 -634 452 493 -432 -364 531
4185E31k43r78K77J022j35j016K00P34k74p45L20R15k34q67P6Q44k85p02L69Q03
$$ 531 288 -690 -413 609 474 -542 -342 392 118 -627 -307 608 374 -493 -417 427 142 -560 -191 612
4205F12l30q91K98O98k27o65M19P38m26q68K76R03l06o27L78N96m46p54L62Q15
$$ 612 282 -609 -311 387 160 -505 -86 652 226 -642 -366 537 231 -396 -18 578 132 -622 -260 555
4225E55l13o24L03O09n44o01N71O26l41n77L34M19m76n14O44N32n15m92M52L22
$$ 555 242 -382 -79 530 -14 -615 -44 582 241 -336 -2 417 -59 -573 71 603 88 -404 48 370
4245C70n07l02O60L10n83m08N36K17l45k29N20J75m78l18M53K10l17j04M23L9
$$ 370 -137 -439 221 531 -52 -460 76 293 -52 -281 239 414 -64 -382 71 281 -36 -140 283 322
4265C22n84o7M61J44m31K7L92n7m65%M77O3l32o8L31j35l79J19L83l5l36J10K96
$$ 322 -262 -329 132 276 -155 -128 264 207 -258 -258 219 282 -50 -118 213 78 -301 -182 201 166 -170 -60 236
4288B36k87k59J86L79j03m04J73J55j64l11M38K82l20l03K77Q5k52r5M51J27m09
$$ 236 -51 -310 -124 255 152 -252 -79 76 -88 -399 39 321 1 -302 -25 60 -192 -287 164 291 -118
4309a18j55L16K5k24j2L91Nm53j26M13J02l83Q9M10o8n67L2M50P7l77O7L33j62
$$ -118 -273 43 68 -156 -168 223 228 -225 -351 62 164 -219 -130 280 212 -355 -323 127 204 -173 -106 227 65
4332F5m50J81M93q5m63J24M89k75m77K36N28k40m44K07M89l08m63L32N48l44n32
$$ 65 -385 -204 289 204 -259 -135 354 79 -398 -162 366 126 -318 -111 378 70 -393 -61 487 143 -389
4353c89L39M43l97m59M87N67m77n47L50M58l97l76M85M70n19n32N36M00m75m02
$$ -389 -50 393 -4 -463 24 591 114 -433 -83 375 -22 -398 87 557 38 -494 42 442 -33 -435
4373d35O41L75o38n16N96N59o38l38M65N10o91m41O89M34o66l01N24L60o30l27
$$ -435 206 581 -57 -573 23 582 -56 -394 71 581 -110 -551 138 572 -94 -395 129 489 -141 -468
4393d68O99L72p12k84O25K12o18k70O99K76o27l39N90K93o53k46O67L05o84l40
$$ -468 231 603 -109 -393 232 444 -174 -444 255 531 -96 -435 155 448 -205 -451 216 521 -163 -503
4413e03P21K22o46k53O97K82p33l36O54K99o28j49P01J27p82j80P20K10o82j37
$$ -503 218 440 -206 -459 238 520 -213 -549 105 404 -224 -373 328 455 -327 -507 213 423 -259 -396
4433c96P67J7p60j96Q29J48o89j51P49l9o27o1P52K2p45q0P16L1o31p2P88o7o53
$$ -396 371 388 -372 -568 261 409 -280 -431 318 279 -348 -409 343 365 -380 -460 256 287 -344 -416 372 305 -348
4456c48m3O14J26p27J62N67r0o22Q2O57j31n89R4O30p9o47Q1N51O8o44O6N67p8
$$ -348 -391 223 349 -378 -216 351 261 -361 -279 378 247 -342 -248 382 303 -344 -263 288 356 -288 -222 345 267
4479B67o18Q3N97q7m67k8N87j02n31Q2N33j2n34nN52p4n74J30N64j23n29J2N78
$$ 267 -351 -268 329 242 -225 -253 334 232 -299 -217 316 304 -230 -235 317 243 -331 -201 363 240 -289 -277 301
4502C01q2n33J68M82j14n28J43N17j25n28J54N36k25m72J39M94j76l37N9M04j74
$$ 301 219 -314 -146 336 222 -306 -163 354 229 -299 -145 391 166 -306 -167 327 151 -186 -127 277 103
4523A03l52J50M11j54m31J48M26j78l29J59K64r9l34J44K72p0l47J05L50j42l27
$$ 103 -249 -99 312 158 -273 -125 301 123 -206 -47 217 118 -216 -72 200 130 -217 -112 238 96 -231
4544b31J63K41j30k89J47J96kl33J53K63j29k58M3K54J1l31Q1L54k01k73K23J94
$$ -231 -68 173 43 -246 -99 97 95 -238 -85 178 49 -209 -166 88 99 -232 -151 203 2 -271 -48 146
4566A46j56k29M5L66j21k40J34K33k03j25J42J40r5k84K31J71j49j92K05M7q3
$$ 146 -10 -239 -194 172 51 -189 -55 178 -25 -150 -8 132 37 -247 -16 155 6 -186 19 66 -17
4587a7k02J57J97j11k08J52J60j12k21K39J57j81j35Q3K22j82p4N6J84j58q7P0
$$ -17 -219 -62 135 24 -184 -32 128 16 -205 34 191 10 -125 -42 180 -2 -76 -20 164 6 -81 -11
4609a1J61j26j00J30O5q5j89K03J88j82j38J37P3p6j44J10J12j49j18K37R0j67
$$ -11 150 24 -76 54 119 34 -155 48 236 54 -84 53 126 50 -94 16 128 -21 -139 98 188 21
4631B1j22J61J09k21%J14K1j52K8J28J5j58L5J32j0j47l6K13n3j13j0J28N0j40
$$ 21 -101 60 169 -52 -52 62 83 -69 -41 87 102 -56 -21 111 101 -46 -82 131 78 -35 -45 83 133 -7
4655gj9J47k6j49JJ55j15p8Q5Q8j38m9M1J03p4r1J43N2l1j18L8J64o8j77Q7J12
$$ -7 -26 121 95 -54 -53 102 -13 -91 -6 82 -56 -105 -64 39 -35 -126 17 69 38 -80 -42 122 54 -123 -36 76
4681G6j60m0J67O9k47o4J99J02j58j29J91J00j50p0J33O2k55J0K21J2j83j5K10
$$ 76 -84 -124 43 112 -135 -199 0 102 -56 -185 6 106 -44 -114 19 81 -174 -164 57 69 -114 -129 81
4704H1l5j64RJ89Ok32K4K72j3l70J15K69p1k82O3K99r2k12O8K83j61k36J68J99
$$ 81 46 -118 -109 80 86 -146 -122 150 137 -233 -118 151 80 -202 -139 160 68 -144 -76 207 46 -190 -22 177
4728A77j11k23J26J70j05k08Q9K59j05k30J80J37r9k58K62K00k45k17K38J08j46
$$ 177 66 -157 -31 139 34 -174 -85 174 69 -161 19 156 57 -201 61 261 16 -201 37 145 -1
4749aj82K79J70k89j86K41K03k74k11L38K80m28k41L32K13l17j56L55J79l79k14
$$ -1 -183 96 266 -23 -209 32 235 -39 -250 88 368 -60 -301 31 244 -73 -229 126 305 -74 -288
4770b88M21J90m55p0M19P0n14j19N94R8m74j50N18L5n40l8N26O4m71j01N59pn81
$$ -288 133 323 -132 -202 217 287 -227 -346 248 346 -128 -278 240 275 -265 -303 223 287 -184 -285 274 267 -314
4793c14P9N05L9o62O2O16j33n76K37M91r9o24J02O24j95n73K88O38k77p67L11
$$ -314 -235 270 309 -353 -291 325 192 -384 -147 344 245 -379 -277 347 152 -421 -133 505 228 -539 -228
4814b28O24k54n39K83N84l05p10L37O39k42o03L21N97m60o41M86O35m23n91M10
$$ -228 396 142 -397 -114 470 165 -545 -208 431 189 -414 -93 504 44 -597 -111 524 101 -490 -80
4834h0N49m67o29N41P28n57p08N56O63o64n91O11O95o82o28O82M82o34n56P54
$$ -80 469 2 -627 -86 642 85 -623 -67 596 -68 -659 -48 647 -35 -663 19 501 -133 -689 65
4854F5P15q39n99P26N78q08m96Q48N91r85n32R09N09q62m55R62L35r34n49J039
$$ 65 780 -59 -658 68 646 -162 -658 190 781 -204 -736 173 682 -180 -635 327 662 -272 -821 218
4874B18N27r04m65R73K54j036k57J022M47j019l68R97K88j142k53J153L47j144
$$ 218 745 -159 -624 349 603 -433 -690 332 779 -240 -608 389 677 -465 -718 435 782 -362
4892c62l61J101K57j099r7J127K21j204k68J201Q1j092n7J177O9j329l6J215J01
$$ -362 -723 378 635 -464 -561 566 787 -417 -685 516 597 -495 -552 625 694 -635 -671 544 645
4911F45j193j3J259Lj279p4J244l9j109J11J180j40j355J55J350j69j219J76J222
$$ 645 -548 -561 698 701 -578 -652 592 553 -556 -445 735 595 -760 -605 745 576 -643 -467 755
4930G55l45j233L06J304k30j238J99J185l72j166L87J316l52j339M31J012l36
$$ 755 410 -823 -517 787 557 -681 -482 703 331 -835 -448 868 516 -823 -392 620 284
4947B84j074N51J121n76j226M71J218m83j114O16J015n57j242O91J120n70j062
$$ 284 -790 -239 882 306 -920 -449 769 286 -828 -212 803 246 -996 -305 815 245 -817
4964h17N96J000o36j031O99J063o08j089O71R03p30r16P68J055q06r15O71Q69
$$ -817 -221 779 143 -888 -189 874 266 -823 -152 751 21 -895 -127 928 122 -793 -122 747
4982G47p44q20P77R53q76q33P59Q31q73p22R10P06q37p89Q05P53p96o72R25N80
$$ 747 3 -817 -40 913 37 -796 -37 794 -79 -801 109 815 -22 -811 -6 747 -49 -721 204 784
5002G84r34o51Q97O14q18m66P97N69j013n43R24N61p38m93P16L87q02m09R49M79
$$ 784 -150 -801 96 710 -108 -574 223 792 -221 -764 160 721 -17 -510 206 593 -209 -618 331 810
5022H10r91l92Q41L22q32l26R14L47r69k61P35L76q19k34Q49J53q11k69Q61J30
$$ 810 -181 -573 268 590 -242 -568 346 693 -276 -537 198 574 -245 -479 370 523 -288 -557 304 434
5042D34o84j70P89P8q19j21Q12J04o44r8O76J0p74p3P99J03o58l4N89j4p24J15
$$ 434 -250 -420 369 447 -372 -493 319 423 -221 -319 357 367 -407 -480 319 422 -236 -270 319 305 -419 -304
5064c04N80N4o21K7N93k13n03J39O68j55n62K3M90j01m84K68M74k18n81J52N54
$$ -304 276 330 -291 -264 329 116 -387 -248 420 265 -297 -274 216 115 -369 -101 373 155 -426 -274 280
5085B80j46l81J86L88j96n47K15M17o5m31J89L83l40k90K32L82j91l00J96K42
$$ 280 134 -247 -61 327 131 -416 -201 216 151 -280 -91 292 -48 -338 -106 276 85 -215 -19 223
5105B23k00l39L36K62k64k43K26J66k08j69L04J84k23k81K87J56k99j14L06J39
$$ 223 23 -316 20 282 18 -225 1 167 -41 -210 94 278 55 -226 61 217 -82 -196 110 249
5125B49l21j18K09J45k86L1J66R5k51j07K52O8k08m1K42pk90J02J99k4j71oJ96
$$ 249 -72 -190 19 164 -122 -91 75 170 -81 -188 64 132 -76 -117 125 118 -172 -70 129 105 -66 -72 124
5148A24r7j20jK67p0k11N3J94j04j39J23J26r2j59J20P5r6j10K10M0j50j00J49
$$ 124 27 -93 -94 173 103 -108 -55 139 35 -104 19 145 53 -106 14 89 -7 -117 93 133 -17 -117 32
5171C2J03j28j46J45J42r9j24J01N8q7j15J43J16k22j27J97J68k67J9J32R8j69
$$ 32 135 7 -139 6 148 49 -75 26 84 -3 -118 25 141 -81 -208 -11 157 -110 -91 41 139 -30
5193c0j00K11L9k30J7J96J9j93l6K51L3k45l9K14o1j57L3R1K8j30j1J95L5k02
$$ -30 -130 81 120 -110 -93 103 122 -71 -107 144 177 -68 -107 107 46 -111 -78 13 41 -89 -100 95 130 -72
5217g2k6J69j2j76n0K44l9k00R9J86m9k16O4J92q2j80O2J86m8k07N9K26p8j91
$$ -72 -98 71 59 -117 -167 77 38 -162 -63 123 74 -142 -78 114 32 -148 -86 100 52 -155 -96 130 52 -139
5241a39L4J94n3k22J13J65m0j90P2J82nk12J18J02j02j27R9J51j00j97J28J50
$$ -139 -105 89 36 -186 -73 92 52 -138 -66 116 111 -101 17 119 17 -110 -11 140 40 -157 -29 121
5263A21p1j60J43J37j76j21J36J79k06o6J11O3o0j81R7J96p6j64J38J22j23j89
$$ 121 50 -110 33 170 -6 -127 9 188 -18 -84 27 90 30 -151 -54 142 66 -98 40 162 39 -150
5285a50J26J60q4j92J87O6j54j03J11J64j96j00J49J45j00n4P5K6j13j12J73Q0
$$ -150 -24 136 52 -140 47 113 -41 -144 -33 131 -65 -165 -16 129 29 -25 50 76 -37 -149 24 104
5307A04j55r6J61J16j39q0J61J2j58r9J35J81r8j44Q9J29k28l2K26Oj27j06K11
$$ 104 -51 -147 14 130 -9 -89 72 84 -74 -173 -38 143 45 -99 -10 119 -109 -141 85 91 -36 -142 69
5330F9J01j91j34K21N9j82o6J94N2k01n4J45N6r7q2J84O6k20j7J52L4j74l3J65
$$ 69 170 -21 -155 66 125 -57 -123 71 123 -78 -132 13 69 -28 -110 74 140 -80 -97 55 89 -85 -118 47
5354D7N1k30NK51l8j59o4L05n6k74L0K25K5k11l8K38Mk08mJ98M9l03R1J68%k93
$$ 47 98 -132 -127 124 86 -73 -137 168 112 -162 -132 93 118 -93 -131 107 111 -97 -101 97 146 -157 -66 102 102 -191
5380a91O2K42k7k98J01L06j41j94j7L28j03j59P5K47j48k37J12K64j61k37J44
$$ -191 -129 113 86 -212 -111 195 54 -140 -157 171 68 -91 -16 231 83 -154 -42 222 61 -176 -32
5401c2K33k26k11J95K77j59k44J01K51j33k00K05J79j95k54K27J96j99k11J96
$$ -32 201 -25 -236 -41 236 77 -167 -66 185 52 -148 57 236 41 -213 14 210 11 -200 -4
5421dK41k42k58L02J74k32j27K07J10k10j46K09J58k45j01K29Q3j98k32L02K15
$$ -4 237 -5 -263 39 213 -19 -146 61 171 -39 -185 24 182 -63 -164 65 148 -50 -282 20 235
5442B35l32j47L08J41k53k13K93J90k39j68K69J43l96k7L06J12l02j83L10J24
$$ 235 -97 -244 64 205 -48 -261 32 222 -17 -185 84 227 -169 -196 110 222 -80 -263 47 171
5462A71l81j4L76Q1m14m9M02N2m08j7M57k7m24j8M34l8m03PM76o0m61P3L57o7
$$ 171 -210 -224 152 233 -181 -230 172 224 -184 -201 256 229 -195 -213 221 183 -220 -213 263 203 -258 -185 172 105
5486A05l23P2L95r5m26J79L42j85l51K27L23k05l64K13L83j82l89J74L85l06k34
$$ 105 -218 -146 249 154 -272 -93 249 64 -287 -60 263 58 -306 -93 290 108 -281 -107 278 -28 -262
5507b62J69M52k04m21K06L08k39k93L06L00k06m34K60L35k52k92L52K32l29l64
$$ -262 -93 359 155 -266 -60 248 9 -284 22 322 116 -318 -58 277 25 -267 85 317 -12 -376
5527c76M00K90k80k86L67J56l40k50M27K22l85j87L26K68n14k01N22K66m68j86
$$ -376 24 314 34 -252 115 271 -69 -319 108 330 -55 -242 84 352 -162 -363 159 425 -43 -229
5547b29L42J68m90j18N74P6m51j41M59O0m71j00O38j9m96q5M27N7m71J26M30L6
$$ -229 113 281 -209 -327 247 323 -128 -269 190 250 -221 -321 317 298 -198 -283 144 201 -270 -144 286 322
5569C22n92k3N20o7m33J45M60j24n09Q2M38k1m11Q9M56k11m54J38N03j31m66J48
$$ 322 -270 -293 227 160 -273 -128 332 208 -301 -219 219 198 -213 -124 332 121 -333 -195 308 177 -289 -141
5591a41N12k84n08K82N38k26m75J56M20k76m27L22N44k98n46L05M45m08l05L56
$$ -141 371 87 -421 -139 399 173 -302 -146 274 -2 -429 -107 437 139 -407 -102 343 -65 -370 -14
5611a4M67l89n92M40M28l06l94M34L96n00m18M08L78l51m49O08K67n79l00N14
$$ -14 453 64 -528 -88 340 34 -360 74 470 -30 -448 -40 338 -13 -462 146 413 -166 -466 48
5631D8M09m66l37M90K87o51k60N90L36n49k40N02K37o34k28P18J85n64k19N37
$$ 48 457 -9 -346 144 431 -220 -480 110 446 -103 -343 159 396 -238 -466 252 437 -127 -346 191
5651A91J08o63j3P22Q5o66k06N98J73o71P7O47R3p41j43O77O4o10kO85l3p44o1
$$ 191 299 -364 -377 345 430 -236 -442 156 329 -342 -265 382 475 -266 -409 268 332 -278 -280 405 372 -372 -433
5674d33P65m4n76M3O33j38o25MO77j0n96R7N90j66p56K56P27j15o93J38N09l0
$$ -433 332 288 -288 -245 388 250 -375 -371 306 296 -300 -203 387 221 -535 -279 448 333 -360 -222 287 257
5696B57o95K53O60k38n76O6O84l09n21K41P06l17o89K72N86k99m50L28M96k90
$$ 257 -438 -185 475 237 -339 -273 411 102 -419 -178 528 211 -478 -206 380 81 -369 -41 455 165
5716A65o99M49N25l94m69L74M49l62n55L95N35l23m72L20N17m74m84M84M36l29
$$ 165 -534 -85 440 46 -423 -49 400 38 -517 -122 413 90 -382 -62 455 -19 -503 -19 417 88
5736H8m73L60M13n00l58M84M50m45m84N07L32m37l53M57M06n25l65L88L73l98
$$ 88 -385 -25 388 -112 -470 14 464 19 -465 42 374 -63 -416 41 447 -78 -443 -55 318 -80
5756h0l38N51L52o10l50N42L47m87k48M78K05n55k40N01K84l77k84M91J48n16
$$ -80 -418 133 485 -125 -475 67 414 -73 -321 157 362 -193 -433 68 352 -25 -309 182 330 -186
5776a86j64N05K40n04j70M45J16m59j49M68K26m40j49L58J21m16j36M93J72n67
$$ -186 -350 155 395 -109 -279 166 282 -177 -326 142 368 -72 -221 137 258 -158 -294 199 371 -196
5796a96r3L71J40m16j3M29K2m29m2L88O6l15o1M11q1l84m2L83R5l70jL36l7l52
$$ -196 -289 82 222 -194 -207 222 244 -185 -227 161 227 -88 -149 262 181 -203 -245 138 233 -137 -138 198 161 -191
5820a91M3L51m4l93J68K23n6l03M8L78p8l13pL48m3k58K6K46L4l39L6L49j37k50
$$ -191 -148 203 159 -234 -66 157 101 -202 -154 224 146 -167 -174 174 131 -127 -101 145 179 -160 -124 225 88 -162
5844a62J43J85j14k09O6K72p9k54R7K12k9k28K7J91j10j44J94P6o3k07J9K20j53
$$ -162 -19 166 52 -157 -91 181 102 -152 -55 157 128 -100 -73 118 8 -136 58 134 71 -136 -117 103 -50
5867e0l8J5K01j40j12N2J53j4j54O5J26j19r3J49P8q0q0N0O6n0j59J94L5j19q5
$$ -50 -88 -73 128 -12 -124 -72 81 67 -87 -22 104 -15 -108 41 119 39 -41 9 75 25 -134 60 95 -24 -109
5892a09R3Q7o1n5M7O0j03n3J51L6j44K4M7J4j3j37J02R8j11p7P5Q7oj09O2L4p4
$$ -109 -16 71 10 -45 2 62 -41 -94 57 93 -51 -27 20 34 21 -116 -14 84 -27 -104 -29 58 52 -57 5 39 -35
5919c5k8Q2J0j24R9K8J1m9k3K7J3l4j9Q0Nk9m1%L9qJ3M2k7o0N4k3rm9O5N4j4o6
$$ -35 -63 19 29 -95 4 32 43 -6 -29 -2 11 -23 -42 38 43 14 -27 -27 12 4 17 59 32 -28 26 3 -6 -55 10 64 50 -16
5951a6k5N2M0n4j3P0k9m8J01n0m5K5j8L9l6nR4m2J6n3M1Qn0l5M9K1p3L1OR9j03
$$ -16 -41 11 51 -3 -16 54 25 -23 78 28 -17 8 -10 29 -7 -12 82 40 56 3 44 52 2 -33 16 37 -36 -5 1 100 -3
5982cj5o2J08n9%L6J7m5Oj4J6K0J1l0m3J6j3N5N6j26J4J6O7l4l1M6O9j34JJ21
$$ -3 -18 -80 28 -31 -31 5 22 -23 -17 -31 -15 5 16 -14 -57 -41 -54 1 57 -69 -55 -39 28 -6 -37 9 78 -56 -55 66
6012F6No5q8Q9Pq4P1K5n4J2%J02n4p9j3J02k4m1k0Q9j3j20O8P7p7m0OL7K1j26
$$ 66 71 6 -82 7 14 -70 1 26 -28 -16 -16 86 32 -47 -60 42 18 -23 -43 46 33 -87 -19 58 -19 -59 -53 -16 5 -121
6042a21P3Q1l5l0k1P5K9p1m4J29Jr0j7O7j6j12O0M9k3m4P2J14j87k1J31L4p4l8
$$ -121 -48 33 -2 -32 -53 22 51 -20 -64 65 66 -24 -41 26 10 -102 -42 7 -16 -60 12 126 -61 -82 49 83 9 -29
6070b9O2J38j66j06O9J18j33j0M9J33r3j36J33P0r7j37J92J7l8j18J11J04j57
$$ -29 33 171 5 -101 -32 86 -47 -57 -8 125 32 -104 29 99 2 -135 57 74 36 -82 29 133 -24
6093b4p1J10K1o9q2Q1J92k16j05J95Q2j25p4J20Q3j56o6J04J03j30o3J51lj63
$$ -24 -95 15 36 -33 -115 -34 158 -58 -163 32 114 -11 -85 35 118 -38 -104 0 103 -27 -90 61 58 -105
6117a05m0K39%j09o8R4P2j62j1J48L4k28M7J70J9j70j8J98K6k56M0J89o1j87K9
$$ -105 -145 94 94 -15 -83 11 83 -79 -90 58 92 -136 -89 81 100 -70 -88 110 136 -120 -80 109 48 -139 -110
6142a10K42o2j77r6K33N5j86L0J83pk60k3K70pk33O3K06kk95J46J96p1k12M3K44
$$ -110 132 70 -107 -203 30 85 -101 -71 112 105 -155 -178 92 85 -148 -85 121 119 -176 -30 166 95 -117 -74 170
6167A70j40j48N7K44j11j81N5J83j27k05J18K25j15k56J38K21l3k45J41K37j93
$$ 170 30 -118 -61 183 72 -109 -54 129 2 -203 -85 140 25 -231 -93 128 95 -150 -9 228 35
6188C5k35J61J61l9k02J85J44j75k02J28K33j57j62J04K42k59k42K21K79j62k29
$$ 35 -200 -39 122 83 -119 66 210 35 -167 -39 194 37 -125 -21 221 -38 -280 -59 220 58 -171
6209a71K09J06k45j12K35J95k21j35J84J08j92j64K96J40k46j33J47J62k09j59
$$ -171 38 144 -101 -213 22 217 -4 -139 45 153 -39 -203 93 233 -13 -146 1 163 -46 -205
6229b05L43J44l52k02L13J00k00o9J59J88l09j81L59R7l00k3K65M1l22j31L55
$$ -205 138 282 -70 -272 41 141 -59 -128 31 219 -90 -271 88 185 -115 -138 127 168 -154 -285 70
6250G0R4k77p3L32O3l53r9L77L6k16p8K33J4l11O0K97L1k56n5J59K9k33K5K92
$$ 70 164 -113 -186 146 209 -144 -243 134 170 -46 -124 109 123 -188 -128 169 200 -56 -111 48 77 -156 -131 161
6274A61m3k79n4L36K8k60J19J82n2l45P5L01o0k59J26K14j44l01R7L79r8k28J01
$$ 161 118 -161 -215 121 149 -111 8 190 138 -207 -132 169 109 -150 -24 190 46 -255 -158 221 123 -105 -4
6297dK03j43l15J33K95p5k11R3J94j33k36J53K91j52k33J10J84k16j03J78K37
$$ -4 199 56 -259 -126 169 94 -117 -24 170 37 -199 -46 245 93 -140 -30 154 -62 -165 13 250
6318B50j81k79J38J95j72j20K59J78k04k98K22J41p5k14L11N9l11p0J95J80k62
$$ 250 69 -210 -72 123 -49 -169 90 268 64 -234 -12 129 54 -160 151 210 -101 -171 24 204 -58
6339e8k2J68P7k76p6J87J19j87n9J87J8j99q3K77J56l02j24K83J5k81L9K30J40
$$ -58 -80 88 165 -111 -187 0 119 -68 -127 60 78 -121 -204 73 229 -73 -197 86 101 -180 -141 89 229
6362B29l08o2K14mj87K6J97P5k73k4J77mj59P7J99m7k79J4K47l3k06J18J89j69
$$ 229 -79 -141 73 69 -118 -92 105 180 -93 -117 60 56 -103 -26 173 126 -153 -139 108 75 -131 -13 176 7
6386Gk32J09K54n3j51K6J88q1k47J27K61j38k05O6K45k38j26J86J82m6k46J36
$$ 7 -225 -116 138 85 -66 -40 148 67 -180 -53 208 70 -135 -69 176 -62 -188 -2 180 134 -112 24
6408B4O1j02j55J35K10q2k71J89J29j21k24K57R8j29k30K13J83k86n1K26P1k01
$$ 24 85 -17 -172 -37 173 91 -180 9 138 17 -207 50 148 19 -211 2 185 -101 -152 74 145 -56
6430e6j16J22J82j77j61L40K0k71r8J90J86k68m6K14Pj72o3K43J24k18q9K20l3
$$ -56 -172 -50 132 -45 -206 134 154 -117 -215 -25 161 -107 -153 61 68 -104 -167 76 200 -18 -107 113 80
6453H0k00k3J92J52k96j8J83jk05J08J92J8k86l2K49j0k42K7K72rk36l9J82O1
$$ 80 -120 -143 49 201 -95 -113 70 69 -136 -28 164 182 -104 -136 113 103 -139 -112 160 151 -85 -124 58 119
6477A19k01L1K02o0j96m8K95l0k33R1J62l1k79P8J99o3j06J0J51k8j95O3J39M0
$$ 119 -82 -51 151 91 -105 -153 142 112 -121 -30 132 101 -178 -100 99 36 -70 -60 91 63 -132 -69 70 110
6501A10j56nJ95j24j55P6K16r5k34J24K32j49j81J39K34j69j98R0K10p6j18M7
$$ 110 -46 -51 144 20 -135 -59 157 62 -172 -48 184 35 -146 -7 227 58 -140 -50 160 84 -34 13
6523A3J95j23k60J25J91j30j54R5J53j27j69J09K57j19j51J21J53j74j24J18J49
$$ 13 208 85 -175 -50 141 11 -143 -48 105 -22 -191 -82 175 56 -95 26 179 5 -119 -1 148
6544A48j13j91J32J99j78r8L9K23j54j28J52%l2r7J02J01q5j58J11J22q6j20K06
$$ 148 35 -156 -24 175 -3 -101 -62 161 7 -121 31 31 -1 -98 4 105 20 -138 -27 95 9 -111 95
6567I5R6k33j11J54Q5j20k9L9Q9j38M3M4R7j35j07J89J6j01j26J64J46j94l2J44
$$ 95 191 -42 -153 1 86 -34 -63 -24 65 -73 -30 14 111 -24 -131 58 74 -27 -153 11 157 -37 -69 75
6591G5M0j07q7J00O5j20m4R0J03q3j19J38J16k13m3J57M1j46J8R4j1o3l4P2%K0
$$ 75 115 8 -79 21 86 -34 -78 12 115 32 -87 51 167 -46 -89 68 109 -37 -19 75 64 1 -33 39 39 59
6617E9j24Q8P7k06K5R6Km4k9J41k2q8r3J57M7m1r1R9N8j77q1J38P4j36LP7M2r5
$$ 59 -65 23 100 -106 -81 15 17 -27 -56 85 63 -25 -118 39 86 45 -46 53 111 -66 -147 -9 65 -71 -68 9 51 -44
6645d4o2J37L9j12n2Q9kk8LN7l3k6N1rK4k4k3L7Jk2JN4o3o3kN5N8j56P5J4N4r0
$$ -44 -106 31 70 -42 -94 -5 -7 -35 -32 25 -8 -34 17 8 32 8 -15 22 23 1 2 56 -7 -70 -72 -17 41 -115 -40 -26 28 -62
6677f2K0Q4p4J2l9J32k7j53J22K7j5l1pM6j4p5J3R8nj47Q9J05l2q5j9J66j06k2
$$ -62 -42 42 -32 -20 -59 73 46 -107 15 42 27 -4 -11 35 21 -54 -41 57 52 -95 -6 99 67 -18 -37 129 23 1
6705AMRnj4K5oM0k08J69kJj4j0O1n8l8O2k0l3rL3K2L3p9O2J6q1lM7K4l2o8Q5J9
$$ 1 5 14 9 -5 20 14 54 -154 15 13 14 0 -10 51 -7 -45 17 -3 -36 -45 -12 10 43 -36 26 42 -39 -42 5 29 -3 -71 14 33
6739C3j33L7P8M9n5n6O2k1m9M1L0J3j04L0R1Pj05KQ0n4nJ8R2rj09k3R1o3K3K9
$$ 33 -100 -63 15 64 9 -47 15 -6 -55 -14 16 29 -75 -45 46 53 -52 -50 30 -24 -29 -11 81 72 -37 -60 31 -32 -9 20
6769B0kJ3n1M8Nj8k3QL6K9j62J05PRo3N3k4m6kO9N2j02l2O1N9j54J22L2j8j04
$$ 20 18 31 -20 28 33 15 -8 0 36 65 -97 8 15 24 -39 14 -10 -56 -58 11 63 -39 -71 -10 49 -105 17 49 31 -73
6799g3j0P0O9j03l3N0J01n7m0J9Mj01K9J60m7r8J5L7Pm3mJ49p5r5L9N2K0q8K6
$$ -73 -83 -13 56 -47 -80 -30 71 14 -26 -7 -3 -104 -75 85 38 -60 -45 -8 -1 -44 -48 101 26 -69 -30 22 42 -46 -20
6828b0J00Lk25N7J53j4j28P6R5n1j30qJ50J8j19K8Q5o7l3j1J50n5r8l9J61p2j22
$$ -20 80 83 -142 -85 68 54 -74 2 97 46 -84 -92 58 76 -43 -15 70 3 -30 -41 109 54 -44 -83 78 6 -116
6855a16J42J52j46j14qJ79j17r0J34J72j84r1J07R6j4k04M2K13j62j25J53R0l7
$$ -116 26 178 32 -82 -90 89 -28 -118 16 188 4 -87 20 116 102 -102 -60 153 -9 -134 19 109 72
6878G2j70J68Q5j77j62K12O9j20m4J30M2j71p9J72J34k30j14K26Q3k33n8K50N1
$$ 72 -98 70 155 -22 -184 28 97 -23 -67 63 105 -66 -145 27 161 -69 -183 43 126 -107 -165 85 136
6901A36j89j17K16M8k10RJ95P7k55o1K56M8k39kK30mk61KJ61R5j68j6J67j5j87
$$ 136 -53 -170 46 94 -116 -107 88 165 -90 -151 105 153 -86 -88 142 138 -123 -121 40 135 -33 -49 118 103 -84
6926h4p3K65R7l01O2J49j5k50L8K59n5j78RK31o6k27j3L22p5k14N7K71j21k87
$$ -84 -157 108 205 -96 -34 115 100 -150 -112 147 92 -86 -77 154 88 -139 -152 170 95 -119 -62 209 88 -199
6950a99R6K82q0k37JK93l9k69K19J42j39k39J78J67j60j91J46J33j14j67J67J52
$$ -199 -103 179 99 -138 -137 156 117 -152 67 209 70 -169 9 176 16 -175 -29 104 -10 -177 -10 142
6972A42j33j14RK84j58k56J99K22j69j55J17K13j82k33K49K01j86k62K10J50j90
$$ 142 9 -105 -96 188 30 -226 -27 195 26 -129 -12 201 19 -214 35 236 50 -212 -2 148 -42
6993d2j25K02J30j28k29J91J52j99j28K39J40k34q8K11R8k34j05K12J71l18r1
$$ -42 -167 35 165 37 -192 -1 151 -48 -176 63 203 -31 -119 92 190 -44 -149 63 234 -84 -175
7014a75K22N9j59j04J75J34k27j44L24N6k13p8K04O5l19L7K06J86k43o9J35O7
$$ -175 47 106 -53 -157 18 152 -75 -219 105 161 -52 -130 74 139 -180 -143 63 249 6 -63 72 139
7036A39k54k2K36mj66n9K23J7k57K7K52J1k43l7K25m2j55JK80o3k89N4K99p2k29
$$ 139 -115 -137 99 95 -71 -130 93 110 -147 -120 132 143 -100 -137 88 46 -109 -108 172 109 -180 -126 173 101 -128
7061a28L1K86j38j79J5K79o5k18J22J54r0j66M6J89q1k06N7K41j26j64R7K27r7
$$ -128 -97 189 51 -128 -113 166 101 -117 5 159 69 -97 -51 138 57 -149 -92 149 23 -141 -44 183 86
7084H6k36Q5J82j42j33J93J36j08k38J77J13j25j34J46J40j71j44J60J00o1j69
$$ 86 -150 -65 117 -25 -158 35 171 63 -175 2 115 -10 -144 2 142 -29 -173 -13 87 26 -143
7105a43J65Q9j42n9R8J49k04r0J30J28j21j32J42J68j09k02J17J37j25j32K07
$$ -143 22 111 -31 -90 8 157 -47 -137 -7 121 0 -132 10 178 69 -133 -16 121 -4 -136 71
7126G1Q1j99m5J05J42j42m8J16K1j28l7J00J0n7j10K29J3j40q4J59Rj16l9J51
$$ 71 152 -47 -92 13 155 13 -35 81 102 -26 -63 37 47 -10 -120 109 122 -18 -102 57 66 -50 -89 62
7150F2Q8k04l3J14j1q3M2L3M6r1n4J86n5j24O3J27r3p8j0J51k7p7L6J16o1j25
$$ 62 150 -54 -87 27 16 -67 -25 8 54 -37 -91 95 40 -84 -21 106 13 -65 -75 76 49 -28 8 124 63 -62
7176f2P6J2L8n3n9M0om6J18J1r3j4J6O8k2o3L9L8po6J0P7p5o6R5O3j2j63O8N3
$$ -62 14 26 64 11 -48 -8 -14 -60 58 69 -24 -38 -22 46 24 -39 0 38 31 -35 -25 52 -23 -89 6 69 57 -106 -38 15
7206A5p4l6P1J41j32m1jN6nj7M5j0j1l0K0L5k0o2J44q0j3p4R7L4o4N2j7pr0L4
$$ 15 -59 -95 -24 117 -15 -56 -57 -1 -6 -23 22 12 1 -29 -9 26 6 -56 88 8 -5 -79 18 52 -12 40 23 16 -74 -40
7236d0R0o4J8K9qK1p6rJ11K7j37K0N9lj11M6J15l4p9J6k1P1j15L3J12m8m2k2O2
$$ -40 50 -14 4 33 25 46 -30 -39 72 99 -38 -18 41 38 -73 -27 88 54 -25 -9 -30 41 -74 -41 71 23 -19 -41 21
7265B1j0l7qP2l3l9M3L7n7oK8Po7N6N6mj16N5k3N0k2k1Q9n2j8k4MR1j11l6L4J29
$$ 21 11 -26 -34 38 5 -34 9 46 -11 -17 11 18 -49 7 63 59 -57 -2 -25 25 3 -18 71 19 1 -23 -19 72 -39 -75 -41 88
7297H8j03k3k8R1J6j18P3Q4r3m6M9K1l6QJ8N1n9l5N0L8n1l6O0m9Q4j37J10Q7p9
$$ 88 -15 -38 -66 25 41 -77 -4 80 -13 -59 -10 11 -25 -17 1 52 -7 -42 8 46 -5 -41 19 -30 54 -83 27 114 35
7326C5p4O7K7r2L8L7k2l0LL1m0k3k3J06l4J8n1L9J2m3ooJ02o4p3O0L7m9PO2kp1
$$ 35 -39 28 55 -37 1 38 16 -14 -11 20 -20 -43 -66 40 6 24 -27 12 24 -19 -25 -31 71 7 -66 -6 31 -18 -11 51 49 -22
7358b2M1N3m0k2n1O7Jj7p2O4J4pj5J18p3o2J4O1J7j18J5N7n8JN1O4n7mm8J03m6
$$ -22 19 72 32 10 -41 26 27 10 -62 2 16 9 -6 112 39 -23 -9 52 69 -49 -34 23 -35 -34 17 81 24 20 -28 75 29
7389B9k5J8M0l9r7Q3K4kj1Nk7P6r1K5J8O5j21O6L6p6Nj1J4K1k6K2J3j00R4p9Q4
$$ 29 4 22 62 23 -74 9 33 31 20 25 -2 74 -17 8 26 91 -30 36 72 -4 1 -10 4 25 -1 21 34 -66 28 -51 33
7420C3n1pM0K7m3p7Q8N0p5pJ14r7l5J0j3M7r3K8O1Q0j05k5P3K6m0Po8P3q0J4j4
$$ 33 -18 -25 15 42 -1 -78 10 60 -15 -22 92 -5 -40 -30 -43 4 -89 -61 0 80 -25 -50 23 49 9 16 -52 21 -59 -45 -59
7451e9J12n9l8O7Mqp3O0J08r6j9L3n8O3j04J31j04K6K9J0o0N1%n8N4o3J2J07l7
$$ -59 53 -6 -44 23 27 19 -54 6 114 18 -1 32 -26 37 -67 64 -40 -14 15 25 -35 16 16 -42 12 -51 -39 68 31
7480C1j9q0J18m2k3l9M9L3q0O7Q%n5K0J9mn4LQ7M7r4PN7n9k4K3K3O2o3PPQ0j58
$$ 31 12 -68 50 8 -15 -54 -5 28 -52 15 23 23 -32 -12 7 3 -51 -48 39 86 -8 -1 56 -3 -27 -4 19 81 18 25 32 112 -46
7513d6K8K4kn6O4L0l5q8M1O2o9O3k8R3o3j6l5J36p7o2JP4j8j02R4j7Lm6R3j8l3
$$ -46 -18 6 4 -52 12 42 7 -81 -40 22 -47 16 -12 81 18 2 -33 103 26 -36 -35 39 21 -81 13 -4 -1 -47 46 28 -5
7544ek5Q0L1o4j25R7L1rq9O9P6o5j5N2Km4o2Q1j0Jl1M8K8l2l7J13o9onn7O9q4
$$ -5 -30 50 81 17 -108 -11 20 11 -78 -9 67 2 -13 39 41 -3 -65 16 6 7 -24 24 52 20 -17 96 27 21 16 -41 28 -56
7576e6N4JK9l6pj3J15j04mR2rj26k0P7nn0%R5ml2RL0qr3P8jj9r2N8R7rp0J6P1
$$ -56 -2 -1 28 -8 -15 -28 87 -17 -21 71 62 -64 -84 -7 -12 -62 -62 33 29 -3 6 36 28 -65 13 12 -7 -99 -41 56 47 -23 -7 64
7610F4j3j04K9J29j16%j1O0Lj34M4Q8m2OM1L3l1q5N7L7l9l9j9R6q1l5J30ln3k7
$$ 64 51 -53 -24 105 -11 -11 -22 38 41 -93 -49 39 -3 3 44 77 46 -39 18 55 16 -23 -42 54 -27 -62 68 65 12 -15
7640a5NP6k6j05J09k3n1o6J60pp0m7J00j5n6p2J27M8n7n1L6J34k12O0K5N4m1n3
$$ -15 -10 66 40 -65 44 21 -30 -96 64 57 -13 -60 40 25 -31 -103 24 72 15 -36 0 134 -78 -18 7 61 20 -33
7668c3J04m9q7O3P0o1o0M8KO9j40NJ67m5p6KO3l4p6J11M5n1j11K0L0O2q9M6R6
$$ -33 71 22 -65 -2 68 7 -53 -5 -3 66 -74 -69 98 53 -23 -21 42 8 -68 43 88 37 -74 -54 -24 38 -51 -5 91
7697I1j30K6n6J05nJ7j01J34oj00J1R4np8rJ26m6j76L5J29K3j24O4k3K4n6l3J97
$$ 91 -39 -13 -69 36 31 48 -53 81 75 -25 -14 80 75 -3 -12 114 68 -108 -73 56 79 -45 19 -4 20 -36 -69 128
7725A28j44p2J08N1n5r7L8J18j18k1M9L6J5r3O4O4p9n0L1R5j37l0R3J4j1p1O9
$$ 128 -16 -88 20 71 16 -81 -43 75 -43 -64 -15 21 36 -57 7 71 -8 -58 -27 68 -69 -99 -6 8 -3 -74 -5
7752eO8Jj24J21m9o0l4J10qn9qN7O5k0j17J01L1r5J7K2M9n7q6J15%r8OJ42Jj13
$$ -5 63 64 -60 61 12 -48 -82 28 20 -39 -47 10 75 55 -62 39 70 -25 -8 14 63 6 -80 35 35 -63 -57 85 86 -27
7782b7j7Q5Mo4MO0l0j2oO4L0j40j2J8J25j66O9J2J3n5J3Q0j1j51R3P3J9j19OM4
$$ -27 -44 41 45 -19 -15 45 15 3 -3 61 91 -49 -61 -43 82 -84 -15 -3 10 -45 -32 48 37 -114 -21 52 71 -48 -42 2
7812BK2k4m2P1N9j20K3M6lq0N6k8Q7p7m0J03l6o8k5L3M4j38J19Q7l5j17l0N4N8
$$ 2 24 0 -42 29 88 -32 -9 37 34 -46 10 -18 69 -8 -48 55 19 -49 -74 -41 3 -135 -16 71 36 -81 -111 -57 1
7841Anj8M0Qr4j9Q4P8j00q8J67o2k3N0k4%op0J15p5p2O6P4n9k5J5M8K2p2j0J50
$$ 1 -4 -22 18 26 -68 -87 -3 75 -25 -113 54 -8 -31 19 -5 -5 -11 -81 34 -41 -113 -47 27 -32 -57 -42 6 28 -44 -54 96
7872I6k9r6n0O3N6r7Q3K3o4QJ03r7ok1pNR3r1J4M7mo4Q1M0j27J5n2J25o9K3mj0
$$ 96 67 -29 -79 -16 40 -57 26 49 -15 -7 96 -1 -7 -28 -35 -30 63 -28 -14 33 29 -35 46 86 -41 -26 -78 47 -22 1 -3 -13
7904a3J4m2N7p1Q3k0K9m0Q0j35lJ08p8M0m4P3o8J1mM1k2J3j8O2Ol4Jj1n1K2l8
$$ -13 1 -41 16 -55 28 8 37 -3 77 -58 -61 47 -31 9 -35 38 -30 -19 -23 18 -4 9 -9 53 59 25 26 15 -36 -14 -52
7935e2L5L3%%O9o2j9n9J28p3rJ0j4O4o0O1n7J2l4M4K5k9k7j1P2n6k4P2m9M6m0
$$ -52 -17 16 16 16 85 23 4 -55 73 0 -9 1 -13 51 -9 52 -5 7 -27 17 42 13 -14 -25 47 -9 -33 39 -10 36 -4
7966dj3J1k5J1J5J8Oo6M8j1K8k2N2l9lm1O3m4K8k4J3j2QL3qkk8K6rJ4j2L6Op1
$$ -4 -17 -6 -31 -20 -5 13 19 -47 1 -10 18 -4 48 9 6 -35 28 -16 12 -12 1 -11 -3 30 22 20 -8 18 9 23 11 47 53 -18
8000a8qL9OO1j05M7l3m0J14Mj26J06J0Nj5j0n4M1j8o4P9l0M9k6o3J9ol7R5l7J4
$$ -18 -26 13 19 80 -25 22 -11 -51 63 67 -59 47 57 62 47 37 -17 24 6 -58 21 -9 40 14 -49 -30 -36 -73 22 -15 -1
8031aJ1o7L1P2j06L6R4j05N6m0J9K9Jj6j0o4L3nO5k8Jj9J9k5pK8N2q3o3P7N4l5
$$ -1 10 -57 -26 46 -60 -24 70 -35 21 -19 0 29 30 14 4 -60 -27 -32 33 5 6 -13 6 -19 -26 2 54 -29 -92 -15 39 4
8063Dn2j0J02k7K4K5n5l2p8J08j4k4J4NK2l7J6O6q9M7m3j4O3J4m6J0%NKJ6J1o7
$$ 4 -48 -58 44 17 41 66 11 -21 -99 9 -5 -29 -15 -10 12 -25 -9 57 -32 15 -28 -42 21 35 -11 -1 -1 4 6 22 33 -34
8095c4J6m3P8j5J7n7L8l0K4l5R1k7o2LM7o0O3O2q4rLKm5Q2ro0L7O3r8K3J1J4j4
$$ -34 -18 -61 17 2 19 -38 0 -30 -6 -41 50 23 -39 -36 11 -49 14 76 -8 -17 -14 -12 -57 25 16 -44 -7 56 -42 -19 -8 6 -8
8128hJ9m6NL4j0L6k9Q4r8P6m0l9J4J7j5K2J3l9J2o0N5N8Kq3K0K7J6p4P5j9j0k1
$$ -8 11 -35 -30 4 -6 30 1 85 -13 63 23 -16 -2 15 0 22 35 -4 8 -52 3 61 63 -20 0 27 43 -31 44 25 15 -6
8160fJ1J3j1n5Q6jp9L3OK8mpm3J3L3k2j2N7o3l0P6N6j36J2N2k3M9k8J8Lm4
$$ -6 5 18 7 -48 38 37 -42 -9 -3 25 21 14 -29 -16 17 -5 -17 40 -23 -53 23 79 -57 -45 7 -16 33 5 23 26 -18
8191a8
$$ Imaginary data points
##PAGE= N=2
##DATA TABLE= (X++(I..I)), XYDATA
0@%%%%%%%%%%%%%%%%%%kLlPj0J0j4J9k2K5k7L4m2M6n2O1p0P9q9J01j14J25j40
$$ 0 0 0 0 0 0 0 0 0 0 0 0 0 0 0 0 0 0 0 -2 1 -2 5 -5 5 -9 10 -12 13 -14 20 -22 24 -28 33 -37 42 -47 54 -60 65 -75
41g5J58j73J90k11K32k53K75k99L20l38L55l63L50l04J90P6p06K397q334N9928
$$ -75 83 -90 100 -111 121 -132 143 -156 164 -174 181 -182 168 -136 54 130 -576 1821 -6513 53415
61E3415L69978k44930m31764J83949K67915k39585k25750L04462K57600k45670
$$ 53415 423393 178463 -253301 -69352 198563 -41022 -266772 37690 295290 49620
71D9620k33909J51818Q1516j84312J9290K99776L6834k94755j09035J68340M6742
$$ 49620 -184289 -32471 49045 -135267 -115977 183799 220633 -74122 -183157 -14817 31925
82C1925r2927P1766J50414p2451j82574q399R5010M177j1030P5395L5949j00672
$$ 31925 -61002 10764 161178 88727 -93847 -102246 -7236 -3059 -14089 61306 97255 -3417
94c417j13761j767Q8996R9686L5428n8376p1463k606O877l6994J9106J08399L5436
$$ -3417 -117178 -118945 -29949 69737 105165 46789 -24674 -27280 -20403 -57397 -38291 70108 105544
107A05544r5820o5856J0487k7833m117J48623J06099j60288j74587J11474J39253
$$ 105544 9724 -56132 -45645 -73478 -77595 71028 177127 16839 -157748 -46274 92979
118I2979j30925r7203K20733J49023k42785k09669J74345J63342j44980o5403
$$ 92979 -37946 -135149 85584 234607 -8178 -217847 -43502 119840 -25140 -90543
128i0543K08172L1370k80566p6728K57593Q3220j89782K028J99820o3886k50855
$$ -90543 117629 148999 -131567 -208295 49298 132518 -57264 -55236 144584 80698 -170157
139a70157M6252K39717k6422j67252P9557J28471j62553j69455J69995J98824
$$ -170157 -123905 115812 89390 -77862 1695 130166 -32387 -201842 -31847 166977
149A66977j18962j53545J04903R3842j38902q8565J45931J08200q9640o9437M8794
$$ 166977 48015 -105530 -627 93215 -45687 -134252 11679 119879 30239 -39198 9596
160I596n389p2914L1582J02692n540q1766r793L1019k2319k1399M5108M7120r023
$$ 9596 4207 -68707 -37125 65567 60027 -21739 -31532 -513 -22832 -44231 877 47997 38974
173C8974l1055k9044k3131J8743N2377J0637l1066K9Q034m8398l2084O7177O1041
$$ 38974 7919 -21125 -44256 -25513 26864 37501 6435 6464 14498 -33900 -65984 1193 62234
186F2234m6970m4404M4281P621q0691k588J13068K8070r6804k4414O8739j9266
$$ 62234 15264 -29140 15141 22762 -57929 -60517 52551 80621 -16183 -40597 28142 8876
198H876p6884N2020J02344n1065j03128M5893P4800p2712o1960J07759P9671j07085
$$ 8876 -68008 -15988 86356 35291 -67837 -21944 52856 -19856 -81816 25943 105614 -1471
210a471q3500Q8070N5914q6946k3716J06146J5386j13820j8425R4551o77q0693
$$ -1471 -84971 3099 59013 -27933 -51649 54497 69883 -43937 -62362 32189 31512 -49181
222d9181L0496Q7617m1151r1886L4011P4315l4200m6848N3513L7493o6167l9506
$$ -49181 -18685 68932 27781 -64105 -30094 44221 10021 -36827 16686 54179 -11988 -51494
234e1494N7561K7285m8329m095N2889r602o1483N438N2630m240l1760J9657K3710
$$ -51494 6067 33352 -14977 -19072 33817 24215 -37268 -31830 20800 16560 -15200 4457 28167
247B8167l3241k7219L0753K3518k1071p371K1511o901l0280N051K7170j616j2001
$$ 28167 -5074 -32293 -1540 21978 907 -6464 15047 8146 -22134 -17083 10087 8471 -3530
260c530J0107J993k2317k927K4270L305j6307P113J3391j9726j8265K2332J8207
$$ -3530 6577 8570 -13747 -16674 7596 10901 -5406 1707 15098 -4628 -22893 -561 17646
273A7646k0185q950K3721j175l3056L213L6753l075l2186J0257K8930j9753l0489
$$ 17646 -2539 -11489 12232 11057 -21999 -18786 17967 14892 -17294 -7037 21893 2140 -28349
286b8349K4664L0540k4941k4508K7361J5776l4271j1778L8756J0245l7327m628
$$ -28349 -3685 26855 1914 -22594 4767 20543 -13728 -25506 13250 23495 -13832 -18460
298a8460L5368l759l6671R613L8050j1361l4843J3766K9171j9053k5355K3699
$$ -18460 16908 13149 -23522 -13909 24141 12780 -22063 -8297 20874 1821 -23534 165
310A65K3682k4744k0208K3984J4295k4719q858K6617O362k6023m196K2899L70
$$ 165 23847 -897 -21105 2879 17174 -7545 -16403 10214 16576 -9447 -13643 9256 9626
323I626k0509L341J9207m953j6790N686J3467o434r815P747P584q033n801O608
$$ 9626 -10883 -7542 11665 6712 -10078 -4392 9075 2641 -7174 573 8157 124 -5677 931
337I31K959n573l1N255j336m251J586J927k524N98M105j757m587K841M189m084
$$ 931 3890 -1683 -1714 3541 2205 -2046 -460 1467 -1057 -459 3646 1889 -2698 143 4332 248
353B48l066O026K570p851l410P325K261o913k86P327j144p627K333Q093k448p006
$$ 248 -2818 3208 5778 -2073 -5483 1842 4103 -2810 -3096 4231 3087 -4540 -2207 5886 3438 -3568
369c568K983N183m823m730O013M727o122m379N261K525n375p49N955k80o505M29
$$ -3568 -585 4598 -225 -4955 1058 5785 -337 -4716 545 3070 -2305 -3054 2901 2621 -3884 -3455
385c455O220k01m322K016L751l613m668L406M324l751m088L098L045l469k293
$$ -3455 2765 2564 -1758 258 4009 396 -4272 -866 3458 -293 -4381 -1283 1762 -1707 -4000
400d000M665L347l790l645K746L092k051k624J505J887j575j749J744J741j492
$$ -4000 665 4012 222 -3423 -677 2415 364 -2260 -755 1132 -443 -2192 -448 1293 -199
415a99k255P01J735m46j291J003J661j173j927J829L614m94l740j314J714J32
$$ -199 -2454 -1753 -18 -464 -1755 -752 909 -264 -2191 -362 3252 2758 -982 -2296 -582 -450
431d50j363P53K196q92l073J15L004J275m02M01l19k929j681L067L469j214k679
$$ -450 -1813 -1060 1136 244 -2829 -2714 290 1565 1163 1564 1245 -1684 -3365 -298 3171 1957 -722
448g22O16O33k403q23L935K943l222m588P04L337O11m82J638J071k472k513R99
$$ -722 -106 527 -1876 -2699 1236 4179 957 -3631 -2927 410 1021 539 2177 3248 776 -1737 -738
465g38K165J00o22r0j301j941P20L158J018k286o87K287L33l114r82L721K166
$$ -738 1427 1527 905 815 -486 -2427 -1707 1451 2469 183 -504 1783 2116 -998 -1980 1741 3907
482C907l500k800L168K906l334l876K789M198j879l495J600K000l197j512N241
$$ 3907 407 -2393 775 3681 347 -3529 -740 3458 1579 -1916 -316 1684 -1513 -3025 2216
497B216K919m697k507M546j80p556R97J1433R72j3622m107J2252L804j1500j091
$$ 2216 5135 438 -2069 2477 2297 -5259 -4262 7171 8143 -5479 -9586 2666 6470 -5030 -6121
512f121J4355J337j6914m298J5416N087j1680j666J0904k415j3782K677J4941
$$ -6121 8234 9571 -7343 -11641 3775 8862 -2818 -4484 6420 4005 -9777 -7100 7841
525G841j615j2475K952R932p206j0904R482J3179q461j2317P854R982r124r060
$$ 7841 6226 -6249 -3297 6635 -571 -11475 -1993 11186 2725 -9592 -1738 8244 -880 -9940
539i940J0217R616r153r233O772O630o063m754N608L974l440j572K086j704k952
$$ -9940 277 9893 740 -8493 -1721 4909 -1154 -5908 -300 3674 234 -1338 748 -956 -3908
554c908K849M283j203l179J80O40j295q44J447K919K892j977p779l013P654O065
$$ -3908 -1059 3224 2021 -1158 -978 -338 -1633 -2477 -1030 1889 4781 2804 -4975 -7988 -334 5731
570E731n018l433O772P11j1706k718J4349N963j1603m312R363j588j3054M070
$$ 5731 713 -2720 4052 4763 -6943 -9661 4688 10651 -952 -5264 4099 2511 -10543 -6473
584f473J7464j588j5616J963J0965p706j0861J3391J4280j3392j4440J2060R824
$$ -6473 10991 9403 -6213 -4250 6715 -991 -11852 1539 15819 2427 -12013 47 9871
597I871j4956o894J9770Q641j9436q812J5076K643j4680L437J8539m008j8489
$$ 9871 -5085 -11979 7791 16432 -3004 -11816 3260 5903 -8777 -5340 13199 9191 -9298
610i298L355J3271p762r892J4535J2428j5367j3717J0680O873j0948J310J7759
$$ -9298 -5943 7328 -434 -10326 4209 16637 1270 -12447 -1767 5106 -5842 -4532 13227
623A3227j469k0650k453J4524r34q612J0158J1353j3937j5715Q957J1013o515
$$ 13227 11758 -8892 -11345 3179 2245 -6367 3791 15144 1207 -14508 -5551 5462 -1053
636a053o97J3868j909k1139m479J6844N583q114L412P610j0654j3571P665J2663
$$ -1053 -1750 12118 10209 -10930 -15409 1435 7018 -1096 2316 9926 -728 -14299 -6634 6029
650F029k543k971P015k572j5535k567J4038O639m237L56p3r883m857R978N773
$$ 6029 3486 515 7530 4958 -10577 -13144 894 7533 3296 3652 3579 -6304 -11161 -1183 4590
665D590m941K855P907j0143j6793O948J7778j786q409P640K412j8895o912K0856
$$ 4590 -351 2504 10411 268 -16525 -9577 8201 6415 -1994 5646 8058 -10837 -17749 3107
679C107R720j5320j566J6438q220k6258P689L0514k116k2307P066J4965k0387
$$ 3107 12827 -2493 -4059 12379 4159 -22099 -14410 16104 13988 -8319 -1253 13712 -6675
692f675j9746K6022K6842k0480k1922J7976J0463k6688p840L4221J3423k8876
$$ -6675 -26421 -399 26443 5963 -15959 2017 12480 -14208 -22048 12173 25596 -3280
704c280j1283K0168k258k2581J2508L2647r662l3359M710K3918j0443j9486J9320
$$ -3280 -14563 5605 3347 -19234 -6726 25921 16259 -17100 -12390 11528 1085 -18401 919
717I19K4900j7251k7043P799J7065o117n403J4180N335j7097j0266Q926O541k144
$$ 919 25819 8568 -18475 -10676 6389 272 -5131 9049 14384 -2713 -12979 -4053 2488 344
731C44L296N826n400j0292k155L935N556O677O71q063m482K642k769m135J2154
$$ 344 3640 9466 4066 -6226 -8381 -4446 1110 7787 8458 395 -4087 -1445 -4214 -8349 3805
746C805J4321j1827k0056P302J5391j1313j2078K1386J8050k4566k4374J8702
$$ 3805 18126 6299 -13757 -6455 8936 -2377 -14455 6931 24981 415 -23959 -5257
758e257K0110j6602j0258K3989P488l0644j0629K7640P818k3006L057K6726j0521
$$ -5257 14853 -1749 -12007 11982 19470 -11174 -21803 5837 13655 -9351 -6294 20432 9911
771I911l4647Q565L4714o490k7766J2429K5006k0037k8899J9316K9706j4042k1744
$$ 9911 -24736 -16171 18543 12053 -15713 -3284 21722 1685 -27214 -7898 21808 7766 -13978
784a3978J4350J3318k0310j2627K2067J3871j6778q654J3249k2j6784K597K0248
$$ -13978 372 13690 -6620 -19247 2820 16691 -87 -8741 4508 4486 -12298 -9701 10547
797A0547J157j6288k211R509k242q248M583J0216j13p335m931m43L914N275q50
$$ 10547 11704 -4584 -6795 2714 472 -7776 -3193 7023 6910 -425 -5356 -5799 -1885 3390 2540
812B540m070L112L437q842p775J0733J2090q330j0535Q288O316j2835n611J6753
$$ 2540 -1530 1582 5019 -3823 -11598 -865 11225 2895 -7640 648 6964 -5871 -11482 5271
826E271P238j5764n252J4433n56j7470M717K2012m545k2984M800K0911q231k0900
$$ 5271 12509 -3255 -8507 5926 5370 -12100 -7383 14629 10084 -12900 -8100 12811 4580 -16320
840a6320J1770K2959j1241k2319R527J7742j0794j3534J4463J2274j5309j1428
$$ -16320 -4550 18409 7168 -15151 -5624 12118 1324 -12210 2253 14527 -782 -12210
852a2210J3601P520j3340l041J5588J654j6434k468J3817J252j0368K342R819
$$ -12210 1391 8911 -4429 -7470 8118 9772 -6662 -9130 4687 5939 -4429 -2087 7732
865G732m183j0235K879P977j497m092K546J502l854j207K465J45K31K972j007
$$ 7732 3549 -6686 -3807 4170 2673 -1419 1127 2629 -1225 -2432 33 178 409 3381 2374
880B374n781K07O047m10n124K560N082m474n827N149M651o060k817Q243J832j0606
$$ 2374 -3407 -3200 2847 2437 -2687 -127 4955 481 -5346 -197 4454 -1606 -4423 3820 5652 -4954
896d954j822J1600J367j1603N0J2280j207j2986J404J2134k056j0719L929R864
$$ -4954 -6776 4824 6191 -5412 -5362 6918 5711 -7275 -5871 6263 4207 -6512 -2583 7281
910G281n845j0082O206R540o064p478O962N781q223n538Q465N360p164l843O115
$$ 7281 1436 -8646 -2440 7100 1036 -6442 520 6301 -1922 -7460 1005 6365 -799 -4642 1473
925A473J427o622o28O993J034n882r14L995l47k767J558K789j230k194L77N27
$$ 1473 2900 -3722 -4350 2643 3677 -2205 -3119 876 529 -2238 -680 2109 879 -1315 -938 -411
941d11m00J144R72j701j127J418K85j759P40K510j316k592J816K881k493k716
$$ -411 -811 333 1305 -396 -1523 -105 180 -1579 -839 1671 355 -2237 -421 2460 -33 -2749
957b749L490K585m161k671M727K483n162k557N255K192m899j255N064L19n597
$$ -2749 741 3326 -835 -3506 1221 3704 -1458 -4015 1240 3432 -1467 -2722 2342 2661 -2936
972b936M00O007l68n692R69N127j907n313K512N786k568n725K034M649k285l506
$$ -2936 -2536 3471 3103 -2589 -1620 3507 1600 -3713 -1201 4585 2017 -3708 -1674 2975 690 -2816
988b816L419L483l830l766L778L503l148k844L138J979l611k014L413K037k652
$$ -2816 603 4086 256 -3510 268 3771 623 -2221 917 2896 -715 -2729 684 2721 69
1003F9j575J871O86j749J31K074k61j968n7J575K82q93j21J33k99k2J64k45o1
$$ 69 -1506 365 1051 -698 -567 1507 1246 -722 -779 796 1078 185 64 197 -102 -124 40 -205 -266
1022b66P83k31j453K13K107K48j831l15J466n03j643J246K217j703k721J301K531
$$ -266 517 286 -1167 -954 1153 1401 -430 -745 721 218 -1425 -179 2038 335 -2386 -1085 1446
1039A446j302k007J917J795k416k170K474K077j942j306K022L05k599m7L213m0
$$ 1446 144 -1863 54 1849 -567 -2737 -263 1814 -128 -1434 588 893 -1706 -1753 1460 1420
1055A420l225o5K421l78k171J407K217j617k189J707J779j615j012K010L69k737
$$ 1420 -1805 -1870 551 173 -1998 -591 1626 9 -2180 -473 1306 -309 -1321 689 1058 -1679
1071a679k56K966K85k651J77K146r80k008J761K197j875k217J966J651j822q42
$$ -1679 -1935 1031 1316 -1335 -1158 988 8 -2000 -239 1958 83 -2134 -168 1483 -339 -1181
1087a181K338L93k765l17K545O3k233O89J820j310j945J942K185j733j770J658
$$ -1181 1157 1550 -1215 -1532 1013 1076 -1157 -468 1352 42 -1903 39 2224 491 -1279 379
1103C79J008j927l22K270rk379J51K072n50j730J279J602j893j616J927J637j680
$$ 379 1387 -540 -862 1408 1399 -980 -829 1243 693 -1037 242 1844 -49 -1665 262 1899 219
1120B19r28J767J66k116L51K240m67k197N41J643j179j194J838J233k130j383
$$ 219 -709 1058 1224 -892 -541 1699 1232 -965 -424 1219 40 -1154 684 1917 -213 -1596
1136a596K201J056k076l16K251j52k757J73K524k9j962K65J251r96j149J503J233
$$ -1596 605 1661 -415 -731 1520 1368 -1389 -1216 1308 1279 -683 -418 833 -163 -1312 191 1424
1153A424j651q24J448L78j702P9K029j07j990j78J395q2q42O05M60j135l04J343
$$ 1424 -227 -1051 397 775 -927 -848 1181 1074 -916 -1094 301 219 -623 -18 442 -693 -997 346
1171C46N8j486M09J703n70k082O83K076o52k002O59J772p97j581R31J347j048
$$ 346 404 -1082 -673 1030 460 -1622 -939 1137 485 -1517 -858 914 117 -1464 -533 814 -234
1188b34j189J069J236j026r06Q31N94q76k55J003K73j123m59R41N43p41k95O96
$$ -234 -1423 -354 882 -144 -1050 -219 375 -501 -756 247 520 -603 -1062 -121 422 -319 -614 82
1206H2N05r99r35P89J473Pj398n23J049O68q56o37R57Q77q96j092L40Q84L7j5
$$ 82 587 -412 -1347 -558 915 922 -476 -999 50 718 -138 -775 182 1059 163 -929 -589 295 332 317
1226C17J50l71o15M67Q20l17q47N75J028p98j430O02J744k58j654Q7J607l10j587
$$ 317 467 96 -519 -52 768 451 -396 179 1207 409 -1021 -419 1325 1067 -587 -500 1107 797 -790
1245g90J36J896J84j816k63J608J9j650R5J903j41j948K54J680p40j801J381K471
$$ -790 -654 1242 1426 -390 -653 955 974 -676 -581 1322 1181 -767 -513 1167 427 -1374 7 2478
1263B478j746l103J799L353k005l566K488M032k701m617K325M599j970m160K224
$$ 2478 732 -2371 -572 2781 776 -2790 -302 3730 1029 -3588 -1263 3336 1366 -2794 -570
1278e70L705k821l503K922L203k902k563L315J796m127j699M660J845m679j670
$$ -570 3135 314 -3189 -267 2936 34 -2529 786 2582 -1545 -3244 1416 3261 -1418 -3088
1293c088M556J194m809j035M960J259m505j515L859R86l459n72L443P94l266j074
$$ -3088 1468 2662 -2147 -3182 1778 3037 -1468 -2983 876 1862 -1597 -2169 1274 2068 -1198 -2272
1309b272K323R21j819k93K006K70k315r50K127J355j614j122J827J059k825j875
$$ -2272 51 972 -847 -1140 866 1136 -1179 -2129 -2 1353 -261 -1383 444 1503 -1322 -3197
1325c197L379L098l191l403L117L294l938l616M967M508m960n088M775M508n163
$$ -3197 182 3280 89 -3314 -197 3097 -841 -4457 510 5018 58 -5030 -255 4253 -910
1340i10l727O314L738p071l955P180L299p270k054Q275J442r358j577R533J349
$$ -910 -4637 1677 5415 -1656 -5611 1569 4868 -2402 -4456 3819 5261 -4097 -5674 3859 5208
1355E208q934k74Q848o46r321Q28R052o79q027J587P150k638p296L050P174k465
$$ 5208 -3726 -4000 4848 4202 -5119 -4291 4761 4082 -3945 -2358 4792 2154 -5142 -2092 5082 2617
1371B617o193K457M837l237m522L641M738k825m101J888K798k257k004K718K887
$$ 2617 -3576 -1119 3718 481 -4041 -400 4338 1513 -2588 -700 2098 -159 -2163 555 3442
1386C442k203l459O08K739K22k005K99K581n23l850r18M316J956l421j518L435
$$ 3442 1239 -2220 -1612 1127 1349 -656 -357 2224 1701 -2149 -3067 1249 3205 -216 -1734 1701
1402A701L73n133k14O542J152o685j385O412M7p200Q53Q642n53q926J91P977j444
$$ 1701 2074 -3059 -3273 3269 4421 -2264 -3649 2763 2810 -4390 -3537 5105 4552 -4374 -4183 3794 2350
1419B350p404L203Q093l983q494L861P606m426o658N797O630o557o939O114N795
$$ 2350 -5054 -1851 6242 2259 -6235 -2374 5232 806 -5852 -55 6575 18 -6921 -807 4988
1434D988n595m005O269L042p070l006O691K475n790p99N731m09o372R0N960L88
$$ 4988 -607 -4612 1657 4699 -2371 -5377 1314 3789 -2001 -2800 2931 2522 -3850 -3760 2200 2588
1450B588m264M09L115j808l377K148L455q48k492O12J044j417j032J611K042k12
$$ 2588 -1676 -1267 1848 40 -3337 -1189 2266 1418 -1074 -462 582 -835 -1867 -256 1786 1574
1466A574j863j564M69J815N10j145J30J583j045k910Q72L561k88k838J032K428
$$ 1574 -289 -1853 -1384 431 941 -204 -74 1509 464 -2446 -1574 1987 1699 -1139 -107 2321
1482B321k815l312L659M383l247m225L151L335m081k946M904L392m901k605M318
$$ 2321 -494 -3806 -147 4236 989 -3236 -85 3250 -831 -3777 1127 4519 -382 -2987 1331
1497A331J109m793l7N881j53n943K27N132j283m710K428N059k699m744K528L470
$$ 1331 2440 -2353 -2390 3491 3338 -2605 -2378 2754 1471 -3239 -811 4248 1549 -3195 -667 2803
1513B803l196k287M578K213n199k408M409J521l856j66M424m62m864K96L923m91
$$ 2803 -393 -2680 1898 4111 -1088 -3496 913 2434 -1422 -1588 2836 2374 -2490 -2194 1729 1238
1529A238k693J929K437k999l171K665L029j853j793J945P41k814q58K652J079
$$ 1238 -1455 474 2911 -88 -3259 -594 2435 582 -1211 734 1475 -1339 -2197 455 1534
1544A534j548l47R98q53j490J105J860l32j265q3K39m78N9N54K32K34L3j106r38
$$ 1534 -14 -361 637 -216 -1706 -601 1259 927 -338 -421 -182 -660 -601 -47 185 419 452 -654 -1592
1563a592J217J322j031q87J566M81k465p77K860R76k682n09K937l15l715N38M130
$$ -1592 -375 947 -84 -971 595 1076 -1389 -2166 694 1670 -1012 -1521 1416 1101 -2614 -2076 2054
1580B054l99l745R10L365j934l683K628M058k444l706K641K837l492k641M390
$$ 2054 1655 -2090 -1180 2185 251 -3432 -804 3254 810 -2896 -255 2582 -910 -3551 839
1595H39K864m237k775L763J875l842r19M488Q79m662r30M023M71l454N40L721
$$ 839 3703 -534 -3309 454 2329 -1513 -2432 2056 2935 -1727 -2657 1366 1837 -1617 -1077 2644
1611B644j029m044O61L770l95l175R21K655j118k804R32K741l94k058K52J554
$$ 2644 1615 -2429 -1768 2002 1607 -1568 -647 2008 890 -1914 -982 1759 1365 -693 -441 1113
1627A113o56j400M71J691q9j472l12J196K60j222j62J442N09j588q52J498P88
$$ 1113 457 -943 -472 1219 1130 -342 -654 542 802 -420 -582 860 1369 -219 -1071 427 1215
1644A215j479o81J965O95k334r18K399P80k415n81K748M86l190n71L144N26k784
$$ 1215 -264 -945 1020 1715 -619 -1537 862 1642 -773 -1354 1394 1880 -1310 -1881 1263 1789 -995
1661i95k42K808k96l066M53L128m62k988O78K716j074k798J435K850j323k784
$$ -995 -1237 1571 1275 -1791 -1338 1790 1328 -1660 -982 1734 660 -2138 -703 2147 824 -1960
1677a960J134K391j270k145J619K011j658j979J373J709j257j462J363J343j427
$$ -1960 -826 1565 295 -1850 -231 1780 122 -1857 -484 1225 -32 -1494 -131 1212 -215
1692b15j262J103J304r42j065Q55Q46q64p78Q19Q02o88q35O27Q01n48q85O37Q60
$$ -215 -1477 -374 930 -12 -1077 -222 624 -240 -1018 -199 603 -85 -920 -293 508 -40 -925 -288 572
1711E72m47r82M66Q64l62q99L83J028l75j014M56Q48m53q26N32R18n30r81N35
$$ 572 125 -857 -391 473 111 -788 -405 623 248 -766 -310 538 85 -741 -209 709 179 -802 -267
1730b67R59n64p27N21P60o15o91N63O63n21m65N09M17o36l70O53M51o45l78N82
$$ -267 692 128 -599 -78 682 67 -624 -61 602 81 -384 125 542 -94 -464 189 640 -5 -383 199
1750A99M03o06k89M92M36n24m00M62L51k80m54M11L72m11l27M12K84l68l15L93
$$ 199 602 -4 -293 199 635 111 -289 173 524 244 -210 201 573 162 -165 247 531 163 -152 241
1770B41L05m43l16M54L13l76m31M49K84m34k61M68K11m76j49M44P5m42n6L50Q4
$$ 241 546 103 -213 241 554 178 -253 196 480 46 -215 253 464 -12 -161 283 358 -84 -140 210 294
1791B94l83n6K78Nj86M0J59k24j8J72J3k51mK57j8k65m5J92L9q9K1j8k33N1L32
$$ 294 -89 -145 133 138 -48 -8 151 -73 -91 81 94 -157 -161 96 78 -187 -232 -40 -1 -90 -69 -87 -320 -269 63
1816F3l0l68N1K96j0l11O5J43r4p4K54j47k79J98M20j89n41J75M99p5m03O8L13
$$ 63 33 -335 -284 12 2 -309 -244 -101 -195 -269 -15 -162 -441 -243 177 -12 -553 -378 121 46 -357 -289 24
1839B4k58j61M36M4m27n3N26L5n31NN53nm72N2L76j75k72L44K32m74l07O58L27
$$ 24 -234 -395 41 85 -342 -395 131 166 -365 -360 193 188 -284 -232 144 -31 -303 41 273 -201 -508 150 477
1862D77n67k33L85K71l78j67L12P3k26R1K77l47k52N08M99o17n21M10N79k13n96
$$ 477 -90 -323 62 333 -45 -212 100 173 -53 38 315 -32 -284 224 723 106 -415 -5 574 361 -235
1883b35K92K99j16k20J97P5j68M6J69j29k76J51L38Qm08r2L45Ll3k6j7o4j04J19
$$ -235 57 356 240 20 217 292 124 170 339 210 -66 85 423 431 23 -69 276 279 246 220 203 139 35 154
1907A54P5n4j11q2J44K22j97k76J05L89q8m83j07O01J58m83k34K71j7m6J58Q5
$$ 154 229 175 64 -18 126 348 151 -125 -20 369 281 -202 -309 292 450 -33 -267 4 -13 -59 99 184
1929A84l83j48N69R2n88k80P40M00q42n20P24M71n53m25N91J70o38MP65j47q12
$$ 184 -199 -347 222 314 -274 -554 186 586 -256 -776 -52 419 -134 -559 32 202 -436 -432 333 186 -626
1950f26Q9Q90j21r11J36R98j98j015K16R94k94r89M39Q99n01j066O27J286o84
$$ -626 -537 353 232 -679 -543 455 257 -758 -542 452 158 -831 -392 507 6 -1060 -433 853 169
1969A69j307M97J324k99j250L85J122m42j043M31J023n28q35P43O94r93q22J225
$$ 169 -1138 -641 683 384 -866 -481 641 199 -844 -413 610 82 -753 -10 684 -309 -1131 94
1987I4J129j191j212J019J263j062j121R57J301j052j158R56J054j004r28J282
$$ 94 1223 32 -1180 -161 1102 40 -1081 -124 1177 125 -1033 -77 977 -27 -955 327
2003C27R33j375j114J480J068j318j000J337R53j326j036J377R82j411q37J591
$$ 327 1260 -115 -1229 251 1319 1 -999 338 1291 -35 -1071 306 1288 -123 -960 631
2019F31P75j795r06J834J165j829j106J821J071j886j257J857J388j690j256J559
$$ 631 1406 -389 -1295 539 1704 -125 -1231 590 1661 -225 -1482 375 1763 73 -1183 376
2035C76R85j982p68K372Q77k371j037K263Q73k436p76K804Q86k873j212K595J142
$$ 376 1361 -621 -1389 983 1860 -511 -1548 715 1588 -848 -1624 1180 2066 -807 -2019 576 1718
2052A718k525o55K684N34l047o52K981O46k836l99K866J63l248j9L098L67k911
$$ 1718 -807 -1462 1222 1756 -1291 -1943 1038 1684 -1152 -1551 1315 1478 -1770 -1789 1309 1676 -1235
2069a235k53K789k38k862K76L055j84k934K05K730n10k775N66L102l32l059K14
$$ -1235 -1488 1301 1063 -1799 -1523 1532 1348 -1586 -1381 1349 839 -1936 -1370 1732 1400 -1659 -1445
2086a445K561k35k574N94K705m70k853K61K549l09k324O75K565p43k943L46L118
$$ -1445 1116 881 -1693 -1099 1606 1136 -1717 -1456 1093 784 -1540 -865 1700 957 -1986 -1640 1478
2103A478j98k765M75K719p55l106N57L335k02l012L23K675q09k911J016L438p83
$$ 1478 1280 -1485 -1010 1709 954 -2152 -1595 1740 1538 -1474 -1151 1524 715 -2196 -1180 2258 1475
2120A475l306O35K954r92k963J463L359j381l370R70L012j162k719J739K899j913
$$ 1475 -1831 -1196 1758 766 -2197 -734 2625 1244 -2126 -1156 1856 694 -2025 -286 2613 700
2136G00l125J608K998j511k460J918K365k234k621J897K635j614j951J653J746
$$ 700 -2425 -817 2181 670 -1790 128 2493 259 -2362 -465 2170 556 -1395 258 2004
2151B004k108j950K114K060j576j797J479J315j886j432K066J847j606j823J157
$$ 2004 -104 -2054 60 2120 544 -1253 226 1541 -345 -1777 289 2136 530 -1293 -136
2166a36J340j370j177J736J517j495j864J055J480j046j108J561J319j728j896
$$ -136 1204 -166 -1343 393 1910 415 -1449 -394 1086 40 -1068 493 1812 84 -1812
2181a812J282J752r51j280J345J162j834j660J626J895j251j403J379R42j949
$$ -1812 -530 1222 271 -1009 336 1498 -336 -1996 -370 1525 274 -1129 250 1192 -757
2196g57j266K100J654j630j453J386Q85j865p44K230J147j876j220J412O35j528
$$ -757 -2023 77 1731 101 -1352 34 919 -946 -1690 540 1687 -189 -1409 3 638 -890
2212h90k30K072M06j963p68J445L84j187R4J573j09j689l66J187L30p15K83Q64
$$ -890 -1120 952 1358 -605 -1373 72 456 -731 -637 936 827 -862 -1228 -41 289 -426 -143 721
2230G21l93j317L2J082L85m31r1L09k75p84J23Q55L75l95k61Nj82k07K05O04K85
$$ 721 328 -989 -957 125 510 79 -12 297 22 -762 -639 216 591 196 -65 -60 -242 -449 -244 360 645
2251F45m54m09rL5k0J78N76P6n55m87J99K94r4K18M07r9q04k55M94K68M0N6K60
$$ 645 191 -218 -227 -192 -212 -34 542 618 63 -424 -225 69 -25 193 600 501 -303 -558 -64 204 244 300 560
2274E60l53n94J20M49J40PJ63p7o13k06M22L96j00k1J62l48m95J59N01J93k50
$$ 560 207 -387 -267 182 322 329 492 415 -198 -404 18 414 314 293 455 107 -388 -229 272 465 215
2295B15P8K0n27k48N58N01l31l06K62k2n92q2P70K89n95k65M44p0o87J79R21J1
$$ 215 293 313 -214 -462 96 597 266 -40 222 200 -392 -474 296 585 -10 -275 169 99 -588 -409 512 523
2317E23q08j30N92j24n61K61P31j61p44l0N71j07n23L51O87l60p92J02O94j53
$$ 523 -285 -415 177 53 -508 -247 484 323 -421 -451 120 13 -510 -159 528 168 -624 -522 172 19
2337A9m76K79O36l23q62J45Q24qo34K97M15l95o65L93P77j23p14R3N29j77p57
$$ 19 -457 -178 458 135 -727 -582 242 234 -400 -103 312 -83 -748 -355 422 299 -415 -322 207 30 -727
2358g27M42P62k25p32R0O51k20n59L72O67l36p76L17O59k99o27L70P04l43p83
$$ -727 -285 477 252 -480 -390 261 41 -518 -146 521 185 -591 -274 385 86 -541 -171 533 190 -593
2378e93L32O50j48o09L16N58l73n74L16O59l18n60L24O02l21p20L69O64j86o20
$$ -593 -261 389 241 -368 -52 506 133 -441 -125 534 216 -344 -20 582 261 -459 -90 574 388 -232
2398b32J82O15l77n40L36O37m25m94L35N89n18m62N09N30n26n71M39N42m19n46
$$ -232 -50 565 188 -352 -16 621 196 -298 37 626 108 -354 155 685 159 -412 27 569 150 -396
2418c96O35L64n24m43N26L20m71l08N88J75n66k19N68J63m33k53L96J31l46j00
$$ -396 239 603 79 -364 162 482 11 -297 291 466 -100 -319 249 412 -21 -274 122 253 -93 -193
2438a93L65M8l90m3L41J04l39q8K74J04k36j99J69K62j48k55nK18O9k16k4J71
$$ -193 172 220 -170 -213 128 232 -107 -195 79 183 -53 -252 -83 179 31 -224 -229 -11 58 -158 -182 -11
2460a1j20j21J18K05q8l11J59L36k26l33J88M71l03l56J78L80k63k89L03K12l06
$$ -11 -131 -252 -134 71 -17 -328 -169 167 -59 -392 -204 267 -36 -392 -214 166 -97 -386 -83 129 -177
2481a77k95M53K41m43k00L82J90k96k23M50L2l51k3L70m2l90K42L26k33l48J90
$$ -177 -472 -19 222 -221 -421 -39 151 -145 -368 82 114 -237 -260 110 68 -322 -80 246 13 -335 -145
2502a45L37j25j90L8K30j18j22J95m3j03N9R5r2j48K49O6n4j82J43K1r5O3J61
$$ -145 192 67 -123 -85 145 27 -95 100 57 -46 13 108 16 -132 117 183 129 -53 90 111 16 79 240
2525B40q8j77J34J34j95o9K66L4k74j4K18l2k69J21L37j78l38J81L35j89k70J65
$$ 240 152 -25 109 243 48 -21 245 279 5 -9 209 177 -92 29 366 188 -150 31 366 177 -93 72
2547G2K38k64j60K45J11k87j2L73j10l60M6L96o4m45K04L67k56l31J41L32j99
$$ 72 310 46 -114 131 242 -45 -57 316 206 -154 -108 288 224 -221 -17 350 94 -237 -96 236 37
2568C7k49L57R8l94k06M12J22k72mK41l4l48nL11p7j17M0J67j42j71J83J15j29
$$ 37 -212 145 243 -151 -357 55 177 -95 -99 142 108 -240 -245 66 -11 -128 -88 79 -63 -234 -51 64 -65
2591f5j38J63j7r9k1J59l2K2Jj92m3K14J46j05j85J18R0k30o9J96J18k13n6K84
$$ -65 -203 -40 -57 -156 -177 -18 -50 -28 -27 -219 -262 -48 98 -7 -192 -74 16 -214 -283 -87 31 -182 -238 46
2615D6p2l26L2M63ll54j7L75k18l17K60L04j39k43J79K06l55j01L81K37l16k47
$$ 46 -26 -352 -320 143 140 -214 -231 144 -74 -391 -131 173 34 -209 -30 176 -179 -280 101 338 22 -225
2637b25J87J25k62mM57Ol52j2J76j07o0K03K88k70k70J35J29j74K0K99O2k67j08
$$ -225 -38 87 -175 -179 278 284 -68 -80 96 -11 -71 132 420 150 -120 15 144 -30 -10 289 351 84 -24
2660b4QJ14m9J64P7o7k14p8J50l9J03J08L0k52j38Q3R4j5J74N7q9k86l2R8J66
$$ -24 -16 98 49 213 290 223 9 -69 81 42 145 253 283 31 -107 -24 70 55 229 286 197 -89 -121 -23 143
2685A43M0N0j6k15k08m1K43K18P0j47j70j62kM9K75K32k02k21m9p6m7K8M21K41
$$ 143 183 233 217 2 -206 -247 -4 214 284 137 -33 -195 -197 -148 127 359 157 -64 -113 -189 -236 -208 213 454
2709D54l81m32L3K56r3m6M82J39n39m43K81L22p9j0L08m1p37j71N36L99k60p2
$$ 454 73 -359 -326 -70 -163 -209 273 412 -127 -570 -289 33 -46 -56 252 211 -526 -697 -161 238 -22 -94
2731i4L58k07p91o0P89N41m83j89K48k78o16J61R10L18o22l54K59L2n83K81R91
$$ -94 264 57 -734 -794 -5 536 53 -136 112 -166 -782 -621 289 607 -15 -369 -110 -78 -661 -380 611
2752F11J33r65m46M69J09l55L95Q04j70j110k02P65J24m83M02P40l78j170j25
$$ 611 744 -221 -667 -198 -89 -444 -49 755 585 -525 -727 38 162 -321 81 821 443 -727 -852
2771h52J117K84n69J61N55m13j184K09J199K40p03L1M85n90r71N35J433O0j143
$$ -852 265 549 -20 141 696 283 -901 -692 507 747 44 75 560 -30 -1001 -466 967 1027 -116
2790a16j28N80l60q46P21J357j85j357k04O59j45m93O58J168m84j511j87J021
$$ -116 -244 336 -24 -870 -149 1208 1023 -334 -538 121 -24 -517 141 1309 825 -686 -873 148
2808A48J26m74N14R12q60j452J52J359J61o20K68P07q71j497O73J662K7j108L2
$$ 148 274 -200 314 1226 366 -1086 -934 425 586 -34 234 941 70 -1427 -754 908 935 -173 -141
2827a41P86p75j217P82J772j86j438J8P18o14q66J141J489p47j509K03R16n87
$$ -141 645 -130 -1347 -565 1207 1021 -417 -399 319 -295 -1161 -20 1469 722 -787 -584 332 -255
2845b55p15J228J233j108j565L08J175l43n68J069Q10j333j464P37J240k06n48
$$ -255 -970 258 1491 383 -1182 -874 301 -42 -610 459 1269 -64 -1528 -791 449 243 -305
2862c05O86N34j321j163R15J452j99q56L66L05j023p71J067J481n87j094K06N06
$$ -305 381 915 -406 -1569 -654 798 599 -257 109 414 -609 -1380 -313 1168 581 -513 -307 199
$$ [...]
8191b0
##END NTUPLES=NMR FID
##END=
