##TITLE=1H_IBEP0104
 CDCl3, 8 sc, 
 2.4.2019
##JCAMPDX= 6.0         $$ Bruker NMR JCAMP-DX V2.0
##DATA TYPE= NMR FID
##DATA CLASS= NTUPLES
##ORIGIN= UXNMR, Bruker Analytische Messtechnik GmbH
##OWNER= root
$$ XWIN-NMR		Version 3.5
$$ Tue Apr  2 14:33:56 2019 Russian Standard Time (UT+4h)  she@DPX200
##.OBSERVE FREQUENCY= 200.1316
##.OBSERVE NUCLEUS= ^1H
##.DELAY= (6, 6)
##.ACQUISITION MODE= SIMULTANEOUS
##.ACQUISITION SCHEME= undefined
##.AVERAGES= 8
##.DIGITISER RES= 18
##SPECTROMETER/DATA SYSTEM= spect
##.PULSE SEQUENCE= zg30
##.SOLVENT NAME= CDCl3
##.SHIFT REFERENCE= (INTERNAL, CDCl3, 0, 15.7039)
##AUDIT TRAIL= $$ (NUMBER, WHEN, WHO, WHERE, WHAT)
$$ ##TITLE= Audit trail, XWIN-NMR		Version 3.5
$$ ##JCAMPDX= 5.01
$$ ##ORIGIN= Bruker BioSpin GmbH
$$ ##OWNER= she
$$ F:/spectra/data/she/nmr/H-F/1/audita.txt
$$ ##AUDIT TRAIL=  $$ (NUMBER, WHEN, WHO, WHERE, WHAT)
(   1,<2019-04-02 14:32:47.87 +0400>,<she>,<DPX200>,
      <created by zg, POWCHK disabled, PULCHK disabled
       configuration hash MD5:
       00 E9 B6 7A A2 85 ED C7 34 08 36 98 17 FE 4E 26
       data hash MD5: 16K
       AA 77 29 CA 17 2A F8 6D 83 93 E6 1F FB 5B 5B 6D>)
$$ ##END=
$$ 
$$ hash MD5
$$ AA 09 54 74 12 EF 61 79 7B 4D 7C 63 6D 24 9A 67
##$RELAX= 
##$RELAX= 
##$RELAX= 
##$RELAX= 
##$RELAX= 
##$RELAX= 
$$ Bruker specific parameters
$$ --------------------------
##$DU= <F:/spectra>
##$EXPNO= 1
##$NAME= <H-F>
##$PROCNO= 1
##$TYPE= <nmr>
##$USER= <she>
##$AMP= (0..31)
100 100 100 100 100 100 100 100 100 100 100 100 100 100 100 100 100 100 
100 100 100 100 100 100 100 100 100 100 100 100 100 100 
##$AQSEQ= 0
##$AQ_mod= 1
##$AUNM= <au_zg>
##$AUTOPOS= <>
##$BF1= 200.13
##$BF2= 200.13
##$BF3= 200.13
##$BF4= 200.13
##$BF5= 200.13
##$BF6= 200.13
##$BF7= 200.13
##$BF8= 200.13
##$BYTORDA= 1
##$CFDGTYP= 0
##$CFRGTYP= 5
##$CHEMSTR= <none>
##$CNST= (0..31)
1 1 145 1 1 1 1 1 1 1 1 1 1 1 1 1 1 1 1 1 1 1 1 1 1 1 1 1 1 1 1 1 
##$CPDPRG= <>
##$CPDPRG1= <>
##$CPDPRG2= <>
##$CPDPRG3= <>
##$CPDPRG4= <mlev>
##$CPDPRG5= <mlev>
##$CPDPRG6= <mlev>
##$CPDPRG7= <mlev>
##$CPDPRG8= <mlev>
##$CPDPRGB= <>
##$CPDPRGT= <>
##$D= (0..31)
0 1.2 0 0 0 0 0 0 0 0 0 0.03 0 0 0 0 0 0 0 0 0 0 0 0 0 0 0 0 0 0 0 0 
##$DATE= 1554201167
##$DBL= (0..7)
120 120 120 120 120 120 120 120 
##$DBP= (0..7)
150 150 150 150 150 150 150 150 
##$DBP07= 0
##$DBPNAM0= <>
##$DBPNAM1= <>
##$DBPNAM2= <>
##$DBPNAM3= <>
##$DBPNAM4= <>
##$DBPNAM5= <>
##$DBPNAM6= <>
##$DBPNAM7= <>
##$DBPOAL= (0..7)
0.5 0.5 0.5 0.5 0.5 0.5 0.5 0.5 
##$DBPOFFS= (0..7)
0 0 0 0 0 0 0 0 
##$DE= 6
##$DECBNUC= <off>
##$DECIM= 24
##$DECNUC= <off>
##$DECSTAT= 4
##$DIGMOD= 1
##$DIGTYP= 9
##$DL= (0..7)
0 120 120 120 120 120 120 120 
##$DP= (0..7)
150 150 150 150 150 150 150 150 
##$DP07= 0
##$DPNAME0= <>
##$DPNAME1= <>
##$DPNAME2= <>
##$DPNAME3= <>
##$DPNAME4= <>
##$DPNAME5= <>
##$DPNAME6= <>
##$DPNAME7= <>
##$DPOAL= (0..7)
0.5 0.5 0.5 0.5 0.5 0.5 0.5 0.5 
##$DPOFFS= (0..7)
0 0 0 0 0 0 0 0 
##$DQDMODE= 0
##$DR= 18
##$DS= 0
##$DSLIST= <SSSSSSSSSSSSSSS>
##$DSPFIRM= 0
$$ [...]
##$SUBNAM2= <"">
##$SUBNAM3= <"">
##$SUBNAM4= <"">
##$SUBNAM5= <"">
##$SUBNAM6= <"">
##$SUBNAM7= <"">
##$SUBNAM8= <"">
##$SUBNAM9= <"">
##$SW= 24.9336934301222
##$SWIBOX= (0..15)
0 0 2 0 0 0 0 0 0 0 0 0 0 0 0 0 
##$SW_h= 4990.01996007984
##$TD= 16384
##$TD0= 1
##$TE= 0
##$TE2= 300
##$TE3= 300
##$TEG= 300
##$TL= (0..7)
0 120 120 120 120 120 120 120 
##$TP= (0..7)
150 150 150 150 150 150 150 150 
##$TP07= 0
##$TPNAME0= <>
##$TPNAME1= <>
##$TPNAME2= <>
##$TPNAME3= <>
##$TPNAME4= <>
##$TPNAME5= <>
##$TPNAME6= <>
##$TPNAME7= <>
##$TPOAL= (0..7)
0.5 0.5 0.5 0.5 0.5 0.5 0.5 0.5 
##$TPOFFS= (0..7)
0 0 0 0 0 0 0 0 
##$TUNHIN= 0
##$TUNHOUT= 0
##$TUNXOUT= 0
##$USERA1= <user>
##$USERA2= <user>
##$USERA3= <user>
##$USERA4= <user>
##$USERA5= <user>
##$V9= 5
##$VALIST= <valist>
##$VCLIST= <CCCCCCCCCCCCCCC>
##$VD= 0
##$VDLIST= <DDDDDDDDDDDDDDD>
##$VPLIST= <PPPPPPPPPPPPPPP>
##$VTLIST= <TTTTTTTTTTTTTTT>
##$WBST= 1024
##$WBSW= 4
##$XGAIN= (0..3)
0 0 0 0 
##$XL= 0
##$YL= 0
##$YMAX_a= 413623
##$YMIN_a= -675837
##$ZGOPTNS= <>
##$ZL1= 120
##$ZL2= 120
##$ZL3= 120
##$ZL4= 120
##$ABSF1= 10
##$ABSF2= 0
##$ABSG= 5
##$ABSL= 3
##$ALPHA= 0
##$AQORDER= 0
##$ASSFAC= 0
##$ASSFACI= 0
##$ASSFACX= 0
##$ASSWID= 0
##$AUNMP= <proc_1d>
##$AZFE= 0.1
##$AZFW= 0.1
##$BCFW= 1
##$BC_mod= 2
##$BYTORDP= 1
##$COROFFS= 0
##$CY= 11.3945322036743
##$DATMOD= 1
##$DC= 2
##$DFILT= <>
##$DTYPP= 0
##$F1P= 18.9103706918063
##$F2P= -1.10871071338519
##$FCOR= 0.5
##$FTSIZE= 0
##$FT_mod= 4
##$GAMMA= 1
##$GB= 0.15
##$INTBC= 1
##$INTSCL= 1
##$ISEN= 128
##$LB= 0.24
##$LEV0= 0
##$LPBIN= 0
##$MAXI= 10000
##$MC2= 0
##$MEAN= 0
##$ME_mod= 0
##$MI= 1.114404
##$NCOEF= 0
##$NC_proc= 0
##$NLEV= 6
##$NOISF1= 3.799351
##$NOISF2= 2.8
##$NSP= 1
##$NTH_PI= 0
##$NZP= 0
##$OFFSET= 15.70392
##$PC= 1
##$PHC0= -9210.931
##$PHC1= 12.20025
##$PH_mod= 1
##$PKNL= yes
##$PPARMOD= 0
##$PSCAL= 0
##$PSIGN= 0
##$REVERSE= no
##$SF= 200.130013532006
##$SI= 16384
##$SIGF1= 3
##$SIGF2= 2
##$SINO= 400
##$SIOLD= 16384
##$SREGLST= <1H.CDCl3>
##$SSB= 0
##$STSI= 0
##$STSR= 0
##$SW_p= 3612.71676300578
##$SYMM= 0
##$S_DEV= 0
##$TDeff= 0
##$TDoff= 0
##$TI= <>
##$TILT= no
##$TM1= 0
##$TM2= 0
##$TOPLEV= 0
##$USERP1= <user>
##$USERP2= <user>
##$USERP3= <user>
##$USERP4= <user>
##$USERP5= <user>
##$WDW= 1
##$XDIM= 8192
##$YMAX_p= 0
##$YMIN_p= 0
$$ End of Bruker specific parameters
$$ ---------------------------------
##NTUPLES= NMR FID
##VAR_NAME=  TIME,          FID/REAL,        FID/IMAG
##SYMBOL=    X,             R,               I
##VAR_TYPE=  INDEPENDENT,   DEPENDENT,       DEPENDENT
##VAR_FORM=  AFFN,          ASDF,            ASDF
##VAR_DIM=   8192,          8192,            8192
##UNITS=     SECONDS,       ARBITRARY UNITS, ARBITRARY UNITS
##FACTOR=    0.0002004,     1,               1
##FIRST=     0,             0,               0
##LAST=      1.6414764,     0,               0
##MIN=       0,             -675837,         0
##MAX=       1.6414764,     413623,          0
$$ Real data points
##PAGE= N=1
##DATA TABLE= (X++(R..R)), XYDATA
0@%%%qJ6j6J6k4M0n6O4p2R6j28J52j78K18k64L18l74M32n06N93o86P89r08J038
$$ 0 0 0 0 -8 8 -8 8 -16 24 -32 32 -40 56 -72 80 -98 120 -144 174 -200 232 -274 319 -367 422 -486 552
27E52j182J341j516J715j932K165k423K708l023L369l742M154m610N106n653O260
$$ 552 -630 711 -805 910 -1022 1143 -1280 1428 -1595 1774 -1968 2186 -2424 2682 -2971 3289
43C289o930P674q505R440j0502J1714j3108J4738j6673J9017k1925K5640l0581
$$ 3289 -3641 4033 -4472 4968 -5534 6180 -6928 7810 -8863 10154 -11771 13869 -16712
56a6712L7521m8050O6100j05257L26777k93302n60095P03795J56591m66578P4019
$$ -16712 20809 -27241 38859 -66398 260379 -32923 -593018 110777 267368 -199210 -125191
67a25191N26516l15565m78684K80794L71996k52380o1361K52721j88198m05220
$$ -125191 401325 85760 -392924 -112130 259866 7486 -53875 198846 10648 -394572
77c94572K67978M34395j56213k82527J25871L5052j93204Q4076K92972n0222k36041
$$ -394572 -126594 307801 151588 -130939 -5068 29984 -163220 -79144 213828 163606 -72435
88g2435k6339N4751l4494P8680J62498k7794j93456r3064P4212J40918O6099p9370
$$ -72435 -98774 -44023 -78517 163 162661 134867 -58589 -151653 -77441 63477 129576 50206
100E0206j06981n240J292k1057J10847J45494q8899j79552J972M3489j3115J38535
$$ 50206 -56775 -62015 -60723 -81780 29067 174561 85662 -93890 -91918 -48429 -61544 76991
112G6991J27607k33478k28528K25920K00580k09288m3057K89555j01355m12901
$$ 76991 204598 -28880 -257408 -31488 169092 -40196 -83253 206302 104947 -307954
122c07954J34477M28781j28036k92974J95358J10417l35167P327M47459l4010
$$ -307954 -173477 255304 127268 -165706 29652 140069 -195098 -187771 259688 225678
132B25678m16427P1133K63460k01577j28960L46096P2181l85879k4804L07743
$$ 225678 -190749 -119616 143844 -57733 -186693 159403 231584 -154295 -179099 128644
142A28644q3097j90751K41015J19150l66920j09547L68574P3141k78086M2544
$$ 128644 45547 -145204 95811 214961 -151959 -261506 107068 180209 -97877 -55333
152e5333K07839j59423j85996J95529J58975j49885p8217Q6428m2494o8640J29384
$$ -55333 152506 -6917 -192913 2616 161591 11706 -66511 19917 -22577 -91217 38167
163C8167R3413j19339q0361O1901J1512l7606M7068M9858m5396n8463j1017K4331
$$ 38167 131580 12241 -68120 -6219 5293 -32313 14755 64613 19217 -39246 -50263 -25932
175b5932O6227L7836o6482o1679L0571P723k8921O3966O0829r6536p4495Q9914
$$ -25932 40295 78131 11649 -50030 -19459 -11736 -40657 23309 84138 -12398 -86893 3021
187C021L6080p8907M5647R7168j14657j28193J27445J13113j10187l5488J14285
$$ 3021 39101 -39806 5841 103009 -11648 -139841 -12396 100717 -9470 -44958 69327
198F9327m9264j30429J02272J25482j20338p3935J27305j4866j51684R0206J75447
$$ 69327 20063 -110366 -8094 117388 -2950 -76885 50420 35554 -116130 -25924 149523
209A49523j20621j52658J29287Q2052j49426q208J67790m4561j62457P2001J16250
$$ 149523 28902 -123756 5531 87583 -61843 -70051 97739 53178 -109279 -37278 78972
220G8972r2519m3970J22190j6108j41282M8151J23339o7967p3628R3723K1564
$$ 78972 -13547 -57517 64673 48565 -92717 -44566 78773 10806 -62822 30901 52465
231E2465j14793J3241J15824k7644q0686M5121L0394p0076M300Q0819k1106o3638
$$ 52465 -62328 -49087 66737 39093 -41593 3528 33922 -36154 -31854 48965 27859 -35779
243c5779L4288K9340n1372L404O5492k0918o5453K0736L7367k4183k026L5070
$$ -35779 -1491 27849 -23523 -20119 45373 24455 -40998 -20262 17105 -7078 -9104 25966
255B5966j7600l6421K1338J7628k2732J1752K8040l3471l2138L9289K4563l1163
$$ 25966 8366 -28055 -6717 10911 -11821 -69 27971 -5500 -37638 1651 26214 -4949
267d949j87K4647k3584j9815L6326R122l5268J2808K8035l9548k3760N8306J7977
$$ -4949 -5136 19511 -4073 -23888 12438 21560 -13708 -900 27135 -12413 -36173 22133 40110
280D0110o0032l275N0435k1399m1005M0227K7669m9023q779M6443j6810l9143
$$ 40110 -19922 -23197 27238 5839 -35166 5061 32730 -16293 -25072 21371 4561 -34582
292c4582M2343L0590o0173j9007O3848J591n7837K1646M9315l8825l6576M7103
$$ -34582 7761 38351 -21822 -40829 23019 24610 -33227 -11581 37734 -1091 -37667 9436
304I436J8959m5629N756M0746k8208l3510M4060K3077n0622q279M9967r041m5901
$$ 9436 28395 -17234 -11478 29268 1060 -32450 11610 34687 -15935 -24214 25753 16712 -29189
317b9189K1945L7457k8771k5123K8345Q353k6148O459K1188j8253j4398K3258
$$ -29189 -7244 30213 1442 -23681 4664 13017 -13131 -6672 14516 -3737 -18135 5123
329E123O044k4973L802K4582q945k1018R840J4855p887n737N621l03o66N321l619
$$ 5123 11167 -13806 -10004 14578 5633 -15385 -5545 9310 1423 -4314 1307 1004 338 5659 2040
344B040o528R529O218j4349n668J4775L740j1982o51O359l739r43O078m922p617
$$ 2040 -4488 5041 11259 -3090 -8758 6017 9757 -2225 -2876 3483 -256 -1199 4879 -43 -7660
359g660R107M758j5316k477J9070L96j8813K042J6763k832j1491L682L714n064
$$ -7660 1447 6205 -9111 -11588 7482 7878 -10935 -8893 7870 5038 -6453 -2771 943 -4121
373d121K848O468o900k626J2269L47j4718K542J5944n712j6644N756J3692l997
$$ -4121 -1273 5195 -1705 -4331 7938 8285 -6433 -3891 12053 6341 -10303 -4547 9145 5148
387E148p808L333J568l154K855P67p891l23R329k897j1338N458J3705n360j3628
$$ 5148 -2660 673 2241 -913 1942 2709 -5182 -5505 3824 927 -10411 -4953 8752 3392 -10236
402a0236M139J2306k412j0009J19O335J967k388j518J346L499J933k992l601K079
$$ -10236 -6097 6209 3797 -6212 -6093 242 2209 -179 -1697 -351 3148 5081 2089 -1512 567
417E67L880k032n891L73P677L228p626n658P318P972p185j1509K574Q735j816
$$ 567 4447 2415 -3476 -3103 4574 7802 176 -5482 1836 9808 2623 -8886 -6312 2423 607
432F07o041L037O319k086n942j32L697K171j397n692k665P193R012k885q964J054
$$ 607 -5434 -2397 3922 1836 -4106 -4238 -541 1630 233 -5459 -8124 -931 8081 5196 -3768 -2714
448b714O622j040m812K727N111l150o046L04N279M061p55o396l838N266O346m277
$$ -2714 3908 2868 -1944 783 5894 2744 -3302 -2998 2281 6342 5587 -809 -4647 619 6965 2688
464B688q653J237N724k510m276N250P066l888p653K37M194r89j901J428N77n35
$$ 2688 -5965 -4728 996 -1514 -5790 -540 6526 2638 -5015 -4778 -584 -1573 -3474 -2046 -1469 -2004
480b004L959M091n358n569O632O227r624q175J1518J0493j0395r499J0841P770
$$ -2004 1955 6046 688 -4881 1751 7978 -1646 -9821 1697 12190 1795 -7704 3137 10907
494A0907j2402p109J2493N892j1337m344N080k270j021R997p98j4963K767J8028
$$ 10907 -1495 -8604 3889 9781 -1556 -5900 -820 -3090 -4111 5886 5088 -9875 -7108 10920
508A0920o655j9498J0480J8589j8195j8994K3698K2484j9593j7033J5819O715
$$ 10920 4265 -15233 -4753 13836 -4359 -23353 345 22829 3236 -13797 2022 8737
520H737j5330K090J4239q644j0374J4385N652j6555L723J9642j3047k4781J6058
$$ 8737 -6593 -4503 9736 1092 -9282 5103 10755 -5800 -2077 17565 4518 -20263 -4205
533d205K4777j7785k0779J8807J3457k0678o960K0699K230j8327K055J2904p800
$$ -4205 20572 2787 -17992 815 14272 -6406 -13366 7333 9563 -8764 -6709 6195 -1605
546a605r945J0731P047j0177k124J1712R65j0734J05R472o50r459j484P708M173
$$ -1605 -11550 -819 6228 -3949 -6073 5639 6604 -4130 -4025 5447 4797 -4662 -6146 1562 5735
561E735k775l09L781m233q269L405R782m421p920O186K987j2266K310K0629m409
$$ 5735 2960 2651 6432 2199 -6070 -2665 7117 2696 -5224 962 3949 -8317 -6007 14622 10213
576A0213k6865M269K4473r154j9617J7636J5897k5347j3040K7176J0340k0651
$$ 10213 -16652 -12383 12090 2936 -16681 955 16852 -8495 -21535 5641 15981 -4670
588d670J078J3044j6180q524K6374M447k8960M821K9771j6534k8625K8210K7558
$$ -4670 -3592 9452 -6728 -15252 11122 15569 -13391 -8570 21201 4667 -23958 4252 31810
601C1810l3417k4037K9370J0929k4916M207K2909j4161j8233J7809O030k0793
$$ 31810 -1607 -25644 3726 14655 -10261 -6054 16855 2694 -15539 2270 8300 -12493
613a2493Q405K3692k0357k7062K2579K3486j8828q618J8784n084k1867J0982J9428
$$ -12493 -4088 19604 -753 -27815 -5236 18250 -578 -9196 9588 4504 -17363 -6381 13047
626A3047q894p336Q952q486j3408J9220J9851j6241j5882Q144M87p635J2327J2987
$$ 13047 4153 -3183 5769 -2717 -16125 3095 22946 6705 -9177 -1033 -546 -8181 4146 17133
640A7133j3984j3561N053J823J090J5366J537k4068p855J6394K381n903J2725
$$ 17133 3149 -10412 -5359 -3536 -2446 12920 14457 -9611 -17466 -1072 1309 -4594 8131
653H131M057k3788p871K0436Q405n982L721n128k0177N264K5827l045j3477J2629
$$ 8131 12188 -11600 -19471 965 9370 3388 7109 1981 -18196 -12932 12895 9850 -3627 9002
667I002J417k9295J487L7294Q46k7962L520Q770k0440M355L5939o379l6587R459
$$ 9002 10419 -18876 -17389 19905 20751 -7211 -3691 5079 -15361 -11006 24933 18554 -18033 -8574
681h574K0126k5193n745M4916J908n2230k187L8058q552j5583L2810L504n1572
$$ -8574 11552 -13641 -19386 25530 27438 -24792 -26979 11079 2527 -13056 19754 23258 -28314
694b8314k074N0680n324l3654K6324K1795m9003k0090N6702K0885m2271p861K1656
$$ -28314 -30388 20292 14968 -18686 7638 29433 -19570 -39660 17042 37927 -4344 -12205 9451
707I451j8323j2970L7876J3419l6432o350K1824j5875j5089L8538J9212m4250
$$ 9451 -8872 -21842 16034 29453 -6979 -13329 8495 -7380 -22469 16069 35281 -8969
719h969k4343L0732J3903j5752N855J3408j6701j8022R448J3504O465M165j2038
$$ -8969 -33312 -2580 11323 -4429 1426 14834 -1867 -19889 -10441 3063 9528 13693 1655
732A655j9637N370J8135J216j052O452j1224j8276R993J6766l527J470O811k2899
$$ 1655 -17982 -12612 5523 6739 5687 12139 915 -17361 -7368 9398 5871 7341 14152 -8747
746h747j9174L1847K4572k9444j2366K8365j1537l8866K8078M6961l0884l9529
$$ -8747 -27921 3926 28498 -946 -13312 15053 3516 -35350 -7272 39689 8805 -30724
758c0724L0473J5185l9157R738N2250k2199n4265K6201L8151l2826j3267M7560
$$ -30724 -251 14934 -24223 -14485 37765 15566 -38699 -12498 25653 -7173 -20440 27120
770B7120l930n6025J1609M8599j8581k6471L3467N544m9638M942N4379j0789m2738
$$ 27120 23190 -32835 -21226 27373 8792 -17679 15788 21332 -28306 -23364 31015 20226 -22512
783b2512K0798K5531l6035j6341M3974J2840l7657p664K0975n488q134J8017L081
$$ -22512 -1714 23817 -12218 -28559 15415 28255 -9402 -17066 3909 -1579 -9713 8304 11385
796A1385j9912n20J0917p095p64J7916j307k0657j762J2926K735O62J586p936
$$ 11385 -8527 -9047 1870 -5225 -5989 11927 10620 -10037 -11799 1127 3862 4524 6110 -1826
810a826l189Q445l611p652J7552J0390k9034j2855L1595Q526l0291L761K8338
$$ -1826 -5015 3430 -181 -7833 9719 20109 -8925 -21780 9815 18341 -11950 -8189 20149
823B0149j7617k7952K5400K1137k7359p708K7533j0553k8945K5712K6902l3942
$$ 20149 2532 -25420 -20 21117 -6242 -13950 13583 3030 -25915 -203 26699 -7243
835g243j7672L8848K844m1594J1534M2521k0618l5759K6471K2269l0258n667L3884
$$ -7243 -24915 13933 16777 -24817 -13283 29238 8620 -27139 -668 21601 -8657 -14324 19560
848A9560o921l3218J5705K5388k2101j3617K7238K858k9088L008K4176p313j4462
$$ 19560 12639 -20579 -4874 20514 -1587 -15204 12034 14892 -14196 -11188 12988 5675 -8787
861h787J0511K629j3767N699J2493j0430p690J3172Q23j4892N070J3784o373q246
$$ -8787 1724 4353 -9414 -3715 8778 -1652 -9342 3830 4653 -10239 -5169 8615 2242 -6004
875f004N918Qm103R103J788j4327L137J7635r315j7658J5354J5648j9252j1078
$$ -6004 -86 -78 -4181 4922 6710 -7617 -4480 13155 3840 -13818 1536 17184 -2068 -13146
889a3146J9767L569j7805N140J2932j3244o966J8013j961k1127J1087K1386j9081
$$ -13146 6621 10190 -7615 -2475 10457 -2787 -9753 8260 6299 -14828 -3741 17645 -1436
902a436j9568K3767J3769k5155n636K4137k233k1034R347J5925j3518p701J6295
$$ -1436 -21004 2763 16532 -8623 -14259 9878 7645 -13389 -4042 11883 -1635 -9336 6959
915F959j170j6464R770J6217j4349j3177J5659P443j5204j222J3480l406j0229
$$ 6959 5789 -10675 -905 15312 963 -12214 3445 10888 -4316 -5538 7942 4536 -5693
928e693N018M839n468J043L812p280l138J0803Q42j0590J869P914n151m894P278
$$ -5693 -675 4164 -1304 -261 3551 -3729 -6867 3936 4778 -5812 -3943 3971 -1180 -6074 1204
943A204J272o938L667M672p841o83J1872k647j3707O777J3563r363j0770J1582
$$ 1204 2476 -4462 -795 3877 -3964 -4647 7225 4578 -9129 -2352 11211 1848 -8922 2660
957B660O724j2323j853J1124l147q747Q129M479j1359q12J2120m584j2666Q697
$$ 2660 9384 -2939 -4792 6332 3185 -5562 2567 7046 -4313 -5125 6995 2411 -10255 -1558
971a558J1587j1245r776J1537N967j0226j435Q297l181n943O344L517o695P44
$$ -1558 10029 -1216 -10992 545 6512 -3714 -5149 3148 -33 -5976 368 3885 -2810 -2066
985b066P006m865o994Q712P355q691o427P180M352n579j363L909n82k029M03k93
$$ -2066 4940 75 -6919 1793 9148 457 -5970 1210 5562 -17 -1380 2529 1947 -82 321 28
1001B8k01K560p55n395Q7N835P7m853j24K860m30p99N8j623P15M043j136n268
$$ 28 -173 2387 1632 -3763 -3676 2159 2236 -2617 -2741 119 -311 -1110 -1052 -2675 -1960 2083 947 -4321
1019d321K561O598l113o881M212P079m242o152L803M704k661j525J508j754q49
$$ -4321 -1760 4838 1725 -5156 -944 6135 1893 -4259 -456 4248 1587 62 1570 -184 -1033
1034a033L977L71n735j2N812j749o539K944P051l506p621K340O049r08l732M41
$$ -1033 2944 3315 -2420 -2432 3380 1631 -4908 -1964 5087 1581 -6040 -3700 2349 1441 -2291 -1850
1050a850L45l44J990P79k533M10L464j358m172K502N769k274n927J383N195L26
$$ -1850 -1505 -1849 141 920 -1613 -1203 2261 903 -3269 -767 5002 2728 -3199 -1816 3379 3705
1066C705l311q29P53J088O21k118j697K397K196l592k931M048L475m566l897L183
$$ 3705 394 -435 318 1406 2027 -91 -1788 609 2805 -787 -3718 330 3805 -761 -4658 -1475
1082a475L281k268j765N40K03R35J936k255k607L622L706m521l305N680L500o174
$$ -1475 1806 -462 -2227 -1687 -1484 -549 1387 -868 -3475 147 3853 -668 -3973 1707 5207 -967
1098i67k684N698K428l853j666J823K03N41N49k351j845L073J547m052j239N043
$$ -967 -3651 2047 4475 622 -1044 779 982 1523 2072 -279 -2124 949 2496 -1556 -2795 2248
1114B248k2n393l51M279R4k414J4j13j96K820P00m152p55N169O76n417J073N299
$$ 2248 2226 -3167 -3518 761 855 -1559 -1545 -1658 -1854 966 1666 -2486 -3241 1928 2604 -2813 -1740 3559
1132C559j383m464J852L397j646l76P97k471o07N048L83p254n55P344j67p006
$$ 3559 2176 -2288 -436 2961 1315 939 1736 -735 -1342 3706 4089 -3165 -3720 3624 3457 -3549
1148c549M18O331j448n322M92L515M42j048j908j474K801M370l522n433L824O139
$$ -3549 -3131 3200 1752 -3570 -3078 437 879 -169 -2077 -3551 -750 3620 98 -5335 -1511 4628
1164D628l860n183M199M848l201l705K042K109M74j73k845j422M515K696o193
$$ 4628 768 -4415 -216 4632 1431 -2274 -232 1877 2351 2178 -667 -2089 2426 5122 -1071
1179a071l857P033L247p241l414P236K220o915j506N420K56m233P07K336j000
$$ -1071 -4928 2105 5352 -1889 -5303 1933 4153 -2762 -4268 1152 1408 -2825 -2118 218 -782
1194g82o30J909p60k286J863K928j816k357J421K730j365j780J548K024j281k332
$$ -782 -1412 497 -263 -2549 -686 2242 426 -1931 -510 2220 855 -925 623 2647 1366 -966
1210i66J277J623m51j491Q31P1j658L66K399j035l795J640L788k580m620L203
$$ -966 311 1934 1483 -8 823 894 -764 -398 2001 966 -2829 -1189 2599 19 -4601 -1398
1226a398N087m043n476M527N217m159m410L814L579k886j883K424N29o79J508
$$ -1398 3689 -354 -5830 -1303 3914 -245 -4655 -841 2738 -148 -2031 393 922 243 1751
1241A751n04l353K406M903l502o452M518P895o318q410P217Q344p957q171P524
$$ 1751 1247 -2106 300 5203 1701 -4751 -233 7662 1344 -7066 151 8495 538 -7633 -109
1256a09O336p462m485O922J101n856J710M598n054k317P861L8j0268K584J2736
$$ -109 6227 -1235 -5720 1202 2303 -3553 -1843 2755 -2299 -4616 3245 3283 -6985 -4401 8335
1271H335m720j3353P074J3025q689j0755J0338Q612j1914m693J1943R24j0879
$$ 8335 3615 -9738 -2664 10361 1672 -9083 1255 9867 -2047 -6740 5203 6127 -4752
1284d752K825R365o914p860J0031N360j2064l386J2216P31j2470J674J1281l653
$$ -4752 -1927 7438 524 -7336 2695 8055 -4009 -7395 4821 5552 -6918 -5244 6037 2384
1298B384r698M805O998n247l973O014J520p040Q09P920j812p577L332P910m593
$$ 2384 -7314 -2509 4489 -758 -4731 1283 2803 -4237 -3428 4492 2680 -4897 -1565 6345 1752
1313A752q273O225R617o805j0221O555R549o980p494P905N234r925l157J0401
$$ 1752 -6521 -296 9321 2516 -7705 -1150 8399 1419 -6075 1830 7064 -2861 -6018 4383
1327D383n53r490M539P736j0534o111J5922L844j9417q41K0814l975k0676R679
$$ 4383 3830 -5660 -1121 6615 -3919 -10030 5892 9736 -9681 -10522 10292 6317 -14359 -4680
1341d680J9782j3778j6822J6841J1528j7890l532J8570m038j8029J1035J5468
$$ -4680 15102 1324 -15498 1343 12871 -5019 -8551 10019 5981 -12048 -1013 14455
1353A4455j6168j0797K0698M693k3693M25K3948m977k1773Q837J6609j2318j1781
$$ 14455 -1713 -12510 8188 12881 -10812 -10387 13561 8584 -13189 -4352 12257 -61 -11842
1366a1842J4373O591j4741j662J2280l053j0222P590Q323r715o483R500N500q212
$$ -11842 2531 9122 -5619 -7281 4999 1946 -8276 -686 7637 -2078 -8561 939 6439 -1773
1380a773l262P014K836o294k777N779M397m878n267M667M728n325k965O667K15
$$ -1773 -5035 1979 4815 -1479 -4256 1523 5920 1042 -4225 442 5170 -155 -3120 3547 3762
1395C762q212K069R309o230q760J0011O147j3957l171J6493r10j8008N466J7452
$$ 3762 -4450 -2381 6928 698 -8062 1949 8096 -5861 -9032 7461 6551 -11457 -5991 11461
1409A1461j0198j4207J4244Q870j6783j992J8469m688j6942J0412J3756j5628
$$ 11461 1263 -12944 1300 10170 -6613 -8605 9864 5176 -11766 -1354 12402 -3226
1421c226p373K0343J028k2643M646K1317r285j6724J3674J0205j7288m568J8221
$$ -3226 -10599 9744 10772 -11871 -7225 14092 4807 -11917 1757 11962 -5326 -9894 8327
1434H327j614j5386O919R515j2037m939J5647O07j5773K863J2667o847q551J0116
$$ 8327 6713 -8673 -1754 7761 -4276 -9215 6432 7039 -8734 -5871 6796 -51 -8602 1514
1448A514N510r857k065O322j617j277O162k065p897M236O556o210k839R461Q5
$$ 1514 7024 -2833 -4898 1424 -193 -1470 4692 2627 -5270 -1034 5522 -688 -3527 5934 6019
1463F019j1209P85Q288j774k424M520m009p579O545P377p544l883R606k212j2533
$$ 6019 -5190 -4405 3883 2109 -315 4205 196 -7383 -838 6539 -1005 -4888 4718 2506 -10027
1478a0027M566J3391l823q971L270J128m893N755P154p924n167Q325r32r311P343
$$ -10027 -5461 7930 4107 -4864 -1594 -466 -5359 396 7550 -374 -5541 2784 1852 -7459 -116
1493a16J2338r777j1444Q019N527o457L329P313r928p699J1395L460j1656M325
$$ -116 12222 2445 -8999 -980 4547 -1910 1419 8732 -1196 -8895 2500 5960 -5696 -1371
1507a371J2889j2114j4128J3842J1518j2635l649J1578o013j2297J2286J0945
$$ -1371 11518 -596 -14724 -882 10636 -1999 -5648 5930 -83 -12380 -94 10851
1519A0851j3993m219J5194n466j7419J3315J9386j5228j6029J5449O958j6274
$$ 10851 -3142 -7361 7833 2367 -15052 -1737 17649 2421 -13608 1841 8799 -7475
1531g475K540J8894p920j7948R648J1066j1534j605J5368n190j9499O899J7557
$$ -7475 -4935 13959 6039 -11909 -2261 8805 -2729 -4334 11034 5844 -13655 -6756 10801
1544A0801p512j0792R766L898j3840j625J4589J947r801j073L104k298K99N475
$$ 10801 3289 -7503 2263 6161 -7679 -9304 5285 7232 -2569 -3642 -538 -2836 -2537 2938
1558B938J279m788k545Q43K072K192j75K01P44m392m657P025Q964p494r290Q453
$$ 2938 4217 -571 -3116 -2273 -201 1991 1816 2017 2761 -1631 -6288 737 9701 2207 -7083 1370
1574A370N516j2566j153J6823j824j8283L680J4723q595r295J5488L974k0785
$$ 1370 6886 -5680 -6833 9990 8166 -10117 -6437 8286 -309 -9604 5884 9858 -10927
1587a0927l5K1935n809j8341J3248J5081k0782j1966K4912P987k3399j393K0743
$$ -10927 -10962 10973 5164 -13177 71 15152 -5630 -17596 7316 15303 -8096 -9489 11254
1600A1254p379j7102J4423J4072j7597q702J7893O37j7587P510J7136j3053j5776
$$ 11254 3875 -13227 1196 15268 -2329 -11031 6862 7499 -10088 -2578 14558 1505 -14271
1613a4271J4169J1802j4399n982J3907Q01j3958K054J1626l047p635L852L482
$$ -14271 -102 11700 -2699 -8681 5226 6027 -7931 -5877 5749 2702 -4933 -1081 2401
1626B401n884l26O893N27o742m78N932P73n173n46O529O42q090j357R639J732
$$ 2401 -3483 -3809 3084 3611 -3131 -3609 2323 3096 -2077 -2623 3906 4548 -3542 -4899 4740 6472
1642F472r670o43R161k143q810N093P559q066n478J0092J297j2142L170J3323
$$ 6472 -3198 -3841 5320 3177 -5633 -540 7019 -1047 -6525 3567 4864 -7278 -4108 9215
1656I215q035j3158J1305J1418j4259p397J5890L020j6132J418J5018n174j1482
$$ 9215 1180 -11978 -673 10745 -3514 -10911 4979 7999 -8133 -6715 8303 3129 -8353
1669h353R019P185j1910k208J3934j857j4049N848J2717r250r868J1438O746j2416
$$ -8353 666 7851 -4059 -6267 7667 5810 -8239 -2391 10326 1076 -8792 2646 9392 -3024
1683c024m147J1290J013r478J659O651m139l936N187J340n609N78N234k326m603
$$ -3024 -7171 4119 5132 -4346 -2687 3964 -175 -4111 1076 2416 -3193 -2615 2619 293 -4310
1698d310L247M607l400l898K312M075j052l506L08L856M58l934n40M044O48l885
$$ -4310 -1063 3544 144 -3754 -1442 2633 1581 -1925 -1617 2239 2697 -1237 -1777 2267 2915 -970
1714i70J65L066j578j738K835j43m060J253N038l497n417N217M817o817m187P234
$$ -970 -805 2261 683 -1055 1780 1637 -2423 -1170 3868 371 -5046 171 4988 -1829 -6016 1218
1730A218K881p255j073O462q91m845K862L181l975r00M902r35n426L604M818m190
$$ 1218 4099 -3156 -4229 2233 1342 -3503 -641 2540 -1435 -2335 2567 1632 -3794 -190 4628 438
1746D38m270M853L484m956j924M078Q59l210J52J471r42m51J475j062j900J896
$$ 438 -3832 1021 4505 -451 -2375 1703 2562 -648 -496 975 33 -418 1057 -5 -1905 -9
1762iJ478k430j560K181J372j878j041J035J140m25q12r3R06J190q79j451J334
$$ -9 1469 -961 -2521 -340 1032 -846 -1887 -852 288 -137 -949 -1042 -136 1054 175 -1276 58
1779E8J659p41j390N57J457l28j123m18M58P92N69j717j143K132J044k495j506
$$ 58 1717 976 -414 143 1600 1272 149 -269 189 981 1550 -167 -1310 822 1866 -629 -2135
1796b135K444J515k656j586J726J665j353q17O3N54O88J88j447n85K366J076k077
$$ -2135 309 1824 -832 -2418 -692 973 -380 -1197 -1134 -580 108 296 -1151 -1736 630 1706 -371
1813c71j721K617K322k609j884J803K273q85k319J14K000P08j487j786P43J641
$$ -371 -2092 525 2847 238 -1646 157 2430 1545 -774 -660 1340 2048 561 -1225 -482 1159
1829A159mk008r46J912J406j581k147R30K221m27k382k64K362Q23j478j194P94
$$ 1159 1155 -853 -1799 113 1519 -62 -2209 -1279 942 515 -1867 -2131 231 1054 -424 -1618 -824
1846h24J922k0j443n32J197J328q27j535R49J576o78j522L96J043J7p09l66j17
$$ -824 1098 1078 -365 -897 300 1628 801 -734 215 1791 1113 -409 -13 1030 1047 338 -28 -145
1864a45L14Q49o01j686L30J586m80j554M04J338o09j404O82J097l63m30j33kP26
$$ -145 169 1018 417 -1269 -939 647 167 -1387 -983 355 -254 -1658 -976 121 -242 -672 -805 -807 -81
1883h1P84k46j359O23J534o53j380J075J959j267k165J169J941o53k052J97J344
$$ -81 703 457 -902 -279 1255 602 -778 297 2256 989 -1176 -7 1934 1281 -771 -574 770
1900G70O09j437j189P91J284m47j981q6J958P63j999j773K116K290j685k638J078
$$ 770 1379 -58 -1247 -456 828 381 -1600 -1686 272 1035 -964 -2737 -621 1669 -16 -2654 -1576
1917a576L437j57l543l77L812M35k483m61J741L88q37o4j59L90J459p27k869p
$$ -1576 1861 1704 -1839 -2216 1596 2031 -452 -913 828 1216 379 315 156 546 2005 1278 -1591 -1598
1935a598L740M37m266r34M181L77m195L33L670j360l270K099J764k360o5L043
$$ -1598 2142 2579 -1687 -2621 1560 1937 -2258 -1925 1745 385 -2885 -786 978 -1382 -1447 1596
1951A596j001m325K507N035l389m334L944M259m435l006M747J867m377l75L818
$$ 1596 595 -3730 -1223 3812 423 -3911 33 4292 -143 -3149 1598 3465 -912 -1287 2531
1966B531j306l190L369J839n092j011O238l02p431J057Q333k528q459L022P758
$$ 2531 1225 -1965 1404 3243 -1849 -2860 3378 3076 -4355 -3298 5035 2507 -5952 -2930 4828
1981D828l958o329M565M798m964l158N413J073m942J592M466l710m155O567L304
$$ 4828 870 -5459 -894 3904 -1060 -4218 1195 2268 -2674 -1082 3384 -326 -4481 2086 5390
1996E390p723k112Q669Q66r573J260R600k743r677M012Q518n209o991O402M313
$$ 5390 -2333 -4445 4224 5090 -4483 -3223 6377 3634 -6043 -2031 6487 1278 -5713 689 5002
2011E002p143k455P718j52q066K294P703m626o980P143N789r176m215J0518K714
$$ 5002 -2141 -4596 3122 2970 -5096 -2802 4901 275 -6705 438 6227 -2949 -7164 3354 6068
2026F068j1196k22J1412j885j0485M639R383o908p572R157N169j0745k256J1566
$$ 6068 -5128 -5350 6062 4177 -6308 -1669 7714 806 -6766 2391 7560 -3185 -5441 6125
2040F125o31j2559L574J2374o683j1451R064R236j1293o950J2506L910j2965j38
$$ 6125 5494 -7065 -3491 8883 2200 -9251 -187 9049 -2244 -9194 3312 7222 -5743 -5881
2054e881J2067l733j1246P830R552j0846o595J2868L779j4810K95J6031l129j5705
$$ -5881 6186 2453 -8793 -963 8589 -2257 -8852 4016 7795 -7015 -6720 9311 6182 -9523
2068i523N455J4498q038j0996R924P960j2143m742J2492J809j1644J606J0206
$$ -9523 -4068 10430 2392 -8604 1320 9280 -2863 -7605 4887 6696 -4948 -3342 6864
2081F864o286r311R877Q168j1787o955J2645L858j3488n86J4395j895j4487L312
$$ 6864 578 -8733 1144 9312 -2475 -9430 3215 7073 -6415 -7001 7394 5499 -8988 -5676
2095e676J3201m872j0126P755O922j0310m607J2321K919j2437Q74J1783n352j1953
$$ -5676 7525 2653 -7473 282 7204 -3106 -7713 4608 7527 -4910 -4036 7747 2395 -9558
2109i558R310J2534j1226j1625J2208P387j3458k922J5043o30j6263L245J3694
$$ -9558 -248 12286 1060 -10565 1643 9030 -4428 -7350 7693 7063 -9200 -5955 7739
2122G739n971r957J0499O219j4934m134J7083J590j5942K591J4020p711j2807
$$ 7739 1768 -8189 2310 8529 -6405 -10539 6544 8134 -7808 -5217 8803 1092 -11715
2135a1715J1862J2304j2796q981J1601M061j1186J904J2069n689j2064O869R213
$$ -11715 147 12451 -345 -9326 2275 6336 -4850 -2946 9123 3434 -8630 -1761 7452
2148G452p955m800J0415J345j3492n39J3684M90j1446J157Q004m714o902P345
$$ 7452 -503 -5303 5112 6457 -7035 -7574 6110 6600 -4846 -3689 4315 -399 -7301 44
2162D4O956o756o146N351K399n017J673P417l425r248L348Q558l297n753O025
$$ 44 7000 244 -5902 -551 1848 -3169 -1496 5921 2496 -6752 -3404 5154 1857 -3896 2129
2177B129M442r804m393J0719N186r252k874P235k039p098N447P706o493p132O419
$$ 2129 6571 -3233 -7626 3093 8279 -973 -3847 3388 1349 -5749 -302 7404 911 -6221 198
2192A98K751p520K015J0005m502j1905M636J0367m963o357P271L038r771j679
$$ 198 2949 -4571 -2556 7449 2947 -8958 -4322 6045 1082 -5275 1996 5034 -4737 -6416
2206f416J0007J103o978J566L579n731j653Q834J951q394r72O289k056n076M950
$$ -6416 3591 4694 -2284 -718 2861 -2870 -4523 4311 6262 -2132 -3104 3185 1129 -3947 1003
2221A003N058n267n514L288L060j207K5J166k498k179J986J468l64M39L49k204
$$ 1003 6061 794 -4720 -1432 1628 421 446 1612 -886 -3065 -1079 389 25 464 813 -1391
2237a391j800J845K877L91j729j994M69J670N76p79Q54R43k162k142K167L108
$$ -1391 -3191 -1346 1531 1922 193 -1801 -1332 338 914 135 989 1932 -230 -2372 -205 2903
2253B903r46j748k31p30k48J959P85j866l55Q88j470j251K744K407l119k721J830
$$ 2903 1957 209 -22 -752 -1000 959 1744 -122 -477 411 -1059 -2310 434 2841 -278 -2999 -1169
2270a169J218q67R86Q88k028q36K001l69j338K829J666m545j605M679J621m162
$$ -1169 49 -818 168 1056 -972 -1808 193 -176 -1514 1315 2981 -1564 -3169 1510 3131 -1031
2286a031N83K876k109k652L125J938l361K16K613k677l223N071K850n968k347
$$ -1031 -448 2428 319 -2333 792 2730 -631 -415 2198 -479 -3702 1369 4219 -1749 -4096
2301d096N814M45n711J594N064k510m499L094K712l176j51L479j955l858L912
$$ -4096 1718 2163 -3548 -1954 3110 600 -3899 -805 1907 -1269 -1420 2059 104 -3754 158
2316A58L638m336k529M917J274m956l92M833K02m195P9K797l76j307M69N45j494
$$ 158 3796 -540 -3069 1848 3122 -1834 -2226 2607 2809 -1386 -1307 1490 1114 -193 276 821 -673
2333f73K40J147o86j353Q38J860j269k573R22L211k70l928N41L626m45l806J298
$$ -673 -433 714 28 -1325 -487 1373 104 -2469 -1547 1664 1394 -2534 -1993 1633 1188 -2618 -1320
2350a320L999j889l051K070K157k291j68K812j742l347L585L125m614k345N388
$$ -1320 2679 790 -2261 -191 1966 -325 -493 2319 577 -2770 815 3940 -674 -3019 2369
2365B369J206o626o2O872r49o335J822M190k589k632L561O88m015O95M032k327
$$ 2369 3575 -3051 -3113 3759 2810 -3525 -1703 2487 -102 -2734 827 1515 -2500 -1805 2227 -100
2381a00l177L797K254m357j844N129R07m241k19L733m35l033J120K422j422j400
$$ -100 -3277 520 2774 -1583 -3427 1702 2609 -1632 -1851 1882 1447 -1586 -466 1956 534 -866
2397h66J623M96j556P9J570q92j366O23Q85n51j180P04J463q24k064P06K172r09
$$ -866 757 1253 -303 -224 1346 454 -912 -289 596 45 -1135 -431 1032 208 -1856 -1150 1022 113
2415A13k031J244J628j457j274K027Q05j778m7J603p40j404K459J214l172r95
$$ 113 -1918 -674 954 -503 -1777 250 1055 -723 -770 833 93 -1311 1148 2362 -810 -1805
2431a805L777O09l968J09L820r97l368R51K762j257j617Q23K34j027J196N99k459
$$ -1805 1972 2581 -1387 -1278 2542 1545 -1823 -872 1890 633 -984 -161 73 -954 242 841 -1618
2448a618n08L303K07l427P3L374j1l179K31K592n4j575k28P87O63J76m76r97P27
$$ -1618 -2126 1177 1384 -2043 -1970 1404 1393 -1786 -1555 1037 983 -592 -820 -33 630 806 330 -667 60
2467F0J279l58j355K81R15K41j044m89O61O58p67j389M22J824l80j903l7J447
$$ 60 1339 981 -374 -93 822 1063 19 -470 191 849 82 -1307 -885 939 559 -1344 -1381 66
2485F6R4j015L73K35o27K67R92n97o82J048R49j719m30K444K85k290r7J901J68
$$ 66 160 -855 -482 -247 -874 -607 385 -212 -894 154 1103 -616 -1046 1398 1683 -607 -704 1197 1365
2504A365j420J78P81o65J6L85n68l29N78J51j345K81J268m56j598K38J283J37
$$ 1365 -55 123 904 239 255 640 72 -257 321 472 -873 -592 676 220 -1378 -1140 143 280
2522B80j095L0K22N90Mo20k74R19N89q76n49J532N47r16j076P27J069j79q09k08
$$ 280 -815 -785 -563 27 31 -589 -863 56 645 -231 -780 752 1299 383 -693 34 1103 924 115 -93
2542i3L72O28l15j059M67J128o38j514K18J648m07j019m61O23N09p3n83q09J052
$$ -93 279 907 592 -467 0 1128 490 -1024 -806 842 435 -584 -1045 -422 87 14 -569 -1378 -326
2561c26J184r47j443J030J710p82j752J288J342r30p22M58L89J25L28m07j298
$$ -326 858 -89 -1532 -502 1208 426 -1326 -38 1304 374 -348 110 499 624 952 545 -753
2578g53P43J813r97j883P55J629j127j083Q60R98j044j022L55N14K25R5p45q04
$$ -753 -10 1803 806 -1077 -322 1307 180 -903 -43 955 -89 -1111 -756 -242 -17 78 -667 -1471
2596a471Q46J444p16j247P22J190o63r20N42J224l22r54k6P96M79l06n88M4N45
$$ -1471 -625 819 103 -1144 -422 768 105 -815 -273 951 629 -325 -351 445 924 618 30 74 619
2615F19l20j69rQ3J13J7n82o80R03R62j419j054J311J181j839o74J413Q82j404
$$ 619 299 130 121 204 317 334 -248 -928 -25 937 -482 -1536 -225 956 -883 -1557 -144 738 -666
2634f66o39J272J98m25N62M27j545O48J276o64j103J410J289k057j672K428J533
$$ -666 -1305 -33 165 -260 302 729 -816 -168 1108 444 -659 751 2040 -17 -1689 739 2272
2651B272k067j437J761M12j351J31R54o81p13J020q18q70J359J476k190j759K156
$$ 2272 205 -1232 529 941 -410 -279 675 -6 -719 301 -517 -1387 -28 1448 -742 -2501 -345
2668c45J842j893j422J685J226j610p75J763Q76j368k76O42l45J98J009j05j597
$$ -345 1497 -396 -1818 -133 1093 -517 -1292 471 1347 -21 -297 345 0 198 1207 1102 -495
2685d95J20J567l65j532N20J957j291k190Q53K298o76j646L64P81r14l82J615
$$ -495 -375 1192 827 -705 -185 1772 481 -1709 -856 1442 766 -880 -516 265 -649 -1031 584
2702E84j78j562L83J088j238o68K694R36k965j427L014J296k370j19K462q51k824
$$ 584 406 -1156 -773 315 -923 -1591 1103 2039 -926 -2353 661 1957 -413 -532 1930 1079 -1745
2719a745J332K292o64j519J122n13k119J306L383j858l197J662J977k495j334
$$ -1745 -413 1879 1215 -304 818 305 -1814 -508 2875 1017 -2180 -518 1459 -1036 -2370
2734b370L730J440m355k027L603J487k153L65J537k144j736K667J843k068j42
$$ -2370 1360 2800 -1555 -3582 21 1508 -645 -280 1257 -887 -2623 44 1887 -181 -323
2749c23K020j767l000K998M077k264m148J713K721k267j048L427J047m435j600
$$ -323 1697 -70 -3070 -72 4005 1741 -2407 -694 2027 -240 -1288 2139 3186 -1249 -2849
2764b849L099R30j379J025M49l133j596L870J968k939p80K485j153l640K465M970
$$ -2849 250 1180 -199 826 1275 -1858 -3454 416 2384 -555 -1335 1150 -3 -3643 -1178 3792
2780C792j643m424M38K496q52o96L234M49m279j097L350N07j472K044J063m472
$$ 3792 2149 -2275 -1837 659 -193 -889 2345 2794 -1485 -2582 768 1275 -197 1847 2910 -1562
2796a562k579M571L425l185k419K303j31l783J564M957o38m871M6K014q69J09
$$ -1562 -4141 430 3855 670 -1749 554 423 -3360 -1796 3161 2523 -2348 -2302 -288 -1157 -1048
2812a048L725j94n549n53M851K80k656K106K387m681l575N225M515l466k913K176
$$ -1048 2677 2483 -3066 -3619 1232 1512 -1144 962 3349 -1332 -4907 318 4833 1367 -1546 630
2828F30j92k755K080M198k047l849J158J167k118J064M407j381o101rN058Q1k752
$$ 630 438 -2317 -237 3961 1914 -1935 -777 390 -1728 -664 3743 2362 -3739 -3748 1310 1391 -1361
2845a361J593J901l500l072L819L525k050j568P42q55j555K493L262j711l181
$$ -1361 232 2133 -1367 -4439 -620 2905 855 -713 29 -826 -2381 112 3374 1663 -1518
2860a518O66J367j371N09L577l3n027j610L825K149k141j35J294k385k352K323
$$ -1518 -852 515 -856 -347 3230 3197 -1830 -3440 385 2534 393 258 1552 -833 -3185 -862
2876h62L393j263k262K45l2j973J841M052j433m524N31L191q86j547L432R69m457
$$ -862 2531 1268 -994 -749 -781 -2754 -913 3139 1706 -2818 -2287 904 18 -1529 1903 2872 -1585
2893a585k171M533K002k420l65J449k062j906L556J898k784j043J864j011k321
$$ -1585 -3756 777 2779 359 -6 1443 -619 -2525 1031 2929 145 -898 966 -45 -2366
2908b366K013L849k178m193J231K522j151o40J682K44k224o52J493M26R4R29p51
$$ -2366 -353 3496 1318 -2875 -1644 878 -273 -913 769 1013 -1211 -1863 -370 56 150 1079 328
2925C28j975n6K530Q63j496o36P18j50r68L18K242L47k536j219J165J869k56q95
$$ 328 -1647 -1703 827 1690 194 -442 276 126 -842 -524 1718 2065 -471 -1690 -525 1344 1088 193
2943A93R4o21r85R08J483o14p78K25o16j429J714K501j222k975Q14K360q79j182
$$ 193 287 -334 -1319 -411 1072 458 -320 -95 -711 -2140 -426 2075 853 -2122 -1308 1052 173 -1009
2961a009J490Q59j915q09J870M29o77N63j32j637M19K163m17j644K86J183r73
$$ -1009 481 1340 -575 -1384 486 915 238 801 669 -968 -549 1614 1197 -447 -161 1022 49
2978D9j087J037J175j073q52l1L11N29M41o64o83N29J84n18r8J434J00j577l23
$$ 49 -1038 -1 1174 101 -751 -782 -471 58 499 -165 -848 -319 -135 -653 -751 683 783 -794 -1117
2997a117R30M22M47J87j066p11J281P62j426L82J403o15k242N80K519l67j557
$$ -1117 -187 235 682 869 -197 -908 373 1135 -291 91 1494 879 -1363 -783 1736 1369 -188
3014a88l40N82n63N20R18q59j064Q62K83j173K46K143p25k415M09J792K22q67
$$ -188 -528 54 -509 11 929 70 -994 -132 151 -1022 -776 1367 642 -1773 -1364 428 650 -217
3032b17q9N25m24j15M80Q0K39K64o34n45M05J122m87m69k0k8K15O4m35n9O84j24
$$ -217 -306 219 -205 -320 160 240 479 743 109 -436 -31 1091 604 135 115 87 302 366 -69 -128 556 432
3054D32j466m7J510M72j569l04J392l80j194Q24R04o89p12Q47l81m89J384O12
$$ 432 -1034 -1081 429 901 -668 -972 420 40 -1154 -330 574 -115 -827 20 -361 -850 534 1146
3072A146j565q99K189O27j850k24K012o32j882Q84J548p54p35N31k83p37R89O83
$$ 1146 -419 -1318 871 1498 -352 -576 1436 804 -1078 -194 1354 600 -135 396 113 -624 365 1048
3090A048j332j136J609L17j456l07J669K44j553o0J002K15m75j77M4O28L8k02
$$ 1048 -284 -1420 189 506 -950 -1257 412 656 -897 -957 45 260 -215 -392 -348 280 318 116
3108A16l99M80M16j40o52J99N54L9l6n07j34Q93j11j408N3J659j71j793L8J580
$$ 116 -283 197 613 473 -179 20 574 613 577 70 -64 829 718 -690 -637 1022 851 -942 -904 676
3128F76k19j132J26Q34o15k29O78l67l77N42N69j130j68J645K45j639l37J821
$$ 676 457 -675 -549 285 -330 -559 119 -248 -625 -83 486 -644 -812 833 1078 -561 -898 923
3146I23K09j765L78Q70q0o67K15L05k34K43K31r74k13J053K97j585kJ056L94j169
$$ 923 1132 -633 -255 615 535 -132 83 388 154 397 628 -346 -559 494 791 -794 -796 260 654 -515
3166e15k64N42N86n54m73J05M91J2k99m97Q30M67l26k77q5M73M11k33n53K83N01
$$ -515 -779 -237 349 -205 -678 -573 -82 -70 -369 -866 -36 431 105 -172 -257 216 627 394 -159 124 625
3187F25J88j018j60J074K21j502J82Q96J12j164P4O00k83J01j99r6j98N87K48
$$ 625 813 -205 -365 709 930 -572 -390 506 618 -546 -472 128 -155 -54 -253 -349 -547 40 288
3206B88j013r4J218q0r90j1J103K78j239J13R82j29m18K15M6J47M9l1m07j79N76
$$ 288 -725 -819 399 319 -671 -682 421 699 -540 -427 555 426 8 223 269 416 465 434 27 -152 424
3227D24K57q41k42O93K69q65m41N06M69l41n03J55N08q7n47l8N19J99k60j70Q0
$$ 424 681 -160 -402 291 560 -305 -746 -240 229 -112 -615 -460 48 -39 -586 -624 -105 94 -166 -336 -256
3248b56J20K28L11p02j29R88J40j136L20R10J79j308m3J095N6q16N7K70j85k5
$$ -256 -136 92 403 -299 -428 560 700 -436 -116 794 973 -335 -378 717 773 -43 14 284 99 74
3268G4J71o62k5P80L8j027k73J396j00j382n8J265K61j200J21N92L41n20K27k3
$$ 74 245 -417 -442 338 376 -651 -924 472 372 -1010 -1068 197 458 -742 -621 -29 312 -208 19 -4
3288dJ45K82L8m66l99J178K15r53n82R85O24j199n72J078N93j092l68L54M11m25
$$ -4 141 423 461 -5 -404 774 989 36 -546 439 1063 -136 -708 370 963 -129 -497 -143 268 -157
3308a57r4K4j36RK31o8k97K10N92l27j108O46J512n06j382M80J246n74o45O78
$$ -157 -251 -227 -363 -354 -123 -191 -488 -278 314 -13 -1121 -475 1037 531 -851 -371 875 301 -344 334
3328C34M82p17m67O13L62o86N14J96j015j97J322K02j493j11J185q6j689P39J393
$$ 334 816 99 -368 245 607 -79 435 631 -384 -581 741 943 -550 -661 524 438 -1251 -512 881
3347H81p19j272M96P84l96m17L71O9k92M70N54p08k10Q27K81j304k09J297Q22
$$ 881 162 -1110 -614 170 -226 -643 -272 -203 -495 -25 529 -179 -389 438 719 -585 -794 503 1325
3366A325j292n69R53M81j133j75J118o2q65q6K28o2J26N15n71r64O04Q90l36j033
$$ 1325 33 -536 417 898 -235 -410 708 646 -219 -305 -77 -139 -13 502 -69 -1033 -429 461 125 -908
3386i08P03Q37j193r25J578R69q65o39N2N29K1L28J63n42n93Q09K2n67N01J023
$$ -908 -205 632 -561 -1486 92 1061 196 -443 -391 138 159 487 650 108 -485 324 346 -221 280 1303
3406A303r74j446M09K072m05j360J16N23m36m29N43M73n6p91j59l2K75J041m74
$$ 1303 329 -1117 -708 1364 959 -401 -285 238 -198 -627 -84 389 333 -458 -617 -649 -374 667 193
3425A93p61q0N50J60j12N1P62l82r23k02J030Q01k55p32l62L1K31P19l28M36m15
$$ 193 -568 -648 -98 62 -50 1 763 381 -542 -744 286 1087 832 100 -262 -231 0 719 391 827 412
3446D12j086k55P15J380l57j057q45K9O07P65L54o09q12m7K58j95J271P96j109
$$ 412 -674 -929 -214 1166 809 -248 -1093 -1064 -457 308 662 53 -759 -806 -548 -743 528 1324 215
3465B15j746M37J583P28j057L84j34r89m30J448R27n64o76m60l86J71J572P53
$$ 215 -1531 -1094 489 1217 160 544 410 -579 -1009 439 1366 802 126 -334 -720 -549 1023 1776
3483A776j946r45J040K45r06M39J749p73k507j32K383K50q00L35L8j574n0J942
$$ 1776 -170 -1115 -75 170 -736 -297 1452 679 -1828 -1960 423 673 -127 208 246 -1328 -1378 564
3501E64O15j158L1L90j317p32K706J828k552k018J375J284j440L49K307j202k869
$$ 564 1179 21 52 442 -875 -1607 1099 2927 375 -1643 -268 1016 -424 -75 2232 1030 -1839
3518a839M20K399k69r81J044l30k561J95L385J63k772J67J921j715j517K868K367
$$ -1839 -1419 980 711 -270 774 444 -2117 -1922 1463 1626 -1146 -979 942 -773 -2290 578 2945
3535B945k916k591K107J600j807N11K262j264k865J366K429j275j221K399K6l827
$$ 2945 29 -2562 -455 1145 -662 -151 2111 847 -2018 -652 1777 502 -719 1680 1706 -2121
3551b121r9M254K55l426NK486j585k274K567K631k717k332J994J086j988Q47K551
$$ -2121 -2220 2034 2289 -1137 -1132 1354 -231 -2505 62 2693 -24 -2356 -362 724 -1264 -417 2134
3568B134j553l579J999L108j774k047L026P74m094p66M721J109m182q5K878j116
$$ 2134 581 -2998 -999 2109 335 -1712 1314 2088 -2006 -2772 1949 3058 -1124 -1209 1669 553
3584E53k599K564K558l232k179K806J045k920P11L610k244m183K312L852k404
$$ 553 -2046 518 3076 -156 -2335 471 1516 -1404 -693 2917 673 -3510 -1198 2654 250
3599B50l002L106J603l701q53M196M22l811M16L158j861k065K864J845l502j319
$$ 250 -2752 354 1957 -1744 -2597 1599 2021 -1790 -1374 1784 -77 -2142 722 2567 -935 -2254
3615b254L588P10l732P23L969j766l853J754L638k007k634K221J473l045o56L199
$$ -2254 1334 2044 -1688 -965 3004 1238 -2615 -861 2777 770 -1864 357 1830 -1215 -1871 1328
3631A328K90l271N94K333j372k353K703K125l268k228L914J410l418n80L749j93
$$ 1328 1618 -1653 -1059 1274 -98 -2451 252 2377 -891 -3119 795 2205 -1213 -1793 1956 1763
3647A763m141J171L743j558k797K135J580k800n19L477k46l716Q40L413j777k884
$$ 1763 -2378 -1207 2536 978 -1819 316 1896 -904 -1423 2054 1808 -1908 -1068 2345 568 -2316
3663b316K465K512l339k249L663J269l317m24L066n33l037J583K518j848j819
$$ -2316 149 2661 -678 -2927 736 2005 -1312 -1736 1330 797 -2240 -657 1861 13 -1806
3678a806K232J017k872K98L016o60l177R78L038j310k142J622J962k287j312J882
$$ -1806 426 1443 -1429 -1131 1885 1225 -1952 -974 2064 754 -1388 234 2196 -91 -1403 479
3694D79J369k079o23J779m97j672J073J645j317j730J518J360k125p77K515M52
$$ 479 1848 -231 -854 925 428 -1244 -171 1474 157 -1573 -55 1305 -820 -1597 918 1370
3710A370k650n13K793K0k185N65J537p97j160J258J093j749m29J903n04j771R90
$$ 1370 -1280 -1793 1000 1020 -1165 -600 937 140 -1020 238 1331 -418 -847 1056 552 -1219 -229
3727b29K375j847j952J654J789j924j254K137N69k246k29J775Oj501P50O48j184
$$ -229 2146 299 -1653 1 1790 -134 -1388 749 1318 -928 -1157 618 624 -877 -127 521 -663
3744f63m79J507J15j475L06J553o76j408R53J543j135j034N98J047n18o35P79
$$ -663 -1142 365 480 -995 -689 864 188 -1220 -267 1276 141 -893 -295 752 234 -401 378
3761C78K55n38k04M97p9r8J39K7p60J2M74M24q50l23N77N14j009l06J010M65j041
$$ 378 633 95 -109 388 309 211 350 377 -383 -371 103 527 -323 -646 -69 445 -564 -870 140 605 -436
3782d36l49P86J97o67O6P27m99k5M04J01n35K78Q74p45q73Q19R08q65o88P97M72
$$ -436 -785 1 198 -469 -403 324 -175 -200 204 305 -230 48 922 177 -696 123 1031 166 -522 275 747
3803G47r97k79R05k6o57lJ42j68K98L16l33n92L06N20m81r7N4M74k45k18J66K08
$$ 747 -250 -529 376 350 -307 -310 -168 -336 -38 278 -55 -647 -341 179 -302 -399 -345 129 -116 -334 -168 40
3825D0J29l18j8L2P08k39o79J83J008m52m55J8M56k30j35J51k72J80L79l32p46
$$ 40 169 -149 -167 -135 573 334 -345 -162 846 394 -61 -43 413 183 48 199 -73 107 486 154 -592
3846e92K23P72j80j147M46Q46k73o82K58L04j76M2Q1j56J70K85k19m75L55O82
$$ -592 -369 403 223 -924 -478 368 95 -587 -329 -25 -201 -159 -78 -234 -64 221 2 -473 -118 564
3866E64m52n40L93O74l41m05M0K55P2j39k22K65q0J19m40L4L17J62l89j50J51
$$ 564 112 -428 -35 639 298 -107 -67 188 260 121 -101 164 84 203 -237 -203 114 276 -113 -263 -112
3887a12pN4k99JR0O57m12l64L8O11p8p42N27N56p2o60o1P76k08k91K52j58k32
$$ -112 -119 -65 -364 -363 -273 384 -28 -392 -354 257 179 -563 -36 520 448 -212 -273 503 295 4 256 98 -134
3910a34M44j38l12l19Q54l56o56J37J001j32q29l0N56K3m46LJ42L8J58O7l04m7
$$ -134 310 172 -140 -459 395 39 -617 -480 521 389 -440 -470 86 109 -337 -334 -192 -154 4 71 -233 -280
3932b80L64J7m37J06O02K1n04q4P06J8n35l51O40L94m26l71K12J54k35j39J92
$$ -280 84 101 -336 -230 372 393 -111 -195 511 529 -6 -357 283 677 251 -120 92 246 11 -128 64
3953F4L7j57j90j63j2L29M18n30m36N5Q98q0q16L54M94k57n85N35N39k90k96P3
$$ 64 101 -56 -246 -409 -421 -92 326 -204 -640 -585 313 233 -583 -229 265 8 -577 -42 497 207 -89 -16
3975a6K63j89K03O9n66j53R51k25m83p1N82P0r47J1Q53k91l77Q7M17k65k47L76
$$ -16 247 58 261 330 -236 -389 562 337 -146 -217 365 435 -512 -501 352 61 -316 -229 188 -77 -324 52
3997E2k12k54L83J93n15j69Q47L31r32m01Q02O66r76o4O02R1m59k39M87K18k94
$$ 52 -160 -414 -31 162 -353 -522 325 656 -276 -677 125 791 -185 -249 353 444 -15 -254 233 451 157
4018A57j55N6j92n2P17l44o67K37N62m58q12Q65P80q24r73J010P94q47l15N17
$$ 157 2 58 -134 -186 531 187 -480 -243 319 -139 -951 -86 694 -130 -1103 -93 701 -146 -461 56
4038E6J84q11M55L79k95QK94J54p27J51J135k58j258L35J111o16q25P33N62o75
$$ 56 240 -571 -116 263 -32 -24 270 424 -303 -152 983 725 -533 -198 913 297 -528 205 767 92
4058I2m77K41M30o15K84M10o24n80O92Q04q61m35P16J89j139J65J315j07j067
$$ 92 -385 -144 286 -329 -45 365 -259 -839 -147 657 -204 -639 77 266 -873 -708 607 500 -567
4077e67J4Q85R7o96L56P21q85l64P13n9n47O30O75j118q34J312J053j251j186
$$ -567 -553 332 429 -267 89 810 -75 -439 274 215 -332 298 973 -145 -979 333 1386 135 -1051
4096a051J199M49j168j62J363r7j383K11Q55n26j35R01J25j375oJ456l32q71O44
$$ -1051 148 597 -571 -733 630 533 -850 -639 216 -310 -445 456 581 -794 -800 656 324 -547 97
4115I7R40j150j066J274J101j083p12R08K9o14J31J118l62j254O17M85j009r2
$$ 97 1037 -113 -1179 95 1196 113 -599 309 338 -276 -145 973 611 -643 -26 459 -550 -642
4133f42J461j47j609j26J539j64j028N59P66r20q87P22J235n89o31M46k59l20
$$ -642 819 672 -937 -1063 476 312 -716 -157 609 -311 -1198 -476 759 170 -461 -15 -274 -594
4151e94O87J034q07q69M94P20j032k9J642k09j824k37J341L04o19J72L35q78o52
$$ -594 93 1127 320 -549 -55 665 -367 -396 1246 1037 -787 -1024 317 621 2 174 509 -369 -1021
4170a021J179L79q80J7N84q22p36J331J003j093q53O05N62p97J93J339k11j388
$$ -1021 158 537 -343 -326 258 -564 -1300 31 1034 -59 -912 -307 255 -542 -349 990 779 -609
4188f09j78J125N6p9M52k41j047k04J126K81p58L74M07j207n43J166J171q61j071
$$ -609 -787 338 394 315 767 526 -521 -725 401 682 -76 298 705 -502 -1045 121 1292 431 -640
4207f40K54J65k35L08N63j51r25J75K37k56N97O49m07j370K02J263Q6n21J53M32
$$ -640 -386 -221 -456 -148 415 264 -661 -486 -249 -505 92 741 334 -1036 -834 429 515 -6 147 579
4227E79r83m63J040Q31o32l00j90k44k4Q48M85r97n33L70J80n96N36J186p65j417
$$ 579 -404 -867 173 1004 372 72 -118 -362 -386 462 947 -50 -583 -213 -33 -629 -93 1093 328 -1089
4247a089R1J387k9l97K75j95r44K07J010K36l42j0O7q55p2J265P42j411o07P55
$$ -1089 -998 389 360 -37 238 43 -901 -694 316 552 210 200 267 -588 -660 605 1347 -64 -671 84
4267H4K97o58L64J116r02j000J40R67l47L9N25p23j175P95J240n82p02O10L47
$$ 84 381 -277 87 1203 301 -699 -559 408 61 100 625 -98 -1273 -478 762 180 -522 88 435
4286D35j386m02J759N91r76q27Q69mo67R38O31r33l76O47J10r78Q69J058r51j459
$$ 435 -951 -1353 406 997 21 -806 63 59 -608 330 961 28 -348 299 409 -569 300 1358 407 -1052
4306a052Q95J184o30j034R21N08j490l22J599J79j160J56M13n51m38J080M81j433
$$ -1052 -157 1027 397 -637 284 792 -698 -1020 579 758 -402 -246 167 -384 -822 258 739 -694
4324f94l26J384J73j324O28J161m90j611P55J248n49p25Q90K48j063j43J151Q
$$ -694 -1020 364 537 -787 -159 1002 512 -1099 -344 904 355 -370 520 768 -295 -438 713 721
4342G21j296L85R29q72p54J317Q29j875o84J740J88j702L53J557l21j777P10J232
$$ 721 -575 -190 739 -133 -887 430 1259 -616 -1300 440 628 -1074 -721 836 515 -1262 -552 680
4360F80o55n10Q96j71r74K11J379m16j145O43J057j140o69J468O09j407p64J432
$$ 680 25 -485 411 240 -734 -523 856 440 -705 -62 995 -145 -814 654 1263 -144 -908 524
4378E24K43r95j80Q55l58q71P93O05p26o66J114r6j272L04J492n46j261O71Q47
$$ 524 767 -228 -408 447 89 -782 11 616 -110 -776 338 242 -1030 -726 766 220 -1041 -370 477
4397D77m68r02P97Q72q59l70Q83j5o32J8J030p36n08Q04N11j029m59J134J67j304
$$ 477 9 -893 -96 776 -83 -453 430 415 -217 -199 831 95 -413 391 902 -127 -586 548 715 -589
4417e89N8J284k2j345K25Q22l93p80O71N43q15k53P46p1o38L20O54n48n99R61
$$ -589 -531 753 731 -614 -389 433 40 -740 -69 474 -341 -594 152 81 -557 -237 417 -131 -730 231
4437B31N70o53q77R19O77j140j65R17O2q80J20O73k63j96L86p1o85R5R88m65o91
$$ 231 801 148 -729 190 867 -273 -438 479 541 -339 -219 454 191 -5 381 310 -375 -280 708 243 -448
4458d48K95O16n78o70Q88M59q59m81M37O22l93m6J67k87L22j37J48J27l11K72
$$ -448 -153 463 -115 -785 103 562 -297 -778 -341 281 -112 -158 9 -278 44 -93 55 182 -129 143
4478A43J57o24J95P67j18p46j37O31L11j000K01Q42k61n09j85J11K15j59K87M1
$$ 143 300 -324 -129 638 520 -226 -363 268 579 -421 -220 622 361 -148 -333 -222 -7 -166 121 162
4498A62o58M31o8n9l35N66L28p47l12J047O6o62k50O46K23l83J47J81j85l7O4
$$ 162 -496 -65 -133 -192 -527 39 367 -380 -692 355 421 -241 -491 155 378 -5 142 323 138 101 165
4519A65k0k00J57N8j32k87L31M84n28j84J59K12l86k19J15L34M6k81qJ5J70N4
$$ 165 145 -55 102 160 28 -259 72 556 28 -156 3 215 -171 -390 -275 59 105 -176 -184 -169 1 55
4541E5l59K41M5J34l31m4R9L77q8l3l34N78J68m76k09M12K27m78k80L98K58l70
$$ 55 -304 -63 -18 116 -215 -259 -160 217 129 96 -238 340 508 32 -177 235 462 -16 -296 102 360 -10
4563a0j28J13j56M3K09k61k63K29L10k18k58K27L81l60k25K68K59O6m27P1K90
$$ -10 -138 -25 -181 -138 71 -190 -453 -224 86 -132 -390 -163 218 -142 -367 -99 160 226 -201 -130 160
4584A60J46k29j19J53j36L08k16j01J11K94k65k23L58l3j18r9k6J89j02o3k37
$$ 160 306 77 -42 111 -25 283 67 -34 77 371 106 -117 241 208 90 -9 -35 154 52 -11 -248
4605b48K50O8L7m40R2J50O2p7M2J64J78k81j73J13m6M29k17k70L65R6Ok57M0K05
$$ -248 2 70 107 -333 -241 -91 -29 -106 -64 100 278 -3 -176 -63 -109 320 103 -167 198 294 300 43 83 288
4629B88J86n98O5L02q2l61J34j47K30%k54n2Q5L33j62l92J56K64j4K2m43L47J54
$$ 288 474 -124 -59 243 161 -200 -66 -213 17 17 -237 -289 -204 129 -33 -425 -269 -5 -19 3 -440 -93 61
4652F1q6j55J21K89r5l90J57O03k21k82j25K81o4J49r6j7l01J21J20m22L5M39
$$ 61 -25 -180 -59 230 135 -255 -98 505 284 2 -123 158 94 243 147 130 -171 -50 70 -352 -317 122
4674A22J18n63J4N79j79m82K1O47m2l44m1mm0M31l54Q3p0L77J54n00n7M63K72
$$ 122 240 -323 -309 270 91 -391 -370 277 235 -109 -150 -154 -194 237 -117 -34 -104 273 427 -73 -130 333 605
4697F05p63L8M57J46m72j38J35L24l85L4P3L0k87K76n5k89J22L70m62l09N74K93
$$ 605 -158 -120 337 483 11 -127 8 332 -53 -19 54 84 -203 73 18 -271 -149 221 -241 -550 24 317
4719C17m73n84O01L52m66j40N13J43n75P6N20k97n9K94J42n44L6P18o2q70J48
$$ 317 -156 -740 -139 213 -253 -393 120 263 -312 -236 284 -13 -72 222 364 -180 -144 574 512 -358 -210
4740b10P12j50p70R6R05l50o20L01L02l05k24M38j73l31K45L51l60k69N90K43
$$ -210 502 352 -418 -322 583 233 -387 -86 216 -89 -313 125 -48 -379 -134 217 -143 -412 178 421
4760D21p99n6R21n3q47O9Q65J5q33K16P57m04n05N64J5o71K56P44o90n93O25N62
$$ 421 -378 -434 487 434 -413 -344 521 536 -297 -81 676 272 -233 331 346 -325 -69 675 -15 -608 17 579
4782E79o41n60P62M33r12n45J227J07r86R3O64j75n56O08K13n05j95Q94j56q49
$$ 579 -62 -622 140 573 -339 -884 343 450 -536 -443 221 46 -510 98 311 -194 -389 505 349 -500
4802e00N38J019p38j140Q48P21m81q08O66O11q98m06Q45L09p87J3N80n25n05P15
$$ -500 38 1057 319 -821 27 748 267 -541 125 736 -162 -568 277 586 -201 -188 392 -133 -638 77
4822G7L94q41k48R53J33j323M35J067l06j365N60R47l15n31M46M44q71n6R39j13
$$ 77 471 -370 -618 335 468 -855 -420 647 341 -1024 -464 483 168 -363 83 527 -344 -400 539 426
4842D26q60N65O13q60p75J444O18j433n03J101K41j344K02J318k77j167K81P65
$$ 426 -434 131 744 -116 -891 553 1171 -262 -765 336 577 -767 -565 753 476 -691 -410 355
4860C55o33l29Q50J01j109O6J230l73r08P51Q15j171o75J084Q03q35o94J083J08
$$ 355 -278 -607 243 344 -765 -699 531 158 -750 1 816 -355 -1030 54 857 22 -672 411 519
4879E19j099K43J041k58j179P48M68o54j51J021J09j683K40J188k26j087N94R14
$$ 519 -580 -337 704 446 -733 15 483 -171 -322 699 808 -875 -635 553 327 -760 -166 748
4897G48q79p79Q72P91q20l19M76k69l77M44R09n90q93P37M20j028M22P55L29j503
$$ 748 -131 -910 -38 753 -67 -386 90 -179 -556 -112 797 207 -686 51 471 -557 -135 620 949 -554
4917e54J3J071Kq63K73P28p80o32P44N43o80l45P81m09p43P94P77m02r75N71K98
$$ -554 -541 530 532 -331 -58 670 -110 -742 2 545 -135 -480 301 -108 -851 -57 720 318 -657 -86 212
4938B12o19n5J102K2j075r2Q14q1p2p1M35p23j95O00K19o14K94L12n41o14P79
$$ 212 -407 -462 640 662 -413 -505 309 228 156 85 520 -203 -398 202 421 -193 101 413 -128 -742 37
4959C7P37n39o63K14M62l90k51N71R5n62J6L29j54K7N65k94p80J73N27K53o17
$$ 37 774 235 -428 -214 248 -142 -393 178 273 -289 -273 56 -98 -71 494 200 -580 -407 120 373 -244
4980b44K58K12k28m40N27O23m44l30L0J53r5O1L87l81k64K01p9j83J01O50k39
$$ -244 14 226 -2 -442 85 708 264 -66 -36 117 22 83 470 89 -175 26 -53 -236 -135 515 276
5001B76r25L56L66K7j58o2J10k14L2J20K93l21K3J25q7j46O01L4o21j97N71L2
$$ 276 -649 -293 73 100 -58 -120 -10 -224 -192 -72 221 -100 -77 48 -39 -185 416 450 -171 -368 203 235
5023B35m29J74O60o40l04J36L79j45K7J28k36m11M28L35l08m94O27M3q13O9R64
$$ 235 -194 -20 640 0 -304 -168 211 66 93 221 -15 -426 2 337 29 -465 162 205 -608 -539 425
5044D25k38n22j42N27j77M4K51J30l04k67O49l31j5K91L53m87o77O50L90o08m39
$$ 425 187 -335 -477 50 -127 -83 168 298 -6 -273 376 45 30 321 674 187 -490 160 550 -58 -497
5065d97P49R7o07j18O99L4o23R1J21k3j47L73q5o86K38P06j20o70L59M78l43n10
$$ -497 252 349 -258 -376 323 357 -266 -175 -54 -77 -224 149 64 -622 -384 322 202 -468 -109 369 26 -484
5087d84O28M65n42n71O01L90n88l5P54l71n23M99K53m71m86Q21J54r17O5R47k60
$$ -484 144 609 67 -504 97 487 -101 -136 618 247 -276 223 476 5 -481 340 494 -423 -358 589 329
5108C29r25K90O25k24q16O91M89p94j78N60J40n21J28P97m38o18O05M70o57m71
$$ 329 -596 -306 319 95 -721 -30 459 -335 -513 47 187 -334 -206 591 153 -465 140 610 -47 -518
5128e18Q99K11q73k80J090N1j031L93P14p23m24O08K70p59j7P25k12p27M26O20
$$ -518 381 592 -281 -561 529 580 -451 -58 656 -67 -491 117 387 -372 -389 336 124 -603 -177 443
5148D43m26q29N32R49p91l41O06N9m95nP04k38m56K16M82l27k85M41K11p22j37
$$ 443 17 -812 -280 669 -122 -463 143 202 -293 -298 406 168 -288 -72 410 83 -202 239 450 -272 -409
5169d09R03k38n19K10O78m21p68J67P73n78k56M06K15m58j01N53j46k70J77K92
$$ -409 494 256 -263 -53 625 204 -564 -397 376 -202 -458 -52 163 -295 -396 157 11 -259 -82 210
5189B10k75l63P01Q1p74r8R26J14q27J48O36j79m34J4L31P1l78J04L7k37O0L70
$$ 210 -65 -428 273 354 -420 -518 408 522 -305 -157 479 300 -134 -120 211 282 -96 8 45 -192 -132 238
5211B38k46n15M49M87p03j95N92L14o60k50M12L54n44o0M76k39r0K26J38k22j30
$$ 238 -8 -523 -74 413 -290 -485 107 421 -239 -489 -77 277 -267 -327 149 -90 -180 46 184 -38 -168
5232a68L87q2l53O3O13l33m82K48N01j60m39J11M72l52q1N4P5j89M8j03J21l61
$$ -168 219 137 -216 -153 460 127 -355 -107 394 234 -205 -94 378 26 -55 -1 74 -115 -67 -170 -49 -410
5254d10K25K68j07k16M26Km09k29O68J80p06L8M47P2l38M3J77j12p5J38J07k85
$$ -410 -185 83 -24 -240 186 188 -221 -450 218 398 -308 -270 177 249 -89 -46 131 19 -56 82 189 -96
5276i6L71J27l56j99L40J62m78k71O27o1k13k34K31j84l9N7J24%q7J65n7l05L60
$$ -96 275 402 46 -153 187 349 -129 -400 227 166 -47 -281 -50 -234 -273 -216 -92 -92 -179 -14 -71 -376 -16
5299a6K84j83m02K80M51q4m92J61K61k22j14J41L12k9l35mO2j8j98J3O2L6J97
$$ -16 268 85 -317 -37 414 330 -162 -1 260 38 -76 65 377 348 13 9 71 53 -145 -132 -70 -34 163
5322A63p8n3k71M43k10k56l0L58q2j5j72N08j75q7J9Mp3J66l2o7lM0J28j10k17
$$ 163 85 32 -239 204 -6 -262 -292 66 -16 -31 -203 305 130 43 62 66 -7 159 127 60 57 97 225 115 -102
5347a02M99j59k40j36L08K3l97J45J28n3jj33Pm4K16j55k34J61L74n0k65M3N5
$$ -102 397 238 -2 -138 170 193 -204 -59 69 16 15 -118 -111 -155 61 -94 -328 -167 207 157 -108 -65 -10
5370a0K90m08J9K72J11l55M1K9J21Q6l4j64P8N7r4J34k75L9K99k18m82L48L54
$$ -10 280 -128 -109 163 274 -81 -40 -11 110 196 162 -2 76 133 39 173 -102 -63 236 18 -464 -116 238
5393B38k72j67R0J45r3Qj13J02LML2rm6N6j7j42J63L22k72k91J64L54om38K89
$$ 238 -34 -201 -111 34 -59 -51 -164 -62 -59 -55 -23 -32 -78 -22 -39 -181 -18 304 32 -259 -95 259 253 -185 104
5418A04K57l86P2K32j57j71N2K35k10k02L97k65j63J00J92P3l44k6L54j33k58
$$ 104 361 -25 47 279 122 -49 3 238 28 -174 223 -42 -205 -105 87 160 -184 -210 144 11 -247
5439b47O9K27k54k8L82k34NL3L56m99p3M45Kl15j65O44l6n24J5O20k67m58M95
$$ -247 -178 49 -205 -233 149 -85 -80 -47 309 -190 -263 182 184 -131 -296 348 312 -212 -197 423 156 -302 193
5462A93p1j36n0J19Q7m12K63J98k64l94N06K77o41j20N18K57o13P5M76J08n62
$$ 193 122 -14 -64 55 142 -270 -7 191 -73 -467 39 316 -325 -445 73 330 -283 -208 268 376 -186
5483a86R1L72p7l26N62k69j77J4L92j39n33L99K95l79l33M26K47n03k57M35j01
$$ -186 -95 277 200 -126 436 167 -10 4 396 257 -276 123 418 39 -294 132 379 -124 -381 54 -47
5504d7k43J50M27l76n3M15r1l75R5L79N8r81M06O88k34o55K55N60l47l83M33L82
$$ -47 -290 -140 287 -89 -142 273 182 -193 -98 281 339 -642 -236 452 218 -437 -182 378 31 -352 81 463
5526D63n32jN30n74j76L71N01p77m07R94J09r75J50P75j4j053L71O11k08q13N39
$$ 463 -69 -70 460 -114 -290 81 582 -195 -602 392 501 -474 -324 451 437 -616 -245 366 158 -655 -116
5547a16L26m81n0O64J0p51j4P78l55m96P63L12o23o23R78K28p10k36Q90k17r22
$$ -116 210 -271 -321 343 353 -398 -412 366 11 -485 278 590 -33 -656 322 550 -160 -396 494 277 -645
5568f45K64R27l81m72L63M56r34nJ140m34q33J01J105p36p78Q31Q66j125n55J059
$$ -645 -381 546 165 -307 56 512 -422 -427 713 279 -554 -453 652 -84 -862 -31 835 -290 -845 214
5588B14N7p88K29Q83k16r17O55N56p29k38Q20P0j029j1J198l75r40J81J078p37
$$ 214 271 -517 -288 595 379 -538 117 673 -56 -294 526 596 -433 -444 754 379 -561 -380 698 -39
5608c9p15Q74N06p98l61O67K41r88M58P88o61q80O78R67j088l19J272R1j471L93
$$ -39 -754 120 626 -172 -533 134 375 -613 -155 633 -28 -908 -230 737 -351 -670 602 693 -778 -385
5628c85J137l09r23M32O68m61p24R10L02r25j82R82k70j150Q32J009r57r25J093
$$ -385 752 443 -480 -48 620 159 -565 345 647 -278 -460 522 252 -898 -66 943 -14 -939 154
5647A54O28j042m17J028J68j098p9J031m9o99N05L12p00m76R26L66q72j67J023
$$ 154 782 -260 -677 351 519 -579 -658 373 324 -375 130 442 -258 -734 192 558 -314 -481 542
5666E42j37j011N32J102q96n94N46P80j074k79R54K13j144J38Q86l40o55N82L66
$$ 542 405 -606 -74 1028 132 -462 84 864 -210 -489 465 678 -466 -328 558 218 -437 145 511
5685E11r64k61J199k4j134K15J058k99j166M98J057o62r62R77M94n88l90R51j86
$$ 511 -453 -714 485 461 -673 -458 600 301 -865 -367 690 28 -934 43 537 -51 -441 510 324
5704C24o82K47O16m17n53O93N97j076l74J049P8j070K50O18k00o94L29P79o39
$$ 324 -358 -111 505 88 -465 228 825 -251 -625 424 502 -568 -318 300 100 -594 -265 514 -125
5723a25m07O21p7n20L00P63n23p83O57N34m97n78P30M91r55k35P66L15q20J52
$$ -125 -532 89 12 -508 -208 555 32 -751 -94 440 -57 -635 95 586 -369 -604 162 477 -343 -191
5743a91N71j78n58K48O62o63k86Q65j58p71J34O99l38m83M83L73m43o62O71M80
$$ -191 380 202 -356 -108 554 -109 -395 470 312 -459 -325 374 36 -447 36 409 -34 -696 -25 455
5763D55o92o0M82Q0q39N01L20k35k78O03L8o32m9O71q7m53r0P94j87m69R4L08
$$ 455 -237 -297 185 265 -574 -73 247 12 -266 337 375 -257 -306 365 278 -175 -265 529 342 -127 -33 275
5785B75k56l84L93M5M6l91L13j57k54M38L01m22k22L58K30p12M2M90P7o15Q1N51
$$ 275 19 -365 28 73 119 -272 41 -116 -370 68 369 -53 -275 83 313 -399 -357 133 210 -405 -324 227
5807B27p7k29P5J18l02K07K32j27k83K41J84k35m84O08K66l33k99M25J4l58N2
$$ 227 150 -79 -4 114 -188 19 251 124 -159 82 266 31 -453 155 421 88 -211 214 228 -130 -78
5828g8J22J53m90J39J50p6q0K55j84k75K54L34l02k52L56K56j64l66K05K70j98
$$ -78 44 197 -293 -154 -4 -80 -160 95 -89 -364 -110 224 -78 -330 26 282 118 -248 -43 227 29
5849B9q8L26j81p5J31k3j68K4K8o3m4pM28j88l76R3L38k18m29M36K22l71K8O4
$$ 29 -59 267 86 11 142 119 -49 -25 3 -60 -104 -111 317 129 -247 -154 184 -34 -463 -27 195 -176 -148 -84
5873h4Oj91K36J08L0j75K88J52n59k4L28K03l93NL08j17k11J81L8q7k7m7K02j90
$$ -84 -78 -269 -33 75 105 -70 218 370 -189 -213 115 318 -75 -70 238 121 -90 91 129 42 15 -32 170 -20
5897b0j57K88j78l68N04J22l90q2L50M9l35j65L86J48n31K39J54Lk11J88K33l38
$$ -20 -177 111 -67 -435 69 191 -199 -281 69 118 -217 -382 4 152 -379 -140 14 17 -194 -6 227 -111
5919a11Q8O6J68l15J55J98k22l56L34L18k24m37M55O9j85j93K54j10j07J86Lk91
$$ -111 -23 43 211 -104 51 249 27 -329 5 323 99 -338 117 186 1 -192 62 -48 -155 31 34 -257
5941b57L10J04k65p4j0L38L9k08j00L14k16n7j48M78j23k39J57Nj01K34j85P7
$$ -257 53 157 -108 -182 -192 146 185 -23 -123 191 -25 -82 -230 248 125 -114 43 48 -53 181 -4 73
5963G3k31L46J23l15j63M17k65k17J00M2R6j13n1M10k24k0j32l2K10j83K44o7
$$ 73 -158 188 311 -4 -167 250 -15 -232 -132 -90 6 -107 -158 252 28 8 -124 -156 54 -129 115 48
5985D8j19p7K69j00j28K39J79k92j80L84J14l78J32j45J52q6j30L27l37K03q9
$$ 48 -71 -148 121 21 -107 132 311 19 -161 223 337 -41 91 -54 98 12 -118 209 -128 75 -14
6006a4Q0Lk56L87k94K4n9K19j45k34L62L2j7l57M23j21j10N5L9K25N0q2m5m7j85
$$ -14 66 69 -187 200 -94 -70 -129 90 -55 -289 73 105 88 -269 154 33 -77 -22 17 242 292 210 165 118 -67
6031f7K48j33j55J43P0L0j07j87K73O2k81P0J45k77K9R6m9J52k02J16q5K5K98
$$ -67 181 48 -107 36 106 136 29 -158 115 177 -104 -34 111 -166 -137 -41 -90 62 -140 -24 -109 -84 214
6054B14k09j21j87L44J36k08l3J16N4k45J00J18J20l67K26j46o3J83l3j0j74K23
$$ 214 5 -116 -303 41 177 -31 -64 52 106 -139 -39 79 199 -168 58 -88 -151 32 -1 -11 -185 38
6076C8J07p5m57L45J90p5k21R2K24k63l4J35j67O1J37K47m70M7K21j43J3J26K42
$$ 38 145 70 -387 -42 148 73 -148 -56 168 -95 -129 6 -161 -100 37 284 -186 -139 82 -61 -48 78 320
6099C20j81l74M00O0k7l01K25K7o3j46j10J98Kj43L90m54k19M88J2k43j29J71
$$ 320 139 -235 165 225 198 -103 122 149 86 -60 -170 28 30 -113 277 -177 -396 92 104 -139 -268 -97
6121i7J96k58j31N49j53m29L22P9j17q4J01J52j43L1J42k08m1J02K64l19m6L56
$$ -97 99 -159 -290 259 106 -323 -1 78 -39 -123 -22 130 -13 18 160 -48 -89 13 277 -42 -88 268
6143B68pm91J21K11J67m83J66K58k00k93J51J97j43r3M73m84J16k8J48o6k27M71
$$ 268 261 -230 -109 102 269 -214 -48 210 10 -283 -132 65 -78 -171 302 -182 -66 -94 54 -12 -239 232
6165B32Nm08o1L38J1j62k8K83k60J08J58j53j73qL24k39k96K88L60j38m56J7N80
$$ 232 237 -171 -232 106 117 -45 -73 210 -50 58 216 63 -110 -118 206 -33 -329 -41 319 181 -275 -258 322
6188C22l22k94K96K90n45j44L73L07l86J06J95k44j51M12J28n15J65K57j27k61
$$ 322 0 -294 2 292 -253 -397 -24 283 -103 3 198 -46 -197 215 343 -172 -7 250 123 -138
6208a38P1N85k18n94K61K70j70l50M93N7l32j64N02k84k24J58L07n36q3M69K58
$$ -138 -67 518 300 -294 -33 237 67 -283 210 267 -65 -229 273 -11 -235 -77 230 -306 -389 80 338
6229C38n17k07P48k58l73J46L70k19m65K54M77l90o8M88l21l57L47M46k50l87
$$ 338 -179 -386 362 104 -269 -123 247 28 -437 -183 294 -96 -164 324 3 -354 -7 439 189 -198
6249a98J89K43n17o2R04j74o54O6K93J4n46L99L05m60k82O37O1o66K49L92l4p97
$$ -198 -9 234 -283 -345 559 385 -269 -203 90 104 -442 -43 262 -198 -480 157 218 -448 -199 193 159 -638
6271f38M04N52%o12L32N58r34M1P25M8n91r0L70j89l22M52L97n58n44R39qn82
$$ -638 -234 318 318 -294 38 596 -338 -297 428 476 -115 -205 165 -24 -346 106 503 -55 -599 340 332 -250
6293b50O2M72o2o34K00O07k06o38O77k6n16j19Q43k05o02K80M02k08m42N42L19
$$ -250 -188 284 222 -412 -212 395 189 -449 228 202 -314 -433 410 205 -397 -117 285 77 -365 177 496
6314D96p59j79P72J70r22L86M05j81p45K64P91m92k70N40R9q19Q3Q55k91p75K81
$$ 496 -263 -442 330 500 -422 -36 369 188 -557 -293 498 6 -264 276 375 -444 -361 494 203 -572 -291
6335b91P83o71l87O16M54q46q1N98K52p21J99L13n9m22K76M62o10k4N26J57p22
$$ -291 492 -179 -566 50 504 -342 -423 175 427 -294 -95 218 159 -263 13 475 -135 -159 367 524 -198
6356a98j48Q72k95o48K18P73o65k31M59K93o10j68M94K4o99L47N16l49m52M48
$$ -198 -346 526 231 -417 -199 574 -91 -322 137 430 -180 -348 146 170 -529 -182 334 -15 -467 -19
6376a9N44q92o1N68K0q00M20P64l43p59L60O01l32l01M48N3l74j13M67J1n58L42
$$ -19 525 -367 -428 140 160 -640 -220 544 201 -558 -198 403 71 -230 218 271 -103 -216 251 262 -296 46
6398D6M11l80p05Q19K21n68k71O00K54q12J93N41m59k12K63L40l43k67M28Q7n89
$$ 46 457 77 -628 191 412 -156 -427 173 427 -385 -192 349 -110 -322 -59 281 -62 -329 99 186 -403
6419d03J92N63j76n89L02M65l99m42P18J81p13L7N04P1k72j30K65J53n54M04M6
$$ -403 -211 352 176 -413 -111 354 -45 -487 231 412 -301 -264 240 311 39 -91 174 327 -227 177 223
6440B23m55k43O46j24m62K11M14j46m04kO87l35l57M61K00k08l46K69M6l41K41
$$ 223 -232 -475 171 47 -415 -204 210 64 -340 -342 345 10 -347 114 314 106 -240 29 75 -266 -25
6461b5L12k96k46L12K38n47Q4K30J14m89K45L35j05l95L58K27n67M3J23K43n25
$$ -25 287 -9 -255 57 295 -252 -168 62 176 -313 -68 267 162 -233 125 352 -215 -172 -49 194 -331
6482c31N4M82o7k84J76K33j93m15L42M04l22k88M88K0m46M3L95j59j44j39K45
$$ -331 -277 205 138 -146 30 263 70 -345 -3 401 79 -209 279 299 -147 -104 291 132 -12 -151 94
6503I4J7k31M24j43k06j31K77pl51J68L99k52l56J91K75j54l92L38J08j88n4K15
$$ 94 111 -120 304 161 -45 -176 101 94 -257 -89 310 58 -298 -107 168 14 -378 -40 68 -120 -174 41
6525D1k23L72k81L45k84r4J59J82l11J68m3K04k05k18M11l11j01J76K65l28J3
$$ 41 -182 190 -91 254 -30 -124 35 217 -94 74 31 235 30 -188 223 -88 -189 -13 252 -76 -63
6546f3M6L18m91K57J25k28m7l6K60k50mJ93o2q1k40K46K64k59M7j30J99m3L4O9
$$ -63 -17 301 -190 67 192 -36 -83 -119 141 -109 -113 80 18 -63 -303 -57 207 -52 -5 -135 64 21 55 124
6570A24j96J88O6j60j38K12n4K51k55j96L95l19Q3L8J5n9l6k18K48q4K41k02j22
$$ 124 -72 116 182 22 -116 96 42 293 38 -158 237 -82 1 39 54 -5 -41 -259 -11 -95 146 -56 -178
6593a78Q6L00k62J99q2K38m15p0J37J42L19n48O6J8J53n3o8j0L09k25P0k3r7O9
$$ -178 -92 208 -54 145 63 301 -114 -184 -47 95 414 -134 -68 -50 103 50 -18 -28 281 56 126 103 6 75
6617G5R9j18k9m1l6p8k5K56k08J5J2J57r4J47j64r4J71n7O6p9o7J58J77r0o2R6
$$ 75 174 56 27 -14 -50 -128 -153 103 -105 -90 -78 79 -15 132 -32 -126 45 -12 54 -25 -92 66 243 153 91 187
6643A87j45O4K7k86L22j60k7j07K92l3k12J27l14J75K71m85J49L4R7K0Kk26K51
$$ 187 42 106 133 -153 169 9 -18 -125 167 134 -78 49 -265 -90 181 -304 -155 -121 -24 -4 -2 -228 23
6666B3r3j8J57j39JJ69N9j24K13j04j51O0R3m4J6j66K50j44R5j57m3J18j71jj6
$$ 23 -70 -88 69 -70 -69 100 159 35 248 144 -7 53 146 102 118 -48 202 58 153 -4 -47 71 -100 -101 -117
6691a17K4P3j66K9J16J45j08J7k52J89J50q8r0K25K1j5l77oM04m2o3p5J91k4j17
$$ -117 -93 -20 -186 -157 -41 104 -4 13 -239 -50 100 12 -78 147 168 153 -224 -230 174 132 69 -6 185 161 44
6716D4j27j5J9L1J68k37j1K92q9k04j05K85Qj67J37J1k1j89J43K7l3k52J67K39
$$ 44 -83 -98 -79 -48 120 -117 -128 164 75 -129 -234 51 59 -108 29 40 19 -170 -27 0 -33 -285 -118 121
6740A21l05J93K6k23J55P7Q4j77J45m2J3M3l51J41K66o7j92J45P1m46K27J71j81
$$ 121 -184 9 35 -188 -33 44 128 -49 96 54 67 110 -241 -100 166 99 -93 52 123 -323 -96 75 -106
6763a06K3N2N5k18L55k20K53m00M2J84j73J09p5J08N4j73L08j06p5j04K67j22
$$ -106 -83 -31 24 -194 161 -59 194 -206 -164 20 -153 -44 -119 -11 43 -130 178 72 -3 -107 160 38
6785C8k56L75j3k89L0J88J61n80K41M21k12k69J22J1J08l31m0L37Rp8J25j8l21
$$ 38 -218 157 144 -145 -115 73 234 -346 -105 316 104 -165 -43 -32 76 -255 -295 42 51 -27 98 80 -241
6808b41J34L03k30j73K46K74l11n7K04ml09o8M43n0k44Q7M1l4L4P9j3q0l8K67
$$ -241 -107 196 -34 -207 39 313 2 -55 149 145 -164 -232 211 161 -83 4 45 11 45 124 111 31 -7 260
6832B60j32k62K19Oj46j62L33P8k48j14K80n1m34L10j06J99j59J31K4j30R7K75
$$ 260 128 -134 85 91 -55 -217 116 194 -54 -168 112 61 -373 -63 -169 30 -129 2 26 -104 -7 268
6854B68m5l89JM36l8l60L26J31l03l92M48J09j85j60K88j59k70K84J28j89k84
$$ 268 223 -166 -165 271 233 -127 199 330 27 -365 83 192 7 -153 135 -24 -294 -10 118 -71 -355
6875c55L23L30n74N5N81m5n85J40K62m3l28L03N1l47J48K78Q7k87j02L42l10k27
$$ -355 -32 298 -276 -221 360 315 -270 -130 132 89 -239 64 115 -232 -84 194 281 -6 -108 234 -76 -303
6897c03M24K15l65q2K10N2k84J3K11J69n02J64K61l24J67J7J21m16J26L51r8k56
$$ -303 121 336 -29 -111 99 151 -133 -120 91 260 -242 -78 183 -141 26 43 164 -252 -126 225 127 -129
6919a29Q3J75l13o0N31J39m55l63N18N7k34j42L70O2m36J35J64k69R5J67j7k43
$$ -129 -46 129 -184 -244 287 426 -29 -392 126 183 -51 -193 177 239 -197 -62 102 -167 -72 95 78 -165
6941a65N6L57n1o26K95K78j79k03J06L00j99j56K25O9j25j33M20l90JL43o3j76
$$ -165 -109 248 197 -429 -134 144 -35 -238 -132 168 -31 -187 38 107 -18 -151 269 -121 -120 223 160 -16
6963a6j69M98k99k11P5L10j2j93M8L55m21R9j52L80m73P2K72j0o00M31K30r0l44
$$ -16 -185 313 14 -197 -122 188 176 -17 31 386 -35 64 -88 292 -181 -109 163 153 -447 -16 214 124 -220
6986b20K16L28m36k55N54L3k01l16L73ol30L26J01j70j86L88j15k73j01M99k56
$$ -220 -4 324 -112 -367 187 220 19 -297 76 70 -260 66 167 -3 -189 199 84 -189 -290 209 -47
7007d7k04J93K40j59k20K20J27j18j21K02n4j88J55K01j47k33J76K64n17R6M51
$$ -47 -251 -58 182 23 -197 23 150 32 -89 113 59 -129 26 227 80 -153 23 287 -230 -134 317
7028C17r6l56j06O12k32k58J86L08n66J87L85j85k11J47L2j51j88K49k8j2k92
$$ 317 221 -135 -241 371 139 -119 67 375 -191 -4 381 196 -15 132 164 13 -175 74 46 34 -258
7049b58M80k99r5M5K81n9j96J33p8l8R4l9Nn9N6OJ67l05K67L3l7l25L92N4n60
$$ -258 222 -77 -172 -127 154 95 -101 32 -46 -84 10 -29 -24 -83 -27 -21 146 -159 108 141 104 -221 171 225 -335
7074c35L07J43nl41P7L68j23k32L05q9l75L30K23l69j31J22L24k92p9J02L97m96
$$ -335 -28 115 110 -231 -154 214 91 -141 164 75 -300 30 253 -116 -247 -125 199 -93 -172 -70 327 -169
7096a69r4K91N2l16J20K92m9k30J35J82l11J31P3j15r1m4M84k25l22L26J16r5
$$ -169 -263 28 80 -236 -116 176 127 -103 32 214 -97 34 107 -8 -99 -143 341 116 -206 120 236 141
7118A41l45L88j15k30l4K22L9k18J96pm6k04L53n1k92Q0K80o7l61K35L11k94j71
$$ 141 -204 184 69 -161 -195 27 66 -152 44 37 -9 -213 140 89 -203 -123 157 90 -271 -36 275 -19 -190
7141a90L08l3o4j47K61o3j79J70J45j84j42J68K41k25k69K00J33m41q0N23L3m93
$$ -190 118 85 21 -126 135 72 -107 63 208 24 -118 50 291 66 -203 -3 130 -311 -391 132 165 -328
7163c28K03J08k21Q2K29J08l07j54N74j61l97J25M37k04l53L69K91m96r0N02k56
$$ -328 -125 -17 -238 -156 73 181 -126 -280 294 133 -264 -139 298 94 -259 110 401 -95 -185 317 61
7184F1o7k04M63k08j74K64J42l32j1J79J56n15P4K44k79O8RN51l85k48J84L40
$$ 61 -6 -210 253 45 -129 135 277 -55 -66 113 269 -246 -172 72 -207 -139 -130 421 36 -212 -28 312
7206C12o36M8N80j25l51K02R1k9k35K37K5l1l13L78J9j91l9J77j61j16J40J89
$$ 312 -324 -276 304 179 -172 30 121 92 -143 94 119 88 -225 153 172 -19 -58 119 -42 -158 -18 171
7228A71k64j65J81K9k36J17K25j72O4P0J15k51j11L16J43l29j96K88MJ7k05M19
$$ 171 -93 -258 -77 -48 -284 -167 58 -114 -50 20 135 -116 -227 89 232 -97 -293 -5 -1 16 -189 230
7250B30j58j28N9q6J31j34K22J21k51j38K55q0k84K97M6k58j28J99K49j64k32
$$ 230 72 -56 3 -83 48 -86 136 257 6 -132 123 43 -241 56 102 -156 -284 -85 164 0 -232
7271b32K41M5o6j24L44j37j73r8M83j44j34J03j15R1m9L34k59k74J65P3o0LO2
$$ -232 9 54 -12 -136 208 71 -102 -200 283 139 5 108 -7 84 35 369 110 -164 1 74 14 17 79
7294G9N7k23j07L96q5q3j13J18J13l22J28P9j40j06J85J19j50n2K03n5l82K09
$$ 79 136 -87 -194 202 117 34 -79 39 152 -170 -42 37 -103 -209 -24 95 -55 -107 96 41 -341 -132
7316a32J58k5lJ78oj81O1Q9J19l90K41L0K8k03J15K8j65J69j68L33k38m1m8K18
$$ -132 26 1 -2 176 170 -11 50 139 258 -132 109 139 167 -36 79 107 -58 111 -57 276 38 -3 -51 167
7340A67k24n1J78j28K5k8J45j95M1J84J51l08q5R9J95m36M65m2j6k14J31Q3l05
$$ 167 -57 -108 70 -58 -33 -61 84 -111 -70 114 265 -43 -128 -29 166 -270 195 153 137 -77 54 137 -168
7363a68K48J5j17j05O9N4j34N3J17K32k27j97K71k1k26J27J3j0j62J14K61l03
$$ -168 80 95 -22 -127 -58 -4 -138 -85 32 264 37 -160 111 90 -136 -9 4 -6 -168 -54 207 -96
7385i6L9J76j18j06J55K5j37q0L53r0m22K07K79j93j87K09J98j53j73K48p3j88
$$ -96 -57 119 1 -105 50 75 -62 -142 211 121 -301 -94 185 -8 -195 14 212 59 -114 134 61 -127
7407a27K28j45K05j06k0k78J51o1K3J65R1j97q4K12j65N3J15J8k08J06Q1R6j00
$$ -127 101 -44 161 55 35 -243 -92 -153 -130 35 126 -71 -155 57 -108 -55 60 78 -130 -24 57 153 53
7430E3j57N1J14j54J06N5p0P9N1Mj05J40j47Jl38J88L21j77j3r7J24Qj3j08J15
$$ 53 -104 -53 61 -93 13 68 -2 77 128 132 27 167 20 21 -317 -129 192 15 2 -95 29 37 24 -84 31
7455C1oJ30p0j89J11K47j56k27K6M4J49j08m2P2Kk1K7J51l4j4l7j00L5J07r7k3
$$ 31 25 155 85 -104 7 254 98 -129 -103 -59 90 -18 -60 12 14 -7 20 171 137 123 86 -14 21 128 31 8
7481HpL6J56l07l6J47r0J7Q7O1j34M8L2J09j65J15k32l5M6J47J65n2j03j75L39
$$ 8 1 37 193 -114 -150 -3 -93 -76 11 72 -62 -14 18 127 -38 77 -155 -190 -144 3 168 116 13 -162 177
7506A77r3L2qP9j23k04J12q4J96r0J05k24j26M58k14o7K8J15j42j07J09J94k4
$$ 177 84 116 108 187 64 -140 -28 -112 84 -6 99 -125 -251 207 -7 -74 -46 69 -73 -180 -71 123 99
7529I9k86L21l0j64J8M1Q6o3J38k26n7K81m2J80k77p1N2R6j81J07j6l0O1j88J88
$$ 99 -187 134 104 -60 -42 -1 85 22 160 -66 -123 158 116 296 19 -52 0 96 -85 22 6 -24 37 -151 37
7554C7O0k98J24j1j75L51J0m5k28L08J5k82j0K25K3j63L1R9K05k36n7J60Rk86
$$ 37 97 -201 -77 -88 -263 88 98 53 -175 133 148 -134 -144 81 104 -59 -28 71 276 40 -17 143 152 -134
7578a34K75p3k09K11J83j82k09R7N3K0k49L24Q7l36j85L48M3k04J17K09l13j0
$$ -134 141 68 -141 70 253 71 -138 -41 12 32 -217 107 194 -142 -327 21 64 -140 -23 186 -127 -137
7600a37L42k44k8q5J13L32j44k16M22l73j22J22O1R3k22J96J51l09j9J17J75m04
$$ -137 205 -39 -67 -152 -39 293 149 -67 355 -18 -140 -18 43 136 -86 110 261 -48 -67 50 225 -179
7622a79K32Qr1j59Q3K11j49j68K77q7l50J83L77j73j87L03j2l40J87J84j05k87
$$ -179 53 61 -30 -189 -106 105 -44 -212 65 -22 -372 -189 188 15 -172 131 119 -221 -34 150 45 -242
7644b42R4K32r1l7J48O2k97Q2K87o3m84K63J53k9M2j99K48j49j53J06J29k10J51
$$ -242 -148 84 -7 -44 104 166 -131 -49 238 175 -309 -46 107 78 120 -79 169 20 -133 -27 102 -108 43
7667D3J9j10j02L00k1j47o2K49M7l79P9K83j79k44K18Q5R7j82J25K03m05j63N37
$$ 43 62 -48 -150 150 129 -18 -80 169 216 -163 -84 199 20 -224 -6 79 176 -6 119 322 -83 -246 291
7690B91l32k11J89J12k1j95K26K71l57j45J23K70l81J6M25k54o1O4J03j47k00
$$ 291 -41 -252 -63 49 28 -167 59 330 -27 -172 -49 221 -160 -144 281 27 -34 30 133 -14 -214
7711b14N05m7l67J83J74j66j59K34R6j28l21L14r6j73Q4L1Qq7j5L24j72l27K89
$$ -214 291 244 -123 60 234 68 -91 143 239 111 -210 104 8 -165 -81 -50 -42 -129 -144 180 8 -319 -30
7734c0J09k22j03L20j4j01N3K2j9j79J07L12k01k89J41K13q1o6J35nk11K36K61
$$ -30 79 -143 -246 74 60 -41 12 34 15 -164 -57 255 54 -235 -94 119 38 -28 107 102 -109 127 388
7757C88m71k91M41K68m33RK41L5l14Q2K05J8l58Q2K7J05l24L70j42j89N5J77n8
$$ 388 -83 -374 67 335 -98 -89 152 187 -127 -45 160 178 -180 -98 -71 34 -290 80 -62 -251 -196 -19 -77
7780g7j51m6L75q5k13J06M93m95j39N90l17r8j1M30n81P4J31L10l54M2K45l8k63
$$ -77 -228 -274 101 16 -197 -91 402 -93 -232 358 41 -57 -68 362 -219 -145 -14 296 -58 -16 229 191 -72
7803g2J46K24j93l64L74K54k97j37K82k5j94k26K59Jl93K87J79Ln5j50J86k04
$$ -72 74 298 105 -259 115 369 72 -65 217 192 -2 -228 31 32 -361 -74 105 108 53 -97 89 -115
7825a15K02K72k22m05J91K98j89k34J17M27m56K04J04j69j90J93J06l6k22J06
$$ -115 87 359 137 -268 -77 221 32 -202 -85 342 -114 90 194 25 -165 28 134 98 -124 -18
7845a8J31j71l25M61j67k41M11J04k29m0J67L1k04%J24J34j80k4J74j49MO5J28
$$ -18 113 -58 -383 78 -89 -330 81 185 -44 -84 83 114 -90 -90 34 168 -12 -36 138 -11 -7 58 186
7868A86j27k73J92J20L8k91K38P6l27R2L75l15Q2l3m8j28k00L01K7KL7lR7k14
$$ 186 59 -214 -22 98 136 -155 83 159 -168 -76 299 -16 66 33 -15 -143 -343 -42 -15 -13 24 21 118 -96
7892i6M6L26j72j42K7O1k7q6J13m1m5m7K96j76l39L87j25J04j54K05P7k47m6J90
$$ -96 -50 276 104 -38 -11 50 23 -63 50 9 -36 -83 213 37 -302 85 -40 64 -90 115 192 -55 -101 89
7916H9j60j57J01K57m59J32J93J60k61o6J99m2J02j2J83j16k67J22K40l79J36
$$ 89 -71 -228 -127 130 -329 -197 -4 156 -105 -171 28 -14 88 76 259 143 -124 -2 238 -141 -5
7937eJ18Mj44k5K42j12j36l7L28k92j41M43j0k78j2KJ91o38M94J37L2j71J12j7
$$ -5 113 117 -27 -52 190 78 -58 -95 233 -59 -200 243 233 -45 -57 -55 136 -502 -8 129 161 -10 102 85
7961H5j24j90L47j76j49K81Kj7k53J36J92k35N0K45j33Lj45J57pj46N1K49j56
$$ 85 -39 -229 118 -58 -207 74 76 59 -194 -58 134 -101 -51 194 61 64 -81 76 69 -77 -26 223 67
7984F7j63KJ33n1j24K6J26j72M2K63k52j36K84j12L8k03J72Q9k10J67J43N8k34
$$ 67 -96 -94 39 -12 -136 -110 16 -156 -114 149 -103 -239 45 -67 -29 -232 -60 29 -181 -14 129 187 -47
8007d7l5K72j76j2R4Kj30k9Q1J00m30L12N3Q0k32O7K48l41j45K85j16M4k8J86
$$ -47 -82 190 14 2 96 98 -32 -61 20 120 -310 2 55 135 -97 -30 218 -123 -268 17 -99 -55 -83 103
8031A03j37J7m5Q1k11J68M0J14l76K16J14j78L2M2M1J56k25K72r7m26L10N8P4
$$ 103 -34 -17 -62 19 -192 -24 16 130 -246 -30 84 -94 -62 -20 21 177 -48 224 127 -299 11 69 143
8054A43j14o4J39Lj59K31k88r5J86P7J48k36o3L05j91O4r4l6J71j92P8R2j09N3
$$ 143 29 -35 104 107 -52 179 -109 -204 -18 59 207 -29 -92 213 22 86 -8 -44 127 -65 13 105 -4 49
8078D9l5k9J93j30J02j14l2J17o3q1j26K82q2KMQ9j24K4j85K08Mn1K34k38K5p9
$$ 49 14 -15 178 48 150 36 4 121 58 -23 -149 133 51 53 57 146 22 46 -139 69 73 22 256 18 43 -36
8104c6J08j17R8p0J35M3j51r3K76j85K3L7j34O1J09k8o9p0L4p4Q2L6j7J70j44
$$ -36 72 -45 53 -17 118 161 10 -83 193 8 31 68 -66 -5 104 76 7 -63 -29 -103 -21 15 -2 168 24
8129B4j64O2Q5k1n1J8K9j16K08o6j39j27J00L01j23J7M0j78K16o6J00k54K61m7
$$ 24 -140 -78 7 -14 -65 -47 -18 -134 74 8 -131 -258 -158 143 20 37 77 -101 115 49 149 -105 156 109
8153A09n0M9j02K34k13j47j7J35J7n1%J19n3j89J10k1M4M1nj23Q9J67Jl32LK07
$$ 109 59 108 6 240 27 -120 -137 -2 15 -36 -36 83 30 -159 -49 -70 -26 15 10 -113 -24 143 144 -188 -185 22
8179B2Q1l31J91J39j30J0P7r%J1K8k22
$$ 22 103 -228 -37 102 -28 -18 59 50 50 61 89 -133
8191a33
$$ Imaginary data points
##PAGE= N=2
##DATA TABLE= (X++(I..I)), XYDATA
0@%%%JrQqJ6j6J6k2L0m0M9n7P2q8J04j21J38j62J94k23K53k92L36l83M34m89N51
$$ 0 0 0 0 1 -8 0 -8 8 -8 8 -14 16 -24 25 -32 40 -48 56 -65 73 -89 105 -118 135 -157 179 -204 230 -259 292
30B92o21O96p77Q67r67J077j196J328j474J631j804K000k214K449k715L014l354
$$ 292 -329 367 -410 457 -510 567 -629 699 -775 856 -948 1052 -1162 1287 -1428 1586 -1768
47a768L743m189M712n335O089p027Q223r811J2029j5327K0738l1097N7495k35900
$$ -1768 1975 -2214 2498 -2837 3252 -3775 4448 -5363 6666 -8661 12077 -19020 38475 -197425
61a97425m78412P46243L43217n38595n1518N02055k29044n03775L08007M52247
$$ -197425 -675837 70406 413623 -124972 -176490 325565 96521 -407254 -99247 353000
71C53000k71576k25512K28743p8045l29851K60743M40751k16170l83320J26985
$$ 353000 81424 -144088 84655 6610 -323241 -62498 378253 162083 -221237 -94252
81i4252J53480j45665M5937K54548q3234k85404L216J54397J4384L3298J00567
$$ -94252 59228 -86437 -40500 214048 130814 -154590 -151374 3023 17407 50705 151272
92A51272p2929j99237l5041J45304J31054K09j21264j06803L0118O6548J0272
$$ 151272 78343 -120894 -155935 -10631 120423 120632 -632 -107435 -77317 -10769 -497
103d97O5962Q1062j18314j84699M1533J28555R778N2648O4069j99989j88149K39195
$$ -497 65465 146527 28213 -156486 -114953 13602 23380 76028 140097 -59892 -248041 -8846
115h846K35070k09752j31202K36046m0382l55765J30673M41178j27852l75384
$$ -8846 226224 16472 -114730 121316 80934 -274831 -144158 297020 169168 -206216
125b06216J49082J99090k60870l9110M02894k7955m53596M2935L46757j26337
$$ -206216 -57134 141956 -118914 -158024 244870 216915 -236681 -193746 153011 26674
135B6674j86161K80860R3590l83290n3065L57933k0498k48160J59698J45929l15163
$$ 26674 -159487 121373 214963 -168327 -221392 136541 116043 -132117 27581 173510 -141653
146a41653j10562L85813J00960l27002k2141K35661j07104j93549J90166J77525
$$ -141653 -252215 133598 234558 -92444 -114585 121076 13972 -179577 10589 188114
156A88114j79810j25641J15729J9297o9383R6303P9956j35970r5707R0062M9570
$$ 188114 8304 -117337 -1608 17689 -51694 44609 124565 -11405 -107112 -17050 32520
167C2520m3673K3068M1156n4782n7721K1068M7579M3070O551p4519n9193M8327
$$ 32520 -11153 11915 53071 -1711 -59432 -38364 9215 52285 58836 -15683 -74876 -26549
179b6549M2382k2679L1046M3759q6204p2562R6521O2642q2133K190Q4032q5772
$$ -26549 15833 -6846 24200 67959 -18245 -90807 5714 68356 -13777 -11587 72445 -13327
191a3327j14824J28585J29400j18657p9464J08444r304j23193Q0378J32285j15282
$$ -13327 -128151 434 129834 11177 -68287 40157 30853 -92340 -11962 120323 5041
202E041j06186J22729L1574j37448N7449J66537j11238j71414J24527J20669j38106
$$ 5041 -101145 21584 53158 -84290 -26841 139696 28458 -142956 -18429 102240 -35866
213c5866m3228J60356k1629j68890O0507J44494q1354q0751J06861J0204j34692
$$ -35866 -79094 81262 59633 -109257 -48750 95744 14390 -66361 40500 50704 -83988
224h3988L5329J37646n7745j00317Q0503M6207j05668j484J19750k2093j02566
$$ -83988 -48659 88987 31242 -69075 11428 57635 -48033 -49517 70233 48140 -54426
235e4426L4892N4848n7870j0497P8859j4279p6082K7443M7029m2694j1604N9047
$$ -54426 -19534 35314 -22556 -33053 45806 31527 -44555 -17112 29917 -12777 -24381 34666
247C4666j5056o8110K1866N4115k0564j8548K9467j0179l7774K1105K9403k1356
$$ 34666 19610 -48500 -26634 27481 6917 -11631 17836 7657 -30117 -9012 20391 -965
259i65k715K5130k4072l0768L8745L0679l5615j3753K7171j2744k2594L1430J5676
$$ -965 -3680 21450 -2622 -33390 5355 36034 419 -13334 13837 1093 -21501 9929 25605
272B5605l7232J1L1580k6512k5759N0766K1152o1469j2550N5715q432m5812L1952
$$ 25605 -11627 -11616 19964 -6548 -32307 18459 39611 -21858 -34408 21307 12875 -32937 -985
285i85L5008m6102j9176M9103l007m2966L0150L5280n2569k4983O3689J1323o1221
$$ -985 34023 -12079 -31255 17848 14841 -28125 2025 37305 -15264 -40247 23442 34765 -26456
298b6456J0149N3876l1066m3855M4392K8597m7378p017M3026j7994l7613L7156
$$ -26456 -16307 37569 6503 -37352 7040 35637 -11741 -18758 24268 6274 -31339 5817
310E817K8735m8802j6275N0258n86m8632J6274M2165k6330l1819K8707J7190k7277
$$ 5817 34552 -14250 -30525 19733 19147 -29485 -13211 28954 2624 -29195 -488 16702 -10575
323a0575o14K4196j2604j8138K1875J1005k4211r31K5241o801k2902R729J8450
$$ -10575 -11189 13007 403 -17735 4140 15145 -9066 -9997 15244 8443 -14459 -4730 13720
336A3720q818j0157P020K203l448L188j883o416O380O151j2563o126J4758N018
$$ 13720 4902 -5255 1765 3968 520 3708 1825 -4591 1789 7940 -4623 -10749 4009 9027
350I027j4106k491R297j830l674N243k345p377P607O419j1966l027J7594J926
$$ 9027 -5079 -7570 1727 -103 -3777 1466 -879 -8256 -649 5770 -6196 -9223 8371 10297
364A0297j9069Q75J8135k609j4205L382P633m075K67O233n033m764R349J006j4170
$$ 10297 -8772 -7897 10238 7629 -6576 -3194 4439 364 631 6864 1831 -2933 6416 7422 -6748
379f748J052J5057m331j6549N766J5599m911j1262L300M480l556M41J993n589
$$ -6748 -5696 9361 5030 -11519 -5753 9846 4935 -6327 -3027 1453 -2103 -1662 331 -5258
393e258p08Q957r52r748M558J2706n179j3798M554J3465l304j0977J262Q426J675
$$ -5258 -5966 2991 2039 -7709 -3151 9555 4376 -9422 -4868 8597 5293 -5684 -4422 4004 5679
408E679m093j677J708K347J21l831l109K011L277j865m802J416O907J229q038
$$ 5679 1586 -91 1617 3964 4085 254 -2855 -844 2433 568 -4234 -2818 4089 5318 -2720
423b720m888P335O512q003j0115M849J0954j192o876K745N866k561o413R88M974
$$ -2720 -7608 -273 6239 -1764 -11879 -7030 3924 2732 -4144 -1399 4467 1906 -4507 -3519 1455
438A455J296k456l381n6P032O762n485r505J223P760p28n912J864M451l574n327
$$ 1455 2751 295 -3086 -3142 3890 10652 5167 -4338 -3115 4645 3917 -1995 -131 4320 746 -4581
454d581J720N961K058l813n927j494N578M889m875p937K785P612j052m326L949
$$ -4581 -2861 3100 5158 1345 -4582 -6076 -498 4391 -484 -8421 -5636 1976 924 -3402 547
469E47N975m897q309J989O486r1k596J800J638k90J780J892n213n316N647N552
$$ 547 6522 1625 -6684 -4695 1791 1700 -896 904 2542 2252 4032 5924 711 -4605 1042 6594
485F594p861o822J0450R470j0960j0549J0024Q453j2083p268J2557N970j2579
$$ 6594 -1267 -8089 2361 11831 871 -9678 346 8799 -3284 -10552 2005 7975 -4604
498d604n354Q503J600k412O433J21j2908J577J6881m556j9025Q832J9379j4062
$$ -4604 -9958 -1455 145 -2267 4166 4287 -8621 -7044 9837 5281 -13744 -4912 14467 405
512D05j7609K1893K1247k2466k1046J7243J1940j5411k105J5026n458j2607J1868
$$ 405 -17204 4689 25936 3470 -17576 -333 11607 -3804 -5909 9117 3659 -8948 2920
525B920Q034j5785j690J7503r059k2771J5060K5617j7246k3025J8246J7220j9535
$$ 2920 10954 -4831 -6521 10982 1923 -20848 -5788 19829 2583 -20442 -2196 15024 -4511
538d511r969K0811M638j9834k56J5636m633j0740R943R142j0432m378J1116J050
$$ -4511 -14480 6331 10969 -8865 -9121 6515 1882 -8858 1085 10227 -205 -4583 6533 7583
552G583j1499o76J0044o94r387k72R217L372n222l149J949k650o470M179R451
$$ 7583 -3916 -4592 5452 4758 -4629 -4901 4316 7688 2466 -683 1266 -1384 -7854 -3675 5776
567E776l964r092M946N789q525n53J6683l770k4592L964K6484n370k1876J3520
$$ 5776 1812 -7280 -2334 3455 -5070 -5623 11060 7290 -17302 -13338 13146 7776 -14100 -580
581e80J7414k1354j4240K7497J2677k4956n584J6084q241j0493K1983P195k8533
$$ -580 16834 -4520 -18760 8737 21414 -3542 -9126 6958 -1283 -11776 10207 17402 -11131
594a1131n19K9753j0916k9558K2562K7862l1967k7053L1634J8736k6756l286K3940
$$ -11131 -11650 18103 7187 -22371 191 28053 -3914 -30967 667 19403 -7353 -10639 13301
607A3301j0178k1346J6621J2692j8926J059K2301j5162k5587K3257K6903k0415
$$ 13301 3123 -18223 -1602 11090 -7836 -6777 15524 362 -25225 -1968 24935 4520
619D520j7010J8033J023k0513R616K1789j0163j4524Q361r14j0242J4881J6969
$$ 4520 -12490 5543 6566 -13947 -4331 17458 7295 -7229 1132 218 -10024 4857 21826
632B1826j9314j9647J1311R026p058O908J0198j4977j4638J0192Q799q50O982
$$ 21826 2512 -17135 -5824 3202 -3856 3052 13250 -1727 -16365 -6173 2626 1776 8758
645H758r91k1507n492K2123P057j0428M921L878j9086n964K4361R361j3958l650
$$ 8758 7767 -13740 -19232 2891 9948 -480 4441 8319 -10767 -16731 7630 16991 3033 -617
659f17n57j2632O774K5527l698k1101O041O215k1146J338L4753l97l4666k95J8422
$$ -617 -1174 -13806 -7032 18495 14797 -6304 -263 5952 -15194 -13856 20897 20500 -14166 -14461 3961
674C961j0978r16K9386o106l9080O832K9425j5610j1902L5913K449n1046k343
$$ 3961 -7017 -7933 21453 15347 -23733 -16901 12524 -3086 -14988 20925 23374 -27672 -30015
687c0015M7740p54k6600J9968P945m4325k230N4042R0m2611J4365K6403l8882
$$ -30015 17725 16971 -9629 10339 18284 -26041 -28271 25771 25861 -16750 -2385 24018 -14864
700a4864j9747N5551K1342n1971j6932L1368n264j5084L0437J2752m0058j1731
$$ -14864 -34611 20940 42282 -9689 -26621 4747 -517 -15601 14836 27588 -12470 -24201
712b4201K9157l709j6673K8331J6295m4306k2831L9353K1171k2003l877J3008
$$ -24201 4956 1247 -15426 12905 29200 -15106 -37937 1416 22587 584 -3293 9715
724I715j3534j5475J5100J7910j026n474j1202j3433R824K1335m46j0515P31o716
$$ 9715 -3819 -19294 -4194 13716 12690 7216 -3986 -17419 -7595 13740 13294 2779 3510 -3206
738c206j3332J2128J9786o412r407L382j3197j2875K9365K3748l1651k0853K7625
$$ -3206 -16538 -4410 15376 8964 -443 2939 -10258 -23133 6232 29980 -1671 -22524 5101
751E101P83l2648K1488M4254l0471m5962L0531K8525l3309j362M6219j7559n5048
$$ 5101 5884 -26764 -5276 38978 8507 -37455 -6924 21601 -11708 -13070 33149 15590 -39458
764c9458K4230M8388k8302k5609M0087K953n3617Q671N4639j4510l8572K4838
$$ -39458 -15228 33160 4858 -20751 19336 22289 -31328 -22657 31982 17472 -21100 3738
776C738J4923m2408O16N4064p619n0567J4737L3754k8627j9661M1692J4060m2679
$$ 3738 18661 -23747 -23131 30933 23314 -27253 -12516 21238 -7389 -27050 14642 28702 -13977
789a3977j0719K9711J445j3183J2725M934k0463j901J6230k212m852J2578j000
$$ -13977 -24696 5015 6460 -6723 6002 10936 -9527 -11428 4802 2590 -2262 10316 9316
802I316k0538r7J7941K918o018q78n459l469R077M45p634J0332Q248k4694j2084
$$ 9316 -11222 -11319 6622 9540 3522 2644 -2815 -6284 2793 3238 -4396 5936 14184 -10510 -22594
817b2594L1234J1823l1601k997K9176j1425k8181K2580K5361k6703j5049K7394
$$ -22594 8640 20463 -11138 -14135 15041 3616 -24565 -1985 23376 -3327 -18376 9018
829I018j536k7989J9192K8985l0448k3184L6534J0974m0206M971M2704j6858m0226
$$ 9018 7482 -20507 -1315 27670 -2778 -25962 10572 21546 -18660 -13689 29015 12157 -28069
842b8069K3771K9622k8277j4086L2039j149l4438J1864K9619j9328j9656K4323
$$ -28069 -4298 25324 -2953 -17039 15000 13851 -20587 -8723 20896 1568 -18088 6235
854F235Q124k8926M25K7441n572j9618Q819Q286j2200K352J3797q210j0417J2139
$$ 6235 14359 -14567 -14142 13299 7727 -11891 -3072 5214 -6986 -4634 9163 953 -9464 2675
868B675M130j3867K565J4955o096j1342O435M592n382M884L289j2157K66J6232
$$ 2675 6805 -7062 -4497 10458 4362 -6980 -545 4047 -1335 3549 6838 -5319 -5053 11179
882A1179o340j8226J2403J7002j8022j3993K0127P454j9179O87J5347r537j0472
$$ 11179 4839 -13387 -984 16018 -2004 -15997 4130 11584 -7595 -6908 8439 -1098 -11570
895a1570J6042K857j9735O573K1837j5406k0600K1944J7167k4470j0137K5057
$$ -11570 4472 7329 -12406 -5833 16004 598 -20002 1942 19109 -5361 -15498 9559
907I559J900k2934O343J8927j1540j2298J5342K896j6235N771J6078j2612j5028
$$ 9559 11459 -11475 -5132 13795 2255 -10043 5299 8195 -8040 -2269 13809 1197 -13831
920a3831J5215J0262j5535m549J4391j555j2067M530P549n797j930M755m211l286
$$ -13831 1384 11646 -3889 -8438 5953 4398 -7669 -3139 4410 -1387 -3317 1438 -2773 -6059
934f059R638J876j0789N26R584l808n914O384L308p339J353O220n749k804J0214
$$ -6059 3579 5455 -5334 -4808 4776 968 -4946 1438 4746 -2593 -1240 4980 -769 -3573 6641
949F641q51j3250M763J3718q212j2739J0511Q849j2283m438J1790p44j0010N520
$$ 6641 5790 -7460 -2697 11021 2809 -9930 581 9430 -2853 -7291 4499 3755 -6255 -735
963g35O501j0118l186J2085j441j2523O831J2151r958j0999J1871Q356j0780l808
$$ -735 5766 -4352 -7538 4547 3106 -9417 -2586 9565 -393 -11392 479 8835 -1945 -5753
977e753R344r35o840N493M775p030j477O853k713o821O615P287r017p048P996
$$ -5753 3591 2656 -4184 1309 6084 -946 -2423 4430 1717 -5104 1511 8798 -219 -7267 729
992G29N162o333k860M501k71k821L38Q96m57J374n31l831O25N906q0n166j53L860
$$ 729 5891 -442 -3302 1199 928 -1893 -1555 -659 -1116 258 -273 -4104 -3479 2427 2347 -2819 -2972 888
1010H88Q9j740M37k53M74K892p78m333J807N930k647o833L689O860m512o659M134
$$ 888 977 -763 -326 -579 -105 2787 2009 -2324 -517 5413 2766 -4067 -378 6482 1970 -4689 -555
1027e55N288l527l216J702j20j300L020K53m914n17N720p50o171K798O800l523
$$ -555 4733 1206 -2010 -308 -428 -1728 1292 1545 -3369 -3886 1834 1084 -5087 -2289 4511 988
1043I88p255L062P034j378m752Q88J804rJ103M62k036j00K982r16l862K104M789
$$ 988 -6267 -3205 3829 2451 -2301 -1413 391 382 1485 1947 -89 -189 2793 1877 -1985 119 4908
1060D908k681n908J679N805n85m521r04J839Q71m41j376j146J868J966k772k838
$$ 4908 2227 -3681 -2002 3803 3218 -1303 -2207 -368 503 62 -1314 -2460 -592 1374 -1398 -4236
1076d236L897L520m203l928M059L738k644k389J779J300K52R53j611k311K959
$$ -4236 -339 3181 -1022 -4950 -891 2847 203 -2186 -407 893 1145 2098 487 -1824 1135
1091A135L218m196l162N088L030n967l187N785K902n076k505K857J023j151K44
$$ 1135 4353 157 -3005 2083 5113 -854 -4041 1744 4646 -430 -2935 -78 945 -206 38
1106C8j683j211K652K024l750j760M693O90m849m87N126M43l257O4J282J54J441
$$ 38 -1645 -2856 -204 1820 -1930 -3690 1003 1693 -3156 -3643 1483 1926 -1331 -1267 15 169 1610
1123A610P57l710o82M931R96n445K30N285j330n120J793L816j811k219J091j061
$$ 1610 2367 -1343 -2025 2906 3902 -1543 -1313 3972 2642 -2478 -685 3131 1320 -899 192 -869
1139h69q61L851J94o314m89P134K33p483O16O714j185n622J050M695j78k006r94
$$ -869 -1730 2121 2315 -3999 -4488 2646 2879 -4604 -3988 2726 1541 -4081 -3031 1664 1486 -520 -1514
1156a514j23K514L297l212n054L683O103l766n577M042M790l733m048K358K675
$$ -1514 -1637 877 4174 962 -4092 -409 5694 1928 -3649 393 5183 1450 -2598 -240 2435
1171B435n77j696j560o82L468J933n604l137O467L337p118l495P466K790o883
$$ 2435 1858 162 -1398 -2080 1388 3321 -2283 -5420 1047 4384 -2734 -6229 1237 4027 -2856
1186b856j986O302R04m570J64L529n99j290J432k32j803J308K976j844k823J570
$$ -2856 -4842 1460 2364 -2206 -2042 1487 888 -402 1030 798 -1005 303 3279 1435 -1388 182
1202A82K777j708k286J563J615j678k321J279J914q94j710M46P20j176j07K184
$$ 182 2959 1251 -1035 528 2143 465 -1856 -577 1337 443 -1267 -821 -101 -1277 -1384 800
1218H00p99l140J231L756j669m272K874N296l809n231M369N793m102m872M003
$$ 800 1 -3139 -1908 1848 179 -4093 -1219 4077 268 -4963 -594 5199 1097 -3775 228
1233B28M331l489k917K959J204j680L34J53k556J188M189k885o057M054P012n856
$$ 228 4559 1070 -1847 1112 2316 636 970 1123 -1433 -245 3944 1059 -4998 -944 6068 212
1249B12p880O541Q261p409q672P860P688p748n522P200L064o386K18N623l062
$$ 212 -7668 -1127 7134 -275 -8947 -1087 6601 -1147 -6669 531 3595 -2791 -2573 3050 -12
1264a2l706O808J250q888J224J1570l478j3005N862J3243p994j2060R565R730
$$ -12 -3718 3090 4340 -4548 -3324 8246 4768 -8237 -2375 10868 2874 -9186 379 10109
1278A0109j1412o732J1657L017j1728O36J0174m934q538Q197O648j1221m559J2460
$$ 10109 -1303 -8035 3622 6639 -5089 -4453 5721 787 -7751 446 7094 -4127 -8686 3774
1292C774K216j2477N17J1890k468j0479M252Q438m521n506N750K777o466j27P429
$$ 3774 5990 -6487 -5970 5920 3452 -7027 -2775 5663 1142 -4364 1386 4163 -2303 -2430 4999
1307D999j295p546K346P579l896q075N558Q661o584j0306O527J0119o438r395
$$ 4999 3704 -3842 -1496 6083 2187 -5888 -330 8331 1747 -8559 -2032 8087 1649 -7746
1321g746P368O592r073m336J0355J312j0118K250Q720p298o880J3558N134j7737
$$ -7746 -378 6214 -2859 -7195 3160 4472 -5646 -3396 5324 -1974 -8854 4704 9838 -7899
1335g899k412K0382j233k0693O766K0394j1717j8646J5672J4439j7390p871J8490
$$ -7899 -10311 10071 8838 -11855 -5089 15305 3588 -15058 614 15053 -2337 -10208 8282
1348H282n38j8593P568J6993j4170j3097J8325P821k2509k338K4224l034k3112
$$ 8282 7744 -10849 -3281 13712 -458 -13555 4770 12591 -9918 -12256 11968 8934 -14178
1361a4178O978J9187j0487j4266J3788Q870j4630l873J3773m83j1493N796R268
$$ -14178 -7200 11987 1500 -12766 1022 9892 -4738 -8611 5162 4679 -6814 -1018 8250
1374H250q489p631J0022O245r131m060P286K838o654k476O120L051n448m812M579
$$ 8250 -239 -7870 2152 8397 -734 -4794 2492 5330 -1324 -3800 2320 5371 -77 -4889 -310
1389c10M742m722m130N932J749p679N58Q893m282q736P974P581j1967m897J5719
$$ -310 4432 -290 -4420 1512 3261 -4418 -3860 5033 751 -7985 -11 7570 -4397 -9294 6425
1404F425J178j7799L658J8243q001j5768J2129J1951j5461n508J8056j534j8029
$$ 6425 7603 -10196 -6538 11705 3704 -12064 65 12016 -3445 -8953 9103 7569 -10460
1417a0460P727J5579j3084j0984J8102L941k1646J907K2136p174j9408J1386J3497
$$ -10460 -2733 12846 -238 -11222 6880 10821 -10825 -8918 13218 6044 -13364 -1978 11519
1430A1519j5637p361J7820J436j6765L901J2708r410p077J4242K607j6256J648
$$ 11519 -4118 -11479 6341 7777 -8988 -5087 7621 -1789 -8866 5376 7983 -8273 -6625
1443f625J4492m673j0671Q931O874j0237l836Q226N60l720M106o45p492K947P631
$$ -6625 7867 3194 -7477 1454 8328 -1909 -5745 2481 3041 -679 3427 2782 -4710 -1763 5868
1458E868n217m899P966R04j0793L12J0152q72n746K830j035o479N775Q168p045
$$ 5868 651 -4248 3718 4622 -6171 -5859 4293 3421 -2325 505 -530 -7009 -1234 6934 -111
1473a11o230Q651N09j0825L912J3851m472j1976L580N196l753L011O424p410o865
$$ -111 -6341 2310 2819 -8006 -4094 9757 5285 -6691 -3111 2085 -1668 1343 7767 357 -6508
1488f508P933L024q679M295J0870r377j2512R075R105p285j422O861p391p853
$$ -6508 1425 4449 -4230 65 10935 1558 -10954 -1879 7226 -59 -1481 5380 -2011 -9864
1502i864J0999O008j1427K86J2238r074j3574J3492J3841j3346p964J1788j271
$$ -9864 1135 7143 -4284 -3998 8240 -834 -14408 -916 12925 -421 -8385 3403 2132
1515B132j1691R738J2554j3785q124J4651l31j6235J0029J8727j4838j8503J5225
$$ 2132 -9559 179 12733 -1052 -9176 5475 5144 -11091 -1062 17665 2827 -15676 -451
1528d51J2180j5850k010J7495n917j9017Q716J5110j0259o434J3403k731j8050
$$ -451 11729 -4121 -6131 11364 5447 -13570 -4854 10256 -3 -6437 6966 4235 -13815
1541a3815O482J9445p103j4509Q370O848j1647j986J4801J711j2343k084O641
$$ -13815 -7333 12112 5009 -9500 -1130 5718 -5929 -7915 6886 8597 -3746 -5830 811
1554H11j03j104M473j7n503k025K694K768J109q57j866r9k144k415N687O992p335
$$ 811 708 -396 4077 4060 -1443 -3468 -774 1994 3103 2246 380 281 -1863 -4278 1409 8401 1066
1571A066r937P523P472r736l420J4603n83j7819K543J7042n909j1914J2091O328
$$ 1066 -8871 -1348 6124 -3612 -7032 7571 6988 -10831 -8288 8754 2845 -9069 3022 9350
1585I350j8514j784K1974k271k0285R020J6978j7254j3235K3226J0461k4516n403
$$ 9350 -9164 -10948 11026 8755 -11530 -2510 14468 -2786 -16021 7205 17666 -6850 -12253
1598a2253K2250k910j8862J0850J5888j6791j1612J7861M603j7688L708J7265
$$ -12253 9997 7087 -11775 -925 14963 -1828 -13440 4421 9024 -8664 -4956 12309
1610A2309j0915j6953J4022J4175j4512q721J4160L157j4119J258J2948k447r845
$$ 12309 1394 -15559 -1537 12638 -1874 -10595 3565 6722 -7397 -6139 6809 4362 -5483
1623e483L520N602m912j284O473J4o723k37O258Q48n710m32N588L42p289r19Q395
$$ -5483 -1963 3639 -1273 -2557 3916 3930 -2793 -3030 3228 4076 -1634 -2066 3522 3864 -3425 -4344 4051
1640D051J903r811j851R648n78r138L249Q607o812o640Q940L536j0815R39J2619
$$ 4051 5954 -3857 -5708 3940 3362 -5776 -2527 6080 -732 -7372 1568 5104 -5711 -4772 7847
1655G847n569j3344R958J2548j2787r414J5085N596j6165q29J6177l580j3531
$$ 7847 2278 -11066 -1108 11440 -1347 -10761 4324 9920 -6245 -7074 9103 5523 -8008
1668h008P459R187j0504m738J3141k01j4414M290J3279p848j1655J0603Q353j2396
$$ -8008 -549 8638 -1866 -6604 6537 6336 -8078 -3788 9491 1643 -10012 591 8944 -3452
1682c452n463J2206K588j0530K09P868k854m996M802K702n629qN531j419m884
$$ -3452 -8915 3291 5879 -4651 -4442 3426 572 -4424 378 3080 -2549 -2557 2974 1555 -3329
1697c329K914M574l071m258K575M461j621l940O16L373L11l760p61L892N60m178
$$ -3329 -415 4159 1088 -3170 -595 3866 2245 -1695 -1079 2294 2605 -1155 -1916 1976 2536 -1642
1713a642m47L533r77k342K032R56m046R37M552k275n388M455N278o068m450P325
$$ -1642 -2089 1444 467 -1875 157 1113 -2933 -1996 2556 281 -5107 -652 4626 -1442 -5892 1433
1729A433L585p360j690O738J84n509J978M176l487j967M703l64n006K208N169
$$ 1433 5018 -2342 -4032 2706 2890 -2619 -641 3535 48 -1919 2784 2420 -2586 -378 4791
1744D791m103m804M953L345n006k612M412J266l920j35K284n94j161J272l03j682
$$ 4791 688 -4116 837 4182 -824 -3436 976 2242 -1678 -1813 471 -123 -1284 -12 -315 -1997
1760a997J397J777j928j346K326J385k071q67J627J067r88n60J19R35P97r34j320
$$ -1997 -600 1177 -751 -2097 229 1614 -457 -1324 303 1370 382 -178 -59 876 1673 739 -581
1777e81J025J510j224j663Q38J493p47j358J00M68N55j01j287q36J682J287k587
$$ -581 444 1954 730 -933 -95 1398 651 -707 -607 -139 416 315 -972 -1808 -126 1161 -1426
1794a426j303K726J534k520j320K164J640j568j064P24Q45M62l1j305j35J810
$$ -1426 -2729 -3 1531 -989 -2309 -145 1495 -73 -1137 -413 432 894 863 -442 -577 1233
1810A233J019k100j505K442J889k546k305J927K393j464k585L40K235L84k082
$$ 1233 2252 152 -1353 1089 2978 432 -1873 54 2447 983 -1602 -1262 973 1357 -725
1825g25j403R57J851l95j905m77K237Q06j484j770J464K291o50k249J72K301R37
$$ -725 -2128 -1171 680 285 -1620 -2097 140 946 -538 -2308 -844 1447 797 -1452 -1280 1021 1958
$$ [...]
8191b06
##END NTUPLES=NMR FID
##END=
